
##TITLE=UV1034_TOFR01-ROVE100A_6099638_KXnNaz7PEe
##JCAMPDX= 6.0         $$ Bruker NMR JCAMP-DX V2.0
##DATA TYPE= NMR SPECTRUM
##DATA CLASS= NTUPLES
##ORIGIN= BRUKER
##OWNER= Administrator
$$ 1.72 TOPSPIN		Version 2.1
$$ 2012-05-13 02:48:42.031 -0500  Administrator@TOPSPIN
$$ Compression mode = diff/dup
##.OBSERVE FREQUENCY= 400.13188235
##.OBSERVE NUCLEUS= ^1H
##.ACQUISITION MODE= SIMULTANEOUS (DQD)
##.ACQUISITION SCHEME= undefined
##.AVERAGES= 8
##.DIGITISER RES= 22
##SPECTROMETER/DATA SYSTEM= spect
##.PULSE SEQUENCE= zg30
##.SOLVENT NAME= COFFEE_meoh
##.SHIFT REFERENCE= INTERNAL, COFFEE_meoh, 1, 14.98061
##AUDIT TRAIL= $$ (NUMBER, WHEN, WHO, WHERE, PROCESS, VERSION, WHAT)
$$ ##TITLE= Audit trail, TOPSPIN		Version 2.1
$$ ##JCAMPDX= 5.01
$$ ##ORIGIN= Bruker BioSpin GmbH
$$ ##OWNER= Administrator
$$ $$ C:\Bruker\TOPSPIN/data/COFFEE/nmr/UV1034_TOFR01-ROVE100A_6099638_KXnNaz7PEe/10/pdata/1/auditp.txt
$$ ##AUDIT TRAIL=  $$ (NUMBER, WHEN, WHO, WHERE, PROCESS, VERSION, WHAT)
(   1,<2012-05-13 02:48:34.718 -0500>,<Administrator>,<TOPSPIN>,<go>,<TOPSPIN 2.1>,
      <created by zg
	started at 2012-05-13 02:47:27.859 -0500,
	POWCHK enabled, PULCHK disabled,
       configuration hash MD5:
       AF F2 23 6B 01 CD 40 DD E5 A1 38 A0 06 EA F7 77
       data hash MD5: 64K
       86 B2 7A BC 01 5E 8C 64 F8 CE 37 E5 AB C6 5B 64>)
(   2,<2012-05-13 02:48:37.765 -0500>,<Administrator>,<TOPSPIN>,<proc1d>,<TOPSPIN 2.1>,
      <Start of raw data processing
       efp LB = 0 FT_mod = 6 PKNL = 1 PHC0 = 0 PHC1 = 0 SI = 32K 
       data hash MD5: 32K
       93 4B 3A D0 D4 2E 3E AE DA BF 6A 8A 03 D9 16 7A>)
(   3,<2012-05-13 02:48:38.171 -0500>,<Administrator>,<TOPSPIN>,<proc1d>,<TOPSPIN 2.1>,
      <pk PHC0 = 215.744 PHC1 = 0 
       data hash MD5: 32K
       90 0D 62 FA 09 9E 90 76 36 6C EB 86 52 98 FD 10>)
(   4,<2012-05-13 02:48:38.312 -0500>,<Administrator>,<TOPSPIN>,<proc1d>,<TOPSPIN 2.1>,
      <abs ABSG = 1 
       data hash MD5: 32K
       A1 C8 F8 84 B0 87 D9 EF 1A 02 0B 20 09 AC 09 68>)
(   5,<2012-05-13 02:48:38.468 -0500>,<Administrator>,<TOPSPIN>,<proc1d>,<TOPSPIN 2.1>,
      <abs ABSG = 2 
       data hash MD5: 32K
       A9 5E DE 6E 40 AF 1B D6 7F E1 80 85 D1 97 46 03>)
(   6,<2012-05-13 02:48:38.500 -0500>,<Administrator>,<TOPSPIN>,<proc1d>,<TOPSPIN 2.1>,
      <abs ABSG = 3 
       data hash MD5: 32K
       5F 9C ED 95 DB 14 3E 78 93 BC DB 8C 7C 58 45 38>)
(   7,<2012-05-13 02:48:38.531 -0500>,<Administrator>,<TOPSPIN>,<proc1d>,<TOPSPIN 2.1>,
      <abs ABSG = 4 
       data hash MD5: 32K
       51 F1 57 A3 D8 93 73 BB ED AF 50 D3 35 A2 77 95>)
(   8,<2012-05-13 02:48:38.562 -0500>,<Administrator>,<TOPSPIN>,<proc1d>,<TOPSPIN 2.1>,
      <abs ABSG = 5 
       data hash MD5: 32K
       6F F2 59 B9 28 78 D7 73 6A F6 97 77 B7 6F 48 0C>)
$$ ##END=
$$ 
$$ $$ hash MD5
$$ $$ 1E 9E B3 E5 2E 79 7C B1 B8 A5 47 33 26 57 5C 98
##$RELAX= 
##$RELAX= 
##$RELAX= 
##$RELAX= 
##$RELAX= 
##$RELAX= 
##$RELAX= 
$$ Bruker specific parameters
$$ --------------------------
$$ [...]
##$TP= (0..7)
150 150 150 150 150 150 150 150
##$TP07= 0
##$TPNAME0= <>
##$TPNAME1= <>
##$TPNAME2= <>
##$TPNAME3= <>
##$TPNAME4= <>
##$TPNAME5= <>
##$TPNAME6= <>
##$TPNAME7= <>
##$TPOAL= (0..7)
0.5 0.5 0.5 0.5 0.5 0.5 0.5 0.5
##$TPOFFS= (0..7)
0 0 0 0 0 0 0 0
##$TUNHIN= 0
##$TUNHOUT= 0
##$TUNXOUT= 0
##$USERA1= <user>
##$USERA2= <user>
##$USERA3= <user>
##$USERA4= <user>
##$USERA5= <user>
##$V9= 5
##$VALIST= <valist>
##$VCLIST= <CCCCCCCCCCCCCCC>
##$VD= 0
##$VDLIST= <DDDDDDDDDDDDDDD>
##$VPLIST= <PPPPPPPPPPPPPPP>
##$VTLIST= <TTTTTTTTTTTTTTT>
##$WBST= 2048
##$WBSW= 25
##$XGAIN= (0..3)
0 0 0 0
##$XL= 0
##$YL= 0
##$YMAX_a= 488516
##$YMIN_a= -628984
##$ZGOPTNS= <>
##$ZL1= 120
##$ZL2= 120
##$ZL3= 120
##$ZL4= 120
##$ABSF1= 14.98061
##$ABSF2= -5.57192
##$ABSG= 5
##$ABSL= 3
##$ALPHA= 0
##$AQORDER= 0
##$ASSFAC= 0
##$ASSFACI= 0
##$ASSFACX= 0
##$ASSWID= 0
##$AUNMP= <proc_prof1d_extract_pilot.lims>
##$AXLEFT= 0
##$AXNAME= <>
##$AXNUC= <1H>
##$AXRIGHT= 0
##$AXTYPE= 0
##$AXUNIT= <>
##$AZFE= 0.1
##$AZFW= 0.1
##$BCFW= 0
##$BC_mod= 0
##$BYTORDP= 0
##$COROFFS= 0
##$CY= 15
##$DATMOD= 1
##$DC= 0
##$DFILT= <>
##$DTYPP= 0
##$F1P= 0
##$F2P= 0
##$FCOR= 0.5
##$FTSIZE= 32768
##$FT_mod= 6
##$GAMMA= 0
##$GB= 0
##$INTBC= 1
##$INTSCL= 1
##$ISEN= 128
##$LB= 0
##$LEV0= 0
##$LPBIN= 0
##$MAXI= 10000
##$MC2= 0
##$MEAN= 0
##$ME_mod= 0
##$MI= 0
##$NCOEF= 0
##$NC_proc= -8
##$NLEV= 6
##$NOISF1= 0
##$NOISF2= 0
##$NSP= 0
##$NTH_PI= 0
##$NZP= 0
##$OFFSET= 14.98061
##$PC= 1
##$PHC0= 215.744
##$PHC1= 0
##$PH_mod= 1
##$PKNL= yes
##$PPARMOD= 0
##$PPDIAG= 0
##$PPIPTYP= 0
##$PPMPNUM= 2147483647
##$PPRESOL= 1
##$PSCAL= 4
##$PSIGN= 0
##$PYNMP= <proc.py>
##$REVERSE= no
##$SF= 400.13
##$SI= 32768
##$SIGF1= 0
##$SIGF2= 0
##$SINO= 400
##$SIOLD= 32768
##$SPECTYP= <>
##$SREGLST= <1H.CDCl3>
##$SSB= 0
##$STSI= 32768
##$STSR= 0
##$SW_p= 8223.68421052632
##$SYMM= 0
##$S_DEV= 0
##$TDeff= 65536
##$TDoff= 0
##$TI= <>
##$TILT= no
##$TM1= 0
##$TM2= 0
##$TOPLEV= 0
##$USERP1= <user>
##$USERP2= <user>
##$USERP3= <user>
##$USERP4= <user>
##$USERP5= <user>
##$WDW= 1
##$XDIM= 32768
##$YMAX_p= 333249582
##$YMIN_p= -768529
##$CURPLOT= <Network HP LaserJet P1505>
##$CURPRIN= <$Network HP LaserJet P1505>
##$DFORMAT= <normdp>
##$LAYOUT= <+/1D_H.xwp>
##$LFORMAT= <normlp>
##$PFORMAT= <normpl>
##$SURQMSG= 1
$$ End of Bruker specific parameters
$$ ---------------------------------
##NTUPLES= NMR SPECTRUM
##VAR_NAME=  FREQUENCY,     SPECTRUM/REAL,   SPECTRUM/IMAG
##SYMBOL=    X,             R,               I
##VAR_TYPE=  INDEPENDENT,   DEPENDENT,       DEPENDENT
##VAR_FORM=  AFFN,          ASDF,            ASDF
##VAR_DIM=   32768,         32768,           32768
##UNITS=     HZ,            ARBITRARY UNITS, ARBITRARY UNITS
##FACTOR=    0.250966925370066, 1,           1
##FIRST=     8223.43324360095, 143404,       -62428
##LAST=      0,             -38013,          -154904
##MIN=       0,             -768529,         0
##MAX=       8223.43324360095, 333249582,    0
$$ Real data points
##PAGE= N=1
##DATA TABLE= (X++(R..R)), XYDATA
$$ [...]
23694 146463 -233838 163288 -195695 106857 -154938 -13027 41316 27311 81748 -81937
23683 -43180 -34929 90979 -130268 158255 194528 1842 96931 -256952 -225017 219299 175379
23672 175379 -51205 16271 65307 31317 -15325 -99054 -9704 -26692 -90221 -254908 -109764
23660 -153020 142685 -91528 -204767 -23698 348889 -169844 -172539 6361 -85566 220727 441302
23649 441302 223964 114395 41479 -68563 93878 -270086 163074 90649 9599 13384 247709
23638 247709 -26992 -160144 12024 -40657 -264065 -164062 306446 -324307 135665 102437
23628 102437 208655 177897 114168 -84416 -13987 124552 -268216 173254 3907 -203076 -213422
23617 -213422 -97365 -128212 -359032 85381 113454 -117189 -61934 -56114 -48789 50687 -164225
23605 -92914 248269 -104338 54135 -122035 75261 -69967 13571 -41007 -206370 -23949 -260515
23594 -260515 130323 -111033 92546 -131107 -120770 -227835 15792 226297 80580 190283
23584 190283 98804 92818 -228868 -25119 326663 -184445 -135049 -37745 -5812 141456 -233693
23572 33417 224231 142383 -40943 200524 68793 -74324 -2875 120403 329225 393846 117655
23560 -31664 -158639 47129 14876 17507 259218 217320 356956 -100431 -162638 123 -190756
23548 12384 439127 -161634 -5634 278129 -290204 91919 1156 -88518 -263414 -287906 272674
23536 188659 212857 -271323 120462 -227343 57388 -197233 -79294 94571 108613 227164
23526 227164 -233256 -226416 124778 284124 -372885 106848 -25296 -369697 -206049 -182646
23516 -182646 149201 348830 41624 -76852 -135291 67986 -108256 -195831 92649 -27480 -54773
23505 -54773 -140973 -118451 119503 -3175 -216390 -155935 -139180 -86126 -136045 -47732 329872
23493 -50189 -132623 -43162 -160283 14074 184170 -111314 -163192 -64734 -219146 74812 10157
23481 280487 186612 227904 -115654 -41622 -1091 597369 -46512 -90001 -418639 -140221 -145207
23470 -145207 -244941 -256314 270436 122981 21509 -283 -118831 8596 28199 -177431 -132638
23459 -132638 77630 125783 87989 -52737 -43625 -187919 201096 55019 -103189 -108939 -32809
23447 -195002 31643 56407 48745 -55649 -149895 -180228 6897 -3001 -81470 -139398 251040 -31363
23434 277270 266959 -121037 -223768 -52288 -19557 176817 77916 -80759 -13409 131290 67011
23423 67011 31178 41568 118670 -18821 83180 -9520 -57819 -158890 430973 -42773 94304
23411 323867 145023 -24102 -151037 -165039 -364008 -49863 -44595 -17583 182173 197450 -167350
23399 -2234 -218146 -109018 -20277 32905 178974 -293779 -93516 -83217 139839 247099 -265708
23387 102529 -267855 345729 132062 12512 -237594 -132656 17859 112614 7116 243870
23377 243870 -154826 -18023 5850 119363 145184 110877 -223288 142218 -93495 242415 -56972
23365 45086 -114469 -17024 -99835 -119715 -252622 338187 45790 59154 -198404 279977 -280644
23353 -256353 -300518 -24570 57905 84412 -53586 153017 2606 164063 -77023 63862 -23918
23341 -7049 -33051 -140428 -165955 -39584 -61196 79817 -89704 -102206 24223 48637 93129 330153
23329 330153 -235463 -247320 4662 5853 835 -158847 -427569 -51191 -56283 -34694 131898 114165
23317 114165 -48812 224338 143728 66458 35403 -189488 -190951 -68851 -208673 183941 246245
23306 246245 59721 -130820 50621 424806 -40089 45580 -126545 -176264 248375 -118826
23295 330137 87078 -239093 54768 143966 -106107 143517 26812 -31393 -290608 -39496 -251220
23284 -251220 -197228 136211 159858 99316 338019 106074 253339 25348 69033 -38528 200054
23272 -25277 28265 -165466 -61866 -80585 -7256 -81442 -415861 -266700 8504 131772 -170726
23260 -28469 -464699 109725 138386 -36287 41384 195682 -289161 -164170 -36228 90790 28022
23248 110626 85817 -346093 224897 -90589 13264 -488268 -2710 108451 -75751 89533 201505
23237 201505 -19139 -326987 186185 152756 93388 -253066 -63596 -39528 -417 -42040 -128242
23226 -128242 -19232 160546 -8701 -110294 28653 -153758 71771 227005 -61282 -186217 -106331
23215 -106331 122040 56244 -96187 -50007 -36504 276169 206607 -324442 -55385 -98979 -32489
23203 -172793 191240 25901 27615 -240829 -226445 132681 151418 -180533 -78659 6391 164412
23192 164412 24481 287063 -493 51843 -30464 -333998 -272330 -169001 -13747 -46569 -40248
23181 -40248 73914 -34194 -382287 -136733 21805 377920 -122120 -105012 349437 221265
23171 221265 148728 -335476 -1732 22163 12486 -211048 118029 181751 47132 33884 13076
23159 -164041 -93827 92450 206152 -52275 105917 -358684 50560 -193942 -234362 76241 17274
23147 239697 -62523 -165086 21966 -290945 45407 -82792 -171824 423733 -228760 -143140 -157020
23136 -157020 718 -67038 -200850 -146065 -113276 198863 -199224 -135802 -151930 -122362 -392333
23125 -392333 16123 30846 -66864 -281958 34220 -27821 -187030 122263 403177 202112
23115 202112 -29668 -288642 -7743 124104 -100631 24958 -3331 -214180 -243683 -156645 -97057
23104 -97057 97066 -100925 513847 -170131 95561 -138642 -135371 307692 275415 73740 -87675
23092 -70467 -203387 -5791 24867 250798 99154 -41952 321296 10019 252208 -970 48304
23080 -152958 -22474 -183419 -194359 -177581 105654 -349197 -120510 108061 74843 217663
23070 217663 364376 -169278 222393 215192 -2889 79228 180515 39709 35540 48090 -354417
23058 31161 -522790 34567 308845 -64059 275861 -15601 -57246 -2433 -151129 -237626 383475
23046 -243863 57196 19101 -203449 286243 -208100 109128 10058 31457 92670 -7927 -145781
23035 -145781 -131793 -37402 102466 -230293 -143427 -166957 103208 139726 -144446 -155664 239038
23023 286075 -44338 -131507 -150619 170030 -5107 -231679 -188111 153983 32010 241058 -9573
23011 -60299 -62912 28764 -251201 -111557 -4463 170041 197624 -131324 24540 -138016 -23096
22999 224817 -146389 -165579 -287825 143844 -71539 -78555 -267433 85735 -182817 -104446 -16989
22987 27828 9717 382577 -216668 179638 -296753 -120928 117574 -278844 105332 372253
22977 372253 -167656 175835 -131132 -83801 -18054 80988 -86466 81839 298608 -96313 -200850
22966 -200850 188600 -50504 -230540 -116637 -2475 -68828 -144153 37599 333099 -154181 -118975
22955 -118975 -156863 -306026 144893 -61743 -133221 96024 6960 -118669 156246 -111867 -144041
22944 -144041 -7039 -153341 -76655 174492 -37369 -124258 -40099 149068 -66867 -78399 165132
22932 -85747 -73996 324006 170249 215056 108158 -93590 15330 68698 -94674 -101516 -91086
22921 -91086 29494 -149534 -245614 -249196 -56264 -110112 36418 -243858 -167644 -46788 -331719
22910 -331719 261439 37562 -256318 44182 59804 -179686 -144523 -219117 -275285 -8562 79390
22898 32953 -304580 -136382 -195420 -155845 176808 -52572 70640 -190422 -180799 -155616 58652
22886 -195877 -1103 109984 -64889 73582 -302015 151201 30069 42276 -95949 345824 -69567
22874 -6869 163100 5962 84241 -92645 -127572 160042 154429 46797 144722 134566 -30925 -62771
22862 -62771 419 157237 -292543 345037 -140439 196848 -71666 -69799 -118450 -495267 -31880
22850 58975 -204397 -105613 -110565 -59854 74394 -63689 -80040 15373 -99701 -92411 -185839 101729
22837 64880 -279021 -167582 -214784 15002 -69236 -210655 -165424 219338 355438 278122 -276156
22825 -80803 -190206 167387 55074 -17257 331324 -158002 48345 338045 -134448 -61476
22814 56029 176585 -40088 -174400 -15602 260624 12368 21487 -283723 221864 24566 133102
22803 133102 -84529 -167769 68590 -1260 -227870 51315 46273 172373 -71709 184321 3732
22791 22440 176626 -97055 73804 329298 -3912 534 -86655 -142682 -157985 89995 40735 186855
22779 186855 215898 131189 -18400 28356 -303268 -164465 -207761 38088 -61169 -108347 -190310
22768 -190310 -10506 2548 78257 28361 168674 202386 -20623 360088 -74846 -392394 -16800
22756 -165376 -15909 23193 56546 -301178 -120610 -277205 -180263 -93819 -133046 -7752 22227
22744 166746 31196 -131571 -139377 103562 -17303 -85980 -286427 -265537 -214631 -43392 180101
22732 25501 75933 -186879 228650 -5108 -65638 311885 -116428 -7825 -205391 -90269 -285967
22721 -285967 30212 152368 244754 -187270 -132229 -445545 -431020 -214876 62940 -223805
22710 -24561 118469 -41530 -115259 150984 -137081 257289 17226 85105 -115439 73846 -100252
22698 -315556 -166993 120055 -342088 -280841 -43252 300086 -51149 -167006 -90206 -39603
22687 -30729 245906 -250982 166308 -171520 -82795 -226113 -158728 89726 9766 410460 -283430
22675 -343113 176447 108519 132275 -106122 70878 154382 -106444 -336382 -130767 -62995
22664 84473 59271 61161 -192353 -313830 -132181 39265 144858 -9339 -104222 271913 158207
22653 158207 -47008 -217854 -238516 164915 -214587 -108617 -299431 29965 24434 -161144
22642 -257815 86449 87395 -81266 -175021 -106574 24372 -7615 -159112 39874 122650 -224472 164366
22629 374270 33449 -88655 -154868 -140729 -138602 -93746 -116749 -84064 -546 -146727 -149896 231416
22616 85906 -63703 -72274 127345 -269979 -107536 -178442 -191086 182850 -44923 -216194 92825
22604 -47378 -126193 107715 -371837 80580 62355 145715 -91753 -96942 -69780 92136 -43673
22592 50166 -343495 114978 -127586 46805 21959 92652 -38361 50892 -380252 322587 121222
22580 -113879 -141748 207599 84749 -228455 -96386 -184686 -480317 -86258 -113888 -2034 -50433
22569 -50433 -210828 -159377 68432 -75484 28294 -104582 -258361 91645 17496 17643 -264131
22557 11305 129785 -173370 172273 -12894 -363209 250908 184344 -185527 -146680 276840
22546 -229628 -143363 76470 -45167 -33538 -189379 -135069 -191890 -307645 -335340 -299423 -291892
22535 -291892 -284116 14183 256307 -72384 179388 184496 -6886 -73982 122232 -100047 -169202
22524 -169202 -51315 -103588 -102465 -404647 -148950 184301 -155758 -235904 53538 38134 -122174
22512 -252095 409 -162723 -27312 -304995 -10871 -152529 234863 -64807 128776 50297 -263627
22500 -83877 -120165 20868 49966 -297523 -31452 -125245 -122769 -17566 -81009 77874 -229367
22488 -200853 -20160 408760 -305770 250868 6159 -40020 117543 -62944 -40162 163776 184073
22477 184073 -9916 -74738 68465 -82218 171752 -109311 -412284 54887 178060 124135 66689
22466 66689 -20914 -94251 -16085 328145 -18395 77118 103722 -42498 12523 -115785 -249584
22455 -249584 -292578 -580486 36492 20147 -118551 427111 -20049 -202194 10255 49576 98108
22444 98108 -196463 234976 -214404 -210533 -75125 -214421 -223406 61446 132537 133630 -68923
22432 -149938 -123301 -5036 -178459 200678 376705 144928 36220 150044 190920 -322023
22421 -309462 -123393 -46060 -37550 142077 -173477 54670 -197418 -84992 15273 -236079 28263
22409 -189629 -166367 -235193 -162751 -155801 -205773 133475 -138117 102921 67745 130831 233263
22398 233263 -51944 127130 62408 -176740 95931 -66465 -207003 -76029 -191258 184546
22387 1286 -248070 -5107 -117790 -266501 -124035 88137 -178330 -83967 100745 -249344 73693
22375 28098 -117891 153358 -64497 -199925 -38131 -221055 124617 -176319 -9931 61791 112807
22364 112807 130922 117883 23439 -18498 -139758 96134 39903 -41431 94934 256814 7773
22352 -265300 -101308 -110663 -147557 -289364 332708 -278896 48921 -192329 135498 -187664
22341 -19695 -229045 -96121 197477 -186311 -30737 47801 24625 193884 49363 -8636 -64296
22330 -64296 53174 -51966 -254658 305215 27951 6153 82002 -360778 93088 -57420 76695
22318 -277748 119081 -127625 101853 -117737 88446 14491 317179 53710 201675 -135050
22307 198863 82573 -202307 52342 -25740 -147591 -63391 49808 -108074 -6290 -2138 -217939
22296 -217939 410837 -282048 -134782 -312424 -232472 -122768 -231547 -49972 295796 76370
22285 -59159 -83351 -47955 45045 -358086 -237117 -14487 -91152 -365627 -61201 314805 16283
22273 -310163 50894 -210335 170590 -340846 -130537 -101389 173167 -51211 -509242 -62876
22262 -152831 -118541 70906 -140032 -197693 296899 249212 135417 -79662 -151544 275853 -242186
22250 95157 136190 -255422 77184 -286073 -215458 -221890 -82551 -8552 -289598 58851 109611
22239 109611 -87622 -32712 39138 -62918 -36495 14593 -108236 -222681 27145 -82231 28501
22227 103473 65802 55915 -195238 96795 56401 -121700 116000 -143302 -64320 -302530 163390
22215 135323 100105 -258538 -14794 4666 -147012 89515 -339342 -47300 -105141 -105680 66569
22203 -112496 -210578 59300 -54131 72980 -331129 369902 -164763 -359226 -70167 -164449 -99281
22192 -99281 139119 -28597 -167217 73674 96692 21643 -198821 -42152 133535 40857 -255328
22180 -270130 -107632 -168946 -224264 17035 29020 -298508 43819 74596 -102499 -129854 -328251
22169 -328251 -221955 173390 15740 60400 -56232 -228789 -106905 -141844 -90551 -70672 -158047
22158 -158047 72187 -62871 -60250 -20157 -161850 -342226 -304021 113909 -180086 136303 -77348
22146 231657 73378 -277215 -155257 -23688 149642 -151353 59601 -74860 -343729 -159468
22135 53778 405611 308440 -252082 -104603 -53286 -476515 -203865 -39887 -453030 -78341
22124 71702 242586 127844 -54019 49529 82318 -237207 -130001 365589 -122080 -33096
22113 -155714 -113122 -118070 -19128 212425 -168658 65727 297006 -3953 81434 -71229 65775
22101 11385 -257385 -299015 96287 -113017 -196626 251232 -43945 -79540 92079 -115639 -192111
22090 -192111 56 -119089 206650 -127645 221174 11177 61217 85980 -316304 -92047 7244
22078 101226 17780 185809 114258 -246688 -154845 -269928 140761 -243070 154001 -222282
22067 1636 116936 -171098 -176900 -366387 -27251 -399784 -14767 141264 105513 284576 192748
22056 192748 291814 158154 26496 -256680 -129679 -187623 123690 93023 96294 -108622 72664
22044 147033 -29832 113705 203036 -64428 -33055 44054 -182961 -376117 -129345 1847 -76380
22032 -89336 211008 -133251 -24550 -254480 92155 -146752 -260954 27669 -96475 176430
22021 -137473 -10669 -288872 -12856 -66371 -226198 -179024 55929 -120428 43630 -5564 -100087
22010 -100087 -169250 -294049 -666 407886 74302 -88342 -73990 75086 -39140 -184667 167490
21998 7339 -11555 -157382 25057 -61239 -157780 85877 -161795 126985 -174142 43998 147381
21987 147381 -50423 45383 -260994 13004 171743 55011 -119016 196719 132805 -101079
21976 169917 1135 45882 -18713 100474 -172117 -116378 25155 -135516 87145 343306 152238
21964 211403 7337 -348118 55122 -89020 106093 -311080 56933 -88462 -218835 -226334 -132296
21953 -132296 -64765 68854 -228932 -75762 4522 -159512 -42895 7461 106912 -231894 -168291
21942 -168291 174712 -28554 -153030 -140910 13124 -282688 213297 155061 -216020 -28828
21931 -99787 65429 -188598 141969 -40633 -140140 -51223 150913 154838 273478 -166643 213090
21919 -68941 -93008 6688 -140188 94325 223441 12793 12216 -88241 -45061 -58488 243417 71043
21906 -144782 -139182 152091 -53531 206812 -37387 -12057 -1661 -111169 -250484 -134184 -133919
21895 -133919 25091 -59646 252961 60608 109870 -139858 73241 -137315 96624 591081 -208548
21883 -148145 30077 -93872 209723 -84719 -133371 -150634 -35190 -17362 -66160 34685 219767
21872 219767 -150290 -204940 -240053 -214257 202198 12217 -368850 180608 -106594 85854
21861 169680 -45707 -98211 -269793 -211590 175155 -76846 55798 70410 -110338 -80272 -38574
21849 -218156 -260763 -56998 116928 -43747 -125341 48732 -2898 -55526 -242190 -130831 -239351
21838 -239351 -402013 111673 173261 70619 207450 -481401 106648 105189 -144850 112702
21827 12160 -71990 -37096 -172478 -279827 -18286 159689 -216577 -62912 -168100 -76710 39477
21815 18055 -94189 52730 46213 -56260 206495 -93706 169861 -71817 -274422 -60460 135431
21803 17267 -27963 145027 50765 74312 -341135 23942 -31274 257258 -241746 37997 -185753
21791 -151250 261327 -205598 -12567 -127888 -35455 -171704 213239 161580 53097 173132
21781 173132 -92589 -118373 116718 -82205 -323620 222452 153029 -231599 109324 -117866
21770 204314 375258 -347245 -30054 211981 156974 -30663 -378743 30291 -70228 -194265
21760 -194265 305095 34245 51971 -211448 231071 120591 -124136 -251496 228361 -284159
21749 -303382 167686 -297234 -5528 -12669 108716 -274869 240756 -386276 -165647 261350
21738 -71449 -168584 170165 112055 -343863 -43036 -168468 22977 -82118 -52942 -19713 -219525
21727 -219525 28558 -170126 -157382 -204463 -70877 53068 -161990 -23423 -184553 350390 237129
21716 237129 -302028 -35738 48542 -4372 -92064 -20002 -144344 -82129 -420939 -346826 -45140
21704 77885 -431097 336053 -309327 -205259 -104334 72033 -18443 20197 -204028 -114156
21694 -114156 -177148 -13384 61443 135200 -300 92313 -49714 -32168 6986 117543 -267401 -74512
21681 120991 92301 183707 54151 -223283 -80696 -368538 -312592 -157592 12284 30503 -117602
21669 270252 127860 -191321 109603 -170095 44011 290052 -23005 272617 -74733 -64955
21659 -64955 -281566 -41357 -55753 178241 170326 -88958 -130871 -101639 -211371 30446 185934
21648 185934 106415 -266929 -163030 -137164 132929 -209029 14724 43629 -396216 128026
21637 -68765 -207715 -80874 -224348 -98238 -58891 -360595 298883 -122865 128643 -153094
21626 11474 -24273 -143088 -242510 -544514 -66113 -75404 -51908 64496 -213610 -53928 -55808
21615 -55808 127098 289365 -50174 -134731 -143860 -29870 189404 -47352 -147634 -196985 9831
21603 -25153 -28641 -369793 215079 -246217 264534 -41846 -266486 183363 86064 -158735
21592 -130004 57422 -147557 839 -106608 -97580 -206421 -56087 -252673 3176 -208613 -273150
21581 -273150 41507 -21091 22948 302930 -9493 87341 56033 -48756 71842 -71783 -26155
21569 29065 -32623 68772 -229160 -30508 77009 18159 -240295 484227 -93639 -222053 -435910
21558 -435910 -77447 -158541 94850 -142149 36319 -137189 101412 -70522 -103232 -80784 -10013
21546 -311978 242947 92418 -212151 -83607 -55643 102452 -81211 49809 162569 -172357
21535 312423 -294332 -176604 -24407 112127 191483 167544 -73764 -377866 -99451 -124409 151578
21523 35053 -26317 -41193 184410 -159078 -101846 -96473 130560 -77815 -107376 -27028 -380502
21512 -380502 27132 -145273 240201 -354578 -97883 -363015 -136336 -140219 -207332 -7712 -189578
21501 -189578 -99668 -336589 -69414 -18231 76777 153492 -16685 33047 102937 -61475 122551
21489 -278061 217876 128887 -172139 -384163 -212436 -292069 4917 -109800 -298270 123991
21478 130813 267566 321659 36823 248040 -131284 121155 35323 37078 177819 -283450
21467 98646 106765 -25194 -131230 69914 166793 402349 418479 -66765 139271 -75691 -5406
21455 101363 -192506 -108927 -100669 -20536 -143639 91726 -162467 -165328 -45227 69435 137562
21444 137562 35047 237063 283561 -20245 169035 -2615 104581 -70229 -315358 119462 148212
21433 148212 -130258 -82052 75245 -282555 -33105 228067 245579 -58718 8441 151380 113901
21422 113901 210106 162748 -58693 1208 -127899 -406512 -120295 -115063 150519 232204 137992
21411 137992 -71209 -61416 -191305 -131591 -159878 -82944 -159233 158518 231161 -37361 -88675
21400 -88675 -191340 239768 -134300 -263321 28830 -5596 -200991 -136834 -143691 -72679 -105596
21389 -105596 153142 -47507 -14452 -283469 60958 -340321 -312958 -152133 -41443 218358
21378 -245859 -105768 -5586 199454 19351 89075 -76779 -11014 -121370 -26741 -234322 395325
21366 -86887 -144549 -249695 -353591 -334596 -30392 41012 -112873 326847 -215281 -153059 -46410
21354 246232 326408 -331436 86596 146037 -148476 177427 -164169 -228669 -25584 -195616
21344 -195616 -15914 94539 -316926 -116974 -232344 79652 151406 -73647 -386547 -118452
21333 -342730 -45001 -152094 -217914 -30378 -67192 -229397 -132751 48395 -185634 6703 -261488
21321 -167109 -315797 -151083 70823 -205625 -31717 -145112 -79841 -145401 75564 -20857 -115173
21310 -115173 438466 -173066 -91190 286583 -141397 9682 -129172 13399 -275531 -21529
21299 132873 -29460 87301 -264022 -8483 -179320 -101383 -97086 55728 -98297 9399 125452
21288 125452 161425 -270910 -43976 -89492 22965 -21119 16509 77304 27445 -117383 179102
21276 -70013 -151907 -163228 -90117 152730 -48862 -122323 -172346 -106187 57815 126316 -248751
21264 -639514 137384 -194425 65229 358757 153924 51522 111583 -122142 -140284 116567
21253 117400 380489 -312591 -20666 -26715 -152534 -401110 -266837 -271560 -78294 117914 -16678
21241 -114262 -80431 -110101 -307549 -144991 337880 30171 -485369 151973 -142666 249733
21230 184703 -100477 44620 -15541 167480 -156686 -37773 -56670 190367 196311 -9391 51301
21218 113931 -114301 -328329 277281 28413 12511 -79196 -23845 30363 12522 50690 -55485
21206 -197028 -310199 57702 -409468 -239315 -66359 241108 -115545 -100441 61413 164447
21196 164447 6186 53885 81244 -310623 14704 -59185 -145755 -226228 -111131 -4904 -44189
21185 -44189 -236007 -47854 -92228 372454 -74930 2416 -129835 -13980 145168 -41455 -150899
21174 -150899 -63231 -47857 -260 197185 -137834 30037 61925 -301245 -97595 -156590 -95819
21163 -95819 -136026 285997 329055 -194230 -130664 -16123 -207811 -212299 85770 -75931 125875
21151 412651 -423436 -67062 193730 34800 -112990 369566 61279 -20879 141168 -41132
21140 145959 90840 -339752 -76224 -44461 123380 -114449 -41244 -117574 155370 -280568
21129 -16676 62800 245939 13491 393500 -252192 -9344 -222440 -81534 -57587 253517 146863
21118 146863 231433 40007 17617 -88060 332694 47103 -244572 -163285 56417 -129987 -352172
21107 -352172 154326 -346840 35723 17292 142743 -148149 -145832 216229 200148 -206129
21096 64287 18848 25002 -31174 -172724 135806 -404375 53967 -87841 -55608 -93090 -215593
21085 -215593 55931 -208179 -124311 -98913 -419321 103383 -601941 -140549 116912 261665
21075 261665 61077 -197338 -52030 -411423 -19052 185908 -251786 83619 -399162 76788
21064 -181875 51217 -96293 120408 -400314 -124262 97466 32655 105509 148623 -369352 174494
21052 -34424 -137908 13650 195033 -326431 -12846 172211 -164026 -212008 105082 -372171
21041 -259687 205509 -107580 144362 -93807 -174485 -145612 -184119 53890 -284637 -20304 294643
21029 17051 -237819 -48868 -158623 -94215 177660 -280293 -69187 -76546 31686 380548 -80966
21017 -234755 64998 -93501 115692 -127274 27781 -158132 -200096 -148512 97431 87677 -18224
21005 -469452 73339 -53583 399911 -121760 -116930 -76664 -11767 -77664 -292555 295307 -221164
20993 186044 -117501 -45720 80462 31354 -56006 12780 -41101 -10679 -85776 320062 41393
20981 -91077 -240296 -171138 -30612 -222239 58040 -40381 -164092 141162 161072 -229956 -46856
20969 -82918 15261 -181579 -57067 -101955 350996 5530 393606 221710 -131452 -246523 189096
20957 -198608 40251 321216 -162092 77306 -24601 -235738 -172008 261640 38431 -152486
20946 -130775 -167216 -21924 -419212 -30265 -237345 102071 -92616 -359287 272107 -336 -217489
20935 -217489 -179229 -44074 -207879 -92029 126626 -84291 114051 30657 17644 232713 223565
20924 223565 18345 -143339 -30894 30179 -6032 27503 -156455 72056 -79730 59138 -77887
20912 -45170 165547 -200672 -87119 -438168 -294051 -12584 -74794 124855 -53485 -90942 -186877
20901 -186877 -44190 -106204 -76834 -24531 -91703 -365211 -69000 -231157 -324543 -25056 -333695
20890 -333695 98043 -154021 -65920 82176 -255140 -74889 110660 -322152 252225 5607 -27580
20878 35652 25357 50408 -132203 15085 -200356 -200808 -145242 162373 -198662 -38177 -299065
20867 -299065 13311 -332924 -99719 -161031 -106771 -291186 -48419 -283597 -89072 -151944 -76671
20856 -76671 -195903 338778 -107301 4474 96008 4279 -273634 135523 44732 89431 213879
20845 213879 -117698 -53316 200074 -46071 -54990 -6853 428764 -66304 21228 -221201 -47011
20833 90880 -147333 -158373 -579489 138966 -400513 -547052 157210 -52129 -254361 -569537
20823 -569537 -206854 -63227 -54146 -51510 -201609 56253 328069 33240 245729 -20335 -248264
20812 -248264 -191532 -128282 -170151 -271168 59552 -102762 -81631 119719 -240410 -85316 146234
20800 157426 -47059 940 -239339 83397 164759 -52869 -220630 4630 43217 -18171 -384729
20789 -384729 -66354 -1350 -223485 260238 47018 95492 -166949 48361 17980 -194556 -11689
20777 12351 -121866 32095 -2337 -147288 -40018 93587 -115325 39148 -139270 -150970 221555
20765 -67663 -325774 -243440 56097 -39409 -236438 -345946 122303 -101095 -107295 -167508 -48970
20753 -130710 288110 117401 -104441 -232185 96346 132168 -32527 -112812 -154086 -21487 80139
20741 48786 25178 128065 49228 -51297 -215461 14287 8586 77796 -49624 171311 5579
20729 -768529 -212866 -7228 14403 14651 -147838 32700 -102188 -461389 -269707 109640 119029
20718 119029 -20470 -217455 137345 1956 82752 -59046 76737 -264972 175288 179129 -41035
20706 -10743 -23498 150376 -32401 -162277 -141476 -102951 251344 -96921 299941 66555 -139766
20694 68694 -55093 -36491 60474 -467013 -410886 -189777 145563 135522 125856 -142078 -55828
20682 85909 -142862 -47997 243270 136501 139958 120074 -231492 -120365 253984 211337 -256012
20670 315368 -42712 -50987 -19882 -291574 -151452 -52442 -40124 -83688 287643 -9938 213206
20658 -47829 -269256 -255274 -241755 -231328 64091 -260895 -119342 -201858 -327962 -83015 -61541
20647 -61541 -255367 13497 -21240 -82981 -405338 29003 101905 283679 -27885 201937 10178
20635 36368 -116395 -121471 -84149 -173135 -86879 -8990 166463 -26604 -155701 -106195 125575
20623 -194791 301005 -7216 -138494 68144 -164684 376457 -53311 -221436 113005 312728
20613 312728 239180 -78859 -161848 -323878 -5506 243206 -50196 -102387 146867 -98233 -307331
20602 -307331 47496 103421 -342755 -20597 110300 174594 -67577 -82925 58863 -66479 -83692
20591 -83692 242119 -70660 -238556 1181 -52873 -120578 44855 -61262 -163042 111111 -6612
20579 -218829 -83688 -163587 -124941 -20451 -99436 -94606 -130787 -9746 166840 644331 116587
20567 155655 1358 -39203 116043 -232744 -97631 91603 215225 -7236 -73703 115781 -167327
20555 -48214 100942 -225534 72216 -270983 93508 -200048 -151680 325219 -268745 -326319
20545 -326319 79890 -134358 92449 -119355 159306 -278378 -189108 -99646 42693 -342882
20534 -254182 -536074 201773 -46153 330842 73826 -120277 204460 157312 51127 -144653
20523 -56814 -41254 -46239 -116301 3943 -424065 -217647 221064 -351266 42126 -68983 -335940
20512 -335940 -65217 -107245 57191 206728 -152236 430313 -329089 -134206 -148192 -377968
20502 -377968 -5198 240392 -295852 -121859 -334717 -173511 -59623 226269 -336052 480259
20491 -18607 -350188 275140 -255553 -104919 -38266 -181562 -44556 -201062 -95869 -80154
20481 -80154 -445276 103255 -111395 4214 -99945 -165668 115845 208390 17937 -84098 -184935
20470 -184935 251551 35167 -114200 -211027 -48579 -78384 -179838 62437 -31177 -223925 -173807
20459 -173807 -9346 -132583 116790 -191283 -8012 216615 -53955 -70644 142654 -193742 -347495
20448 -347495 114286 19959 -256869 147509 108827 -204796 -120918 64626 -207017 -395713
20438 -395713 -361620 177259 -29054 5655 32505 8432 -39245 108321 -251024 -118588 129719
20426 -89432 -50505 -231757 -81914 67081 121922 118936 171207 116362 -22737 -236790 -260825
20415 -260825 274304 -251436 104689 219575 -114490 -48874 -65720 -211447 -173183 22878
20404 -51435 -62694 57409 -63618 -162320 20321 -96257 -197406 -80444 85525 -262020 -19083
20392 -26474 -145238 22523 153065 -92124 -166097 -77315 -128229 -6522 -189052 -26305 60509
20380 -116377 -156997 -67976 -242726 1656 -111340 -111662 -97177 -98758 -84022 -373654 173240
20368 -661311 -110294 50702 -87198 279146 -197865 38773 -106817 -10150 -11229 201886 -192235
20356 -125665 46513 -378495 -50929 27980 -159567 400733 -35654 -224261 75606 32145 7503
20344 66800 -147198 117179 111634 -92619 172156 -205060 -58532 -168469 173614 -349586
20333 -170237 217318 -13123 41229 -20974 -58499 -30674 42977 -242097 87385 -265140 4098
20321 142044 -20790 -25171 -175310 42755 -208135 -327818 -103497 -434645 12348 145037
20311 145037 232932 -376298 -364435 -29326 -195470 -111645 -256379 -41889 -12761 39220 -185074
20299 -205526 -215527 13419 178505 -41493 275934 158023 -6266 79512 123210 117924 -199019
20287 30055 -5161 -197544 1225 41863 -475563 133579 -84154 138615 208023 -79910 -172213
20276 -172213 43711 -224805 -77780 -279314 -175368 -344559 -84500 127442 308123 -143622
20265 91300 -39143 -105802 -183308 113772 -314665 -154669 -11863 -17518 62336 244674 148063
20254 148063 215209 -81261 -164019 -232947 -53212 44344 -54547 -127770 6700 -13108 -176799
20243 -176799 -129146 -233503 -323611 -384294 -37543 -470821 184278 -13952 -133200 -178481 21066
20231 -19045 -20040 -6620 -70893 102625 -47466 78914 -115184 -188408 125937 73872 54339 75853
20219 75853 -125697 41777 -75174 -243350 -106239 -208703 -249875 -30383 -3582 -178075 -265294
20208 -265294 -96102 127651 106667 106618 52452 265557 214057 204391 -105837 10803 207754
20197 207754 -75402 -61905 9638 -272986 -172837 215469 301934 -158078 -830 -238918 -185761
20186 -185761 -11706 -284376 122288 143190 -100778 -78265 249628 50508 334222 -427639
20175 -230228 -20830 148383 37579 150742 -211217 -69636 -236602 -161435 15224 -93216 -238104
20164 -238104 -58319 58226 -211456 -244680 -282878 -262947 -13001 3323 -129397 155590 -76956
20152 -442202 10712 88679 19886 -267411 -316684 188665 -216291 -8150 38201 -173056 -137542
20141 -137542 -280336 -14613 185428 -118245 -103786 -80297 143926 -327503 -118661 -105455
20131 -105455 -459897 196631 38358 417975 -128522 117426 -63364 2527 -286627 -314873
20121 -314873 -136858 216191 126131 -32729 -170827 -34908 -381720 88167 244335 16021
20110 -249277 -85212 -53922 -84285 -347278 122457 -47472 -137111 206582 -106908 55960 -241718
20098 125711 -40234 -127045 23446 -290173 -94631 -336471 -68290 -105289 -316220 159319 -418102
20086 -81085 -301029 1482 90500 8699 -262377 -162232 96597 175109 -239294 -194081 -91655
20074 -406826 30298 -69957 -249651 175522 76380 176562 -11547 -98793 27524 111633 -158427
20062 -2769 16056 -173827 154297 164415 253033 23887 -27774 -66592 27619 -90377 -78333
20051 -78333 55795 191959 312021 -104575 -123959 -232190 -92316 -15207 -21034 13787 33208
20040 33208 32772 -76588 -114437 -54291 24199 -206250 -9058 15924 151755 255325 -303146
20028 -177147 -148019 72585 -74977 -142572 -171661 -162222 94431 118411 -30961 -305913 -138654
20016 376212 33520 -385686 10225 -68334 -53075 -335132 143283 46656 -246903 34032 -90234
20004 194925 -212520 -66579 -202208 80903 14126 131416 26624 34521 10183 123964 -186258
19992 56719 -25221 -179657 -176906 -108636 -222959 -266575 176063 -385315 -365453 198915 175373
19981 175373 -8528 388681 -168129 188720 -397162 -245979 -171139 281605 -7490 -211499
19971 -211499 153050 -1625 -257648 -256569 23427 3264 82771 -182949 -107644 -160083 3334 -124198
19958 -141840 -56990 63411 -184479 216343 -22761 47412 -351057 -191507 78840 -89726 118744
19946 -131631 -58466 -148159 -265599 -106156 -165435 69602 13829 -365838 1170 -351138 -165884
19934 99664 -29552 93622 40798 -95331 115179 -86075 -111213 175307 232449 -269848 24773
19922 224663 262494 124299 -16460 -278282 77790 529345 -92839 -147579 -162942 -240178 -251000
19911 -251000 -621861 -19417 -44204 99854 -8761 -4788 -43802 -64910 -274756 -149365 -62391
19899 -261177 -42166 117443 -37644 -36647 27045 144351 -98919 -138117 -233809 -92394 -108809
19888 -108809 196930 75799 7734 5045 122251 109945 89325 -12331 -32790 -100648 -212600
19877 -212600 45924 -79777 210536 -16710 -125847 -123580 119415 -330824 -379828 -54646 -114136
19866 -114136 19552 66625 8866 -27628 -35543 113151 -460522 -296504 -269487 118403 -141274
19854 -64115 221853 -57736 -390849 -290905 -176555 -168454 39880 56549 -179787 -205319 -163695
19843 -163695 -209817 373164 230969 143446 17166 277695 -83692 140660 -59196 110891
19832 7581 173317 -126909 -330419 224498 -296229 155795 -200293 -52654 41565 4139 -355552
19820 -133409 303434 57596 -122066 -137368 433574 -201188 7645 -5077 -197594 -217883 37272
19808 52985 -225763 18166 -3037 234029 -129140 5298 -218937 36501 129967 -271068 -26003
19796 -116947 -75570 252991 -293717 -5219 -95585 -104302 -39934 -241076 97316 149653 43767
19784 -258455 309121 -409372 -77606 79187 -79086 -254010 105102 -13112 -25601 -309018
19774 -309018 101311 297752 71635 -155368 -296812 -277849 -40351 -228067 308884 -212913
19763 54087 -192314 -325711 -52375 122754 77332 -57406 63888 -100427 109870 -389648
19752 82680 105689 -19115 -128570 105437 202810 163610 -117323 37690 -184953 -266984 34943
19740 -210545 198189 -130476 -67535 -60274 -53262 -216549 -65157 -289729 185748 37968 147880
19729 147880 -77742 26921 45756 -79797 -123366 -151962 -259849 -205126 102242 204321 23785
19717 -99637 -180696 103141 44740 128546 -79304 -195688 307663 -334630 -14337 -145511 -222108
19706 -222108 -92582 -131740 -205033 -404822 279669 -27324 226825 -33813 -153407 -75769 152083
19694 117490 -568124 -288151 -170444 -189700 -140337 -415929 154188 -45714 4381 78766 -233314
19682 163847 -404790 -213640 -160285 -287364 -17239 -11569 -201317 110713 -76192 131313
19671 -35647 18042 -110809 -306929 16821 -46065 -150184 -298924 282481 254162 -169940
19660 -170902 126796 -160340 -93733 -367160 -494640 -149965 -189859 -5078 43863 213962
19650 213962 117618 -132459 33364 89710 -175423 -53240 231458 -8734 -289860 -165090 -10659
19638 -13883 13526 66679 -228120 193238 110724 -275822 -69567 252591 -153656 -249469 106713
19626 -92978 -135615 71211 118862 -251991 -385799 89663 -126107 -18600 -181552 64887 57953
19615 57953 20209 82457 -155998 -125338 106198 107496 -67064 -74923 121012 -114742 -209024
19604 -209024 -52182 -107447 117075 -218040 -67707 -90866 -224233 83389 6050 -138254 3155
19592 138518 -6899 173701 -129034 -260741 361684 67342 -100082 -66249 -198387 -320003
19582 -320003 -26411 -136694 -13830 -140541 -158857 374533 56101 84195 -298272 -345581 -40250
19570 35782 -439084 192045 93209 -204814 251217 8014 -206609 -100542 -107527 -31415 -269483
19559 -269483 178093 -30421 -86101 -150713 -82194 116682 49426 -71504 21094 212912 125171
19548 125171 358078 88022 -240412 -280181 51544 -76595 54350 -46130 -177502 -52384 -210165
19537 -210165 32448 39494 -177760 134306 -157710 -234794 99150 92705 -138229 436227 -83247
19525 -417249 -377920 -71088 -145441 -314994 -296576 9908 352003 180268 101488 180379 39350
19513 -309822 -64808 -139584 125046 -347309 10997 -84409 -165589 -41146 -454811 -58146 -109423
19502 -109423 55692 -188177 -182941 -76784 39977 -110356 -181445 -18079 -64228 2527 -118640
19490 -231358 104642 160152 -173352 -179490 -48921 -87164 220758 -3184 -37017 125804 5124
19478 239970 -263614 -126013 -86633 -268724 18111 39570 -171844 71553 -138337 -4766 -94726
19467 -94726 150432 -354671 -177874 160927 74890 85670 -139145 -109455 21035 227498
19457 227498 -152838 -193316 -5685 147459 -258844 -26778 101174 226631 -172059 -112752
19447 -112752 -100981 -67350 -300967 -203948 -141431 -90092 194284 25473 -70907 -89097 -105896
19436 -105896 1359 75964 -93310 -314643 -40654 -144297 -320943 40605 -47223 -21719 122278
19424 -112556 -320042 -168305 83147 125056 -144767 -26702 19 216201 105790 -90739 -27083
19412 68911 93112 108178 48759 -4496 -11834 60155 -368778 -483 214401 -195387 57468 142415
19400 142415 -86759 5809 32384 158928 -313281 -41381 -37905 158600 -201639 -27192 -260740
19389 -260740 -364746 -141172 -163285 156678 28489 78931 -119602 202549 106278 -241483
19378 -182143 9791 -172739 61879 -93529 -204620 -347644 53520 254692 -124897 76038 -338184
19366 -102531 -99360 -125189 -225303 -139734 -64101 -55392 -325206 94517 219050 -79713 -239337
19355 -239337 -281883 -164213 -447120 -253159 201687 -178804 -136036 -129630 41641 -222887
19344 178169 51307 -279026 106406 208478 22307 -164982 -90703 -56124 -122758 -297329
19334 -297329 -162670 -95829 166362 141330 -220313 -15092 -171877 -387485 -166768 -160455
19324 -160455 -17780 287635 -23106 19344 -17989 13977 -255712 -31223 22897 82362 185197
19313 185197 -352970 29209 -79446 -212947 25259 123628 83033 -66073 -148540 -77710 -140992
19302 -140992 75098 -400680 33490 26700 -339502 -42442 32006 -9573 -137771 -136962 3721 -110758
19289 17201 164072 9377 516303 230674 -232173 -45868 137047 -244538 -45827 -210209
19279 -210209 137116 10007 152333 -143491 -4996 -34079 292141 -246310 112848 48491
19268 312450 -95055 108677 -123005 -53630 -105665 21946 -229983 -27516 36073 25052 -164015
19256 -170579 -209560 69687 -2430 -32753 -218356 -236753 -251067 -79488 -34241 -147441 -30362
19244 -35723 93372 -17367 -316183 -31873 36188 -160244 130761 -22517 6931 -389717 -360181
19233 -360181 -47674 -148518 -242903 -181721 -198098 272812 125853 3046 -56536 -308723 -123048
19221 -97585 -115723 -105066 1693 226832 -601876 -8539 -41644 148076 212890 -87662 -83033 42813
19208 -270878 -314594 -298546 -266457 -130418 20167 -118591 43247 -112655 -142510 79823 -184738
19196 -78402 -114182 43577 -153168 -308997 -181328 -42621 -136685 69921 -147345 -162004 133225
19184 7571 -340193 128513 -148823 -184863 53920 -32376 101555 81960 -82392 184916 -102099
19172 -140762 46330 -195190 323086 -51875 26767 151279 -61729 272934 109552 -199208
19161 -2500 -48594 -81903 -138726 -18784 -67905 84066 375820 -90849 -281220 -135230 183688
19149 106203 -24254 5533 -87190 -126388 309113 -332552 8923 -20296 273435 256352 121571
19137 -138876 154536 -57920 -318532 27147 -125725 -84937 -162932 4417 -91989 -233653 -368270
19126 -368270 -12216 -27552 -62962 -212383 -280372 87307 -105243 -41402 45054 -129232 -91937
19115 -91937 190101 -85070 -3899 -163914 -121446 -185362 175049 4817 -207856 -37592 12108
19103 26323 -224135 -283518 -218450 163520 -336333 -17812 -306902 -21314 230723 84057 85113
19092 85113 154306 296490 366258 -141701 158144 -101380 23062 -38705 204896 -352621
19081 124734 -57743 12626 -98595 228142 94366 18609 55458 -75970 -291696 -58820 -164916
19070 -164916 137354 34899 -11336 -87487 -4537 59384 79368 -131640 12219 8367 -54142
19058 -35010 79192 -167492 239853 -37289 -223568 -260685 53583 -310809 3158 244529 55896
19046 -54613 2865 190532 93010 183981 113521 38742 238758 -78908 344200 -243203 49599
19034 4840 80399 68888 -259902 158947 -142282 15685 -68396 5562 329498 16962 61984
19023 61984 305619 150464 -29535 -77440 348773 -75075 20316 -30168 -697 110645 241678
19012 241678 22319 -91995 2553 -36819 28645 -36198 178699 -232487 -309511 -326863 4508
19000 -65930 164201 -86818 -140014 -119802 151661 95089 -265016 -79807 -234324 -68441 -110519
18989 -110519 -386798 -47272 -161808 -23795 -350284 -433094 45048 -127566 61107 -102611
18978 -49713 -171573 -25073 317130 -220107 -29546 2834 -74116 -3010 -254540 -221987 -105161
18966 -268396 -99887 138566 -412328 107026 29352 44905 -80716 -346213 56748 200061
18956 200061 -206076 34376 -24843 -72278 -239004 -115126 9790 -183639 151556 -188439
18945 40685 -33455 -79542 -69909 -7204 -289528 -288657 -352195 -347058 -188890 288691 116789 30072
18932 -168709 -24367 46977 -355562 -198439 3303 144944 77949 -35356 -104087 -87912 -237549
18921 -237549 -142369 -114704 -261889 258901 -46102 -409727 145217 232268 93933 278261
18911 278261 -91348 -67800 -109237 96926 -325353 -287838 94508 -181639 -91613 -101342 -73467
18900 -73467 81989 -344601 -106581 -69284 -62668 -30006 45370 87953 -448973 259953 622
18888 257270 90073 -192293 -318296 174966 -53286 -283154 115537 125138 137019 -256066
18877 369258 -86308 22543 -253932 378405 148711 221040 106578 -340846 -47548 347408
18866 -244923 -57710 66820 -167770 -241179 -124315 88306 56673 84981 -61355 230 -250570
18854 -95700 -47489 96076 -100411 -224882 187737 -273988 -239428 -61721 78059 73410 -77459
18842 18954 12738 255547 109878 -52779 -77012 42042 -306110 -320602 -133362 -30028 294802
18830 287028 -282392 -3306 -151333 -331167 -234518 66564 -94860 -102209 -26903 228831 -35002
18818 150554 18935 -293568 -228477 -131696 -353159 -119553 -155041 25546 140079 224351 -96745
18806 70394 -100162 248631 -159006 -156826 22501 -218529 60685 104067 335741 159864 -166566
18794 144226 -88085 -49313 -48815 12708 -365188 22765 -132853 186704 -35727 38542 -33603
18782 134484 -57068 16374 20028 139304 -17831 -171285 -60516 69753 -4613 -9714 228197
18770 -138385 -72315 -260031 -160026 -241657 48568 5452 90685 6020 -76769 -153430 -335568
18759 -335568 274071 -44514 32192 -277112 -85933 58722 -282955 83477 102671 -344825 277526
18747 61630 -116014 -137416 420937 -360890 -28207 -29552 -153592 -26864 -263167 -85654 -132217
18736 -132217 68272 125998 34672 199341 54542 -277344 -260212 71868 -3145 176740 -150588
18724 89044 -180912 108241 124608 -281766 140733 143377 -102945 -23473 24396 92737 439181
18713 439181 -444290 -22197 59681 -57409 -66427 -61571 -77101 -112706 113243 -119114 -36815
18701 -277892 -57928 181094 118268 -131674 76725 246998 145474 -267616 -355140 134675
18690 139798 -180792 -132549 -234835 -146156 218232 -156386 96497 -52623 -88471 -303486
18680 -303486 -73528 132480 60477 -102340 -152170 9762 -139640 -10562 57504 15260 85834
18669 85834 55104 -181881 -55013 -29414 -154097 297386 -27473 12533 31470 -286257 -366860
18658 -366860 -73545 -244240 -8055 -115684 110993 41898 -24787 -29620 -17409 78396 -94810
18646 12939 -132562 -12795 -13237 37154 -91294 357108 -226127 -111321 32669 -127043 -348964
18635 -348964 -40716 267959 -5533 -23259 210822 78782 146565 66323 -483112 -81629 156879
18623 142427 155127 416628 127098 -31039 194808 94337 -32225 160465 5422 27392 10536
18611 -146723 105621 20900 -99640 -88354 -173701 -24043 88731 -181279 -141876 -190505 -112267
18600 -112267 95221 -89606 112307 -293275 215682 190405 27829 12751 102626 -193194 -211851
18589 -211851 47841 153422 -271420 -157963 289975 -72717 -8146 -18218 20728 29068 37922
18578 37922 314811 -174880 -351252 -234943 -275948 -140558 -170610 -200112 -183288 174416
18567 260888 63520 -38869 -2205 253391 -247478 16214 185730 -208230 -39604 -44411 -113799
18556 -113799 -246401 230050 -89117 -300539 -106941 70648 70117 -52999 -232982 -8170 65890
18544 -1 -109857 179505 14107 179598 49577 -310394 4340 -64926 98188 -298911 40193 -92975
18531 -140131 5245 -50597 -117403 4711 -164543 -269785 175530 18596 -537216 -18945 -43650
18520 -43650 -487646 -109869 117332 158893 142918 -186421 240249 -54145 332620 -18598
18509 -107915 -117768 -95191 1652 110211 134459 232020 -135829 335359 -139441 -148552 275762
18497 50119 -114791 -112864 196444 9593 -152630 -77591 30540 69895 90915 -54264 -106975
18486 -106975 180708 81591 145902 -99152 -175714 19036 -207173 137499 110018 -348772 -40859
18474 -358444 -189569 57088 243520 134576 -43081 344362 -27428 86681 -103019 56068
18463 -32359 -242846 111775 -50652 297069 -276613 -138193 183971 -101023 69443 -193770
18452 16345 57974 49525 -405017 50871 163551 -264741 -103003 324032 -163307 -104252 -83585
18441 -83585 233085 68684 80834 -124664 149515 218043 -115837 -62953 -71026 24543 205781
18430 205781 -223326 -302398 -132833 -26073 22401 -98356 265201 -279965 -309402 82331 202596
18419 202596 47645 -112200 -248217 73478 -94637 101748 94278 264488 -4443 -191814 49283
18407 -301267 -278780 -13985 64522 -401280 10422 70131 123609 7679 26229 25826 5223 16882
18395 16882 234162 -9939 -177232 99375 168279 -236296 43765 138469 114246 23727 -318554
18383 97130 -97990 -51322 -73565 -181621 198797 26660 -45473 8787 -53311 205574 -184824
18371 -143038 34469 82444 -180214 -33752 35848 -36945 -145054 -153413 317317 -94564 68575
18359 65891 -269128 199635 -125611 -112452 -82196 -255436 55835 78216 -67212 161927 111199
18348 111199 -90325 -107474 -187360 1710 -291058 176144 -129808 63917 -221146 211474 -55847
18336 88995 -47685 63314 204599 -22565 57691 -145920 -81502 75903 -390952 42373 -200370
18324 -1564 -192590 -309879 44593 59311 -32534 -237254 33679 174311 202660 -14529 -166973
18313 -166973 104318 -243224 -83856 132633 156850 -123177 118873 -242994 -181190 -124350
18303 -124350 -228599 -5556 90234 -210797 -5102 232235 -122959 237581 -252927 -254682 40377
18291 -139314 -167157 7169 49211 135894 26269 306007 -133762 159442 118820 -245508 220652
18279 74344 -207745 -79647 225987 140469 -153003 124584 -23405 -160684 34975 -253917
18268 272152 -307356 248210 -25 95366 -128613 237034 -220037 250214 -83612 17971 58716
18257 58716 -324906 -72758 -135299 -256907 51732 37795 345860 -200844 36536 85217 -197483
18245 -8699 -92907 144287 114680 222654 -104765 56728 -169722 -124264 -21706 164860 179352
18234 179352 161947 -224201 -109055 -18015 20097 -224044 -275903 87299 -257019 -53811 -139735
18223 -139735 276770 63394 68278 322609 -296168 -202784 225683 44515 50219 222482 -34711
18211 -192179 9359 -430979 -65875 203612 -374089 -286866 -181412 -317265 103214 183369
18201 183369 43072 110379 -203843 96132 4483 -139631 -148349 -45572 129092 75252 -93228
18189 132696 35576 -129490 134841 -6117 -85300 33810 -90541 95226 58184 33655 41942
18178 41942 -191049 -177350 -166927 -135556 -54552 388454 -121647 -185827 -53348 -565695 -202010
18166 -70179 302335 100194 176807 -13742 -113985 -113755 73806 170154 -36375 6571 -149176
18154 -263606 -22689 423510 -251185 -196256 -50053 109940 123287 38991 60379 -79011 102040
18142 21034 299395 176135 127867 236205 -206241 33217 122479 58157 -114453 -94850 -254514
18131 -254514 21610 -440850 181787 161988 119995 -95358 84150 -237838 5249 -774 -156767
18120 -156767 24555 -266 -91354 -138424 309763 -212649 64306 -169343 216677 -119292 -66143
18109 -66143 258417 211459 105672 -73726 -91201 -198377 -14470 -69522 119851 -67042 127831
18097 -14485 216953 -82016 -2732 78812 -89388 -82618 -72219 152230 14200 -301814 260287
18085 75492 -106289 -42962 263311 -79043 22635 189330 119080 -22982 268447 82867 -75445
18073 257281 -484448 -69446 95270 226032 187944 -39820 30177 52711 -80286 51253 -436603
18061 -114692 23518 209518 102341 -50230 86345 -226862 -145527 -50428 27512 92112 200077
18050 200077 -59734 92740 218371 25281 34060 302000 -45848 178508 -203098 49199 -91061
18038 341015 -39702 183246 13592 129369 78720 351785 -71496 -39240 -79229 314972 -211694
18026 -196591 121915 -89274 -289488 68227 283266 144675 142988 -219442 -119818 163919
18015 -43339 159693 69426 -29837 153303 340801 -266412 38239 287272 -133917 -38170
18004 25921 92075 129475 143854 107063 -218663 -396148 139986 83020 195677 -115076 13161
17992 -75693 64375 -72280 -49527 122183 -17331 -148867 -139453 -119830 -93440 -115426 124548
17980 -266689 -205555 38645 -182100 -293687 117797 95428 -146262 -23094 -155755 10987
17969 -63745 42990 -44767 208825 94472 210229 -179012 237081 225427 130050 266754 148263
17958 148263 138790 -132980 26984 -31797 -144056 16461 329352 42786 -109888 -70526 -85410
17947 -85410 77789 -81042 -121833 166070 -139637 -37088 224248 -15532 -5055 93237 -46195
17935 150720 -23278 111536 85121 107089 -377294 -161311 -240203 42494 -162623 -23622 94673
17923 311424 -218568 222800 -190708 183618 -164206 10099 220253 -108367 395868 118900
17912 -98146 72150 -324191 -132499 157185 305635 154896 -116746 -203330 286882 -137229
17901 82153 114269 171864 302080 -231808 -116287 146063 -84775 204974 -77446 -15978 116880
17889 -157368 227844 -60213 133110 134828 -30611 -130575 158460 157728 -5679 -93490 120288
17877 -151783 487343 -52361 -21471 477983 -131517 -55762 -25922 -183853 13358 -134733
17866 -96164 -7022 -217192 220384 112371 -80933 157816 -46465 82001 -69380 57064 -52952
17854 108274 118551 202958 -95706 15790 -72598 -207779 185857 95310 131493 123476 85747
17843 85747 260774 7143 47676 203620 -164903 138139 -241904 -21904 -241246 123916
17832 -115202 105473 -1319 -62264 -42289 178392 -122607 135506 -200072 -34787 -59009 129626
17820 -144966 -202754 41237 -28222 86093 153619 102740 49424 80560 -297745 598 191014
17809 191014 -238277 16623 12244 -18067 163208 50029 115904 148688 -108802 214150 207794
17798 207794 66704 144304 184363 3614 132367 187231 -43464 17916 -103083 -1326 108740
17786 183369 -182951 114289 453829 16904 -188188 -60821 325328 -143445 -31132 -272845
17776 -272845 45444 58556 175497 269506 86991 138722 207750 164709 -1095 -85145 30146
17764 128430 86745 119186 -146609 166636 -122987 90536 -59500 41642 238920 -223111
17753 254264 367444 5388 180797 34595 -256140 -132309 -75016 -36699 -154568 63080 -118602
17741 82211 -43530 59518 -66401 -126583 -65384 -75200 145612 37191 33186 -174416 -75503 212799
17728 -279699 344595 -140684 142994 189550 -168167 316920 15580 46923 283877 271599
17718 271599 185691 -49143 84848 131243 301522 -195754 380157 47850 -30407 -72735 -55060
17707 -55060 269066 -89090 15153 210829 18823 -93744 100675 96599 -84594 259729 241250
17696 241250 428040 515702 85899 294319 28652 -213069 124899 -105080 53334 -125939
17685 -47584 29911 -17616 -97847 109876 -138680 281820 42109 166477 142019 127872 149579
17674 149579 276433 -48997 31682 389473 46669 -2266 195849 131816 149335 -14548 135199
17662 -105667 382605 264688 27264 -54222 7185 339402 -7934 47431 -65306 191053 188768
17651 188768 97401 134240 458405 179885 109579 159079 40484 197744 -74094 335469 305461
17640 305461 458243 11123 -152375 150835 153178 -133209 407380 675694 -80970 -28018
17629 101814 -160356 117062 -17736 364059 134393 91019 -10343 149183 98126 247666
17619 247666 239991 18201 28260 91061 324963 394842 -154133 104111 250025 -21335 401903
17607 191533 6831 -34160 263942 163779 -156085 226332 48767 -288238 47529 -234387
17596 81098 -83715 30447 188027 78545 274251 -68942 469596 394431 -100577 -60487 281414
17584 496092 35232 -18212 332955 105204 266717 511309 313655 266722 29222 151206
17574 151206 314356 11188 -137636 360047 250794 248549 100625 45603 193647 -71570
17563 199138 -270963 95593 119014 -222392 383035 -108111 247795 134058 343075 141668
17552 397141 54223 231703 167640 184538 310072 43152 387023 141433 250053 136535
17542 136535 374695 361402 119480 621507 -53763 261061 -115543 -17385 460303 245295
17532 245295 308382 188078 121875 -154312 24168 446024 67131 5393 1275 58956 120262
17521 120262 184665 -136963 450114 288931 88428 85920 -85375 49882 49294 63147 427744
17510 427744 -10517 26780 540525 94238 151591 368819 111113 425821 539432 55255
17499 235316 -11034 23539 211786 263875 104289 389217 -27645 398485 -18296 415790
17488 155245 223780 493088 237553 -25208 17383 241128 261505 506407 52581 210430
17478 210430 213708 315533 292994 240663 31675 238939 -835 58490 310357 348062 250054
17467 250054 296065 327924 313030 118339 341905 281950 181537 497354 313428 527804
17457 527804 170845 145222 137880 421972 -101930 345076 229375 419478 550817 246372
17446 151197 280925 241542 205232 490481 300347 249867 259762 716313 331358 603379
17436 603379 327711 174104 251874 647073 433173 599914 546984 400307 565630 320652
17426 320652 529437 81767 181489 303983 335733 236021 331788 -41774 414262 561630 483099
17415 483099 590242 450760 123390 514752 146280 557864 509393 388393 337379 325032
17405 325032 272197 448881 578756 435142 598195 600982 199727 440330 222639 416776
17395 416776 173729 847545 646050 177729 428549 196467 397730 333808 327874 377074
17385 377074 189152 28284 663895 338549 331568 280102 547485 480725 267050 512306
17375 512306 77139 82984 529351 471817 534386 296216 403499 412753 359503 251616 515286
17364 515286 510397 236770 278764 340471 739216 334714 241960 297664 466948 230919 260098
17353 260098 495728 410094 129813 347453 5582 285288 107555 255430 434620 364915
17343 364915 607268 324341 227658 470408 451173 539232 354610 262589 695339 397959
17333 397959 183566 338646 518132 436593 772953 594269 455121 386289 205069 287133
17323 287133 389998 7713 592652 186711 869 319811 249118 375139 94564 552655 380661
17312 380661 321625 389448 302318 382537 315689 525912 559924 372194 855216 324767 575916
17301 575916 362818 275243 737096 246917 642142 -64794 383488 649377 540446 796442
17291 796442 73056 358854 525785 401017 312034 402518 661125 816307 572466 574522
17281 574522 246704 608623 586276 330690 575918 361697 439720 529746 769827 398522
17271 398522 432603 474892 664601 610486 647162 148481 732389 495660 559663 814680
17261 814680 260847 607596 299053 142839 623761 346710 759071 427907 603305 280965
17250 509832 534600 114182 460786 497096 514670 726655 385192 717338 794445 649480
17240 649480 745908 661034 387030 675571 789196 522476 733524 455969 480416 449932
17230 449932 866671 572133 787269 351883 683696 291636 604231 629625 635163 586814
17220 586814 648352 649742 656818 636719 800407 652818 582794 515584 751769 756771 453223
17209 453223 686919 551894 590722 833198 533123 898620 732418 947518 925324 881368
17199 881368 890340 922896 370722 773217 424533 841909 834378 998659 676985 811757
17189 811757 298937 786949 925311 694480 751283 993155 471698 469388 790796 680445
17179 680445 627645 1066965 656976 658193 687481 831718 728019 872118 948542 806109
17169 806109 780478 980276 887392 576168 760247 859083 818616 1050204 591473 911631
17159 911631 936735 844404 421682 953232 1106375 826896 1006210 948239 793802 707670
17149 707670 1173518 991888 1037421 849963 1230221 1218885 1046455 1219843 933598 973020
17139 973020 952985 1032348 1221322 1070193 547396 952669 779416 1035357 1337166 1101407
17129 1101407 991267 1232666 1220637 1185764 1016761 921185 1015869 1450047 1165932 1094568
17119 1094568 1279101 956621 894417 1203051 1368804 1041306 1189217 1303837 1136034 1104813
17109 1104813 1048450 1461413 1313475 1415729 1059213 1059725 958934 1121788 1384742 1234093
17099 1234093 1282193 1178277 1173894 1105611 1444103 1049915 1145878 1332270 1029000 1377630
17089 1377630 1056978 1332560 1346540 1115837 990290 1372304 1431982 1332831 1489441 1015788
17079 1015788 1759195 1141563 1290983 1781278 1623168 1539806 1464404 1055075 1564965 1741014
17069 1741014 1572284 1482775 1420376 1206562 1623366 1052943 1610069 1504013 1624788 1582735
17059 1582735 1792298 1363051 1749830 1720850 1590365 1350256 1587622 1578483 1340498 1824170
17049 1824170 1497071 1722299 1979678 1495747 1975043 1573577 1651827 1674859 2015809 1682358
17039 1682358 1835166 2209354 1707650 1939284 1850676 1904329 2245856 2014622 2030565 1928618
17029 1928618 1821593 1955348 1633642 1710501 1827535 1978933 2012955 2068788 2261098 1981771
17019 1981771 2130900 2282934 2348196 2255178 2128391 2163152 2285030 2274503 2535199 2179294
17009 2179294 2203799 2311641 2291467 2299807 2335126 2402046 2290008 2272685 2338825 2302159 2632108
16998 2632108 2681812 2598955 2589300 2989596 2529544 2755354 2640910 2308607 2498669 2700544
16988 2700544 2559013 3022855 2751791 2699320 2895715 2591515 2760772 2863499 2868227 2912428
16978 2912428 3095400 2631949 3230036 2806515 2681844 2995278 3169360 3352319 2997556
16969 2997556 3132901 3077960 3293778 3345181 3159731 3278054 3024265 3306108 3310939 3265506
16959 3265506 3311850 3395284 3618193 3580685 3595581 3636754 3625330 3818878 3520563 3667186
16949 3667186 3867263 3801601 3679542 3995079 3847101 4064979 4107558 4117184 3792007 3854600
16939 3854600 3985111 4108659 3925853 4002626 4170109 4474053 4368255 4543517 4206885 4455388
16929 4455388 4293575 4504392 4749288 4715925 4465707 4945197 4736841 4774373 4571378 5125162
16919 5125162 5116311 5053993 4931491 5180974 4845891 5299459 5244012 5023015 5648956 5506628
16909 5506628 5158865 5325143 5653853 5473712 5763292 5507030 5725144 6146000 5794073
16900 5794073 6106267 6022718 6121145 6047591 5879848 6505416 6225919 6292057 6605222 6547164
16890 6547164 6464755 6372799 6504169 7118239 7016500 6704684 7008557 6923264 7139269 7029736
16880 7029736 7439549 7424871 7416873 7621075 7260475 8146745 7653090 7560790 8198829 7885910
16870 7885910 8258960 8255753 8590937 8456727 8685367 8814613 8627052 8836926 9096444 9195883
16860 9195883 9082818 9144241 9340125 9653681 9537983 9608658 9576410 9516645 9985439 10280217
16850 10280217 10229674 10398883 10623697 10730625 10735200 10904853 11126410 11150574 11180236 11772631
16840 11772631 11474883 11731349 11508468 12363653 12008521 12541895 12660274 12901440 12816519
16831 12816519 12893579 13105634 13140719 13260769 13721242 14062723 13924114 13939360 14548531 14880202
16821 14880202 14752152 15038290 15209501 15698780 15860105 15810054 16001973 16243044 16526465
16812 16526465 17121212 17079485 17528163 17595528 17922141 18171459 18469497 18524110 18922626 19169852
16802 19169852 19673644 20062605 20267455 20204064 20874478 20938631 21641223 21749045 21808649 22416271
16792 22416271 22814218 23265268 23691227 23817483 24187692 24450849 24971309 25510985 25151543
16783 25151543 26172611 26542977 27034274 27287581 27756005 28231614 28895179 29294392 29885109
16774 29885109 30521796 30727571 31493845 31726701 32330023 33163401 33693733 34350943 34777704
16765 34777704 35571043 36300471 37210407 37595156 38334073 39253519 40004779 40336607 41378828
16756 41378828 42132710 43333237 44036993 45148420 45833413 46837485 47838627 48871648
16748 48871648 49845199 51123035 52589376 53214644 54655420 55863492 56948282 58638141
16740 58638141 59527405 61095019 62089878 63624439 65396665 66882407 68432376 69779210
16732 69779210 71105998 73101764 74814193 76623300 78087527 80072332 81768909 83760450
16724 83760450 85677276 87371695 89446248 91525416 93526873 95331908 97415494 99406648
16716 99406648 101660384 103792463 105798979 107847950 109862234 111710897 113624777 114851185
16708 114851185 116214211 117042214 118020994 118197828 118323931 117504271 115971173 114297678 111623719
16699 111623719 108552923 105452391 101618002 98316972 93938071 89463281 85278488 80709900
16691 80709900 76388478 72243407 67964948 64322159 60237335 56665181 53491234 50315050
16683 50315050 47591038 44644517 41904554 39599427 36793682 35247273 33097199 31475303
16675 31475303 29778650 28168494 26906675 24976494 24103464 22867451 21770323 20676109
16667 20676109 19604937 19051571 18157844 16991731 16814509 15940871 15351650 14629196 13996781
16658 13996781 13413918 12839562 12780839 12160201 11564368 11294819 10687597 10487573 10501895 9753080
16648 9753080 9332009 9329606 9038224 8773539 8271860 8041348 7666248 7651624 7342297 7365594
16638 7365594 6868788 7187004 6744860 6316994 6345182 6345427 6175819 6190575 5628514 5546283
16628 5546283 5462450 5532741 5161023 5309440 4872600 4906294 4908720 4371863 4546516 4556052 4306314
16617 4306314 4030118 4177275 3671667 3625913 4188720 3907625 4032028 3758498 3512200 3458776
16607 3458776 3660093 3418097 3580323 3204347 3203104 2969490 3275007 2939744 2879677 2852126
16597 2852126 2871269 2780334 2324529 3158495 2725784 2750529 2404218 2210134 2073942 2309808
16587 2309808 2618959 2193299 2138612 2383452 2179601 2195229 1703726 2218276 2353325 2179258
16577 2179258 2168308 1959191 1990430 1935902 1758263 1765587 2195675 1763874 2335377 1814025
16567 1814025 1951831 1918911 1637210 1687917 1490571 1666867 1418668 1341072 1924869 1807793
16557 1807793 1622222 1589510 1639520 1639839 1698068 1822832 1346927 1511412 1411541 1539639 1307426
16546 1307426 1436130 1482184 1232737 950171 1621765 994412 1249222 1306387 1123956 1175879
16536 1175879 1173619 1038950 744045 883385 890711 982655 1144542 1032604 1160848 1140800
16526 1140800 982176 1156339 1013882 1060890 1132622 802686 896697 767795 1016438 974752
16516 974752 876996 1218199 744578 883561 1001415 952802 1155873 870383 871869 615238
16506 615238 777643 904067 805373 781888 700406 1061999 802341 959133 521291 911857
16496 911857 659210 722249 1003982 972857 893161 774715 865648 664463 470555 355658
16486 355658 973866 975461 562325 547184 548890 786226 811478 806017 569491 770137 713527
16475 713527 728904 548585 573308 514279 730940 429029 380121 709760 461987 599712
16465 599712 567732 983711 435712 657125 607348 662449 618732 171290 656668 413120
16455 413120 265822 762605 656568 577588 574779 451232 724383 576392 474682 351323
16445 351323 453495 334258 344066 383997 670258 133544 588601 885230 54674 218113
16435 218113 579851 291837 268315 477056 380576 377520 511540 436376 514860 405719 601780
16424 601780 414926 476168 543393 471269 537018 139446 595893 95931 312806 350921 389061
16413 389061 256158 311569 123315 440503 475584 61684 483450 388388 454684 573562
16403 573562 145886 216453 125559 270774 466784 1992 304170 313161 -133363 212957 261002
16392 261002 403063 283528 475450 -17369 573205 244720 132243 621441 229449 429740
16382 429740 376928 540490 341528 263115 228286 408285 612386 369947 257204 -91863
16371 330969 -19729 493504 239640 227650 423741 30315 417606 -40985 666174 57725
16360 494809 116847 189973 320378 347531 -26477 645348 93467 247442 89993 316578
16350 316578 449490 411299 339408 716479 -14443 223090 150110 12513 -73623 -215419 201912
16338 59420 96553 441725 428671 302322 533263 318165 -196484 477317 143100 289865
16328 289865 -52136 320334 -7680 220513 146024 238305 -49549 -25431 258722 184903 400008
16317 400008 158718 209969 40908 -169211 30021 212202 148226 351195 89257 230552
16307 230552 127740 579911 145106 266656 -1212 295866 280242 57912 951 956 332085 248334
16295 248334 269893 73896 79586 121051 141981 138926 55350 48085 119222 154047 307771 118824
16282 168067 274403 53788 -206141 456767 105716 15502 121553 83927 32893 399721
16272 399721 -34799 462083 502647 56806 239288 209404 138891 -65882 39904 309492 239203
16261 239203 180478 225523 -222500 220970 -71651 -8746 287507 130501 100934 -75198 121822
16249 -82812 102928 56170 -97750 224825 -356948 140378 -137337 180216 163534 249932
16239 249932 128773 106863 -157113 -13187 192681 -133059 45753 54713 -204575 -133399 324380
16227 -45609 199260 411284 162384 -181309 182308 356294 -40027 23009 388171 197484
16217 197484 269986 -73681 90224 131215 12184 220814 147779 177560 371748 99789 -6980
16205 -237240 198962 131464 12161 -2774 -113519 27465 247293 -266578 -39861 108200 -299072
16193 41751 23049 -198709 -23638 219257 4396 61342 67837 -28515 14830 323098 103884
16181 -155624 234108 61483 185414 -22874 303608 -69897 323338 323255 -81869 26359 272879
16170 272879 -59211 271378 -209735 -63831 11674 152983 335802 68779 -104715 344264
16159 62072 189348 218347 33896 74867 302211 -300356 -163413 96312 -57380 -55260 162437
16147 68029 7409 -228284 -125610 243825 7177 271569 63567 -226371 29008 106044 -28699
16135 -137624 175846 48591 203951 50233 203204 275786 97856 84790 -188624 303344
16124 148756 324536 -68370 -83108 33261 284902 112718 -118889 -283078 52775 -95595
16113 -5273 248064 195250 79742 231749 -18206 250440 273116 -118427 188833 294473 -102382
16101 -196478 156960 -61914 121016 -82440 -185271 -15612 74834 -51479 30310 178760 21909
16089 -21407 -136731 -330453 350067 -178126 56 51335 -150372 60328 512615 136294 -31722
16077 73843 -54435 113682 64406 180902 -152338 -145918 19265 -126753 -283097 192345 -179741
16065 -301389 173136 447873 -236364 -216010 62499 81607 19816 180034 102675 197050 238218
16054 238218 7674 -11884 43804 306201 -359303 4734 159309 293578 -120085 281409 232763
16043 232763 -39920 -180385 116455 -120905 92175 116941 -318033 -325756 -66278 303167 -155455
16031 -150166 135964 179397 54782 16963 -39314 -108281 -153522 58651 -73897 21732 98012
16020 98012 -172548 -256087 -14979 244170 217193 -80301 -30630 -216594 -58505 -2821 20000
16008 -73446 -34924 314200 235369 -125157 -108224 -163815 -93902 209295 -358275 -31014 293754
15996 183119 -175327 -23117 49966 -89946 -79624 -205747 -262361 -322718 108923 214798 25180
15984 -162370 -294823 61150 162470 -144577 -66877 12096 226003 -63788 198939 6070 -102535
15972 39212 -32813 12146 -46277 53358 177189 3090 -21980 -13176 -277885 24944 -226325
15960 -93590 -145449 286419 148710 -189149 133018 -3356 11456 -136657 -253539 -142983
15950 -142983 -131373 -322424 -122755 233990 119854 29758 -49855 45568 84280 -84318 -187006
15939 -187006 66968 -150489 -161098 -483020 -119108 105621 188992 -53375 115962 45478
15928 -144709 90873 62016 204837 7224 -16771 -358013 -213302 -8502 -122157 96552 17999
15916 -244249 -97494 66333 -199197 -151705 16880 -186247 -17915 196991 -132389 -117032 -1798
15904 -406880 139629 63813 -117091 2685 -6436 -270174 -59620 109363 -182990 4234 300959
15893 300959 351949 142899 -224643 274144 -107226 -22772 -592 -91819 -95454 176976 -148010
15881 -250210 334928 70840 -80502 -40632 -208883 264038 143603 82656 64615 197498
15871 197498 -276059 226703 -153982 -94402 -42062 -99639 -175543 -63380 309588 190473
15861 190473 -33226 -161987 -150105 -161825 119084 226283 187711 -46724 91523 50384 -45226
15849 -292130 170034 390662 -98589 -172850 182266 6144 94727 -124918 8099 -184157 -116833
15838 -116833 -249150 27465 55020 234539 424105 -54712 -40467 281593 72786 -2195 118612
15826 274638 244802 -262498 -132682 -68905 191550 259646 59563 119215 57433 -72442 -192554
15815 -192554 85670 -2112 -231534 -8931 -149857 -375795 73948 169892 146555 -361427 -191940
15804 -191940 286350 41310 103129 140793 -27067 -193057 309889 -278788 -151937 -94335
15794 -94335 -234468 -160277 -62826 -36504 225846 24683 -154231 308852 -15718 47262 40079
15783 40079 177079 -240072 56554 31913 200110 49680 -133025 289945 -239879 125291
15772 -80421 -72530 89173 4653 -247070 -125470 99731 133619 266 -71578 -1384 -154346 -150825
15760 -150825 -5233 -13754 81362 49133 290669 11160 159839 232426 -190062 -423 165952
15748 11223 -150540 269083 267626 41109 -82379 18251 16188 -90207 -89469 -66465 69735 -219408
15735 318610 -151071 -105200 -124862 -7720 -131237 -47805 28726 135503 159283 97612 21079
15723 12055 -201625 8723 114011 -258355 285361 49527 107107 4083 -290197 -74032 8276
15711 -327026 -78392 -134986 -77641 -36043 491595 -30450 -114724 -62134 372012 185175 16838
15699 274139 -108198 179696 110668 51193 197373 -32317 -222305 11030 -209523 -152663
15689 -152663 126060 128111 7295 -72044 275065 -105512 -92833 147387 -21710 482787 -166690
15677 -155741 -127872 -70911 -120847 27690 155888 -29475 97524 74022 -85960 129796 -174403
15665 167777 25898 -304532 -299257 25908 127681 -41308 70485 65338 280920 -119662 92558
15653 -117048 177183 125622 -155561 -121932 -14391 82079 133827 208348 -53413 112973 344543
15642 344543 -171360 119516 -238724 -42806 -236352 379842 232307 129870 -331245 16956
15631 -230270 -275631 -56379 20690 -5811 47829 13477 59749 79157 149543 135251 64806 235220
15619 235220 2588 -232107 -303537 -42391 -52583 257970 208761 -94313 209976 95976 246148
15608 246148 -201185 249581 -91233 -320486 -93963 15797 79576 -438582 -192192 -54658
15597 187242 23063 -22702 -9263 -70709 -212673 117098 47209 -98241 31576 -423202 -25738
15585 300024 92430 -51078 -28324 93633 378779 50371 74966 -141271 448689 1095 -219223
15573 177805 201962 -53823 119511 -48210 108192 -416002 360710 190110 32208 -71793
15562 -313 142089 37945 -134205 -50175 188183 -2223 40156 106359 140936 -88594 150514
15550 46221 -131394 216841 90725 99545 72051 106201 430682 17468 -93884 200345 27415
15538 -84664 -149482 21856 46998 26933 -90599 192188 -254190 -118972 240752 306778 182203
15527 182203 488263 123097 200829 59069 220301 84635 -102713 -39818 65577 345673
15517 345673 40746 -35197 159515 114183 -17564 -303896 156310 4566 154868 301137 37230
15505 -45313 119679 -98223 37875 154193 -24302 -13381 160081 162107 -131386 134013 -338992
15493 96404 307874 281601 -121608 372710 219249 218745 -126745 -21502 -104716 112396 152813
15482 152813 88891 195179 213201 29946 245293 121344 450082 -39327 45686 15739 332882
15471 332882 -95402 34898 33165 377152 -162428 249691 -99836 318860 166262 104726 106179
15460 106179 230420 -68442 145017 44645 248049 425770 342058 200561 -46131 252313
15449 -102820 9551 90437 148269 -187631 -148873 71865 221726 354340 -26888 -89236 2437
15437 13414 209370 51772 -70715 230613 3689 240067 -1818 249652 -33843 207377 66424
15425 161117 492390 508205 -67345 240205 137702 -162028 -41175 269491 188937 224950
15415 224950 -114275 41958 13198 176200 67196 44072 62313 -155256 -74905 34022 58042
15404 58042 158734 409159 236765 -124805 -178151 315301 97220 2845 198163 268131 97554
15392 339882 331129 250967 94339 126655 12211 -85636 160706 90227 231773 -33157 255851
15380 16853 298944 151702 239541 25733 -398010 -44161 82122 -30709 124971 38493 274136
15369 274136 243906 37272 58299 -99588 223187 -30724 183773 24077 43577 -116032 404829
15357 221395 67540 110232 223402 179427 -40649 201424 299058 181756 -145568 271027
15346 517172 165848 274103 -25539 375936 87543 367329 220013 435535 -61673 32554
15335 328951 207589 221963 8970 127527 264968 192607 399354 170714 258681 298860 460433
15324 460433 267168 54099 579713 237029 199195 378967 284887 145352 274716 91551
15313 345813 229427 282245 -103200 241765 360929 -126277 377971 349808 442178 236364
15303 236364 309480 309356 151259 -44587 316432 249524 143508 83266 154794 -116326 -268376
15292 -268376 478069 177260 317483 179798 318609 99217 -70300 297207 99326 159033
15282 159033 340841 290105 352243 192695 54236 47946 217990 153237 4271 314890 -36455
15270 292279 3452 342270 210121 385809 296371 530169 184958 240758 341542 325343
15260 325343 47018 440605 537743 269221 344807 282292 190191 423858 265689 441275
15250 441275 439748 413227 407436 452195 219667 443719 533477 96657 594769 534427 518731
15239 518731 383303 433365 533198 285914 437609 265471 581574 835687 312189 750853
15229 750853 389488 522313 497513 256041 118542 -9487 395912 217001 242330 74837
15218 377202 132549 389886 261588 571284 304741 301503 479990 22943 165057 85868
15208 85868 224320 308296 618400 425863 530181 226126 123936 150175 -79966 126440
15197 456471 -38376 172769 259184 521218 136200 -32545 548863 135282 310058 366018
15187 366018 152218 180639 81479 420224 352335 457478 389739 780641 118734 569559
15177 569559 315726 399156 79994 539726 435102 409074 277996 320886 590144 620003
15167 620003 225824 413959 440630 305335 375378 141107 389451 349206 411283 239088
15157 239088 328951 115978 164134 302398 76594 389189 226544 140415 272347 519938
15147 519938 242335 235389 100867 -41029 322442 405265 219735 171962 421582 384026 370609
15136 370609 115525 597654 242955 309150 528322 320965 421492 295433 783913 348001
15125 742167 216769 400186 743540 413035 524794 698420 343172 283058 357848 447456
15115 447456 485141 419814 464419 616092 201936 735794 554617 216337 311456 243827
15105 243827 413298 534689 260185 709264 454770 274654 565153 557013 527026 252073
15094 729075 487755 467648 520642 684980 783877 416908 440778 282851 639653 484561
15084 484561 366416 461450 644227 442033 306768 562422 492094 668993 108712 387195
15074 387195 509399 506416 432630 690864 360741 393905 828235 610215 609931 292676 638068
15063 638068 640197 606057 432956 731015 555039 543970 526952 505474 492173 351775 637320
15052 637320 647011 619844 551917 784054 785894 526662 577099 286635 525426 724586 489019
15041 489019 763671 556778 660084 819280 567389 775414 353370 498772 589179 688751
15031 688751 541188 648533 444262 740220 930193 348203 670705 466371 630725 584518
15021 584518 785002 462989 701641 797419 620245 921760 760604 641040 946494 603456
15011 603456 606792 933697 738733 802173 465995 687200 705503 607799 564753 403856 533399
15000 533399 788069 795721 964287 805039 954947 758302 505845 440607 885468 850447
14990 850447 692888 400111 896324 1192207 812454 706132 658099 657696 514755 551290
14980 551290 729087 908352 599727 823198 575976 783027 892199 734675 868368 863391
14970 863391 767597 756407 822144 968740 803231 571306 756369 621022 902001 879840
14960 879840 940964 702057 640585 917495 865436 597583 997655 918338 786217 751371
14950 751371 1031694 887071 1177607 750642 950939 466996 626499 783243 976006 1066414
14940 1066414 984468 1226494 1127163 804076 946066 914281 655273 496089 860124 1010529
14930 1010529 1005536 1099938 1045951 1034652 908496 1093946 904503 1133150 1089840 848520
14920 848520 1287687 1480015 813632 983513 720567 671114 1122765 1037939 951221 1239026
14910 1239026 918068 1126511 965174 949614 1143053 753160 1041220 891193 980537 934991
14900 934991 1148554 1186879 1059817 1244570 1278481 975108 1044149 870491 1122312 985449
14890 985449 1108314 1073638 991235 1185272 1184278 1017426 1182498 1162657 1037941 1302830 1083856
14879 1083856 1295197 1145159 1015057 1233666 1078019 1129383 1194568 1245814 1423123 1456440
14869 1456440 1120032 1404657 1239481 994628 1189994 1162136 1136547 1405001 1397913 1189082
14859 1189082 1346982 1234321 1529485 1637754 1444266 1148068 1368006 1286547 1538177 1098613
14849 1098613 1151488 1270310 1643241 1230873 1125894 1500030 1281577 1660643 1532577 1450005
14839 1450005 1326602 1292084 1389704 1366145 1224142 1371824 1333164 1281912 1487532 1529122
14829 1529122 1585295 1409391 1646885 1372244 1477735 1538367 1629082 1872162 1534389 1605069
14819 1605069 1846972 1695210 1454274 1427924 1394302 1527686 1605987 1829676 1315682 1887030
14809 1887030 1469044 1560271 1873693 1522892 1482001 1507396 1901297 1577783 1703041 1646896
14799 1646896 1941450 1651847 2354323 1714521 1582616 1964380 1486741 2009922 1852120
14790 1852120 1513746 1780528 1474958 1773258 2042788 1756324 1996196 1572805 2285515
14781 2285515 2104040 1940867 1901745 2131811 1975338 1999283 1752878 1912875 1956994 1781683
14771 1781683 2043531 1752376 2037896 1897452 1932977 2079309 2177353 2308390 2358294 2415459
14761 2415459 1955071 1918028 1857085 2117118 2169760 2603380 2308755 2024019 2333905 1960513
14751 1960513 2077147 2001753 2536785 2230435 2471191 2039529 2337939 2268324 2675440 2385325
14741 2385325 2667446 1964615 2677849 2371779 2488239 2181172 2587710 2582209 2453572 3082648
14731 3082648 2587125 2390002 2422416 2798627 2643762 2537906 2418533 2572571 2858690 2688009
14721 2688009 2693603 2481034 2710710 2679756 2786903 2546642 2921030 2452040 2724047 3109119
14711 3109119 2849757 2847376 2682620 2920845 2839887 2797408 2827465 2748111 2912882 2845110 2919866
14700 2919866 2977543 2949052 2913563 2982927 3310440 3125314 2821608 2985568 3302406 3315275
14690 3315275 3179021 3381561 3059487 3354051 3144641 3167914 3065888 3459394 3118063 3379891
14680 3379891 3508838 3283434 3177195 3427913 3166763 3518312 3225169 3593861 3309320
14671 3309320 3556397 3537727 3721401 3243080 3440807 3766450 3761558 3805683 3837330 3902017
14661 3902017 3614944 3967740 4007266 3887022 3573770 3605961 3863947 3319233 4151243 4211662
14651 4211662 4001738 4137933 4050051 3965769 4028977 4084048 4494579 4449031 4244661 4193113
14641 4193113 4483871 4330975 4338906 4114341 4421736 4556534 4377591 4393527 4420934 4510645
14631 4510645 4732759 4995096 4729645 4557917 4465457 4693060 4886755 4744557 4806468 4875359
14621 4875359 5014834 4875446 4993587 4794711 4895619 4956561 5359412 5467600 4982731 5220655
14611 5220655 5110720 5486347 5394602 5603499 5441715 5602433 5696601 5679843 5683544 5805316
14601 5805316 5557658 6150815 5707181 5936470 5924730 5944816 6146535 5991088 6189119 6229119
14591 6229119 6122889 6259608 6381369 6553842 6074910 6461060 6557568 6731737 6568354 6529233
14581 6529233 6704630 6863402 6938191 6987834 7123080 7199884 7236589 6969103 7620969 7166667
14571 7166667 7345173 7774476 7463540 7459868 7686129 7807812 8064091 8114097 8162460 7904635
14561 7904635 8506770 8231199 8418607 8489635 8701017 8519187 8906548 9043700 9055693 9269218
14551 9269218 9434666 9561805 9517096 9541629 9518585 10108126 9806373 10321434 10299407 10609915
14541 10609915 11068394 10813130 10948234 11075736 11649152 11678064 12261195 12731823 13169436
14532 13169436 13918466 13844563 13698129 13195899 12505005 11897651 11563559 11083428 10660037
14523 10660037 10100509 10360807 9996786 10316596 9670518 9871462 9933946 9948002 9990805 9852262
14513 9852262 9903655 10378436 10384892 10491334 10439324 10560270 10376746 10883139 10717142 11090969
14503 11090969 10968026 11072968 11310057 11228036 11458773 11105556 11577166 11542247 11858436 11911927
14493 11911927 11936361 12256615 12172184 12166823 12494375 12666732 12731763 13164863 12978931 13374205
14483 13374205 13598477 13070172 13522524 13669919 13714914 14035839 13909990 14213518 14360903
14474 14360903 14541567 14614001 14573019 14942130 15111949 15232050 15350525 15417250 15853309 15915618
14464 15915618 16639327 15901098 16439088 16486495 16638504 16970671 17380822 17048069 17409968
14455 17409968 17595809 17580218 17586418 17984128 18290591 18489163 18769406 18660813 18881237 19524274
14445 19524274 19657968 19742313 20260504 20209074 20221541 20355179 20507509 20803618 21263014 21495668
14435 21495668 21621879 21654498 22022265 22245724 21966170 22326379 23075605 23151531 23431990 23770681
14425 23770681 24400337 24207205 24321735 24931049 25081185 25809803 25772984 26186764 26440653
14416 26440653 26822471 27128639 27580512 27244351 27679609 28159137 28181857 29058004 29040434 29738132
14406 29738132 29682658 30065609 30596159 30709848 31271147 31760767 31734870 32545447 32675263 33330001
14396 33330001 33265989 33881106 34559116 35223456 35641983 35750640 36071314 36642626 36815585
14387 36815585 37458314 38206418 38465212 38827800 39112720 39878390 40526291 41365312 41700998
14378 41700998 42461708 42668170 43371572 43673575 44066994 44961782 45487557 45943300 46148191
14369 46148191 47049878 47759895 48641789 48789298 49784633 50217903 51060438 51656423 52554138
14360 52554138 52993286 53897021 54776197 55460719 56377875 57071873 58071865 58574137 59679784
14351 59679784 60486584 61384800 62048054 63279602 63972562 64626582 65879063 66861352 67898026
14342 67898026 68178946 69195561 70298101 71471328 72495716 73799977 74853347 75620582
14334 75620582 76376594 77334415 78475843 79864797 81149172 82476090 83841127 85068061
14326 85068061 85573428 87565979 89163916 90385246 91623030 92863979 94366958 96419511
14318 96419511 97562563 99296580 100286607 102109960 104838420 106829477 108476771 109567760
14310 109567760 111244183 113303133 115832124 117873895 120200848 122531819 125176133 127444477
14302 127444477 130003978 132665681 134084477 136705663 139370043 142789859 144548701 147305292
14294 147305292 150410159 153221596 154923626 157342845 160476295 164078868 168585096 171841080
14286 171841080 174743657 177304416 179990179 184366760 187998024 191466147 195065448 198003540
14278 198003540 201288282 204454715 207655650 211750061 215357817 219190324 222809905 226857664
14270 226857664 230975227 234799825 239740435 246108095 252575082 258241098 261253855 264488269
14262 264488269 270062665 275678960 280911752 288277023 298308095 310492099 320826914
14255 320826914 327192682 331841053 333249582 328660611 322602424 316021771 308375692 299613137
14247 299613137 289833904 279418712 268179922 257235197 244664702 231812873 219087327
14240 219087327 206808872 194563527 182489425 171571857 161460534 151328090 142629654
14233 142629654 134379970 126969142 119881831 112842398 107212287 101555714 96032395 91019456
14225 91019456 86502508 82064943 78183580 74294943 71090879 67714448 65030816 62099824
14217 62099824 59595092 57253376 55077615 53057591 51197955 49209473 47331098 45843453
14209 45843453 44200424 42590693 41460055 40338064 38699471 37657230 36386253 35688970
14201 35688970 34014432 33077080 31954482 31248325 30351953 29629377 28996727 28318290 27182593
14192 27182593 26881645 26035797 25279870 24628168 23950311 23678039 22947834 22460360 21743140
14183 21743140 21383661 20957584 20581036 20028363 19970106 19001029 18690656 18618281 17946743 17467814
14173 17467814 17345824 16939263 16408456 16249936 15706245 15787920 15448435 14896005 15091684
14164 15091684 14468949 14078555 13879780 13648027 13558961 12910256 12946107 12868414 12438050 12077886
14154 12077886 12122540 11823453 11967238 11426369 11213862 10980210 10873577 10670349 10156621
14145 10156621 10397366 10330124 10088028 10058180 9847336 9556628 9472541 9562292 9141000 9124715
14135 9124715 8630848 8814285 8557603 8632884 8369682 8620869 8146977 8035081 8176900 7610878
14125 7610878 7651051 7757611 7734576 7360839 7552999 7189089 7026495 6893922 6870438 6936388
14115 6936388 6900568 6986004 6681446 6713441 6469537 6440438 6391814 6126544 6266405 5956340
14105 5956340 5958607 5977006 5979640 5460868 5880962 6012557 5774691 5603661 6011944 5192081
14095 5192081 5228899 5407254 5143860 5251021 5199884 5076674 5221034 4790313 5023581 4941239
14085 4941239 5169684 4966179 5002134 4777924 4639164 4712545 4669002 4889713 4811352 4645699
14075 4645699 4400767 4379165 4502337 4592495 4400731 4388523 4121178 4135470 4395316 4100374
14065 4100374 4113480 3979795 4126421 3688832 4172578 3932637 4047773 3778569 3979370 3712473
14055 3712473 3682262 3857072 3877127 3743455 3858371 3674000 3569758 3681341 3745763 3654642
14045 3654642 3698738 3879438 3450010 3491296 3436845 3228043 3161230 3610408 3352698 3492509
14035 3492509 3506472 3422382 3224264 3363972 3209866 2882109 3272954 3371201 3424995 3451441
14025 3451441 3298396 2937591 3126861 3276986 3258158 3110178 3239399 3150009 3220883 3451906
14015 3451906 3100372 3052199 3189081 3250817 3103303 3147665 3229457 3394387 3419081 3007444
14005 3007444 3289992 3428483 2940085 3605379 3274779 3225118 3268780 3131563 3220210 3499903
13995 3499903 3325052 3480626 3321880 3584988 3892103 3602694 3826449 3605058 3790100
13986 3790100 3754332 3991616 4181394 4027238 4020747 4205262 4434013 4520275 4598362 4823907
13976 4823907 5529656 5357107 5466847 6163446 6539354 7303655 7388438 7091152 6268722 5439848
13966 5439848 4707861 4292567 4137355 3600980 3234506 2896105 2894998 2553943 2458248 2411441
13956 2411441 2329798 2497733 2159848 2166717 1876240 1778037 1978120 1858526 1895009 2052508
13946 2052508 1792698 1552511 1960294 1981095 1584821 1733479 1880028 1883677 1791101 1635337
13936 1635337 1671053 1742479 1697075 1747756 1712939 1486084 1241299 1294971 1703058 1516141
13926 1516141 1289611 1794319 1496872 1203034 1553217 1337167 1400573 1545466 916220 1647051
13916 1647051 1347355 1551235 1305297 1637774 1264515 1465386 1240317 1539985 1556998 1330197
13906 1330197 1065483 1521189 1402506 1190129 1566811 1415161 1464773 1258229 1122783 907067
13896 907067 1050585 1268618 1282705 1313793 943054 1121829 1064717 1204769 1381381 1119114
13886 1119114 1122057 1287395 1113427 1241952 1200298 1054108 1169058 1144072 867720 802941
13876 802941 1270570 1214183 1423085 1203016 1177456 1076017 1351901 1069712 1150237 1106835
13866 1106835 807928 965166 1360626 844427 1230252 893262 1037723 953242 1104247 902155
13856 902155 1060282 1108473 1290935 908946 935771 1226186 767144 1060507 959233 770735
13846 770735 859177 1010724 797615 896734 876402 954438 1011841 844765 667744 786110
13836 786110 1095507 934322 664665 688247 774014 978018 712293 739981 675778 698483
13826 698483 477025 896965 815235 1066649 777273 919447 788889 847240 773025 785536
13816 785536 423864 1083213 667493 598069 1064946 1023906 741755 967772 857616 799064
13806 799064 805291 817007 489713 827307 978147 818541 475690 605038 805219 1110323
13796 1110323 722468 754241 902124 740243 864922 738692 888366 686253 670425 591444
13786 591444 452730 423671 601752 823917 387381 782517 670057 811883 860509 731156
13776 731156 674190 847225 661751 794852 725352 580337 755704 515070 236441 498723
13766 498723 555235 631727 768792 566500 305366 496875 683388 812013 529545 986271
13756 986271 871150 428519 249019 494566 668238 654502 750975 574941 690440 778692
13746 778692 853158 486534 623425 591178 687795 538985 548388 529481 771131 430681 567004
13735 567004 421574 773266 701717 679804 23567 411285 582524 408167 279576 638024
13725 638024 674925 351650 548840 598561 528615 655668 532963 529919 396250 815793
13715 815793 288140 579309 808660 775361 286351 770546 680288 580752 831341 401244
13704 692493 640819 397983 354627 530383 444206 223283 260614 490205 343871 903371
13694 903371 431538 646653 202883 436808 317560 449087 514596 309106 475183 533512
13684 533512 368515 498815 512723 715743 342554 432720 508183 685808 682920 319018
13673 48089 363910 262494 294629 370750 473237 400702 18836 867130 323559 224932 571224
13662 571224 304796 135760 556843 208232 589942 397977 473869 346688 677392 363075
13652 363075 282269 316518 362757 421224 400574 453730 409909 478972 322973 91674 308515
13641 308515 587551 542634 569358 664210 59566 662306 500824 316248 468197 341142
13631 341142 384827 98545 127205 261670 402932 393863 345133 399027 343547 39980 543861
13620 543861 419710 539400 181136 166325 422297 173761 403420 117240 -43231 187329
13609 231506 273084 301970 239973 334278 289056 237900 656340 479153 340084 316966 272101
13598 272101 467594 403112 377644 398034 447525 115494 350659 446073 238896 543950
13588 543950 491882 176723 145423 492444 802274 537674 315474 329356 290811 75062
13577 230078 406539 116573 230465 335538 460602 346226 66738 321441 185932 333299
13567 333299 247468 230745 50583 414685 715862 85367 303317 547200 367078 183794
13557 183794 450903 240928 217326 162142 570319 176822 588916 312141 469094 431183
13547 431183 123075 292953 445963 -55479 143075 49050 93959 208095 280765 330091
13537 330091 304703 479228 271535 386153 123171 267871 402447 290824 -45166 511626
13526 554690 131679 128886 559089 13493 124734 317355 285728 157095 190313 52593 261885
13515 261885 361493 427896 103079 176930 119511 346027 -107221 397148 -30564 230959
13504 229030 151101 556390 163436 303466 106163 219103 328930 9151 547808 367717
13494 367717 415721 53643 208788 223716 240580 254383 257587 321433 -47603 352513 319731
13483 319731 330001 729144 134844 173681 371096 145154 234351 159061 171112 434208
13473 434208 61073 19881 285001 249013 244549 198335 259283 237771 164606 229453 79850
13461 -85813 134351 267335 269721 138781 247813 399915 326619 308472 287448 198383 145388
13450 145388 270455 153892 289830 186644 -13686 145264 12211 416067 209849 246984
13440 246984 120183 202319 77800 338132 78871 663183 -150465 -167303 525908 111910
13429 92116 49168 367328 172409 275960 376141 179392 275923 269781 185748 -76333 368443
13417 -70283 443802 254491 362203 -228073 229941 328790 172823 241582 480117 261889
13407 261889 185294 42290 78172 -112018 -29913 251891 109392 117087 355783 312996 206078
13396 206078 -86630 302678 328110 299531 214697 183302 -12948 125855 376522 283021 172424
13385 172424 582052 -30150 173819 331521 316654 335424 404450 215388 238018 -6311 161926
13373 324664 261307 215712 405229 395577 168804 58698 202279 137559 33251 308266 268328
13362 268328 -8106 164150 -26704 75548 200158 435902 260911 389541 -134698 -60669
13351 30704 333099 45612 296836 -133016 147048 358169 536111 68757 -140280 210799
13340 314401 30005 58397 187881 26060 71006 -6461 547479 582063 312935 204684 39720
13328 209339 215508 194966 192236 -75239 360308 46977 191139 -32830 53923 -13490 61134
13316 48131 322864 124657 469852 -34717 191530 -50390 -42131 347206 154189 195524 148726
13305 148726 21905 224327 204287 133364 -120396 -46009 -103083 -42712 135536 -225995 523293
13293 343577 351170 357546 170364 -12840 -42952 -68465 -215427 169330 -3190 -24013 101030
13281 226022 -51284 257824 79692 204250 151298 142792 -57707 -190759 130712 128155 -35826
13269 112580 -157933 291807 -9418 -73460 7 161985 -106298 281450 329070 105445 -265596
13257 -209955 337851 176875 -44314 62554 132750 190573 248645 -28020 -178120 -152906 282306
13245 26118 427 287710 -138509 -105469 274230 -128002 -58222 394354 -93640 116029 -207399
13233 333107 184947 168921 24242 316996 65951 140433 193369 333895 169072 116649 -192636
13221 99811 -88960 123909 254631 391707 69767 -240515 147273 287879 390953 349532
13211 349532 199564 137779 -158986 28992 -56762 441339 -170263 -125759 120292 107202
13201 107202 160017 127089 50559 187598 -294849 -329804 -97134 73994 -228310 182090 51811
13189 22718 227117 32164 -118964 2476 3934 297823 143332 123683 144174 131670 57215
13177 202269 194316 207292 -273903 -208688 50038 -205280 -50671 240678 38137 53350 227744
13166 227744 104424 155012 -270506 -152470 93039 108292 224202 181183 9864 354892 -86506
13154 82646 134153 240420 -42306 275252 -73163 524554 108657 154059 136753 73099 -93774
13142 -48665 -139711 -2577 -31528 167955 125147 -9073 -148527 99763 16422 173826 288157
13131 288157 -159418 -64742 150072 49584 59153 173820 -145276 334612 -189723 86295
13120 56583 40877 -363778 -25075 193780 45051 257037 248008 -70023 143470 -44363 112828
13108 190108 -219791 -65846 72118 255003 23407 389008 239648 337782 9325 272088 156025
13097 156025 91496 -24206 97661 -68843 -205708 265854 -88723 378445 185677 -200840
13086 -52579 -288209 330809 -264925 102948 -157247 -92407 -131602 34085 54559 39394 290807
13075 290807 -87480 -85518 80036 -112455 -111287 -397905 19761 60646 98286 274270 -24835
13063 162400 -33622 15561 365541 315152 176333 -260338 59361 -37995 127928 -52412 138232
13051 203700 44933 -173762 21027 77539 -15465 -78472 -21437 -86766 -528967 -24631 80349
13039 -184438 221132 19439 184171 57883 185583 46198 80347 -71923 373638 380489 -27342
13027 56031 215879 -143417 202620 379306 92430 -33818 173035 -120423 169795 479489
13017 479489 -387744 -118787 253517 143901 164582 139359 219298 41213 -40913 56929 172644
13006 172644 241260 205062 123861 -81312 189457 -23699 -85984 214338 30669 -209272 -38338
12994 -82115 179846 94551 -59029 90898 105525 -42826 -126059 -142636 322876 -72813 -21749
12982 258757 143432 117998 -76414 179854 -31026 20015 69682 -156800 -35672 -47632 47368
12970 -208490 47332 -228941 171766 -139160 215257 101799 -305818 -79798 72681 62231
12960 62231 133304 -102528 -36417 187383 394040 92154 245346 77044 -113975 154266
12949 -5791 235189 -96519 -158632 40998 372005 47843 -5853 80236 152139 -178636 61677
12937 -206220 -66702 511994 -133691 248085 63825 -174162 -171004 151798 -44496 -224514
12927 -224514 94197 287625 56403 182045 198061 206665 271999 -53532 180337 93075 -279357
12915 -85345 60859 127219 60500 -331093 -484325 -141876 -122461 -43717 -73867 -13674 420128
12903 128212 209246 42519 132590 74716 -45773 205875 132000 124624 -257769 217148 244817
12892 244817 65444 -289895 248668 -105160 -82782 -80609 57478 -290917 -69733 -159709 -92300
12881 -92300 125892 -33217 138684 -141423 -159089 -53151 -97284 72244 -139409 -1742 -88155
12870 -88155 -35962 191032 -124838 -28884 -47702 14554 105665 232278 215531 -204281 88328
12858 -36101 -250918 546733 -62494 -556526 149310 27667 83639 230777 166727 333700
12848 333700 81240 -159368 -155997 -28264 -228038 98681 385730 3715 -46275 28442 143359
12837 143359 -322670 -131101 64010 -159502 -57851 25335 -76777 -21368 24566 -35129 104414
12825 381499 -168621 152206 223855 -56593 246622 -31581 83432 -199614 131113 -138302
12814 101497 -156081 315456 -350372 147434 -28561 91500 48913 23214 -118000 -111988 -137621
12803 -137621 49611 369037 108811 -59295 -241335 18244 111863 -146945 164666 95087
12793 95087 -224964 -92776 6164 -71423 346362 55630 -231902 -26727 75004 436456 227495
12782 227495 181998 -222443 40266 356454 -131852 -130734 -1292 -86979 -68743 -81434 -116104
12771 -116104 -186326 49729 21441 177343 65095 -232664 -101683 -151626 -17987 -44340 -159217
12760 -159217 -324513 -104299 -139379 53348 267016 -91135 157202 152398 324097 91108 62561
12749 62561 57521 71619 58920 -194794 231773 -156230 262283 -77258 72696 -48776 87476
12737 406707 -134446 -128274 -224576 -181522 -17016 59688 -476371 -212689 -822 171659 -129817
12725 -295582 19443 -16392 85247 210576 165847 -93202 219671 47973 88064 -92253 197200
12713 279795 166402 -217672 238364 21616 -382309 -81367 119172 76424 -66942 -34703
12703 -34703 328240 367269 -208281 198946 313457 96259 -139543 -94604 -22944 367306
12692 -162747 130063 182962 -59127 13904 -63387 -28754 39949 205296 -14604 -373887 50459
12680 -109176 -374090 57951 128648 141048 39052 136415 -18786 35587 -213853 86256 99817
12669 99817 483814 85440 26780 262134 -169726 350026 -97400 -111285 -251412 216753
12658 -174824 252587 -125884 209074 -222875 -228080 -82342 -17591 143301 -25292 -104075 152264
12646 21380 137992 -134868 -14192 -50096 21009 -50917 191125 59806 178172 -370501 253600
12634 -6645 -8878 -297499 122541 91677 265140 21334 103191 104002 174239 347528 19246 -93548
12621 144310 -92893 -21880 264222 289758 179031 14520 -10494 171935 144811 6619 42494
12610 42494 76736 -169564 131729 -2556 -104367 84585 322547 -210599 228008 176892 448216
12599 448216 15475 -215529 147930 132584 43724 260863 -163448 -26513 38568 360524
12589 360524 -85694 -65848 435008 -44540 156864 -17105 47967 -188620 294568 636720
12579 636720 150781 -23131 -161608 90409 325837 -295628 249823 -194732 -117371 42748
12568 108185 -35459 16324 216536 41117 -20251 -3814 -250766 326635 40607 -65945 17833
12556 -144435 -125946 -33902 105939 -336486 -226145 -165600 -92986 137009 -118770 122057
12545 -54391 56547 182200 17974 69457 160187 -84023 147230 37766 -229066 -97034 182122
12533 37338 342736 -42770 86152 -22674 -140679 240624 19644 -355753 -130835 53879 -1146
12521 -75268 -36562 -224071 116132 254451 42534 97250 85083 52780 77898 56829 -139571
12509 22484 64205 -115315 114569 -119072 162718 -231399 -153255 -145380 -75386 -173226 95749
12497 100424 -75877 84098 386363 -33184 72264 156706 290512 49017 -231429 106592 423437
12486 423437 -301706 217434 11772 6860 -18340 -109471 -61125 -7461 147318 136114 -59652
12474 131559 293585 -249561 128938 2172 -196375 -20379 321012 -32448 19184 185853
12464 185853 151131 -405622 -61442 -16498 76321 -162281 -150075 155909 -67153 -80027 -355174
12453 -355174 -11368 66360 102469 -285924 187336 -314235 48526 -24056 38215 96188 235261
12442 235261 -18248 53419 -113687 -25777 -160656 101610 -196287 -47579 -11169 166490
12431 218215 42362 311149 401562 21296 80858 19781 137061 132297 20833 73520 16451
12419 -125853 163270 162607 225596 -84945 61019 -27275 177276 -137939 -55111 -111155 -131890
12408 -131890 175468 40458 -69466 277918 -50997 283102 -269676 -142225 -143429 -77408 -101332
12397 -101332 7122 -59879 88788 8284 -11965 143101 -11668 282379 168948 -63123 6579
12385 -167533 32498 167902 -225061 282345 -3289 39010 290031 -194318 85560 474033
12375 474033 55253 -73201 -238466 -129231 195657 9214 39590 -109706 -97546 -150053 57297
12363 11089 25141 129226 -91194 91447 -217454 -163750 -221476 79452 -76472 -174867 202892
12351 128339 151061 -183699 181913 236294 102668 -433359 137558 267453 133511 149688
12341 149688 -3110 -82269 16250 -65185 -196103 -103014 156644 138968 51312 114807 173853
12330 173853 -29191 66365 -110254 -68814 -269801 -50735 -270573 12294 61968 -88307 317259
12318 71603 15179 93309 163465 -176485 -114483 116757 -330056 -283888 -190197 22307 77528
12307 77528 32087 151038 -223287 -194077 -12242 87727 124179 355121 98132 53890 36134
12296 36134 145428 41134 -115860 -27911 -20886 93370 -334118 -3857 -23724 -149628 142253
12284 31628 21006 -79840 9999 88099 216162 216342 316023 21061 358844 301751 -149471 208851
12271 123526 264864 153035 -97399 29176 126977 -66213 -55214 28989 125301 307502 224684
12260 224684 67980 179658 291350 70570 116990 102251 138359 114209 36897 21982 107403
12249 107403 163904 142751 56236 226712 -160538 129213 206414 50822 385764 -81836 -119560
12238 -119560 115280 202099 -45308 187557 22539 63504 1069 193192 -142338 -171987 285424
12226 -227219 743 246492 37432 -158581 -86153 -86321 -210318 -14973 272783 -69000 -79096
12215 -79096 228655 91458 150119 41772 224211 -94855 113980 -142053 102713 173772 -125596
12203 127301 197039 150281 110339 107972 224989 -188828 -241741 152463 226129 -30146 166830
12191 492557 -262309 205987 416631 193578 58998 161281 201249 -64144 -6151 149226
12180 17504 317 574153 148869 81851 55392 337498 314091 351005 -52975 214941 -72105
12168 150963 38408 125806 -67795 160700 123897 -150431 -147830 134621 -93555 -72360 40505
12156 -212141 336291 -14791 -203270 -210415 -4737 -46236 -151849 -130557 -16419 148870 33639
12144 48140 -221275 163064 184594 54204 -449224 -103238 -8208 -343279 -270892 -104103 -155615
12133 -155615 -134857 189278 9621 76214 125061 1309 162492 -191853 -30751 -223141 339133
12121 -197742 11789 242141 72383 86663 -187612 76266 -65492 265743 -440085 60097 212828
12110 212828 288307 193342 203472 57633 39954 -196171 -7029 230551 -378193 93799 8067
12098 -61585 154660 -113300 -143199 3820 -228755 249574 57766 -115399 184268 -46755 -163758
12087 -163758 76904 208033 254023 -85774 178863 -210203 -114869 -196775 153987 240669 79354
12075 -65499 308393 -130412 26059 -77572 106644 -20940 225695 -139360 -54715 -49043 54176
12063 90787 225480 128735 103055 -79695 224933 19449 122468 293536 3060 -39468 -109978
12052 -109978 82848 15371 269026 241398 -239982 147595 -102663 256650 105483 14293
12041 -208626 -221104 25628 -121088 13452 163416 -40070 -79853 -87757 -1401 -92352 -301807
12030 -301807 115116 -46770 -152297 78567 -215932 -102543 -98607 85266 -80932 205410 -63067
12018 -154239 293344 -326414 28804 104656 -519716 -25523 5987 -15805 -10910 -294380 -157285
12007 -157285 -310805 72814 -352187 -126993 23675 32951 61645 -90572 -23824 178357 240561
11996 240561 77409 145837 36034 101210 277429 -287798 -119164 -44023 269472 142753
11986 142753 -184276 177753 52727 114430 70520 -319809 -157657 193555 264736 18829
11975 -65350 -130099 -189220 -26827 331600 10849 124336 123906 129123 -105213 -22927 -204717
11964 -204717 79991 -470425 -136560 118367 -92068 286182 87729 41684 -10274 -42953 -187823
11953 -187823 7683 -485598 71053 237073 9585 54676 -72439 284730 45657 -59064 -199168
11942 -199168 -164036 -235673 -88986 93929 -155772 -244411 -334268 -32149 59747 -45455 70555
11930 13411 15006 287824 -41058 61328 217666 -265242 -281225 -77525 -59496 -139485 80198
11918 -78161 15791 -47992 -83220 180528 151651 -245321 -18063 26346 93227 -248748 -102088
11906 -201054 180848 -219018 11260 -53236 -321041 109387 15331 54623 117544 336106
11896 336106 70325 -218017 160718 -42446 46115 -365685 34718 253992 77254 198323
11886 198323 -148157 372771 49249 385739 -93787 -2142 -279663 185891 -90626 191768
11875 -54314 -345623 -227322 -142245 229498 64932 -54526 -81134 297259 -263028 -31930 118958
11863 52699 -163005 -221053 167527 213558 266413 241822 10154 80326 105267 -356262 111460
11851 -1897 -107423 189404 -148714 -311259 -133908 -278564 -27881 -53022 128545 -73729
11840 -172835 -157888 29297 100 -210864 -62841 219151 -87616 -281772 -137259 -110974 -40737
11828 -22987 -46653 80378 -195212 -152884 -333646 -105790 -176069 -19295 23188 -160606 -180805
11817 -180805 95685 -256637 -48566 -207858 25083 -351490 -124461 -121493 196886 -407179
11806 -184767 241168 85374 82173 195 -264267 -415101 128238 -146834 74006 -85198 85449
11794 -18943 -397116 -220483 222492 -82797 -120898 -114401 -2366 -89213 232020 72210 -401335
11782 141115 -14201 -149214 -295785 -286442 -355123 328 -272413 -129624 -44058 -2875 81715
11770 -284963 -56875 166694 53066 165492 -77549 -41562 -159082 136581 253163 -94970
11759 331141 -222576 65515 -14100 -83179 -238607 241602 -80571 211168 -116660 -152676
11749 -152676 97461 182059 -292 -40483 113473 247890 343202 38795 -147001 -350717 -115152
11737 -31763 401735 -145496 -234909 -12737 182574 3702 229906 -35927 -425478 38858 -163764
11725 -49101 -36916 35751 168487 257328 128129 -6093 176518 -1780 11627 52234 105262
11714 105262 212565 -274003 -169121 -71988 -151091 -304246 20519 131423 88140 90557 -311021
11702 202672 225352 -83263 451448 -643 -309025 86357 -325371 -102117 -141845 49387 -44585
11690 293420 324364 -231884 -45787 230059 -163470 151411 -99940 250352 229728 -88596
11679 204709 -150278 -176459 -85426 -151775 117609 -51477 -80041 400720 34759 -68749 12200
11667 437625 -138485 -87785 179226 -112745 -70678 -225434 -7625 -35651 20742 139529 -217539
11655 -203445 -30241 -134518 -56358 182442 -185373 70292 -45015 73473 -175005 41944 147089
11644 147089 46917 -198279 -132510 -101143 434399 59382 -163266 -165054 -39491 105430 46124
11632 -125423 78058 -154648 -271980 50459 -47884 218947 -25528 192990 83788 -39206 -39848
11621 -39848 -59139 -251537 -54686 223730 -51341 22678 76340 158147 30134 104421 -43819
11609 -75143 -263850 22644 84275 -169219 -248399 -154220 -85210 120651 -333847 -13410 77323
11597 116715 259682 78125 -452 100216 67056 181994 -30467 -190102 248845 37154 179913
11586 179913 -155800 171094 -16935 196839 -108429 -88729 223776 273574 62263 -59256
11575 -177419 -157672 49560 237835 44670 -94233 -60550 24767 -208196 311286 -282231 75876
11563 -218095 238851 -122439 -106227 132628 390554 11434 147759 161265 289331 307715
11553 307715 -85929 -353954 2030 -340614 127437 56645 -9154 -206843 282771 -54424 21800
11541 -133848 -176201 -47405 385242 -79425 132752 50784 53660 165 300870 136766 127882
11530 127882 90843 -126228 9364 -64582 152586 -20357 -52178 183454 267365 22246 35231
11519 35231 -64212 -7400 -8542 246042 -104256 22217 -433653 -47535 -126329 -49324 250838
11507 83546 22626 245286 240295 143101 6735 91636 128991 202082 -95095 156736 -134661
11495 72744 -141867 -40485 18544 35228 -164686 15353 -144614 221261 -161739 -14140 56458
11483 9310 -239481 176367 179121 68875 -140662 10229 22670 257914 364828 405639 -287968
11471 12459 139809 392141 137667 -1406 101835 84463 -26500 -102525 -169917 -80187 -141947
11460 -141947 47957 148736 421961 5196 142283 262272 -164656 -110575 -53648 301239
11449 -82444 -164019 -63896 -103048 148433 67213 -67297 -305571 95435 98898 190586 -112291
11437 153935 -47808 119282 -121566 196318 -183229 45960 -54481 -111248 -204619 41696 40391
11426 40391 65286 346535 -62210 -120784 52731 -404316 152313 -304687 6552 -105336 -51594
11414 190961 -36494 49015 -265735 139817 -439190 115248 -43923 30949 -247553 -174160
11404 -174160 -166896 147856 114241 41516 -25275 78017 -499 148859 -182588 181460 -297862
11392 -228220 423417 29907 -141342 -166436 301225 -484886 -111988 171193 -335 65708 -245612
11380 -201381 7868 84664 -27568 337962 203975 -258073 38345 36134 -55095 -43448 162941
11368 -71283 -8853 10754 152090 136961 -29417 245465 3064 -92991 54787 88973 304353
11357 304353 242469 -65890 -413791 -130438 -104639 149334 107107 77980 343092 -91833 -86307
11346 -86307 6466 236411 -386954 18128 -34936 -166357 65818 -35931 201017 -165578 108785
11334 115647 102120 228381 -39094 122673 264734 -21297 -4756 -47131 -168387 -88376 225493
11322 -57187 130052 -153340 150234 141816 -112569 9216 222296 201046 -25529 156617 42061
11310 124081 -96477 -55042 -137372 -218247 77086 98211 -190791 55752 -96529 -58372 310418
11298 48380 -10799 -103214 -45733 -18997 155512 911 88686 25723 -152859 -180513 87751 117509
11286 117509 -181998 227777 15671 196720 -161398 -224851 297847 -17748 -200863 -291203
11276 -291203 197063 -14227 74738 -130478 -232512 -353660 -197520 106461 153347 -109330
11265 -164447 3225 -166562 -243102 253631 -229436 -70421 80932 253640 16305 -207248 -31240
11253 -338323 120390 -209338 -204149 -8988 281935 157022 -163240 -115841 68192 -106172 115318
11241 102864 54291 67049 205443 175473 68184 224110 -239603 61220 -340689 -23203 334496
11229 -275302 -88755 233753 104568 -284234 183392 -97046 80694 -87143 52501 -232193
11218 146652 68033 -364658 -223165 -108380 30220 -43595 -245392 210394 336391 -45902
11207 -415766 -79879 211695 -152192 -38739 52352 -13067 -168076 99021 254166 192895 -20509
11195 -194164 -20104 -270545 -219273 -156056 -202098 32153 -117995 -90908 -81756 -158778 -102457
11184 -102457 -472015 -99895 -9413 -162185 101473 56136 -72494 -223352 119786 4322 -415943
11172 100561 -238544 278455 10348 186042 -172403 145850 -186068 -102131 356556 33968
11161 203115 -87555 52661 -210515 310403 -91880 363292 233982 58134 -4764 190117 -123010
11149 164290 -135719 274710 145364 -115049 -349712 -239697 257660 -42305 370538 -86686
11138 238318 456503 -129868 222069 163464 -87422 -1386 -291609 -66803 -80887 171048 153059
11127 153059 310434 -79064 -44580 137721 75964 281103 440789 120023 394500 179926
11116 -25207 -72804 11242 -33607 145244 -26502 228140 -155226 -34829 -88070 32789 162829
11105 162829 11058 166159 366476 -106890 -105894 320703 373939 -177039 430436 -96899 283648
11093 174820 201917 413775 178615 259889 350525 218739 443210 257332 213239 365858
11083 365858 128174 221969 -132373 248174 203679 576923 121591 218490 522642 263961
11073 263961 261224 224206 480364 228141 414812 27784 283646 80429 496265 259289
11063 259289 318307 414488 340368 520922 123583 410317 172731 280814 284583 456572
11053 456572 535692 298455 578232 317879 472379 605495 704250 405344 352472 540893
11043 540893 533913 564044 547991 546604 427217 560475 758095 568656 295437 511042 695136
11032 695136 598485 599862 857503 581003 547414 388445 784495 583158 527808 465839 456002
11021 456002 654970 677310 490697 816150 710812 908914 518954 684809 864119 471734
11011 471734 730952 545892 613278 628148 218687 861182 518471 601735 624894 540869
11001 540869 567631 477027 360311 681036 594596 473005 628797 476877 479303 498098 508681
10990 508681 392076 882048 561005 540631 703539 576094 455675 913544 486190 596853
10980 596853 728767 608916 446877 754733 667175 686021 731003 838511 786041 948654
10970 948654 829599 929512 821424 946494 671845 714388 808492 1273219 1090800 1004364
10960 1004364 960998 1021011 1137442 923878 981548 1202907 800172 1041853 742568 443032
10950 443032 907388 792883 796529 483695 547964 622864 506679 718091 316228 735794
10940 735794 366351 601208 715928 326349 367513 127892 187534 28761 276927 332334
10930 332334 -1686 -24322 -279877 519108 87393 -165592 -262575 -9470 152462 14605 -197521
10918 49516 299382 280120 110721 -59827 57711 -114606 -366227 73840 182228 2465 103857
10907 103857 152644 167785 49124 35709 -309474 -96695 -23409 65045 -195865 -260972 -28850
10895 8136 -49622 -151820 75682 -63129 294740 109679 -176365 -163494 -176380 -116130 -120539
10884 -120539 -50197 158703 -14464 27010 -143048 -92919 157147 -405826 -70062 -241244
10874 -241244 -256338 -267598 -136786 54070 -249953 -203689 150053 -150166 16663 -50740 124575
10862 180978 -23969 -344093 -72995 63360 304078 15659 7525 322126 -399004 -164963 -39020
10850 36379 -300189 55964 70768 -207448 -7349 228163 -29463 -21368 -187887 -261004 -179363
10839 -179363 -327820 52192 222317 -23037 -198931 -80937 134332 -103730 -56806 16288
10828 -161885 -13511 139885 -93933 -349151 204374 81321 180591 28606 -100997 -112917 -246227
10817 -246227 -120905 25717 191670 -345916 220177 -36778 -199360 119985 -145479 -181764
10807 -181764 -27630 -193102 -398453 47694 -215438 59534 139139 26456 256658 -91719 -242805
10796 -242805 -10581 -140265 -295448 -269585 -17728 125137 -149701 115018 -292224 5169
10785 -126402 82642 -25646 -241947 103639 31464 29424 98802 -154886 -161808 -450324 11829
10773 72520 -34279 4154 58195 234650 -188842 169268 -128312 28500 79083 1110 63596
10762 63596 -350397 -315177 -237294 33832 -195941 35372 89742 -175029 -300298 -196033 76171
10750 -161676 93684 -158199 -65639 67616 -417231 131407 91444 -29960 -173140 34796 42992
10739 42992 -91898 143826 -122191 -21344 -179097 -411451 -319154 8974 -131216 145987 -31482
10727 198778 55066 -299221 100011 -15651 101223 334206 -158508 162954 -45907 -189178
10717 -189178 -31086 -16495 103347 111355 17897 166895 -84504 223900 -280814 -61605 -211243
10706 -211243 255532 -188957 -42572 198933 -114087 225381 -146188 -366990 -214599 181292
10695 31438 275043 114716 -216853 -207829 120059 52050 -135775 21240 99450 76638 -49088
10683 -46004 289189 77621 116650 77423 9068 -33585 -58091 123583 116581 159835 -391255
10671 108981 -433922 -140564 -114498 155777 18445 -278985 -38948 -177012 -83614 -149852
10661 -149852 -191923 -225047 -65538 -12702 -109826 -281105 -57432 -306252 233381 95907 -260142
10649 105161 289067 -317774 283008 -285194 38945 75323 -101584 36473 -25312 -257506
10639 -257506 126622 -13411 -48939 -74505 5324 -77546 -217209 -38491 -16363 -522481 39459
10627 198763 57637 -171714 135817 -281113 -69768 -72531 -176808 134043 -240018 -219206
10617 -219206 -186569 -247409 -68823 -132950 -202160 -299296 83802 147194 75743 1209 -211011
10605 -145752 -246370 -267269 240779 110563 332590 5244 -153568 -27402 -270443 -150768
10595 -150768 -39044 -163929 277910 -335776 -329062 -109808 -428831 -24169 295767 4851 -82673
10583 31681 31761 -305161 -161098 -39207 126731 -115177 -66510 167058 -40388 -251337 -299464
10572 -299464 -26276 -162357 -16124 -231534 -241630 -228990 -119912 -66154 -104622 1003 -86694
10560 -149138 -87410 248082 -56377 -67810 93132 -85267 194531 -320659 80078 -8052 -458554
10549 -458554 -113728 -135060 222867 -116442 -26987 -44089 -218319 -268849 170111 15411
10538 -74559 26079 80155 357937 -13973 57019 61585 -3930 -144313 -28635 -97327 -125233 269333
10525 -91719 -254016 -184629 47506 -39388 -153662 121029 118304 89602 -52073 237168 -44220
10513 -52515 -102385 -246015 -215593 358611 -29212 -150565 -301005 -243529 204698 91052 -387332
10501 270899 -89616 -4080 272480 -220004 -125630 -385110 -79855 184802 160469 226062 -194057
10489 106322 35009 -95000 -138638 -276091 -197986 69599 -107829 28938 345434 -108326 -39354
10477 181479 66892 115789 -14479 182225 -73546 144091 41825 182643 384171 -105360
10466 3069 60199 -48987 168075 138503 160635 -267140 150832 34350 283407 -150746 -218082
10455 -218082 182269 -249605 259217 460625 179387 -249516 15458 87995 213821 -36286
10444 100836 -74604 -108786 -94721 246280 119745 -169991 -107439 -14726 428410 44744 -145627
10432 259626 88466 -244743 -80481 330830 94154 -57818 -33266 -123987 -43101 14895 29784
10421 29784 59893 -92385 225149 -90134 -17081 98346 -24240 11141 -276602 -143157 191577
10409 -149951 -100153 21072 -209765 288636 82424 -174511 5510 184657 152306 -111959 -97521
10398 -97521 12800 109485 -23749 -21376 319583 69101 -211656 41963 -151897 317770 80642
10386 -30349 -105749 -91443 20605 126205 75856 120822 79046 164837 59935 126512 125566 114927
10374 114927 286490 216486 171362 -41703 269632 163625 191333 242661 114384 90813 163143
10363 163143 68786 140892 128433 241498 -57805 377206 70854 201633 172139 210579 -11861
10351 269187 173356 203271 182399 32540 239159 -10471 171342 99567 48056 -60031 287882
10339 -16453 -117770 57287 -187044 123880 51624 160825 150735 52813 10485 8771 134123
10328 134123 156579 55094 122613 186896 32621 -144272 -233183 -38424 4287 140331 -20648
10316 16823 138410 -161263 -156705 101504 -73501 -7812 -237607 170770 35750 -145022 200037
10304 -99308 -137218 -23811 -34585 123588 222442 -15484 -69653 22129 263563 -557037 -86828
10292 -128269 -178240 -57960 160190 -171342 -221135 140710 123155 229256 31136 -418800
10281 92320 -7231 -154808 -145566 -101189 117645 -11228 -68757 148479 -221629 105550 -38788
10269 -62199 261910 189666 -69077 -81348 -146425 194219 -416623 -161467 139634 97474 -93850
10257 86775 376185 -348205 -91968 75254 -112565 -126855 160475 203078 86043 3001 -188799
10245 -216230 320704 -46278 -172962 118429 148112 -68982 -118897 41077 -840 88452 179701
10234 179701 -81621 -465768 27094 -131928 -120512 31406 -213192 167020 -151327 -274469
10224 -274469 -331886 -42701 -334786 -141011 -143149 -286233 48706 -343064 -223165 -41342 -36249
10213 -36249 186007 -225526 -13689 26580 -259936 -134536 45831 16556 -39045 120200 -178148
10201 -172592 140480 -106666 -7504 -328404 -350938 -58025 -63902 312900 -127726 -306246 -291361
10190 -291361 -28515 111684 -235851 -201386 -349663 -207134 -471394 -302792 -36792 -221093
10180 -221093 -38356 -326987 -147222 272153 192132 30980 -479286 -315234 -72196 188861
10169 99777 28586 -197038 -99051 -78430 -122120 74234 75653 272020 -309971 -149766 160945
10157 -36978 113220 -49518 -280844 -46913 79956 138355 -289685 -260578 56862 -29100 -30137
10146 -30137 18579 -183256 107365 -85579 -180159 -324298 129238 -57680 -130156 -319994 -165438
10135 -165438 -177220 104256 -198776 152197 -93166 -173494 -128124 74916 11046 129090 5857
10123 94192 -332825 140709 -238156 57794 -85313 -135614 39792 -182227 -386660 71500 200249
10112 200249 -73153 35694 -27884 -486248 139295 -258482 -217237 55641 186062 9428 -119332
10100 178246 415902 -91078 -34217 -311353 19990 -46625 99451 -211265 -95562 -59502 77115
10088 -138249 -96129 30147 -91069 137887 -218021 -428403 204765 22402 -108268 -157746
10078 -157746 -103713 -224771 -171654 -205962 162936 523896 -154388 119048 -253546 32754
10067 -68094 73311 -83664 98893 -201743 -118823 -112089 -175073 197985 140190 -147471 -219656
10056 -219656 -17121 -65866 -2530 -305607 390908 -179368 87529 -114837 -100501 -45542 -95514
10045 -95514 -141065 45963 63175 36001 -3415 76441 -195232 115764 36617 27949 158005
10034 158005 -66402 -278658 -168076 -138817 -219603 -144840 -121913 -196679 63231 -242033 -52631
10022 -189422 -249880 165364 -147728 -155178 -18734 249810 31678 14130 -288946 80403 -139909
10010 -406473 -170422 -281870 130349 -220386 141104 65109 -27535 76189 48754 91739
10000 91739 -129563 -372287 29016 -41351 6386 -179326 -242430 -53962 -253761 121605 -298195
9988 11832 -347961 -114516 -379441 -29256 -215077 -209022 -67999 122239 -352001 124720 -92981
9976 -228282 -82181 -38141 -116901 155209 -269603 66197 -249695 -53694 -166861 94460 110104
9965 110104 -229510 176750 19464 -76051 48453 -240099 -181391 -348711 168605 -322226
9954 62247 -55880 54108 -228904 -60366 45525 -220399 10175 -102180 3218 42183 -6722 88830
9941 74391 -65241 -80050 92897 215020 -84116 -189876 157046 47084 -16516 12574 70300
9930 70300 -1801 -100872 -69088 59385 -11767 -318081 -176700 113757 98710 -6472 28728 -289797
9917 87104 -198583 -177499 -219617 -146003 -279208 99055 -15060 39808 -154917 -93565 -119564
9906 -119564 112952 170650 -78144 -303433 73799 90978 17589 11212 -307138 -288997 149394
9894 -175755 49386 220539 -148923 -166282 -205582 -132300 -547641 -44145 -132622 -78561 112264
9882 50949 -75722 131419 -346776 55120 176035 25945 -302079 -307510 -133605 -82445 -48248
9871 -48248 -54669 58046 -206487 -112229 -138785 -96693 -30847 -266459 -145028 -400026 88871
9859 148978 27856 -74928 -240027 -15301 286491 -154705 -144326 -82272 -66688 -166857 52306
9847 -151879 -39336 -103429 -198208 69001 -107573 -209145 336082 -126450 128859 -469151
9836 -335821 -151522 -214827 -41732 127336 -62997 -131084 -92974 -251144 10716 183662 -51562
9824 -165405 178762 178099 269277 -52116 -139626 -266006 8717 -35064 217770 -101145 82307
9812 -155613 172464 -251554 60869 -359719 48035 -312 162350 -14134 -184563 -473098 -45703
9800 12991 -180696 225026 -174841 -183347 -195043 -262104 -102806 -100790 -269424 -118878 -82303
9789 -82303 -321609 41540 -30276 320355 -472063 3933 -223422 97681 142809 140754 -187006
9777 -240649 433003 -144092 220551 -40990 -60455 -69544 -91243 84343 106106 -92063 -82629
9766 -82629 63513 113731 -133401 50750 -116698 -31075 -15315 -65581 -39681 -15806 -122398
9755 -122398 18904 -202209 -144915 31833 -219147 -203772 -71955 -83175 -5180 -282958 -112595
9743 125499 163355 -220662 -108669 -164250 -85788 -26937 58072 -209648 -59987 -350541 -91961
9731 106176 76857 5671 29665 76728 -259842 -281513 -157165 -230455 -318649 -87684 42378
9719 5478 -60858 -246283 -198797 -96007 -29825 -87304 -182553 -17680 -136249 -5759 -99381 -144187
9707 -144187 -331215 -107056 -62887 -366539 -64045 26864 -132712 191940 -45117 -201852
9697 -201852 -243744 63372 -56590 -203720 -128382 -143545 27130 -66282 -165393 -170671 -114498 168563
9684 -162736 -37591 378475 -276048 96413 49145 -240362 -167853 -320407 -30012 82562 -228689
9672 -211193 19676 -114351 -238211 86946 -416472 150807 -37165 4802 -196943 -144188 207286
9660 -92223 -246262 -65584 -168126 -321503 -143302 -11266 149499 -76305 40554 -160153 -132235
9649 -132235 72268 -119340 -22871 -87626 -44175 -27345 131663 -405102 99635 168933 158664
9638 158664 -106576 -93017 -69105 31685 -242888 152299 -181582 3805 -76159 -317227 -83058
9626 -151790 259892 -301743 181164 -216578 16208 118732 -82834 11660 115607 -143389
9615 -59907 -55844 247017 -44983 -149419 157991 -23519 -220804 -224667 -405753 296905 25730
9603 65026 216566 -100952 -536809 -159482 -118854 41108 111254 55048 -240179 -90978 -66640
9592 -66640 -255978 68651 -201279 94688 -267866 -69279 -46435 -69494 6247 86035 95236 -260372
9579 64684 5283 -137901 272308 157711 -147889 2074 -71782 35269 106407 -217784 43968
9567 -180536 89127 -180423 21759 286805 301903 -82902 198809 41308 53115 -457918 -196960
9555 -275514 -301158 51768 -262119 -121057 -120731 108812 -41299 -85614 -62700 -72475 -111754 250979
9542 -32544 -73747 -215289 -33233 -34097 117172 93490 163767 -9434 79687 -216156 -269773 113807
9529 58566 -247892 67122 76084 123038 -259269 -138935 -122040 -17770 23088 -31485 131402
9517 -84984 -365368 22526 -378297 -60781 158364 -169141 -23976 -294326 -276471 -287394 -333871
9506 -333871 227658 161025 -350952 -281937 -389197 86748 -79525 -82313 -165232 -120034 102191
9494 -18253 13631 -42062 64433 147965 -34691 24583 -164543 180602 -239366 -158387 -43752
9482 -108554 28155 -129734 -172062 -75357 -434444 -34479 -159454 -503558 136838 -137960
9471 -370803 -35846 -188860 60124 -43894 -400814 169597 -124917 108168 -352307 98789
9460 -228678 -361153 211282 -36112 -204709 145353 -62492 129587 265899 74417 -155295
9449 23413 -77312 205413 7385 -14894 149368 -259701 -267886 171238 -184168 -104912 214384
9437 43967 292652 -258407 -119892 -232715 -394767 -150107 -233461 -144765 -172326 -50841 -29765
9426 -29765 -441003 103669 -178320 -101516 -223393 -183551 21485 -84376 250425 48945 10240
9414 -126456 -302319 -316938 -84152 135657 -246411 309708 2445 -106009 -74997 -224257 -132307
9403 -132307 -20589 -509267 -106398 213863 147288 32489 52401 298804 -104565 -45169 145081
9391 -71494 8255 -105234 117596 120014 -52171 21562 -12701 22911 -192250 -200711 5173 96977
9379 96977 -286323 95192 177364 -23952 235153 91800 -121823 -35092 -259685 -333106 -148972
9367 89289 177729 -123841 -211887 -32580 -361928 144390 137141 45247 -302560 149056 -133903
9355 90881 360298 142384 -3345 -7590 -343168 40261 191760 -321269 72644 -51910 27192
9343 87198 144505 -9818 -331421 -72806 91864 88493 20482 -314886 -197042 26447 -76529 -310305
9331 -310305 -97934 -176008 -74661 82448 -445614 -260776 -155014 -222750 -13657 15610 -362263
9319 5594 145846 -6857 -305752 4274 -92104 -209974 -1119 -203066 213946 -113219 135043
9307 -33532 108643 -400040 112605 -136665 9463 84562 -204772 -104326 -72581 -116260 -176303
9296 -176303 -318351 17446 -331910 -251304 9621 -462072 -36134 56139 -217306 38665 -158798
9284 -91078 -607 102169 314470 -32864 130507 -250971 -163221 -249087 -156602 -13025 -107391
9273 -107391 -31197 -170099 20249 249470 -187176 -114045 -339425 -228527 206085 -325105
9262 -179218 -345507 109357 58005 204429 103523 21859 -77447 67105 270535 -20630 355774
9250 -261619 58219 142950 -6346 -216747 -414897 -149068 50156 -208177 162880 -113782 -206282
9239 -206282 -140790 -311317 -265643 80454 59511 87033 -115313 314056 109274 10308 71470
9228 71470 244042 -30882 -388612 7369 -403281 139785 -82991 128799 -86011 57794 185316
9217 185316 -271561 -412293 -136646 -84704 -146165 30245 51565 2894 -47175 7504 -179834
9205 -89757 198806 26931 26220 -71633 367418 136240 4163 147347 -174709 70505 33616
9193 218036 -58274 -21740 29840 -38123 -64832 -36732 -57983 -323146 222424 -79392 18186
9181 306469 406321 -5659 244969 222026 -234393 -98441 -268382 121742 -238498 -261944 -8288
9169 -234808 -188652 46702 -153357 90103 -159356 -175438 -142555 7049 -67313 -200981 -240838
9158 -240838 -100991 -127737 224075 -32351 160757 -157758 20442 -330282 101737 -71722
9147 4499 337 171816 -143881 -134782 125584 -255788 71522 -239354 -186399 -120968 -81102 -112466
9135 -112466 32690 134411 -73869 -412606 -445670 27626 -32494 -208306 4563 90316 -130527
9123 -304830 -35654 96380 -207287 -52264 -163608 -355978 -160303 -79356 48487 170768 -176969
9111 4581 -30141 33299 -79627 185474 -28357 22256 -336008 -221860 -157516 154254 -291773
9099 65793 19880 29347 23485 200371 -217506 54147 99536 15546 144887 -120083 -129682 100496
9086 -388839 234752 42215 -145257 -155190 -40856 55119 -226540 -334261 -217647 -226801 -143183
9075 -143183 30919 -165621 -131632 147753 456691 287371 -41496 -31446 34157 123467 479384
9064 479384 -137189 2564 -345620 332271 107457 24432 -69044 -20120 -191526 86040 258271
9053 258271 160121 4459 203157 -236571 -276066 -241275 -205178 26953 207633 -188364 -98816
9042 -98816 -95890 240019 91054 227303 57119 -51071 -7341 30735 -58903 223895 -283814
9030 -34837 23133 130616 -191268 -96317 -118380 321069 93666 -406734 -111583 -445648 87969
9018 -157434 142628 -259382 -58423 276246 153310 86222 -102524 257273 -344339 288211
9007 -519218 -217054 79141 106126 284799 106623 -154650 146804 -281402 40015 45960 -134141
8995 42050 -12736 -126988 340284 37582 98552 -134422 92809 128319 -120135 65653 258056
8984 258056 175219 375521 -250263 42984 -179050 43774 140781 192237 83144 101130 4768
8972 -26581 65629 109335 -88957 301617 -131908 -39082 119885 -14824 316308 -69266 136173
8960 311069 -21808 277631 111867 188915 911 229611 295438 -87950 10115 180852 150980
8949 150980 -188830 -109866 64543 176655 151054 269415 154013 105599 -162961 86476 103071
8938 103071 542639 194237 53392 148776 88906 335251 -129280 91965 552047 178420
8927 467770 142528 -13908 407917 575073 302278 817917 356532 632693 308056 509841
8917 509841 507942 915584 762862 398551 343627 998433 616903 934392 726649 1208111
8907 1208111 1409529 1242791 1270374 1179053 851425 834864 636062 609665 213512 301026
8897 301026 221900 185973 290864 25870 -182161 -35600 132639 25995 -73778 202766 79167
8885 356574 -29874 91587 120055 -146814 -19891 -7155 16106 177695 73187 -157196 135637
8873 60026 -125291 -305983 -113303 -213046 -335078 -254631 -9858 102535 -55012 -8632 -418433
8862 -418433 -28146 -95535 155823 -201530 -15917 14842 -149836 -133322 41636 -351318 -184085
8851 -184085 36861 -31880 -211670 -116143 -131332 -347524 -280603 477968 25976 -75167 -13038
8839 93372 68542 105458 -47263 -67350 264313 -168211 -153209 -196322 -24432 185430 45348
8827 -183023 61422 -58712 -222110 -115255 -102897 -21989 -232833 -273760 -84151 -25555 -353588
8816 -353588 -509620 260236 27774 22381 -152236 32969 -213451 -121870 -86949 -221485 81078
8804 -330471 -2963 -25778 49715 -32339 -91893 318368 -175813 408588 -192633 -184021 -28949
8792 -52833 37542 -410466 -34921 -114756 2854 -192360 142610 -50532 186296 -116981 -376544
8781 -376544 -352713 -52290 91002 199610 -385527 -70227 -53399 -6365 60725 125510 -67740
8769 -298613 -173273 -134807 -37331 176886 -66073 -377945 51452 -207411 -65340 -297921 -272707
8758 -272707 -258493 174996 -130738 -287018 -363556 -225168 -81952 350429 14696 171137
8748 171137 216774 509753 -150296 167100 130715 91974 108366 172907 -52882 124462 139001
8737 139001 -164253 -21601 178601 -30823 40569 -88102 -66451 21562 186770 59046 -62631
8725 129421 -144121 -85580 86384 74528 80180 -54285 28389 -245795 -128229 48291 2130
8713 77938 124418 -209661 54946 275765 -86 -58002 -401759 91270 59519 -59059 356401 -98301
8700 181125 100898 -267545 6683 -23386 -80997 -184869 208998 -26745 234474 -303629 -95997
8688 -35224 -64905 33900 -123072 157342 -237680 59277 -314097 -128413 168219 -296912
8677 -95300 -224824 1946 73491 -134784 174242 -181639 123627 -190775 74137 -217175 -19734
8665 40411 102472 -165026 -239794 45908 54922 292822 -412737 175834 -248362 -171310 116077
8653 -298025 -73754 -47805 52299 257280 -68957 410315 134036 -155592 108484 47187 -75617
8641 -70830 -125082 -74316 123640 -261517 -23082 36028 167029 17863 220094 -19223 -84935
8630 -84935 -137188 57293 -184242 -78550 201274 -6208 -17400 -98429 -219516 -168832 -35609
8618 -295799 -385587 -199734 -180761 -94531 -160218 81566 36177 -128333 70209 -16961 206217
8606 -306564 -47495 -126319 -86112 -130645 -282147 -86525 44374 -249251 -227209 -395093 -498275
8595 -498275 -152560 67821 -203577 -101682 24819 96661 -56441 -66884 -130619 91956 -115988
8583 -72532 -26565 -119838 71721 -203515 8331 -78872 -193209 -9581 304564 -142878 85997
8571 21596 79703 -131903 -220836 133995 131919 26073 -138870 -73239 19580 -67297 -279766
8560 -279766 -262819 -212461 -136154 -127043 56539 -88580 -254436 -631 -69571 44313 -93180 -97909
8548 -97909 -418359 -244877 54346 -1627 -123427 110574 -164087 276443 -22761 -160173 63065
8536 21266 -47160 16712 -12801 -387096 157666 -184116 -133208 188573 -71724 -196119 -145084
8525 -145084 136708 -65007 -419988 -46963 246047 -167296 -58408 -10870 -28465 203059 364305
8514 364305 -241737 254577 161283 -144309 -191629 -225127 158052 10301 -5000 -435440 222546
8502 -39550 90180 -24386 -86278 -514858 -229648 195963 272929 241537 -38423 -231540 -254535
8491 -254535 159831 -81799 -55111 -370571 -154441 21968 -2633 -12280 -150265 253448 31900
8479 -36828 72753 -4809 45189 -366068 217576 -142968 -54785 20990 -140965 -72 190222 -190607
8466 -16810 -92417 -136622 -98474 209365 366673 -143743 146132 -221871 -78505 -116085 -18451
8454 -58975 48277 16436 -219688 -45528 -92077 103930 100493 13628 -129266 -16322 -114438
8443 -114438 -12749 -536810 214294 220156 -155228 -48072 -115194 159099 -576312 -163533 9917
8431 -399219 124993 -281383 -1663 133613 -30172 108201 20557 -247272 -196587 -5296 -224183
8420 -224183 -42193 -58755 125364 -294796 -150853 92573 -152072 48257 -187720 -149602 -139884
8409 -139884 -30971 -222005 -241304 -89527 101208 -44954 67295 298652 318 31859 71981
8398 71981 -329095 -170413 -79866 -65914 234404 -96944 -218149 24622 48039 -210104 68284
8386 32964 -223303 241431 96829 -78672 36533 -306314 -53718 -300422 -8861 9692 -7050 -54824
8374 -54824 -53379 -36267 29497 -234831 -120356 7734 -13743 88564 5373 -157875 6902 269781
8362 269781 61290 -137311 27249 -115640 6985 -34592 333300 -89404 -92807 -80856 -331563
8351 -331563 -91435 -32694 -80961 -21740 148273 108941 -265042 -124930 4309 -176066 -413359
8340 -413359 13661 152448 44576 -395403 -31899 -243997 -126371 25623 -61594 -400431 -52419
8328 -99084 -174289 -114907 219754 -202949 -520545 292929 -71154 174532 66866 -65812 -25406
8316 39943 8492 236028 -315197 202944 193107 144092 -100742 -307891 191421 302943 288462
8305 288462 -74031 -11811 156811 137835 98502 68533 -69470 -56738 163472 145910 -187601
8293 -282877 -64196 46905 -209780 23580 -2989 -135962 -130634 -107922 58614 42075 -48804 85283
8280 -185269 -235069 69456 -359926 -114311 -245755 -181104 143378 84055 -2576 8014 -168881
8268 280721 -35247 -103102 -191474 175019 443735 284867 166290 104254 -135001 76400 -157826
8256 33829 -329475 -7129 -61466 17388 -26658 46022 40109 86197 -80285 57398 17024 80814
8244 80814 -139771 35130 171588 57763 -201589 -193737 160681 -197674 -260387 -364196 144327
8232 266508 21232 74901 -92545 151 -264957 -269645 106220 -228652 83801 -233408 -135996
8221 -135996 -477482 118409 793 -96092 -61711 -134397 144278 5819 -265170 -2526 -59508 -205263
8209 -205263 -129769 178424 -2546 140512 45212 68797 87578 -90529 -115191 5897 210568
8198 210568 -9483 -321028 12638 12410 -183536 -256374 -1920 -256243 179922 -186812 -28242
8186 -301312 -223809 259470 -434477 -19114 350 -85143 -115351 -225053 241922 -12309 45525
8174 -46359 146172 -91723 -281931 113826 -5646 -20737 -153796 75820 -61415 -29540 260272
8162 99976 -112812 187772 -113747 240318 40432 -277136 227946 12688 193641 129016
8152 129016 12738 -19522 -212927 -113528 -297061 -67674 -61739 40530 -107698 4654 -247685
8140 -47615 -117494 -553668 -61204 -244839 -92873 -164540 -190710 60811 236095 55876 -271204
8128 -200642 10564 -77395 -41960 -91421 170623 -233771 -58217 45715 -270697 -336670 40809
8116 240471 248458 51723 61047 -28610 -356593 19451 -106778 -147946 47595 -195809 -5349 -516576
8104 -516576 75432 -48073 183359 -161927 39924 -261117 113631 -86072 -20954 -344684 -87376
8092 -111342 -335292 -508700 -26460 -48925 144545 -186924 -107889 176744 -157695 41312
8081 131947 -230598 110740 -248842 -24841 -193877 144401 -122148 -114346 133485 -104974
8070 -167225 -206619 -90959 23268 7858 147087 12355 -51138 23370 -135467 101824 188679
8059 188679 -75704 -113755 -15459 -198347 32872 185852 -269479 -191620 219017 142095 -82746
8047 -157885 -237842 -30046 -135251 -48390 -6206 208389 251711 35445 122165 -192115 72618
8035 184020 -160417 -371756 -45113 5145 51827 122801 -85356 356631 -91604 -105265 299292
8023 40094 102046 -61792 -262979 230551 -124102 31810 76085 -1 -319583 391243 4749 -152089
8010 -128741 -374744 41917 -223096 177755 163976 270687 66945 41447 70325 71316 191751
7999 191751 -71120 -4920 -70607 -296782 45990 150712 -237456 -8569 -108705 120989 -60615
7987 282408 259807 259419 -62380 -43706 -424706 -225574 -56340 -30144 211636 156588 -197362
7975 136331 -28562 -127192 -357984 -90526 216732 39840 -7666 188046 -208000 19159 44953
7964 44953 -256787 -25778 13424 38632 -290070 -148013 -93874 32234 97223 -194952 -25593
7952 -81434 -116133 -61812 -160278 -293744 -252830 -62810 -86991 269270 -70040 242997 -19118
7940 -87348 -37336 -74533 -25982 -66717 -142294 -269413 302367 171346 119528 -201442 -314962
7929 -314962 -258835 -108670 -20883 91355 -221927 71763 -48898 -1522 167871 -113376 -184539
7918 -184539 -43798 19967 112674 246674 -264308 -42098 186583 -93550 45487 -78404 65668
7906 -84276 245492 -174 34171 125158 19788 124345 52595 82648 -21819 -168181 -102696 -253853
7894 -253853 99401 147870 48642 -141312 345186 -61190 -90238 30766 -214634 16206 -124335
7882 -239615 -128742 -128679 -107198 74467 107567 -142274 179492 -24677 350303 177055 -267962
7870 -196218 166716 -60990 -196109 -195289 -267874 -232812 57201 -214734 -37467 305658 132940
7858 47798 120948 -184422 -66429 -6054 -272412 139091 -44322 -93158 139968 28766 -157471
7846 -233608 -432138 7393 4936 -293019 -174058 293268 159527 -215792 21733 -198161 197446
7834 88011 2383 -216939 -131024 119304 -83431 -107959 -291801 -94047 261437 -55139 73329
7822 -208088 -158036 -370793 -438539 49216 112925 175661 116310 -227105 -204342 -25350 -57098
7811 -57098 82457 -4163 -293441 -168768 -177310 165823 -150731 -87151 -35865 -32128 -240077
7800 -240077 -208314 -242890 -66473 150444 -100722 343373 27561 7188 -214358 -55934 -54460
7789 -54460 -553392 269615 -102833 -139573 344214 -368220 -302152 -19859 152871 69211 45386
7778 45386 -91178 -196556 -59301 -178462 -73704 205844 150479 -70828 -165381 -279210 171942
7766 -4591 -287401 121864 -110957 173629 -23752 -372982 73379 -60094 -164385 -209610 -196610
7755 -196610 12193 -2580 -157331 254594 -159567 182019 17370 229757 -220981 -173622 -290589
7744 -290589 29611 15114 59048 -116344 212272 -36223 77894 -92315 -65732 -81217 -60007
7733 -60007 -409750 128763 -152512 -197577 12444 -38505 -70661 39604 -440629 16975 -7088
7721 -242580 156770 -259949 -115267 92988 -169627 -3117 -82195 -205494 104121 54712 193709
7710 193709 -111651 31545 234526 -338888 -134948 -71814 257558 225053 -393549 -50413
7699 -46545 -338004 -4233 102500 119405 -25516 135047 -114779 -188033 -2905 -29620 -199748
7688 -199748 310464 -14033 79371 43919 98147 -263781 -88915 172435 137141 -2701 -296047
7677 -296047 -27348 -46388 -236454 70492 66074 97139 -154237 60920 50479 -385680 931 -58842
7664 -212451 -64131 -3051 -39220 161393 160909 27043 -9608 -11357 -167433 10943 255825 -87162
7651 57862 257256 7947 -141759 21861 -95376 27412 254630 -82120 43523 176983 -299271
7639 -7060 201959 -156519 -204485 -58963 -215779 -96186 54902 -22974 -110661 -174982 -96542
7628 -96542 -271790 -42420 -165663 141862 -92116 -80231 -156257 151200 314127 57873 -79735
7616 -222256 163066 -64762 -123906 -247166 166896 -188167 -80032 -153626 -58067 -47405 -34471
7605 -34471 192553 139262 -104589 -145209 -2591 -285856 -9586 -234832 41491 40504 440707 233196
7593 233196 -341366 -74985 207706 -102398 -72486 168143 -320854 58568 76583 -140142
7582 44200 10682 -131846 -147908 331492 -45863 36623 149179 29000 -33305 29712 131962
7571 131962 125276 371621 -232306 25302 -14419 12435 -108547 -171648 -23753 26205 144786
7560 144786 -118434 172873 -180719 -206053 -336627 117073 -51646 -292821 -130414 -451579
7550 -451579 -399254 181854 14264 -94176 -26874 -16035 -156508 -360423 -66354 193057 329417
7539 329417 137387 144275 -83116 -17699 -394714 56768 82377 154532 -327473 219386 306523
7528 306523 -252479 -42960 -162793 -111488 -244197 -169934 104592 -266390 99841 -157667
7517 211871 -575958 -29112 93311 -310818 182922 -350193 109307 -32054 -337089 2540 48776
7506 48776 42139 -95330 -7386 -315457 97339 228614 -236907 -26510 -45106 -297761 -28336
7494 191409 -24853 307339 106730 29025 -522079 -63100 132738 -210956 -58331 26984 73517
7483 73517 -83281 -117949 145984 365945 26378 -26275 -56060 -196823 178702 202355 -90657
7471 -35544 90707 -94141 -181656 -16496 -343054 -26419 204331 -183126 -21544 -170724 64509
7459 -181995 -55358 231011 -395010 43055 -523137 -403983 -11 -87394 -52626 -75685 294957
7447 -69152 259440 -74105 -108723 -254372 -62770 125715 -51516 -103920 -214142 -254822 4885
7435 28359 36854 -163783 -242200 -3507 -67450 -333374 -8328 -266083 170904 214040 63254 76924
7423 76924 -58743 249543 -154340 -6403 -24230 -201387 113194 51201 -97791 73573 21823
7411 162153 -113236 249080 110276 -127879 174045 -98966 125352 -242302 -16857 -84509
7401 -84509 87766 -202956 -42805 -59644 69457 221800 -89765 242086 74007 -272569 72124
7389 134697 -415054 -61384 -784 -1133 -177698 -150981 -102736 346003 229663 -445969 45010
7377 69505 194622 416659 -78117 -78635 -118701 304289 -49054 -355181 62516 64287 -17614 -185669
7365 -185669 97657 188126 17590 53722 185369 -70003 -6952 -250776 -61090 159083 -33334
7353 283782 157195 87720 126483 116158 18710 -100038 -133408 -58839 -306380 -164168 -89453
7342 -89453 -22072 -256192 -92743 266783 -230324 -216989 190861 25699 160941 -3511 196477
7330 682185 -141861 130331 -239982 81800 135443 -332376 10936 -79473 -76187 -23943 68569
7318 -22991 -40286 -2275 198428 119732 135316 7962 -53340 -85241 41936 -127050 -9108 -27404
7306 -27404 -67931 -66732 -3933 -74199 176401 -272743 -418411 131886 -164583 -485946 117124
7294 129804 67144 -188028 -119673 -188996 26198 100181 -126513 -90172 -308956 -18995 -482022
7283 -482022 -175888 -366750 -171321 120320 -106272 53237 -67018 -179021 91238 264194
7273 264194 150371 -279817 -115400 341198 149237 103933 9117 -163438 -70082 -38105 25717
7261 -311681 -201662 -101245 -39103 68373 -35684 6913 -64384 5664 -250455 -87632 -10145
7249 101267 -106697 -67527 92303 115967 -249980 92712 10911 -43775 192316 -66286 -250752
7238 -250752 -122053 -93529 -131281 253027 -245527 -83612 -251943 -41618 36129 183499 -19079
7226 40576 -297392 66611 -93833 -105421 -150311 -115459 38217 -218674 -55830 130142 4691
7214 -160247 -186388 -69757 -3260 -8632 -498061 233278 173809 277778 122161 114905 -171787
7202 211963 -10261 -73574 40528 -89201 -65009 -15520 -5769 190665 41128 2530 -104848 127816
7189 158215 -162508 97318 -361796 206033 165731 176485 -133419 -113375 177040 -25081 -73059
7178 -73059 196409 276651 -26247 -271695 -251314 103606 -28666 -164803 74584 -150590 138591
7166 -16450 242395 329679 109826 120026 14362 -102436 34552 174410 265658 96455 39214
7154 -32757 37593 93158 -90728 43098 -21654 -33508 -186608 -13188 -286811 -98882 161307
7142 154835 -192066 -92297 -70100 -139733 234540 -97497 -168357 83306 -8022 -362430 -188082
7131 -188082 -142564 -80637 -4528 -310852 -193606 -150842 -17432 125538 324557 -200395 -265894
7120 -265894 5127 -324128 289250 -183314 86281 -306310 -136456 -163444 -95068 114986 297662
7109 297662 -514973 -56533 28676 27993 -57684 269958 31943 98079 -5685 -88008 -29397 71474
7096 -132181 -9773 -179563 -94827 -216433 -274168 73131 65858 -70835 12970 -231699 -127197
7085 -127197 -67507 -55293 329492 39307 -70754 144519 22404 -42918 -28054 203462 -244483
7073 132055 11564 5808 93671 -38292 -173740 -107461 -14806 -121525 -62326 177095 -21621
7061 -217918 1923 42966 186877 -429489 -160599 297106 -18862 -32475 -286856 -65748 134399
7049 122473 -55167 -74995 4867 121415 42157 281079 -5392 -38768 34663 263744 27483
7037 -198618 -359021 2279 -213156 -184296 76708 147706 35943 119710 185464 -86755 -150955
7026 -150955 -138345 -29173 22403 114022 210067 93073 21248 -150758 286003 351826 -148303
7014 202490 -106969 -126234 -133446 -226895 27956 136901 37901 -257651 -129884 -136867 -65065
7002 44358 -249378 -145190 123423 22103 -128661 104982 67477 -219176 -72412 113414
6991 93443 133368 -53461 35309 -64816 4421 -78567 -33998 -135190 -219439 161641 -223905
6979 -317719 -137388 166158 149316 46131 -165033 -67811 147080 169472 171757 91517 27420
6967 -303589 81606 121672 -37287 -44641 -143800 -190601 180174 -69908 -209900 -414923 134041
6955 121586 237966 108152 172681 -103295 -67861 3228 -77641 23339 134138 -265951 -99579
6943 103955 -28026 -229458 100509 -145501 -231206 -146881 84147 -15932 193218 232802 102103
6931 130875 -190392 -59123 47887 -103679 203426 -166096 -343714 27688 222751 -208905
6920 -176962 206733 -160065 -220874 56825 -168932 24843 319467 181295 -96187 -190436 118947
6908 160953 -33433 -88162 -188529 -126775 22829 -232576 296131 -170187 -205454 -112185 90874
6896 -54319 145602 175154 21627 24571 88315 -27376 -257569 242627 38644 -161010 160484
6884 -205664 -57338 -385379 14397 -29867 56829 105902 83223 104244 -47528 18674 136452
6873 136452 -200699 94172 -257501 -160652 -131010 -32817 -508805 -94435 -86530 215885 -50558
6861 -200384 -101074 146383 -93861 224791 -197627 11054 71427 86977 -163036 122618 -477667
6849 -72468 -70558 156429 203623 188808 -195721 -46006 -159866 -73006 -260030 -205171 -328067
6838 -328067 126369 86989 -320168 -106758 177114 80877 -85519 327795 130654 -17032
6827 119034 -285802 192434 -154625 42262 18375 122314 -99066 -40483 -107076 140934 62070
6815 -304089 77284 -8724 -153484 -75846 -41422 -3392 126419 -322059 -73573 134820 195175
6804 195175 -136879 58292 -16339 -2121 21696 -188091 161936 114148 -58451 175579 -390607
6792 167474 100340 -182679 75403 -45404 95013 44817 79491 -85777 104765 -49036 -136171
6781 -136171 -251910 -164234 -84689 -102300 98569 63239 -252511 -20327 -465766 -187343 87591
6769 -126891 27719 108290 -87132 -191366 -223035 -87458 -27067 35996 9083 -27282 -285719
6758 -285719 -168471 167283 -95035 316886 -219369 -122100 -122480 135410 116614 -223626 -382584
6747 -382584 -41966 -114752 -115121 -27610 18441 -38234 -204201 86910 -24593 -188394 -249528 -234387
6735 -234387 -27663 135657 35901 -35867 77897 -85880 -172089 -226087 -22649 187034 75621
6723 144104 -293703 2371 111298 -211035 -41609 65814 120174 210623 -62826 -338652 69559
6711 16714 14254 86567 -70790 128717 -223318 -19374 244945 205428 283881 242052 97531
6699 190820 -233411 -124289 -18186 -162955 246993 -74382 -385370 29765 93020 -5728 233538
6687 20293 -25407 38623 -89197 8940 -125969 196470 75381 339787 -511221 93474 -161586
6675 44751 280994 -224360 -314388 -33118 -232411 250353 80218 -64956 -108147 -126760 -138234
6664 -138234 43012 -21640 178561 -13167 71503 256788 -8074 53634 -33377 -87458 97723
6652 -26340 111462 276014 -74684 103576 22431 -55288 171287 -59892 147790 -127584 187709
6640 -147808 75842 -397755 -299757 73483 -175190 -99742 -24530 -125519 -94358 -149212 170435
6628 -116064 150833 -227073 66390 -43558 -131903 -37738 -159553 68055 -154945 -165196 52377
6616 4295 -242908 -46189 -88380 -25376 -232749 171243 89759 -76688 140892 140183 177221 196604
6604 196604 79074 206068 -32771 61726 44627 -124168 -146725 -125813 252091 -131219 148855
6592 -372 -378649 -286631 -222033 -66796 115140 288383 -280138 -90378 229858 -399622 -262126
6581 -262126 -10568 340441 -176746 -99175 -175475 -299957 -23161 -28780 -23066 19039 -285676
6569 -144432 -153350 74166 -86555 24355 248932 -79328 -401333 189104 188499 -132817 -24553
6557 -135397 -392064 -112009 151879 -136082 22938 -12201 -35874 97115 33977 -134491 -151169
6546 -151169 -41966 132402 -152803 -103702 24108 106177 -25109 86355 -79731 68354 -281285
6534 27364 128221 -58906 -116245 40310 16134 -188265 219948 141593 313163 412100 48899
6522 277730 51185 122199 -253414 -92301 17131 59701 5438 32544 -76395 -110566 -234875
6511 -234875 148344 11289 270238 208261 -133881 -39990 -62252 122229 154571 261411 -121208
6499 28566 31379 -240862 24240 29547 113661 -133021 56585 -69421 132674 143199 197477 -15423
6486 8762 -195864 -49503 -76129 24804 -321143 -20580 -239372 115062 -2322 -212974 87929
6474 249598 26738 -252898 58207 223873 215069 -279463 -17373 139129 -145760 107430 -240363
6462 -248166 12973 -291436 179851 -332832 36610 67113 27837 25107 -163082 219994 -157480
6450 -30448 12087 60821 32932 -371639 93725 71080 403357 -130067 31527 -58911 -213873
6439 -213873 -207374 -287700 -110321 -216023 -41002 75489 -235920 -152367 -207044 300866 -56593
6427 -85327 267495 -116733 49395 -202365 -217526 -145794 93840 -71648 -12219 -270144 -2231
6415 -142406 193107 -165557 -143957 -19531 161725 2008 -139851 -147937 34134 -178534 -132774
6404 -132774 -316987 -200265 342141 90047 -274707 250914 20508 210894 23743 -165051
6393 -141561 48812 -26915 -5064 249620 -133918 -33392 -16743 -125997 -268851 -27173 146073
6381 -265875 13043 175856 3172 153327 165379 4873 -11891 -217708 358371 -19378 -71345
6370 -71345 -8037 -85250 -202403 106199 -51828 273625 169663 -2760 -423418 -142602 -231990
6359 -231990 -57445 -268866 76640 83337 -33281 159241 -184646 -65530 -321716 80933 48042
6348 48042 203335 172581 367514 -413252 -74716 -20858 -302511 -61364 -311843 -254060 -36455
6336 216201 19815 -198254 -173268 -119195 -175590 -66719 -272604 139516 -216236 -173164 118435
6324 -51387 -51516 -12685 100281 -150733 268874 -57899 16384 54420 247198 -168537 4151
6312 -37651 72165 -226332 -277526 26822 59359 -7084 -111782 128856 58963 150532 361730
6301 361730 243641 -100149 47499 86951 120072 -260682 104093 -80991 30393 -32680 263966
6289 -257396 -138762 137155 -178653 264459 -20343 32853 -239725 -238511 -83377 -5999 -72193
6278 -72193 -2709 38669 245353 187746 116526 270689 -144468 14256 -134321 -27473 56556
6266 -3465 -125870 221456 -11293 83351 347943 19857 -189660 205832 -14233 -187478 270051
6254 35740 128610 -182813 -161310 -56635 441909 -204131 -201167 78169 -374292 -309460 -28840
6242 -72386 33714 -372103 -316918 -192884 46752 -90242 -238240 -290404 203010 -275497 260999
6230 -181167 104212 114105 -339802 -28451 -176015 328364 139701 -141231 -82199 -91318 -226935
6219 -226935 233200 -106817 138203 -175518 406777 159692 15325 -186179 -163048 364141
6208 15347 -140852 312871 -216954 357 297215 2004 -81773 -77677 29019 378747 -36709 9766
6195 105114 -89915 -534318 -146097 -95159 301928 145706 112641 -68693 -56083 -150655 -107410
6184 -107410 174556 98582 6872 -71097 186479 -58043 -63493 2229 -277341 116851 46004
6172 77270 -34710 56624 166062 -137703 -46822 259313 2415 210158 -13814 -254193 -53021
6160 -108663 333894 -232909 95869 -4231 -121790 140664 90670 139327 121445 60607 19345
6148 -75553 -311872 -239263 184154 -94931 -35482 -267627 252496 312957 143075 -210165 -8932
6136 -252503 -333447 -147929 13209 44508 20308 43860 -27229 -146402 -47733 31934 153174
6125 153174 -39789 6648 153388 125638 172055 202862 -192385 -88180 -149215 -19391 -112633
6114 -112633 57375 -50054 87355 100301 -183765 -44844 61565 14477 -70933 270061 -18215
6102 25738 -341471 -143108 -197032 -83170 143386 -131015 15431 -13141 49484 -186923 -171971
6091 -171971 -98294 -9942 -60768 192699 406432 79248 131592 99514 343510 135082 -31447
6079 -19500 -121337 -199741 164414 536489 -3390 161354 147892 310229 252655 -490721 -105991
6067 -72915 -131377 -323034 49987 -65636 82309 261624 100952 177964 223922 7328 -23699
6055 -64337 19004 -174334 -368974 53 -192130 321630 -236198 -124633 526308 73437 130794
6044 130794 110510 77859 -218986 21502 48952 -19298 319411 -143306 138921 -97286 -309345
6033 -309345 -267013 -357052 244338 179433 -82101 -204009 -82586 -112961 29460 -149007 -51299
6021 331813 -36687 -121518 185830 -15394 59867 -222808 150020 -89426 -248681 -33446 136422
6009 175722 2466 -243120 -64387 -27020 -66488 -31776 -269605 57149 -263376 -90124 33171
5997 -71943 257553 -453825 62260 2557 -25417 39100 90681 -70106 139257 -2835 -283416
5986 -283416 136385 305419 -136136 -40752 122708 48711 22964 230257 -811 65053 -140549
5974 28314 187216 3473 26962 115292 140451 -73039 -28801 -320061 -110894 11016 146842
5963 146842 65 127104 -178856 -164803 -199857 -432353 -252436 -104124 -293881 -211544 10988
5951 -277225 23879 20846 -185982 -180483 47698 -194027 107490 -20839 125960 -74249 10305
5939 257378 -12675 -34219 -11291 231067 346052 34893 -129012 34173 -100845 -207711 -107188
5928 -107188 25702 -115056 -60785 94088 32131 -140122 -225250 24041 -67365 16068 10767
5917 10767 124565 180754 133057 -294945 -8428 9842 137568 -114520 -259620 -200949 -98245
5905 52114 212836 83641 106368 150259 10324 33682 103372 225197 -284540 -174264 182050
5893 -79426 -6013 50483 77483 -54963 -206191 -67325 58822 -87392 140466 71569 73413 -207139
5880 44479 104775 276917 -32582 277509 157581 -79754 94912 -265968 61458 -267684 96987
5868 -319783 -16451 30359 114900 -60111 -83928 -255781 381856 -201164 -125943 -251086 -66866
5856 52966 242201 -125423 -9868 -240126 -35949 -21942 -6798 182684 -377259 -96472 357841
5844 193264 -248682 121498 -23742 -226148 -18476 385126 -407935 168595 126403 -128217
5833 -163183 -110312 -154586 152030 -4639 46262 -75805 92073 173136 288928 7846 18526 -324764
5820 191449 15226 93915 -45771 428517 -137161 36584 198049 -42883 -57563 -110531 -168517
5809 -168517 893 -170877 -141599 -65512 -18831 -336219 -180091 -22064 58013 29518 263790
5798 263790 66974 57961 7156 186522 -57406 -271168 103495 319243 109117 160387 -21743
5786 5100 275200 -156622 65388 43221 59374 115734 492046 273525 -46681 -45511 319271
5774 86644 45501 -48668 -51239 87514 -164312 -38208 158168 -53561 -37261 -92449 -513571
5763 -513571 -321857 -73310 351367 -54159 -47200 337991 182854 -76281 115605 9186 -98893
5751 -72340 -286644 -88258 293761 -58340 67505 -58756 -10136 -51765 -140652 -196021 -121400
5740 -121400 112907 -425603 163145 -6977 -83280 94597 128924 137983 146479 -249885 208234
5728 -246775 -225655 198916 -97006 86446 -47781 -230243 152472 65924 104332 297581 358012
5717 358012 -224468 390381 233629 -219909 244978 -87782 -136369 -759 271283 377961 85047
5705 -70530 109610 -9699 -150646 91404 -207104 263080 -6590 -127686 47446 36726 175286
5694 175286 -130218 165183 -76898 -94861 -131016 -159532 -38754 -73249 101181 -352894 23082
5682 -7239 -25266 -80625 -176064 -143431 90450 -112807 98603 3287 -110511 186410 120260 41159
5669 116516 -102100 143777 -372624 263219 81484 76192 -146071 170074 -61637 188589
5658 111056 -28489 -7269 -123077 113789 -77548 -7370 -31727 -81919 -258536 217504 -349221
5646 71440 290706 -207318 -203483 -129618 -160931 -58831 -97933 -147584 80377 161116 46301 -166153
5633 -356341 34180 288913 258496 66768 -46137 263230 103290 -112121 -121633 14249 17984
5622 17984 -156125 29521 220083 -208751 40435 117245 512242 198328 -29778 -66071 191640
5610 48100 -307661 32978 -71368 -69149 123844 75800 68470 -138264 3008 45719 45721 39721 -41156
5596 54609 55386 244117 53130 -182281 264938 -317006 -47290 -11308 -19695 -145767 -76705
5585 -76705 -159443 -114703 -124451 -229790 150670 -20303 94555 135175 52868 -317625 296484
5573 -98797 203396 -84867 110181 64530 -25736 -303154 -16314 -42310 237977 139434 37609
5561 56659 17409 99296 -37176 -88973 -110237 31450 -227042 -114320 -107648 -58629 -244621
5550 -244621 -199158 -41907 41837 242071 -99338 94064 62239 13461 152591 218790 30101
5538 128640 9741 48122 229740 75376 -24384 146927 -68266 97246 16991 -74076 -154207
5527 -154207 168582 -141217 -314817 -68260 -40462 206421 93336 -134507 -119814 -103026 -138141
5516 -138141 -88831 -266712 -237315 -148609 -139002 4157 238150 -71766 228930 126566 -181002
5504 -70828 -72471 244885 270865 -128865 -91814 -149216 -6678 19383 -162842 222787 68495
5492 -72853 20959 -76394 84981 -65295 -284291 9628 4879 -157265 41831 -146191 12666 -249768
5479 -223157 -342295 310869 65086 -2367 77738 -115832 357280 -6290 246429 -24925 233745
5467 -119956 112076 -19258 102692 75411 -54134 -3026 -17267 42190 155049 -466022 -225307
5455 -32114 103512 2340 200298 -208079 -98522 -230086 -48761 -148340 366326 110149 -21342
5443 111361 -57864 -53373 19535 -105967 -31821 -204441 78324 -71036 -8412 106164 18344
5431 183491 387962 -70899 -243242 -7282 -105302 13092 -793 -95382 -44188 21859 28524 -313378
5418 -139485 31669 -280848 235262 133882 -68657 17826 94078 289304 -100275 -275927
5408 -275927 419687 6302 -180831 -197662 74646 -47969 -111204 -62609 90174 141006 51783
5396 308899 -135016 49299 183987 55558 165704 -139270 -163885 -364523 166489 171821 -123013
5384 -130637 121558 73795 -90870 -101903 -34536 -247355 99699 -118168 -55467 -71775 63623
5372 94682 235930 52816 359979 -169097 -298674 278753 44807 -179856 -210209 -37217 -198996
5361 -198996 14498 71441 43344 -260968 -271362 -30171 505925 63388 -211217 -170194 -80729
5349 -96858 25300 174837 -97895 101633 147720 157644 171136 -143455 179570 -165091 18549
5337 96420 -180554 -225557 -53321 355848 224568 10047 350265 -46295 12491 371310 136058
5325 234689 21789 445991 383725 -22680 -32842 100950 135914 216280 -27485 -380139 -93177
5313 269083 -41093 -11050 -103303 -125918 122666 210788 -205191 92702 -319873 -336565 -67884
5301 -64718 -156973 -263329 -58921 175936 157125 -175366 44416 -259901 431280 -67046 131036
5289 -152964 234140 98673 207132 9032 65825 117974 -113666 205685 -308923 206041 117295
5278 117295 -261482 -180304 326659 108505 -272147 -413792 -357051 -323076 190968 -255602
5267 -233606 -34521 -186791 97711 -24138 -54424 -204292 -193923 162217 2519 118585 8054
5255 103713 322798 -69685 -150856 50813 55240 180013 193106 -276897 86441 -145378 -70731
5243 56196 119114 -18099 -117108 182752 -145619 263128 -69751 -39470 74969 9182 5489 270263
5231 270263 -106932 315161 -68420 204455 -46919 -91321 -63527 -17451 -115238 148371 11385
5219 -130107 -19446 -215664 -156606 -58439 -3291 -220687 -285542 -78904 48315 36856 22816
5208 22816 -140360 -136120 7243 148191 106246 -59520 40799 -43617 -13742 82327 -207711 32966
5195 257552 -14827 110398 71391 180567 436968 -232502 -138948 -116961 216768 -189602
5184 31950 -194054 88328 -75093 343978 -217873 87984 210789 -264519 -369006 111555
5173 -163345 -53462 -261018 158120 228769 -15043 -86859 -112454 409368 166162 143728 -203660
5161 -202996 -42426 -185806 89291 19166 -25736 -340937 142662 181216 25989 85124 -85755
5149 78835 -61748 -84479 243573 -57560 124247 94725 -84330 -192114 -13181 107485 -11411
5137 369534 53775 37624 48017 111403 -219545 185748 236963 28684 148235 6877 176197
5126 176197 189449 -87238 -87109 -188539 -183409 368904 145630 95769 25592 311205 289187
5115 289187 171554 528550 128679 129781 438615 180429 249195 105545 83270 -172164
5104 45700 -224763 160434 299076 -27939 45857 354819 399516 -69225 -118623 -71835 -58407
5093 -58407 175703 -117754 361547 198098 242223 -73685 16738 112242 -166468 199935 -90666
5081 -230570 -201864 1826 73650 96245 -57886 205426 -62197 159369 138263 -92541 36773
5069 206706 -110107 353551 -108743 -75726 -75852 155546 59028 26549 179739 161405 -11180
5057 -124903 -250621 -131925 160202 -189864 10634 -169996 -189160 -73494 75814 175254 25144
5045 37268 198308 -204590 -177096 12802 -4242 -78234 499611 109440 245791 -81732 -245060
5034 -245060 103420 -165545 -45894 22278 -41397 -100271 -189761 -148147 -14045 -13640 -120625
5023 -120625 23173 -32989 -72495 -281762 -290204 -54903 -15568 270825 -85109 -265736 -345741
5012 -345741 -20791 195181 88492 74126 52341 -19758 -179239 -162183 83175 -106986 -63715
5001 -63715 -91072 -58387 -114943 -202806 169450 73661 12654 -252909 17552 210459 -212202
4989 128757 107860 -120691 459484 104602 -158030 -6303 35463 -50501 405649 150548 73837
4977 226858 14475 -237674 -91239 15867 33637 -7089 165985 -144756 -97426 15136 -248233
4965 111444 -160582 -5999 9884 19464 -57899 -168077 286605 29143 -32320 -315419 41506
4953 64850 -42518 -20481 -207326 -119179 23778 -76340 9331 10841 -248785 155462 230327 -60018
4940 -186257 -345812 93276 -200432 133352 41342 -167497 -55374 -10580 34713 149201 165079
4929 165079 10797 29997 141920 17348 201434 123167 83283 -2189 -110861 -121341 -86600
4918 -86600 -143998 -148742 -133561 -2074 -124655 -275455 414464 -18269 68222 -80067 -78482 -86215
4906 -86215 -90574 137870 90815 -194924 -11230 -74034 307870 -222557 -192880 -67149 84706
4894 -64077 76974 77580 170299 -66967 -78858 -77131 91957 126006 -201799 66985 -69386 -122971
4882 -122971 81574 80267 158612 -18719 37946 61031 -70226 41850 -180934 2570 -112704 -228905
4870 -228905 122767 211572 -198903 -64864 -39772 60552 -409448 379617 57814 49838 223882
4859 223882 -11015 71917 45624 69801 -130968 30875 -147143 -14898 34693 50823 -79439
4847 -159333 12738 -169457 -193940 255112 162264 -73118 142960 -6862 31486 -10006 -61262
4836 -61262 -118436 73691 -214584 52082 163121 15913 -239341 -221419 -236464 210140 195784
4825 195784 37940 -64173 37383 15607 -13642 -185733 157385 28048 300852 206488 -30768
4813 -70138 23340 308303 18384 -183013 77198 43549 -343671 308169 39503 -145017 -179859
4802 -179859 -146348 38749 344792 -2610 -107382 121777 26835 -53569 95661 -38779 -122759
4791 -122759 -11893 339258 528317 46854 -20726 199952 4253 2815 -155005 236226 197831
4780 197831 -108672 -16469 134642 241622 -153153 -61041 -16586 61445 31178 10659 -193104
4768 -16891 -26726 -9761 126504 114402 -30344 25350 261190 -356887 143300 438292 -150341
4756 195221 230160 -171789 40367 -360149 274786 178680 -51485 -131744 116267 -168252 -37438
4744 -83838 -162751 180456 228400 100656 211075 153707 -298851 145317 -136169 148518
4733 -153469 -360783 77347 -12024 40291 180091 -192052 157086 266246 188086 197859 -196513
4721 116648 87278 1379 231010 -213762 -157030 -273606 -241742 30953 -237454 131089 175091
4710 175091 -9503 23784 89467 8373 -338757 104727 88083 3209 191135 247220 -112356
4698 81323 112636 344684 7673 -205949 216480 -468398 -214922 183410 163289 38719 -55989
4686 -240522 -288658 280256 148492 -207739 -165626 132567 52699 37269 -135384 363538
4675 59492 39532 -138579 -27736 235209 237176 -65180 -144319 -39997 -13738 -62748 9854 63488
4663 63488 110288 -8465 84919 -245373 -243791 15174 -240845 76996 -30130 85075 36890 396542
4651 396542 -148871 -145289 88276 -26574 115040 27052 -112269 238041 57374 58885 -53586
4639 255517 191095 179827 -48966 233272 94615 53367 21870 -194402 100215 433033 35084
4627 211780 86138 -97963 -116514 6291 393068 -116987 61303 191237 35668 -296876 -41546
4615 -331 -332652 17647 172992 449733 -42753 -63335 -91587 327604 -34373 93132 -93783
4603 122494 110250 176379 184271 40610 34983 -53583 69180 184718 -68054 -37520 215566 -19370
4590 106134 85934 -184765 346827 -280464 -255438 12712 -95627 -301092 3350 -175939 -279978
4579 -279978 -42372 -175805 285704 99716 191049 279526 51445 92277 -96501 -21036 11043
4567 41465 110381 -244819 158999 -90902 -129531 168151 -445744 -6268 267717 -75171 -263412
4556 -263412 12089 -190937 28320 -169445 123010 -12144 42327 -476 59107 -132966 -159581
4545 -159581 -308218 -95647 -89430 -215119 -27733 128360 -64042 177361 124607 -99601 97108
4533 -323472 -196333 -26926 510407 -4018 -138959 -66356 -246870 -274094 103960 49002 81634
4522 81634 -46927 -149730 188941 -16097 -222314 -85731 236287 328180 137253 32160 -63747
4510 199928 104592 163205 -109923 -307726 7204 -59158 189644 160601 92521 4940 -110412
4498 -130547 -13039 52970 99825 156033 -177235 -35952 -205658 -128270 175103 369991 4067
4486 -31697 249054 164816 -301244 -5480 257129 199121 78201 95294 81956 -136293 43398
4474 41984 102455 96189 85790 20705 21746 186121 -86618 65639 335695 -11077 87243 337113
$$ [...]
##END NTUPLES=NMR SPECTRUM
##END=
