
##TITLE=UV1034_TOFR01-ROVE100A_6099638_KXnNaz7PEe
##JCAMPDX= 6.0         $$ Bruker NMR JCAMP-DX V2.0
##DATA TYPE= NMR SPECTRUM
##DATA CLASS= NTUPLES
##ORIGIN= BRUKER
##OWNER= Administrator
$$ 1.72 TOPSPIN		Version 2.1
$$ 2012-05-13 03:01:45.000 -0500  Administrator@TOPSPIN
$$ Compression mode = diff/dup
##.OBSERVE FREQUENCY= 400.13188235
##.OBSERVE NUCLEUS= ^1H
##.ACQUISITION MODE= SIMULTANEOUS (DQD)
##.ACQUISITION SCHEME= undefined
##.AVERAGES= 64
##.DIGITISER RES= 22
##SPECTROMETER/DATA SYSTEM= spect
##.PULSE SEQUENCE= noesygpps1d.comp
##.SOLVENT NAME= COFFEE_meoh
##.SHIFT REFERENCE= INTERNAL, COFFEE_meoh, 1, 14.96676
##AUDIT TRAIL= $$ (NUMBER, WHEN, WHO, WHERE, PROCESS, VERSION, WHAT)
$$ ##TITLE= Audit trail, TOPSPIN		Version 2.1
$$ ##JCAMPDX= 5.01
$$ ##ORIGIN= Bruker BioSpin GmbH
$$ ##OWNER= Administrator
$$ $$ C:\Bruker\TOPSPIN/data/COFFEE/nmr/UV1034_TOFR01-ROVE100A_6099638_KXnNaz7PEe/12/pdata/1/auditp.txt
$$ ##AUDIT TRAIL=  $$ (NUMBER, WHEN, WHO, WHERE, PROCESS, VERSION, WHAT)
(   1,<2012-05-13 03:01:39.656 -0500>,<Administrator>,<TOPSPIN>,<go>,<TOPSPIN 2.1>,
      <created by zg
	started at 2012-05-13 02:50:09.437 -0500,
	POWCHK enabled, PULCHK disabled,
       configuration hash MD5:
       AF F2 23 6B 01 CD 40 DD E5 A1 38 A0 06 EA F7 77
       data hash MD5: 64K
       28 5D A7 A1 00 4E 28 10 6F 75 3F 47 5C 5A 19 09>)
(   2,<2012-05-13 03:01:42.500 -0500>,<Administrator>,<TOPSPIN>,<proc1d>,<TOPSPIN 2.1>,
      <Start of raw data processing
       efp LB = 0.3 FT_mod = 6 PKNL = 1 PHC0 = 0 PHC1 = 0 SI = 128K 
       data hash MD5: 128K
       1F 73 D5 3B 43 3C 28 5A AC AC 99 4E 97 23 78 C6>)
(   3,<2012-05-13 03:01:43.734 -0500>,<Administrator>,<TOPSPIN>,<proc1d>,<TOPSPIN 2.1>,
      <pk PHC0 = 37.97424 PHC1 = 0 
       data hash MD5: 128K
       22 63 99 2B 49 A0 96 3B 99 C7 F6 31 6B 57 CD 29>)
(   4,<2012-05-13 03:01:44.687 -0500>,<Administrator>,<TOPSPIN>,<proc1d>,<TOPSPIN 2.1>,
      <abs ABSG = 1 
       data hash MD5: 128K
       D6 3F 41 05 37 84 11 91 6E CD C0 CC 8B 87 83 F3>)
(   5,<2012-05-13 03:01:44.750 -0500>,<Administrator>,<TOPSPIN>,<proc1d>,<TOPSPIN 2.1>,
      <abs ABSG = 2 
       data hash MD5: 128K
       25 A1 FB 59 20 60 73 61 7A 20 B7 6E 96 08 28 F0>)
(   6,<2012-05-13 03:01:44.812 -0500>,<Administrator>,<TOPSPIN>,<proc1d>,<TOPSPIN 2.1>,
      <abs ABSG = 3 
       data hash MD5: 128K
       BB D2 35 EB D0 11 13 6A E3 67 48 CF DF AF 4F D7>)
(   7,<2012-05-13 03:01:44.875 -0500>,<Administrator>,<TOPSPIN>,<proc1d>,<TOPSPIN 2.1>,
      <abs ABSG = 4 
       data hash MD5: 128K
       59 60 29 C1 27 66 23 1D 8F 9A F1 10 1E E2 4D CC>)
(   8,<2012-05-13 03:01:44.921 -0500>,<Administrator>,<TOPSPIN>,<proc1d>,<TOPSPIN 2.1>,
      <abs ABSG = 5 
       data hash MD5: 128K
       8F FA 7A B9 87 82 FF 05 12 16 CD E4 B8 62 DE F7>)
$$ ##END=
$$ 
$$ $$ hash MD5
$$ $$ DF 81 47 DD CE 8B 4D 21 BF DB 72 37 72 16 8B 30
##$RELAX= 
##$RELAX= 
##$RELAX= 
##$RELAX= 
##$RELAX= 
##$RELAX= 
##$RELAX= 
##$RELAX= 
$$ [...]
##$TP07= 0
##$TPNAME0= <>
##$TPNAME1= <>
##$TPNAME2= <>
##$TPNAME3= <>
##$TPNAME4= <>
##$TPNAME5= <>
##$TPNAME6= <>
##$TPNAME7= <>
##$TPOAL= (0..7)
0.5 0.5 0.5 0.5 0.5 0.5 0.5 0.5
##$TPOFFS= (0..7)
0 0 0 0 0 0 0 0
##$TUNHIN= 0
##$TUNHOUT= 0
##$TUNXOUT= 0
##$USERA1= <user>
##$USERA2= <user>
##$USERA3= <user>
##$USERA4= <user>
##$USERA5= <user>
##$V9= 5
##$VALIST= <valist>
##$VCLIST= <CCCCCCCCCCCCCCC>
##$VD= 0
##$VDLIST= <DDDDDDDDDDDDDDD>
##$VPLIST= <PPPPPPPPPPPPPPP>
##$VTLIST= <TTTTTTTTTTTTTTT>
##$WBST= 2048
##$WBSW= 25
##$XGAIN= (0..3)
0 0 0 0
##$XL= 0
##$YL= 0
##$YMAX_a= 42832272
##$YMIN_a= -33141408
##$ZGOPTNS= <>
##$ZL1= 120
##$ZL2= 120
##$ZL3= 120
##$ZL4= 120
##$ABSF1= 14.96676
##$ABSF2= -5.585771
##$ABSG= 5
##$ABSL= 3
##$ALPHA= 0
##$AQORDER= 0
##$ASSFAC= 0
##$ASSFACI= 0
##$ASSFACX= 0
##$ASSWID= 0
##$AUNMP= <proc_prof1d_extract.lims>
##$AXLEFT= 0
##$AXNAME= <>
##$AXNUC= <1H>
##$AXRIGHT= 0
##$AXTYPE= 0
##$AXUNIT= <>
##$AZFE= 0.1
##$AZFW= 0.1
##$BCFW= 0
##$BC_mod= 0
##$BYTORDP= 0
##$COROFFS= 0
##$CY= 15
##$DATMOD= 1
##$DC= 0
##$DFILT= <>
##$DTYPP= 0
##$F1P= 0
##$F2P= 0
##$FCOR= 0.5
##$FTSIZE= 131072
##$FT_mod= 6
##$GAMMA= 0
##$GB= 0
##$INTBC= 1
##$INTSCL= 1
##$ISEN= 128
##$LB= 0.3
##$LEV0= 0
##$LPBIN= 0
##$MAXI= 10000
##$MC2= 0
##$MEAN= 0
##$ME_mod= 0
##$MI= 0
##$NCOEF= 0
##$NC_proc= -4
##$NLEV= 6
##$NOISF1= 0
##$NOISF2= 0
##$NSP= 0
##$NTH_PI= 0
##$NZP= 0
##$OFFSET= 14.96676
##$PC= 1
##$PHC0= 37.97424
##$PHC1= 0
##$PH_mod= 1
##$PKNL= yes
##$PPARMOD= 0
##$PPDIAG= 0
##$PPIPTYP= 0
##$PPMPNUM= 2147483647
##$PPRESOL= 1
##$PSCAL= 4
##$PSIGN= 0
##$PYNMP= <proc.py>
##$REVERSE= no
##$SF= 400.13000554198
##$SI= 131072
##$SIGF1= 0
##$SIGF2= 0
##$SINO= 400
##$SIOLD= 131072
##$SPECTYP= <>
##$SREGLST= <1H.CDCl3>
##$SSB= 0
##$STSI= 131072
##$STSR= 0
##$SW_p= 8223.68421052632
##$SYMM= 0
##$S_DEV= 0
##$TDeff= 65536
##$TDoff= 0
##$TI= <>
##$TILT= no
##$TM1= 0
##$TM2= 0
##$TOPLEV= 0
##$USERP1= <user>
##$USERP2= <user>
##$USERP3= <user>
##$USERP4= <user>
##$USERP5= <user>
##$WDW= 1
##$XDIM= 131072
##$YMAX_p= 468569371
##$YMIN_p= -178896853
##$CURPLOT= <Network HP LaserJet P1505>
##$CURPRIN= <$Network HP LaserJet P1505>
##$DFORMAT= <normdp>
##$LAYOUT= <+/1D_H.xwp>
##$LFORMAT= <normlp>
##$PFORMAT= <normpl>
##$SURQMSG= 1
$$ End of Bruker specific parameters
$$ ---------------------------------
##NTUPLES= NMR SPECTRUM
##VAR_NAME=  FREQUENCY,     SPECTRUM/REAL,   SPECTRUM/IMAG
##SYMBOL=    X,             R,               I
##VAR_TYPE=  INDEPENDENT,   DEPENDENT,       DEPENDENT
##VAR_FORM=  AFFN,          ASDF,            ASDF
##VAR_DIM=   131072,        131072,          131072
##UNITS=     HZ,            ARBITRARY UNITS, ARBITRARY UNITS
##FACTOR=    0.0627417313425165, 1,          1
##FIRST=     8223.62146879498, -348,         -463726
##LAST=      0,             17548,           -467531
##MIN=       0,             -178896853,      0
##MAX=       8223.62146879498, 468569371,    0
$$ Real data points
##PAGE= N=1
##DATA TABLE= (X++(R..R)), XYDATA
$$ [...]
$$ plain form
62988 3789250 3815208 3840437 3861564 3876737 3888404 3900953 3915842 3930703 3943174 3953767 3964557
62977 3964557 3976633 3989562 4002095 4012568 4019794 4024605 4029744 4037057 4045224 4051109 4052909 4050897 4045465
62964 4045465 4036027 4022537 4006947 3991790 3977271 3960933 3940974 3919301 3900059 3885076 3871937
62953 3871937 3857200 3840291 3823143 3807091 3791991 3777959 3765723 3754704 3742675 3728522 3714005
62942 3714005 3701558 3691320 3681683 3672121 3663930 3658207 3654151 3649572 3642464 3632151 3619566 3606729 3595587
62929 3595587 3587080 3580946 3576055 3571000 3564860 3557404 3548078 3535174 3517030 3494028 3468418 3442335 3417221
62916 3417221 3394726 3375777 3358161 3337621 3312880 3287532 3265122 3244326 3221459 3196222 3172048
62905 3172048 3151658 3135189 3122080 3111359 3099777 3083181 3061339 3039064 3020963 3006758 2993109
$$ packed form
62988C789250K5958K5229K1127J5173J1667J2549J4889J4861J2471J0593J0790
62977C964557J2076J2929J2533J0473P226M811N139P313Q167N885J800k012n432
62964D045465r438j3490j5590j5157j4519j6338j9959k1673j9242j4983j3139
62953C871937j4737j6909j7148j6052j5100j4032j2236j1019j2029j4153j4517
62942C714005j2447j0238r637r562q191n723m056m579p108j0313j2585j2837j1142
62929C595587q507o134m891n055o140p456r326j2904j8144k3002k5610k6083k5114
62916C417221k2495j8949j7616k0540k4741k5348k2410k0796k2867k5237k4174
62905C172048k0390j6469j3109j0721j1582j6596k1842k2275j8101j4205j3649
$$ plain form
62894 2993109 2978232 2962986 2948653 2935510 2923204 2911096 2898371 2884568 2869860 2854592 2839183
62883 2839183 2824752 2812792 2803640 2796148 2789403 2783730 2779357 2775298 2770531 2765138 2759142 2751265 2740576
62870 2740576 2728854 2719600 2714517 2712161 2710124 2707301 2703651 2699043 2693333 2687062 2681086 2675600 2670250 2665433
62856 2665433 2662817 2663852 2667976 2673121 2678118 2683684 2690511 2697299 2701738 2702945 2701848 2699576 2696846 2694867
62842 2694867 2695246 2698239 2701972 2704068 2703675 2701826 2700488 2701339 2704680 2709290 2713751 2717667 2720953 2722791 2722828
62827 2722828 2723007 2726159 2732540 2739553 2745248 2750032 2754316 2756724 2756058 2753454 2751141 2750283 2751002 2752954 2754742
62812 2754742 2754594 2753171 2753991 2759070 2765602 2769229 2769490 2769849 2773167 2779471 2787501 2796026 2803883 2810889 2818539
62797 2818539 2827819 2836666 2841772 2842697 2842095 2842194 2843452 2846438 2852050 2859241 2865200 2868802 2871844 2876299 2882625
$$ packed form
62894B993109j4877j5246j4333j3143j2306j2108j2725j3803j4708j5268j5409
62883B839183j4431j1960r152p492o745n673m373m059m767n393n996p877j0689
62870B740576j1722r254n083k356k037k823l650m608n710o271n976n486n350m817
62856B665433k616J035M124N145M997N566O827O788M439J207j097k272k730j979
62842B694867L79K993L733K096l93j849j338Q51L341M610M461L916L286J838L7
62827B722828J79L152O381P013N695M784M284K408o66k604k313q58P19J952J788
62812B754742j48j423Q20N079O532L627K61L59L318O304Q030Q525P857P006P650
62797B818539R280Q847N106R25o02R9J258K986N612P191N959L602L042M455O326
$$ plain form
62782 2882625 2891221 2902547 2914594 2923427 2928371 2934049 2944662 2958353 2970097 2978449 2986101 2994660 3002461
62769 3002461 3007697 3010715 3012532 3013510 3014354 3016475 3020376 3025259 3031101 3039552 3051571 3065214 3077012 3085157
62755 3085157 3090773 3096467 3103991 3112710 3120259 3125499 3130819 3140095 3153921 3168491 3180254 3190070 3200965
62742 3200965 3212908 3222412 3227518 3230981 3237603 3249816 3266845 3286729 3307478 3327013 3343981 3359130
62730 3359130 3374655 3391652 3409075 3425731 3442247 3460030 3478862 3496893 3513124 3528706 3545294
62719 3545294 3563012 3580833 3598376 3616389 3635618 3655905 3676284 3695265 3711247 3723555 3732999
62708 3732999 3740435 3744766 3743887 3738086 3730805 3724658 3718106 3707992 3694331 3679972 3665782 3649198 3628571
62695 3628571 3606283 3585696 3566823 3547134 3525224 3501519 3476478 3450778 3426903 3407898 3394100
$$ packed form
62782B882625Q596J1326J2047Q833M944N678J0613J3691J1744Q352P652Q559P801
62769C002461N236L018J817R78Q44K121L901M883N842Q451J2019J3643J1798Q145
62755C085157N616N694P524Q719P549N240N320R276J3826J4570J1763R816J0895
62742C200965J1943R504N106L463O622J2213J7029J9884K0749J9535J6968J5149
62730C359130J5525J6997J7423J6656J6516J7783J8832J8031J6231J5582J6588
62719C545294J7718J7821J7543J8013J9229K0287K0379J8981J5982J2308R444
62708C732999P436M331q79n801p281o147o552j0114j3661j4359j4190j6584k0627
62695C628571k2288k0587j8873j9689k1910k3705k5041k5700k3875j9005j3798
$$ plain form
62684 3394100 3382955 3372107 3360633 3347421 3331252 3313493 3298053 3286942 3277706 3266843 3254024
62673 3254024 3241201 3229454 3219154 3211960 3209648 3211065 3212502 3211415 3208053 3203496 3198046 3192088 3186795
62660 3186795 3182987 3180081 3176817 3172670 3168668 3167282 3171051 3180190 3191824 3202591 3211625 3219985 3228001
62647 3228001 3235121 3241925 3249944 3259156 3267868 3275799 3285177 3297721 3312395 3327551 3343435 3360667 3377498
62634 3377498 3390868 3399954 3406974 3414516 3423354 3432782 3441639 3448666 3452839 3453894 3452198 3448135 3442128 3435048
62620 3435048 3427779 3420173 3410881 3398483 3382777 3365105 3347557 3331486 3316623 3301968 3287531 3274374
62608 3274374 3262566 3250146 3235069 3217448 3198734 3179355 3158769 3137890 3119700 3106487 3097260
62597 3097260 3088768 3078738 3067454 3056497 3046679 3037531 3028345 3019215 3010772 3003223 2996276 2990177 2986078
$$ packed form
62684C394100j1145j0848j1474j3212j6169j7759j5440j1111r236j0863j2819
62673C254024j2823j1747j0300p194k312J417J437j087l362m557n450n958n293
62660C186795l808k906l264m147m002j386L769R139J1634J0767R034Q360Q016
62647C228001P120O804Q019R212Q712P931R378J2544J4674J5156J5884J7232J6831
62634C377498J3370R086P020P542Q838R428Q857P027M173J055j696m063o007p080
62620C435048p269p606r292j2398j5706j7672j7548j6071j4863j4655j4437j3157
62608C274374j1808j2420j5077j7621j8714j9379k0586k0879j8190j3213r227
62597C097260q492j0030j1284j0957r818r148r186r130q443p549o947o099m099
$$ plain form
62584 2986078 2984700 2984963 2984705 2982737 2979514 2975874 2972061 2968317 2965488 2964235 2964009 2963686 2963254 2964148 2967536
62569 2967536 2972636 2977261 2980083 2981986 2984903 2989426 2994050 2997024 2998685 3001415 3007252 3015849 3024806 3031564
62555 3031564 3034865 3035077 3033933 3033806 3036470 3042173 3049990 3058837 3067685 3075309 3081191 3087013 3095845 3108654
62541 3108654 3122467 3133381 3141008 3148590 3158958 3172008 3186190 3200413 3213574 3224061 3231468 3237941
62529 3237941 3246088 3255796 3264463 3270186 3273513 3276081 3278746 3281336 3283308 3284145 3283694 3282415 3281031 3279715
62515 3279715 3277691 3273475 3265593 3253853 3240416 3228970 3222103 3219718 3220071 3221258 3221253 3218254 3212661 3207553
62501 3207553 3205339 3204648 3202267 3197260 3190906 3183590 3174947 3167110 3164300 3167876 3174432 3180142 3184620 3189004
62487 3189004 3192925 3195760 3199014 3204701 3212427 3220409 3228459 3237428 3246106 3251321 3251725 3249846 3249791 3253713 3260476
$$ packed form
62584B986078j378K63k58j968l223l640l813l744k829j253k26l23m32Q94L388
62569B967536N100M625K822J903K917M523M624K974J661K730N837Q597Q957O758
62555C031564L301K12j144j27K664N703P817Q847Q848P624N882N822Q832J2809
62541C108654J3813J0914P627P582J0368J3050J4182J4223J3161J0487P407O473
62529C237941Q147R708Q667N723L327K568K665K590J972Q37m51j279j384j316
62515C279715k024m216p882j1740j3437j1446o867k385L53J187nk999n593n108
62501C207553k214o91k381n007o354p316q643p837k810L576O556N710M478M384
62487C189004L921K835L254N687P726P982Q050Q969Q678N215M04j879n5L922O763
$$ plain form
62472 3260476 3266860 3270257 3271133 3272636 3277151 3283962 3291203 3298906 3308464 3319883 3331611 3342671 3352980
62459 3352980 3361853 3368633 3375190 3385344 3400587 3418072 3434053 3447978 3461883 3476930 3492282 3506948
62447 3506948 3521118 3535294 3548938 3560631 3569575 3576737 3584152 3592730 3601067 3606956 3609792 3610737 3610821 3610232
62433 3610232 3609712 3611176 3615811 3622272 3627975 3631982 3635688 3640686 3647015 3653998 3661893 3671378 3681346 3688686
62419 3688686 3691573 3692479 3696114 3703839 3711465 3713672 3709697 3703572 3699459 3698131 3697641 3695787 3691663 3685975
62405 3685975 3680430 3676159 3672355 3666859 3658123 3646246 3632390 3617873 3603652 3589950 3576492 3563523
62393 3563523 3552122 3542804 3534583 3526544 3519483 3514307 3509347 3501573 3490632 3479504 3470538 3463082 3456141
62380 3456141 3451166 3450115 3452107 3454154 3454717 3454693 3455160 3455963 3456734 3457741 3459074 3459909 3459355 3457582 3455662 3454456
$$ packed form
62472C260476O384L397Q76J503M515O811P241P703R558J1419J1728J1060J0309
62459C352980Q873O780O557J0154J5243J7485J5981J3925J3905J5047J5352J4666
62447C506948J4170J4176J3644J1693Q944P162P415Q578Q337N889K836R45Q4n89
62433C610232n20J464M635O461N703M007L706M998O329O983P895R485R968P340
62419C688686K887R06L635P725P626K207l975o125m113j328m90j854m124n688
62405C685975n545m271l804n496q736j1877j3856j4517j4221j3702j3458j2969
62393C563523j1401r318q221q039p061n176m960p774j0941j1128q966p456o941
62380C456141m975j051J992K047N63k4M67Q03P71J007J333Q35n54j773j920j206
$$ plain form
62364 3454456 3453878 3453141 3451521 3448874 3445536 3442172 3440091 3441112 3445980 3452769 3458089 3460531 3462110 3465605
62350 3465605 3471449 3478261 3485516 3493940 3503370 3511986 3518494 3524012 3530757 3539365 3548340 3556002 3562180 3567865
62336 3567865 3574105 3581851 3592322 3606386 3623146 3639774 3653417 3663334 3671070 3678951 3688614 3700296
62324 3700296 3712727 3724014 3733490 3742653 3753648 3766960 3781344 3795901 3811256 3828530 3847937 3868565
62312 3868565 3888764 3906728 3921881 3936187 3953061 3974151 3997758 4021075 4043398 4066205 4090382
62301 4090382 4114377 4135613 4153485 4170589 4190624 4215010 4241880 4268410 4293244 4316066 4335964
62290 4335964 4351933 4364685 4376244 4387391 4396818 4403033 4405882 4406029 4404353 4402072 4399851 4396376 4389599
62277 4389599 4379926 4370198 4361573 4351528 4337373 4319832 4301364 4282699 4263238 4243426 4224187 4204905
$$ packed form
62364C454456n78p37j620k647l338l364k081J021M868O789N320K442J579L495
62350C465605N844O812P255Q424R430Q616O508N518O745Q608Q975P662O178N685
62336C567865O240P746J0471J4064J6760J6628J3643R917P736P881R663J1682
62324C700296J2431J1287R476R163J0995J3312J4384J4557J5355J7274J9407K0628
62312C868565K0199J7964J5153J4306J6874K1090K3607K3317K2323K2807K4177
62301D090382K3995K1236J7872J7104K0035K4386K6870K6530K4834K2822J9898
62290D335964J5969J2752J1559J1147R427O215K849J47j676k281k221l475o777
62277D389599r673r728q625j0045j4155j7541j8468j8665j9461j9812j9239j9282
$$ plain form
62265 4204905 4184482 4163870 4145055 4127777 4109845 4090824 4072847 4057128 4041874 4024872 4006534
62254 4006534 3989224 3974560 3962346 3951515 3941510 3932948 3926722 3922086 3916520 3908863 3901750 3898777 3899375
62241 3899375 3898820 3893810 3885912 3878805 3874376 3872852 3874795 3880766 3889680 3899078 3906918 3912535 3916489 3920116
62227 3920116 3924554 3929772 3935163 3941038 3948087 3955275 3960386 3963489 3967763 3975381 3984574 3992863 4001507 4013919
62213 4013919 4030464 4047663 4062605 4075752 4088969 4103095 4118298 4134922 4152736 4170518 4187601
62202 4187601 4205110 4224755 4246902 4270537 4294616 4318707 4342660 4366383 4389902 4413112 4435323
62191 4435323 4455341 4472331 4486746 4500194 4513886 4527036 4537272 4542971 4544824 4544716 4543580 4540900
62179 4540900 4535834 4528124 4518225 4507297 4496673 4486398 4474451 4458404 4437946 4415087 4391941 4369232
$$ packed form
62265D204905k0423k0612j8815j7278j7932j9021j7977j5719j5254j7002j8338
62254D006534j7310j4664j2214j0831j0005q562o226m636n566p657p113k973N98
62241C899375n55n010p898p107m429j524J943N971Q914R398P840N617L954L627
62227C920116M438N218N391N875P049P188N111L103M274P618R193Q289Q644J2412
62213D013919J6545J7199J4942J3147J3217J4126J5203J6624J7814J7782J7083
62202D187601J7509J9645K2147K3635K4079K4091K3953K3723K3519K3210K2211
62191D435323K0018J6990J4415J3448J3692J3150J0236N699J853j08j136k680
62179D540900n066p710r899j0928j0624j0275j1947j6047k0458k2859k3146k2709
$$ plain form
62167 4369232 4347015 4325775 4306323 4289210 4274582 4262127 4250833 4239086 4225231 4208099 4187682
62156 4187682 4165991 4146491 4131211 4118379 4104417 4088636 4074499 4065431 4060686 4056613 4051140 4045423
62144 4045423 4041291 4038626 4035889 4032342 4028764 4026082 4024095 4022118 4020565 4021013 4024435 4030200 4037433 4046350
62130 4046350 4056934 4066932 4073174 4075373 4077068 4082001 4090655 4100941 4110907 4119707 4127119 4133873 4142118
62117 4142118 4154066 4169846 4187285 4203710 4217527 4228659 4238468 4249102 4262031 4276921 4292195
62106 4292195 4306520 4319622 4332268 4345884 4361478 4378204 4393533 4405603 4415005 4423618 4432301 4440368
62094 4440368 4446473 4449104 4447079 4440874 4432825 4424837 4416424 4406179 4394259 4381760 4368511 4353617 4337724
62081 4337724 4322340 4306992 4289681 4270589 4252788 4238340 4226042 4214100 4202603 4191634 4179244
$$ packed form
62167D369232k2217k1240j9452j7113j4628j2455j1294j1747j3855j7132k0417
62156D187682k1691j9500j5280j2832j3962j5781j4137r068m745m073n473n717
62144D045423m132k665k737l547l578k682j987j977j553M48L422N765P233Q917
62130D046350J0584R998O242K199J695M933Q654J0286R966Q800P412O754Q245
62117D142118J1948J5780J7439J6425J3817J1132R809J0634J2929J4890J5274
62106D292195J4325J3102J2646J3616J5594J6726J5329J2070R402Q613Q683Q067
62094D440368O105K631k025o205q049p988q413j0245j1920j2499j3249j4894j5893
62081D337724j5384j5348j7311j9092j7801j4448j2298j1942j1497j0969j2390
$$ plain form
62070 4179244 4163823 4147384 4134292 4127300 4126184 4128946 4132267 4131858 4125140 4113842 4102119 4092039 4082541
62057 4082541 4072573 4063100 4055580 4050375 4047515 4047494 4050060 4053051 4053571 4050284 4044360 4038597 4035605 4036037 4038116
62042 4038116 4039263 4038386 4036335 4034560 4034170 4036054 4040616 4046785 4052162 4054896 4055141 4054373 4053658 4053038 4052433 4052612
62026 4052612 4054883 4059670 4065734 4071424 4076651 4082773 4090289 4097736 4103520 4107772 4111489 4114965 4118362 4122808
62012 4122808 4129102 4135923 4141375 4146330 4154206 4166899 4182392 4196859 4207963 4215913 4222767 4231195 4242425
61999 4242425 4254539 4263640 4267224 4265766 4261218 4255310 4249344 4243691 4236691 4225566 4209409 4190219 4170394
61986 4170394 4150510 4130157 4109410 4088437 4067013 4045528 4025366 4007267 3990398 3973797 3957297
61975 3957297 3940151 3920481 3897674 3873830 3851125 3829162 3806944 3786078 3769165 3755446 3740939
$$ packed form
62070D179244j5421j6439j3092o992j116K762L321m09o718j1298j1723j0080r498
62057D082541r968r473p520n205k860k1K566K991N20l287n924n763k992M32K079
62042D038116J147q77k051j775l90J884M562O169N377K734K45p68p15o20o05J79
62026D052612K271M787O064N690N227O122P516P447N784M252L717L476L397M446
62012D122808O294O821N452M955P876J2693J5493J4467J1104P950O854Q428J1230
61999D242425J2114R101L584j458m548n908n966n653p000j1125j6157j9190j9825
61986D170394j9884k0353k0747k0973k1424k1485k0162j8099j6869j6601j6500
61975C957297j7146j9670k2807k3844k2705k1963k2218k0866j6913j3719j4507
$$ plain form
61964 3740939 3723534 3705760 3691337 3680382 3669292 3654947 3638190 3623003 3612437 3605751 3599967 3593725
61952 3593725 3588071 3583326 3577331 3568254 3557663 3549072 3544273 3542489 3542018 3540984 3537493 3531083 3523576 3516985
61938 3516985 3511451 3506787 3504598 3506127 3508923 3508723 3504627 3499750 3496758 3495562 3495491 3496481 3497167 3494785 3488620
61923 3488620 3481613 3477381 3477386 3481534 3488927 3496832 3501452 3501500 3499168 3496509 3493344 3490131 3489541 3492317 3494263
61908 3494263 3491210 3485601 3484206 3489640 3497782 3503910 3508001 3512697 3518747 3524602 3529373 3534253 3540811 3548554
61894 3548554 3554713 3557103 3557394 3560522 3569840 3583460 3596340 3605270 3610750 3615019 3620105 3627424 3637378 3648907
61880 3648907 3660408 3671034 3680197 3686680 3689944 3692077 3696502 3704578 3714871 3725616 3736148 3746059 3755072
61867 3755072 3764291 3775440 3787902 3798250 3803830 3805550 3806326 3808347 3812850 3820685 3831027 3840366 3844804
$$ packed form
61964C740939j7405j7774j4423j0955j1090j4345j6757j5187j0566o686n784o242
61952C593725n654m745n995r077j0591q591m799j784m71j034l491o410p507o591
61938C516985n534m664k189J529K796k00m096m877k992j196p1R90O86k382o165
61923C488620p007m232NM148P393P905M620M8k332k659l165l213n90K776J946
61908C494263l053n609j395N434Q142O128M091M696O050N855M771M880O558P743
61894C548554O159K390K91L128R318J3620J2880Q930N480M269N086P319R954J1529
61880C648907J1501J0626R163O483L264K133M425Q076J0293J0745J0532R911R013
61867C755072R219J1149J2462J0348N580J720P76K021M503P835J0342R339M438
$$ plain form
61854 3844804 3843549 3839319 3835600 3834216 3834792 3835494 3834775 3833520 3835178 3842551 3854502 3866596 3874792 3877776
61840 3877776 3876264 3871680 3866013 3861824 3861139 3863981 3868090 3870457 3869740 3867314 3865400 3864051 3861061 3855361
61826 3855361 3849257 3845942 3845620 3845699 3844445 3842612 3841361 3840411 3839027 3837466 3836449 3836025 3835675 3834759 3832256 3827114
61810 3827114 3819990 3813938 3812175 3815296 3821368 3828206 3834528 3839210 3840879 3838925 3834547 3830613 3830531 3836528
61796 3836528 3848057 3861913 3874634 3884941 3893666 3901924 3910111 3918007 3924656 3928695 3930305 3932430 3938123
61783 3938123 3946633 3954311 3959719 3965226 3972250 3977678 3977659 3973328 3969851 3970501 3974314 3979075 3983618 3986897 3987723
61768 3987723 3986479 3984928 3983274 3979399 3972203 3963836 3957216 3952910 3949932 3948010 3947108 3945785 3942084 3935680
61754 3935680 3927724 3919117 3910214 3901379 3892196 3880950 3866758 3851646 3838357 3826470 3813088 3797591
$$ packed form
61854C844804j255m230l719j384N76P02p19j255J658P373J1951J2094Q196K984
61840C877776j512m584n667m189o85K842M109K367p17k426j914j349k990n700
61826C855361o104l315l22P9j254j833j251r50j384j561j017m24l50r16k503n142
61810C827114p124o052j763L121O072O838O322M682J669j954m378l934q2N997
61796C836528J1529J3856J2721J0307Q725Q258Q187P896O649M039J610K125N693
61783C938123Q510P678N408N507P024N428j9m331l477O50L813M761M543L279Q26
61768C987723j244j551j654l875p196q367o620m306k978j922r02j323l701o404
61754C935680p956q607q903q835r183j1246j4192j5112j3289j1887j3382j5497
$$ plain form
61742 3797591 3783174 3772697 3765040 3756850 3746197 3733168 3718424 3703173 3689850 3680761 3675857 3672831
61730 3672831 3669336 3664197 3656939 3647685 3637956 3630302 3626156 3624421 3622776 3620183 3617655 3616669 3617336 3618245 3617720
61715 3617720 3614974 3610262 3604517 3598977 3594637 3591469 3588359 3584340 3580000 3577251 3577505 3580347 3584034 3586811
61701 3586811 3587449 3585102 3579705 3572890 3567796 3566833 3569246 3571522 3570910 3568293 3567006 3569129 3573809 3579033 3583730
61686 3583730 3587677 3590590 3592263 3592886 3592370 3590074 3586179 3582750 3582335 3585701 3591559 3597844 3602427 3603596 3601434
61671 3601434 3598259 3596217 3594889 3592887 3591199 3592603 3597763 3604384 3610835 3617956 3625971 3632042 3633214 3630443
61657 3630443 3627455 3626305 3626076 3625572 3625113 3625310 3625599 3624832 3622686 3619993 3617933 3616912 3616137 3614602 3612635 3611819
61641 3611819 3613146 3616098 3620109 3625782 3633564 3641961 3648342 3651142 3650392 3646780 3641553 3636886 3634804 3635472
$$ packed form
61742C797591j4417j0477p657q190j0653j3029j4744j5251j3323r089m904l026
61730C672831l495n139p258r254r729p654m146j735j645k593k528r86O67R09n25
61715C617720k746m712n745n540m340l168l110m019m340k749K54K842L687K777
61701C586811O38k347n397o815n094r63K413K276o12k617j287K123M680N224M697
61686C583730L947K913J673O23n16k296l895l429m15L366N858O285M583J169k162
61671C601434l175k042j328k002j688J404N160O621O451P121Q015O071J172k771
61657C630443k988j150k29n04m59J97K89p67k146k693k060j021p75j535j967q16
61641C611819J327K952M011N673P782Q397O381K800p50l612n227m667k082O68
$$ plain form
61627 3635472 3637475 3639640 3641643 3642964 3642504 3639535 3634506 3629032 3625619 3626568 3631870 3638602 3643828 3647865
61613 3647865 3653110 3659757 3664672 3665223 3662717 3661007 3662679 3667427 3673247 3678191 3681201 3682037 3680820 3678099
61599 3678099 3675638 3676070 3680326 3685692 3688206 3687302 3686643 3689912 3697179 3705837 3713530 3719245 3722980 3725538 3727827
61584 3727827 3729563 3729566 3727954 3726779 3727650 3729872 3731944 3733581 3735074 3735871 3735341 3734042 3732857 3731793 3731075 3732362
61568 3732362 3736916 3743152 3747890 3749827 3750255 3750822 3752393 3755721 3761119 3767253 3771969 3774598 3775982 3776334 3774888
61553 3774888 3771906 3769180 3768084 3768558 3770153 3772153 3772446 3768661 3761638 3755958 3755665 3760521 3767231 3772795 3775842
61538 3775842 3776581 3776871 3778858 3782131 3783739 3782476 3781331 3783658 3788529 3792558 3795141 3798641 3803607 3807166
61524 3807166 3807328 3806367 3808270 3814154 3821564 3827447 3830711 3832401 3834375 3837763 3842232 3846522 3849513 3850709
$$ packed form
61627C635472K003K165K003J321m60k969n029n474l413R49N302O732N226M037
61613C647865N245O647M915N51k506j710J672M748N820M944L010Q36j217k721
61599C678099k461M32M256N366K514r04o59L269P267Q658P693N715L735K558K289
61584C727827J736Lj612j175Q71K222K072J637J493P97n30j299j185j064p18J287
61568C732362M554O236M738J937M28N67J571L328N398O134M716K629J384L52j446
61553C774888k982k726j096M74J595K000K93l785p023n680k93M856O710N564L047
61538C775842P39K90J987L273J608j263j145K327M871M029K583L500M966L559
61524C807166J62r61J903N884P410N883L264J690J974L388M469M290K991J196
$$ plain form
61510 3850709 3850496 3850534 3852980 3858123 3863482 3866802 3869415 3874675 3883166 3891690 3897531 3901432 3905168 3908214 3908840
61495 3908840 3907397 3906450 3907949 3911910 3917819 3925728 3935407 3945448 3954153 3961095 3967168 3972910 3977214 3978531
61481 3978531 3977570 3977795 3982258 3990478 3999704 4008685 4018310 4028495 4036840 4041652 4044619 4048807 4055015 4061617
61467 4061617 4067354 4072740 4078941 4086436 4094582 4101751 4106470 4109436 4113673 4121344 4130733 4137793 4140663 4141443
61453 4141443 4143434 4147731 4152791 4156520 4158489 4160544 4165276 4173624 4184316 4195665 4206920 4217292 4225190
61440 4225190 4230028 4233898 4239592 4247319 4254997 4261456 4267581 4274545 4282671 4291889 4301464 4309516 4314943 4319707
61426 4319707 4326616 4334595 4339313 4339679 4340596 4347164 4358626 4370545 4380655 4389172 4394931 4395697 4392926 4392522
61412 4392522 4398973 4410704 4422871 4433095 4442446 4451811 4459983 4466021 4471493 4478491 4486002 4490487 4490940
$$ packed form
61510C850709k13L8K446N143N359L320K613N260Q491Q524N841L901L736L046O26
61495C908840j443r47J499L961N909P909R679J0041Q705O942O073N742M304J317
61481C978531r61K25M463Q220R226Q981R625J0185Q345M812K967M188O208O602
61467D061617N737N386O201P495Q146P169M719K966M237P671R389P060K870P80
61453D141443J991M297N060L729J969K055M732Q348J0692J1349J1255J0372P898
61440D225190M838L870N694P727P678O459O125O964Q126R218R575Q052N427M764
61426D319707O909P979M718L66R17O568J1462J1919J0110Q517N759P66k771m04
61412D392522O451J1731J2167J0224R351R365Q172O038N472O998P511M485M53
$$ plain form
61399 4490940 4491538 4497256 4507667 4517441 4523137 4527005 4533246 4542794 4553404 4563035 4571117 4577757 4583964 4591994
61385 4591994 4603279 4616211 4627746 4637060 4645925 4655540 4664707 4671463 4675296 4677635 4681107 4687856 4697321
61372 4697321 4706122 4711709 4715718 4722119 4732499 4745018 4757353 4768076 4775612 4779247 4781911 4788501 4799765
61359 4799765 4810673 4816954 4820711 4827034 4837298 4849031 4860936 4874233 4889013 4902481 4911792 4916825
61347 4916825 4919675 4923047 4929395 4939683 4952213 4963997 4973928 4983415 4993630 5003695 5012400 5020161 5028014
61334 5028014 5035771 5042791 5050036 5059567 5071661 5083729 5092973 5099335 5104811 5110302 5114769 5118082 5123033
61321 5123033 5132617 5145882 5158588 5168317 5176888 5186859 5197802 5207713 5216511 5225798 5236007 5246123 5256003
61308 5256003 5266845 5279245 5292645 5306710 5321379 5335411 5347020 5356496 5366155 5376975 5387364 5396352
$$ packed form
61399D490940N98N718J0411R774N696L868O241R548J0610R631Q082O640O207Q030
61385D591994J1285J2932J1535R314Q865R615R167O756L833K339L472O749R465
61372D697321Q801N587M009O401J0380J2519J2335J0723P536L635K664O590J1264
61359D799765J0908O281L757O323J0264J1733J1905J3297J4780J3468R311N033
61347D916825K850L372O348J0288J2530J1784R931R487J0215J0065Q705P761P853
61334E028014P757P020P245R531J2094J2068R244O362N476N491M467L313M951
61321E123033R584J3265J2706R729Q571R971J0943R911Q798R287J0209J0116R880
61308E256003J0842J2400J3400J4065J4669J4032J1609R476R659J0820J0389Q988
$$ plain form
61296 5396352 5406003 5418940 5434919 5451493 5466813 5480045 5490271 5497362 5503523 5511705 5522317 5533231
61284 5533231 5543344 5554368 5568325 5584585 5600453 5614008 5625454 5635984 5646264 5656443 5667241
61273 5667241 5680137 5695766 5712390 5726944 5737763 5745387 5750631 5753667 5756028 5761621 5773292 5788820
61261 5788820 5802678 5812080 5819382 5828097 5838600 5849011 5858722 5869192 5881751 5896071 5910834 5924870
61249 5924870 5937454 5948217 5957375 5966084 5976236 5989313 6004886 6020488 6033804 6045040 6056482 6069607
61237 6069607 6083507 6096417 6107986 6119522 6132601 6147707 6163604 6177816 6188734 6197701 6207888
61226 6207888 6220369 6232530 6241580 6248476 6256558 6266944 6277590 6287105 6297181 6309961 6324541 6337773
61214 6337773 6347928 6356059 6363874 6371760 6379388 6387233 6396427 6407335 6419226 6431673 6445641 6462239
$$ packed form
61296E396352R651J2937J5979J6574J5320J3232J0226P091O161Q182J0612J0914
61284E533231J0113J1024J3957J6260J5868J3555J1446J0530J0280J0179J0798
61273E667241J2896J5629J6624J4554J0819P624N244L036K361N593J1671J5528
61261E788820J3858R402P302Q715J0503J0411R711J0470J2559J4320J4763J4036
61249E924870J2584J0763R158Q709J0152J3077J5573J5602J3316J1236J1442J3125
61237F069607J3900J2910J1569J1536J3079J5106J5897J4212J0918Q967J0187
61226F207888J2481J2161R050O896Q082J0386J0646R515J0076J2780J4580J3232
61214F337773J0155Q131P815P886P628P845R194J0908J1891J2447J3968J6598
$$ plain form
61202 6462239 6480474 6497335 6510903 6522891 6537110 6555481 6576294 6596307 6613448 6627301 6638205
61191 6638205 6646923 6654641 6662436 6670982 6681224 6694601 6711523 6729986 6747016 6761713 6775978 6791994
61179 6791994 6809728 6827179 6842355 6854873 6866390 6879655 6896115 6914102 6930381 6943976 6957175
61168 6957175 6972040 6987511 7001497 7014350 7027979 7042256 7055033 7065802 7076709 7089093 7101570
61157 7101570 7113091 7125811 7142865 7164500 7188184 7211456 7232790 7250754 7264912 7277508 7292173
61146 7292173 7310471 7330946 7351354 7370342 7387331 7402903 7419555 7440034 7464208 7489068 7512311
61135 7512311 7534243 7555836 7577107 7598473 7621653 7647511 7674286 7699499 7722538 7744212 7765142
61124 7765142 7786145 7808813 7833697 7858847 7882137 7904242 7927167 7950485 7971556 7989517 8006681
$$ packed form
61202F462239J8235J6861J3568J1988J4219J8371K0813K0013J7141J3853J0904
61191F638205Q718P718P795Q546J0242J3377J6922J8463J7030J4697J4265J6016
61179F791994J7734J7451J5176J2518J1517J3265J6460J7987J6279J3595J3199
61168F957175J4865J5471J3986J2853J3629J4277J2777J0769J0907J2384J2477
61157G101570J1521J2720J7054K1635K3684K3272K1334J7964J4158J2596J4665
61146G292173J8298K0475K0408J8988J6989J5572J6652K0479K4174K4860K3243
61135G512311K1932K1593K1271K1366K3180K5858K6775K5213K3039K1674K0930
61124G765142K1003K2668K4884K5150K3290K2105K2925K3318K1071J7961J7164
$$ plain form
61113 8006681 8025478 8046048 8067616 8090393 8114920 8140689 8166399 8190868 8213280 8233563 8253075
61102 8253075 8273923 8297020 8321533 8346414 8371198 8394938 8415852 8433288 8449270 8467136 8489053
61091 8489053 8515191 8544392 8574940 8605445 8635601 8665414 8693542 8717879 8738608 8759151 8782563
61080 8782563 8807984 8832141 8853649 8874392 8897447 8925253 8958982 8997397 9036388 9071944 9104257
61069 9104257 9137273 9173759 9212572 9251384 9289963 9329317 9369386 9409667 9451220 9495915 9543964
61058 9543964 9593913 9644954 9697340 9750364 9802031 9851720 9901505 9953354 10006173 10057411 10106921
61047 10106921 10157240 10209981 10263918 10317453 10371268 10426944 10483750 10538536 10588988 10635940 10682353
61036 10682353 10730790 10781915 10834274 10885043 10931882 10974994 11017178 11061371 11108311 11156875 11206022
$$ packed form
61113H006681J8797K0570K1568K2777K4527K5769K5710K4469K2412K0283J9512
61102H253075K0848K3097K4513K4881K4784K3740K0914J7436J5982J7866K1917
61091H489053K6138K9201L0548L0505L0156K9813K8128K4337K0729K0543K3412
61080H782563K5421K4157K1508K0743K3055K7806L3729L8415L8991L5556L2313
61069I104257L3016L6486L8813L8812L8579L9354M0069M0281M1553M4695M8049
61058I543964M9949N1041N2386N3024N1667M9689M9785N1849N2819N1238M9510
61047A0106921N0319N2741N3937N3535N3815N5676N6806N4786N0452M6952M6413
61036A0682353M8437N1125N2359N0769M6839M3112M2184M4193M6940M8564M9147
$$ plain form
61025 11206022 11255575 11305351 11354580 11402544 11449340 11495712 11542527 11590723 11641386 11695323 11752432
61014 11752432 11811716 11871875 11931911 11991497 12051196 12112251 12175655 12241328 12308429 12376323 12444610
61003 12444610 12512460 12579336 12646990 12719144 12797474 12878877 12959140 13039036 13123960 13216677 13313417
60992 13313417 13409136 13504254 13603232 13708108 13817080 13929100 14046179 14170258 14300604 14435269
60982 14435269 14572362 14708788 14840892 14968804 15097907 15233256 15373962 15515688 15657096
60973 15657096 15800348 15945870 16090573 16232290 16372906 16515357 16659623 16803747 16947619
60964 16947619 17093858 17245388 17403661 17569262 17743065 17926173 18118818 18319543 18526212
60955 18526212 18738801 18961190 19199081 19455913 19731942 20027599 20345823 20689375 21056839
$$ packed form
61025A1206022M9553M9776M9229M7964M6796M6372M6815M8196N0663N3937N7109
61014A1752432N9284O0159O0036N9586N9699O1055O3404O5673O7101O7894O8287
61003A2444610O7850O6876O7654P2154P8330Q1403Q0263P9896Q4924R2717R6740
60992A3313417R5719R5118R8978J04876J08972J12020J17079J24079J30346J34665
60982A4435269J37093J36426J32104J27912J29103J35349J40706J41726J41408
60973A5657096J43252J45522J44703J41717J40616J42451J44266J44124J43872
60964A6947619J46239J51530J58273J65601J73803J83108J92645K00725K06669
60955A8526212K12589K22389K37891K56832K76029K95657L18224L43552L67464
$$ plain form
60946 21056839 21443083 21843094 22252927 22666155 23071346 23455048 23807382 24124636 24407795
60937 24407795 24659963 24883999 25079237 25238212 25347163 25391512 25361872 25255679 25075318 24827058
60927 24827058 24521219 24169859 23781322 23356986 22894537 22394385 21862430 21307638 20738739
60918 20738739 20163310 19587974 19017883 18456278 17905408 17367715 16845639 16340590 15852978
60909 15852978 15383462 14933612 14504851 14096851 13707429 13334267 12976567 12634741 12308680
60900 12308680 11996834 11697132 11408291 11130022 10862359 10605255 10358583 10122205 9896326
60891 9896326 9681978 9480506 9291865 9113811 8943601 8780293 8624473 8475973 8333215
60882 8333215 8195396 8064132 7941743 7828099 7720141 7614766 7511666 7413085 7321134 7235753
$$ packed form
60946B1056839L86244M00011M09833M13228M05191L83702L52334L17254K83159
60937B4407795K52168K24036J95238J58975J08951M4349k9640j06193j80361k48260
60927B4827058l05839l51360l88537m24336m62449n00152n31955n54792n68899
60918B0738739n75429n75336n70091n61605n50870n37693n22076n05049m87612
60909A5852978m69516m49850m28761m08000l89422l73162l57700l41826l26061
60900A2308680l11846k99702k88841k78269k67663k57104k46672k36378k25879
60891I896326k14348k01472j88641j78054j70210j63308j55820j48500j42758
60882H333215j37819j31264j22389j13644j07958j05375j03100r8581r1951q5381
$$ plain form
60872 7235753 7155151 7077762 7003450 6932953 6866448 6802870 6740704 6679568 6620924 6566908 6518294
60861 6518294 6474077 6433204 6395726 6361317 6327677 6292287 6255723 6221263 6190711 6162542 6135043
60850 6135043 6109087 6085918 6064026 6040995 6017714 5997906 5983194 5970988 5957927 5943463 5929163
60839 5929163 5916152 5904620 5894780 5886995 5881103 5876134 5870578 5863119 5853799 5844171 5835318 5826255 5815914
60826 5815914 5806282 5800955 5799964 5798667 5793389 5785987 5780715 5778372 5776293 5773131 5770480 5769549 5769025 5767248 5764519
60811 5764519 5761857 5758937 5754813 5750079 5746806 5746338 5748077 5750677 5753555 5756580 5758636 5757614 5752667 5746116
60797 5746116 5741979 5742107 5744473 5745818 5745381 5745118 5746713 5749537 5751672 5751928 5750358 5747538 5744091 5740803 5738603
60782 5738603 5738259 5740077 5743684 5747895 5751239 5753328 5755752 5760813 5768797 5777087 5782836 5786052 5788880 5792112
$$ packed form
60872G235753q0602p7389p4312p0497o6505o3578o2166o1136n8644n4016m8614
60861F518294m4217m0873l7478l4409l3640l5390l6564l4460l0552k8169k7499
60850F135043k5956k3169k1892k3031k3281j9808j4712j2206j3061j4464j4300
60839E929163j3011j1532r840p785n892m969n556p459r320r628q853r063j0341
60826E815914r632n327r91j297n278p402n272k343k079l162k651r31n24j777k729
60811E764519k662k920m124m734l273m68J739K600K878L025K056j022m947o551
60797E746116m137J28K366J345m37k63J595K824K135K56j570k820l447l288k200
60782E738603l44J818L607M211L344K089K424N061P984Q290N749L216K828L232
$$ plain form
60768 5792112 5794157 5793890 5792549 5791647 5790801 5789517 5789632 5793385 5799862 5806035 5811024 5816455 5822652 5827838 5831881
60753 5831881 5837287 5844763 5850938 5853011 5852933 5854103 5856141 5856441 5855248 5855220 5856629 5857059 5856205 5857238 5862192 5868962
60737 5868962 5874352 5877747 5880233 5882090 5882939 5883021 5882913 5882979 5884219 5888413 5896096 5905366 5913924 5921523 5929326
60722 5929326 5937694 5945900 5953455 5960379 5966341 5970599 5972904 5973875 5974640 5976609 5981305 5989579 6000696 6012289
60708 6012289 6021486 6026683 6028898 6031087 6035242 6040377 6044396 6047604 6052571 6060158 6067670 6072226 6074553 6078027
60694 6078027 6084944 6094994 6106249 6115918 6121123 6121359 6120326 6123336 6132132 6143420 6152826 6158882 6162635
60681 6162635 6165087 6166645 6168450 6172483 6179773 6189172 6198334 6205692 6211326 6216140 6220542 6224131 6226671 6229033
60667 6229033 6232664 6237903 6243211 6246737 6248775 6252066 6259108 6269419 6279989 6288185 6293435 6296315 6297494
$$ packed form
60768E792112K045k67j341r02q46j284J15L753O477O173M989N431O197N186M043
60753E831881N406P476O175K073p8J170K038L00j193k8J409M30q54J033M954O770
60737E868962N390L395K486J857Q49Q2j08O6J240M194P683R270Q558P599P803
60722E929326Q368Q206P555O924N962M258K305R71P65J969M696Q274J1117J1593
60708F012289R197N197K215K189M155N135M019L208M967P587P512M556K327L474
60694F078027O917J0050J1255R669N205K36j033L010Q796J1288R406O056L753
60681F162635K452J558J805M033P290R399R162P358N634M814M402L589K540K362
60667F229033L631N239N308L526K038L291P042J0311J0570Q196N250K880J179
$$ plain form
60654 6297494 6298354 6301260 6307603 6315886 6322992 6327266 6329374 6330616 6331876 6334122 6338310 6344401 6351739 6360627
60640 6360627 6371998 6385171 6397689 6408258 6418216 6428946 6439345 6447418 6453300 6459050 6466122 6474543
60628 6474543 6484056 6494565 6505677 6517001 6528598 6540242 6550799 6559633 6568107 6578334 6590614 6603147
60616 6603147 6613804 6621229 6625061 6626656 6628826 6633125 6637988 6641411 6644703 6651037 6660667 6670689 6679814
60603 6679814 6690017 6702166 6713289 6720623 6726054 6733720 6744580 6755987 6765715 6773778 6780696 6786639 6792622
60590 6792622 6800364 6810309 6821173 6831792 6841966 6851171 6858225 6863149 6868043 6874811 6882653 6888985 6892674
60577 6892674 6895459 6899960 6906831 6914222 6919963 6923873 6927647 6932871 6939917 6948705 6959228 6970608 6980791
60564 6980791 6988608 6995670 7004779 7016557 7028949 7040024 7049771 7058844 7067234 7075202 7084353 7096308 7110589
$$ packed form
60654F297494Q60K906O343Q283P106M274K108J242J260K246M188O091P338Q888
60640F360627J1371J3173J2518J0569R958J0730J0399Q073N882N750P072Q421
60628F474543R513J0509J1112J1324J1597J1644J0557Q834Q474J0227J2280J2533
60616F603147J0657P425L832J595K170M299M863L423L292O334R630J0022R125
60603F679814J0203J2149J1123P334N431P666J0860J1407R728Q063O918N943N983
60590F792622P742R945J0864J0619J0174R205P054M924M894O768P842O332L689
60577F892674K785M501O871P391N741L910L774N224P046Q788J0523J1380J0183
60564F980791P817P062R109J1778J2392J1075R747R073Q390P968R151J1955J4281
$$ plain form
60551 7110589 7124819 7137043 7147343 7157268 7168137 7179891 7191347 7201535 7210746 7219980 7229610 7239261
60539 7239261 7248869 7258790 7268496 7276351 7281741 7286861 7295254 7308583 7325427 7342935 7358812 7371916 7382209
60526 7382209 7390976 7400599 7413180 7428829 7445336 7459998 7472292 7484686 7500217 7519031 7537733 7552452
60514 7552452 7562154 7568906 7575758 7584954 7597371 7612478 7628702 7644494 7659153 7672472 7684134 7694188
60502 7694188 7703806 7714818 7728383 7744368 7761501 7777624 7790509 7799631 7806895 7814669 7823454 7832571
60490 7832571 7842671 7855726 7872297 7890441 7907980 7924403 7939739 7953068 7963472 7971687 7979646 7988986
60478 7988986 8000746 8015462 8032131 8047881 8060587 8071905 8086111 8105252 8126328 8143917 8155199
60467 8155199 8162188 8169472 8179934 8192352 8202977 8209469 8213014 8216444 8221022 8225955 8230568 8235732 8242972
$$ packed form
60551G110589J4230J2224J0300R925J0869J1754J1456J0188R211R234R630R651
60539G239261R608R921R706P855N390N120Q393J3329J6844J7508J5877J3104J0293
60526G382209Q767R623J2581J5649J6507J4662J2294J2394J5531J8814J8702J4719
60514G552452R702O752O852R196J2417J5107J6224J5792J4659J3319J1662J0054
60502G694188R618J1012J3565J5985J7133J6123J2885R122P264P774Q785R117
60490G832571J0100J3055J6571J8144J7539J6423J5336J3329J0404Q215P959R340
60478G988986J1760J4716J6669J5750J2706J1318J4206J9141K1076J7589J1282
60467H155199O989P284J0462J2418J0625O492L545L430M578M933M613N164P240
$$ plain form
60454 8242972 8253035 8265653 8279873 8294234 8307291 8318676 8329537 8341636 8355976 8372172 8388766
60443 8388766 8404087 8417139 8427992 8437536 8447202 8458801 8473649 8491073 8508451 8523804 8538029 8553390
60431 8553390 8569978 8585121 8596580 8604884 8611752 8617292 8619836 8618015 8612155 8604078 8596188 8590242 8586064
60418 8586064 8581493 8574133 8563098 8548936 8532610 8515303 8498634 8483862 8470706 8457720 8444070 8430435
60406 8430435 8418109 8407764 8399272 8392118 8385592 8378962 8371948 8364912 8358257 8351713 8344658 8337290 8331099
60393 8331099 8327623 8326708 8326466 8325255 8323240 8321500 8320006 8317464 8313288 8308858 8306152 8305571 8305785 8305590 8305367
60378 8305367 8306559 8310063 8315494 8322071 8329834 8339373 8350147 8359876 8366522 8370615 8374677 8380341 8387160 8394395
60364 8394395 8402511 8411895 8421090 8427815 8431690 8434900 8439923 8447114 8454665 8460660 8465278 8471165 8481291 8495929
$$ packed form
60454H242972J0063J2618J4220J4361J3057J1385J0861J2099J4340J6196J6594
60443H388766J5321J3052J0853R544R666J1599J4848J7424J7378J5353J4225J5361
60431H553390J6588J5143J1459Q304O868N540K544j821n860q077p890n946m178
60418H586064m571p360j1035j4162j6326j7307j6669j4772j3156j2986j3650j3635
60406H430435j2326j0345q492p154o526o630p014p036o655o544p055p368o191
60393H331099l476r15k42j211k015j740j494k542m176m430k706n81K14j95k23
60378H305367J192L504N431O577P763R539J0774R729O646M093M062N664O819P235
60364H394395Q116R384R195O725L875L210N023P191P551N995M618N887J0126J4638
$$ plain form
60350 8495929 8511970 8525701 8536127 8545390 8556406 8570506 8586804 8602931 8616538 8626842 8634819 8641724
60338 8641724 8647907 8653677 8660620 8670740 8684080 8698112 8709883 8718591 8726264 8736287 8750639 8767532
60326 8767532 8782250 8791593 8797462 8804601 8814781 8824964 8831971 8837131 8844713 8856731 8871115 8884678
60314 8884678 8896294 8906863 8917634 8929426 8942792 8957899 8974049 8989679 9003238 9014400 9024546
60303 9024546 9035800 9049179 9063654 9077146 9088454 9098126 9107596 9117634 9127824 9137740 9148519 9162461
60291 9162461 9180278 9199167 9214861 9225815 9234229 9242715 9251507 9259957 9269131 9280813 9294490 9307563
60279 9307563 9318802 9329662 9341486 9353193 9363169 9372161 9382485 9394660 9406522 9416000 9423678 9431968
60267 9431968 9442313 9453746 9464031 9471971 9478696 9486790 9498121 9512504 9528405 9544402 9559570 9572965
$$ packed form
60350H495929J6041J3731J0426R263J1016J4100J6298J6127J3607J0304P977O905
60338H641724O183N770O943J0120J3340J4032J1771Q708P673J0023J4352J6893
60326H767532J4718R343N869P139J0180J0183P007N160P582J2018J4384J3563
60314H884678J1616J0569J0771J1792J3366J5107J6150J5630J3559J1162J0146
60303I024546J1254J3379J4475J3492J1308R672R470J0038J0190R916J0779J3942
60291I162461J7817J8889J5694J0954Q414Q486Q792Q450R174J1682J3677J3073
60279I307563J1239J0860J1824J1707R976Q992J0324J2175J1862R478P678Q290
60267I431968J0345J1433J0285P940O725Q094J1331J4383J5901J5997J5168J3395
$$ plain form
60255 9572965 9583855 9592875 9602301 9614491 9629980 9647252 9664264 9680005 9694718 9708941 9722596 9735183
60243 9735183 9746716 9758040 9769957 9782372 9794715 9806845 9818737 9829432 9837336 9842089 9845410 9849466
60231 9849466 9854843 9860787 9866971 9874090 9882670 9892232 9902034 9912117 9922992 9934392 9944805 9952551 9957315
60218 9957315 9960371 9963241 9966418 9969757 9973788 9979882 9988953 10000640 10013965 10028051 10041773 10053623 10062916
60205 10062916 10070831 10079426 10089796 10101776 10114844 10128259 10140584 10150491 10158435 10166638 10177022 10189646
60193 10189646 10203179 10216148 10227769 10238526 10250117 10263806 10278558 10291805 10302437 10311970 10322316
60182 10322316 10333641 10345186 10356979 10369460 10382260 10394827 10407764 10422120 10437312 10451076 10461963
60171 10461963 10471231 10481814 10495495 10511031 10524905 10534461 10540742 10547873 10559180 10574316 10590458 10605406
$$ packed form
60255I572965J0890R020R426J2190J5489J7272J7012J5741J4713J4223J3655J2587
60243I735183J1533J1324J1917J2415J2343J2130J1892J0695P904M753L321M056
60231I849466N377N944O184P119Q580R562R802J0083J0875J1400J0413P746M764
60218I957315L056K870L177L339M031O094R071J1687J3325J4086J3722J1850R293
60205A0062916P915Q595J0370J1980J3068J3415J2325R907P944Q203J0384J2624
60193A0189646J3533J2969J1621J0757J1591J3689J4752J3247J0632R533J0346
60182A0322316J1325J1545J1793J2481J2800J2567J2937J4356J5192J3764J0887
60171A0461963R268J0583J3681J5536J3874R556O281P131J1307J5136J6142J4948
$$ plain form
60159 10605406 10618681 10630642 10642157 10654963 10670700 10689139 10708235 10726225 10742852 10758524 10773319
60148 10773319 10787223 10800489 10813342 10825846 10838351 10851453 10865264 10879306 10893293 10907496 10922226
60137 10922226 10937490 10953077 10968211 10981223 10990941 10998948 11009314 11024935 11044504 11063806 11079704
60126 11079704 11092340 11103999 11116693 11130789 11145161 11158276 11169325 11178528 11186742 11195132 11204992 11216963
60114 11216963 11230108 11242559 11253627 11264607 11276766 11289210 11299941 11308983 11319185 11333385 11351488
60103 11351488 11370878 11389098 11405242 11419111 11430375 11439330 11447813 11458203 11471215 11485196 11497866
60092 11497866 11508482 11518198 11528766 11541105 11554794 11568729 11582459 11596755 11612288 11627901 11641471
60081 11641471 11652960 11665226 11680475 11697044 11711531 11723552 11736115 11751018 11766335 11779955 11793683
$$ packed form
60159A0605406J3275J1961J1515J2806J5737J8439J9096J7990J6627J5672J4795
60148A0773319J3904J3266J2853J2504J2505J3102J3811J4042J3987J4203J4730
60137A0922226J5264J5587J5134J3012R718Q007J0366J5621J9569J9302J5898
60126A1079704J2636J1659J2694J4096J4372J3115J1049R203Q214Q390R860J1971
60114A1216963J3145J2451J1068J0980J2159J2444J0731R042J0202J4200J8103
60103A1351488J9390J8220J6144J3869J1264Q955Q483J0390J3012J3981J2670
60092A1497866J0616R716J0568J2339J3689J3935J3730J4296J5533J5613J3570
60081A1641471J1489J2266J5249J6569J4487J2021J2563J4903J5317J3620J3728
$$ plain form
60070 11793683 11811248 11832487 11852009 11864854 11872310 11880654 11894547 11913103 11932467 11950459 11967311
60059 11967311 11983152 11997129 12009205 12020822 12033090 12045799 12058882 12073126 12088392 12103036 12116496
60048 12116496 12130527 12145854 12159575 12168803 12175569 12184757 12197793 12211869 12225220 12239254 12254683 12269339
60036 12269339 12281432 12291963 12302313 12312391 12322962 12336697 12354262 12371895 12385615 12395941 12405834
60025 12405834 12416159 12426350 12437784 12452617 12469936 12486429 12500694 12514010 12527138 12539330 12550619
60014 12550619 12562223 12574210 12585176 12594723 12604152 12614402 12625264 12636728 12648867 12660203 12668501 12673841
60002 12673841 12679017 12686516 12696819 12709490 12723592 12736941 12747636 12757012 12768728 12784321 12801787 12818684
59990 12818684 12833834 12845896 12854190 12862229 12876380 12898341 12921987 12940573 12954504 12969012 12986634
$$ packed form
60070A1793683J7565K1239J9522J2845P456Q344J3893J8556J9364J7992J6852
60059A1967311J5841J3977J2076J1617J2268J2709J3083J4244J5266J4644J3460
60048A2116496J4031J5327J3721R228O766R188J3036J4076J3351J4034J5429J4656
60036A2269339J2093J0531J0350J0078J0571J3735J7565J7633J3720J0326R893
60025A2405834J0325J0191J1434J4833J7319J6493J4265J3316J3128J2192J1289
60014A2550619J1604J1987J0966R547R429J0250J0862J1464J2139J1336Q298N340
60002A2673841N176P499J0303J2671J4102J3349J0695R376J1716J5593J7466J6897
59990A2818684J5150J2062Q294Q039J4151K1961K3646J8586J3931J4508J7622
$$ plain form
59979 12986634 13005640 13024214 13042234 13059613 13076293 13093618 13112605 13131016 13145141 13154477 13161980
59968 13161980 13169766 13177665 13186299 13198197 13214335 13232051 13248111 13262242 13276480 13292381 13309912 13327586
59956 13327586 13342707 13353125 13360200 13368781 13382600 13400282 13417118 13430186 13440548 13450940 13462888
59945 13462888 13476390 13491335 13508240 13527346 13547255 13565189 13579371 13591147 13604185 13621406 13642940
59934 13642940 13666773 13690608 13713154 13734448 13755248 13775896 13795928 13814994 13833369 13850825 13866006
59923 13866006 13878384 13890197 13904522 13921568 13938775 13954759 13970992 13988939 14007647 14025442 14042401
59912 14042401 14059755 14078089 14097486 14118320 14140444 14162379 14182639 14201320 14219362 14237171 14255089
59901 14255089 14274247 14295267 14316744 14336582 14354519 14371882 14389226 14405891 14421890 14438512 14456537
$$ packed form
59979A2986634J9006J8574J8020J7379J6680J7325J8987J8411J4125R336P503
59968A3161980P786P899Q634J1898J6138J7716J6060J4131J4238J5901J7531J7674
59956A3327586J5121J0418P075Q581J3819J7682J6836J3068J0362J0392J1948
59945A3462888J3502J4945J6905J9106J9909J7934J4182J1776J3038J7221K1534
59934A3642940K3833K3835K2546K1294K0800K0648K0032J9066J8375J7456J5181
59923A3866006J2378J1813J4325J7046J7207J5984J6233J7947J8708J7795J6959
59912A4042401J7354J8334J9397K0834K2124K1935K0260J8681J8042J7809J7918
59901A4255089J9158K1020K1477J9838J7937J7363J7344J6665J5999J6622J8025
$$ plain form
59890 14456537 14474966 14492097 14507269 14521435 14536644 14554805 14576167 14598998 14621426 14643257 14665270
59879 14665270 14687378 14708847 14729956 14751887 14774977 14798519 14822258 14846286 14869148 14888172 14902973
59868 14902973 14917229 14935451 14958513 14983300 15006156 15025887 15044066 15063366 15085264 15108641 15130968
59857 15130968 15151262 15171155 15192605 15215511 15238510 15261106 15283629 15305649 15326071 15344993 15364230
59846 15364230 15385604 15409298 15433887 15457307 15477952 15495939 15513616 15533936 15557875 15583994 15610722
59835 15610722 15638138 15666811 15695468 15720972 15741007 15756526 15771249 15788604 15809097 15830681 15851618
59824 15851618 15872610 15895782 15921817 15948772 15973803 15995563 16014670 16032483 16050213 16069077 16090335
59813 16090335 16114322 16139637 16164099 16186836 16208978 16231792 16254649 16275755 16294780 16313770 16335031
$$ packed form
59890A4456537J8429J7131J5172J4166J5209J8161K1362K2831K2428K1831K2013
59879A4665270K2108K1469K1109K1931K3090K3542K3739K4028K2862J9024J4801
59868A4902973J4256J8222K3062K4787K2856J9731J8179J9300K1898K3377K2327
59857A5130968K0294J9893K1450K2906K2999K2596K2523K2020K0422J8922J9237
59846A5364230K1374K3694K4589K3420K0645J7987J7677K0320K3939K6119K6728
59835A5610722K7416K8673K8657K5504K0035J5519J4723J7355K0493K1584K0937
59824A5851618K0992K3172K6035K6955K5031K1760J9107J7813J7730J8864K1258
59813A6090335K3987K5315K4462K2737K2142K2814K2857K1106J9025J8990K1261
$$ plain form
59802 16335031 16358955 16384459 16410716 16437394 16463536 16487434 16508067 16526229 16544057 16563575 16585390
59791 16585390 16608143 16629308 16647294 16663145 16679810 16699488 16721861 16744864 16766810 16787639 16808542
59780 16808542 16830746 16854507 16878841 16902039 16922648 16940444 16956858 16974128 16993419 17013724 17033189
59769 17033189 17051525 17070207 17090089 17110115 17129313 17148919 17170919 17194761 17217065 17234884 17248371
59758 17248371 17260254 17273779 17291290 17313466 17338949 17364932 17388552 17408078 17423837 17438956 17458260
59747 17458260 17484364 17514530 17542869 17566015 17585354 17603807 17622754 17642906 17665535 17690539 17714783
59736 17714783 17735023 17752175 17770652 17793461 17819552 17845969 17870905 17894342 17917226 17940731 17965394
59725 17965394 17990433 18014590 18037935 18062170 18088839 18117641 18146450 18172551 18194369 18212959 18231599
$$ packed form
59802A6335031K3924K5504K6257K6678K6142K3898K0633J8162J7828J9518K1815
59791A6585390K2753K1165J7986J5851J6665J9678K2373K3003K1946K0829K0903
59780A6808542K2204K3761K4334K3198K0609J7796J6414J7270J9291K0305J9465
59769A7033189J8336J8682J9882K0026J9198J9606K2000K3842K2304J7819J3487
59758A7248371J1883J3525J7511K2176K5483K5983K3620J9526J5759J5119J9304
59747A7458260K6104L0166K8339K3146J9339J8453J8947K0152K2629K5004K4244
59736A7714783K0240J7152J8477K2809K6091K6417K4936K3437K2884K3505K4663
59725A7965394K5039K4157K3345K4235K6669K8802K8809K6101K1818J8590J8640
$$ plain form
59714 18231599 18252856 18276212 18299620 18322980 18348341 18376557 18405727 18433698 18460430 18486788 18512493
59703 18512493 18536747 18559730 18581978 18603140 18623076 18643483 18666468 18691670 18716762 18741068 18766858
59692 18766858 18796210 18827952 18858701 18885983 18909520 18930548 18951187 18973906 19000122 19029029 19058487
59681 19058487 19087147 19115200 19143231 19171084 19198033 19223520 19247612 19271040 19294749 19318930 19342526
59670 19342526 19364300 19384398 19404366 19425632 19448634 19473447 19500198 19528308 19556141 19582276 19606787
59659 19606787 19630604 19654150 19677459 19701208 19726380 19752642 19778074 19801167 19822746 19845362 19870889
59648 19870889 19898905 19927427 19955150 19982737 20011635 20041812 20071432 20098946 20124498 20148793 20171980
59637 20171980 20194911 20220162 20249501 20280784 20309828 20335563 20360943 20388242 20416194 20443238 20470902
$$ packed form
59714A8231599K1257K3356K3408K3360K5361K8216K9170K7971K6732K6358K5705
59703A8512493K4254K2983K2248K1162J9936K0407K2985K5202K5092K4306K5790
59692A8766858K9352L1742L0749K7282K3537K1028K0639K2719K6216K8907K9458
59681A9058487K8660K8053K8031K7853K6949K5487K4092K3428K3709K4181K3596
59670A9342526K1774K0098J9968K1266K3002K4813K6751K8110K7833K6135K4511
59659A9606787K3817K3546K3309K3749K5172K6262K5432K3093K1579K2616K5527
59648A9870889K8016K8522K7723K7587K8898L0177K9620K7514K5552K4295K3187
59637B0171980K2931K5251K9339L1283K9044K5735K5380K7299K7952K7044K7664
$$ plain form
59626 20470902 20501514 20534211 20565862 20594894 20621680 20646110 20667977 20689761 20715709 20746921 20779457
59615 20779457 20808648 20833722 20857272 20881824 20908265 20936285 20964812 20992626 21019643 21047166 21076168
59604 21076168 21105973 21135191 21163148 21189896 21215991 21242996 21272829 21305431 21338234 21369312 21399807
59593 21399807 21431478 21462989 21491118 21515315 21538421 21562618 21587322 21612083 21639024 21670254 21704427
59582 21704427 21738145 21770064 21801498 21833366 21864808 21895109 21924948 21954958 21984725 22014316 22045313
59571 22045313 22078856 22113675 22147672 22180687 22213928 22247175 22278757 22308452 22338099 22368538 22398100
59560 22398100 22425699 22453492 22484193 22516653 22546687 22572401 22596716 22624127 22656608 22693310 22732552
59549 22732552 22772675 22811653 22847348 22878729 22906775 22934184 22963923 22997515 23034689 23074648 23116867
$$ packed form
59626B0470902L0612L2697L1651K9032K6786K4430K1867K1784K5948L1212L2536
59615B0779457K9191K5074K3550K4552K6441K8020K8527K7814K7017K7523K9002
59604B1076168K9805K9218K7957K6748K6095K7005K9833L2602L2803L1078L0495
59593B1399807L1671L1511K8129K4197K3106K4197K4704K4761K6941L1230L4173
59582B1704427L3718L1919L1434L1868L1442L0301K9839L0010K9767K9591L0997
59571B2045313L3543L4819L3997L3015L3241L3247L1582K9695K9647L0439K9562
59560B2398100K7599K7793L0701L2460L0034K5714K4315K7411L2481L6702L9242
59549B2732552M0123L8978L5695L1381K8046K7409K9739L3592L7174L9959M2219
$$ plain form
59538 23116867 23159974 23201072 23237975 23271819 23305555 23339883 23372865 23404059 23436510 23472985 23511904
59527 23511904 23548956 23581796 23611534 23640547 23670797 23703836 23740365 23779330 23818599 23856867 23894249
59516 23894249 23931352 23968695 24006639 24044742 24081492 24115910 24149233 24183661 24219443 24254561 24287520
59505 24287520 24319237 24351767 24386292 24422922 24461573 24502237 24544573 24587523 24629337 24668591 24705811
59494 24705811 24743545 24783762 24825466 24866001 24904278 24941353 24978393 25016082 25056057 25100444 25148927
59483 25148927 25198096 25244943 25289527 25333067 25375155 25414662 25452228 25489916 25529032 25569849 25612686
59472 25612686 25657369 25702096 25744930 25786491 25829415 25874906 25921409 25966952 26011055 26053750 26094353
59461 26094353 26132402 26168801 26205023 26241792 26279252 26317792 26357983 26400179 26444569 26490931 26537809
$$ packed form
59538B3116867M3107M1098L6903L3844L3736L4328L2982L1194L2451L6475L8919
59527B3511904L7052L2840K9738K9013L0250L3039L6529L8965L9269L8268L7382
59516B3894249L7103L7343L7944L8103L6750L4418L3323L4428L5782L5118L2959
59505B4287520L1717L2530L4525L6630L8651M0664M2336M2950M1814L9254L7220
59494B4705811L7734M0217M1704M0535L8277L7075L7040L7689L9975M4387M8483
59483B5148927M9169M6847M4584M3540M2088L9507L7566L7688L9116M0817M2837
59472B5612686M4683M4727M2834M1561M2924M5491M6503M5543M4103M2695M0603
59461B6094353L8049L6399L6222L6769L7460L8540M0191M2196M4390M6362M6878
$$ plain form
59450 26537809 26582807 26624569 26664001 26702945 26742359 26782565 26824374 26868547 26914278 26959391 27002162
59439 27002162 27042255 27080057 27116260 27152389 27190737 27233023 27279203 27327656 27376195 27423080 27467810
59428 27467810 27511179 27554150 27596782 27638788 27680928 27724694 27770249 27815683 27858994 27900201 27940900
59417 27940900 27982438 28025368 28070222 28117685 28167824 28219619 28271347 28321139 28367444 28409676 28448711
59406 28448711 28486586 28525575 28567300 28612132 28659125 28706916 28755000 28803704 28852786 28901016 28947908
59395 28947908 28994920 29043626 29093170 29141052 29186449 29231273 29277555 29325192 29372902 29420212 29467563
59384 29467563 29515337 29563830 29613470 29663932 29713352 29759585 29802313 29843277 29884533 29927226 29971868
59373 29971868 30018723 30067454 30116991 30166324 30215265 30264282 30313806 30363908 30414493 30465571 30517147
$$ packed form
59450B6537809M4998M1762L9432L8944L9414M0206M1809M4173M5731M5113M2771
59439B7002162M0093L7802L6203L6129L8348M2286M6180M8453M8539M6885M4730
59428B7467810M3369M2971M2632M2006M2140M3766M5555M5434M3311M1207M0699
59417B7940900M1538M2930M4854M7463N0139N1795N1728M9792M6305M2232L9035
59406B8448711L7875L8989M1725M4832M6993M7791M8084M8704M9082M8230M6892
59395B8947908M7012M8706M9544M7882M5397M4824M6282M7637M7710M7310M7351
59384B9467563M7774M8493M9640N0462M9420M6233M2728M0964M1256M2693M4642
59373B9971868M6855M8731M9537M9333M8941M9017M9524N0102N0585N1078N1576
$$ plain form
59362 30517147 30568761 30619259 30667469 30713504 30759227 30807087 30858366 30912563 30968221 31024075 31079637
59351 31079637 31134911 31189492 31242081 31291530 31338764 31386901 31438454 31492514 31545631 31595525 31643109
59340 31643109 31690704 31739337 31788485 31837638 31886927 31936274 31984823 32031584 32076197 32118934 32160373
59329 32160373 32201430 32243419 32287575 32334270 32382592 32430663 32476696 32520474 32564110 32610854 32662314
59318 32662314 32716790 32770829 32822413 32872120 32921248 32969834 33017079 33062934 33108320 33154030 33200366
59307 33200366 33247842 33297544 33350590 33407519 33467833 33529365 33588466 33642243 33691277 33739454 33790748
59296 33790748 33846671 33906676 33969429 34032724 34093531 34149969 34203228 34256298 34310666 34365165 34418224
59285 34418224 34470312 34523764 34580821 34642165 34706762 34772488 34837034 34898714 34956810 35011563 35064136
$$ packed form
59362C0517147N1614N0498M8210M6035M5723M7860N1279N4197N5658N5854N5562
59351C1079637N5274N4581N2589M9449M7234M8137N1553N4060N3117M9894M7584
59340C1643109M7595M8633M9148M9153M9289M9347M8549M6761M4613M2737M1439
59329C2160373M1057M1989M4156M6695M8322M8071M6033M3778M3636M6744N1460
59318C2662314N4476N4039N1584M9707M9128M8586M7245M5855M5386M5710M6336
59307C3200366M7476M9702N3046N6929O0314O1532N9101N3777M9034M8177N1294
59296C3790748N5923O0005O2753O3295O0807N6438N3259N3070N4368N4499N3059
59285C4418224N2088N3452N7057O1344O4597O5726O4546O1680N8096N4753N2573
$$ plain form
59274 35064136 35116332 35169667 35224318 35279091 35332571 35384339 35435138 35486110 35538023 35591315 35646680
59263 35646680 35705055 35766444 35828779 35888693 35943857 35994480 36042734 36091466 36143394 36200057 36260309
59252 36260309 36320502 36377401 36430791 36482413 36533165 36583072 36633776 36688618 36748851 36811235 36871213
59241 36871213 36927985 36984833 37044515 37105982 37166115 37223277 37278051 37331397 37383631 37435153 37486856
59230 37486856 37539324 37592558 37647076 37704408 37765417 37828504 37890579 37950014 38007756 38065386 38123036
59219 38123036 38180009 38236910 38296088 38359537 38426571 38493965 38558672 38620416 38681401 38743630 38807248
59208 38807248 38871689 38937125 39003420 39068633 39130761 39191274 39254810 39324098 39396421 39466213 39530294
59197 39530294 39589663 39647520 39707147 39770969 39839572 39911194 39983152 40053883 40122946 40189600 40252906
$$ packed form
59274C5064136N2196N3335N4651N4773N3480N1768N0799N0972N1913N3292N5365
59263C5646680N8375O1389O2335N9914N5164N0623M8254M8732N1928N6663O0252
59252C6260309O0193N6899N3390N1622N0752M9907N0704N4842O0233O2384N9978
59241C6871213N6772N6848N9682O1467O0133N7162N4774N3346N2234N1522N1703
59230C7486856N2468N3234N4518N7332O1009O3087O2075N9435N7742N7630N7650
59219C8123036N6973N6901N9178O3449O7034O7394O4707O1744O0985O2229O3618
59208C8807248O4441O5436O6295O5213O2128O0513O3536O9288P2323O9792O4081
59197C9530294N9369N7857N9627O3822O8603P1622P1958P0731O9063O6654O3306
$$ plain form
59186 40252906 40313540 40374338 40438332 40506506 40577414 40648284 40716538 40781305 40844288 40908844 40977503
59175 40977503 41049848 41122668 41192427 41258222 41322540 41388807 41458212 41529336 41600581 41671840 41743708
59164 41743708 41816477 41890438 41965766 42041280 42114779 42185671 42255902 42326896 42397123 42464583 42530346
59153 42530346 42597206 42665625 42733719 42801066 42869769 42941188 43013881 43085712 43156393 43227177 43299253
59142 43299253 43372884 43446977 43519471 43589577 43659491 43732149 43807355 43882291 43955950 44030442 44107154
59131 44107154 44184260 44259438 44332888 44406108 44479647 44553764 44629447 44706735 44783572 44858378 44932603
59120 44932603 45008604 45086045 45162671 45237921 45313416 45390129 45467385 45544868 45623569 45704078 45785321
59109 45785321 45865568 45943714 46019459 46093434 46167586 46244256 46323960 46404538 46483084 46558627 46632788
$$ packed form
59186D0252906O0634O0798O3994O8174P0908P0870O8254O4767O2983O4556O8659
59175D0977503P2345P2820O9759O5795O4318O6267O9405P1124P1245P1259P1868
59164D1743708P2769P3961P5328P5514P3499P0892P0231P0994P0227O7460O5763
59153D2530346O6860O8419O8094O7347O8703P1419P2693P1831P0681P0784P2076
59142D3299253P3631P4093P2494P0106O9914P2658P5206P4936P3659P4492P6712
59131D4107154P7106P5178P3450P3220P3539P4117P5683P7288P6837P4806P4225
59120D4932603P6001P7441P6626P5250P5495P6713P7256P7483P8701Q0509Q1243
59109D5785321Q0247P8146P5745P3975P4152P6670P9704Q0578P8546P5543P4161
$$ plain form
59098 46632788 46708086 46785797 46865368 46945566 47025765 47105936 47186098 47266847 47349959 47436743 47525213
59087 47525213 47610430 47688950 47762230 47834607 47908534 47982788 48054981 48124913 48195490 48270767 48352686
59076 48352686 48439413 48527222 48613883 48699284 48783069 48863809 48941481 49018981 49099531 49183497 49269020
59065 49269020 49354715 49440187 49524880 49608294 49691222 49775529 49862795 49953781 50048411 50145232 50241637
59054 50241637 50335779 50427728 50518207 50607430 50696169 50786315 50878595 50970918 51060828 51148675 51236635
59043 51236635 51325685 51415501 51506054 51596901 51685861 51771183 51854573 51939521 52026987 52115308 52203819
59032 52203819 52293516 52384183 52474071 52562809 52651587 52739984 52825979 52910222 52997064 53089473 53185440
59021 53185440 53281016 53374472 53465673 53554022 53639637 53724878 53812159 53901210 53990476 54080165 54171924
$$ packed form
59098D6632788P5298P7711P9571Q0198Q0199Q0171Q0162Q0749Q3112Q6784Q8470
59087D7525213Q5217P8520P3280P2377P3927P4254P2193O9932P0577P5277Q1919
59076D8352686Q6727Q7809Q6661Q5401Q3785Q0740P7672P7500Q0550Q3966Q5523
59065D9269020Q5695Q5472Q4693Q3414Q2928Q4307Q7266R0986R4630R6821R6405
59054E0241637R4142R1949R0479Q9223Q8739R0146R2280R2323Q9910Q7847Q7960
59043E1236635Q9050Q9816R0553R0847Q8960Q5322Q3390Q4948Q7466Q8321Q8511
59032E2203819Q9697R0667Q9888Q8738Q8778Q8397Q5995Q4243Q6842R2409R5967
59021E3185440R5576R3456R1201Q8349Q5615Q5241Q7281Q9051Q9266Q9689R1759
$$ plain form
59010 54171924 54266237 54361859 54457313 54551773 54645414 54739922 54837413 54937537 55036948 55133028 55226695
58999 55226695 55320083 55413304 55505679 55598471 55693498 55789976 55885689 55980865 56077901 56177196 56276089
58988 56276089 56372693 56468488 56566250 56667204 56770831 56875703 56979795 57081722 57182518 57284780
58978 57284780 57389355 57494347 57597951 57700494 57802824 57904686 58006247 58109423 58215538
58969 58215538 58322555 58426968 58528323 58629984 58735165 58843730 58953259 59061909 59169529
58960 59169529 59276984 59385232 59494671 59604840 59714980 59824958 59935039 60044609 60152024
58951 60152024 60256345 60358738 60461641 60566950 60675312 60786184 60897644 61007026 61113308
58942 61113308 61218683 61326259 61436210 61545860 61653839 61762181 61873375 61987246 62102142
$$ packed form
59010E4171924R4313R5622R5454R4460R3641R4508R7491J00124R9411R6080R3667
58999E5226695R3388R3221R2375R2792R5027R6478R5713R5176R7036R9295R8893
58988E6276089R6604R5795R7762J00954J03627J04872J04092J01927J00796J02262
58978E7284780J04575J04992J03604J02543J02330J01862J01561J03176J06115
58969E8215538J07017J04413J01355J01661J05181J08565J09529J08650J07620
58960E9169529J07455J08248J09439J10169J10140J09978J10081J09570J07415
58951F0152024J04321J02393J02903J05309J08362J10872J11460J09382J06282
58942F1113308J05375J07576J09951J09650J07979J08342J11194J13871J14896
$$ plain form
58933 62102142 62217431 62332654 62445653 62554505 62660996 62769350 62881023 62993213 63103237
58924 63103237 63211962 63321618 63432410 63543139 63653704 63765014 63877286 63990311 64104833
58915 64104833 64221952 64341355 64461499 64581421 64701187 64820690 64939135 65055753 65170290
58906 65170290 65283138 65395804 65510577 65628405 65747444 65865132 65981527 66098893 66217775
58897 66217775 66335391 66449027 66559711 66671066 66785111 66900654 67015829 67130854 67247424
58888 67247424 67365985 67484675 67601301 67715860 67830583 67947586 68066852 68186491 68304598
58879 68304598 68420850 68536616 68653598 68772320 68892190 69013196 69136529 69262540 69388824
58870 69388824 69512113 69632141 69751967 69874200 69998604 70123920 70249905 70376416 70502608
$$ packed form
58933F2102142J15289J15223J12999J08852J06491J08354J11673J12190J10024
58924F3103237J08725J09656J10792J10729J10565J11310J12272J13025J14522
58915F4104833J17119J19403J20144J19922J19766J19503J18445J16618J14537
58906F5170290J12848J12666J14773J17828J19039J17688J16395J17366J18882
58897F6217775J17616J13636J10684J11355J14045J15543J15175J15025J16570
58888F7247424J18561J18690J16626J14559J14723J17003J19266J19639J18107
58879F8304598J16252J15766J16982J18722J19870J21006J23333J26011J26284
58870F9388824J23289J20028J19826J22233J24404J25316J25985J26511J26192
$$ plain form
58861 70502608 70628954 70758351 70892780 71029902 71165390 71297941 71429414 71560535 71689586
58852 71689586 71815945 71942049 72070442 72200726 72330790 72459653 72587981 72717070 72848418
58843 72848418 72983098 73120356 73257757 73393696 73528923 73664794 73801175 73937148 74072579
58834 74072579 74207540 74341117 74472533 74603012 74734905 74869060 75004394 75139937 75275812
58825 75275812 75412067 75548015 75683392 75819056 75955699 76092623 76228568 76363319 76497700
58816 76497700 76632085 76765656 76897391 77027504 77157540 77289122 77422892 77558735 77696323
58807 77696323 77834569 77970774 78101821 78227219 78350394 78476004 78606130 78739560 78874083
58798 78874083 79008287 79141683 79274845 79409866 79549100 79692408 79836612 79978664 80118623
$$ packed form
58861G0502608J26346J29397J34429J37122J35488J32551J31473J31121J29051
58852G1689586J26359J26104J28393J30284J30064J28863J28328J29089J31348
58843G2848418J34680J37258J37401J35939J35227J35871J36381J35973J35431
58834G4072579J34961J33577J31416J30479J31893J34155J35334J35543J35875
58825G5275812J36255J35948J35377J35664J36643J36924J35945J34751J34381
58816G6497700J34385J33571J31735J30113J30036J31582J33770J35843J37588
58807G7696323J38246J36205J31047J25398J23175J25610J30126J33430J34523
58798G8874083J34204J33396J33162J35021J39234J43308J44204J42052J39959
$$ plain form
58789 80118623 80258368 80398159 80536193 80671702 80806895 80944923 81086600 81229986 81372752
58780 81372752 81514202 81655076 81796095 81937079 82077367 82216948 82357041 82499367 82644750
58771 82644750 82792582 82941637 83091123 83240789 83390400 83539626 83688559 83838116 83989594
58762 83989594 84143610 84299466 84455924 84612757 84770825 84929944 85087408 85240263 85389273
58753 85389273 85539120 85693944 85853783 86015965 86178360 86339927 86499638 86657169 86814151
58744 86814151 86972680 87132754 87292915 87452846 87612967 87771822 87927209 88080899 88238969
58735 88238969 88405333 88577137 88748871 88919037 89090018 89262899 89436018 89608369 89780975
58726 89780975 89953930 90124729 90291223 90454784 90619156 90786874 90957760 91130215 91303115
$$ packed form
58789H0118623J39745J39791J38034J35509J35193J38028J41677J43386J42766
58780H1372752J41450J40874J41019J40984J40288J39581J40093J42326J45383
58771H2644750J47832J49055J49486J49666J49611J49226J48933J49557J51478
58762H3989594J54016J55856J56458J56833J58068J59119J57464J52855J49010
58753H5389273J49847J54824J59839J62182J62395J61567J59711J57531J56982
58744H6814151J58529J60074J60161J59931J60121J58855J55387J53690J58070
58735H8238969J66364J71804J71734J70166J70981J72881J73119J72351J72606
58726H9780975J72955J70799J66494J63561J64372J67718J70886J72455J72900
$$ plain form
58717 91303115 91476563 91651125 91826434 92001083 92174552 92348630 92525601 92705245 92885156
58708 92885156 93064095 93243404 93424614 93607328 93790462 93974353 94160413 94349280 94540140
58699 94540140 94731127 94919734 95103868 95283703 95462008 95641599 95822796 96004169 96185074
58690 96185074 96366128 96547418 96727791 96906539 97084956 97265423 97449013 97634290 97818672
58681 97818672 98001228 98184127 98370809 98562322 98755956 98947952 99137206 99325747 99516107
58672 99516107 99709196 99904527 100101177 100297830 100492702 100684568 100874153 101064132 101257337
58663 101257337 101454733 101654963 101855764 102055698 102254578 102452686 102650319 102848078 103046765
58654 103046765 103246436 103446304 103646469 103849186 104057047 104269764 104483993 104696858 104908548
$$ packed form
58717I1303115J73448J74562J75309J74649J73469J74078J76971J79644J79911
58708I2885156J78939J79309J81210J82714J83134J83891J86060J88867J90860
58699I4540140J90987J88607J84134J79835J78305J79591J81197J81373J80905
58690I6185074J81054J81290J80373J78748J78417J80467J83590J85277J84382
58681I7818672J82556J82899J86682J91513J93634J91996J89254J88541J90360
58672I9516107J93089J95331J96650J96653J94872J91866J89585J89979J93205
58663A01257337J97396K00230K00801J99934J98880J98108J97633J97759J98687
58654A03046765J99671J99868K00165K02717K07861K12717K14229K12865K11690
$$ plain form
58645 104908548 105120676 105333290 105545163 105756476 105969143 106183990 106399341 106613628 106828260
58636 106828260 107046334 107268921 107494003 107718833 107942045 108163481 108383619 108603845 108826009
58627 108826009 109050658 109276268 109500898 109724151 109947122 110171035 110396239 110621672 110844918
58618 110844918 111064055 111280280 111497497 111718225 111941139 112163889 112386744 112611175 112836045
58609 112836045 113058422 113278218 113498844 113722332 113946559 114168942 114390551 114614476 114841856
58600 114841856 115071768 115303556 115536452 115767761 115994731 116218889 116445803 116679097 116916244
58591 116916244 117151592 117382281 117609895 117837498 118066931 118298739 118532855 118768619 119005042
58582 119005042 119241709 119478921 119716670 119954105 120190620 120426978 120664703 120904571 121146324
$$ packed form
58645A04908548K12128K12614K11873K11313K12667K14847K15351K14287K14632
58636A06828260K18074K22587K25082K24830K23212K21436K20138K20226K22164
58627A08826009K24649K25610K24630K23253K22971K23913K25204K25433K23246
58618A10844918K19137K16225K17217K20728K22914K22750K22855K24431K24870
58609A12836045K22377K19796K20626K23488K24227K22383K21609K23925K27380
58600A14841856K29912K31788K32896K31309K26970K24158K26914K33294K37147
58591A16916244K35348K30689K27614K27603K29433K31808K34116K35764K36423
58582A19005042K36667K37212K37749K37435K36515K36358K37725K39868K41753
$$ plain form
58573 121146324 121389550 121633889 121878385 122121724 122363692 122605547 122848313 123091464 123334250
58564 123334250 123577818 123824756 124076224 124330266 124583373 124833620 125082552 125334206 125591701
58555 125591701 125853976 126116126 126373772 126627020 126879652 127135098 127394278 127656799 127922369
58546 127922369 128190543 128460456 128731491 129003350 129275177 129545834 129815699 130086965 130361187
58537 130361187 130637216 130912368 131185006 131455491 131725535 131997424 132272931 132551893 132832328
58528 132832328 133112726 133393561 133675889 133959564 134244113 134530404 134819628 135110977 135402139
58519 135402139 135692336 135983286 136276736 136572446 136869258 137166847 137465269 137763617 138060641
58510 138060641 138356713 138653903 138953342 139252981 139549013 139839895 140128479 140419642 140716188
$$ packed form
58573A21146324K43226K44339K44496K43339K41968K41855K42766K43151K42786
58564A23334250K43568K46938K51468K54042K53107K50247K48932K51654K57495
58555A25591701K62275K62150K57646K53248K52632K55446K59180K62521K65570
58546A27922369K68174K69913K71035K71859K71827K70657K69865K71266K74222
58537A30361187K76029K75152K72638K70485K70044K71889K75507K78962K80435
58528A32832328K80398K80835K82328K83675K84549K86291K89224K91349K91162
58519A35402139K90197K90950K93450K95710K96812K97589K98422K98348K97024
58510A38060641K96072K97190K99439K99639K96032K90882K88584K91163K96546
$$ plain form
58501 140716188 141017697 141322841 141631217 141942428 142254665 142565439 142873279 143178058 143480237
58492 143480237 143780686 144080616 144380677 144680367 144979162 145277750 145577069 145876497 146174216
58483 146174216 146469344 146762512 147054337 147344629 147633682 147923291 148215682 148511752 148810777
58474 148810777 149111620 149413994 149718828 150027491 150340619 150657768 150978206 151301181 151624828
58465 151624828 151945747 152261136 152571365 152879470 153188236 153498735 153811268 154125880 154441340
58456 154441340 154755068 155065135 155371901 155677395 155983882 156293159 156605856 156920468 157233831
58447 157233831 157543482 157849363 158153133 158456759 158762220 159071431 159385343 159703616 160025758
58438 160025758 160351858 160681669 161014005 161348055 161684420 162023673 162364630 162705429 163045899
$$ packed form
58501A40716188L01509L05144L08376L11211L12237L10774L07840L04779L02179
58492A43480237L00449K99930L00061K99690K98795K98588K99319K99428K97719
58483A46174216K95128K93168K91825K90292K89053K89609K92391K96070K99025
58474A48810777L00843L02374L04834L08663L13128L17149L20438L22975L23647
58465A51624828L20919L15389L10229L08105L08766L10499L12533L14612L15460
58456A54441340L13728L10067L06766L05494L06487L09277L12697L14612L13363
58447A57233831L09651L05881L03770L03626L05461L09211L13912L18273L22142
58438A60025758L26100L29811L32336L34050L36365L39253L40957L40799L40470
$$ plain form
58429 163045899 163387544 163731556 164078216 164427892 164780919 165136311 165492189 165847941 166204716
58420 166204716 166563301 166922913 167282784 167643724 168007101 168372932 168739750 169105750 169469745
58411 169469745 169832174 170195883 170564504 170938704 171314932 171689210 172061212 172432909 172804364
58402 172804364 173173459 173539621 173904909 174270552 174635003 174997015 175358573 175722698 176089759
58393 176089759 176458179 176827724 177199608 177573753 177948560 178323716 178700964 179081340 179463417
58384 179463417 179845209 180226308 180607332 180988728 181371044 181754856 182139285 182522091 182902852
58375 182902852 183284813 183671665 184063398 184457568 184854227 185256977 185668505 186087282 186510209
58366 186510209 186937265 187371536 187814332 188261270 188704019 189136278 189558099 189974356 190389381
$$ packed form
58429A63045899L41645L44012L46660L49676L53027L55392L55878L55752L56775
58420A66204716L58585L59612L59871L60940L63377L65831L66818L66000L63995
58411A69469745L62429L63709L68621L74200L76228L74278L72002L71697L71455
58402A72804364L69095L66162L65288L65643L64451L62012L61558L64125L67061
58393A76089759L68420L69545L71884L74145L74807L75156L77248L80376L82077
58384A79463417L81792L81099L81024L81396L82316L83812L84429L82806L80761
58375A82902852L81961L86852L91733L94170L96659M02750M11528M18777M22927
58366A86510209M27056M34271M42796M46938M42749M32259M21821M16257M15025
$$ plain form
58357 190389381 190803812 191216192 191625625 192031836 192434608 192835591 193239901 193653238 194077093
58348 194077093 194508881 194946932 195392750 195847348 196307912 196770095 197232087 197694629 198158490
58339 198158490 198624118 199092772 199565523 200041582 200519909 201002390 201492912 201992766 202499325
58330 202499325 203010332 203527261 204052393 204583777 205115408 205642368 206164091 206682344 207197879
58321 207197879 207710593 208222399 208738071 209262185 209795503 210335115 210877762 211421780 211965514
58312 211965514 212505742 213039737 213568469 214095628 214622855 215147612 215666880 216181785 216697361
58303 216697361 217218654 217748452 218287945 218837329 219395128 219958371 220524353 221091618 221658844
58294 221658844 222223798 222784551 223341574 223898049 224458083 225024646 225598612 226178905 226763387
$$ packed form
58357A90389381M14431M12380M09433M06211M02772M00983M04310M13337M23855
58348A94077093M31788M38051M45818M54598M60564M62183M61992M62542M63861
58339A98158490M65628M68654M72751M76059M78327M82481M90522M99854N06559
58330B02499325N11007N16929N25132N31384N31631N26960N21723N18253N15535
58321B07197879N12714N11806N15672N24114N33318N39612N42647N44018N43734
58312B11965514N40228N33995N28732N27159N27227N24757N19268N14905N15576
58303B16697361N21293N29798N39493N49384N57799N63243N65982N67265N67226
58294B21658844N64954N60753N57023N56475N60034N66563N73966N80293N84482
$$ plain form
58285 226763387 227349954 227937144 228524187 229111115 229699041 230289720 230884218 231481870 232080426
58276 232080426 232676629 233266458 233845785 234412153 234966542 235513498 236059930 236614005 237184455
58267 237184455 237779596 238406159 239068512 239767974 240501816 241262930 242041294 242826346 243608301
58258 243608301 244378419 245129702 245858155 246563151 247246557 247911833 248563563 249206911 249847395
58249 249847395 250491758 251148735 251827661 252535545 253275605 254047846 254849466 255674265 256513092
58240 256513092 257355792 258192388 259013175 259810640 260583410 261337489 262082424 262827589 263583524
58231 263583524 264364614 265186147 266056990 266975820 267933683 268917400 269910087 270892056 271845204
58222 271845204 272757593 273623632 274441552 275213322 275947582 276661276 277377198 278119585 278910906
$$ packed form
58285B26763387N86567N87190N87043N86928N87926N90679N94498N97652N98556
58276B32080426N96203N89829N79327N66368N54389N46956N46432N54075N70450
58267B37184455N95141O26563O62353O99462P33842P61114P78364P85052P81955
58258B43608301P70118P51283P28453P04996O83406O65276O51730O43348O40484
58249B49847395O44363O56977O78926P07884P40060P72241Q01620Q24799Q38827
58240B56513092Q42700Q36596Q20787P97465P72770P54079P44935P45165P55935
58231B63583524P81090Q21533Q70843R18830R57863R83717R92687R81969R53148
58222B71845204R12389Q66039Q17920P71770P34260P13694P15922P42387P91321
$$ plain form
58213 278910906 279769785 280708032 281726724 282814232 283948757 285104098 286254654 287377648
58205 287377648 288454533 289473892 290434636 291346080 292224208 293087257 293954024 294844977 295782996
58196 295782996 296790450 297882624 299061857 300316923 301627220 302966884 304306617 305616111
58188 305616111 306869113 308047962 309144903 310163203 311121176 312054581 313010993 314038875
58180 314038875 315180264 316468668 317925591 319554032 321336474 323240996 325228009 327250973
58172 327250973 329256171 331189154 333004764 334672242 336176137 337520985 338740066 339898030
58164 339898030 341080277 342373789 343848556 345544589 347465987 349583255 351842444 354175823
58156 354175823 356509922 358771945 360897895 362843332 364594952 366179899 367668469 369166501
$$ packed form
58213B78910906Q58879R38247J018692J087508J134525J155341J150556J122994
58205B87377648J076885J019359R60744R11444Q78128Q63049Q66767Q90953R38019
58196B95782996J007454J092174J179233J255066J310297J339664J339733J309494
58188C05616111J253002J178849J096941J018300R57973R33405R56412J027882
58180C14038875J141389J288404J456923J628441J782442J904522J987013K022964
58172C27250973K005198J932983J815610J667478J503895J344848J219081J157964
58164C39898030J182247J293512J474767J696033J921398K117268K259189K333379
58156C54175823K334099K262023K125950J945437J751620J584947J488570J498032
$$ plain form
58148 369166501 370798445 372686786 374932564 377598326 380695847 384184282 387981886 391986147
58140 391986147 396093464 400214319 404285750 408283177 412230706 416206802 420339361 424781785
58132 424781785 429666241 435043704 440832471 446798582 452583857 457783728 462055561 465213097
58124 465213097 467256578 468319973 468569371 468116050 466989041 465166450 462631068 459411807
58116 459411807 455590036 451274368 446566431 441542387 436258290 430767465 425133667 419434173
58108 419434173 413755603 408184340 402792004 397621230 392680934 387954893 383417782 379048922
58100 379048922 374837970 370782976 366885251 363145894 359565593 356145096 352883785 349777708
58092 349777708 346820172 344004401 341324713 338775125 336348238 334036530 331834444 329738896
$$ packed form
58148C69166501J631944J888341K245778K665762L097521L488435L797604M004261
58140C91986147M107317M120855M071431L997427L947529L976096M132559M442424
58132D24781785M884456N377463N788767N966111N785275N199871M271833L157536
58124D65213097K043481J063395K49398m53321j127009j822591k535382l219261
58116D59411807l821771m315668m707937n024044n284097n490825n633798n699494
58108D19434173n678570n571263n392336n170774m940296m726041m537111m368860
58100C79048922m210952m054994l897725l739357l580301l420497l261311l106077
58092C49777708k957536k815771k679688k549588k426887k311708k202086k095548
$$ plain form
58084 329738896 327748190 325860827 324074984 322388589 320799704 319306647 317907553 316600088
58076 316600088 315382023 314251828 313208165 312248857 311370624 310569342 309840156 309178245 308580523
58067 308580523 308045882 307572492 307155585 306789733 306472809 306205344 305985912 305809948 305674098
58058 305674098 305578888 305524818 305507708 305520554 305559133 305623325 305713529 305828465 305966912 306129268
58048 306129268 306316286 306527447 306761074 307014520 307283418 307562356 307848072 308141511 308445488
58039 308445488 308760675 309085187 309417792 309759471 310110731 310468791 310829366 311191134 311556929
58030 311556929 311930236 312311973 312701322 313098041 313502342 313913324 314329299 314749720 315175623
58021 315175623 315608319 316048656 316497157 316953459 317415867 317882921 318355183 318833766 319317229
$$ packed form
58084C29738896j990706j887363j785843j686395j588885j493057j399094j307465
58076C16600088j218065j130195j043663r59308q78233q01282p29186o61911n97722
58067C08580523n34641m73390m16907l65852l16924k67465k19432j75964j35850
58058C05674098r5210n4070j7110J2846L8579O4192R0204J14936J38447J62356
58048C06129268J87018K11161K33627K53446K68898K78938K85716K93439L03977
58039C08445488L15187L24512L32605L41679L51260L58060L60575L61768L65795
58030C11556929L73307L81737L89349L96719M04301M10982M15975M20421M25903
58021C15175623M32696M40337M48501M56302M62408M67054M72262M78583M83463
$$ plain form
58012 319317229 319802019 320286238 320770670 321255390 321737746 322215106 322687685 323157080 323623620
58003 323623620 324086851 324547221 325005541 325461875 325916586 326371419 326828111 327287207 327749712
57994 327749712 328218292 328694590 329176630 329661305 330148406 330639646 331134655 331631263 332129756
57985 332129756 332633777 333146199 333666369 334192147 334722569 335257600 335797032 336340489 336887219
57976 336887219 337435428 337983231 338530741 339079972 339632494 340188613 340748621 341312866 341880231
57967 341880231 342448650 343017882 343590131 344167399 344749964 345337836 345931465 346530110 347131574
57958 347131574 347734776 348340801 348950143 349560470 350168346 350771587 351368863 351958736 352540548
57949 352540548 353114822 353681539 354239602 354789199 355332657 355871186 356402708 356925168 357440406
$$ packed form
58012C19317229M84790M84219M84432M84720M82356M77360M72579M69395M66540
58003C23623620M63231M60370M58320M56334M54711M54833M56692M59096M62505
57994C27749712M68580M76298M82040M84675M87101M91240M95009M96608M98493
57985C32129756N04021N12422N20170N25778N30422N35031N39432N43457N46730
57976C36887219N48209N47803N47510N49231N52522N56119N60008N64245N67365
57967C41880231N68419N69232N72249N77268N82565N87872N93629N98645O01464
57958C47131574O03202O06025O09342O10327O07876O03241N97276N89873N81812
57949C52540548N74274N66717N58063N49597N43458N38529N31522N22460N15238
$$ plain form
57940 357440406 357952299 358462310 358969572 359474299 359978137 360481432 360982993 361482607 361981238
57931 361981238 362478534 362972749 363463657 363952982 364440863 364924116 365399479 365867078 366329499
57922 366329499 366788798 367245678 367700175 368151496 368598075 369039724 369479699 369923142 370373074
57913 370373074 370828713 371287837 371749818 372215821 372686908 373163170 373644839 374133178 374629584
57904 374629584 375134439 375647728 376170124 376701831 377240366 377781491 378323277 378867578 379415896
57895 379415896 379965031 380508751 381043122 381568298 382085780 382596596 383102673 383607510 384113890
57886 384113890 384622057 385131282 385642291 386157195 386678075 387206911 387746074 388297089 388858689
57877 388858689 389427460 390001023 390579776 391164671 391753680 392341485 392922849 393495378 394058276
$$ packed form
57940C57440406N11893N10011N07262N04727N03838N03295N01561M99614M98631
57931C61981238M97296M94215M90908M89325M87881M83253M75363M67599M62421
57922C66329499M59299M56880M54497M51321M46579M41649M39975M43443M49932
57913C70373074M55639M59124M61981M66003M71087M76262M81669M88339M96406
57904C74629584N04855N13289N22396N31707N38535N41125N41786N44301N48318
57895C79415896N49135N43720N34371N25176N17482N10816N06077N04837N06380
57886C84113890N08167N09225N11009N14904N20880N28836N39163N51015N61600
57877C88858689N68771N73563N78753N84895N89009N87805N81364N72529N62898
$$ plain form
57868 394058276 394609195 395143701 395657764 396149263 396616766 397058886 397476548 397874714 398259519
57859 398259519 398633391 398994308 399340103 399672530 399997076 400319989 400645738 400976226 401311620
57850 401311620 401652040 401998490 402352183 402713863 403084500 403465502 403856599 404254156 404653592
57841 404653592 405053292 405454170 405855515 406253984 406647715 407039050 407431585 407826172 408221404
57832 408221404 408616350 409010832 409404219 409796200 410188124 410581502 410975434 411367372 411756039
57823 411756039 412141491 412522352 412895714 413260933 413621582 413981846 414341986 414698853 415050145
57814 415050145 415396395 415738890 416077500 416411597 416742278 417072607 417405844 417744146 418088879
57805 418088879 418441272 418802215 419171781 419549226 419933275 420322465 420716183 421115935 421524773
$$ packed form
57868C94058276N50919N34506N14063M91499M67503M42120M17662L98166L84805
57859C98259519L73872L60917L45795L32427L24546L22913L25749L30488L35394
57850D01311620L40420L46450L53693L61680L70637L81002L91097L97557L99436
57841D04653592L99700M00878M01345L98469L93731L91335L92535L94587L95232
57832D08221404L94946L94482L93387L91981L91924L93378L93932L91938L88667
57823D11756039L85452L80861L73362L65219L60649L60264L60140L56867L51292
57814D15050145L46250L42495L38610L34097L30681L30329L33237L38302L44733
57805D18088879L52393L60943L69566L77445L84049L89190L93718L99752M08838
$$ plain form
57796 421524773 421944246 422372111 422803980 423236886 423670076 424102539 424531627 424954792 425371379
57787 425371379 425781806 426185838 426582361 426969903 427346611 427710634 428061467 428400110 428726941
57778 428726941 429040096 429336806 429615608 429876539 430120368 430348959 430565331 430771622 430967462
57769 430967462 431151855 431326062 431493061 431654953 431813105 431970527 432131419 432297751 432468366
57760 432468366 432642142 432819930 433002489 433188792 433378288 433573481 433778413 433995045 434221916
57751 434221916 434455221 434690158 434922642 435151449 435378002 435602783 435822893 436034364 436235451
57742 436235451 436425811 436603937 436768107 436918723 437056043 437175518 437269373 437334457 437375452 437398326
57732 437398326 437403631 437389583 437359982 437325205 437295359 437275177 437265596 437267286 437281585 437310398 437356621
$$ packed form
57796D21524773M19473M27865M31869M32906M33190M32463M29088M23165M16587
57787D25371379M10427M04032L96523L87542L76708L64023L50833L38643L26831
57778D28726941L13155K96710K78802K60931K43829K28591K16372K06291J95840
57769D30967462J84393J74207J66999J61892J58152J57422J60892J66332J70615
57760D32468366J73776J77788J82559J86303J89496J95193K04932K16632K26871
57751D34221916K33305K34937K32484K28807K26553K24781K20110K11471K01087
57742D36235451J90360J78126J64170J50616J37320J19475R3855O5084M0995K2874
57732D37398326N305j4048k9601l4777k9846k0182r581J690J4299K8813M6223
$$ plain form
57721 437356621 437422979 437508905 437609729 437720294 437838600 437964987 438099048 438238858 438382227
57712 438382227 438526780 438669183 438806147 438936332 439059953 439176530 439284556 439383456 439474204
57703 439474204 439557612 439633793 439704129 439772065 439840516 439909509 439977767 440045684 440115129 440186931 440260458
57692 440260458 440335913 440415495 440501634 440594976 440694565 440799219 440907938 441019194 441130394 441238460
57682 441238460 441341243 441438351 441529926 441614543 441689384 441753315 441808554 441857627 441899236 441929189 441945474
57671 441945474 441950264 441946004 441931208 441901426 441853186 441785711 441699830 441597151 441480298 441352505 441216309
57660 441216309 441073065 440923809 440770083 440613619 440455251 440294076 440127790 439954252 439772899
57651 439772899 439584535 439390252 439191614 438991704 438794399 438601776 438413320 438228640 438050289
$$ packed form
57721D37356621O6358Q5926J00824J10565J18306J26387J34061J39810J43369
57712D38382227J44553J42403J36964J30185J23621J16577J08026R8900R0748
57703D39474204Q3408P6181P0336O7936O8451O8993O8258O7917O9445P1802P3527
57692D40260458P5455P9582Q6139R3342R9589J04654J08719J11256J11200J08066
57682D41238460J02783R7108R1575Q4617P4841O3931N5239M9073M1609K9953J6285
57671D41945474M790m260j4796k9782m8240o7475q5881j02679j16853j27793j36196
57660D41216309j43244j49256j53726j56464j58368j61175j66286j73538j81353
57651D39772899j88364j94283j98638j99910j97305j92623j88456j84680j78351
$$ plain form
57642 438050289 437883182 437731811 437598273 437481503 437377317 437280513 437188520 437102460 437023641 436950275
57632 436950275 436879073 436808467 436737786 436664184 436583528 436494506 436399257 436299318 436193309 436079405
57622 436079405 435957902 435830458 435699081 435567205 435439753 435320209 435208630 435103286 435002334
57613 435002334 434902474 434798322 434685954 434566252 434442478 434315157 434181423 434038774 433887004
57604 433887004 433726448 433556842 433378694 433194079 433005142 432812815 432617468 432419701 432219888
57595 432219888 432017851 431813680 431608609 431404710 431203766 431005879 430808661 430608326 430402457
57586 430402457 430191314 429975828 429755189 429527349 429290642 429043323 428783004 428509227 428225916
57577 428225916 427938058 427645721 427344589 427033240 426716589 426400320 426084696 425765945 425440913
$$ packed form
57642D38050289j67107j51371j33538j16770j04186r6804r1993q6060p8819p3366
57632D36950275p1202p0606p0681p3602q0656q9022r5249r9939j06009j13904
57622D36079405j21503j27444j31377j31876j27452j19544j11579j05344j00952
57613D35002334r9860j04152j12368j19702j23774j27321j33734j42649j51770
57604D33887004j60556j69606j78148j84615j88937j92327j95347j97767j99813
57595D32219888k02037k04171k05071k03899k00944j97887j97218k00335k05869
57586D30402457k11143k15486k20639k27840k36707k47319k60319k73777k83311
57577D28225916k87858k92337l01132l11349l16651l16269l15624l18751l25032
$$ plain form
57568 425440913 425107000 424759320 424391818 424001228 423587418 423150330 422689730 422208473 421713536
57559 421713536 421212935 420713097 420219109 419734956 419262691 418803466 418360263 417937482 417536787
57550 417536787 417155564 416791016 416443655 416114656 415801618 415499783 415206422 414920913 414640734
57541 414640734 414360671 414077187 413791474 413507075 413226176 412949107 412675294 412402864 412128920
57532 412128920 411852643 411577572 411308675 411047358 410791406 410539883 410295682 410062070 409838537
57523 409838537 409621394 409406905 409191565 408969839 408733938 408476589 408192914 407879394 407532511
57514 407532511 407149317 406728231 406268165 405767801 405227440 404651582 404048351 403426017 402791160
57505 402791160 402150668 401514079 400892295 400294098 399724966 399189250 398692133 398238482 397829938
$$ packed form
57568D25440913l33913l47680l67502l90590m13810m37088m60600m81257m94937
57559D21713536n00601m99838m93988m84153m72265m59225m43203m22781m00695
57550D17536787l81223l64548l47361l28999l13038l01835k93361k85509k80179
57541D14640734k80063k83484k85713k84399k80899k77069k73813k72430k73944
57532D12128920k76277k75071k68897k61317k55952k51523k44201k33612k23533
57523D09838537k17143k14489k15340k21726k35901k57349k83675l13520l46883
57514D07532511l83194m21086m60066n00364n40361n75858o03231o22334o34857
57505D02791160o40492o36589o21784n98197n69132n35716m97117m53651m08544
$$ plain form
57496 397829938 397463298 397131267 396824545 396533785 396250193 395964393 395665197 395340749 394981699
57487 394981699 394582957 394142428 393659811 393138263 392586357 392016124 391438476 390861464 390292732
57478 390292732 389741766 389218979 388733588 388292535 387899498 387553502 387249472 386981369 386744090
57469 386744090 386531370 386332639 386133325 385918074 385673160 385386784 385048625 384649601 384182493
57460 384182493 383644321 383038959 382375864 381664439 380910452 380119381 379302289 378476524 377661329
57451 377661329 376874520 376132242 375448570 374834163 374296425 373840256 373465820 373164811 372920955
57442 372920955 372714892 372527224 372337579 372124681 371869531 371557082 371174472 370711211 370163666
57433 370163666 369537205 368841258 368083916 367274069 366427266 365565768 364712492 363887064 363107142
$$ packed form
57496C97829938l66640l32031l06722k90760k83592k85800k99196l24448l59050
57487C94981699l98742m40529m82617n21548n51906n70233n77648n77012n68732
57478C90292732n50966n22787m85391m41053l93037l45996l04030k68103k37279
57469C86744090k12720j98731j99314k15251k44914k86376l38159l99024m67108
57460C84182493n38172o05362o63095p11425p53987p91071q17092q25765q15195
57451C77661329p86809p42278o83672o14407n37738m56169l74436l01009k43856
57442C72920955k06063j87668j89645k12898k55150l12449l82610m63261n47545
57433C70163666o26461o95947p57342q09847q46803q61498q53276q25428p79922
$$ plain form
57424 363107142 362389876 361750012 361197364 360736509 360367550 360086551 359886110 359755873 359681633
57415 359681633 359644001 359619408 359583474 359513729 359390306 359196157 358917804 358545858 358075303 357506587
57405 357506587 356846768 356108776 355309182 354467299 353606370 352754021 351939595 351189653 350525128
57396 350525128 349961889 349512758 349187177 348987517 348906170 348927881 349034762 349207059 349419027
57387 349419027 349637671 349828213 349959106 349999762 349916414 349675839 349254846 348644413 347845323
57378 347845323 346863753 345712569 344413882 342997572 341497903 339952212 338401074 336887665
57370 336887665 335456600 334152625 333017577 332085847 331381491 330918172 330699160 330716148 330949426
57361 330949426 331370328 331942963 332624241 333365700 334118857 334840089 335491678 336041093 336461012
$$ packed form
57424C63107142p17266o39864n52648m60855l68959k80999k00441j30237p4240
57415C59681633l7632k4593l5934o9745j23423j94149k78353l71946m70555n68716
57405C57506587o59819p37992p99594q41883q60929q52349q14426p49942o64525
57396C50525128n63239m49131l25581j99660q1347K1711J06881J72297K11968
57387C49419027K18644J90542J30893M0656q3348k40575m20993o10433p99090
57378C47845323r81570j151184j298687j416310j499669j545691j551138j513409
57370C36887665j431065j303975j135048r31730p04356m63319k19012J6988K33278
57361C30949426M20902N72635O81278P41459P53157P21232O51589N49415M19919
$$ plain form
57352 336461012 336728181 336819784 336711221 336378901 335805122 334980162 333902137 332578116 331025989
57343 331025989 329274084 327359032 325324890 323223501 321113179 319055039 317108979 315330268
57335 315330268 313766317 312454164 311419525 310676648 310228014 310064962 310169941 310518601 311080306
57326 311080306 311818833 312694694 313666557 314689502 315712995 316682865 317546072 318253454 318759650
57317 318759650 319023704 319011650 318698792 318070498 317122954 315864369 314315175 312506939 310481037
57308 310481037 308286808 305977841 303607208 301224042 298872101 296589428 294409398 292363463
57300 292363463 290483024 288797915 287333578 286110890 285147578 284456755 284042797 283899939
57292 283899939 284015356 284371882 284946946 285710975 286629207 287665063 288780987 289936802 291088615
$$ packed form
57352C36461012K67169R1603j08563l32320n73779q24960j078025j324021j552127
57343C31025989j751905j915052k034142k101389k110322k058140j946060j778711
57335C15330268j563951j312153j034639p42877m48634j63052J04979L48660N61705
57326C11080306P38527Q75861R71863J022945J023493R69870Q63207P07382N06196
57317C18759650K64054j2054l12858o28294r47544j258585j549194j808236k025902
57308C10481037k194229k308967k370633k383166k351941k282673k180030k045935
57300B92363463j880439j685109j464337j222688r63312o90823m13958j42858
57292B83899939J15417L56526N75064P64029R18232J035856J115924J155815J151813
$$ plain form
57283 291088615 292189206 293188747 294036051 294681566 295081569 295201226 295015128 294506006 293663241
57274 293663241 292482585 290967385 289129874 286990940 284578773 281928050 279079722 276079759
57266 276079759 272976991 269822156 266668289 263569408 260575665 257727577 255053260 252569716
57258 252569716 250286695 248211298 246351539 244717340 243319440 242168210 241272581 240637440
57250 240637440 240260339 240131268 240236035 240558260 241076944 241764427 242589998 243525489 244544750
57241 244544750 245617594 246707339 247776033 248790248 249720439 250537307 251212490 251722792
57233 251722792 252051058 252182407 252102083 251798471 251266629 250507087 249521865 248312907 246883321
57224 246883321 245237392 243377919 241304003 239012012 236499179 233768144 230831550 227715175
$$ packed form
57283B91088615J100591R99541Q47304O45515M00003J19657j86098n09122q42765
57274B93663241j180656j515200j837511k138934k412167k650723k848328k999963
57266B76079759l102768l154835l153867l098881k993743k848088k674317k483544
57258B52569716k283021k075397j859759j634199j397900j151230q95629o35141
57250B40637440l77101j29071J04767L22225N18684O87483Q25571R35491J019261
57241B44544750J072844J089745J068694J014215R30191Q16868O75183N10302
57233B51722792L28266J31349q0324l03612n31842p59542r85222j208958j429586
57224B46883321j645929j859473k073916k291991k512833k731035k936594l116375
$$ plain form
57216 227715175 224457195 221102931 217697627 214280127 210878647 207509380 204179179 200891965
57208 200891965 197655717 194486903 191411700 188464580 185684457 183109280 180771557 178696148
57200 178696148 176898830 175384281 174145005 173162992 172412931 171864830 171486478 171246864 171119198
57191 171119198 171081710 171117730 171217223 171377731 171601179 171888021 172234064 172630895 173065508 173517503
57181 173517503 173958359 174356089 174681676 174912058 175029849 175023029 174885056 174613391 174206768
57172 174206768 173663917 172984872 172173125 171236467 170185854 169033112 167789353 166465770
57164 166465770 165076083 163637669 162169218 160685791 159193847 157688558 156154942 154572571
57156 154572571 152920710 151180329 149333365 147362877 145255518 143003988 140607727 138072860
$$ packed form
57216B27715175l257980l354264l405304l417500l401480l369267l330201l287214
57208B00891965l236248l168814l075203k947120k780123k575177k337723k075409
57200A78696148j797318j514549j239276r82013p50061n48101l78352k39614j27666
57191A71119198l7488L6020R9493J60508K23448K86842L46043L96831M34613M51995
57181A73517503M40856L97730L25587K30382J17791o820j37973k71665m06623
57172A74206768n42851o79045q11747r36658j050613j152742j243759j323583
57164A66465770j389687j438414j468451j483427j491944j505289j533616j582371
57156A54572571j651861j740381j846964j970488k107359k251530k396261k534867
$$ plain form
57148 138072860 135411635 132639974 129774007 126828974 123820294 120762467 117665491 114535118
57140 114535118 111379597 108215595 105066112 101954467 98902424 95931117 93057566 90287942
57132 90287942 87616760 85034566 82535989 80121589 77795871 75565152 73434262 71402043
57124 71402043 69460312 67598252 65806447 64075029 62389004 60727409 59067373 57389308
57116 57389308 55680853 53939051 52169328 50381022 48582853 46781835 44984576 43198112
57108 43198112 41430198 39689838 37986461 36326703 34711936 33139707 31606961 30111030
57100 30111030 28649341 27221323 25831589 24490092 23208698 21997657 20863379 19806212
57092 19806212 18819238 17890606 17007560 16157034 15322708 14484199 13620600 12713847 11748816
$$ packed form
57148A38072860k661225k771661k865967k945033l008680l057827l096976l130373
57140A14535118l155521l164002l149483l111645l052043k971307k873551k769624
57132I0287942k671182k582194k498577k414400k325718k230719k130890k032219
57124G1402043j941731j862060j791805j731418j686025j661595j660036j678065
57116E7389308j708455j741802j769723j788306j798169j801018j797259j786464
57108D3198112j767914j740360j703377j659758j614767j572229j532746j495931
57100C0111030j461689j428018j389734j341497j281394j211041j134278j057167
57092A9806212r86974r28632q83046q50526q34326q38509q63599r06753r65031
$$ plain form
57083 11748816 10713225 9599571 8404950 7125637 5751470 4266904 2656971 910969
57074 -977903 -3012557 -5190151 -7502302 -9938736 -12490165 -15147498 -17900417 -20738453
57066 -20738453 -23652336 -26632382 -29666009 -32738867 -35839074 -38959479 -42095724 -45243116
57058 -45243116 -48395583 -51546571 -54690474 -57824210 -60948288 -64066257 -67183254 -70305756
57050 -70305756 -73441674 -76597086 -79769879 -82946986 -86109758 -89242168 -92333234 -95373592
57042 -95373592 -98353165 -101262168 -104090419 -106822875 -109436826 -111905153 -114202765 -116312873
57034 -116312873 -118235533 -120000211 -121675582 -123366976 -125201127 -127308528 -129814078 -132836444
57026 -132836444 -136483300 -140825544 -145850837 -151425498 -157297798 -163138085 -168575701 -173214498
$$ packed form
57083A1748816j035591j113654j194621j279313j374167j484566j609933I10969
57074i77903k034654k177594k312151k436434k551429k657333k752919k838036
57066b0738453k913883k980046l033627l072858l100207l120405l136245l147392
57058d5243116l152467l150988l143903l133736l124078l117969l116997l122502
57050g0305756l135918l155412l172793l177107l162772l132410l091066l040358
57042i5373592k979573k909003k828251k732456k613951k468327k297612k110108
57034a16312873j922660j764678j675371j691394j834151k107401k505550l022366
57026a32836444l646856m342244n025293n574661n872300n840287n437616m638797
$$ plain form
57018 -173214498 -176662207 -178606526 -178896853 -177548278 -174653893 -170296555 -164551798 -157564221
57010 -157564221 -149599909 -141017866 -132193507 -123453859 -115043373 -107107453 -99689511 -92749075
57002 -92749075 -86197874 -79937895 -73889269 -68004809 -62270117 -56690860 -51277074 -46036489
56994 -46036489 -40978524 -36119824 -31483317 -27091162 -22957409 -19085850 -15474337 -12121000
56986 -12121000 -9025716 -6185913 -3593136 -1235179 899679 2822183 4544687 6082051
56978 6082051 7449566 8661155 9729504 10666576 11483436 12189862 12794161 13303441 13725153
56969 13725153 14069131 14347142 14569237 14741037 14865588 14946881 14990046 14999124 14977225 14929158
56959 14929158 14861711 14780324 14686950 14582071 14467462 14345858 14218922 14086738 13948464 13802301
$$ packed form
57018a73214498l447709j944319k90327J348575K894385M357338N744757O987577
57010a57564221P964312Q582043Q824359Q739648Q410486P935920P417942O940436
57002i2749075O551201O259979O048626N884460N734692N579257N413786N240585
56994d6036489N057965M858700M636507M392155M133753L871559L611513L353337
56986a2121000L095284K839803K592777a235179H99679J922504J722504J537364
56978F082051J367515J211589J068349R37072Q16860P06426O04299N09280M21712
56969A3725153L43978K78011K22095J71800J24551Q1293M3165R078k1899m8067
56959A4929158o7447q1387r3374j04879j14609j21604j26936j32184j38274j46163
$$ plain form
56949 13802301 13645588 13476835 13297907 13113139 12926121 12738282 12550435 12363817 12178612
56940 12178612 11992817 11804365 11613872 11423586 11233732 11041937 10847187 10652712 10463285
56931 10463285 10280380 10101593 9924369 9748455 9574276 9400562 9224832 9045639 8863396
56922 8863396 8679085 8492614 8302487 8107001 7905801 7700024 7490553 7276446 7055719
56913 7055719 6827662 6593872 6357241 6120716 5886770 5657008 5432002 5211962 4997356
56904 4997356 4787979 4581915 4376933 4173065 3972515 3777068 3587328 3404781 3232439
56895 3232439 3072070 2922117 2779564 2642849 2512138 2388344 2273335 2169768 2078539 1996629
56885 1996629 1919048 1843127 1770315 1704202 1647262 1598539 1553656 1507992 1460905 1416166 1377579
$$ packed form
56949A3802301j56713j68753j78928j84768j87018j87839j87847j86618j85205
56940A2178612j85795j88452j90493j90286j89854j91795j94750j94475j89427
56931A0463285j82905j78787j77224j75914j74179j73714j75730j79193j82243
56922H863396j84311j86471j90127j95486k01200k05777k09471k14107k20727
56913G055719k28057k33790k36631k36525k33946k29762k25006k20040k14606
56904D997356k09377k06064k04982k03868k00550j95447j89740j82547j72342
56895C232439j60369j49953j42553j36715j30711j23794j15009j03567r1229q1910
56885A996629p7581p5921p2812o6113n6940m8723m4883m5664m7087m4739l8587
$$ plain form
56874 1377579 1345383 1317651 1293241 1271668 1251709 1232468 1214812 1199665 1185777 1171380 1157006
56863 1157006 1144137 1132026 1118887 1105637 1094862 1085857 1074370 1058465 1041468 1027411 1016278
56852 1016278 1005793 995696 987813 983133 980873 979696 978416 976402 974534 974843 977968 981903 984368 985411
56838 985411 986457 987954 989449 991024 992887 994001 992872 989734 986741 985820 987049 989157 991024 992727
56824 992727 995245 998815 1001816 1002493 1001824 1002954 1007113 1011929 1014995 1017128 1020222 1023601 1025392 1026666 1031039
56809 1031039 1039869 1050562 1060553 1070455 1081737 1093175 1101916 1107382 1111953 1117625 1123711 1128775 1133596
56796 1133596 1140554 1150004 1158654 1162624 1161609 1159216 1159548 1164376 1173108 1183825 1193857 1200859 1204372 1205814
56782 1205814 1206641 1207645 1210361 1217342 1229484 1244183 1257799 1269330 1280054 1290012 1296753 1297968 1294224
$$ packed form
56874A377579l2196k7732k4410k1573j9959j9241j7656j5147j3888j4397j4374
56863A157006j2869j2111j3139j3250j0775r005j1487j5905j6997j4057j1133
56852A016278j0485j0097p883m680k260j177j280k014j868L09L125L935K465J043
56838I85411J046J497J495J575J863J114j129l138k993r21J229K108J867J703
56824I92727K518L570L001O77o69J130M159M816L066K133L094L379J791J274M373
56809A031039Q830J0693R991R902J1282J1438Q741N466M571N672O086N064M821
56796A133596O958R450Q650L970j015k393L32M828Q732J0717J0032P002L513J442
56782A205814Q27J004K716O981J2142J4699J3616J1531J0724R958O741J215l744
$$ plain form
56769 1294224 1288718 1285029 1284888 1287078 1288410 1286666 1282727 1279135 1276755 1273833 1268598 1261996 1257524 1258586
56755 1258586 1265675 1275515 1283237 1286304 1286359 1286822 1289063 1291666 1292760 1291607 1288005 1281848 1274166 1267591 1264680
56740 1264680 1265735 1268579 1270350 1269362 1265563 1259696 1252507 1244932 1238273 1232984 1227422 1219523 1210283 1203712
56726 1203712 1201833 1201440 1197991 1191656 1186804 1185958 1187170 1187731 1187541 1187542 1187217 1185453 1182258 1177921 1171775 1163625
56710 1163625 1155414 1149528 1145878 1142319 1137683 1132765 1128360 1123993 1119150 1114605 1111610 1110184 1108760 1105644
56696 1105644 1100888 1096716 1095573 1097442 1099724 1100326 1100036 1100795 1102398 1102680 1100832 1098561 1097254 1095919 1093524
56681 1093524 1092056 1094865 1101971 1109005 1111615 1109613 1105906 1102701 1100291 1098857 1099506 1102964 1108412 1114269
56667 1114269 1119506 1123847 1127488 1131129 1135574 1140604 1144956 1148215 1152049 1158245 1165766 1171382 1173783 1175678
$$ packed form
56769A294224n506l689j41K190J332j744l939l592k380k922n235o602m472J062
56755A258586P089R840P722L067N5M63K241K603J094j153l602o157p682o575k911
56740A264680J055K844J771r88l799n867p189p575o659n289n562p899r240o571
56726A203712j879l93l449o335m852q46J212N61j90Jl25j764l195m337o146q150
56710A163625q211n886l650l559m636m918m405m367m843m545k995j426j424l116
56696A105644m756m172j143J869K282O02k90P59J603K82j848k271j307j335k395
56681A093524j468K809P106P034K610k002l707l205k410j434O49L458N448N857
56667A114269N237M341L641L641M445N030M352L259L834O196P521N616K401J895
$$ plain form
56653 1175678 1180443 1187335 1191795 1190900 1187039 1184991 1186399 1189036 1191348 1195186 1202618 1211941 1219474 1224756
56639 1224756 1231222 1241176 1252460 1261415 1267315 1272086 1276870 1281007 1284261 1288253 1295181 1305814 1318874
56626 1318874 1331803 1342216 1349215 1353445 1355906 1357250 1358262 1360092 1363383 1367857 1373133 1379073 1385078
56613 1385078 1390497 1396387 1404968 1416022 1425705 1430971 1433610 1437423 1442721 1446800 1449139 1452458 1458057 1463488
56599 1463488 1466367 1467989 1471476 1478202 1487571 1498702 1510512 1521272 1529761 1536454 1542603 1548755 1554692
56586 1554692 1559775 1562700 1562169 1558683 1554432 1550450 1545259 1537595 1529121 1522755 1519285 1517489 1517029 1519199
56572 1519199 1524669 1532124 1539624 1546319 1552422 1558260 1563706 1568103 1570684 1571486 1571935 1574002 1578430 1583796
56558 1583796 1587571 1588633 1589240 1594090 1606329 1624153 1641940 1654940 1662512 1667324 1672767 1681183 1692830
$$ packed form
56653A175678M765O892M460q95l861k048J408K637K312L838P432R323P533N282
56639A224756O466R954J1284Q955N900M771M784M137L254L992O928J0633J3060
56626A318874J2929J0413O999M230K461J344J012J830L291M474N276N940O005
56613A385078N419N890Q581J1054R683N266K639L813N298M079K339L319N599N431
56599A463488K879J622L487O726R369J1131J1810J0760Q489O693O149O152N937
56586A554692N083K925n31l486m251l982n191p664q474o366l470j796m60K170
56572A519199N470P455P500O695O103N838N446M397K581Q02M49K067M428N366
56558A583796L775J062O07M850J2239J7824J7787J3000P572M812N443Q416J1647
$$ plain form
56545 1692830 1705528 1716158 1723316 1728031 1731903 1735759 1740323 1746445 1753771 1760752 1767118 1774983 1786220
56532 1786220 1799869 1813320 1824907 1834115 1840754 1845838 1852169 1861830 1873502 1884086 1892602 1900710 1909885
56519 1909885 1920132 1931373 1943795 1956252 1966242 1972692 1977793 1985111 1996251 2009754 2022941 2034672
56507 2034672 2046368 2059991 2074873 2087545 2095438 2099892 2104566 2111836 2121947 2134451 2148466 2162093
56495 2162093 2173638 2183509 2193446 2204248 2215812 2228694 2243336 2258003 2270099 2279784 2289857 2301488
56483 2301488 2312564 2321266 2328849 2337450 2347297 2357852 2369958 2384664 2400844 2415820 2427919 2437372
56471 2437372 2445458 2453897 2464186 2476444 2489643 2503611 2519330 2536133 2550537 2560059 2566973 2575761
56459 2575761 2587455 2598949 2607700 2614530 2621556 2629840 2639813 2651748 2664527 2675731 2684457 2692849 2703416
$$ packed form
56545A692830J2698J0630P158M715L872L856M564O122P326O981O366P865J1237
56532A786220J3649J3451J1587R208O639N084O331R661J1672J0584Q516Q108R175
56519A909885J0247J1241J2422J2457R990O450N101P318J1140J3503J3187J1731
56507B034672J1696J3623J4882J2672P893M454M674P270J0111J2504J4015J3627
56495B162093J1545R871R937J0802J1564J2882J4642J4667J2096R685J0073J1631
56483B301488J1076Q702P583Q601R847J0555J2106J4706J6180J4976J2099R453
56471B437372Q086Q439J0289J2258J3199J3968J5719J6803J4404R522O914Q788
56459B575761J1694J1494Q751O830P026Q284R973J1935J2779J1204Q726Q392J0567
$$ plain form
56446 2703416 2715840 2727737 2737750 2746452 2754853 2763632 2773570 2785223 2798093 2811328 2825145 2840277
56434 2840277 2856105 2871118 2885549 2901469 2919072 2934854 2945760 2954118 2965777 2983214 3002711
56423 3002711 3018995 3030673 3040029 3049314 3059028 3068908 3078763 3088536 3098725 3110595 3124928 3140674
56411 3140674 3155818 3169539 3182950 3197909 3215491 3234859 3252970 3266684 3276728 3288707 3308018
56400 3308018 3333772 3359549 3380067 3395230 3407685 3419159 3430413 3442542 3456134 3470189 3483626
56389 3483626 3497315 3513224 3531974 3552361 3572972 3593229 3613062 3632417 3651083 3668660 3685260
56378 3685260 3702428 3722176 3744315 3765946 3784962 3802985 3823086 3845211 3865995 3883178 3898221
56367 3898221 3913914 3931053 3948552 3965710 3983074 4001509 4021413 4042645 4064385 4085051 4103151
$$ packed form
56446B703416J2424J1897J0013Q702Q401Q779R938J1653J2870J3235J3817J5132
56434B840277J5828J5013J4431J5920J7603J5782J0906Q358J1659J7437J9497
56423C002711J6284J1678R356R285R714R880R855R773J0189J1870J4333J5746
56411C140674J5144J3721J3411J4959J7582J9368J8111J3714J0044J1979J9311
56400C308018K5754K5777K0518J5163J2455J1474J1254J2129J3592J4055J3437
56389C483626J3689J5909J8750K0387K0611K0257J9833J9355J8666J7577J6600
56378C685260J7168J9748K2139K1631J9016J8023K0101K2125K0784J7183J5043
56367C898221J5693J7139J7499J7158J7364J8435J9904K1232K1740K0666J8100
$$ plain form
56356 4103151 4118747 4133860 4150945 4170706 4191547 4211500 4230672 4251261 4274913 4300542 4325362
56345 4325362 4347892 4369172 4390856 4412771 4433232 4451783 4470584 4492029 4515238 4536595 4554607
56334 4554607 4572700 4595228 4621582 4646894 4668766 4690348 4715357 4742602 4767798 4789140 4808414
56323 4808414 4827671 4847871 4870520 4897364 4927497 4957197 4984112 5009950 5037667 5067193 5095315
56312 5095315 5119140 5138737 5156984 5177520 5202192 5229807 5257815 5285344 5313662 5343533 5373736
56301 5373736 5403056 5432161 5461998 5491339 5517775 5540856 5562772 5585898 5610647 5635734 5659702
56290 5659702 5682336 5705195 5730463 5758674 5788237 5817998 5849225 5883582 5920034 5955887 5990499
56279 5990499 6025519 6061107 6094680 6124858 6154470 6187344 6223183 6257886 6288584 6316359 6343929
$$ packed form
56356D103151J5596J5113J7085J9761K0841J9953J9172K0589K3652K5629K4820
56345D325362K2530K1280K1684K1915K0461J8551J8801K1445K3209K1357J8012
56334D554607J8093K2528K6354K5312K1872K1582K5009K7245K5196K1342J9274
56323D808414J9257K0200K2649K6844L0133K9700K6915K5838K7717K9526K8122
56312E095315K3825J9597J8247K0536K4672K7615K8008K7529K8318K9871L0203
56301E373736K9320K9105K9837K9341K6436K3081K1916K3126K4749K5087K3968
56290E659702K2634K2859K5268K8211K9563K9761L1227L4357L6452L5853L4612
56279E990499L5020L5588L3573L0178K9612L2874L5839L4703L0698K7775K7570
$$ plain form
56268 6343929 6372659 6402713 6434631 6469369 6507049 6546490 6586026 6624516 6661819 6698601 6735405
56257 6735405 6771562 6805317 6835638 6864052 6894253 6929432 6969790 7012567 7054359 7093370 7129906
56246 7129906 7165528 7202096 7240940 7281865 7322758 7360926 7395527 7428621 7463627 7502726 7545601
56235 7545601 7590098 7633772 7675360 7715530 7756331 7799583 7845538 7892925 7939994 7985600 8029838
56224 8029838 8073866 8118668 8163858 8208361 8252564 8298722 8348299 8399644 8449698 8497670 8545577
56213 8545577 8595016 8644987 8693603 8740703 8787599 8834953 8882142 8928612 8974858 9021875 9070302
56202 9070302 9120409 9172386 9226095 9280650 9334925 9388854 9443895 9501429 9560768 9619861 9678531
56191 9678531 9739775 9806453 9877335 9948341 10017777 10088388 10163346 10241711 10319076 10391656 10458503
$$ packed form
56268F343929K8730L0054L1918L4738L7680L9441L9536L8490L7303L6782L6804
56257F735405L6157L3755L0321K8414L0201L5179M0358M2777M1792L9011L6536
56246G129906L5622L6568L8844M0925M0893L8168L4601L3094L5006L9099M2875
56235G545601M4497M3674M1588M0170M0801M3252M5955M7387M7069M5606M4238
56224H029838M4028M4802M5190M4503M4203M6158M9577N1345N0054M7972M7907
56213H545577M9439M9971M8616M7100M6896M7354M7189M6470M6246M7017M8427
56202I070302N0107N1977N3709N4555N4275N3929N5041N7534N9339N9093N8670
56191I678531O1244O6678P0882P1006O9436P0611P4958P8365P7365P2580O6847
$$ plain form
56180 10458503 10520635 10579853 10638420 10698343 10760084 10822240 10882606 10939513 10992624 11043112 11092821
56169 11092821 11142551 11191084 11236283 11276993 11313491 11346400 11375865 11401952 11425518 11448461 11472788
56158 11472788 11498950 11525351 11550343 11574629 11600249 11626967 11651688 11672897 11693931 11719555 11750208
56147 11750208 11782212 11813493 11846315 11883632 11924972 11967241 12008046 12046938 12084695 12122913 12163461
56136 12163461 12206821 12251293 12295048 12338711 12384604 12433353 12482630 12530306 12578471 12633094 12698915
56125 12698915 12774886 12855366 12935615 13014986 13094505 13173285 13249132 13321645 13392257 13461267 13527205
56114 13527205 13589888 13652029 13716564 13783854 13852977 13924526 14000553 14082456 14170311 14263697 14361563
56103 14361563 14461484 14560611 14657881 14754543 14852351 14951906 15052984 15155906 15262058 15372893
$$ packed form
56180A0458503O2132N9218N8567N9923O1741O2156O0366N6907N3111N0488M9709
56169A1092821M9730M8533M5199M0710L6498L2909K9465K6087K3566K2943K4327
56158A1472788K6162K6401K4992K4286K5620K6718K4721K1209K1034K5624L0653
56147A1750208L2004L1281L2822L7317M1340M2269M0805L8892L7757L8218M0548
56136A2163461M3360M4472M3755M3663M5893M8749M9277M7676M8165N4623O5821
56125A2698915P5971Q0480Q0249P9371P9519P8780P5847P2513P0612O9010O5938
56114A3527205O2683O2141O4535O7290O9123P1549P6027Q1903Q7855R3386R7866
56103A4361563R9921R9127R7270R6662R7808R9555J01078J02922J06152J10835
$$ plain form
56093 15372893 15488416 15606999 15727224 15849578 15975376 16104026 16232746 16359504 16484996
56084 16484996 16611077 16738746 16868952 17004005 17146077 17294584 17446621 17599844 17753724
56075 17753724 17908412 18064017 18220753 18377800 18531657 18677526 18813382 18941592 19065728
56066 19065728 19186993 19304892 19420548 19537981 19662190 19796712 19942559 20098231 20260213
56057 20260213 20423891 20584769 20739554 20886880 21027206 21161537 21290112 21413224 21533979
56048 21533979 21659298 21796427 21947938 22111090 22282366 22461039 22646809 22835040 23017080
56039 23017080 23186242 23341846 23486379 23620720 23744441 23859609 23971143 24083256 24198660
56030 24198660 24322637 24465142 24636258 24840383 25076166 25339922 25625912 25924032 26221080
$$ packed form
56093A5372893J15523J18583J20225J22354J25798J28650J28720J26758J25492
56084A6484996J26081J27669J30206J35053J42072J48507J52037J53223J53880
56075A7753724J54688J55605J56736J57047J53857J45869J35856J28210J24136
56066A9065728J21265J17899J15656J17433J24209J34522J45847J55672J61982
56057B0260213J63678J60878J54785J47326J40326J34331J28575J23112J20755
56048B1533979J25319J37129J51511J63152J71276J78673J85770J88231J82040
56039B3017080J69162J55604J44533J34341J23721J15168J11534J12113J15404
56030B4198660J23977J42505J71116K04125K35783K63756K85990K98120K97048
$$ plain form
56021 26221080 26506089 26773444 27021128 27249002 27460469 27663687 27868380 28081357 28306182
56012 28306182 28546229 28805697 29086886 29387728 29702860 30026254 30351670 30671222 30976059
56003 30976059 31260783 31527451 31783859 32037483 32292396 32552777 32827369 33127771 33462177
55994 33462177 33832274 34235655 34668246 35123000 35588270 36049900 36494876 36912410 37293391
55985 37293391 37631998 37929437 38195750 38447696 38704626 38984523 39300905 39661238 40067498
55976 40067498 40517697 41006378 41524285 42059007 42596375 43120755 43615098 44064318 44461975
55967 44461975 44814436 45138010 45452544 45778347 46137163 46551384 47038219 47602990 48237353
55958 48237353 48922954 49636612 50353855 51050655 51704851 52298781 52823355 53281274 53686564
$$ packed form
56021B6221080K85009K67355K47684K27874K11467K03218K04693K12977K24825
56012B8306182K40047K59468K81189L00842L15132L23394L25416L19552L04837
56003C0976059K84724K66668K56408K53624K54913K60381K74592L00402L34406
55994C3462177L70097M03381M32591M54754M65270M61630M44976M17534L80981
55985C7293391L38607K97439K66313K51946K56930K79897L16382L60333M06260
55976D0067498M50199M88681N17907N34722N37368N24380M94343M49220L97657
55967D4461975L52461L23574L14534L25803L58816M14221M86835N64771O34363
55958D8237353O85601P13658P17243O96800O54196N93930N24574M57919M05290
$$ plain form
55949 53686564 54061145 54432300 54832088 55294820 55850343 56517416 57302237 58200338 59196658
55940 59196658 60264288 61367069 62466642 63528872 64527180 65445848 66284308 67058170 67794461
55931 67794461 68525422 69285304 70108281 71023586 72049227 73189092 74434827 75769394 77168895
55922 77168895 78601833 80028071 81401936 82681480 83838797 84863635 85760349 86546228
55914 86546228 87254922 87939012 88666327 89513193 90558097 91871750 93500920 95455219 97708054
55905 97708054 100209113 102895990 105700088 108552135 111389396 114159724 116821708 119347799
55897 119347799 121733565 124005696 126220064 128449515 130767201 133230941 135872465 138693502
55889 138693502 141666882 144739221 147835076 150864797 153734811 156355896 158646923 160533419
$$ packed form
55949E3686564L74581L71155L99788M62732N55523O67073P84821Q98101R96320
55940E9196658J067630J102781J099573J062230R98308R18668Q38460P73862P36291
55931F7794461P30961P59882Q22977R15305J025641J139865J245735J334567J399501
55922G7168895J432938J426238J373865J279544J157317J024838Q96714P85879
55914H6546228P08694O84090P27315Q46866J044904J313653J629170J954299K252835
55905I7708054K501059K686877K804098K852047K837261K770328K661984K526091
55897A19347799K385766K272131K214368K229451K317686K463740K641524K821037
55889A38693502K973380L072339L095855L029721K870014K621085K291027J886496
$$ plain form
55881 160533419 161939633 162777732 162947746 162359554 160966964 158788452 155900908 152416679
55873 152416679 148460190 144149571 139584145 134842699 129993075 125101572 120231398 115434474
55865 115434474 110747804 106195863 101792734 97543187 93446711 89502904 85712232 82072665
55857 82072665 78578401 75222001 71995639 68890827 65900400 63021964 60256944 57604859
55849 57604859 55059872 52613484 50258544 47989692 45802150 43692475 41659957 39705655
55841 39705655 37829986 36031887 34309813 32662498 31088793 29587519 28157748 26798852
55833 26798852 25509801 24288049 23129102 22027644 20979599 19983193 19038114 18143999
55825 18143999 17299667 16503028 15751347 15042216 14374534 13747682 13159382 12605355 12081540
$$ packed form
55881A60533419J406214Q38099J70014n88192j392590k178512k887544l484229
55873A52416679l956489m310619m565426m741446m849624m891503m870174m796924
55865A15434474m686670m551941m403129m249547m096476l943807l790672l639567
55857H2072665l494264l356400l226362l104812k990427k878436k765020k652085
55849E7604859k544987k446388k354940k268852k187542k109675k032518j954302
55841C9705655j875669j798099j722074j647315j573705j501274j429771j358896
55833B6798852j289051j221752j158947j101458j048045r96406r45079q94115
55825A8143999q44332p96639p51681p09131o67682o26852n88300n54027n23815
$$ plain form
55816 12081540 11585303 11113711 10662319 10227501 9809094 9409082 9028428 8666859 8324827
55807 8324827 8003171 7700744 7414402 7141686 6881957 6634779 6399102 6174434 5961029
55798 5961029 5758112 5563403 5375299 5194439 5022329 4859240 4703973 4554895 4410893
55789 4410893 4272283 4141010 4018857 3904994 3796229 3689876 3585244 3482304 3380701
55780 3380701 3280887 3184567 3092783 3004679 2919329 2837792 2761919 2691740 2625344 2561135 2499255
55769 2499255 2441050 2387864 2339937 2295603 2251860 2206754 2161254 2118206 2079481 2044574 2011720
55758 2011720 1979652 1948157 1917470 1887553 1858182 1829722 1803341 1779662 1757222 1733282 1706676
55747 1706676 1679317 1654397 1633618 1616549 1601899 1588558 1575720 1562876 1549859 1536615 1523152
$$ packed form
55816A2081540m96237m71592m51392m34818m18407m00012l80654l61569l42032
55807H324827l21656l02427k86342k72716k59729k47178k35677k24668k13405
55798E961029k02917j94709j88104j80860j72110j63089j55267j49078j44002
55789D410893j38610j31273j22153j13863j08765j06353j04632j02940j01603
55780C380701r9814r6320r1784q8104q5350q1537p5873p0179o6396o4209o1880
55769B499255n8205n3186m7927m4334m3743m5106m5500m3048l8725l4907l2854
55758B011720l2068l1495l0687k9917k9371k8460k6381k3679k2440k3940k6606
55747A706676k7359k4920k0779j7069j4650j3341j2838j2844j3017j3244j3463
$$ plain form
55736 1523152 1510012 1498405 1489263 1482206 1475921 1469461 1462707 1455495 1446889 1435941 1423213 1410940 1400891
55723 1400891 1391998 1381002 1366198 1350072 1337407 1331015 1329941 1331174 1331682 1328891 1321152 1308897 1294553
55710 1294553 1280435 1267194 1254742 1243728 1235096 1228696 1223248 1217485 1210713 1202556 1193011 1182703 1172358
55697 1172358 1161785 1149755 1135230 1118742 1102530 1089179 1079857 1073765 1069187 1064713 1059320 1052131
55685 1052131 1043137 1033881 1026294 1020802 1016483 1012945 1010676 1009260 1006736 1001539 994149 986210 979098 973937
55671 973937 971499 970635 967841 960204 948721 937461 929483 924605 920891 916915 912213 906719 900655 894539
55657 894539 888744 883104 877227 871160 865583 861197 857803 854199 849307 843323 837316 831853 826743 822103
55643 822103 818758 817321 817679 819634 823003 826688 828856 828938 828418 828578 828267 825138 818545 809995 801199 792896
$$ packed form
55736A523152j3140j1607r142p057o285o460o754p212q606j0948j2728j2273j0049
55723A400891q893j0996j4804j6126j2665o392j074J233N08k791p739j2255j4344
55710A294553j4118j3241j2452j1014q632o400n448n763o772q157r545j0308j0345
55697A172358j0573j2030j4525j6488j6212j3351r322o092m578m474n393p189
55685A052131q994r256p587n492m319l538k269j416k524n197p390p939p112n161
55671I73937k438q64k794p637j1483j1260p978m878l714l976m702n494o064o116
55657H94539n795n640n877o067n577m386l394l604m892n984o007n463n110m640
55643H22103l345j437L58J955L369L685K168Q2n20J60l11l129o593q550q796q303
$$ plain form
55627 792896 785381 778913 773521 769259 766592 765671 765376 763907 760350 755153 749573 745411 744526 747083 750497
55612 750497 751476 749161 745127 740637 735684 730928 728437 729330 732075 734340 735613 736648 737059 734992 729321
55597 729321 721214 713222 707291 703748 701949 701700 703748 708455 714203 718027 718233 715681 712173 708579 705237
55582 705237 703082 702871 703686 703828 703294 703919 706482 708966 708603 704807 699216 693604 688903 685587 683524 681546
55566 681546 678568 675303 673494 673213 672473 670098 667187 664513 660198 652121 641825 633740 630546 631166 633390
55551 633390 636470 640607 645605 650933 655912 659176 659231 656327 652720 650379 649299 648360 646563 643038 637524
55536 637524 631612 627934 627085 626946 626108 626133 628736 632250 633015 629437 623081 616704 612849 613032 616072 618067
55520 618067 616418 613517 614264 620139 627709 632778 633951 632298 629708 627827 626906 625547 622922 620483 619510
$$ packed form
55627G92896p515o468n392m262k667r21k95j469l557n197n580m162q85K557L414
55612G50497R79k315m034m490m953m756k491Q93K745K265J273J035M11k067n671
55597G29321q107p992n931l543j799k49K048M707N748L824K06k552l508l594l342
55582G05237k155k11Q15J42n34O25K563K484l63l796n591n612m701l316k063j978
55566F81546k978l265j809k81p40k375k911k674m315q077j0296q085l194O20K224
55551F33390L080M137M998N328M979L264N5k904l607k341j080r39j797l525n514
55536F37524n912l678q49j39q38K5K603L514P65l578o356o377l855J83L040J995
55520F18067j649k901P47N875P570N069J173j653k590j881r21j359k625k439r73
$$ plain form
55505 619510 617940 612626 604455 598036 595951 596493 597630 599594 602109 602583 599422 594501 589916 584633 577135
55490 577135 569421 565186 564947 565797 565455 564083 562469 560875 559861 560269 562012 564203 566541 569234 571578
55475 571578 571893 569151 563915 557851 552986 550971 551999 554519 556680 557684 557284 555006 551007 546891 544329
55460 544329 543233 542413 541583 541544 542687 544359 545373 544384 540551 534981 530792 530267 532243 533583 532941 531902
55444 531902 532683 535811 539821 542303 541629 538638 536306 536926 540196 544527 548881 552160 552508 549403 545454
55429 545454 543827 544429 544699 543550 542143 541257 540534 540336 541795 544688 547516 549858 552398 554655 555519 556291
55413 556291 559833 565602 568880 566886 562694 560493 559463 555653 548694 543192 543381 548723 555180 559114
55399 559114 559486 557569 555334 554064 554310 556485 560270 563496 563405 559727 554935 550779 546589 542217 540313
$$ packed form
55505F19510j570n314q171o419k085N42J137J964K515M74l161m921m585n283p498
55490E77135p714m235k39Q50l42j372j614j594j014M08J743K191K338K693K344
55475E71578L15k742n236o064m865k015J028K520K161J004m00k278l999m116k562
55460E44329j096q20q30l9J143J672J014r89l833n570m189n25J976J340o42j039
55444E31902P81L128M010K482o74k991k332O20L270M331M354L279L48l105l949
55429E45454j627O02K70j149j407q86p23j98J459K893K828K342K540K257Q64P72
55413E56291L542N769L278j994m192k201j030l810o959n502J89N342O457L934
55399E59114L72j917k235j270K46K175L785L226r1l678m792m156m190m372j904
$$ plain form
55384 540313 543177 548778 552678 553373 553291 554777 557392 559308 559247 556662 551925 547043 544681 545629 548040 549453
55368 549453 548807 546646 544650 545003 548703 553926 557205 556830 554257 551873 550466 549470 548662 548620 549791 551749
55352 551749 553409 553947 553645 553569 554026 553808 551709 548281 545076 542534 540011 537703 536855 537670 538617 538579 538279
55335 538279 538637 539095 538882 538925 540747 543750 545334 544048 541358 539789 540255 541982 544286 547214 550408 552451
55319 552451 552015 549348 546049 543600 542684 543621 546479 550443 554016 556483 558608 561320 564246 566102 565950
55304 565950 563362 558035 550309 541739 534170 528426 524683 523518 525291 528745 531686 533149 533626 533190 531141
55289 531141 528045 526317 527464 529828 530565 529454 529419 533176 540271 547854 554009 559729 567162 575959 582176
55274 582176 581614 573978 563090 553461 547603 545966 547516 550018 551375 551401 551177 550455 547442 542003 537272
$$ packed form
55384E40313K864N601L900O95q2J486K615J916o1k585m737m882k362R48K411J413
55368E49453o46k161j996L53L700N223L279l75k573k384j407r96q08m2J171J958
55352E51749J660N38l02p6M57k18k099l428l205k542k523k308q48Q15R47l8l00
55335E38279L58M58k13M3J822L003J584j286k690j569M66J727K304K928L194K043
55319E52451m36k667l299k449r16R37K858L964L573K467K125K712K926J856j52
55304E65950k588n327p726q570p569n744l743j165J773L454K941J463M77m36k049
55289E31141l096j728J147K364P37j111l5L757P095P583O155N720P433Q797O217
55274E82176n62p636j0888r629n858j637J550K502J357K6k24p22l013n439m731
$$ plain form
55259 537272 536541 539473 542636 543075 540493 537046 536085 539872 547029 553102 554974 553763 552095 550066 546257
55244 546257 541729 539954 542518 547281 551347 553901 555608 557120 558918 560845 561052 557153 549589 542488
55230 542488 540042 542952 548900 555027 559097 559972 558543 557269 557565 558575 559291 560330 562085 562756 560542
55215 560542 556965 555530 557191 559260 558860 555536 550422 545032 541382 541090 543164 544406 543264 541879 543016
55200 543016 546291 549115 550323 550892 551440 551153 549634 548260 548807 551418 554454 555834 554374 550708 547469
55185 547469 547647 551635 555956 555915 550020 541469 535111 533300 534923 537765 540601 542899 543758 542496 540020
55170 540020 538505 539576 543377 549141 555493 560100 560762 557796 554201 552410 551923 551260 550802 551711 553132
55155 553132 553231 552767 554514 558339 560008 556824 551955 550547 553266 556730 559187 562130 566177 568945 568400
$$ packed form
55259E37272p31K932L163M39k582l447r61L787P157O073J872j211j668k029l809
55244E46257m528j775K564M763M066K554J707J512J798J927K07l899p564p101
55230E42488k446K910N948O127M070Q75j429j274K96J010P16J039J755O71k214
55215E60542l577j435J661K069m00l324n114n390l650k92K074J242j142j385J137
55200E43016L275K824J208N69N48k87j519j374N47K611L036J380j460l666l239
55185E47469J78L988M321m1n895q551o358j811J623K842K836K298Q59j262k476
55170E40020j515J071L801N764O352M607O62k966l595j791m87o63m58R09J421
55155E53132R9m64J747L825J669l184m869j408K719L464K457K943M047K768n45
$$ plain form
55140 568400 565671 562749 559574 555643 552841 553946 558679 563640 566323 567327 568280 569433 570130 570183 569584
55125 569584 567758 564277 559923 556241 554384 554984 558397 563826 568591 569860 567555 564404 562565 561391
55111 561391 559349 556852 555505 555247 554395 552685 552089 553574 555006 554128 552462 553927 559848 567389 573107
55096 573107 576028 576613 574735 570383 565251 561787 560718 560586 559751 558085 556644 556249 556548 556458 555797 556288
55080 556288 560009 566497 572443 574973 574300 572280 569585 565952 562487 561639 564486 569458 574117 577190 578703
55065 578703 579386 580291 581861 582993 582206 580146 579669 582593 587429 591167 592344 591438 589279 586412 583414
55050 583414 580561 577470 574197 572355 573887 578770 584969 590484 594262 595160 591759 584121 574792 567136
55036 567136 562878 561667 562380 564247 567210 571895 578961 587693 595328 598521 596039 590092 584896 583652
$$ packed form
55140E68400k729k922l175l931k802J105M733M961K683J004R53J153O97N3n99
55125E69584j826l481m354l682j857O00L413N429M765J269k305l151j839j174
55111E61391k042k497j347k58q52j710n96J485J432q78j666J465N921P541N718
55096E73107K921N85j878m352n132l464j069j32q35j666j441l95K99r0o61M91
55080E56288L721O488N946K530o73k020k695l633l465q48K847M972M659L073J513
55065E78703O83R05J570J132p87k060m77K924M836L738J177r06k159k867k998
55050E83414k853l091l273j842J532M883O199N515L778Q98l401p638r329p656
55036E67136m258j211P13J867K963M685P066Q732P635L193k482n947n196j244
$$ plain form
55022 583652 586420 590582 593446 594518 595244 596833 598958 600645 601665 602467 603274 603905 604221 604028 602688 599566
55006 599566 594916 589743 584857 580824 578735 579747 583162 585939 585370 582107 579600 580459 584107 588127 591087
54991 591087 593481 596318 599422 601211 599968 595406 589227 584199 582546 584876 590120 596173 600872 603055
54977 603055 603089 602350 602123 602893 604252 605008 603685 599824 595125 592598 593879 597502 600348 600885 600595 601994
54961 601994 605401 608090 606981 602032 596391 593018 591960 591624 591891 594412 599828 606241 611200 614087 615631
54946 615631 615871 613825 609031 602689 597201 594752 595840 598861 601715 604033 606919 610249 611828 610346
54932 610346 607694 606461 606236 604792 602490 602694 607176 613454 617886 619623 620212 620822 621509 622115 622256 621004
54916 621004 618080 614976 613673 614519 616456 618931 622306 626559 630789 633979 635342 634243 631161 628536
$$ packed form
55022E83652K768M162K864J072P26J589K125J687J020Q02Q07O31L16j93j340l122
55006E99566m650n173m886m033k089J012L415K777n69l263k507Q59L648M020K960
54991E91087K394K837L104J789j243m562o179n028j653K330N244O053M699K183
54977F03055L4p39k27P70J359P56j323l861m699k527J281L623K846N37k90J399
54961F01994L407K689j109m949n641l373j058l36K67K521N416O413M959K887J544
54946F15631K40k046m794o342n488k449J088L021K854K318K886L330J579j482
54932F10346k652j233k25j444k302K04M482O278M432J737N89O10O87O06J41j252
54916F21004k924l104j303Q46J937K475L375M253M230L190J363j099l082k625
$$ plain form
54902 628536 629040 632626 636653 639325 641393 643726 645163 644502 643141 643270 643932 641683 635753 630009 628260
54887 628260 629643 630875 631648 634722 640721 645878 646284 642341 637525 634411 633789 636294 642211 649646 655048
54872 655048 656377 654655 652157 650195 648916 647976 646783 644860 642520 640663 639855 640259 642306 646428 652148
54857 652148 658473 665029 671399 675554 675034 670240 664690 661182 659583 659346 661875 668311 676526 682680 685087
54842 685087 684761 683022 680522 677826 674813 670104 663426 658063 658137 663235 668342 669877 669324 669756 671214
54827 671214 671452 669681 667340 665746 664707 663370 661404 659484 659163 661590 665547 667492 664821 658852 653622
54812 653622 651800 652525 653178 652449 651471 652313 655495 658994 660058 658077 655036 652889 651388 649239 646564
54797 646564 644998 645548 647508 649614 651350 652838 654116 654874 654591 652849 649914 646940 644970 643616 641434
$$ packed form
54902F28536N04L586M027K672K068K333J437o61j361J29O62k249n930n744j749
54887F28260J383J232P73L074N999N157M06l943m816l114o22K505N917P435N402
54872F55048J329j722k498j962j279r40j193j923k340j857q08M04K047M122N720
54857F52148O325O556O370M155n20m794n550l508j599k37K529O436Q215O154K407
54842F85087l26j739k500k696l013m709o678n363P4N098N107J535n53M32J458
54827F71214K38j771k341j594j039j337j966j920l21K427L957J945k671n969n230
54812F53622j822P25O53p29r78Q42L182L499J064j981l041k147j501k149k675
54797F46564j566N50J960K106J736J488J278P58k83j742k935k974j970j354k182
$$ plain form
54782 641434 637915 634607 633780 636338 641379 647274 652620 656419 658142 657835 655913 652947 649902 648195 648685
54767 648685 650785 653469 657041 662528 668911 672583 670858 664899 657706 650369 642543 635951 634136 637727
54753 637727 642553 644358 643807 644943 649905 657073 663547 667380 667757 665069 661065 657438 654040 649521 643728
54738 643728 638233 634608 633313 634197 636818 640324 644127 648504 653440 657367 658661 658071 657865 658807 659930
54723 659930 661201 663971 668431 673063 677350 682509 688488 692713 693365 691618 688898 684356 677526 671412
54709 671412 669760 672357 675997 679311 683419 688044 690603 690193 689613 691681 695312 696949 694785 690155 685523
54694 685523 682520 681855 683976 689040 696023 702201 704565 702754 699960 699606 701215 700894 696054 688288 681079
54679 681079 675870 671395 666227 661149 659053 662601 671475 681724 688530 690063 688315 686123 684182 681425
$$ packed form
54782F41434l519l308q27K558N041N895N346L799J723l07j922k966l045j707M90
54767F48685K100K684L572N487O383L672j725n959p193p337p826o592j815L591
54753F37727M826J805n51J136M962P168O474L833L77k688m004l627l398m519n793
54738F43728n495l625j295Q84K621L506L803M377M936L927J294n90k06R42J123
54723F59930J271K770M460M632M287N159N979M225O52j747k720m542o830o114
54709F71412j652K597L640L314M108M625K559m10n80K068L631J637k164m630m632
54694F85523l003o65K121N064O983O178K364j811k794l54J609l21m840p766p209
54679F81079n209m475n168n078k096L548Q874J0249O806J533j748k192j941k757
$$ plain form
54665 681425 677519 673991 672894 674927 679032 683561 687602 691126 694151 696250 696970 696115 693327 688130 681273
54650 681273 675581 674247 677980 684368 690001 692632 691566 687246 681129 675258 671097 668649 666921 665198
54636 665198 663776 663387 663923 664108 663038 661803 662399 664721 666171 665343 664622 667177 672224 675641 675230 673085
54620 673085 672242 673216 674896 676858 678946 679731 677316 671574 664467 658376 654959 655211 659246 665583 671347
54605 671347 673840 672331 668580 665417 664231 663841 662481 660707 661220 665540 672034 677922 682147 685365 688046
54590 688046 689832 690220 688809 685363 680845 677976 679288 684308 689719 692596 692604 690868 687817 683136 677179
54575 677179 671364 666940 664090 662589 662815 665338 669561 673639 676283 677990 679780 681317 681578 681125 682074
54560 682074 685223 688683 690393 690874 692029 693843 693978 690838 685851 682170 681697 683665 685549 685080 681780
$$ packed form
54665F81425l906l528j097K033M105M529M041L524L025K099P20q55k788n197o857
54650F81273n692j334L733O388N633K631j066m320o117n871m161k448j728j723
54636F65198j422l89N36J85j070j235N96K322J450q28p21K555N047L417m11k145
54620F73085q43R74J680J962K088P85k415n742p107o091l417K52M035O337N764
54605F71347K493j509l751l163j186l90j360j774N13M320O494N888M225L218K681
54590F88046J786L88j411l446m518k869J312N020N411K877Qj736l051m681n957
54575F77179n815m424k850j501K26K523M223M078K644J707J790J537K61m53R49
54560F82074L149L460J710M81J155J814J35l140m987l681m73J968J884m69l300
$$ plain form
54545 681780 677118 673385 672352 674604 679463 685354 690846 695763 700894 706352 710971 713697 714666 714060 711049
54530 711049 705468 700001 698582 702123 707258 709966 709158 706063 701688 696523 691972 690085 691442 694361
54516 694361 696637 697328 696583 694680 692152 690453 691511 696109 702964 709654 714474 717323 718961 719650 718832
54501 718832 716195 712805 710736 711394 714379 718017 720655 721303 719749 716832 714342 713654 714211 714072 712196
54486 712196 709447 707156 705730 705283 706537 710033 715146 720935 727252 733750 738494 739422 737144 734554 733381
54471 733381 732704 731295 729730 729344 730598 733522 738380 744551 749743 751786 750648 747619 743318 738057 733659
54456 733659 733007 737163 743878 749445 751534 750271 747259 743977 740925 738139 736138 735745 736906 738515 739771
54441 739771 740995 742761 745119 748073 751651 754856 756008 755249 755231 757622 760117 759065 754269 748848 744674
$$ packed form
54545F81780m662l733j033K252M859N891N492M917N131N458M619K726R69o06l011
54530G11049n581n467j419L541N135K708q08l095m375n165m551j887J357K919
54516F94361K276O91p45j903k528j699J058M598O855O690M820K849J638O89q18
54501G18832k637l390k069O58K985L638K638O48j554k917k490o88N57j39j876
54486G12196k749k291j426m47J254L496N113N789O317O498M744R28k278k590j173
54471G33381o77j409j565l86J254K924M858O171N192K043j138l029m301n261m398
54456G33659o52M156O715N567K089j263l012l282l052k786k001l93J161J609J256
54441G39771J224J766K358K954L578L205J152p59j8K391K495j052m796n421m174
$$ plain form
54426 744674 740652 735938 732332 732232 735933 742164 749863 757992 764675 768198 768719 767969 767305 766752 765938 765386
54410 765386 766469 769982 774888 778945 780702 780223 777672 772553 765384 758897 755730 755520 755932 755841 755469 754152
54394 754152 750970 747714 748148 753344 760261 765840 769743 771929 771026 767604 766003 769407 774983 777591 777063
54379 777063 777867 781986 786214 787186 785505 783465 781606 779430 777457 776553 776613 777555 780390 785498 790588 792271
54363 792271 789781 786059 785060 788439 794463 799430 800490 797963 794961 794418 796680 800109 803151 804775 803550
54348 803550 798127 789564 782136 780299 784560 791102 795835 798008 799224 799896 798527 794661 790857 790583 794959
54333 794959 802369 810313 816552 819492 819143 817368 815707 813312 808620 802823 799532 800468 803388 805263 805758
54318 805758 806209 806468 804856 801087 797665 797753 802083 808150 812329 812890 811078 809308 808820 809675 812212 816826
$$ packed form
54426G44674m022m714l606j00L701O231P699Q129O683L523N21p50o64n53q14n52
54410G65386J083L513M906M057J757m79k551n119p169o487l167k10M12r1l72j317
54394G54152l182l256M34N196O917N579L903K186r03l422j601L404N576K608n28
54379G77063Q04M119M228R72j681k040j859k176j973r04O0R42K835N108N090J683
54363G92271k490l722r99L379O024M967J060k527l002n43K262L429L042J624j225
54348H03550n423q563p428j837M261O542M733K173J216O72j369l866l804k74M376
54333G94959P410P944O239K940l49j775j661k395m692n797l291R36K920J875M95
54318H05758M51K59j612l769l422Q8M330O067M179N61j812j770m88Q55K537M614
$$ plain form
54302 816826 822276 826199 828077 829945 832924 834799 832999 828793 826088 826337 826931 824964 820640 816331 813977
54287 813977 814341 817248 821096 823125 821863 819182 818594 821199 824109 823233 817172 808287 800616 797223 799070
54272 799070 805371 814410 824187 832801 838644 840539 838191 832771 826736 822340 820076 818812 817389 815660
54258 815660 814085 813157 813492 815695 819516 823706 827274 830394 833449 835818 836542 835828 834757 833538 831248
54243 831248 827739 824859 825020 828856 834749 840447 844659 847122 847765 846482 843841 841317 839939 838873 836428
54228 836428 832836 830936 833155 838430 842917 843312 838836 831057 823229 819242 821255 827830 835267 840929
54214 840929 844468 846476 847687 849511 853137 857188 857992 853526 846134 840226 838222 839766 843714 849155
54200 849155 854839 859208 861424 861757 861039 860198 859834 859481 857634 853289 847374 842241 840054 841845 847091
$$ packed form
54302H16826N450L923J878J868K979J875j800m206k705K49N94j967m324m309k354
54287H13977L64K907L848K029j262k681n88K605K910q76o061q885p671l393J847
54272G99070O301R039R777Q614N843J895k348n420o035m396k264j264j423j729
54258H15660j575r28L35K203L821M190L568L120L055K369P24p14j071j219k290
54243H31248l509k880J61L836N893N698M212K463O43j283k641k524j378j066k445
54228H36428l592j900K219N275M487L95m476p779p828l987K013O575P437N662
54214H40929L539K008J211J824L626M051Q04m466p392n908k004J544L948N441
54200H49155N684M369K216L33p18q41l64l53j847m345n915n133k187J791N246
$$ plain form
54185 847091 853406 857701 859021 859668 862234 866061 868226 867613 866147 865803 866323 866524 866306 866246 866339 866350 866818
54168 866818 868550 871239 873222 872642 868831 863172 858738 858210 861422 865532 868114 869447 871090 873093 873928
54153 873928 872904 871211 870213 869892 869676 869937 871615 874548 877181 878114 877303 875548 873578 872211 872725 875930
54137 875930 880858 885238 887599 888315 888447 888371 888098 888214 889750 893250 898328 903788 908096 910549 912344 915370
54121 915370 919204 920592 917394 912075 909272 910256 911976 911814 910984 912106 915159 917530 917231 914579 911080
54106 911080 907955 905794 904642 904082 903710 903911 905997 911247 919430 928140 934104 935808 934763 933894 935028
54091 935028 938401 943718 950275 956362 960191 961771 962692 963847 964582 964276 963285 961861 959693 957227 955929
54076 955929 956269 956732 955797 953755 951717 950266 950172 952805 958088 963242 965481 965287 965399 967286 970325 973711
$$ packed form
54185H47091O315M295J320O47K566L827K165o13j466l44N20K01k18o0R3J1M68
54168H66818J732K689J983n80l811n659m434n28L212M110K582J333J643K003Q35
54153H73928j024j693r98l21k16K61J678K933K633R33q11j755j970j367N14L205
54137H75930M928M380K361P16J32p6k73J16J536L500N078N460M308K453J795L026
54121I15370L834J388l198n319k803R84J720j62q30J122L053K371k99k652l499
54106I11080l125k161j152n60l72K01K086N250Q183Q710N964J704j045q69J134
54091I35028L373N317O557O087L829J580R21J155P35l06r91j424k168k466j298
54076I55929L40M63r35k042k038j451r4K633N283N154K239j94J12J887L039L386
$$ plain form
54060 973711 977144 979837 980833 980499 980300 981098 982958 986246 991222 996608 1000163 1000903 999619 997533 996002
54045 996002 997096 1002214 1009766 1016122 1019446 1021183 1023513 1026960 1030789 1033870 1034751 1032783 1029748 1028436
54031 1028436 1029062 1029382 1029025 1030800 1035809 1040150 1039504 1035318 1033054 1034988 1038153 1039616 1040655 1044328 1050982
54016 1050982 1057984 1062948 1065839 1068048 1070357 1072258 1073316 1074751 1078608 1084815 1090265 1092253 1092128 1093800
54002 1093800 1098683 1103930 1106128 1105097 1103198 1102297 1102639 1103738 1105004 1105838 1106320 1107551 1110413 1114184 1117485
53987 1117485 1120475 1124759 1130786 1136672 1140433 1142157 1142677 1141076 1135623 1127259 1119978 1116731 1116517 1116899 1118041
53972 1118041 1122286 1130365 1140194 1149560 1157990 1165413 1170777 1173222 1173568 1173449 1173560 1173556 1173092 1172204 1171230 1170978
53956 1170978 1172354 1175203 1178211 1180613 1183182 1186721 1190520 1193436 1195590 1197425 1197786 1194979 1189918 1186211
$$ packed form
54060I73711L433K693R96l34j99P98J860L288M976N386L555P40j284k086j531
54045I96002J094N118P552O356L324J737K330L447L829L081Q81j968l035j312
54031A028436O26L20l57J775N009M341o46m186k264J934L165J463J039L673O654
54016A050982P002M964K891K209K309J901J058J435L857O207N450J988j25J672
54002A093800M883N247K198j031j899r01L42J099J266Q34M82J231K862L771L301
53987A117485K990M284O027N886L761J724N20j601n453q364p281l247k14L82J142
53972A118041M245Q079R829R366Q430P423N364K445L46j19J11mm64q88r74k52
53956A170978J376K849L008K402K569L539L799K916K154J835L61k807n061l707
$$ plain form
53942 1186211 1186258 1188649 1190363 1190365 1189839 1189735 1189681 1189178 1188439 1187659 1186473 1184757 1183191 1182254 1181054 1178058 1172971
53925 1172971 1167224 1162556 1159745 1158655 1158619 1158606 1158062 1158046 1160335 1164598 1167711 1167316 1165177 1165439 1170127 1177899
53909 1177899 1186310 1193037 1195527 1192675 1187490 1185152 1187067 1189338 1188649 1187024 1188486 1193259 1198279 1201955
53895 1201955 1205261 1208813 1211974 1214746 1217816 1220636 1222130 1223551 1227877 1235458 1242653 1246046 1246183 1245955
53881 1245955 1246995 1249046 1251514 1254086 1256653 1259707 1264205 1270216 1276484 1281976 1286931 1291702 1295773 1298937
53867 1298937 1302354 1307080 1312092 1314973 1314293 1310620 1305839 1302294 1301885 1304760 1309189 1313487 1317687 1322634
53853 1322634 1328328 1334279 1340673 1347586 1353465 1356155 1355482 1353147 1349922 1344904 1338382 1333347 1332343 1333888
53839 1333888 1334098 1331528 1328500 1327541 1328512 1330078 1332176 1335324 1338406 1339143 1336811 1333009 1329478 1326381 1323109
$$ packed form
53942A186211M7K391J714Kn26j04n4n03p39p80j186j716j566r37j200k996n087
53925A172971n747m668k811j090l6j3n44j6K289M263L113l95k139K62M688P772
53909A177899Q411O727K490k852n185k338J915K271o89j625J462M773N020L676
53895A201955L306L552L161K772L070K820J494J421M326P581P195L393J37k28
53881A245955J040K051K468K572K567L054M498O011O268N492M955M771M071L164
53867A298937L417M726N012K881o80l673m781l545m09K875M429M298M200M947
53853A322634N694N951O394O913N879K690o73k335l225n018o522n035j004J545
53839A333888K10k570l028r59R71J566K098L148L082P37k332l802l531l097l272
$$ plain form
53824 1323109 1319456 1315290 1310132 1304156 1299016 1296701 1297745 1301001 1304718 1307350 1308075 1307382 1306778 1307343 1309054
53809 1309054 1311831 1316105 1321401 1325494 1326433 1324804 1322646 1320715 1318259 1314829 1310547 1305059 1298275 1292137
53795 1292137 1289695 1292003 1297330 1303474 1309172 1313368 1315290 1315764 1316494 1317541 1317426 1316154 1315682 1316524 1316438 1314030
53779 1314030 1311292 1310649 1311512 1311993 1312291 1313806 1316177 1317990 1319677 1323046 1328109 1332772 1335709 1337453 1338615
53764 1338615 1339194 1340063 1343055 1348623 1354726 1358952 1361147 1363640 1369295 1378940 1389889 1397656 1400453 1401297
53750 1401297 1404116 1408555 1411065 1410796 1411192 1414657 1418531 1418694 1415498 1413596 1416461 1423261 1431096 1438184 1444001
53735 1444001 1447910 1449404 1449409 1449861 1451307 1452029 1450653 1448941 1450252 1455143 1460508 1463885 1466510 1470308 1473576
53720 1473576 1472516 1466695 1460352 1457919 1460184 1465260 1471267 1477286 1483241 1489680 1496490 1501608 1502678 1500420
$$ packed form
53824A323109l653m166n158n976n140k315J044L256L717K632P25o93o04N65J711
53809A309054K777M274N296M093R39j629k158j931k456l430m282n488o784o138
53795A292137k442K308N327O144N698M196J922M74P30J047j15j272m72Q42q6k408
53779A314030k738o43Q63M81K98J515K371J813J687L369N063M663K937J744J162
53764A338615N79Q69K992N568O103M226K195K493N655R645J0949P767K797Q44
53750A401297K819M439K510k69L96L465L874J63l196j902K865O800P835P088N817
53735A444001L909J494NM52J446P22j376j712J311M891N365L377K625L798L268
53720A473576j060n821o343k433K265N076O007O019N955O439O810N118J070k258
$$ plain form
53706 1500420 1498362 1498398 1498630 1496909 1494519 1494356 1496769 1499414 1500709 1501579 1503917 1508681 1515478 1522974 1529891
53691 1529891 1536203 1542729 1548803 1551543 1548954 1543101 1538462 1537440 1539062 1541889 1546245 1553066 1562002 1571506
53677 1571506 1580023 1586643 1591257 1594422 1596574 1597396 1596713 1595891 1597241 1601641 1607684 1613576 1619064 1624957 1631421
53662 1631421 1637538 1642352 1645911 1649206 1653116 1657278 1660306 1661636 1662900 1666708 1674008 1683273 1692113 1698876
53648 1698876 1702833 1704246 1704783 1706599 1710130 1713735 1716442 1720007 1726742 1735782 1743317 1746875 1747874 1749214
53634 1749214 1751636 1753792 1755299 1757903 1763050 1769514 1774614 1777519 1780281 1785347 1792942 1801367 1809161 1816033
53620 1816033 1822217 1828110 1834605 1842478 1850795 1856881 1858940 1858289 1858136 1860530 1865365 1871870 1879443 1886825
53606 1886825 1892180 1895127 1897556 1901141 1904898 1906877 1907773 1910657 1916712 1923389 1928143 1932286 1939092 1948871
$$ packed form
53706A500420k058L6K32j721k390j63K413K645J295Q70K338M764O797P496O917
53691A529891O312O526O074K740k589n853m639j022J622K827M356O821Q936R504
53677A571506Q517O620M614L165K152Q22o83q22J350M400O043N892N488N893O464
53662A631421O117M814L559L295L910M162L028J330J264L808P300R265Q840O763
53648A698876L957J413N37J816L531L605K707L565O735R040P535L558R99J340
53634A749214K422K156J507K604N147O464N100K905K762N066P595Q425P794O872
53620A816033O184N893O495P873Q317O086K059o51j53K394M835O505P573P382
53606A886825N355K947K429L585L757J979Q96K884O055O677M754M143O806R779
$$ plain form
53592 1948871 1958256 1964468 1968333 1972537 1978729 1987237 1997908 2009517 2019358 2025337 2028271 2030662 2033445
53579 2033445 2035636 2037280 2040778 2048188 2058488 2068755 2077317 2084628 2091736 2099208 2107332 2116002 2124400
53566 2124400 2131831 2138900 2146646 2154470 2160569 2165062 2170997 2180780 2192763 2203153 2210674 2217420 2225321
53553 2225321 2234047 2242912 2252591 2263343 2273004 2278749 2280581 2281752 2285798 2294017 2305386 2317591 2328184
53540 2328184 2336039 2342211 2348764 2356550 2364611 2371672 2377557 2383205 2390063 2399354 2411044 2423327 2434021
53527 2434021 2442803 2451468 2461786 2473691 2485791 2496894 2506638 2515041 2521885 2526584 2529000 2530688 2534717
53514 2534717 2543286 2555621 2568968 2581353 2592612 2603447 2614950 2628580 2644628 2660594 2673022
53503 2673022 2681396 2688438 2696233 2704322 2712243 2721191 2731430 2740517 2746731 2752725 2762993 2778553 2796586
$$ packed form
53592A948871R385O212L865M204O192Q508J0671J1609R841N979K934K391K783
53579B033445K191J644L498P410J0300J0267Q562P311P108P472Q124Q670Q398
53566B124400P431P069P746P824O099M493N935R783J1983J0390P521O746P901
53553B225321Q726Q865R679J0752R661N745J832J171M046Q219J1369J2205J0593
53540B328184P855O172O553P786Q061P061N885N648O858R291J1690J2283J0694
53527B434021Q782Q665J0318J1905J2100J1103R744Q403O844M699K416J688M029
53514B534717Q569J2335J3347J2385J1259J0835J1503J3630J6048J5966J2428
53503B673022Q374P042P795Q089P921Q948J0239R087O214N994J0268J5560J8033
$$ plain form
53490 2796586 2814697 2832833 2851027 2867930 2882384 2894815 2906440 2918161 2930499 2943710 2958154
53479 2958154 2975319 2997369 3023859 3049701 3068928 3080608 3089057 3098341 3109002 3120519 3134148 3151770
53467 3151770 3173469 3197461 3221448 3243690 3264141 3284843 3307648 3331324 3352764 3371204 3389011
53456 3389011 3407971 3427590 3447818 3470202 3494562 3517469 3536618 3554557 3575459 3599923 3625348
53445 3625348 3649715 3672482 3693562 3714289 3737753 3764894 3791636 3813335 3830986 3849267 3869504
53434 3869504 3889151 3907967 3929429 3954725 3980107 4002394 4022913 4043085 4059932 4070066 4075868
53423 4075868 4083577 4096103 4111034 4125158 4137697 4149008 4158945 4167331 4174337 4179881 4183870 4187000 4189982
53410 4189982 4192011 4191438 4188034 4183307 4178417 4172971 4166086 4157713 4148815 4141039 4135914 4133332 4131010 4126685
$$ packed form
53490B796586J8111J8136J8194J6903J4454J2431J1625J1721J2338J3211J4444
53479B958154J7165K2050K6490K5842J9227J1680Q449R284J0661J1517J3629J7622
53467C151770K1699K3992K3987K2242K0451K0702K2805K3676K1440J8440J7807
53456C389011J8960J9619K0228K2384K4360K2907J9149J7939K0902K4464K5425
53445C625348K4367K2767K1080K0727K3464K7141K6742K1699J7651J8281K0237
53434C869504J9647J8816K1462K5296K5382K2287K0519K0172J6847J0134N802
53423D075868P709J2526J4931J4124J2539J1311R937Q386P006N544L989L130K982
53410D189982K029n73l404m727m890n446o885q373q898p776n125k582k322m325
$$ plain form
53396 4126685 4120748 4115575 4112368 4110037 4107221 4103821 4100186 4096271 4092353 4089321 4087212 4084269 4078464 4069776
53382 4069776 4060576 4054218 4053369 4058687 4068230 4078622 4087497 4094756 4101391 4107955 4114771 4122923 4133835 4147617
53368 4147617 4162237 4174752 4183654 4190453 4198877 4211896 4229341 4248737 4268160 4287254 4305649 4322290
53356 4322290 4337518 4354369 4375755 4400492 4423906 4442985 4459731 4478533 4500848 4523615 4543182
53345 4543182 4560139 4579308 4604536 4634220 4663105 4688292 4711901 4737271 4764447 4791137 4816740
53334 4816740 4842719 4869093 4893296 4913494 4930829 4946929 4960909 4970913 4977530 4983433 4989961 4996060
53322 4996060 5000684 5004213 5006932 5007930 5006564 5003757 5000505 4995920 4987966 4975716 4959851 4941217 4919909
53309 4919909 4895664 4868325 4837957 4805107 4770893 4736253 4701182 4665093 4627463 4587575 4544400
$$ packed form
53396D126685n937n173l207k331k816l400l635l915l918l032k109k943n805q688
53382D069776r200o358q49N318R543J0392Q875P259O635O564O816Q152J0912J3782
53368D147617J4620J2515Q902O799Q424J3019J7445J9396J9423J9094J8395J6641
53356D322290J5228J6851K1386K4737K3414J9079J6746J8802K2315K2767J9567
53345D543182J6957J9169K5228K9684K8885K5187K3609K5370K7176K6690K5603
53334D816740K5979K6374K4203K0198J7335J6100J3980J0004O617N903O528O099
53322D996060M624L529K719R98j366k807l252m585p954j2250j5865j8634k1308
53309D919909k4245k7339l0368l2850l4214l4640l5071l6089l7630l9888m3175
$$ plain form
53298 4544400 4497865 4449830 4402506 4356054 4308924 4260176 4209988 4158411 4105986 4055714 4011491
53287 4011491 3973136 3935395 3893840 3849834 3807595 3768411 3730641 3693768 3658714 3624684 3589443
53276 3589443 3553056 3518006 3485197 3453307 3422730 3396030 3372723 3347872 3318919 3290268 3267120
53265 3267120 3247652 3226256 3202765 3182882 3169531 3158991 3146698 3132306 3117210 3101206 3084282
53254 3084282 3068606 3055846 3044717 3033587 3023288 3014823 3006560 2996945 2988234 2983924 2983338 2982306 2978756
53241 2978756 2974273 2970298 2966531 2963681 2963938 2967018 2968901 2966764 2962724 2960233 2958713 2954719 2947429 2939979
53227 2939979 2935293 2932829 2929881 2924343 2915620 2904280 2891717 2879571 2868851 2859597 2851053 2841607 2828987
53214 2828987 2811596 2789784 2765135 2738523 2709604 2678301 2646048 2615378 2588552 2566130 2545969
$$ packed form
53298D544400m6535m8035m7324m6452m7130m8748n0188n1577n2425n0272m4223
53287D011491l8355l7741m1555m4006m2239l9184l7770l6873l5054l4030l5241
53276C589443l6387l5050l2809l1890l0577k6700k3307k4851k8953k8651k3148
53265C267120j9468k1396k3491j9883j3351j0540j2293j4392j5096j6004j6924
53254C084282j5676j2760j1129j1130j0299q465q263r615q711m310n86j032l550
53241B978756m483l975l767k850K57L080J883k137m040k491j520l994p290p450
53227B939979m686k464k948n538q723j1340j2563j2146j0720r254q544r446j2620
53214B828987j7391k1812k4649k6612k8919l1303l2253l0670k6826k2422k0161
$$ plain form
53203 2545969 2523943 2496955 2465608 2433001 2400816 2367942 2333467 2299391 2268808 2242005 2215841
53192 2215841 2186912 2154337 2119718 2085728 2054817 2027723 2002420 1975639 1946499 1917831 1892755
53181 1892755 1870756 1848694 1825166 1801518 1778142 1752634 1723719 1695007 1671499 1652701 1632580
53170 1632580 1607348 1580421 1557708 1540165 1523690 1505220 1485948 1468436 1453162 1438965 1425317
53159 1425317 1412894 1402389 1393353 1384040 1372704 1359563 1346913 1336275 1326100 1313662 1298713 1283401
53147 1283401 1269042 1255324 1242613 1232127 1223066 1212536 1199915 1188590 1181225 1175803 1169030 1161543
53135 1161543 1156294 1153188 1149149 1143098 1137092 1132194 1126805 1120149 1114234 1110645 1107850 1103453 1097320 1090892
$$ packed form
53203B545969k2026k6988l1347l2607l2185l2874l4475l4076l0583k6803k6164
53192B215841k8929l2575l4619l3990l0911k7094k5303k6781k9140k8668k5076
53181A892755k1999k2062k3528k3648k3376k5508k8915k8712k3508j8798k0121
53170A632580k5232k6927k2713j7543j6475j8470j9272j7512j5274j4197j3648
53159A425317j2423j0505r036r313j1336j3141j2650j0638j0175j2438j4949j5312
53147A283401j4359j3718j2711j0486r061j0530j2621j1325p365n422o773p487
53135A161543n249l106m039o051o006m898n389o656n915l589k795m397o133o428
$$ [...]
##END NTUPLES=NMR SPECTRUM
##END=
