
##TITLE=UV1040_TOSA01-ROVE100B_6099550_M4QxPf6Al5
##JCAMPDX= 6.0         $$ Bruker NMR JCAMP-DX V2.0
##DATA TYPE= NMR SPECTRUM
##DATA CLASS= NTUPLES
##ORIGIN= BRUKER
##OWNER= Administrator
$$ 1.72 TOPSPIN		Version 2.1
$$ 2012-05-12 19:34:04.453 -0500  Administrator@TOPSPIN
$$ Compression mode = diff/dup
##.OBSERVE FREQUENCY= 400.13188235
##.OBSERVE NUCLEUS= ^1H
##.ACQUISITION MODE= SIMULTANEOUS (DQD)
##.ACQUISITION SCHEME= undefined
##.AVERAGES= 8
##.DIGITISER RES= 22
##SPECTROMETER/DATA SYSTEM= spect
##.PULSE SEQUENCE= zg30
##.SOLVENT NAME= COFFEE_meoh
##.SHIFT REFERENCE= INTERNAL, COFFEE_meoh, 1, 14.98061
##AUDIT TRAIL= $$ (NUMBER, WHEN, WHO, WHERE, PROCESS, VERSION, WHAT)
$$ ##TITLE= Audit trail, TOPSPIN		Version 2.1
$$ ##JCAMPDX= 5.01
$$ ##ORIGIN= Bruker BioSpin GmbH
$$ ##OWNER= Administrator
$$ $$ C:\Bruker\TOPSPIN/data/COFFEE/nmr/UV1040_TOSA01-ROVE100B_6099550_M4QxPf6Al5/10/pdata/1/auditp.txt
$$ ##AUDIT TRAIL=  $$ (NUMBER, WHEN, WHO, WHERE, PROCESS, VERSION, WHAT)
(   1,<2012-05-12 19:33:57.328 -0500>,<Administrator>,<TOPSPIN>,<go>,<TOPSPIN 2.1>,
      <created by zg
	started at 2012-05-12 19:32:50.843 -0500,
	POWCHK enabled, PULCHK disabled,
       configuration hash MD5:
       AF F2 23 6B 01 CD 40 DD E5 A1 38 A0 06 EA F7 77
       data hash MD5: 64K
       6A E2 AF BF 3C 75 18 A2 E6 87 5E 2B 35 47 F1 28>)
(   2,<2012-05-12 19:34:00.187 -0500>,<Administrator>,<TOPSPIN>,<proc1d>,<TOPSPIN 2.1>,
      <Start of raw data processing
       efp LB = 0 FT_mod = 6 PKNL = 1 PHC0 = 0 PHC1 = 0 SI = 32K 
       data hash MD5: 32K
       35 E3 46 C3 EC 86 99 22 00 10 66 53 FB 7F BB 40>)
(   3,<2012-05-12 19:34:00.578 -0500>,<Administrator>,<TOPSPIN>,<proc1d>,<TOPSPIN 2.1>,
      <pk PHC0 = 217.2986 PHC1 = 0 
       data hash MD5: 32K
       B6 EC 4C 6B A4 AD D0 11 31 38 6E BE 0A 38 97 CC>)
(   4,<2012-05-12 19:34:00.671 -0500>,<Administrator>,<TOPSPIN>,<proc1d>,<TOPSPIN 2.1>,
      <abs ABSG = 1 
       data hash MD5: 32K
       2C FF 8B 24 EC 90 80 61 B6 33 41 F8 14 A2 C4 23>)
(   5,<2012-05-12 19:34:00.703 -0500>,<Administrator>,<TOPSPIN>,<proc1d>,<TOPSPIN 2.1>,
      <abs ABSG = 2 
       data hash MD5: 32K
       D5 57 3D D8 88 2B FF 3E 7D 89 D8 A4 86 C6 87 CB>)
(   6,<2012-05-12 19:34:00.734 -0500>,<Administrator>,<TOPSPIN>,<proc1d>,<TOPSPIN 2.1>,
      <abs ABSG = 3 
       data hash MD5: 32K
       F1 78 21 01 22 C9 94 E9 AA 78 EE C7 14 D6 15 7E>)
(   7,<2012-05-12 19:34:00.765 -0500>,<Administrator>,<TOPSPIN>,<proc1d>,<TOPSPIN 2.1>,
      <abs ABSG = 4 
       data hash MD5: 32K
       E1 93 6C E3 10 E9 BC 5A E8 C8 CF DF 7C 27 13 42>)
(   8,<2012-05-12 19:34:00.796 -0500>,<Administrator>,<TOPSPIN>,<proc1d>,<TOPSPIN 2.1>,
      <abs ABSG = 5 
       data hash MD5: 32K
       BA 26 E2 D1 F4 D7 A1 30 B6 49 03 53 A8 6F 29 C6>)
$$ ##END=
$$ 
$$ $$ hash MD5
$$ $$ 28 6E 77 0E 8B 40 39 2C F5 34 0D 10 E0 ED 6E 1E
##$RELAX= 
##$RELAX= 
##$RELAX= 
##$RELAX= 
##$RELAX= 
##$RELAX= 
##$RELAX= 
$$ Bruker specific parameters
$$ --------------------------
$$ [...]
##$TP= (0..7)
150 150 150 150 150 150 150 150
##$TP07= 0
##$TPNAME0= <>
##$TPNAME1= <>
##$TPNAME2= <>
##$TPNAME3= <>
##$TPNAME4= <>
##$TPNAME5= <>
##$TPNAME6= <>
##$TPNAME7= <>
##$TPOAL= (0..7)
0.5 0.5 0.5 0.5 0.5 0.5 0.5 0.5
##$TPOFFS= (0..7)
0 0 0 0 0 0 0 0
##$TUNHIN= 0
##$TUNHOUT= 0
##$TUNXOUT= 0
##$USERA1= <user>
##$USERA2= <user>
##$USERA3= <user>
##$USERA4= <user>
##$USERA5= <user>
##$V9= 5
##$VALIST= <valist>
##$VCLIST= <CCCCCCCCCCCCCCC>
##$VD= 0
##$VDLIST= <DDDDDDDDDDDDDDD>
##$VPLIST= <PPPPPPPPPPPPPPP>
##$VTLIST= <TTTTTTTTTTTTTTT>
##$WBST= 2048
##$WBSW= 25
##$XGAIN= (0..3)
0 0 0 0
##$XL= 0
##$YL= 0
##$YMAX_a= 534624
##$YMIN_a= -620956
##$ZGOPTNS= <>
##$ZL1= 120
##$ZL2= 120
##$ZL3= 120
##$ZL4= 120
##$ABSF1= 14.98061
##$ABSF2= -5.57192
##$ABSG= 5
##$ABSL= 3
##$ALPHA= 0
##$AQORDER= 0
##$ASSFAC= 0
##$ASSFACI= 0
##$ASSFACX= 0
##$ASSWID= 0
##$AUNMP= <proc_prof1d_extract_pilot.lims>
##$AXLEFT= 0
##$AXNAME= <>
##$AXNUC= <1H>
##$AXRIGHT= 0
##$AXTYPE= 0
##$AXUNIT= <>
##$AZFE= 0.1
##$AZFW= 0.1
##$BCFW= 0
##$BC_mod= 0
##$BYTORDP= 0
##$COROFFS= 0
##$CY= 15
##$DATMOD= 1
##$DC= 0
##$DFILT= <>
##$DTYPP= 0
##$F1P= 0
##$F2P= 0
##$FCOR= 0.5
##$FTSIZE= 32768
##$FT_mod= 6
##$GAMMA= 0
##$GB= 0
##$INTBC= 1
##$INTSCL= 1
##$ISEN= 128
##$LB= 0
##$LEV0= 0
##$LPBIN= 0
##$MAXI= 10000
##$MC2= 0
##$MEAN= 0
##$ME_mod= 0
##$MI= 0
##$NCOEF= 0
##$NC_proc= -8
##$NLEV= 6
##$NOISF1= 0
##$NOISF2= 0
##$NSP= 0
##$NTH_PI= 0
##$NZP= 0
##$OFFSET= 14.98061
##$PC= 1
##$PHC0= 217.2986
##$PHC1= 0
##$PH_mod= 1
##$PKNL= yes
##$PPARMOD= 0
##$PPDIAG= 0
##$PPIPTYP= 0
##$PPMPNUM= 2147483647
##$PPRESOL= 1
##$PSCAL= 4
##$PSIGN= 0
##$PYNMP= <proc.py>
##$REVERSE= no
##$SF= 400.13
##$SI= 32768
##$SIGF1= 0
##$SIGF2= 0
##$SINO= 400
##$SIOLD= 32768
##$SPECTYP= <>
##$SREGLST= <1H.CDCl3>
##$SSB= 0
##$STSI= 32768
##$STSR= 0
##$SW_p= 8223.68421052632
##$SYMM= 0
##$S_DEV= 0
##$TDeff= 65536
##$TDoff= 0
##$TI= <>
##$TILT= no
##$TM1= 0
##$TM2= 0
##$TOPLEV= 0
##$USERP1= <user>
##$USERP2= <user>
##$USERP3= <user>
##$USERP4= <user>
##$USERP5= <user>
##$WDW= 1
##$XDIM= 32768
##$YMAX_p= 454724683
##$YMIN_p= -732322
##$CURPLOT= <Network HP LaserJet P1505>
##$CURPRIN= <$Network HP LaserJet P1505>
##$DFORMAT= <normdp>
##$LAYOUT= <+/1D_H.xwp>
##$LFORMAT= <normlp>
##$PFORMAT= <normpl>
##$SURQMSG= 1
$$ End of Bruker specific parameters
$$ ---------------------------------
##NTUPLES= NMR SPECTRUM
##VAR_NAME=  FREQUENCY,     SPECTRUM/REAL,   SPECTRUM/IMAG
##SYMBOL=    X,             R,               I
##VAR_TYPE=  INDEPENDENT,   DEPENDENT,       DEPENDENT
##VAR_FORM=  AFFN,          ASDF,            ASDF
##VAR_DIM=   32768,         32768,           32768
##UNITS=     HZ,            ARBITRARY UNITS, ARBITRARY UNITS
##FACTOR=    0.250966925370066, 1,           1
##FIRST=     8223.43324360095, -261094,      -411771
##LAST=      0,             -65287,          92778
##MIN=       0,             -732322,         0
##MAX=       8223.43324360095, 454724683,    0
$$ Real data points
##PAGE= N=1
##DATA TABLE= (X++(R..R)), XYDATA
$$ [...]
19521c67100a38442A83284o1764a89796d9037C6791j3167I761d51555J03107a03374
19509b48263K6607G9972C6198P9492c3567H5249b32036f184A62053b75788J5467
19498b60321A72263a30113b3670k14435A52331a16836B565L51267a23962A11286
19487B1062G028a3417b977A46057f2293A27234g4784j37810A92914g1970j26558
19476a98528F5955K9718a17052M0864A15756a12113k23094a41198j37841A81527
19465c51177J04559r5327G3J48216b15023e1687C57433B7106a39085A33901b85495
19453b80247e3255F485b42834G6383f8700A17363J93642p7436l7126j9319B1684
19441b6293j07448f3377j23107C05567b36999J07888q096N552b4935j59889M0901
$$ plain form
19521 -367100 -138442 183284 121520 -189796 -49037 36791 23624 9761 -451555 -348448 -103374
19509 -248263 -221656 79972 36198 115690 -33567 85249 -232036 -6184 162053 -275788 -260321
19498 -260321 172263 -130113 -23670 -238105 152331 -116836 2565 353832 -123962 111286
19487 21062 7028 -13417 -2977 146057 -62293 127234 -74784 -212594 192914 -71970 -198528
19476 -198528 65955 95673 -117052 -76188 115756 -112113 -335207 -141198 -279039 181527
19465 -351177 -246618 -341945 73 148289 -215023 -51687 357433 27106 -139085 133901 -285495
19453 -280247 -53255 6485 -242834 76383 -68700 117363 311005 233569 196443 177124 21684
19441 -26293 -133741 -63377 -186484 305567 -236999 -129111 -137207 -131655 -24935 -184824 -143923
19430a43923o8262A01749A1299b25989J12490A2111a39690A44162a23703M8786
19420g4917L0937j42305k73436J61214D3146O975a30908k7443C0145a59015b1677
19408f7273a234B03803O900b70811f0345I4709n163J47536F9903p983a87015N5612
19396a31403A11863O7531H7716b09876B35082b07067h5219l49494G2512b13306
19385A05198D7238R0276j41A0391c81013R3077j84565B574e3983J5297A49769
19373D0873b5717E4243a98914n6298a12333a002C00670a44020A14289a24093m4828
19362a68921A35477j1714b47135F9445a22535k73056J58764D44291d94620K18847
19352b75773C6803d2522C77926f475o6075a7678l71966A00645h3944j20432p4343
$$ plain form
19430 -143923 -212185 101749 11299 -225989 -113499 12111 -139690 144162 -123703 -74917
19420 -74917 -43980 -186285 -459721 -298507 43146 50121 -130908 -158351 30145 -159015 -21677
19408 -67273 -1234 203803 210703 -270811 -60345 94709 89546 237082 69903 61920 -187015 -131403
19396 -131403 111863 179394 87716 -209876 235082 -207067 -85219 -434713 72512 -213306
19385 105198 47238 137514 137373 10391 -381013 -287936 -472501 2574 -53983 -38686 149769
19373 40873 -25717 54243 -198914 -255212 -112333 -1002 300670 -144020 114289 -124093 -168921
19362 -168921 135477 123763 -247135 69445 -122535 -395591 -236827 444291 -494620 -275773
19352 -275773 36803 -42522 377926 -6475 -72550 -17678 -389644 100645 -83944 -204376 -278719
19341b78719J31845A26352E2117i5621j18372C0855J11278a73787n9460c3191
19330C10892f1120B75920a20745A34975l1982e2720E2113a89984a2478l9216k14792
19319b66486a575j15171b9519G5599a7159B38204c05112a45543j56295A47043
19308b11056C3888a69932p1398B30533a87318B17746b32427K946A15795E3420
19297c14735M8716i3443b4549I2859h4668D3826c47994i255B31820b52078B02563
19285h1878j46354k94946e5767A87615B5152a2941q5892j65047H7749a70584A00030
19273e024m14353a49561n2568j02613a27090B26020a03532J4791A7599o386K2842
19262C4055a30501C09028g9488j1415l19505a41544F7239J12894a28355I4900
$$ plain form
19341 -278719 -146874 126352 52117 -95621 -213993 30855 142133 -173787 -233247 -33191
19330 310892 -61120 275920 -120745 134975 102993 -52720 52113 -189984 -12478 -51694 -266486
19319 -266486 -1575 -116746 -29519 75599 -17159 238204 -305112 -145543 -301838 147043
19308 -211056 33888 -169932 -241330 230533 -187318 217746 -232427 -229481 115795 53420
19297 -314735 -266019 -93443 -24549 92859 -84668 43826 -347994 -9255 231820 -252078 202563
19285 -81878 -228232 -523178 -55767 187615 25152 -12941 -98833 -263880 87749 -170584 100030
19273 -5024 -419377 -149561 -202129 -304742 -127090 226020 -103532 -88741 17599 11213 34055
19262 34055 -130501 309028 -79488 -90903 -410408 -141544 67239 180133 -128355 94900
19251a13984A42006a43227M4154J3188A12958c56674J69422O9688n8346D1928
19240c16903B1513a24470m3444A60912J5126b2319k44925a7562k3579j44102d0022
19228b27006E883b55647B95580a16736c0272k84147a40474j22979h4493m2550
19218a27043M7656F6141J37516d13267B37364l2049c92277a12497d8342G4714
19207a20053M1198A70681i5021k42384a54515l1555d8739C35766c91048o560C5829
19195A04428b89464b1407j4438r2109O3163m058N720l0874B85465a27933k3682
19184a51615q5490A55066b69752A07709a74972o6610B3359b03492H1430a83038
19173B67046g3308D37253b4843o002o8571B29879A09367K7724A5954P2743a28377
$$ plain form
19251 -113984 142006 -143227 -99073 -85885 112958 -356674 -187252 -117564 -175910 41928
19240 -316903 21513 -124470 -167914 160912 176038 -22319 -267244 -17562 -41141 -185243 -40022
19228 -227006 5883 -255647 295580 -116736 -30272 -314419 -140474 -263453 -84493 -127043
19218 -127043 -79387 66141 203657 -413267 237364 205315 -392277 -112497 -48342 74714
19207 -120053 -78855 170681 -95021 -337405 -154515 -186070 -48739 335766 -391048 -397608 35829
19195 104428 -289464 -21407 -35845 -127954 -64791 -68849 -63129 -94003 285465 -127933 -151615
19184 -151615 -237105 155066 -269752 107709 -174972 -241582 23359 -203492 81430 -183038
19173 267046 -73308 437253 -24843 -30845 -99416 229879 109367 137091 15954 88697 -128377
19161B92700A1249c1989l42497a15217j99995A05437Q6180D1660e2392I1075a65043
19149a96832e7957a2981j96426m5705I136K56602c08763a51104j4733e0306H5874
19137G0341g92A17887a4716l65226A04418b65988J276a9244C9462j7512b51497
19125a48671N2648j22464A03082b3631j03638E0362a30049k67039a26894o8569
19115a95463A44845i8782k763M2208N017m5541b8037j25960K8404j16689G7877
19103a60674B31255f0006A94196g8828H1335a75386A07267b58473e1649o1097
19093a12746j01581R5879k937C3724e3892a6368j39724B27891b6461j03171N5058
19082g4574I5519b01036h5959o4767A63639C3332a15622A48499N78b09851b6857
$$ plain form
19161 292700 11249 -31989 -374486 -115217 -315212 105437 191617 41660 -52392 91075 -165043
19149 -196832 -57957 -12981 -209407 -255112 9136 265738 -308763 -151104 -165837 -50306 85874
19137 70341 -792 117887 -14716 -379942 104418 -265988 -264712 -19244 39462 21950 -251497
19125 -148671 -96023 -218487 103082 -23631 -127269 50362 -130049 -397088 -126894 -195463
19115 -195463 144845 -98782 -101545 -59337 -54320 -99861 -28037 -153997 -125593 -242282 77877
19103 -160674 231255 -60006 194196 -78828 81335 -175386 107267 -258473 -51649 -112746
19093 -112746 -214327 -118448 -121385 33724 -53892 -16368 -156092 227891 -26461 -129632 -74574
19082 -74574 95519 -201036 -85959 -150726 163639 33332 -115622 148499 149077 -209851 -26857
19070A59364K74938c01158B7206a35006A7406a674A13724d2932k80525E4711i9412
19058A32809J95182b30805h0116D9922e920B45542i9512O750j26263i8510j80013
19047b78523i6541E7659J9817J75205a84920F3788a23620m9790A58136E2948d2150
19035a64683g0113k3987c0468k3244m52471a58689F9798A2346a45557G9208e5550
19023a1201j21902k73629d2870C04860a49578C552a54415j71750a43731A25535
19012e4138k29253I9509c49170B86385A15022k9874I643L8184J47568a18643A40109
19000B11072i752k49570B38941A06721a33418d4938E3442A2047J93215o2612a47986
18988B06840b13185I7128P5933b03872j02736d1170k90165C62483A79212e7439
$$ plain form
19070 159364 434302 -301158 27206 -135006 17406 -1674 113724 -42932 -323457 54711 -99412
19058 132809 327991 -230805 -80116 49922 -5920 245542 -99512 -92762 -219025 -98510 -278523
19047 -278523 -96541 57659 77476 252681 -184920 63788 -123620 -173410 158136 52948 -42150
19035 -164683 -70113 -94100 -30468 -53712 -506183 -158689 69798 12346 -145557 79208 -55550
19023 -11201 -133103 -406732 -42870 304860 -149578 3552 -154415 -326165 -143731 125535
19012 -54138 -283391 99509 -349170 286385 115022 85148 9643 47827 195395 -118643 140109
19000 211072 -9752 -259322 238941 106721 -133418 -44938 53442 12047 205262 142650 -147986
18988 206840 -213185 97128 173061 -203872 -306608 -41170 -331335 362483 179212 -57439
18977A76139k8097d2601j21966k36899a7588m30809a2091j08096j34623B04374
18966F6908O6709g192j89257b046C2973h3853A71793c81487I53N1422Q632K35018
18954B96025b22228B0695f5943j39847F4012a02280r7381K3514c2559A07808J54352
18943B62160a8525A43095A0392i5888j29011a4095k06923g536c335n13975d120
18931a05296A96291I5104h707H9338b5410p0712A52355D8046f1002a3076k3916
18920c6992D932c33897B99940f9270A21038g1384J1964a8198k65029o4982B78219
18908D7489b7895j31881B57054l5981f4579A21383A3008c29140I1292g4902f995
18896B95238G525J84187L0876a37579c5952j7244B246J20171b3656n7466B29444
$$ plain form
18977 176139 148042 -42601 -164567 -401466 -17588 -448397 -12091 -120187 -254810 204374
18966 66908 133617 -7192 -196449 -2046 32973 -83853 171793 -381487 953 52375 61007 296025
18954 296025 -222228 20695 -65943 -205790 64012 -102280 -199661 -176147 -32559 107808 262160
18943 262160 -18525 143095 10392 -95888 -224899 -14095 -221018 -7536 -3335 -517310 -4120
18931 -105296 196291 95104 -8707 89338 -25410 -96122 152355 48046 -61002 -13076 -36992
18920 -36992 4932 -333897 299940 -69270 121038 -71384 -59420 -18198 -283227 -348209 278219
18908 47489 -27895 -159776 257054 221073 -64579 121383 13008 -329140 91292 -74902 -6995
18896 295238 7525 191712 222588 -137579 -35952 -53196 2246 122417 -23656 -81122 229444
18884e5271a8840l4041A69732a45996f6714D5621P7514j9271b73400g6708G1840
18872a5897C29041d5489p8222L8548n8286j6346j39215h8195j44143A98240c0664
18860A4013J38876j5038A3622b03156G8118b95695k0815C7854J8650M1763c90676
18848b6910G6222b8981l39009g9854j39452A40042a37253C23745b74688a27599
18837B53063b8496k81814B83633B3713K35372H415K52884b46810a09236A78757
18826c25195B38035j3572b70285H458d35541A0743g6255k43798J01960r0815A17832
18814F0951d2615H6984i0949j36763K3418F9156K11601h6921I9963a79850B8909
18802a58715H9664g961D825J16041f3340F8540k3937P2066K21019E7422J24763
$$ plain form
18884 -55271 -18840 -52881 169732 -145996 -66714 45621 123135 103864 -273400 -76708 71840
18872 -15897 329041 -45489 -123711 -85163 -143449 -159795 -299010 -88195 -232338 198240 -30664
18860 14013 152889 137851 13622 -203156 78118 -295695 -316510 37854 56504 98267 -390676
18848 -26910 76222 -28981 -367990 -79854 -219306 140042 -137253 323745 -274688 -127599
18837 253063 -28496 -310310 283633 23713 259085 8415 261299 -246810 -109236 178757
18826 -325195 238035 224463 -270285 8458 -435541 10743 -76255 -320053 -218093 -308908 117832
18814 60951 -42615 86984 -90949 -227712 -204294 69156 280757 -86921 99963 -179850 28909
18802 -158715 89664 -7961 4825 120866 -63340 68540 44603 116669 337688 57422 182185
18791A82185G5056n828b23948A52720d82064a21705l78352a32858c6698j29469
18781a66167F3145a49864j25826J33942d7131B5847J02521a19908L5031L563C70109
18769B10861a65348J0165B17417a5237k43044J14349e7737h370k02348f7337j97714
18758b65051A36465a81650e0839j25512A4170a17524G0049j5292L29820j29983
18748B54594h6577j33148J08245k65630H1100a84764h3114l408j06147F2635f9860
18736a71330k29862a37764q7669B30508B6115a63373A69074c50340a08425j6195
18726a24620p2614j21545A4425h3361Q484E1520a06434G7769a80122P9630l36974
18715d37466h7612A63193h0335r7248j58576B35713b14887R5736C1137I845i9570
$$ plain form
18791 182185 75056 69228 -223948 152720 -482064 -121705 -500057 -132858 -36698 -166167
18781 -166167 63145 -149864 -275690 -141748 -47131 25847 128368 -119908 -84877 -81314 370109
18769 210861 -165348 -155183 217417 -15237 -258281 -143932 -57737 -8370 -210718 -67337 -265051
18758 -265051 136465 -181650 -50839 -176351 14170 -117524 70049 54757 384577 254594
18748 254594 -86577 -219725 -111480 -377110 81100 -184764 -83114 -86522 -192669 62635 -69860
18736 -171330 -401192 -137764 -225433 230508 26115 -163373 169074 -350340 -108425 -124620
18726 -124620 -197234 -318779 14425 -83361 -74877 51520 -106434 77769 -180122 -100492 -437466
18715 -437466 -87612 163193 -80335 -177583 -336159 235713 -214887 -119151 31137 9845 -99570
18703f6815B07542j2027F0894g4375A24862N47f9954L2256B3192a56792R332B40135
18690b47843j3266C1489K17178D2649O3775l7921j2480b78371D2518M4283M7339
18679A34140B011a04853r5713l7112A10068m0176a64462D031L18306F6979J74086
18668B41065Q7837c60487J36504I3307a505j24035k4627k36341b6881A23437F1036
18656b13992L91l0719C93529d7305j55642d1306A9622J8840J7859c99094h8265
18644b12305H6984e34667A09555l9092c5423j14063j8088o430A66511a27487C3610
18632a83990L7432A47422b87348J33740j01209F7479b08629A78282a38728H0049
18621H657b38523F1629K8563c59816A92267D0343j0725R5737m5200B5292P9935
$$ plain form
18703 -66815 207542 195515 60894 -74375 124862 125409 -69954 -37698 23192 -156792 -147460 240135
18690 -247843 -261109 31489 248667 42649 106424 68503 56023 -278371 42518 86801 134140
18679 134140 2011 -104853 -200566 -237678 110068 69892 -164462 4031 322337 66979 241065
18668 241065 328902 -360487 -223983 93307 -1505 -125540 -150167 -386508 -26881 123437 61036
18656 -213992 -213601 -244320 393529 -47305 -202947 -41306 19622 38462 56321 -399094 -88265
18644 -212305 86984 -534667 109555 70463 -35423 -149486 -167574 -174004 166511 -127487 33610
18632 -183990 -146558 147422 -287348 -153608 -254817 67479 -208629 178282 -138728 80049
18621 8657 -238523 61629 90192 -359816 192267 40343 29618 125355 80155 25292 105227
18610A05227a91509e3796D2952c07390F8268J86316j09653l7167J75459K7335
18600C10558d99A7875a61081f1053A70819H4002a59140C152d91622A3224b2603
18588B10497d8119k01230J01404q9023D8003c42540j026A74607a30024j15468
18578b45492b2403G4078l0658K125B807a93228j56790e0894A8724a65411G3989
18566b7292E6741b09337A04498b83745d3977j35741A08893M5256D92b61899a30170
18554a01283j27227k6566C08159K2965I972R5065m8987a68797D5720A5854b93002
18542B0624K37427c01626N041a04981b3376A93259a73568A87554o8305g0215j02839
18531a73054L5793H3351b2629q8476j61959d8933A02503b99527c9965k05312C2271
$$ plain form
18610 105227 -191509 -53796 42952 -307390 68268 254584 144931 107764 283223 310558
18600 310558 -499 17875 -161081 -61053 170819 84002 -159140 3152 -491622 13224 -22603
18588 210497 -48119 -249349 -147945 -236968 48003 -342540 -343566 174607 -130024 -245492
18578 -245492 -22403 74078 43420 45545 2807 -193228 -350018 -50894 18724 -165411 73989
18566 -27292 56741 -209337 104498 -283745 -43977 -179718 108893 154149 492 -261899 -130170
18554 -101283 -228510 -255076 308159 331124 9972 105037 56050 -168797 45720 15854 -293002
18542 20624 258051 -301626 -296585 -104981 -23376 193259 -173568 187554 119249 -70215 -173054
18531 -173054 -137261 83351 -22629 -111105 -273064 -48933 102503 -299527 -39965 -245277 32271
18519a64521c7500H3030f6053j54969Q6207b3090j7200p3068j67930D01921D2
18507a34170B4111a15792r359a2280k3840o6049A42119h9097n6513C9141d3406
18495a83221L8778f0837M279r3722p3634N0476M7310J8850N0113l59737B17470
18483F2392a17740k57150H6058j6257g662C13559b72842e974j02403M8806d635
18471a62379A40803c5030H0652b56060I6514Q8062b46066J15651A20270d1186
18460B59038a86483G8710a96457i0185A0238J09575b0967A31182g7642B7671J3022
18449D0693a46889j18384J17647E8914c53695g2632F3197a48604b9717j02938
18439a32655p1371A89016A6409a40862C3114i197l19065a9939l83513J14143J40869
$$ plain form
18519 -164521 -37500 83030 -66053 -221022 -134815 -23090 -40290 -113358 -281288 401921 42
18507 -134170 24111 -115792 -125151 -12280 -36120 -102169 142119 -89097 -145610 39141 -43406
18495 -183221 -144443 -60837 -56558 -150280 -223914 -173438 -126128 -107278 -57165 -416902 217470
18483 62392 -117740 -374890 86058 69801 -7662 313559 -272842 -5974 -108377 -59571 -4635
18471 -162379 140803 -35030 80652 -256060 96514 184576 -246066 -130415 120270 -41186
18460 259038 -186483 78710 -196457 -90185 10238 119813 -20967 131182 -77642 27671 40693
18449 40693 -146889 -265273 -147626 58914 -353695 -72632 63197 -148604 -29717 -132655
18439 -132655 -204026 189016 16409 -140862 33114 -9197 -328262 -19939 -403452 -289309 -148440
18428a48440K263G1308b21981b4121j07676a7152A51375h1031j76902G3151g2327
18416D2995b2430C5220J06676B9020b27779C12534c4268C43442d1556j07821B97426
18404A03287Q5757c46924J67371l4963R8802A53513b18394e3322o4044M6294L810
18393f7262H5865a89157J9341e4976H9335b56297j8181d5749k4234l5177b0729
18381b8095B92355j41789a36974p8943A16271c7041E4446a08235B73917b64167
18370C6708b02960j9546j62742a01057j09999L0265j12314A84735c54560J72677
18360a81883q3797G7973M8343a94136B07878o5411A929i03E2219J5793h2180G410
18347A64664a70169d2837k46167A92450I1752d4237A53090e9363B67555d79659
$$ plain form
18428 -148440 -146177 71308 -221981 -24121 -131797 -17152 151375 -81031 -257933 73151 -72327
18416 42995 -22430 35220 141896 29020 -227779 312534 -34268 343442 -41556 -149377 297426
18404 103287 189044 -346924 -179553 -214516 -115714 153513 -218394 -53322 -117366 -71072 -67262
18393 -67262 85865 -189157 -169816 -54976 89335 -256297 -274478 -45749 -69983 -105160 -20729
18381 -28095 292355 150566 -136974 -215917 116271 -37041 54446 -108235 273917 -264167
18370 36708 -202960 -222506 -385248 -101057 -211056 -180791 -293105 184735 -354560 -181883
18360 -181883 -265680 77973 126316 -194136 207878 142467 1929 -903 52219 68012 -82180 7410
18347 164664 -170169 -42837 -289004 192450 91752 -44237 153090 -59363 267555 -479659
18336E5290a42035a6248k08682e1642G4048b00313O8186A58814C7825J09619F4676
18324a65812f8096j03753M1544c7204j45538J8987A58881f8510B98434a07109
18313f1638j43465e3381j13070k053m1390p5538J06125P7328j41893l8909B38817
18301B43369a33840O3044A25860N9933e1331A35477n2450c29816A90686b1050
18290e0989A58301d5437e881B85118I774L0281K01265H0331h1580a1A99552D1188
18277D2265b57811p7372A8870b58893g11j20680g885j15702A83129o9280M2660
18266A56509a24283n5933i551k5823B13116a87178l8636a00877G3267b62463J23844
18255a38619B02K84120i7441J8603r5734Q6478K0776j03014c1782C1329a71813
$$ plain form
18336 55290 -142035 -16248 -224930 -51642 74048 -200313 -132127 158814 37825 147444 64676
18324 -165812 -68096 -171849 -130305 -37204 -182742 -163755 158881 -68510 298434 -107109
18313 -61638 -205103 -53381 -166451 -168504 -209894 -285432 -179307 -101979 -243872 -282781 238817
18301 243369 -133840 -70796 125860 185793 -51331 135477 83027 -329816 190686 -21050
18290 -50989 158301 -45437 -5881 285118 9774 40055 241320 80331 -81580 -11 199552 41188
18277 42265 -257811 -335183 18870 -258893 -711 -121391 -7885 -123587 183129 113849 156509
18266 156509 -124283 -180216 -9551 -35374 213116 -187178 -225814 -100877 73267 -262463 -138619
18255 -138619 202 284322 -97441 -78838 -174572 -88094 -67318 -170332 -31782 31329 -171813
18243a71799H2482b91776b4433j60690P1144B21480h0692l21935b0598j04813
18233a25411C7814N9166d4971A48337N0963b96331e6453B24400b69511D1642a01803
18221d3701H7298a64495H8913q283c21690A22919c96633J73221f2937k90670i1806
18209b4173M242B89862b20351B090a79251A47675K04744j35228B9296d0691N423
18198c5268H6946a26655B5228M9026a49338K616A11252m2789b62032b5954l7539
18187f3493d257B3088a11390n737r6303k5441j05341G7215O0208i6944k906H7397
18174B19559H3213d9734H0857a68446p775k07243a1031A6154a34420l7196I9272
18162C6615f6127F0196c19369G5294a53006A34169N1918D1719h4836B4414a31616
$$ plain form
18243 -171799 82482 -291776 -24433 -185123 -113979 221480 -80692 -402627 -20598 -125411
18233 -125411 37814 96980 -44971 148337 199300 -296331 -56453 224400 -269511 41642 -101803
18221 -43701 87298 -164495 88913 80630 -321690 122919 -396633 -223412 -62937 -353607 -91806
18209 -24173 -19931 289862 -220351 2090 -179251 147675 352419 217191 29296 -40691 -35268
18198 -35268 86946 -126655 25228 74254 -149338 -146722 111252 68463 -262032 -25954 -63493
18187 -63493 -4257 23088 -111390 -117127 -213430 -238871 -344212 77215 137423 -96944 -99850 87397
18174 219559 83213 -49734 80857 -168446 -176221 -383464 -11031 16154 -134420 -171616 99272
18162 36615 -66127 60196 -319369 75294 -153006 134169 186087 41719 -84836 24414 -131616
18150A07809g2252J0553A70988f4350o3546k070n8231j58792G0322a18453k85614
18139d04067B42286C0859g0680r4150f2261b4172G3463Q2608c7732j42086A43037
18127G8184j5643M3480a10555J6598j41018I0959a93374c1372j06255e5671q6878
18116a42549A89886d383l5142J4766k72542g6511G751a82603H3841J03655c12004
18104A37992o719A5358g252A16478n1849K3426f2566K4310j0951k16632b7349
18092e1066G1640b939j64809A26881M2567A4368a83782B08916G4677a86229A74443
18080h1205k04186I3348a86406C2839a70420j21420A08517E4230A0445a86658
18069A4301a557l0212l46950J77566N9913l45279D15540a1871k6090A20402N0443
$$ plain form
18150 107809 -72252 -61699 170988 -64350 -127896 -129966 -188197 -346989 70322 -118453 -404067
18139 -404067 242286 30859 -70680 -164830 -62261 -24172 73463 156071 -37732 -179818 143037
18127 78184 62541 106021 -110555 -93957 -234975 90959 -193374 -31372 -137627 -55671 -142549
18116 -142549 189886 -4383 -39525 -24759 -297301 -76511 7751 -182603 83841 187496 -312004
18104 137992 131273 15358 -7252 116478 64629 88055 -62566 -38256 -49207 -265839 -27349
18092 -51066 71640 -2939 -167748 126881 169448 14368 -183782 208916 74677 -186229 174443
18080 -81205 -285391 93348 -186406 32839 -170420 -291840 108517 54230 10445 -186658
18069 14301 -1557 -31769 -378719 -201153 -141240 -486519 415540 -11871 -37961 120402 170845
18058A70845a91218f1356D6394e5952A10585k2015d284C13968i8066l6138A38432
18046A279g8174j91870B99215b16302m7948d9761A99100J9309c17001R3099B20358
18034e51413E8466h9832A3823J1940h2470A5182a44578E3541b47976Q5699a9125
18022A83868m2684D9785L4693e1917j38415A62334c8754j45212A39234J35322
18012B74556G4552a54139r5578a15695l9449l9030j86485a67335B17259C3053
18001b3207A53399d3936l51484h2761o7647n232b4794A56399o5922P2117c46657
17989A79378O6436O2800a8823g808k2215q4338e2195a7293j29312o0645C10908
17977A66688a96932C31846B472N8527b2505n0811C67722e7873j1726p5435B82663
$$ plain form
18058 170845 -191218 -61356 46394 -55952 110585 88570 -4284 313968 -98066 -134204 138432
18046 1279 -78174 -270044 299215 -216302 -264250 -49761 199100 218409 -317001 -223902 220358
18034 -551413 58466 -89832 13823 25763 -82470 15182 -144578 53541 -247976 -162277 -19125
18022 183868 141184 49785 84478 -51917 -190332 162334 -38754 -183966 139234 274556
18012 274556 74552 -154139 -249717 -115695 -155144 -194174 -380659 -167335 217259 33053
18001 -23207 153399 -43936 -395420 -82761 -150408 -155640 -24794 156399 90477 162594 -346657
17989 179378 245814 308614 -18823 -7808 -30023 -114361 -52195 -17293 -146605 -207250 310908
17977 166688 -196932 331846 2472 60999 -22505 -73316 367722 -57873 -69599 -145034 282663
17965c7874M659C46866d6722A53069J39848b46993h4852j64331A33323a19430
17954b6072D644P6319J46229L5356E6546A6416a51480J3390A11183P385J05127
17943B23695b11075L6591e5249F0049b38338m250B40104I8352a66455I4331k949
17932I1382M595K58508G8911a32597B21365e5155B25626e21422M0577J91338J41842
17921a47665i462B71862i829A12752a6586n0496G168N4593a18622E8464c09280
17909a65627D17402h8134j25622R2713F0462L7928d1903C02437a37037C5654a88664
17897C5787a60744A06759c57733J58762G263a16851A0668b04828R9677o5775B5251
17885a57514k1101m9421A35462A3351M2506a62725G5230h8347F1615k4051J4901
$$ plain form
17965 -37874 -33215 346866 -46722 153069 292917 -246993 -84852 -249183 133323 -119430
17954 -26072 4644 80963 227192 262548 56546 16416 -151480 -138090 111183 118568 223695
17943 223695 -211075 -174484 -55249 60049 -238338 -242588 240104 98352 -166455 94331 91382
17932 91382 95977 354485 78911 -132597 221365 -55155 225626 -521422 -480845 -289507 -147665
17921 -147665 -9462 271862 -9829 112752 -16586 -67082 7168 61761 -118622 58464 -309280
17909 -165627 417402 -88134 -213756 -121043 60462 98390 -41903 302437 -137037 35654 -188664
17897 35787 -160744 106759 -357733 -198971 7263 -116851 10668 -204828 -105151 -170926 25251
17885 -157514 -178615 -228036 135462 13351 55857 -162725 75230 -88347 61615 37564 52465
17874E2465b03137Q4120j85773R6735M1363C4679J47942f3818F3158b44599e1993
17862E1556c01387a06822B3686J31043d01897a52686n2626N2876b2727A19180
17851d7078l162A34531a06806c9741k73628a8289k62317J20958B46067a18550
17840C9759N1083L6791b48142B19137b31873A40745N7919a49802C069b25978R2859
17829a33119L6283B77032o3065a14028e571C2534K37555j33792a16898B27393
17818A2217P7149O1513F2609k1350l26i6606l83833a04286r5835B3382c2522G1585
17805a06311A75832h8656b4793n9639B18983b51546B41446g8127J0243A25307
17794a8504D03620A38281G258a13809D5704O9502g133D0258J4517L26207D3308
$$ plain form
17874 52465 -203137 -119017 -304790 -208055 -166692 34679 182621 -63818 63158 -244599 -51993
17862 51556 -301387 -106822 23686 154729 -401897 -152686 -205312 -152436 -22727 119180
17851 -47078 -50240 134531 -106806 -39741 -313369 -18289 -280606 -159648 246067 -118550
17840 39759 90842 127633 -248142 219137 -231873 140745 198664 -149802 3069 -225978 -133119
17829 -133119 -96836 277032 213967 -114028 -5571 32534 270089 136297 -116898 227393
17818 12217 89366 150879 62609 41259 40933 -96606 -480439 -104286 -200121 23382 -32522 71585
17805 -106311 175832 -88656 -24793 -84432 218983 -251546 241446 -78127 -67884 125307
17794 -18504 403620 138281 7258 -113809 45704 115206 -7133 40258 54775 380982 43308
17782D6032a16834A96261g4399A98152a67386M8482A04722L8007C2400l179d41002
17770B49283e4251k20532C6729a30513C02201A00197M7140K5317K1910b448l62910
17759c65358a54098L2041D1461J55038I784a08098j41956C13301b18484K6038
17749a92446A03695h0494q8474o3739c3089k48221j54360d5820A9237l41K6187
17738D5083J64396C6736a14291q782I6967l7989M7660L24698a2149l80388F5399
17726D1472J51356a99750A39855b54132h9271B03232B0869P1639J49652B7521
17715A8628J23178j2152N6663c35422b9707q3415A8847K4679O6243K5455n5227
17704G9997e6839B27450j04404B0760Q5588m9264b16979A22341a3724A25686L2716
$$ plain form
17782 46032 -116834 196261 -74399 198152 -167386 -118904 104722 142729 32400 29221 -441002
17770 249283 -54251 -274783 36729 -130513 302201 100197 147337 172654 194564 -2448 -365358
17759 -365358 -154098 -122057 41461 196499 9784 -108098 -250054 313301 -218484 -192446
17749 -192446 103695 -80494 -168968 -232707 -33089 -281310 -435670 -45820 19237 18896 45083
17738 45083 209479 36736 -114291 -123073 96967 58978 106638 431336 -12149 -392537 65399
17726 41472 192828 -199750 139855 -254132 -89271 203232 20869 92508 242160 27521
17715 18628 141806 129654 186317 -335422 -29707 -113122 18847 43526 109769 135224 79997
17704 79997 -56839 227450 123046 20760 106348 57084 -216979 122341 -13724 125686 158402
17693A58402N9506b00428B27970c91000g7989F7994j3774J41014E7434M5674a83327
17681b65818A27697c2710B3323a15603B26781C9228J03601d37482C35356j61303
17671A74053j0427a35038L5424C80196C1002g9596B7301L83924f0316H2203a2761
17659A80326c2969A27854J96849a6601m5401C8056J0492i4905r4192d6325k5903
17648g2228K4242k80324J51029A60969A6242d8116m9392B06694J51492C5965j7926
17637A8039K159J05450a08578Q652B5322a45086l0247l4771b9738j12540F3770
17625C01092b5268j18545j86735K5482H0953l235a54716a5855I273c2442B25542
17613a551A93573p3416a44157D7602j3669J16593k1953a04971a434B5709b85441
$$ plain form
17693 158402 217908 -200428 227970 -391000 -77989 67994 54220 195234 57434 103108 -183327
17681 -265818 127697 -32710 23323 -115603 226781 39228 142829 -437482 335356 174053
17671 174053 163626 -135038 -99614 380196 31002 -79596 27301 411225 -60316 82203 -12761
17659 180326 -32969 127854 324703 -16601 -62002 38056 48548 -94905 -189097 -46325 -72228
17648 -72228 -47986 -328310 -177281 160969 16242 -48116 -97508 206694 358186 35965 18039
17637 18039 20198 125648 -108578 -99926 25322 -145086 -175333 -210104 -29738 -142278 63770
17625 301092 -25268 -143813 -330548 -305066 80953 77718 -154716 -15855 9273 -32442 225542
17613 -1551 193573 120157 -144157 47602 33933 150526 128573 -104971 -1434 25709 -285441
17601C05819b1262A45386m8488M5230n3960h3026j39791A93082J04945K429I2206
17589b66782D0237J35406a99503A63804m3236n1217j2666A8092b88951Q1095a01688
17577A2410b2419k3179A70497c7364A9870e7126B4151d8845A18477J24404F9671
17565b15856B09684d7326A91999b11631G521f8972J4420C3466K9525a34551m3647
17554a78198A16158k2803A9846b36158B23286A07241B9855a57702f3614j22332
17544a85946C0290f4291q116n2920e9638o8460d2436E8719d8013A12122a10004
17532A51086a90601D7959N6194b62655C1296K42490A10022b93418B37150I3083
17521A66031q377a54139B53188A24473K56432j58160H7384k8702K5895L0957L18481
$$ plain form
17601 305819 -21262 145386 96898 142128 88168 -83026 -222817 193082 298027 300456 92206
17589 -266782 40237 175643 -199503 163804 120568 69351 56685 18092 -288951 -207856 -101688
17577 12410 -22419 -45598 170497 -37364 19870 -57126 24151 -48845 118477 242881 69671
17565 -215856 209684 -47326 191999 -211631 7521 -68972 -54552 33466 62991 -134551 -178198
17554 -178198 116158 93355 19846 -236158 223286 107241 29855 -157702 -63614 -185946
17544 -185946 30290 -64291 -72407 -125327 -59638 -128098 -42436 58719 -48013 112122 -110004
17532 151086 -190601 47959 104153 -262655 31296 273786 110022 -293418 237150 93083
17521 166031 157654 -154139 253188 124473 380905 222745 87384 58682 84577 115534 434015
17510D34015a58636a4568j03073d5589j58415G2601P7490b25848f2370B27507
17499I455M27202h0102C6220a22556B42477B7940c3162B1013o939J84295c8187
17487A24662N4489P1296a2604E8022K7656R5392b19183A71214J11342I211M41985
17476D51196f5837A2231k273i7958A22982N6063P9183n7991J08010q4852B8437
17464F8665B2686a48819E2129J04780F3101J1960L150e7937A53553Q8735h2783
17452A90932E4061N41J4508a90658b2605A46925a27701B4265J66187b9818A73272
17440E6220L11202E3420J66198j4579k427O1106k2282f2266D80824A17294b51215
17428B58722E7007K09189j22725E5491J37553J79288R8944j83093j26824K26114
$$ plain form
17510 434015 -158636 -14568 -117641 -45589 -204004 72601 150091 -225848 -62370 227507
17499 9455 436657 -80102 36220 -122556 242477 27940 -33162 21013 14074 198369 -38187
17487 124662 179151 250447 -12604 58022 85678 181070 -219183 171214 282556 9211 451196
17476 451196 -65837 12231 9958 -97958 122982 179045 258228 200237 308247 223395 28437
17464 68665 22686 -148819 52129 156909 63101 75061 78211 -57937 153553 242288 -82783
17452 190932 54061 54602 69110 -190658 -22605 146925 -127701 24265 190452 -29818 173272
17440 56220 367422 53420 219618 205039 202612 263718 241436 -62266 480824 117294 -251215
17428 258722 57007 266196 143471 55491 193044 372332 471276 288183 161359 387473
17418C87473A34133L14941B20222q3794r335J71516J48422A99675n6776C5526
17407a18622F1366K45351n6891R8390A38797J65688K8318j9390G4683J62004l4761
17396B01926J82199a11837H0438g0398H5869a17199A93695e4138A81493M19986
17386F01479k71427L1644A40825k7309L2969g8923D40561A07058Q7744A3546L43190
17375C56736j0382j1345n7752a11521B91631A25580M1457m7087K35687r0226J07428
17364C72839q7631D5564b8915E0506P439Q7207a8526C50573Q1244F2576J19196
17353A81772b6937A19748n1711Q2382c12569A10663M7210o6569e7279G4051J33423
17342B07474B8475b4304A81538K38272j47990b38464L492A77128C1453J34345
$$ plain form
17418 387473 134133 449074 220222 136428 127093 298609 447031 199675 142899 35526
17407 -118622 61366 306717 249826 348216 138797 304485 332803 313413 74683 236687 201926
17396 201926 384125 -111837 80438 -70398 85869 -117199 193695 -54138 181493 601479
17386 601479 330052 361696 140825 113516 146485 -78923 440561 107058 194802 13546 356736
17375 356736 346354 335009 277257 -111521 291631 125580 167037 119950 355637 265411 372839
17364 372839 285208 45564 -28915 50506 57945 145152 -18526 350573 431817 62576 181772
17353 181772 -26937 119748 68037 150419 -312569 110663 157873 91304 -57279 74051 207474
17342 207474 28475 -24304 181538 419810 271820 -238464 -234972 177128 31453 165798
17332A65798Q7385F9305k6198K21943c2634D17075A12652n5924L83195A23141
17321f00569B0261a32742B04816O8155A01253A9000K90653f0859J3778H8217a4923
17309B78845C8448M50659a86115D9098K16752P159q2430l8593E4122O1046K18257
17298C33425b2876A71123I965J92084e4219A89340h2259A51908J80138j32124
17288A99922j0332j7766A0689J51588R2896O9307M0388g9967A85227L0593O7329
17277B83149r0581J48964F1012g9326A14185J22647J06043a7816B35606o8982
17267A66624a57508H3767J2195L9010R2471r3867N80971b05446e7707D34950a38672
17255C78774a04776o075I0323L5834J6993K07359K20584B31633a620B66393a18441
$$ plain form
17332 165798 253183 69305 43107 265050 -32634 417075 112652 56728 439923 123141
17321 -600569 20261 -132742 204816 272971 101253 19000 309653 -60859 -47081 88217 -14923
17309 278845 38448 489107 -186115 49098 265850 273009 190579 151986 54122 115168 333425
17298 333425 -22876 171123 9965 202049 -54219 189340 -82259 151908 332046 199922
17288 199922 189590 171824 10689 162277 255173 324480 364868 -79967 185227 215820 283149
17277 283149 192568 341532 61012 -79326 114185 236832 342875 -17816 235606 166624
17267 166624 -157508 83767 95962 134972 227443 133576 714547 -205446 -57707 434950 -138672
17255 378774 -104776 -110851 90323 126157 143150 350509 571093 231633 -1620 266393 -118441
17243B87203N2873A11248L2223f4952F0582R4237l3427c0937o9731B78464L1137
17232C09601F6813l079k4708L20880b34123A18349J69404A37422l1051J4994J9249
17221A40614K24251A49013D4409L80018D3702L3243b9628B34041q5200D5103M4992
17210I0095M94200A50443M05582B40995L2639I2105h2457A96311L18038B7537
17199B93266J7985a21630h726B96950J15706M3995D9341P2216M35331A21630J2371
17188A34001J72112A9457a5775D7695J52383b3569C8947J02044a4316B89453j06465
17177A82988j8221d4488B93168A26349K55828O8248o4415e1553B58957l0761Q7863
17166C16059D38M43504j75300J21818A39027J21397q5928R3861K05726k07747
$$ plain form
17243 287203 340076 111248 143471 -64952 60582 154819 121392 -30937 -100668 278464 309601
17232 309601 66813 63734 39026 359906 -234123 118349 287753 137422 106371 121365 140614
17221 140614 364865 149013 44409 424427 43702 76945 -29628 234041 148841 45103 90095
17210 90095 584295 150443 556025 240995 273634 92105 -82457 196311 514349 27537
17199 293266 311251 -121630 -8726 296950 412656 456651 49341 121557 556888 121630 134001
17188 134001 306113 19457 -15775 47695 200078 -23569 38947 140991 -14316 289453 182988
17177 182988 164767 -44488 293168 126349 382177 450425 386010 -51553 258957 228196 316059
17166 316059 438 443942 268642 390460 139027 260424 174496 268357 474083 266336
17156B66336J35814j20617m8650J04936j17540P6703l0917H9614L54238r9657
17146C44195K76298B57969m3103Q2857k8205C9103N89849j56930j33563E4513
17135A61501L94038A44305A4639L29512j24427K2908K43091n7440A43199K78275
17125D21474R9867B22932J43207R707a5438C54486m1020F08M65232H6529M08870
17114D95399k43528j0941l8045J84558j52394J38119J15235J61170j48482A55554
17103D81921j81997K98358A04320J31386K19908A66617L11795E9842L55620J08753
17093E24215K1977A90196Q0697n7993K74437J447D6382K49899L23430A76525a08076
17081D20658K29506j81659L3406k07826r4579J72575r2361k5406O1334M1300J97231
$$ plain form
17156 266336 402150 281533 232883 337819 220279 296982 266065 89614 443852 344195
17146 344195 620493 257969 214866 297723 269518 39103 628952 472022 338459 54513
17135 161501 555539 144305 14639 344151 219724 242632 485723 428283 143199 421474
17125 421474 521341 222932 366139 375846 -15438 354486 313466 608 465840 86529 495399
17114 495399 251871 240930 202885 387443 235049 373168 488403 649573 501091 155554
17103 481921 299924 598282 104320 235706 455614 166617 478412 59842 415462 524215
17093 524215 546192 190196 270893 212900 487337 488784 46382 296281 619711 176525 -108076
17081 420658 650164 468505 501911 294085 199506 372081 279720 254314 315648 356948 554179
17070E54179q6853q8258j45201A02278K90418k7579o4840I0861L51689l8504K80401
17059F84447l07400Q6350K58655k27534J40755A82944M17539k48619L07777j66986
17049D92655J01540B95975K01895J9538L50603j50956j21492N3293k7043B24613
17038G06458B56783J85304j31952K2452K47724j81590K15453j13025j19161J31799
17028E13787k13017o535j4055L72565l09618L66057k76077K45979j79938J97938
17018F97086k33251J18405j87064J32314o7770J04647J95315l74614L78800o5912
17008F97956j4775k52545K38947N9548k74185N06017D00273L83077j92472L09386
16998I00264k25794P234k34811K83115k4862l25148K41640K98287l78526K36284
$$ plain form
17070 554179 467326 379068 233867 102278 392696 365117 300277 90861 442550 404046 684447
17059 684447 377047 463397 722052 494518 635273 182944 600483 351864 659641 492655
17049 492655 594195 295975 497870 517408 868011 717055 595563 648856 621813 224613
17038 706458 256783 442087 310135 332587 580311 398721 614174 501149 381988 513787
17028 513787 300770 294235 280180 652745 343127 709184 433107 679086 499148 697086
17018 697086 463835 582240 395176 527490 459720 564367 759682 385068 763868 697956
17008 697956 683181 430636 669583 729131 454946 960963 400273 783350 590878 900264
16998 900264 674470 681704 446893 730008 705146 379998 621638 919925 541399 777683
16988G77683q9832C05175N21217j96157J05130j64889N5678j0374m0811K48328
16978H23297j83903R9023k50643J53643o7520L17940J4494k89746K52892l45501
16968E23976Q7440j3053K95931o4211J09742O9922j36938m13206N65059n8144
16958I66518n4821L0766J89616l61166n5815P2414K72607k98893N53591j42542
16948A172275j77826J01571k08587M26992k0522m24031J50084m01148O17370j04493
16938A131685j81203J30491o3772K30696m28167M10164m13884L89741j55357L5113
16928A085507K60531k9877j08111K00395p9054l16591J96075j06420K4813J12484
16918A239752j88525K85673K13775l43598K68475k08816L507R4095j97023K01733
$$ plain form
16988 777683 687851 305175 826392 630235 735365 570476 626154 615780 574969 823297
16978 823297 639394 738417 487774 641417 573897 891837 906331 616585 869477 523976
16968 523976 611416 598363 894294 830083 939825 1009747 872809 459603 1024662 966518
16958 966518 911697 942463 1132079 770913 715098 787512 1060119 761226 1314817 1172275
16948 1172275 994449 1096020 887433 1314425 1293903 869872 1019956 618808 1236178 1131685
16938 1131685 950482 1080973 1017201 1247897 819730 1229894 816010 1205751 1050394 1085507
16928 1085507 1346038 1316161 1208050 1408445 1329391 1012800 1208875 1102455 1127268 1239752
16918 1239752 1051227 1336900 1550675 1207077 1475552 1266736 1270243 1364338 1167315 1369048
16908A369048j93704L81767j12386M1900K8951m0494k27652J31938p3233L68263
16898A674398j31470M6025k73839K00850j92730P5036K88784L3773n1064k86042
16888A383721P2599M17493N349k79171k02005M66476o6784L7120J30217J41473
16878B106488l86965K74748m46676K68648M57137k65688j38690Q3550L1755J31637
16868B115944K55193k55190K8563J55881K05679k07859J53952k64532L61004k28160
16858B320475j32430K44653l25374M93840k12121K31503M4408R242K04334j57465
16848B721065J78667k45517p9170K94990j51262L2095L74771J99526k71355m112
16838C049698J24111N1959Q6403k07765N27143k55975L85136l13059O4163k34756
$$ plain form
16908 1369048 1175344 1557111 1444725 1486625 1515576 1475082 1247430 1379368 1306135 1674398
16898 1674398 1542928 1588953 1315114 1515964 1323234 1398270 1687054 1720827 1669763 1383721
16888 1383721 1456320 1873813 1879162 1599991 1397986 1864462 1797678 1834798 1965015 2106488
16878 2106488 1719523 1994271 1547595 1816243 2273380 2007692 1869002 1952552 1984307 2115944
16868 2115944 2371137 2115947 2144510 2300391 2506070 2298211 2452163 2187631 2548635 2320475
16858 2320475 2188045 2432698 2107324 2601164 2389043 2620546 2664954 2674196 2878530 2721065
16848 2721065 2899732 2654215 2575045 2870035 2718773 2750868 3125639 3325165 3053810 3049698
16838 3049698 3173809 3225768 3312171 3104406 3631549 3375574 3760710 3447651 3511814 3277058
16828C277058N20688k43581L34286K39323l22954L19888J80521n8715J14813r414
16818D351913L10471l90735K64495J59891k27555J41302K62323J0429J67839j18856
16808D931517N1212M29703J31064P3710r4938K63643J68516k3873M01270M2315
16798F374139K17854l6433k722M47588j53869K0581M69628L86150J06027k19134
16788G609809L49202K72486j36868K81647N65429J19382r9132M54316J36430L74372
16778I927073J06558O19735K43118M72104j79126N05070M70839K26075L93694
16769A2785140L2999P16579L97388J43764N62755K45289O38936L90404N77114
16760A6490368M47005Q42884M07176P71818M96831O02303J126899K23367Q37611
$$ plain form
16828 3277058 3797746 3554165 3888451 4127774 3804820 4124708 4305229 4246514 4361327 4351913
16818 4351913 4662384 4271649 4536144 4696035 4468480 4609782 4872105 4882534 5050373 4931517
16808 4931517 4982729 5412432 5543496 5617206 5522268 5785911 5954427 5930554 6331824 6374139
16798 6374139 6591993 6555560 6552838 7000426 6846557 6867138 7336766 7722916 7828943 7609809
16788 7609809 7959011 8231497 8094629 8376276 8941705 9061087 8961955 9416271 9552701 9927073
16778 9927073 10033631 10653366 10896484 11368588 11189462 11694532 12165371 12391446 12785140
16769 12785140 12818139 13534718 13932106 14075870 14638625 14883914 15522850 15913254 16490368
16760 16490368 16937373 17780257 18187433 18959251 19456082 20058385 21185284 21408651 22246262
16751B2246262J184643N78750J251078P58698J278917R73197J495994Q64252J426467
16742C2058258J544655J537667J262856J888107J462808K354348J837606K189619
16734D6135924J950726K514101K846890K637989L112948L371925L240504L425047
16726F9236054M207042M285474M534888M450750N357015N364860N441871N899603
16718A08777557O300765O582391O871304O932568P136476O918900P127141O695018
16710A63342120O787616O393425N421137M540494M054915K447298J795595L59358
16702A95141958q87123j938355l082354m062284n439676n705283o446674o832538
16694A60747671p459045p302910p220178p650020p224160o925140o557668o735617
$$ plain form
16751 22246262 23430905 24009655 25260733 26019431 27298348 28271545 29767539 30631791 32058258
16742 32058258 33602913 35140580 36403436 38291543 39754351 42108699 43946305 46135924
16734 46135924 48086650 50600751 53447641 56085630 59198578 62570503 65811007 69236054
16726 69236054 73443096 77728570 82263458 86714208 92071223 97436083 102877954 108777557
16718 108777557 115078322 121660713 128532017 135464585 142601061 149519961 156647102 163342120
16710 163342120 170129736 176523161 181944298 186484792 190539707 192987005 194782600 195141958
16702 195141958 194254835 192316480 189234126 185171842 179732166 174026883 167580209 160747671
16694 160747671 153288626 145985716 138765538 131115518 123891358 116966218 110408550 103672933
16686A03672933n568128n657023n813719m890224m922303m359712m178091l861373
16678F4422360l510022l349785l479696k715452k647522k522495k694971j902201
16670D1600216k336419j757096j601693j735828j475526j423945j637861q90432
16662B8741416j361034j151548j376837o35456j149596j267729n93162p41925
16654B0464129q36902n62725o82567n45704r05975o18723l44329n38972n70509
16645A4857723m94280m71152m83302l47710m42140m00169m18026o3379p39043
16636A0998522k87187j18288l84182j04257m02559l92479O1019l18711l84802
16627H667076n9439m05059m3949k26519l90946n35973J75757J95317m98667J92616
$$ plain form
16686 103672933 98104805 92447782 86634063 81743839 76821536 72461824 68283733 64422360
16678 64422360 60912338 57562553 54082857 51367405 48719883 46197388 43502417 41600216
16670 41600216 39263797 37506701 35905008 34169180 32693654 31269709 29631848 28741416
16662 28741416 27380382 26228834 24851997 24216541 23066945 21799216 21206054 20464129
16654 20464129 19627227 19064502 18381935 17836231 16930256 16311533 15967204 15428232 14857723
16645 14857723 14363443 13892291 13408989 13061279 12619139 12218970 11800944 11737565 10998522
16636 10998522 10711335 10593047 10208865 10104608 9702049 9309570 9370589 9051878 8667076
16627 8667076 8607637 8202578 8158629 7932110 7541164 7005191 7180948 7376265 6877598 7070214
16617G070214n46793p00j79419J9028n86483L75757l61408k13211p4223k78874
16607E223888K69337l34628j08619N0470r8902l76212O8451N5669p8040q4492
16597D586922l96057j32817j3806K45648k97223j04946k5198o732k07036O6547
16587C715302r8138k57469J62851n1293k10698P3214j98651o4432J43986K9222
16577C243894p4136j14926m2344j72632M60661q45623R2448K25353K01890j78192
16567B796393k76767Q2037j78929P2142k7751n4205n9475J19153j10209k1961
16557B340428k05088j04920L95614l28283j76869L47305l67218q7053O5445n3966
16547A825395n6012J54876k04455J83059j61266K03493j57836j71022j4492J85759
$$ plain form
16617 7070214 6523421 6522721 6343302 6362330 5775847 6151604 5790196 5576985 5502762 5223888
16607 5223888 5493225 5158597 5049978 5100448 5001546 4625334 4693785 4749454 4671414 4586922
16597 4586922 4190865 4058048 4044242 4289890 3992667 3887721 3862523 3855791 3648755 3715302
16587 3715302 3617164 3359695 3522546 3471253 3260555 3333769 3135118 3070686 3214672 3243894
16577 3243894 3169758 3054832 3012488 2839856 3300517 2454894 2547342 2772695 2974585 2796393
16567 2796393 2519626 2601663 2422734 2494876 2467125 2412920 2353445 2472598 2362389 2340428
16557 2340428 2135340 2030420 2426034 2097751 1920882 2268187 1900969 1813916 1879361 1825395
16547 1825395 1769383 1924259 1719804 1902863 1741597 1945090 1787254 1616232 1601740 1787499
16537A787499k30916J69488m4382r1900J5029j30069k6709O7107L46684m53729
16527A408102L8997l03229K44370o3468L45876m29522M59096l18232m4534j35379
16517A202077J45040k06629k3998K9966Q0978n7391P3849p5896o2974l15109L93264
16506A183177l84193M04921j84750J34636l18968J62305P7514K34594j20629Q7054
16496A275661m9463k0219j05884j22469J36201J04862l64971K4826K55416j01535
16486A032425k04496K19276n00129L5369r267L82342p240n8399L182L19549m40559
16475G72053L82420l31818J07351J86167n18717k4394N41252E39624M05720q1943
16465H63401B65739L48405P1049j41877j8236M67799k69564q4031k29308L30445
$$ plain form
16537 1787499 1556583 1726071 1681689 1589789 1604818 1474749 1448040 1515147 1861831 1408102
16527 1408102 1447099 1143870 1388240 1324772 1670648 1241126 1700222 1381990 1337456 1202077
16517 1202077 1347117 1140488 1116490 1146456 1227434 1170043 1243892 1167996 1105022 789913 1183177
16506 1183177 798984 1203905 1019155 1153791 834823 997128 1074642 1309236 1188607 1275661
16496 1275661 1226198 1205979 1100095 977626 1113827 1218689 853718 878544 1133960 1032425
16486 1032425 827929 1047205 547076 582445 573178 955520 948280 889881 893063 1212612 772053
16475 772053 1154473 822655 930006 1116173 597456 573062 1114314 539624 945344 863401
16465 863401 265739 614144 685193 543316 525080 992879 723315 639284 409976 740421
16455G40421o2184K60162D31446N1668K13498K47720O581l52348M6696J38134
16445G83395k36305N8187K18336m01654O3590J87101k2128N2849j27780N2994
16435F28585k33989J72441J0853J83775B48703N85060l80630M9181j12876L09512
16425F98950j97949P7970k01322J73045J85678B15271M49886j22586J5464p9895
16415D78140j7990M26826l97711k3763j80954J50303k2362j3668Q5213P107J02022
16404E93163M8683k59002J67924p7928K37352k82115l683K43976B08476K28871
16394D37347A09746L51044A01007J75216L6878M2694r420n7166J14667j4223J01407
16383D91060j59280j20153D2932K67503Q5830j31826J94257A78435J51234R7472
$$ plain form
16455 740421 678237 938399 431446 483114 696612 944332 950913 598565 645261 783395
16445 783395 547090 605277 823613 421959 485549 672650 650522 703371 575591 628585
16435 628585 394596 567037 577890 761665 248703 833763 453133 502314 389438 698950
16425 698950 501001 578971 377649 550694 736372 215271 665157 542571 558035 478140
16415 478140 460150 886976 489265 465502 284548 434851 412489 398821 484034 491141 593163
16404 593163 641846 382844 550768 472840 710192 428077 424394 668370 208476 437347
16394 437347 109746 460790 101007 276223 313101 355795 346375 289209 403876 389653 491060
16383 491060 331780 211627 42932 310435 396265 264439 458696 178435 329669 427141
16373D27141m3717J06115j37445n7187K74464B37834O4544A25572K14481A19769
16362C38342D2747L12619G8439K07226l5323J54467d4153A87906K61152m4211
16352D04847M114A43891J17733R4972o1808Q5621j8635p1140o2221j07530K29971
16341C50854E0404O0471a02532A30175R9412J82886R2624B37964O1591P8462A67343
16329a11889F34878j29621A43660L00207o6009A70684L05006F9354M26265k40408
16319B55211R0631M6213b19309H5555C120M37113A53292D5945J31624K97316j89997
16308B84888A42088K22028B1151J689M29654k21149j06254J13924A4361J30944
16298A45305C921L07988K4168d7280B97066a26851D03991A15708J66204Q3885
$$ plain form
16373 427141 383424 489539 352094 294907 569371 237834 302378 125572 340053 119769
16362 338342 42747 355366 78439 285665 250342 404809 -44153 187906 449058 404847
16352 404847 408961 143891 261624 356596 294788 380409 361774 290634 228413 120883 350854
16341 350854 50404 110875 -102532 130175 229587 412473 505097 237964 299555 378017 167343
16329 -111889 634878 505257 143660 443867 377858 170684 475690 69354 495619 255211
16319 255211 345842 392055 -219309 85555 3120 440233 153292 45945 177569 474885 284888
16308 284888 142088 364116 21151 22840 452494 231345 125091 239015 14361 145305
16298 145305 3921 311909 336077 -47280 297066 -126851 403991 115708 281912 365797
16288C65797p5814E1391O3579J37277A2558J95361L32118j49884a89234j03503
16278b92737g7735A29700J30221K00060i9831j76297A68549F1860P1244J07145
16268B40249p7263a34957d7283l1869A23311J13218q1042o0509f7018B96156H7502
16256C9743A0840J25301L38456j01758I559J27066o490a270B3354J01074m5017
16245G9411a0788B75195c0618m1436A2440a05171C50936J1285j18974H3057R0321
16234A73378D1905J07053a6593p906I7799M3919Q8858E5739e6216B72041q6872
16223A85169J68350i9798C05461c2728D19599A24871b3414R1E16790C6477K68359
16212C04836E9866b255A63438a9342j70157B02342d0385B9096O0352a79546A08298
$$ plain form
16288 365797 289983 51391 114970 252247 12558 207919 540037 390153 -189234 -292737
16278 -292737 -77735 129700 259921 459981 -99831 -276128 168549 61860 133104 240249
16268 240249 162986 -134957 -47283 -79152 123311 236529 155487 94978 -67018 296156 87502
16256 39743 10840 136141 474597 372839 9559 136625 130135 -1270 23354 124428 79411
16245 79411 -10788 275195 -30618 -72054 12440 -105171 350936 362221 243247 83057 173378
16234 173378 41905 148958 -16593 -24499 97799 141718 230576 55739 -56216 272041 185169
16223 185169 353519 -99798 305461 -32728 419599 124871 -23414 -23323 516790 36477 304836
16212 304836 59866 -2255 163438 -19342 -189499 202342 -40385 29096 89448 -179546 108298
16200A58457b64880B91043F2765J4459M8907g07o9257j04191A58824J64975R2514
16189D16313A43385a93153j26602A11162b47433E5370K38719a35241e8967A4369
16178e9425B79841I1529e8902C6126J65439I8197J62451F5163b30833h3865l1515
16167a15380E1812P9911a81503A12703h0544D1281g1372o996d866G7671K46201
16156C23872o5248e9466C61576G2439b26208C5803M72002A82928a16300N5384
16146f0916C67319a89924C27134d0338B06557G1771K49497a15560j34727M0828
16136b09459A69372A8108K76066d4032k50236D96038B9978c5250B28268C3228
16125B41953f43C32089E8802o016b8954B83948c08687J44954D768R1958M19524
$$ plain form
16200 158457 -264880 291043 62765 77224 126131 -707 -69964 -174155 158824 323799 416313
16189 416313 143385 -193153 -319755 111162 -247433 55370 294089 -135241 -58967 14369
16178 -59425 279841 91529 -58902 36126 201565 98197 260648 65163 -230833 -83865 -115380
16167 -115380 51812 131723 -181503 112703 -80544 41281 -71372 -78368 -4866 77671 323872
16156 323872 258624 -59466 361576 72439 -226208 35803 507805 182928 -116300 -60916
16146 -60916 367319 -189924 327134 -40338 206557 71771 321268 -115560 -250287 -209459
16136 -209459 169372 18108 294174 -44032 -294268 496038 29978 -35250 228268 33228
16125 241953 -643 332089 58802 52786 -28954 283948 -308687 -163733 4768 96726 516250
16114E16250E8098P4528C5724b1983A36a51629P5128c3440B7515J85895d961m3915
16102d8876D10349A28360O2177p4448A3378K08791J7645a84274A95238N727a00884
16090a42963B95915b210l37122J61151h3023A99111I4518R2611O3501D1493a21522
16078A31099Q2014B6801b03022A7903c6460m61416A94692g9133k40071D55834
16067B50653K1458H6233L49323c08612h5325a8038n6185A72908l4098b18301F129
16055A28944k8415a92798h3351j56063A26713a41833j4687L8024j31225e6884
16044a9361B31695G7625K240e2371j61145p2937h6157A7822a78357A45562a62101
16032a37693A34849a49153E0807K73174F9953J88201c2278j62544B48275a85099
$$ plain form
16114 516250 58098 132626 35724 -21983 136 -151629 -76501 -33440 27515 213410 -4961 -48876
16102 -48876 410349 128360 190537 116089 13378 222169 239814 -184274 195238 200965 -100884
16090 -142963 295915 -2210 -339332 -178181 -83023 199111 94518 187129 250630 41493 -121522
16078 131099 213113 26801 -203022 17903 -36460 -497876 194692 -79133 -319204 455834
16067 250653 272111 86233 435556 -308612 -85325 -18038 -74223 172908 138810 -218301 6129
16055 128944 100529 -192798 -83351 -239414 126713 -141833 -156520 -118496 -249721 -56884
16044 -19361 231695 77625 79865 -52371 -213516 -286453 -86157 17822 -178357 145562 -162101
16032 -137693 134849 -149153 50807 323981 69953 258154 -32278 -194822 248275 -185099
16021a31806q1625E6854b71261b8439B07756g1636m41A72530d1724J7954A07103
16009A9429i1621l2183C5805O662c74543B27087a08707M4772C46889F6968a50075
15997c7966j32584K215e2981b4819j08093j46278b1723I8384c5144l9665E4957
15985c53316h2438k62337B54910a39350n5102A24072a13910k10907a59097A56030
15974b31959A16742l9748L63453I8897a62402C80032j71561g01I9907h2646D80109
15962c49013h4982j79530B05196M5783A07879r094f7871C43723b24771i6269d7047
15950A17650e3117A37891a95430j43646J67113e5519j09182A23064g9092l00576
15940c79668A13087B1090J29565b60077b0929N023p7525L3874j73711P1940n0782
$$ plain form
16021 -131806 -213431 56854 -271261 -28439 207756 -71636 -72077 172530 -41724 -23770 107103
16009 19429 -91621 -123804 35805 42467 -374543 227087 -108707 -63935 346889 66968 -150075
15997 -37966 -170550 -168335 -52981 -24819 -132912 -279190 -21723 98384 -35144 -74809 54957
15985 -353316 -82438 -344775 254910 -139350 -194452 124072 -113910 -324817 -159097 156030
15974 -231959 116742 76994 440447 98897 -162402 380032 208471 -701 99907 -82646 480109
15962 -349013 -84982 -264512 205196 250979 107879 98785 -67871 343723 -224771 -96269 -47047
15950 117650 -53117 137891 -195430 -339076 -171963 -55519 -164701 123064 -79092 -379668
15940 -379668 113087 21090 150655 -260077 -20929 -15906 -93431 -59557 -233268 -161328 -212110
15929b12110I9063P3073K8643R444H9097a96656A72612a48285A65886b42192I1318
15917a02292c8619m7208E3253a97039b3548r5201C2249c00929L5036j21651J27467
15906b60077a07970j08622P3511j02552l9100B63652C951M08966c074l78722b8767
15894G8426b9406E573c1665j70728n0809l4322K1911G2997d5058c875m43110E4019
15881d8200r1824H9782b20994C7793A8201M4482a73283L87A1803a24208A79990
15869I229b11818L6400F9584A1953b88953m6684h2506m87010B13211J19607A0267
15857B40858e6557D7109d22812o4760B8322J25022Q1398a10610B2042d33579B42494
15845C6946b66063a12003e0368e010n0147A0388L60385e0999A06286b53742B8072
$$ plain form
15929 -212110 99063 172136 200779 210223 89097 -196656 172612 -148285 165886 -242192 91318
15917 -102292 -38619 -85827 53253 -197039 -23548 -118749 32249 -300929 -265893 -387544 -260077
15906 -260077 -107970 -216592 -143081 -245633 -284733 263652 3951 412917 -3074 -381796 -28767
15894 78426 -29406 5573 -31665 -202393 -253202 -287524 -265613 72997 -45058 -3875 -446985 54019
15881 -48200 -140024 89782 -220994 37793 18201 62683 -173283 -172896 11803 -124208 179990
15869 9229 -211818 -175418 69584 11953 -288953 -335637 -82506 -569516 213211 332818 10267
15857 240858 -56557 47109 -422812 -487572 28322 153344 234742 -110610 22042 -433579 242494
15845 36946 -266063 -112003 -50368 -5010 -55157 10388 370773 -50999 106286 -253742 28072
15833a78716A47476G2766J00654e8510j74537a14752A27475a67064K5426L5127
15823a06511d7321h711D1326c91442I0471L0806K91344i575m7000a2389B52093
15811b14974A9342d8744B2946f6910k7702A93696a21006I8615b10314E9715K50836
15800C10551e2657j32335a4122j13535N2885B0953c7834k8537k07554E5291i8568
15788C20779d8812k75772a8750m01980H2673a19706A99444a28883C4581Q4757
15778A19338c2316B47904k7516a5969l82196D5516K50337I3301f9197A99997c96765
15766b79584B74171A31778a03448A91158d0120m4753a7618B75395E8811b46878
15755B4075P686J36436G9792e7020j30740A0443O2841a24844c9014H7084f8204
$$ plain form
15833 -178716 147476 72766 173420 -58510 -233047 -114752 127475 -167064 -141638 -106511
15823 -106511 -47321 -8711 41326 -391442 90471 121277 412621 -9575 -56575 -12389 252093
15811 -214974 19342 -48744 22946 -66910 -94612 193696 -121006 98615 -210314 59715 310551
15800 310551 -52657 -184992 -14122 -127657 -74772 20953 -37834 -66371 -273925 55291 -98568
15788 320779 -48812 -324584 -18750 -420730 82673 -119706 199444 -128883 34581 119338
15778 119338 -32316 247904 220388 -15969 -398165 45516 295853 93301 -69197 199997 -396765
15766 -279584 274171 131778 -103448 191158 -40120 -84873 -17618 275395 58811 -246878
15755 24075 31761 168197 79792 -57020 -187760 10443 73284 -124844 -39014 87084 -68204
15743F881N6178K0567C9300J00402c06745h0966D4559i2062k90018G9785k5123
15732E4662K12375d19744a42814C93228g0330E4867c09302A5876a02667B135J42871
15721A45006b6331A62111a67366K7366d464k60779R8297e7145a5026l55955A58665
15709b2578n1611c2315P681k97911Q8663q6165g9641K4353E4284a74441A0821
15697a02248c6908J3225m3569j11123D2696a80664B12315D9786P5825E1744b29857
15685e6293j58213A95394a11901C9J84903b02771A82250o3390a60031F9280J46399
15674B15679J78498A54566B6974c6869l22430J20200A22731k4010b02795A44717
15663e3685P623n986K1288C9871J55363D8409q793h0012B63136D0469Q5370a69927
$$ plain form
15743 6881 63059 83626 39300 139702 -306745 -80966 44559 -92062 -382080 79785 54662
15732 54662 267037 -419744 -142814 393228 -70330 54867 -309302 15876 -102667 2135 145006
15721 145006 -26331 162111 -167366 -140000 -4464 -265243 -166946 -57145 -15026 -370981 158665
15709 -22578 -74189 -32315 -24634 -322545 -233882 -320047 -79641 -55288 54284 -174441 10821
15697 -102248 -36908 -23683 -67252 -178375 42696 -180664 212315 49786 125611 51744 -229857
15685 -56293 -214506 195394 -111901 39 184942 -202771 182250 118860 -160031 69280 215679
15674 215679 394177 154566 26974 -36869 -359299 -239099 122731 98721 -202795 144717
15663 -53685 -46062 -52048 -30760 39871 195234 48409 39616 -80012 263136 40469 125839 -169927
15650a24498C678b28147A30724b51720A27416b21780N7898o7939A0812h0730j99463
15639b80193j42738a46218A3868K91312I9780f0850r9627O0927o7225f0757j20819
15628a81576m4719K8188C6152a76303E1889L3622d60503e4680H8197i7380J1586
15617h5794B51768p5663C9768c52179b8697A46330D5471K2299a91762b2307l5102
15606e7409c824m03968C8606b0349B34514b60728D4200a30852A74680J69727i9589
15594H8144f643A70946R8835b29912M8273g2237m81464a28131j47586i402a326
15582F2312J44008G0880I081M123K89824b58199H2791b48568M8384Q6256H4126
15570b05955B062K85240b23218K4900A62849a9539j87218j330A91691o4504o3210
$$ plain form
15650 -124498 3678 -228147 130724 -251720 127416 -221780 -163882 -231821 10812 -80730 -280193
15639 -280193 -422931 -146218 13868 305180 99780 -60850 -160477 -99550 -166775 -60757 -181576
15628 -181576 -226295 -198107 36152 -176303 51889 85511 -460503 -54680 88197 -97380 -85794
15617 -85794 251768 176105 39768 -352179 -28697 146330 45471 67770 -191762 -22307 -57409
15606 -57409 -3824 -407792 38606 -20349 234514 -260728 44200 -130852 174680 344407 -99589
15594 88144 -6643 170946 269781 -229912 -181639 -72237 -553701 -128131 -275717 -9402 -1326
15582 62312 206320 70880 9081 13204 303028 -258199 82791 -248568 -200184 -113928 84126
15570 -205955 2062 287302 -223218 -198318 162849 -19539 -206757 -208087 191691 127187 63977
15559F3977h7401c4178p542A17661a94942j9806a8186D2734m669g4161A29220
15547G3870L1340b39244c1712A24825j1019j6509A6980a03053A99115l7422o2298
15536I9395f5027G3678Q4500a20054G2025L7876a41527L8383C6821M7155g176
15524g3219A09334D3260N3854a69219E9076L24087a23003A19574B5376K3373M2694
15513I1443a27910A4373J80012k1580D2682J6668a61042B83559A34325F1372b97029
15501a13061E3426e5755A59112a04796J3280A17639c5462j3677q5622c4758D1301
15489A41861J07212n8311b14203P0661J2176m4442B73893a11055j05093O6697
15479a49451M4034c8616J2860B72841g8025a0699k20145a1772C048h0039A88335
$$ plain form
15559 63977 -87401 -34178 -41720 117661 -194942 -214748 -18186 42734 38065 -74161 129220
15547 73870 105210 -239244 -31712 124825 113806 97297 16980 -103053 199115 161693 99395
15536 99395 -65027 73678 158178 -120054 72025 109901 -141527 -103144 36821 83976 -7176
15524 -73219 109334 43260 97114 -169219 59076 383163 -123003 119574 25376 48749 91443
15513 91443 -127910 14373 194385 172805 42682 59350 -161042 283559 134325 61372 -297029
15501 -113061 53426 -55755 159112 -104796 -91516 117639 -35462 -49139 -134761 -34758 41301
15489 141861 249073 190762 -214203 -143542 -131366 -175808 273893 -111055 -216148 -149451
15479 -149451 -105417 -38616 -25756 272841 -78025 -10699 -230844 -11772 3048 -80039 188335
15467A17459C7449a67772p9706a13337N4448o9643q4760Q1870A33541b79599J3340
15456b66259I0330M20969a49091A21655M96a89738H0576E033P8405N6101h2489
15444A70381F0041a91228Q5080a7543o381j76816Q5987h21o4695o4875e0550F9307
15431C5722L5812D658c29922B7412d9270A89541J04849b25092N0022A70326D9507
15419i1742B4413K6672K8850P9484N3433d55128a34577F5245K3373c39475L2104
15408c07371J18593b061B7403a13496L6668a4268A33369K05924a53422L6983j1118
15397a27557k26570A89921H7027D1709J26767A2268J84093A3662J20109o3954
15387F9817B1204c56190C539a26875A20470a49674I3453a5095E7205M9321l9534
$$ plain form
15467 117459 37449 -167772 -247478 -113337 -58889 -128532 -213292 -131422 133541 -279599 -266259
15456 -266259 90330 511299 -149091 121655 122151 -189738 80576 5033 83438 139539 -82489
15444 170381 60041 -191228 -106148 -17543 -23924 -200740 -114753 -821 -65516 -130391 -50550 69307
15431 35722 71534 4658 -329922 27412 -49270 189541 294390 -225092 -175070 170326 49507
15419 -91742 24413 51085 79935 159419 212852 -455128 -134577 65245 88618 -339475 -307371
15408 -307371 -188778 -2061 27403 -113496 -76828 -14268 133369 339293 -153422 -116439 -127557
15397 -127557 -354127 189921 87027 41709 168476 12268 196361 13662 133771 69817
15387 69817 21204 -356190 3539 -126875 120470 -149674 93453 -15095 57205 106526 66992
15376F6992a61406j24502h0590k16778h5229C72605e5017A64679f9871n8398A20933
15364B7907a19198H1961c3748B62302A17351e8999A07398c9290a1731l16543a11540
15352d2780A5748i3713I1316C5894j5071J1161J73324G9096d1449B5823d2724
15340A77460B2875K2169J49188k8197b50376A74559K7465m6883M5470c28453B13058
15328A12410J26261a75192c2556A28451e1814k90518a60909B3503J48325K6946
15318A98774k9974K8509a99383h1409k60881A83067K652D5312K26982a58110B0587
15306G6461b48125B8558a83725e4566A69897e379A32425b4926A85480a01864m1761
15295a43625A69950j9277a20982K5238M3090B22171b2616p7117A24420L5936j5635
$$ plain form
15376 66992 -161406 -285908 -80590 -297368 -85229 372605 -55017 164679 -69871 -128269 120933
15364 27907 -119198 81961 -33748 262302 117351 -58999 107398 -39290 -11731 -328274 -111540
15352 -42780 15748 -93713 91316 35894 20823 31984 205308 79096 -41449 25823 -42724
15340 177460 22875 45044 194232 166035 -250376 174559 202024 155141 200611 -328453 213058
15328 112410 238671 -175192 -32556 128451 -51814 -342332 -160909 23503 171828 198774
15318 198774 168800 197309 -199383 -81409 -342290 183067 185719 45312 272294 -158110 20587
15306 76461 -248125 28558 -183725 -54566 169897 -5379 132425 -24926 185480 -101864 -143625
15295 -143625 169950 150673 -120982 -95744 -52654 222171 -22616 -99733 124420 160356 144721
15284A44721e26427b19794g3589A4123N02255b15387j01250A92774b55670h7906
15273i6518B11847i3572A48973j1278a38376k1842A44763K6788J15153J52790
15263D39494A37559m8494c3905k23544a1837B4805b09678F9768J36384b06078
15252B84025j32613l1253j3823b74436B43141J05578C1113M1348b50442A92237
15241H522K06915B9228a12826I1464J96970P5113Q33277n41684K85410P9003k31908
15230G87645A53910o2022J50438n558n6484a61030J7730B35398n926J22705a31762
15218G3923J8531G164L08140P3610b6565q8137B8818N8731k3504h9558a0438j13717
15206a24155Q945K7062G4317j6191J89537A432K198J13327n3217L5403a28120
$$ plain form
15284 144721 -526427 -219794 -73589 14123 516378 -215387 -316637 192774 -255670 -87906
15273 -96518 211847 -93572 148973 137695 -138376 -160218 144763 171551 286704 439494
15263 439494 137559 89065 -33905 -257449 -11837 24805 -209678 69768 206152 -206078
15252 284025 151412 120159 106336 -274436 243141 348719 31113 72461 -250442 192237
15241 8522 215437 29228 -112826 91464 288434 363547 1196824 655140 940550 1019553 787645
15230 787645 153910 91888 242326 236768 180284 -161030 -143300 235398 229472 352177 -131762
15218 73923 92454 7164 315304 388914 -26565 -114702 28818 87549 64045 -89558 -10438 -124155
15206 -124155 -115210 -88148 74317 58126 247663 1432 3630 116957 63740 99143 -128120
15194E844K17817o5503N7412f6413n1220q7048Q1319i658j1227A22066J97173
15183C19239j33496C6011E997b17237C67232e1309k26005F2817J8069N5187r610
15172A26463A5407K20168b0176n4351I2771a39270C7813J86874b72628A4109g6699
15160D06467A66409K20923r5506d433j24965D18214B00596J20323A0685M47879
15150D58564a68864d269B21580b78320B98751e313H865a02259F2102B943J75643
15139A78586D6390d7124l5842A52724D1102K06411j11487K18969A56144D4968
15128A34986k7188k9273L08238G3610B404R6647J86821G9096e196H1481K89674
15117C71155o4080r5970R5679A35611R485B0576N5478C0199a01869b0221E40624
$$ plain form
15194 5844 223661 158158 215570 -66413 -117633 -204681 -123362 -9658 -20885 122066 319239
15183 319239 185743 36011 5997 -217237 367232 -51309 -277314 62817 80886 136073 126463
15172 126463 15407 235575 -20176 -74527 92771 -139270 37813 224687 -272628 14109 -76699
15160 406467 166409 387332 291826 -4433 -129398 418214 200596 320919 10685 458564
15150 458564 -168864 -4269 221580 -278320 298751 -5313 8865 -102259 62102 2943 178586
15139 178586 46390 -47124 -82966 152724 41102 247513 136026 354995 156144 44968
15128 134986 107798 78525 386763 73610 2404 99051 285872 79096 -5196 81481 371155
15117 371155 307075 211105 306784 135611 145096 20576 76054 30199 -101869 -20221 540624
15105f246A48477J5511g7997B66658J28208r5128A04515f8273B71583A31459K30692
15094C62151J01897G3710P8358J6003K5646K53127A73722i8405J1983A6656K71320
15083B87976D9155j2047K63812j42110C5981O645L61665h1833B40090A10532L7036
15072A47568J30306G2665M9476K01109k9597L789j41168J991l1854M95860B6190
15060F751K11705a37802E30243C7880a99483j5724A88250J627a4383I8733a18250
15048B94267f5669A77543b35606G6076K32514c36490A37457g1892F1914K47434
15038C09348H7869J77809m2435r304m1926M1540p8542i1296E84750A92283R9744
15027B92027j8420A33388e0952C60210o7239r0218N081q0792a44331A61714J7326
$$ plain form
15105 -6246 148477 163988 -77997 266658 394866 299738 104515 -68273 271583 131459 362151
15094 362151 464048 73710 152068 168071 193717 446844 173722 -98405 -86422 16656 287976
15083 287976 49155 37108 300920 158810 35981 42626 404291 -81833 240090 110532 147568
15072 147568 277874 72665 122141 323250 293653 297442 156274 158265 126411 622271 26190
15060 6751 218456 -137802 530243 37880 -199483 -215207 188250 189877 -14383 98733 -118250
15048 294267 -65669 177543 -235606 76076 308590 -336490 137457 -71892 61914 309348
15038 309348 87869 265678 223243 213939 172013 213553 135011 -91296 584750 192283 292027
15027 292027 273607 133388 -50952 360210 292971 202753 207834 127042 -144331 161714 179040
15016A79040k8302J66461n5188r0357h5074A98251a07630B06678c2281A17579
15005D20897j68326J07640j63465Q3743H8583K44829E8328L30912j6334K5668
14995C98574J27414k06503B800M78952c2899C45831a57896B84479A25037j9441
14985A05596P8592m6987R3808a57897I9495C741L15499j4889A17133R3743F657
14973D67224k02668j07232P7400K97185g1122G5498K48114E5754K16515j12994
14963A59275J22525J56265D0957J97709A18184J28028G8489L00683A65423J50020
14953C15443r8957j05305K61911J26094A60486L58577A30094l9621K19106I0890
14942d2725D4030f2570A49163J57964r0955J95317A23095D917N70232B54328J75678
$$ plain form
15016 179040 150738 317199 262011 171654 -85074 198251 -107630 206678 -32281 117579
15005 420897 252571 360211 196746 280489 88583 333412 58328 389240 372906 398574
14995 398574 525988 319485 2800 481752 -32899 345831 -157896 284479 125037 105596
14985 105596 184188 137201 231009 -157897 99495 3741 319240 304351 117133 210876 6657
14973 467224 264556 157324 234724 531909 -71122 75498 323612 55754 272269 159275
14963 159275 281800 438065 40957 238666 118184 246212 78489 379172 165423 315443
14953 315443 216486 111181 373092 499186 160486 519063 130094 90473 309579 90890
14942 -42725 44030 -62570 149163 307127 216172 411489 123095 4917 575149 254328 430006
14931D30006A6038N16160q5697j81565I5702L80517K9593B39089m0190L47256
14921E46155a16350D04678J56659A08490K93460H2401P8604p1482K07871r5752
14911B01642M32980B52181J90556A02655J14052a45166B51964B4460L85953L6351
14901D46764j17119J13773j31139A55054K78970n6113j50512p9878J91030A30724
14890C83474p5786n5186k4161P5259o872J80193a07773C18304c6138E26208B16725
14878D63598C282K1348L83420j78714P5782J05252J55140A98735J6792K9286L04940
14867E49753j57242K20761A36371K67813o0003L4119K8200p7362p3681n3912F8029
14855C91168j05020J25074K54651k45380j8823j76526k7985N16027l31505j57311
$$ plain form
14931 430006 16038 532198 446501 264936 95702 476219 505812 239089 198899 546155
14921 546155 -116350 404678 561337 108490 401950 82401 161005 89523 297394 201642
14911 201642 634622 252181 442737 102655 216707 -145166 251964 24460 410413 446764
14901 446764 329645 443418 312279 155054 434024 377911 227399 147521 338551 130724
14890 383474 307688 252502 228341 303600 296728 476921 -107773 318304 -36138 526208 216725
14878 463598 3282 24630 408050 229336 305118 410370 565510 198735 215527 244813 549753
14867 549753 392511 613272 136371 404184 344181 378300 406500 329138 255457 201545 68029
14855 391168 286148 411222 665873 420493 401670 225144 197159 713186 381681 224370
14845B24370P0933J22575J25348k6734r7119j05690M7442Q8539J3020r9162m9117
14834C14405L4335o3786M2747J36214K92555j01254N1543k11792A50061Q1140
14824B31201K21755L7037J24651B19785M42108Q5442D2515L73778j7661K08224
14814F06856j24851j8790K71184l65795K48435B36517J51919r4446j064J41703
14804D34629K62L40555j57470k09485J01403m3894J7460B14203O17772k89958
14794E42017R1937J25109A37030L91032q3786K22325o7905j30048j87194K75706
14784E57160n5276K25453j01117l8248o0629J25075q310m0787o1165j03560M19527
14773H58123k78183k452K99549C33615M25556j28524M8491j4336P9123j78845
$$ plain form
14845 224370 295303 417878 543226 516492 419373 313683 361125 449664 462684 363522 314405
14834 314405 348740 284954 327701 463915 756470 655216 706759 494967 150061 231201
14824 231201 452956 489993 614644 219785 661893 747335 42515 416293 398632 606856
14814 606856 482005 463215 734399 368604 617039 236517 388436 293990 292926 434629
14804 434629 434891 775446 617976 408491 509894 466000 483460 214203 831975 542017
14794 542017 633954 759063 137030 528062 444276 666601 598696 468648 281454 557160
14784 557160 501884 727337 626220 587972 527343 652418 644108 603321 542156 438596 858123
14773 858123 579940 577488 877037 333615 759171 630647 679138 664802 743925 565080
14763E65080M4701j02983j87183K97878J31639j76378j02742K65100k2448k15469
14753D97195K42632j88059J52136p0051j78109J61200K03630k17066L9356K9360
14743F72224B54952L68411M34501l69966j71921J05467R0841K06581r9681j9791
14733G99394M6765l46023J45824K47296M1845j08867C78631M59239j81373K11438
14723H67935j27979L7211J8231J28338J40851o2877l31896J85105j70965J63080
14713H47034n0275j77042L95901j92359R29K1680j08515j3532o5732O7812p5660
14702F50241L32780J33030j65903j03207j17914L13887l36457L33644n1277l30911
14692F57913K05426K27646k61884j49879J82687k69909M62506j38824J77374l48538
$$ plain form
14763 565080 609781 506798 319615 617493 749132 572754 470012 735112 712664 497195
14753 497195 739827 551768 703904 633853 455744 616944 820574 603508 642864 672224
14743 672224 254952 623363 1057864 687898 515977 621444 712285 918866 819185 799394
14733 799394 846159 500136 645960 893256 935101 826234 378631 837870 656497 867935
14723 867935 739956 777167 795398 923736 1064587 1001710 669814 854919 683954 847034
14713 847034 796759 619717 1015618 823259 824188 845868 737353 723821 658089 725901 650241
14702 650241 983021 1116051 950148 846941 729027 1042914 706457 1040101 988824 657913
14692 657913 863339 1090985 829101 679222 861909 592000 1054506 915682 1093056 744518
14682G44518K75537j94645l5921K22627k8001Q3030l03772L90251j14001l53137
14672F86486K31711l2541K14457l83539K42737j06367R4969R4728k75870K41360
14662A008131L6711L6829k20569J78583L27720k53847L76049p31779L68972j79352
14652I47448K22340j13321p1729K84513N8898k95798J54828L0690m04515D05764
14641A155888K36057l16936K65291k31521n3599o1507K19994k84855L04747k19057
14631A014502L22859N6505j81294O9028Q2598j13227l9208L0619N6267q3895K60756
14620A475510k97255j2985J34380L3126k87301M90625k93897K36212k48449K99481
14610A529447k79832J49583L06458k46598L1979k23104M34856o7826k03907L27377
$$ plain form
14682 744518 1020055 825410 789489 1012116 984115 1067145 763373 1153624 1039623 686486
14672 686486 918197 885656 1100113 716574 959311 852944 947913 1042641 766771 1008131
14662 1008131 1044842 1081671 861102 1039685 1367405 1113558 1489607 757828 1126800 947448
14652 947448 1169788 1056467 984738 1269251 1328149 1032351 1187179 1217869 813354 405764
14641 1155888 1391945 1075009 1340300 1108779 1055180 993673 1213667 928812 1233559 1014502
14631 1014502 1337361 1393866 1212572 1281600 1364198 1250971 1211763 1242382 1298649 1214754 1475510
14620 1475510 1178255 1165270 1299650 1332776 1045475 1536100 1242203 1478415 1229966 1529447
14610 1529447 1249615 1399198 1705656 1459058 1491037 1267933 1702789 1634963 1431056 1758433
14600A758433K23416j31901j36243j79923N2584J11697L45105n50363L4125J13944
14590A640874J08287j08536l33541K85094M24568k50387M2231j80481k229K06313
14580A832193M7974N643k05581j5116J95567k07904j41120L39172k33910M60627
14570B077545R4881j18355n7938L41250m92549L62613j32536j74597M13355n06751
14560A806918K62357Q8766L65005k45277J7067K68232q6412j37088L32752j38434
14550B533886J29808M2496J97026J33235j4236r270l07192O70420M69406q349
14540C837230O5090L59045M98052Q74123P21530J541077K405373M502304O380681
14531B1184505R899244p65553j2358323p017176l503521k044070j449583o31522
$$ plain form
14600 1758433 1981849 1849948 1713705 1533782 1586366 1698063 2043168 1492805 1526930 1640874
14590 1640874 1749161 1640625 1307084 1592178 2016746 1766359 1808590 1628109 1625880 1832193
14580 1832193 1880167 1885810 1680229 1665113 1860680 1652776 1511656 1850828 1616918 2077545
14570 2077545 2172426 2054071 1996133 2337383 1844834 2207447 2074911 1900314 2313669 1806918
14560 1806918 2069275 2158041 2523046 2277769 2294836 2563068 2476656 2339568 2672320 2533886
14550 2533886 2663694 2706190 2903216 3036451 3022215 3012945 2705753 3376173 3845579 3837230
14540 3837230 3902320 4261365 4759417 5633540 6355070 7896147 10301520 14803824 21184505
14531 21184505 31083749 30318196 17959873 10942697 7439176 5395106 3945523 3314001
14523C314001j78737l52584k76555n1003k54103K59981j97867J35011k6685j87936
14513B183523J75222J3017Q0336K98334o1547j17039K25875k63778K10705N4267
14503B798915k2143M3371l23985K66274N0983L838J6941J46454r6682r9987O25477
14492C409456n71795J24329K49253J28644m7613l01811O48493m15056R244J08663
14482C341807J73340q0761j87851K03928J75842L43683n82677L49999P200M8766
14472C793276p8246k5937o2377J74673J9729M41733k29843l63750M00412P3380
14462D143050j69634L69900M8685l65217L92175j94065M32939j20034J31547P5532
14452D744878l31129J43041M00073k08082K52060l2113K98475k20081L4653L50027
$$ plain form
14523 3314001 3135264 2782680 2506125 2455122 2201019 2461000 2263133 2398144 2371459 2183523
14513 2183523 2358745 2371762 2452098 2750432 2688885 2571846 2797721 2533943 2744648 2798915
14503 2798915 2776772 2820143 2496158 2762432 2813415 2817253 2834194 2980648 2883966 2783979 3409456
14492 3409456 2837661 2961990 3211243 3339887 3292274 2990463 3638956 3223900 3233144 3341807
14482 3341807 3515147 3434386 3246535 3450463 3626305 3969988 3387311 3737310 3744510 3793276
14472 3793276 3715030 3689093 3626716 3801389 3821118 4262851 4033008 3669258 4069670 4143050
14462 4143050 3973416 4343316 4392001 4026784 4418959 4224894 4657833 4537799 4669346 4744878
14452 4744878 4413749 4556790 4956863 4748781 5000841 4968728 5267203 5047122 5081775 5431802
14442E431802J1488q1283J47547Q0142j75914Q1459K20108J29314p5307l10952
14432E458404O08622K09172n57067K75065K24834j57263M21606j2828j64438J20974
14422F427081M74888j75899q6208N59015l62615l031K64782M25879r1911K31908
14412G663889J14388K1236J23273L39015k08366L85494m28700M96987N0458k77462
14402H280212K79468M08142K55588K0826P7615L54244K5762L1752L12268r1762
14392I954115K64107J22956J65387k6840L10584P7230J98845J8410N42823l15492
14382A1312125Q05429L5085p8617L18258r2736O93290K6785J76944N25619O5302
14372A3787484j21735L85259O06027L85980k70454O54014P5498K74293J87511
$$ plain form
14442 5431802 5443290 5362007 5509554 5589696 5413782 5495241 5715349 5844663 5769356 5458404
14432 5458404 6067026 6276198 5719131 5994196 6219030 6061767 6483373 6470545 6306107 6427081
14422 6427081 6901969 6726070 6639862 7198877 6836262 6833231 7098013 7523892 7431981 7663889
14412 7663889 7778277 7799513 7922786 8261801 8053435 8438929 8010229 8507216 8557674 8280212
14402 8280212 8559680 8967822 9223410 9244236 9321851 9676095 9701857 9733609 10045877 9954115
14392 9954115 10218222 10341178 10506565 10479725 10790309 10867539 11066384 11084794 11627617 11312125
14382 11312125 12117554 12152639 12074022 12392280 12299544 12992834 13019619 13196563 13722182 13787484
14372 13787484 13665749 14051008 14657035 15043015 14772561 15426575 15502073 15776366 15963877
14363A5963877O43423o9036N99349M1988O37912L46058J43191M32140L12612N32817
14353A9584331K55898M74514M8581N36630P95736O40461N40247M43383K25597
14344B3545378N77791P42513J51941P23556M89282Q53967N55101O03618O62160
14335B8905307P97181R47923P15206P08302K37355J405930J385392M34026R53464
14326C6490086J072271Q49032J132368J285306J306351N89054J761240J131636
14318D5617344J317259J358657J511863J518234J565583J851184J756835J785681
14310E8282640J726159K362295J794349K167779K130794K482723K557890K539644
14302G6044273K875147K861088L078480L546196L269801L611348L592090M150545
$$ plain form
14363 15963877 16607300 16538264 17137613 17179601 17817513 18163571 18306762 18738902 19051514 19584331
14353 19584331 19840229 20314743 20363324 20899954 21695690 22336151 22876398 23319781 23545378
14344 23545378 24123169 24865682 25017623 25741179 26230461 27084428 27639529 28243147 28905307
14335 28905307 29702488 30650411 31365617 32073919 32311274 33717204 35102596 35536622 36490086
14326 36490086 37562357 38411389 39543757 40829063 42135414 42724468 44485708 45617344
14318 45617344 46934603 48293260 49805123 51323357 52888940 54740124 56496959 58282640
14310 58282640 60008799 62371094 64165443 66333222 68464016 70946739 73504629 76044273
14302 76044273 78919420 81780508 84858988 88405184 91674985 95286333 98878423 103028968
14294A03028968M111381M500904M517312M767463N110838N250956O053303O039451
14286A43380576O170574P063961P087473P628889P966011Q590521R021976R027854
14278B05937835J0005960J0851196J1042659J0983967J2158584J2608437J2367106
14271B85955744J3164143J3525997J3468060J3702448J3148494J2925623J2523473
14264C78413982J1786122J1790602J1159030J0466233R434152P987955N586250
14257D46624326K595968K534122K970267j13308m973616m256271n564449o915885
14249D32901154q099348j0716369j1123820j2207872j2721769j3623670j4073104
14242C50335202j3995440j2875783j3765062j4056396j3417657j3472585j3049581
$$ plain form
14294 103028968 107140349 111641253 116158565 120926028 126036866 131287822 137341125 143380576
14286 143380576 149551150 156615111 163702584 171331473 179297484 187888005 196909981 205937835
14278 205937835 215943795 226794991 237837650 248821617 260980201 273588638 285955744
14271 285955744 299119887 312645884 326113944 339816392 352964886 365890509 378413982
14264 378413982 390200104 401990706 413149736 423615969 433050121 441038076 446624326
14257 446624326 449220294 451754416 454724683 454611375 449637759 445381488 439817039 432901154
14249 432901154 424801806 414085437 402961617 390753745 378031976 364408306 350335202
14242 350335202 336339762 323463979 309698917 295642521 282224864 268752279 255702698
14235B55702698j2855956j2520935j1454385j1456488r863368r841854q957472
14228A78752240q389510q072361p774587p168368o526076o304192n857945n549413
14220A23109788n689364m641141m601252m490933m074669l749867l863735l678435
14212H8320392l565354l143403k970509l162926k083157k858081k308125k395690
14204F5833147k110421k197558k156970k184634j519320j684521j493485j817774
14196E0668464j317455j785951j104345j742217p50694j025269j499469j218923
14188D0224141j133942j105911n76409j265863r47500p18367j040220j027449
14180C2408480q03828p18010l13774j042056p69229p07833n10458q94786o94976
$$ plain form
14235 255702698 242846742 230325807 218871422 207414934 197551566 187709712 178752240
14228 178752240 170362730 162290369 154515782 147347414 140821338 134517146 128659201 123109788
14220 123109788 117420424 112779283 108178031 103687098 99612429 95862562 91998827 88320392
14212 88320392 84755038 81611635 78641126 75478200 73395043 70536962 68228837 65833147
14204 65833147 63722726 61525168 59368198 57183564 55664244 53979723 52486238 50668464
14196 50668464 49351009 47565058 46460713 44718496 43967802 42942533 41443064 40224141
14188 40224141 39090199 37984288 37407879 36142016 35194516 34476149 33435929 32408480
14180 32408480 31604652 30886642 30572868 29530812 28761583 28053750 27543292 26648506 25953530
14171B5953530m85170o86386o97155k64176l87965k98334q20494l37380m71769
14162B1504701l93051p64600j55651l38258l49809n60976l74096P8883p82037
14153A7865106j15226o00628L4680o23120n64989J20092n77396L11027o25302
14144A5224244o76460j39528j07331l08546j82972n9232l72204k1863m28059j84380
14134A2743669l66818n3215k38606j27923M6711n12826k76681J62878m44368j37589
14124A0795232k71657J15347l59164J0610m15664K36824l02666N4703p20088R4945
14114I238422j25378J71508l20641J51544n06433J49378m60317K75189j92208
14105H381064k23470K11905m45123m93784L35886j8135k27556k96621J47572k39404
$$ plain form
14171 25953530 25468360 24781974 24084819 23820643 23432678 23134344 22313850 21976470 21504701
14162 21504701 21111650 20347050 20191399 19853141 19503332 18942356 18568260 18647143 17865106
14153 17865106 17749880 17149252 17183932 16560812 15995823 16115915 15538519 15849546 15224244
14144 15224244 14547784 14408256 14300925 13992379 13809407 13750175 13377971 13356108 12928049 12743669
14134 12743669 12376851 12323636 12085030 11957107 12003818 11490992 11214311 11377189 10932821 10795232
14124 10795232 10523575 10638922 10279758 10290368 9874704 10111528 9808862 9863565 9143477 9238422
14114 9238422 9113044 9284552 8963911 9115455 8609022 8758400 8298083 8573272 8381064
14105 8381064 8157594 8369499 7924376 7430592 7766478 7748343 7520787 7224166 7371738 7132334
14095G132334J47385P2209n67378K84329m69116L9392N49923l29456l33024j05487
14085F421111N4379n06518M95464l30109J43634l99612N0149j7502l32610k3343
14075E555043J60714p1646k1936J15546j72338P8505l57544Q1697j12135l33242
14065D922664N76543n64335O66231p28435L57304m56248j41480M1526m9226l53364
14055D271180O8926L04431k19710K7626L5744k07345j3626J88111j37817K55932
14045D573452l47185K6171L6801j59551J82615o564J14406n90095K11198L3392
14035D074640P025l37053J09222l08751J47167p283j4534k30318K58895l94863
14025C304147J40929k5178L329k48734p9488P9639K28436K1729O7226l9999n37474
$$ plain form
14095 7132334 7279719 7351928 6784550 7068879 6599763 6639155 7189078 6859622 6526598 6421111
14085 6421111 6475490 5968972 6464436 6134327 6277961 5878349 5928498 5910996 5578386 5555043
14075 5555043 5715757 5644111 5622175 5737721 5565383 5643888 5286344 5368041 5255906 4922664
14065 4922664 5499207 4934872 5601103 4872668 5229972 4773724 4632244 4673770 4624544 4271180
14055 4271180 4340106 4644537 4424827 4452453 4488197 4280852 4267226 4455337 4317520 4573452
14045 4573452 4226267 4252438 4289239 4129688 4312303 4305739 4420145 3830050 4041248 4074640
14035 4074640 4081665 3744612 3853834 3545083 3692250 3684967 3670433 3440115 3699010 3304147
14025 3304147 3445076 3419898 3423227 3174493 3095005 3174644 3403080 3424809 3492035 3452036 2914562
14014B914562j18888J87814J47091K06131p2856o4747l24860J60728P308q4401
14004B957882j24792l1897j54602L45005k93000K98442k70255N3236m2902m5851
13994B691266L3666j97460J39296j11515l21140J55187K44037k76352L37795q5408
13984B609372k3914j36408Q9187K79930N7105j2474O5212M62310N93366R83413
13974D967099J934709L540596N643411R945954N375468r999475o755855m164183
13966A0487724k610310j867023m45802j034111m37518o29060P7891l52678n4754
13957C134359o4056k39238k84985K27439l36778J32990N3447r5633j51204n8956
13947B317385j16439R5402j2649j6241M3081k23369q240J35916j94844L60411
$$ plain form
14014 2914562 2795674 2983488 3130579 3336710 3263854 3199107 2874247 3034975 3042283 2957882
14004 2957882 2833090 2801193 2646591 2991596 2698596 2997038 2726783 2780019 2737117 2691266
13994 2691266 2724932 2527472 2666768 2555253 2234113 2389300 2633337 2356985 2694780 2609372
13984 2609372 2585458 2449050 2538237 2818167 2875272 2862798 2928010 3390320 3983686 4967099
13974 4967099 6901808 10442404 16085815 26031769 31407237 21407762 14651907 10487724
13966 10487724 7877414 6010391 5564589 4530478 4092960 3463900 3541791 3189113 3134359
13957 3134359 3070303 2831065 2546080 2773519 2436741 2569731 2623178 2527545 2376341 2317385
13947 2317385 2200946 2296348 2283699 2267458 2310539 2087170 2078930 2214846 2020002 2380413
13937B380413m12498j03662K83110j16277k8832N19q651l31406N11660j85512
13927A988864l39797K85338j84290L74746m28111q3086o8053K19136O3910j14058
13917A714599K92015l77290K89526K33448n56140j44624L21072q2169j2296j39051
13907A539090K56075K833k92894n0286J34078K51149j38885Q206l05728J04404
13897A508042j234j13577K16109l54912N4118K57112K95507l82298J15946j13532
13887A481281kk67900J25898J24666r4603P8641K1836n8395k5838K56614l36746
13876A305452J86753M803k52580K77788r6394k37636Q0433L20059m63853J83807
13866A308632j51354K61744k12828K40506n46306O05138l4606k39160K08405q3074
$$ plain form
13937 2380413 1967915 1864253 2147363 2031086 2002254 2002773 1994122 1662716 2174376 1988864
13927 1988864 1649067 1934405 1750115 2124861 1696750 1613664 1545611 1764747 1828657 1714599
13917 1714599 2006614 1629324 1918850 2152298 1596158 1451534 1772606 1690437 1678141 1539090
13907 1539090 1795165 1797998 1505104 1454818 1588896 1840045 1701160 1709366 1403638 1508042
13897 1508042 1506808 1393231 1609340 1254428 1308546 1565658 1861165 1478867 1594813 1481281
13887 1481281 1481279 1213379 1339277 1463943 1369340 1447981 1469817 1411422 1385584 1642198 1305452
13876 1305452 1492205 1497008 1244428 1522216 1425822 1188186 1268619 1588678 1124825 1308632
13866 1308632 1157278 1419022 1206194 1446700 900394 1505532 1470926 1231766 1440171 1357097
13856A357097J20214k58390l70176L89580l5514k16693K53298p735N7018j04842
13846A183857n9166j89130P3802L78627l21387J19958p8421j00301j27325K40433
13836A120947L07335m58157j56705M6054K207J29342J6115K24255q0846P2208
13826A222755n3624j9696R2231r996k01745k37584L7761P974n9056L87033j32429
13815A033624p2220K30806l31592K48856m24843K38992j02372R8143j3983J03991
13805A009402P4983j28733o7455P9954J17724k53840K27842k69866R570J26596
13795I26177J06296p8353j32269p5591M32953k81620J05986k38231k3588J41912
13785H83672j61253l2818P4448m3139q4694J41079n9002J72265j39l03647N05185
$$ plain form
13856 1357097 1477311 1218921 848745 1238325 1202811 986118 1239416 1231681 1288699 1183857
13846 1183857 1124691 935561 1009363 1387990 1066603 1186561 1108140 1007839 880514 1120947
13836 1120947 1428282 970125 813420 859474 861681 991023 1007138 1231393 1150547 1222755
13826 1222755 1169131 1149435 1241666 1231670 1029925 792341 830102 838076 779020 1166053 1033624
13815 1033624 961404 1192210 860618 1109474 684631 923623 821251 919394 905411 1009402
13805 1009402 1084385 955652 888197 968151 1085875 832035 1059877 790011 799581 926177
13795 926177 1032473 954120 821851 746260 1179213 897593 1003579 765348 741760 883672
13785 883672 722419 689601 764049 720910 636216 777295 718293 890558 890419 586772 1091957
13774A091957k96949L27461k14313k46265L7998J37209j62544L75955j93494k02969
13764F54046k2774L21977l26143k30860L30434j21579N78105m30733L7504k85144
13754E04833N58490k59724J41364l04620O9720k7989J58115j21179j37502J33039
13744G14547j40114K59536l12611J26968n0787K89871o4238l55285L50848l4269
13734G84466l3999l57695M92860j11391k76850K31739R2800j98682R010j1169
13724F21089O2688r6572J94671l4209l35442J74156K52341k01636J11881L92611
13714A141578n47371A76444K91277K27882L0251m8633p6589m2337K25215l82615
13704D00895r3636L50449j01480L18438k66809j26453N5021J83247J1549j70354
$$ plain form
13774 1091957 795008 1122469 908156 661891 699889 837098 674554 1050509 857015 654046
13764 654046 631272 953249 627106 396246 726680 605101 1183206 752473 789977 504833
13754 504833 1063323 803599 944963 640343 710063 682074 840189 719010 581508 714547
13744 714547 574433 833969 521358 648326 597539 887410 823172 467887 818735 784466
13734 784466 750467 392772 885632 774241 497391 729130 821930 623248 632258 621089
13724 621089 683777 587205 781876 747667 412225 586381 838722 637086 748967 1141578
13714 1141578 594207 176444 467721 695603 725854 677221 600632 558295 783510 400895
13704 400895 307259 657708 556228 874666 607857 481404 536425 719672 731221 560867
13694E60867P4439B33197J62192K9750o0398L2907J11790j75340J55647K59365
13684G49110J6644C33050J68497K61555J08800B97554K07104K25856p392l04704
13674D18418P3811J5589o6790M1375J01898J00972l34019M17065K09759C14032
13663F29212j90562j8484j4968j6908n3851n8021M76371A68791L82369k45326
13653C05834K09333J81776k55032K43319k04964j25036J31387J73497B28810J69126
13643C97936P7025R7992n5216M0419j23085J08626o2981J1978J09423r0300j65433
13632C46384K35783k08205K08128j37558j14220J06237J81107j2447J16201B47884
13621E60980m6419B53879A16189L92341r077J93729B63930J29749L76201l16379
$$ plain form
13694 560867 635306 233197 395389 425139 364741 397648 509438 334098 489745 749110
13684 749110 765754 333050 501547 763102 871902 297554 504658 730514 723122 418418
13674 418418 492229 507818 441028 482403 584301 685273 351254 768319 978078 314032
13663 629212 438650 420166 405198 388290 334439 276418 752789 168791 551160 305834
13653 305834 515167 696943 441911 685230 480266 355230 486617 660114 228810 397936
13643 397936 474961 572953 517737 558156 435071 543697 480716 492694 602117 511817 346384
13632 346384 582167 373962 582090 444532 330312 436549 617656 605209 721410 247884
13621 560980 514561 253879 116189 508530 499453 693182 263930 393679 769880 453501
13611D53501l4657L051A50003O8462k8676j1501L59945J97106A519N72056m8511
13600E25064j69063J22137J32455k40032o4931L53856j94108M4350B40510N4894
13590B95404J24270r5978R503L17894C20438N25812k78702B27911L81135k71024
13580C38022R5003P3035k4414L7399Q7798A37206N57457A34929L07870j8819j69476
13569B54504L19229j04634j7611J37912B73727J85806A12731L19083j41968q1537
13559B08309J73092n9090J9729j01227J07722j26715K30274j44123L30333j11732
13549E26572l1949k06801M29552C04632b665E57708p3880k31304P3811J46115
13539D72450O7426k05155O555J97403j95972m3067e9565F11398j36687k03334
$$ plain form
13611 453501 418844 421895 150003 218465 189789 178288 538233 735339 1519 573575 525064
13600 525064 356001 478138 610593 370561 305630 659486 465378 509728 240510 295404
13590 295404 419674 323696 333199 651093 320438 846250 567548 227911 609046 338022
13580 338022 433025 506060 481646 519045 606843 137206 694663 134929 442799 423980 254504
13569 254504 573733 469099 451488 589400 273727 459533 112731 431814 289846 208309
13559 208309 381401 322311 342040 240813 348535 221820 452094 307971 638304 526572
13549 526572 494623 287822 717374 304632 -2665 557708 483828 252524 326335 472450
13539 472450 539876 334721 341276 538679 342707 299640 -59565 611398 474711 271377
13529B71377L75436A89792L48250b6152E00420c4454A38641J34139P7882j63003
13519A87659L3543k4132J11953j8394j39770J66850A35866J91317M38586l81105
13509C84664r9881E9800K38150P809J11766B07434J69932R0872A70983J68594
13499C39577C1147J90859q2468K87659R9207k37026j20995F5583K20913R5764
13489C82260o6506A43996J45321L819J52767j62310F8582c5031B27260j0605C5010
13477E49588A53404n8049K23988A57897C2854J69569M24327B53161J59928p5320
13467C37769K86096B0224K01235o4241M62607A23752p399J35805J3754A18356
13456H3089K27930A450K89890J93515H6602O6548C5392L5053J92549A26449J98497
$$ plain form
13529 271377 646813 189792 538042 -26152 500420 -34454 138641 272780 350662 187659
13519 187659 221202 197070 309023 290629 150859 317709 135866 327183 765769 384664
13509 384664 284783 59800 297950 305759 417525 207434 377366 468238 170983 339577
13499 339577 31147 222006 139538 427197 526404 289378 168383 65583 286496 382260
13489 382260 315754 143996 289317 293136 445903 283593 68582 -35031 227260 216655 35010
13477 549588 153404 95355 319343 157897 32854 202423 626750 253161 413089 337769
13467 337769 623865 20224 221459 157218 619825 123752 116353 252158 265912 118356
13456 83089 311019 1450 291340 484855 86602 153150 35392 70445 262994 126449 324946
13445C24946l9111P6632j38791K42989B13736K00733d811B68675J7285f5340A92401
13433D5831J96523O8361K4943o4326i8520D10563A29595K37097L1376j8838q1754
13422B97476K9947K25392J90010B06285K86774l9855j82565A03917J27718H9041
13411A20712K35879n3622o5032q2924h1041D8667J54050a21999C28662p3591A19624
13399A58777F5125K64285j42384N0679f163A13124K93562A74436J994J11728K72253
13388E60411k52862A02377K12037A10053D5668K11072a9168H1449K50745o3531
13378B68663C6424N8194J22498B8840M35097B00101B1890i3499A14438N5931c6931
13366A40335K21653c1310C41654j09880J93264A75007M3378J33125J60423k12728
$$ plain form
13445 324946 285835 362467 223676 466665 213736 414469 -4811 268675 285960 -65340 192401
13433 45831 242354 310715 335658 271332 -98520 410563 129595 366692 398068 379230 297476
13422 297476 327423 552815 742825 206285 493059 453204 270639 103917 231635 89041
13411 120712 356591 302969 237937 155013 -81041 48667 202717 -121999 328662 255071 119624
13399 158777 65125 329410 187026 237705 -6163 113124 406686 174436 176430 288158 560411
13388 560411 307549 102377 314414 110053 45668 256740 -19168 81449 332194 268663
13378 268663 36424 94618 217116 28840 463937 200101 21890 -93499 114438 170369 -36931
13366 140335 361988 -31310 341654 231774 425038 175007 218385 351510 511933 299205
13356B99205A43721K55713P5994o4633d6027E53278B57283A4768K63064O6175
13346C44007j10044K42973a60723A53654J85458A15635J65190J80359j59457a27274
13335C22886a69293B79488j623j19332p1698N04983k81291J7251C9860j5657J85433
13324B09636J3194K97156k3249j93590R3613j06696M114l5287L084L2368q7680
13313B06663h0131D645b8072A80647k3744C3684K21741o8855K88422a8133A60578
13301F2093J63927B7586J29310M22746G3496K45974j53006P202L16056E1995K92062
13290C44057P5959c02361B30369F7064J35413P7535F4586j0881L5021a57324B56315
13278D85333j96054l6958k1627a54973I9946L57544B15761Q1197E2893L15463
$$ plain form
13356 299205 143721 399434 475428 410795 -46027 553278 257283 14768 277832 344007
13346 344007 233963 476936 -160723 153654 339112 115635 280825 461184 301727 -127274
13335 322886 -169293 279488 277865 158533 86835 591818 310527 327778 39860 24203 209636
13324 209636 222830 519986 496737 303147 396760 290064 294178 258891 261975 294343 206663
13313 206663 -80131 4645 -28072 180647 156903 33684 255425 186570 474992 -18133 160578
13301 62093 226020 27586 156896 579642 73496 319470 166464 173666 489722 51995 344057
13290 344057 420016 -302361 230369 67064 202477 280012 64586 53705 88726 -157324 256315
13278 485333 289279 252321 230694 -154973 99946 457490 215761 296958 52893 368356
13268C68356D857a33351N2804D33253H4465J24834k0191Q4415k7657J7067j27851
13257A35082J2562b7173B27544j85C1261M11576B13350a72457G3039A696J90867
13246A92563K2802P5880a04378A79637J81484b09140B81897l991D4469K6374A2575
13234E2969K04890B9491H025P3274N7535D2094J45835q7279J28152G5568J8764
13223I4332h1439A37173L19845a94576A54488L01931A45844e2343A51566K5087
13213A76653C6720a41138B76388J25091j90716F5964e0690A67160A812a3467F4245
13201b5956J0947k36118A07380a20406G2818b71116B90083A39950J84572a4186
13190A96962l378e0610B03416C165J48926D0644a33233o0797C7720g5741B65521
$$ plain form
13268 368356 4857 -133351 -80547 433253 84465 209299 189108 273523 245866 262933 135082
13257 135082 147644 -27173 227544 227359 31261 442837 213350 -172457 73039 1696 192563
13246 192563 215365 291245 -104378 179637 361121 -209140 281897 277906 44469 70843 12575
13234 52969 257859 29491 8025 81299 138834 42094 187929 100650 228802 75568 94332
13223 94332 -81439 137173 457018 -194576 154488 456419 145844 -52343 151566 176653
13213 176653 36720 -141138 276388 401479 210763 65964 -50690 167160 1812 -13467 64245
13201 -25956 -15009 -251127 107380 -120406 72818 -271116 290083 139950 324522 -14186
13190 196962 193584 -50610 203416 3165 152091 40644 -133233 -194030 37720 -75741 265521
13178C2277L96281f1488B36996Q4041A13940k0564N2136a45743A15784O4742A2125
13166a47770l7582P6917J5230F2781J51415e6024K292o5428B60291B0043M4672
13155F4715g5240A57496a47213E429J1485N16443j04633a00773B50354f1881C0449
13143D57686K3531A48624l8906J9171b6754A34009J43222b25636a5680A80563
13132A32722J22514i5217H2076k1842J00578M70404I7639K49031c3758A34075
13121A57450a39521B86810A31104k4661J51461I879a9157D4352J74839a55561
13110A86493p9657m1769L3007j8284a0563j57435B6289a898B22301o8465g1461
13098B60884j7895A20440b0515F5246a1740A74453P6739p8443m8684M5451K34072
$$ plain form
13178 32277 428558 -61488 236996 321037 113940 93376 145512 -145743 115784 180526 12125
13166 -147770 -185352 -108435 -93205 62781 214196 -56024 -53732 -119160 260291 20043 64715
13155 64715 -75240 157496 -147213 5429 16914 533357 428724 -100773 250354 -61881 30449
13143 457686 481217 148624 109718 128889 -26754 134009 277231 -225636 -15680 180563
13132 132722 255236 -95217 82076 60234 160812 631216 97639 346670 -33758 134075
13121 157450 -139521 286810 131104 106443 257904 9879 -19157 44352 219191 -155561
13110 186493 106836 65067 98074 79790 -10563 -167998 26289 -1898 222301 153836 -71461
13098 260884 242989 120440 -20515 65246 -11740 174453 251192 172749 124065 169516 403588
13087D03588d2640p0934C1331a36074b1223p0411C54910g7171j390F3932J29846
13076A93778O1935a70137C27860J17632j42222G1364R4823C210Q0503r47K17206
13065B99972e8852H9886C4047M64436A07198J7589n1290J29664J9230H8700k4994
13054F3706L64449F0533h912D6308K4649b15755I6110a00440H8782a00306M8860
13043e1446C06443p0575n4861F5640b577F9151a7984A68511k2137o6936K82446
13032C61884m1339d6567H0039b57298h3102B61338I5056a78914G4371M9676L04324
13021D28371j76067L5772A07638a61277I6922D3341J21151K93333B02681J00312
13011C02993A8146L04138j51122J08074g1627K0565F7020M5691P5874L1168M07470
$$ plain form
13087 403588 -42640 -113574 31331 -136074 -21223 -91634 354910 -77171 -78561 63932 193778
13076 193778 255713 -170137 327860 445492 303270 71364 166187 3210 83713 82766 299972
13065 299972 -58852 89886 34047 498483 107198 124787 73497 203161 222391 88700 63706
13054 63706 428155 60533 -8912 46308 70957 -215755 96110 -100440 88782 -100306 -51446
13043 -51446 306443 235868 181007 65640 -2577 69151 -17984 168511 146374 79438 361884
13032 361884 320545 -46567 80039 -257298 -83102 261338 95056 -178914 74371 124047 428371
13021 428371 252304 288076 107638 -161277 96922 43341 164492 457825 202681 302993
13011 302993 18146 322284 171162 279236 -71627 -51062 67020 112711 188585 219753 627223
13000F27223f8592H1894K76381A55500n8698K3096K6396b50572A23446c3021q1649
12989a14670G7650a9711M740B54710i6846A10118J31352G6846g3671B1665J59131
12978A80796a23794m0211p062J787a961B00146b90821B19080a16527A16106L5211
12967A51317N9515i2374m4826A13674Q9912E8429J1975K31683I5234O1384A0216
12955a35468k543D3498A1833K03279p7393J1927M84C1020Q1511A2100a34936b4287
12942B42047d1985k1168C68731a82154A18480L54381e4352l52382a01805E9048
12931C07266c0918p6292G9416a1492k60056B6482K92618i5824A75006G5431K4480
12920I9911C1130d9408k08330n9124b4027k88240A05015E946c8018B80847A38126
$$ plain form
13000 627223 -68592 81894 358275 155500 96802 119898 146294 -250572 123446 -33021 -114670
12989 -114670 77650 -19711 -14971 254710 -96846 110118 241470 76846 -73671 21665 180796
12978 180796 -123794 -164005 -171067 -169280 -1961 200146 -290821 219080 -116527 116106 151317
12967 151317 210832 -92374 -137200 113674 203586 58429 70404 302087 95234 156618 10216
12955 -135468 -138011 43498 11833 215112 137719 149646 150130 31020 112531 12100 -134936 -24287
12942 242047 -41985 -63153 368731 -182154 118480 472861 -54352 -406734 -101805 59048
12931 307266 -30918 -107210 79416 -11492 -271548 26482 319100 -95824 175006 75431 99911
12920 99911 31130 -49408 -257738 -316862 -24027 -312267 105015 5946 -38018 280847 138126
12908B00068c3086A84509e157n8307A8576A410b07323A78264a59208A60302P0430
12897B30732a02824d2086H7213l2102L6763b83370J26815O7580A11203a22480
12886E5790B0198J07505a49372N4954A44150C5845i1201C76634F6261R5625Q9353
12875B51239j1227d2910C6686K2111P8752d0976n5448A49362E2361b0665B35419
12863B26807c4456j7268A73339G1711a69409A18089k6002a3042j27317A78298
12852A60288J77878N1237A71927b30932A27454F3204c3218k37260A54500m3901
12842A10599D5733g9857F8640Q0782D2067a23067C13950f23A28152b56276A23826
12830d2962B15596E9455A0397J75588p2790J7226k1555d99567K22384c4537A39557
$$ plain form
12908 200068 -33086 184509 -5157 -63464 18576 1410 -207323 178264 -159208 160302 230732
12897 230732 -102824 -42086 87213 55111 91874 -283370 -156555 -88975 111203 -122480
12886 55790 20198 127703 -149372 -94418 144150 35845 -91201 376634 66261 161886 251239
12875 251239 240012 -42910 36686 58797 137549 -40976 -96424 149362 52361 -20665 235419
12863 226807 -34456 -51724 173339 71711 -169409 118089 92087 -13042 -140359 178298
12852 160288 338166 389403 171927 -230932 127454 63204 -33218 -270478 154500 110599
12842 110599 45733 -79857 68640 149422 42067 -123067 313950 -623 128152 -256276 123826
12830 -42962 215596 59455 10397 185985 113195 130421 108866 -499567 -277183 -34537 139557
12818B724a15019k00227H6277b03223I5435a7507k3383A74074d578F5677L14854
12807C80531a65371K0145j6229A58776a2401A0728K88751a45739e6244A1469J10576
12796A22045a43708A51644J33045m7311a23676j7053j89135A43366E6360P9148
12786A35508b69350a18326j79444I6166b83971L1794D63314A54103c363C7941
12775i5997B95079a34895b5137r0688B83621A1278N2063a19309E7426a29498d7974
12763F5002K2465J78775b64029C8949a17072a6628A65986Q6707i5487B8685g2052
12751i8860C11595A49801k4310B6480a78400e7247B22665D9682N2440J8604m8450
12740G2276J45986d30673A23835K00053a79777A21955E6545a71691C7260K06642
$$ plain form
12818 2724 -115019 -315246 86277 -203223 95435 -17507 -40890 174074 -4578 65677 380531
12807 380531 -165371 -145226 -161455 158776 -12401 10728 299479 -145739 -56244 11469 122045
12796 122045 -143708 151644 284689 237378 -123676 -140729 -329864 143366 56360 135508
12786 135508 -269350 -118326 -297770 96166 -283971 -252177 463314 154103 -3363 37941
12775 -95997 295079 -134895 -25137 -115825 283621 11278 63341 -119309 57426 -129498 -47974
12763 65002 87467 266242 -264029 38949 -117072 -16628 165986 252693 -95487 28685 -72052
12751 -98860 311595 149801 125491 26480 -178400 -57247 222665 49682 102122 120726 72276
12740 72276 218262 -430673 123835 323888 -179777 121955 56545 -171691 37260 243902
12730B43902a36540j89985E35J742h5458A30848a51209P1374B77212f3187G5282
12718A66595I576M0635J94504K0101p9362a602B00226Q5711C2846A1816M6518
12707E8334b16261C8729g452j16723C38614E589L53397j32437b70737A80944a71915
12695b19296d6251B42880Q6196A01861J6161d38415F8284J89491E0602c5467B33612
12683c6907D20782h6711a2021m4823l2162A40392e1776A93815D3717J7602a24532
12671H9325b62409E0614a21817Q477N4893A81964L17072a14966A00592J13244
12661B13836e9432A65417a1152B16227a3199C76169n4521j43975k5455A1939c01648
12649C73211A45492J7173p4147m3370J78517D6280j4031N535J09070b1629A22594
$$ plain form
12730 243902 -136540 -326525 535 2277 -85458 130848 -151209 -79835 277212 -63187 75282
12718 166595 9576 50211 244715 264816 185454 -1602 200226 285937 32846 11816 58334
12707 58334 -216261 38729 -7452 -124175 338614 5589 358986 226549 -270737 180944 -171915
12695 -219296 -46251 242880 329076 101861 118022 -438415 68284 257775 50602 -35467 233612
12683 -36907 420782 -86711 -12021 -56844 -89006 140392 -51776 193815 43717 61319 -124532
12671 89325 -262409 50614 -121817 -113340 -58447 181964 499036 -114966 100592 213836
12661 213836 -59432 165417 -11152 216227 -13199 376169 321648 177673 152218 11939 -301648
12649 373211 145492 162665 88518 45148 223665 46280 32249 37784 146854 -21629 122594
12637A23694K69661h2546I9828c8391k09615b1419j25535B81224a40363a3998
12626H0914J50061q3030E8988K47176i847r0367G6704L28999j09924b9118A06017
12614C87611f434A70992J53652r5793o9140o0424a82645d6652A26310J96952j29424
12603A93838H4210d186E6961e2773A90309m973K14927a04502I1093O932b41109
12591C55778j74142i6855A20856J32794B8550J18906K90507a82351M7328K6565
12581a08458B38283a37675A09739g030B54969p481J0253a2813A13249a4003K910
12570a1093A75567J06032d7800D9261L55493b65460a5300A29744b33429J05468
12560a27961A47118J51754e6189A04686h1348M506A30437m4137Q7117P0749H0953
$$ plain form
12637 123694 393355 -82546 99828 -38391 -248006 -21419 -146954 281224 -140363 -13998
12626 80914 230975 147945 58988 306164 -9847 -100214 76704 405703 295779 -29118 106017
12614 387611 -6434 170992 324644 228851 159711 99287 -182645 -46652 126310 323262 193838
12603 193838 84210 -4186 56961 -52773 190309 185336 400263 -104502 91093 98025 -241109
12591 355778 181636 -96855 120856 253650 28550 147456 437963 -182351 -135023 -108458
12581 -108458 238283 -137675 109739 -7030 254969 247488 257741 -12813 113249 -14003 -11093
12570 -11093 175567 281599 -47800 49261 404754 -265460 -15300 129744 -233429 -127961
12560 -127961 147118 298872 -56189 104686 -81348 -76842 130437 86300 173417 244166 80953
12548a58015f8789j7989p9591B16582c335E7885a3953j71439H9867B1140a05924
12536f5196j53195H5165J5331C0454Q221J5208i9404q394j4917H1703b6736l1791
12524e8527c022j51969A27265c58529B7176M8537N6635L40295j43175c1951A47136
12512c6571D6032M3762l3255B6762a43297A42396a83960h8665c8675F89J74366
12501A75055l6875l8907a49861B6919J89310a77880A68096i8927A36817l4000
12491A02817q630b16921P9401o8078E9891a19371j17357O9781B55946C756K79735
12480B83491a8476A24105J78231b5652F3632i0967B0077J1536b20233B0460b6740
12468A62713d7580G5889b7623j33856j19270D6820K17121c52699E0819j9523b6141
$$ plain form
12548 -158015 -68789 -86778 -166369 216582 -3335 57885 -13953 -185392 89867 21140 -105924
12536 -65196 -218391 85165 100496 30454 38675 53883 -99404 -107798 -122715 81703 -26736 -58527
12524 -58527 -3022 -154991 127265 -358529 27176 75713 132348 472643 329468 -31951 147136
12512 -36571 46032 89794 56539 26762 -143297 142396 -183960 -88665 -38675 689 175055
12501 175055 138180 99273 -149861 26919 216229 -177880 168096 -98927 136817 102817
12491 102817 94187 -216921 -137520 -205598 59891 -119371 -236728 -166947 255946 3756 283491
12480 283491 -18476 124105 302336 -25652 63632 -90967 20077 31613 -220233 20460 -26740
12468 162713 -47580 75889 -27623 -161479 -280749 46820 263941 -352699 50819 31296 -26141
12456B27239j11007a48830C40272d45369a201j43471A78061F7729a91660B0829
12445i0805j17263K9354C891K22016b20564B50911a99363h2892j15637P0224C27190
12433e9239G9812c0416r429G1992C503i786j52980g4197B48200a55443O0752m7272
12421a41963l6474e6771D1803b16122e8577B63276e192G995b91147B68306D361
12409c9037k66627H6413a82443B44704B6905K320b6875j06896A19587b03483A02042
12397i5243D4969G38J77985P946f6858j1047A76328i8075B5479a7833g79m7620
12385d8399n2355d2447J590J7052E0827R9939a70544B31019h2869E5940K49608
12374C05548c42935A29141j6026b14774K2701r5190B14078M0015a88042B44850
$$ plain form
12456 227239 116232 -148830 340272 -445369 -1201 -144672 178061 67729 -191660 20829
12445 -90805 -208068 -178714 3891 225907 -220564 250911 -199363 -82892 -198529 -128305 327190
12433 -59239 79812 -30416 -39845 71992 3503 -9786 -162766 -74197 248200 -155443 -94691 -141963
12421 -141963 -178437 -56771 41803 -216122 -58577 263276 -5192 7995 -291147 268306 4361
12409 -39037 -305664 86413 -182443 244704 26905 29225 -26875 -133771 119587 -203483 102042
12397 -95243 44969 738 178723 186669 -66858 -77905 176328 -98075 25479 -17833 -779 -48399
12385 -48399 -100754 -42447 -40857 -23805 50827 150766 -170544 231019 -82869 55940 305548
12374 305548 -342935 129141 113115 -214774 -192073 -287263 214078 254093 -188042 244850
12363b33188A40106K9811L2643e3336j96381B9248a79657f015k6615F5424f1192
12351A23902L26995A93686a20560B0723L2195M19998a01756A7153a98586D4375
12340B8170d90779G0168b21239M7069I6357K43825i1502G0665B1362c78485f6013
12328A9019a54600A18535b6322l5256B36052p295k0232a51345A40095b21394e3063
12316a76295B30872D4366K03104b8017k7680G4783a66973A06452d9474G8896a26466
12304C02919a62969A25242g2826K1117A5844K95485e7059j25462a4200A51877
12293C41205D3970b4841n6442A13765M7130l6267k7827J84270b9364q1279F5539
12281a77686N9737I4996K293J33803a16129I7915b009F6668N5467b05075B54683
$$ plain form
12363 -233188 140106 169917 202560 -53336 -249717 29248 -179657 -6015 -32630 65424 -61192
12351 123902 450897 193686 -120560 20723 52918 472916 -101756 17153 -198586 44375
12340 28170 -490779 70168 -221239 -174170 96357 340182 -91502 70665 21362 -378485 -66013
12328 19019 -154600 118535 -26322 -61578 236052 228757 208525 -151345 140095 -221394 -53063
12316 -176295 230872 44366 247470 -28017 -55697 74783 -166973 106452 -49474 78896 -126466
12304 302919 -162969 125242 -72826 -51709 15844 311329 -57059 -182521 -14200 151877
12293 341205 43970 -24841 -81283 113765 160895 124628 96801 281071 -29364 -110643 65539
12281 -177686 -117949 94996 97289 231092 -116129 97915 -2009 66668 122135 -205075 254683
12269B45331A944e146j49586F8993a25745N8009m7238A17922L6278K227b9771
12257F7364J45981c32568e5714J3090F1269R2115c6092q2536H6341O1638C8192
12245B46274A22917n2466L8277J00660J56714M2663A78930b78985A03851C4137
12234c16990H0941K67259a2887C35243I8357R657J62736c17339A70373A3480n656
12223G824O3130K7968m617J15819c024A36392n0534j7353k552Q2077J75384i719
12210B99615H0462l6616h6287C02495F1686Q5889g663D55943B1326L35926A45264
12198A30466K99055b65348B04154K02525j54035J42300A12230J63728D4962c1711
12187a91216G5056J97759j30308O68J70229a37426B62397M2482H4610J58747a3265
$$ plain form
12269 245331 1944 -5146 -154732 68993 -125745 -67736 -114974 117922 154200 156427 -29771
12257 67364 213345 -332568 -55714 -42624 61269 153384 -36092 -118628 86341 147979 38192
12245 246274 122917 70451 108728 209388 366102 408765 178930 -278985 103851 34137
12234 -316990 80941 348200 -12887 335243 98357 108014 270750 -317339 170373 13480 7824
12223 7824 70954 98922 94305 210124 -3024 136392 85858 68505 65953 148030 323414 -9719
12210 299615 80462 43846 -86287 302495 61686 147575 -7663 455943 21326 357252 145264
12198 130466 429521 -265348 204154 406679 252644 394944 112230 275958 44962 -31711
12187 -191216 75056 272815 142507 143175 313404 -137426 262397 304879 84610 243357 -13265
12175B99698j14976F6398O3334i3717C3686a11143L0553B08651k2202B0277f4944
12163A022a86819G3464M1J49203H7715D2653O591K39558a65745M3496I4543a64074
12150f4707j04298g8068B2333j0768K53608c9397G7944L3663D7965N8999b47l21653
12138c21900A55725L9475K3733J20452a88811A22994g6600c7284H2355O2702C1850
12126D9379d1441B7491b49003H9889D370L68917a66609d971B31924b07393A50038
12114A88091P0041j3363C4720K70943H8328e6468I9329K35367b26930M6725N6845
12103a23360B93672i9930B1113J33863a8978q9309A31395B4582B253a00500M7245
12092e3255F5763J7253K55830F307P7560L88468a11926j7336J4913a3830k69282
$$ plain form
12175 299698 184722 66398 129732 -93717 33686 -111143 -80590 208651 186449 20277 -64944
12163 1022 -186819 73464 73505 222708 87715 42653 49244 288802 -165745 -122249 94543 -164074
12150 -64707 -169005 -78068 22333 11565 265173 -39397 77944 111607 47965 106964 -247 -321900
12138 -321900 155725 195200 218933 339385 -188811 122994 -76600 -37284 82355 145057 31850
12126 49379 -41441 27491 -249003 89889 4370 373287 -166609 -4971 231924 -207393 150038
12114 188091 258132 244769 34720 305663 88328 -56468 99329 334696 -226930 -180205 -123360
12103 -123360 293672 -99930 21113 154976 -18978 -108287 131395 24582 2253 -100500 -53255
12092 -53255 65763 83016 338846 6307 83867 472335 -111926 -129262 -114349 -13830 -283112
12081b83112A78301a7250Q043l60686A57549G2923K6851i4050B7993h4825C444
12069A12719N0057b3798k74586A7345L51458j13984g1223A89380c6870B81810
12058A380317m12889j45542A38688o1700A8598J13111b49861d3537C0160g2403
12047b60704B04989d4637g526B86109J0933A03306j8108e6109e469l37482J55604
12036a87347O4484n1170E2762b15590j0377A6244c24119B31219f9040A11980d6894
12024B54150B3119a63104A28250e1859A44989b5647o750k03775C00944b48271
12013A39838K98130A99312p9189l8717C9607P9751a50921b2832k22574B46070
12002g8649j75459b6572A25701d27199C584c25883Q8629A16527n7547K67476e642
$$ plain form
12081 -283112 178301 -17250 -9207 -369893 157549 72923 99774 -94050 27993 -84825 3444
12069 112719 162776 -23798 -298384 17345 368803 254819 -71223 189380 -36870 281810
12058 1380317 967428 821886 138688 76988 18598 131709 -249861 -43537 30160 -72403
12047 -260704 204989 -44637 -7526 286109 297042 103306 85198 -56109 -5469 -342951 -187347
12036 -187347 -122863 -174033 52762 -215590 -225967 16244 -324119 231219 -69040 111980 -46894
12024 254150 23119 -163104 128250 -51859 144989 -25647 -32397 -236172 300944 -248271
12013 139838 437968 199312 120123 81406 39607 119358 -150921 -22832 -245406 246070
12002 -78649 -254108 -26572 125701 -427199 3584 -325883 -237254 116527 58980 326456 -5642
11990a53025j55531B9299f806C37512b66721B24684a49976A83752a92612B59808
11979B42112G9640g8390B4198i7476C11498J6572a02796K1352j83599f0446m47699
11968e08145b33709b5136n0138A07354b557A17559R5607A9985a92899G7687g6108
11956a20601l89344b53879l5207F9541k5564K4979e5802C792d40946b01682Q6645
11945a15037j0657A169f6497B3688K02751q8321a563l4570I0326e7319F6630o393
11933F0237b77047h0788j5820A13293k5383K80322b98723f4975A39871b57321
11922A3824J03789B7639J75107A0476i9484A43732A6033J12487a9990l2809C03455
11910B2132a16076B28429n6969J25567g0170r5794r0140P3572d328b49A05340
$$ plain form
11990 -153025 -308556 29299 -6806 337512 -266721 224684 -149976 183752 -192612 259808
11979 242112 79640 -78390 24198 -97476 311498 328070 -102796 -81444 -265043 -60446 -508145
11968 -508145 -233709 -25136 -75274 107354 -2557 117559 213166 19985 -192899 77687 -76108
11956 -120601 -509945 -253879 -289086 69541 43977 68956 -55802 3792 -440946 -201682 -115037
11945 -115037 -125694 1169 -66497 23688 226439 138118 -1563 -36133 90326 -57319 66630 60237
11933 60237 -277047 -80788 -96608 113293 87910 368232 -298723 -64975 139871 -257321
11922 13824 117613 27639 202746 10476 -99484 143732 16033 128520 -19990 -52799 303455
11910 22132 -116076 228429 171460 297027 -70170 -165964 -256104 -182532 -4328 -249 105340
11898b8581p2638M4736O333E4672a1276l22692c9371k64615C2519b438q0168E3950
11885h9685B13391E9874a10891D3432L8786c19678J55011L0886L1263k35846R4322
11874b44042B4629b7032A82218b52127C8945h0721D3813M0865b62521K7262E61
11862C77664e83j45445N7848A29100a2721E7884d9439j92691l1948h4864l05293
11851c90157E2211f351j99502C46098j69236e5971l09035B7581a32312M8934j51888
11840b35266A6285f674A46684J52901q6068J6639E4580d3292A71727O338n4314
11829A23751P1722a08734I7096a54569r5831A73488l4419l3212l9887J4184d5364
11817a82065f8353j87111e552D1941J51518K3395b68754a12443j65803D8055a62626
$$ plain form
11898 -28581 -101219 -56483 -50150 54672 -11276 -333968 -39371 -303986 32519 -2438 -82606 53950
11885 -89685 213391 59874 -110891 43432 82218 -319678 -164667 -133781 -102518 -338364 -244042
11874 -244042 24629 -27032 182218 -252127 38945 -80721 43813 84678 -262521 -235259 561
11862 377664 -583 -146028 -88180 129100 -12721 57884 -49439 -242130 -274078 -84864 -390157
11851 -390157 52211 -6351 -205853 346098 176862 -55971 -365006 27581 -132312 -83378 -235266
11840 -235266 16285 -6674 146684 299585 213517 230156 54580 -43292 171727 178065 123751
11829 123751 195473 -108734 97096 -154569 -250400 173488 139069 105857 65970 80154 -45364
11817 -182065 -68353 -255464 -5552 41941 193459 216854 -268754 -112443 -278246 48055 -162626
11805A44223E3505J77628r2825F4346g1258j0765c0434A89128H0175a47784j1809
11794a59593J3009A91826F9191b38823L5557j06378D5773N1652L223K1844K13686
11783C36178H1145b48889P5264A52566E3601n569e7491j65019j39633a26673A83605
11771c90272a9368p2254B5450e4489G7165b8623k34536j854H5770J70587c7446
11759D6272g6839C08006f9055A44161N3287b0338B29364a1075G8530M3110b08868
11747d00830e244A42026J67104a15800m6643A37016D761K6088K9690f396I5292
11735h889B45415D7309P4345l572n1023h9072A45744a02653j38225B42674b9891
11723H1056h2100B11488b10344H9316b18336B22129j07757J4904a39514F4396
$$ plain form
11805 144223 53505 231133 138308 64346 -71258 -82023 -30434 189128 80175 -147784 -159593
11794 -159593 -146584 191826 69191 -238823 -203266 -309644 45773 97425 100648 122492 336178
11783 336178 81145 -248889 -173625 152566 53601 48032 -57491 -222510 -362143 -126673 183605
11771 -390272 -19368 -91622 25450 -54489 77165 -28623 -263159 -265013 85770 256357 -37446
11759 46272 -76839 308006 -69055 144161 197448 -20338 229364 -11075 78530 121640 -208868
11747 -400830 -5244 142026 309130 -115800 -162443 137016 4761 30849 60539 -6396 95292
11735 -8889 245415 47309 121654 118082 67059 -89072 145744 -102653 -240878 242674 -29891
11723 81056 -82100 211488 -210344 89316 -218336 222129 114372 129276 -139514 64396
11712i1768j29347l6591h806B21393B6744A1496K02604B2042P3626a18031b3901
11700A35268D475a72086K7206B66040K0110f4712E8853O6043m3665b5632B10301
11688B22408q187g7280k32796c9558k07449J08560C0137a08025A83777K6405a23651
11676I808a49834N160D63908i1423d0463A89347g3283A9697K8317K19288N8295
11665C25597D2587K71400B9565N2421b54738f2154J2276A14830K28629b9769l72372
11654d02141h0226q0137F6708k627L45623i8113A48175f4336r8570C4193a25975
11642g4489B66656g1028b2713B73333a46574r7720j06491a28111B3417g1197A81281
11630C53606d1331B67927h2357l7533B06608k6778P7514n8284d0053k8079F3649
$$ plain form
11712 -91768 -221115 -257706 -8806 221393 26744 11496 214100 22042 95668 -118031 -23901
11700 135268 4475 -172086 -144880 266040 286150 -64712 58853 124896 81231 -25632 210301
11688 222408 214221 -77280 -310076 -39558 -247007 -138447 30137 -108025 183777 210182 -123651
11676 9808 -149834 -144674 463908 -91423 -40463 189347 -73283 19697 48014 267302 325597
11665 325597 42587 313987 29565 81986 -254738 -62154 -49878 114830 343459 -29769 -402141
11654 -402141 -80226 -160363 66708 64081 409704 -98113 148175 -64336 -162906 34193 -125975
11642 -74489 266656 -71028 -22713 273333 -146574 -244294 -350785 -128111 23417 -71197 181281
11630 353606 -41331 267927 -82357 -119890 206608 179830 257344 199060 -40053 -68132 63649
11618A59934D6614j6679h0259F1370a79293L6516I2630M70145G428M982N6815
11607F9225b95465a20612D00264c47300I6568a49232d4978j23052A26316d02801
11596A17350g319l9017l7792H9369p859a10369E51653A09706j1787g6936C53892
11584b82394f7012l1451A53535J34081c96076A7884d6761j21609B4053J53482
11574A77535J01863I846K32234A10989N498d7776e150B66275I7246f2110n5811
11563a17921O460N3845B21042a27533A57585B9605J67171C0440K2211a63270A41586
11551g7545q2130O4762B61695B5940J57273a02968B15872I7814a80294A11289
11540H6471g4226e824H1341c9847I1219a56201g7237F6959b54896g5903c0962
$$ plain form
11618 159934 46614 29935 -80259 61370 -179293 -142777 92630 562775 7428 12410 69225
11607 69225 -295465 -120612 400264 -347300 96568 -149232 -44978 -168030 126316 -402801
11596 117350 -7319 -46336 -84128 89369 81510 -110369 551653 109706 97919 -76936 353892
11584 -282394 -67012 -98463 153535 287616 -396076 17884 -46761 -168370 24053 177535
11574 177535 279398 9846 242080 110989 116487 -47776 -5150 266275 97246 -62110 -117921
11563 -117921 -111461 -57616 221042 -127533 157585 29605 196776 30440 52651 -163270 141586
11551 -77545 -159675 -94913 261695 25940 183213 -102968 215872 97814 -180294 111289
11540 86471 -74226 -5824 81341 -39847 91219 -156201 -77237 66959 -254896 -75903 -30962
11528e1483A66430o0957a68079B28013I4472c9846O147I3755J52178F7410g102
11516A48048K69217h6711C02651r9102I7402f0397a7032C34599f7717b2219p6556
11505i8775E6611J25105A1680Q6008D0854d2717j17893A64821K35882j14699j33123
11494A52881J13895f5738A7679J01883C5837L6767h9778c5543A2515O12384b44312
11482a31541B43953a91105n6018B58490J94735A80851b15674A1298c5993B46199
11471E5950N6427J36640K9708A19698l6605N7467a92570H0425l3345L9474J74299
11460B60853d8447b1801A41678a10728C24187j09665P6428a41518B16651J4708
11450B31359b33832A01262C751K82960k0667b98014A55037D9364a2072C4665h0190
$$ plain form
11528 -51483 166430 105473 -168079 228013 94472 -39846 -33699 93755 245933 67410 -7102
11516 148048 417265 -86711 302651 203549 97402 -60397 -17032 334599 -67717 -22219 -98775
11505 -98775 56611 181716 11680 97688 40854 -42717 -160610 164821 400703 286004 152881
11494 152881 266776 -65738 17679 119562 35837 72604 -89778 -35543 12515 624899 -244312
11482 -131541 243953 -191105 -247123 258490 453225 180851 -215674 11298 -35993 246199
11471 55950 112377 249017 278725 119698 83093 140560 -192570 80425 47080 86554 260853
11460 260853 -48447 -21801 141678 -110728 324187 214522 290950 -141518 216651 231359
11450 231359 -233832 101262 3751 286711 266044 -298014 155037 49364 -12072 34665 -80190
11438C7207a47620B45050n3327I4484k3545a92879a9151r6426C1715h8123J7715
11427g0408A13440j8170M1010i8576d8943k3029n6412I2713M5046b31528a03622
11415B23333a88495d1498i203l23365A41527L1284a25858A66857E66a24279b3693
11403B36464i8416b343l4250a4686j19145O4425A29246J53170d5734B0219R9303
11392A19522J17638A712Q3660c44352A45981J5235M294m6815l2001i7327B17706
11380B7477L4408B5788o163J82529o9564L8900E4507c1147l5405A32390a48152
11368a02978K321k46569A51344L21544a03758c6692D084A899K39431J91269e7866
11356c5525p9739B79255A23722A0313a91159a893m6777F6295e7378F2821b45952
$$ plain form
11438 37207 -147620 245050 191723 94484 70939 -192879 -19151 -115577 31715 -88123 -70408
11427 -70408 113440 95270 136280 -98576 -48943 -71972 -128384 92713 137759 -231528 -103622
11415 223333 -188495 -41498 -9203 -332568 141527 172811 -125858 166857 566 -124279 -23693
11403 236464 -98416 -2343 -36593 -14686 -133831 -69406 129246 282416 -45734 20219 119522
11392 119522 237160 1712 85372 -344352 145981 161216 165510 118695 86694 -97327 217706
11380 27477 61885 25788 19625 202154 132590 171490 54507 -31147 -66552 132390 -148152
11368 -102978 -100657 -347226 151344 472888 -103758 -36692 4084 1899 241330 432599 -57866
11356 -35525 -115264 279255 123722 10313 -191159 -1893 -48670 66295 -57378 62821 -245952
11344C22814A26665b4963j54822B38909C2111b38279R5803A16777K47263G3187
11333A39982f2704A07498g2410B04928J06477a19362k01743C3095A3066c9433
11322c21834M2133C84277j04505a8187A5890f0519a1325A58349N4229E0170b2344
11310A89074N1836b41159D4254b1727j71473E0319i5036D0546i3051B83285B0871
11298A93799g6318j35532B09445a73567k24176e5636a8513k8453B2125J66060
11288A88185b9904J0368j5624a2172k07607K3327A28913o0981K1749c11264A10453
11276G7448a85639H7088J53323a32762j7909H7091b1787B23512H9700a05494B79172
11264b5492l9394B25945I6043b33532J07119N9355A52020g0415L2048k07520j22470
$$ plain form
11344 322814 126665 -24963 -179785 238909 32111 -238279 -142476 116777 364040 73187
11333 139982 -62704 107498 -72410 204928 311405 -119362 -321105 33095 13066 -39433
11322 -321834 -279701 384277 279772 -18187 15890 -60519 -11325 158349 212578 50170 -22344
11310 189074 240910 -241159 44254 -21727 -193200 50319 -95036 40546 -93051 283285 20871
11298 193799 -76318 -211850 209445 -173567 -397743 -55636 -18513 -46966 22125 188185
11288 188185 -29904 -19536 -35160 -12172 -219779 -196452 128913 67932 89681 -311264 110453
11276 77448 -185639 87088 240411 -132762 -150671 87091 -21787 223512 89700 -105494 279172
11264 -25492 -64886 225945 96043 -233532 -126413 -67058 152020 -70415 -38367 -245887 -368357
11253c68357F5495J55475b20938A14442J54123f6907j18233j31952C39964c30263
11242f5961a8916A02507g7408E7371b72286J24390b5060B18273i7180k85363b2544
11230G2291g9626F7885J39605c4067j21330G9811d08093a1981G8600a64315p0011
11219b34326a08407j7149J5654k1079a3106H0222J08725q9230f1809D6298L9043
11208H5341O4104a00310A4139c20868d0219B53722q1623g7123J0259k35876a9521
11196A28897b85611g472A25027K63452p6157A16959e5072I8884b56226Q7619A04359
11184E5815L9305a87955D9428h8274E5581N8973h6653j13272M0824j46856J14192
11173a91765b3669A76355c34104a32594O4000B85298e8910k28116N0072b5986
$$ plain form
11253 -368357 65495 220970 -220938 114442 268565 -66907 -185140 -317092 339964 -330263
11242 -65961 -18916 102507 -77408 57371 -272286 -147896 -25060 218273 -97180 -382543 -22544
11230 72291 -79626 67885 207490 -34067 -155397 79811 -408093 -11981 78600 -164315 -234326
11219 -234326 -108407 -125556 -109902 -130981 -13106 80222 188947 99717 -61809 46298 85341
11208 85341 149445 -100310 14139 -320868 -40219 253722 172099 -77123 -66864 -302740 -19521
11196 128897 -285611 -7472 125027 388479 312322 116959 -55072 98884 -256226 -168607 104359
11184 55815 95120 -187955 49428 -88274 55581 114554 -86653 -199925 -159101 -305957 -191765
11173 -191765 -23669 176355 -334104 -132594 -68594 285298 -58910 -287026 -236954 -25986
11162c01412A4978a0493G0036c4308j30078k20428h843C16826a47986K9966A98283
11150a20226k18657J46036M3500A27624a23251A63421b07485O0192B33879a52897
11139B84650p4278f7355D775f67225e2331k7397A63494d27179A08543K64650A4384
11127f4735I3693J49417c7861l06208C6100a8820C83241a09698K5504j56598e4726
11115B24117a93153A40035M2977m7733a70413d9973q4231n2361o3196D4836h6441
11103A51222a23613A18650c72386A17225i3693b163B29322K10157D4949n607L175
11092D2517K28988A16300a32694A93831l5811K22953Q7291j43644A61495P2611
11082B34106j05216J50303E0106P6861O3815E2357Q9328o7288J88371n6623J04172
$$ plain form
11162 -301412 14978 -10493 70036 -34308 -164386 -384814 -8843 316826 -147986 -118020 198283
11150 -120226 -338883 -192847 -149347 127624 -123251 163421 -207485 -147293 233879 -152897
11139 284650 210372 -67355 4775 -667225 -52331 -79728 163494 -427179 108543 373193 14384
11127 -64735 93693 243110 -37861 -344069 36100 -18820 383241 -109698 -84194 -240792 -54726
11115 224117 -193153 140035 183012 135279 -170413 -49973 -134204 -186565 -249761 44836 -86441
11103 151222 -123613 118650 -372386 117225 -93693 -2163 229322 439479 44949 39342 42517
11092 42517 271505 116300 -132694 193831 158020 380973 468264 324620 161495 234106
11082 234106 128890 279193 50106 126967 190782 52357 141685 74397 262768 206145 310317
11071C10317J7645A59048K36878j60951d1409A35832K02938A65775M9327J3765
11061B28867b851E03701l6346A34717K83208A11313M16433A69919J08622Q3901
11051C62442A77981J54508J53631j38116K02552N2351K92252I9755N35032l1359
11041F03428j10769J7389K71682l30637L06862B96283J20888L94606k11874A58077
11030E63231J50934m0697M996B97371K87068J88420k97403J9401J19818N1217
11020F65892Q2989l32266K85594k87878L8097L64807k13816p2799K84400j33092
11010F81928j74455J41895o7057L5660n716L1602k92866J77673J34832R6827K09820
10999I70143l24298M1910j17791q6107n5023K49455j65778J14443B22307K47991
$$ plain form
11071 310317 327962 159048 395926 234975 -41409 135832 338770 165775 215102 228867
11061 228867 -2851 503701 467355 134717 417925 111313 527746 169919 278541 362442
11051 362442 177981 332489 486120 348004 550556 602907 895159 99755 634787 603428
11041 603428 492659 510048 781730 451093 757955 296283 417171 811777 599903 158077
11030 563231 714165 673468 678464 297371 584439 772859 475456 494857 614675 665892
11020 665892 748881 416615 702209 414331 452428 817235 603419 530620 815020 681928
11010 681928 507473 649368 582311 617971 612255 643857 350991 528664 663496 760323 970143
10999 970143 645845 687755 569964 483857 428834 678289 512511 626954 222307 470298
10989D70298L39879J440l66217L86760l25742o9413K1697L80125j34873R7019
10979H00973J14640k40800J37500Q1515N1152K2514k48101m5841J54433J62944
10969I90929P1111r2552L40419m3575K40454l62370K34663J36228J5816M15967
10959A947090P1709L15459J30999p196J91988l92788k27812J11229l13385R1779
10949A919072l04334q7506j58264L34539m00897R3164n26975M76800k83080N82068
10939A644587o32293q2561O1120j03069j63465j60701J1449k03697J16563p7642
10929D10291o4097P6009F2307K96338j31952m5331m2887Q810n6131J80161L2954
10918C04269C902K27230k4772J14540h5478H3252E803K193J87955E2069P208A6154
$$ plain form
10989 470298 810177 811617 445400 832160 506418 437005 458702 838827 703954 800973
10979 800973 915613 674813 812313 893828 944980 967494 719393 673552 827985 990929
10969 990929 1062040 969488 1309907 1266332 1506786 1144416 1379079 1515307 1531123 1947090
10959 1947090 2018799 2334258 2465257 2458061 2650049 2257261 2029449 2140678 1827293 1919072
10949 1919072 1614738 1527232 1368968 1703507 1302610 1395774 868799 1345599 1062519 1644587
10939 1644587 1012294 929733 990853 887784 724319 563618 575067 371370 487933 410291
10929 410291 346194 422203 62307 358645 226693 181362 138475 147285 91154 271315 304269
10918 304269 3902 231132 206360 320900 -85478 83252 5803 7996 195951 52069 59277 16154
10905a12010a2973D5403a41433B61332a1217G7833a45667K8975K3337B2280J43314
10894A65594J68c66961A14591a54059A32542D6586a44952f7217j53358h7772B45828
10882f1191l07843b4699m8194j79714H8288b07505g4942m6078p6684B51670g5068
10870d6110A86496b41864G4587d1910G1968L3345O967b19392A91427m3827L3210
10859A80810g32322H4842A3116b06319J3544M5865k4722j04710f3298P339C06914
10847F7694J9317d7535A61724l5594E1844P66e6239n1625C6233c61527A12569
10835B08989p5447A1096g7584B08104J1818e6564G0659l3223j2874J01573a25690
10823b96985A11069C5508h8523r2340f4784j97905J21925l0000B52001a87868
$$ plain form
10905 -112010 -12973 45403 -141433 261332 -11217 77833 -145667 -116692 -93355 22280 165594
10894 165594 165762 -366961 114591 -154059 132542 46586 -144952 -67217 -220575 -87772 245828
10882 -61191 -369034 -24699 -72893 -252607 88288 -207505 -74942 -121020 -197704 251670 -75068
10870 -46110 186496 -241864 74587 -41910 71968 105313 112280 -219392 191427 147600 180810
10859 180810 -732322 84842 13116 -206319 -192775 -146910 -171632 -276342 -63298 -55959 306914
10847 67694 87011 -47535 161724 126130 51844 52610 -56239 -107864 36233 -361527 112569
10835 208989 133542 11096 -77584 208104 219922 -56564 70659 37436 24562 126135 -125690
10823 -296985 111069 35508 -88523 -180863 -64784 -262689 -140764 -170764 252001 -187868
10812a77347h3752k50511L3446J29187P445A47650b02479B1696b87757O000a30037
10800H3974M9383R7371a15371a3883B3494J26240C727J89584g2552F8924a6667
10788b99173E7616a47281D6677a68895B4216a05704J6310a6652k46507P3105H616
10776b28676a2730I9219b0391F9665O9946e4454k89499f7287d439k09681A44679
10764b06088m7851f5968H6218a10875j05310g768m72985C3610h423j84966i3580
10752b54716J26090j32511C7533f0037b5073o5963A06149m8130b16017L7674P0703
10741a07640P194b5370A90342d1398j17750d1893A46608g1350p9367B14940a6510
10729A07391L3272e8095j21069k68280A55224a17548j22863b4982r3873n4874
$$ plain form
10812 -177347 -83752 -334263 -300817 -171630 -164185 147650 -202479 21696 -287757 -281757 -130037
10800 83974 133357 230728 -115371 -13883 23494 149734 3727 193311 -72552 68924 -16667
10788 -299173 57616 -147281 46677 -168895 24216 -105704 -89394 -16652 -263159 -190054 8616
10776 -228676 -12730 99219 -20391 69665 139611 -54454 -343953 -67287 -4439 -214120 144679
10764 -206088 -253939 -65968 86218 -110875 -216185 -7768 -480753 33610 -8423 -193389 -93580
10752 -254716 -128626 -261137 37533 -60037 -25073 -91036 106149 58019 -216017 -178343 -107640
10741 -107640 -100446 -25370 190342 -41398 -159148 -41893 146608 -71350 -150717 214940 -16510
10729 107391 140663 -58095 -179164 -447444 155224 -117548 -240411 -24982 -118855 -173729
10719a73729j10150G761R9639C352a1793A16960j760h8153H9473d110j95142b7147
10706I2450a57387c7710a5114l45438A25281N235J80563b13888j1809Q9827L3820
10695a02050B25938e9781J5755j70995A42905c90597H7435n673Q2953d2145j10523
10684a52668E6308i4599o3882f4805f057A69559c14979P4912C79516b20771i9119
10672a97090n1752d7191O899k13802i844H8697a69260N8393p6775P8727j63827
10661b72742P293A14156a43470A88799H7021a50363O8591n13754A05839a06860
10650I4976h3724I6282a2720A19406a08644B74034a74518f7356B91609A5513b55338
10638a65064g7986p4924j66979A49573l793c839k41193d2870j20192D8262i1486
$$ plain form
10719 -173729 -283879 7761 107400 3352 -11793 116960 115200 -88153 89473 -4110 -199252 -27147
10706 92450 -157387 -37710 -15114 -360552 125281 130516 311079 -213888 -225697 -135870 -102050
10695 -102050 225938 -59781 -44026 -215021 142905 -390597 87435 81762 164715 -42145 -152668
10684 -152668 56308 -94599 -158481 -64805 -6057 169559 -314979 -240067 379516 -220771 -99119
10672 -197090 -248842 -47191 -40292 -254094 -9844 88697 -169260 -110867 -187642 -108915 -272742
10661 -272742 -265449 114156 -143470 188799 87021 -150363 -81772 -595526 105839 -106860
10650 94976 -83724 96282 -12720 119406 -108644 274034 -174518 -67356 291609 15513 -255338
10638 -165064 -77986 -152910 -319889 149573 145780 -3839 -245032 -42870 -163062 48262 -91486
10626A2054b67369p852A38100b6676A7595K11324b84350a4518r4709I734a76508
10614b16687A0160K9074i7582k63469h8301D961a80471A26642a90735L8832f1008
10602C31894h051q8464n1019l7163l5648Q7375C4177J61328a44699E3253j9377
10591C3876b2948l07A00035c10540g0410C4304a88358j5104A12738b89827c2117
10579c03284l2758h7017C14344j42626J61448i5759L2448I4788b54010b6288m1431
10568f7719c0912k25374f333B90080F293M4441a09705A3179f5088o79E6713a50105
10555I6436a60671C1431M8102k8827c2830B52098c19666A32914D3710a25224C35273
10543a03669D5042a5123n4713f725q1375c8303D7291a24358B1466f3773B2973
$$ plain form
10626 12054 -267369 -275221 138100 -26676 17595 228919 -284350 -14518 -109227 9734 -176508
10614 -216687 10160 39234 -97582 -361051 -88301 4961 -180471 126642 -190735 -151903 -61008
10602 331894 -8051 -96515 -147534 -184697 -220345 -132970 34177 195505 -144699 53253 33876
10591 33876 -22948 -23255 100035 -310540 -70410 34304 -188358 -203462 112738 -289827 -32117
10579 -303284 -336042 -87017 314344 171718 333166 -95759 -63311 94788 -254010 -26288 -67719
10568 -67719 -30912 -256286 -6333 290080 6293 50734 -109705 13179 -65088 -65767 56713 -150105
10555 96436 -160671 31431 79533 50706 -32830 252098 -319666 132914 43710 -125224 335273
10543 -103669 45042 -15123 -69836 -6725 -88100 -38303 47291 -124358 21466 -63773 22973
10531F8146k7741J91747r6366g1444C4378d2103q2212j2738E617a46608l11907
10520d58515a55621q9085M6650f7785j7944q4019p2330B7861L00906l4324J4398
10509C08841D6880L0942J1782e3877E0928P2080a63488h1496A45841b45340I3568
10497a23335B31254d4580G3268c639p1960k64704b0001j15061M6903K9575B6585
10485D6284J2150a77864m1020G4614j6197e4232j30950h9489B59216C3637i15
10473a09975q6610A83230J1539D17K49097b11851N7320E6664M22177b8825C1592
10461B25116q7072d6296A17218R4463e7359l23B55067d6524k41712J23811L7097
10450a27328K4582l4771M1178E6684a12453j57108A35939L7250b94532B81868
$$ plain form
10531 68146 40405 232152 135786 -71444 34378 -42103 -124315 -137053 5617 -146608 -458515
10520 -458515 -155621 -244706 -198056 -67785 -85729 -169748 -242078 27861 328767 294443 308841
10509 308841 46880 77822 89604 -53877 50928 123008 -163488 -81496 145841 -245340 93568
10497 -123335 231254 -44580 73268 -3639 -75599 -340303 -20001 -135062 -88159 -58584 26585
10485 46284 58434 -177864 -218884 74614 58417 -54232 -185182 -89489 259216 33637 -915
10473 -109975 -196585 183230 194769 417 249514 -211851 -154531 56664 478841 -28825 31592
10461 225116 138044 -46296 117218 211681 -57359 -57682 255067 -46524 -288236 -164425 -127328
10450 -127328 -102746 -137517 -96339 56684 -112453 -269561 135939 173189 -294532 281868
10439c41553d7697p1657r3696d8461j83717B12930a4728j9498j68034C9916O6761
10428A06677a1064B14635C8209b26860d7599B9737a05122j37477J09148j75167
10418c08618A37148d13843B9540K25706j14446b79172C5766a9292l03886A91367
10407H0157H441a84826M962C6199J98715q9822e2163k6241N609p1933M5878K3394
10395g5456b5836a0694H9646a63963k37554a18363B8412b33918l9771B57773E0626
10383D04976A07448a03275l6992F7713g2551H8709O6658O1158D7254a3695A62064
10371B2931J00303b13403b0664B2771b24909D7018A3976K20725J24837j33994
10361B25544J10261C9416N6431K04340A21553J49748R8971p8568L05131B59403
$$ plain form
10439 -341553 -47697 -119354 -213050 -48461 -232178 212930 -14728 -34226 -202260 39916 106677
10428 106677 -11064 214635 38209 -226860 -47599 29737 -105122 -242599 -133451 -308618
10418 -308618 137148 -413843 29540 255246 140800 -279172 35766 -19292 -323178 191367
10407 80157 8441 -184826 -179864 36199 234914 145092 -52163 -78404 -72795 -144728 -98850 -75456
10395 -75456 -25836 -10694 89646 -163963 -401517 -118363 28412 -233918 -273689 257773 50626
10383 404976 107448 -103275 -140267 67713 -72551 88709 155367 216525 47254 -13695 162064
10371 22931 123234 -213403 -20664 22771 -224909 47018 13976 234701 359538 225544
10361 225544 335805 39416 95847 300187 121553 271301 370272 291704 596835 259403
10350B34170J90411A65804K76402K94702A36559a28559j9897b7019q2809B18015
10339B87003J58123A41064K09037L1295A29445K07801j12516K55229H5217K68670
10329C53887E6392Q1406K80839i2911B66395q9471K23181A29363k2190k1080A465
10317B18436J47051l3471a22002C53971h1760E3490J29052l6759J33572I2224
10306G4975a9897H9140d0967B5401P6719M1056L6324C9831N4040Q9136p0145J36644
10294B49506a91264e7986A88791F0088A7371L52536j66787r9666c03928B92753
10283C806N4101b41121f4382G1274a10201A01139e6639j50147G2276b24277C4658
10271a04497j15445A09052b68807A47689B3964b52253d4907k94402c5833C5196
$$ plain form
10350 234170 424581 165804 442206 736908 136559 -128559 -148456 -27019 -109828 218015
10339 287003 445126 141064 350101 381396 129445 337246 224730 479959 85217 353887
10329 353887 56392 137798 418637 -92911 266395 176924 400105 129363 107173 86093 1465
10317 218436 365487 332016 -122002 353971 -81760 53490 182542 145783 279355 92224
10306 74975 -19897 89140 -40967 25401 102120 143176 179500 39831 93871 183007 112862 249506
10294 249506 -191264 -57986 188791 60088 17371 369907 203120 103454 -303928 292753
10283 3806 57907 -241121 -64382 71274 -110201 101139 -56639 -206786 72276 -224277 34658
10271 -104497 -219942 109052 -268807 147689 23964 -252253 -44907 -339309 -35833 35196
10260f0258A83027a806k02972g0290l40946h5165D06247c7329j0688l986A09403
10248a12k943p8076C85166o9103j27537G5329A1756R9705a25349A02324Q1740
10237A84064a04733A39708a75021b5143A38563q798A6705c46266A38139b02636
10226B07337a11132q5509B3329J15025J14955f5406A72178e6974q924E4667e0997
10214A50297c3795n2832b388E26532a8812l0334k81202J63844D4567a93044L5024
10203a58020d0430j34653q1221J25503A1320Q5414M2451a57783m842m0833G4521
10191a32438A172c17364B597J3348d5485j6579E7178J2000c1481A45325b06537
10179b35484C863L64270A572K64145e07662a51474d1140m1305p3765D93314a61004
$$ plain form
10260 -60258 183027 -1806 -204778 -70290 -411236 -85165 406247 -37329 -48017 -52003 109403
10248 -112 -3055 -81131 385166 316063 188526 75329 11756 111461 -125349 102324 184064
10237 184064 -104733 139708 -175021 -25143 138563 129765 16705 -346266 138139 -202636
10226 207337 -111132 -196641 23329 138354 253309 -65406 172178 -56974 -65898 54667 -50997
10214 150297 -33795 -86627 -2388 526532 -18812 -49146 -330348 -166504 44567 -193044 -158020
10203 -158020 -40430 -175083 -256304 -130801 11320 96734 139185 -157783 -162625 -203458 74521
10191 -132438 1172 -317364 2597 15945 -45485 -62064 57178 69178 -31481 145325 -206537
10179 -235484 3863 368133 1572 265717 -507662 -151474 -41140 -82445 -156210 493314 -161004
10167a1976p6014a5013j62388o0009e3535j90688P6675n5028i21A50402d2199
10155b52376b5942j78543A10374A0473c15406E3745c7104A02495G630K4531a62033
10143f0509n3137l2888k2156C24332a55372J2363D2171j470J20376d60089a03080
10131B20531E7430a09820M6616N814A01921b7460A04308e1627j01504j7127j2315
10120a82573m4243a080B63846H9912i4593G305L2511e27344a67740K3624L9661
10109a04455C2355P6373g8023A18470i9667I1705c68115a07641B3691a59174A37046
10097G4607M8373J43044I080J18585l4493g7402j55685A38327b35826c3462B3794
10085A29256d216A22666b2027j0198A35166a23198m6973n1078A61898F1069J24145
$$ plain form
10167 -11976 -87990 -15013 -177401 -237410 -53535 -244223 -167548 -222576 -921 150402 -42199
10155 -252376 -25942 -204485 110374 10473 -315406 53745 -37104 102495 7630 32161 -162033
10143 -60509 -113646 -146534 -168690 324332 -155372 -143009 42171 40701 161077 -460089 -103080
10131 220531 57430 -109820 -63204 -57390 101921 -27460 104308 -51627 -153131 -170258 -182573
10120 -182573 -226816 -1080 263846 89912 -94593 7305 39816 -527344 -167740 -144116 -104455
10109 -104455 32355 108728 -78023 118470 -99667 91705 -368115 -107641 23691 -159174 137046
10097 74607 122980 266024 9080 127665 93172 -77402 -233087 138327 -235826 -33462 23794
10085 129256 -4216 122666 -22027 -32225 135166 -123198 -170171 -221249 161898 61069 185214
10074A85214b36414I1078J64979c11094D580d6875F7317a02274A71048B4181J78364
10063B02545N4108b54052R2901C63446b0301A58020a04913A09666a93125P9958
10053a13167c5598A53965c267r8295A68970F1097b24530A599K7638K525b63644
10041A68865a32661o440j32900m357a19408A01445b34215n3730a40691k0367k3586
10030a84644D1531L53227H4869c34884C1180J7292I741a73544C6644d27700g6338
10018g5857F2288L7197k5754J48942g8568E3552b62819a11891l4153f5891j01083
10007a66974k09142J51775a06869B17254F1583a98803C02498A12129b21945j31804
9997c53749a66663f9262G4744i9381a3425j70996E9967R2385P1086b80430a13971
$$ plain form
10074 185214 -236414 91078 256057 -311094 4580 -46875 67317 -102274 171048 24181 202545
10063 202545 256653 -254052 -161151 363446 -20301 158020 -104913 109666 -193125 -113167
10053 -113167 -35598 153965 -3267 -101562 168970 61097 -224530 1599 29237 31762 -263644
10041 168865 -132661 -139101 -272001 -276358 -119408 101445 -234215 -287945 -140691 -161058 -184644
10030 -184644 41531 394758 84869 -334884 31180 48472 9741 -173544 36644 -427700 -76338
10018 -75857 62288 99485 73731 222673 -78568 53552 -262819 -111891 -146044 -65891 -166974
10007 -166974 -376116 -224341 -106869 217254 61583 -198803 302498 112129 -221945 -353749
9997 -353749 -166663 -69262 74744 -99381 -13425 -184421 59967 152352 223438 -280430 -113971
9985b6863j20864k97389K13469A07513b89972f5228K8442A23301e22735b12432
9974a94051B21874b19910j01426B21895c10514O6238B87675b98136b0727E7890
9963E7744R6576j8792Q0332D5972N5678A0823a22538A20255K24382F0374a32297
9951c12497E2423a87449r5505N2783K5433B3126h4537A52124j5430d32026B29184
9939c06802i2616j04160e69k233B23728a22934F3435K28209C0856R1184C288a67384
9926c92467a85493a0596I8265h5774d1777C26833b6276C647h1497C3613K13432
9915B47045j22407g2508B95615f8257A17321d43320a35871k34703a10566B38269
9904a11383C5934c24985B30847p9770a83094q8572a18124o3797K2692E0344f6526
$$ plain form
9985 -26863 -147727 -445116 -231647 107513 -289972 -65228 -36786 123301 -522735 -212432
9974 -194051 221874 -219910 -321336 221895 -310514 -244276 287675 -298136 -20727 57890
9963 57744 154320 135528 215860 45972 101650 10823 -122538 120255 344637 60374 -132297
9951 -312497 52423 -187449 -282954 -230171 -204738 23126 -84537 152124 136694 -432026 229184
9939 -306802 -92616 -196776 -569 -2802 223728 -122934 63435 291644 30856 122040 3288 -167384
9926 -392467 -185493 -10596 98265 -85774 -41777 326833 -26276 3647 -81497 33613 247045
9915 247045 124638 -72508 295615 -68257 117321 -443320 -135871 -370574 -110566 238269
9904 -111383 35934 -324985 230847 151077 -183094 -271666 -118124 -181921 -159229 50344 -66526
9892d97422a48228A76233B8244d2697l5329L6417B5554a54811G328b44337c4086
9880F6391L2375l0840L6703b97548I8913i9202j67666i6023j00306N0376l0198
9869a76151b3011l6225D8338d1206A42975C4077a6003I3502a55492e2806l5639
9858h8445E4389N9128a54167c7991A91146b62438A86334a28889M7142B37265C6014
9846b50977E3154b46581A7100b01046N8518c1320C1725f4411k9981j58410L849
9835b48953A64684b45911k9601A80435G6136P935b35505A27616b0233B36438c75110
9823b89365i1018j12577n7140M4400a6377l34181a27699B7970B215b39997b0282
9811b1559A7870e97599b62458A6226L7644j0115A376N1707A8696d4948A24857
$$ plain form
9892 -497422 -148228 176233 28244 -42697 -78026 -41609 25554 -154811 7328 -244337 -34086
9880 66391 98766 67926 104629 -297548 98913 -99202 -266868 -96023 -196329 -145953 -176151
9869 -176151 -23011 -59236 48338 -41206 142975 34077 -16003 93502 -155492 -52806 -88445
9858 -88445 54389 113517 -154167 -37991 191146 -262438 186334 -128889 -81747 237265 36014
9846 -250977 53154 -246581 17100 -201046 -142528 -31320 31725 -64411 -94392 -252802 -248953
9835 -248953 164684 -245911 -275512 180435 76136 84071 -235505 127616 -20233 236438 -375110
9823 -289365 -91018 -203595 -260735 -216335 -16377 -350558 -127699 27970 2215 -239997 -20282
9811 -21559 17870 -597599 -262458 16226 53870 43755 1376 53083 18696 -44948 124857
9799A26100b05801A73218b9144q5461j60462G4670a58606e5735j79199J4812e7064
9787b00895A53019h3744G785J19331b72318b6114A0992R2274c5218j28394K3093
9776a40519K5141j29794j63780B57974I6980d4377j03181l26084A81350b40501
9765F2913f9178q7016c5629a6819q819n1249F5382C785b6486n06585C06754b09593
9752b61578B69910f3281j13068M0776k94462R2732i2320j9105a948A43322J6150
9741A59472b04047N9159e92D53965g6829L184a1302A4069a93867A19796m1375
9730G8421a92835g7986b3442k6612j68464f5247E8516b78702h1146m07107g0j82241
9718a82311E2574a97390k06921d3632B0476a60334A18913a04189d4455B4689J12630
$$ plain form
9799 126100 -205801 173218 -29144 -114605 -275067 74670 -158606 -55735 -234934 -220122 -57064
9787 -200895 153019 -83744 7785 127116 -272318 -26114 10992 103266 -35218 -163612 -140519
9776 -140519 -115378 -245172 -408952 257974 96980 -44377 -147558 -473642 181350 -240501
9765 62913 -69178 -156194 -35629 -16819 -25638 -76887 65382 3785 -26486 -533071 306754 -209593
9752 -261578 269910 -63281 -176349 -135573 -430035 -337303 -92320 -111425 -1948 143322 159472
9741 159472 -204047 -144888 -592 453965 -76829 -73645 -11302 14069 -193867 119796 78421
9730 78421 -192835 -77986 -23442 -50054 -218518 -65247 58516 -278702 -81146 -488253 -70 -182311
9718 -182311 52574 -197390 -404311 -43632 20476 -160334 118913 -104189 -44455 24689 137319
9707A37319b57453a310F4007A0508b51571A12311g2268C7004a7511j07189B61883
9695h9014j8311l03931B0447b61283D6592b47148J21583e3930A89985H3426c30233
9683f1810k08192j8731Q4049j31939B11710k8724a31354C1768N8740C9826a78708
9671b47784n0155K2180O0902A06126a5119m17389D6092c30205a51371B0463a25517
9659b35067L9686A22054d36253A09905e1216A66804f6649D4028a0787K214G2790
9647E4161b57727E5214J18114b34666R9223A76723F5998b37396h3338q327A75471
9635f9418I4692K5127h8213j79955A59297M5411b10672O9191L4167H8980j4589
9624G4391a0233l49281a67650j51806f9806m7990B82520a93218I5623a50236B95156
$$ plain form
9707 137319 -257453 -1310 64007 10508 -251571 112311 -72268 37004 -17511 -124700 261883
9695 -89014 -107325 -411256 20447 -261283 46592 -247148 -125565 -53930 189985 83426 -330233
9683 -61810 -270002 -288733 -204684 -336623 211710 182986 -131354 31768 90508 39826 -178708
9671 -247784 -297939 -275759 -214857 106126 -15119 -432508 46092 -330205 -151371 20463 -125517
9659 -235067 -195381 122054 -436253 109905 -51216 166804 -66649 44028 -10787 -8573 72790
9647 54161 -257727 55214 173328 -234666 -135443 176723 65998 -237396 -83338 -91665 175471
9635 -69418 94692 119819 -88213 -268168 159297 204708 -210672 -141481 -107314 88980 74391
9624 74391 -10233 -359514 -167650 -319456 -69806 -117796 282520 -193218 95623 -150236 295156
9612B4703K376b57075a3572k92955a40724r0220c188n8361l6965A2198b86481
9600e7874m5961G1231j7592J10293a21489J0077E0363c44512g420d03F5893b00872
9587b48314I9191N9441d2408B5487c92032A21983d5700l1232B94518A0084e087
9575d29462a25687A46270a39599I4841a56880b7942A27775F018J3718P4020h5399
9563b29078G2756L09359f8476N205A69758b55261C2097d7078G4181l0394J04422
9552A48209c06422f1566c0202A06298a75165k1996A33403a09051B20792p9952
9542A40840M345a10685D2466c9212l38743L3933G191J973Q2920b10913j10018
9531c20931b9856k35746A22171b24546L0949j13695H2646j6257O3628b76614C189
$$ plain form
9612 24703 27079 -257075 -13572 -306527 -140724 -230944 -3188 -61549 -98514 12198 -286481
9600 -57874 -103835 71231 53639 163932 -121489 -111412 50363 -344512 -7420 -403 65893 -200872
9587 -248314 99191 158632 -42408 25487 -392032 121983 -45700 -76932 294518 10084 -5087
9575 -429462 -125687 146270 -139599 94841 -156880 -27942 127775 6018 19736 93756 -85399
9563 -229078 72756 382115 -68476 -63271 169758 -255261 32097 -47078 74181 43787 148209
9552 148209 -306422 -61566 -30202 106298 -175165 -197161 133403 -109051 220792 140840
9542 140840 145185 -110685 42466 -39212 -377955 -344022 7191 9164 92084 -210913 -320931
9531 -320931 -29856 -265602 122171 -224546 -193597 -307292 82646 66389 130017 -276614 3189
9519c18256G259c30705a03398k40980B03315a71961l129e0539k72017a7659h532
9507d57335K24412f0970A19477b03359E789b89792J43417p4393j2721I5271a02113
9495f2262j19898e0332n2373K7725c452I98J87759e4063m06940a05469K9169L4188
9483d2112H1604c09455K312d6051l22570a62466A50861b05976B21254c5526B03275
9471I1819a85204B90439e2689A32020c80438C837K03356B2704h391A26332d0748
9459a8206A20586c58780J64641J8724j39055D3876a02175j18846K563K9248A15811
9447A06593a11357P178G2726b41906j21309Q731A56811b09422e7974B08183a28734
9435a50697B7176a13879K4674j80543c4158J0800E1597c20360H9965P5604F901
$$ plain form
9519 -318256 7259 -330705 -103398 -344378 203315 -171961 -175090 -50539 -322556 -17659 -8532
9507 -457335 -232923 -60970 119477 -203359 5789 -289792 -146375 -220768 -233489 95271 -102113
9495 -62262 -182160 -50332 -102705 -74980 -3452 998 188757 -54063 -461003 -105469 -76300 -42112
9483 -42112 81604 -309455 -307143 -46051 -368621 -162466 150861 -205976 221254 -35526 203275
9471 91819 -185204 290439 -52689 132020 -380438 3837 207193 22704 -8391 126332 -40748
9459 -18206 120586 -358780 -194139 -175415 -314470 43876 -102175 -221021 -218458 -189210 115811
9447 106593 -111357 -104179 72726 -241906 -363215 -354484 156811 -209422 -57974 208183 -128734
9435 -150697 27176 -113879 -89205 -269748 -34158 -23358 51597 -320360 89965 165569 6901
9423b49307a5687l11135a4538D24164B10251g6047m0169A27044g9139G1938i4956
9411I26b97667a26247k3224f2475A12425b77388j52372a68038j38769C1337L29628
9400C60965D7127b74844H2023K2970l6294k9139q157L8942J86843A22119c61456
9388A04003J46970l6177b27039d0668n6922B4454K64065d09271K00131a3404k4995
9377c8399a4326l90111I8615i4897M5935m3942B7807b56444J18503E1971d09044
9365B59443C2968c66426C0975f5785l03618B30170b38622G800e24857A0265M4276
9354E4541k2139a32616O4710B648J61673b7601k16437A5931c10946H8675a25083
9342b68501C76793A69590d594j8772I369c64110a5499j96803F7023d74217B80857
$$ plain form
9423 -249307 -15687 -326822 -14538 424164 210251 -76047 -116216 127044 -79139 71938 -94956
9411 926 -297667 -126247 -149471 -62475 112425 -277388 -429760 -168038 -306807 31337 360965
9400 360965 47127 -274844 82023 104993 68699 39560 31403 70345 257188 122119 -361456
9388 104003 250973 214796 -227039 -40668 -97590 24454 288519 -409271 -209140 -13404 -38399
9377 -38399 -14326 -404437 98615 -94897 -48962 -92904 27807 -256444 -137941 51971 -409044
9365 259443 32968 -366426 30975 -65785 -369403 230170 -238622 7800 -524857 10265 54541
9354 54541 32402 -132616 -67906 2648 164321 -27601 -244038 15931 -310946 88675 -125083
9342 -268501 376793 169590 -4594 -23366 9369 -364110 -15499 -212302 67023 -474217 280857
9330b7048j04576N0961B03755a19045j20966D06457a18038c4768r8488l05156
9320d38412b01790D7477h4275l7861J1741A464P2625f4687k15151R4609M423A27443
9307B00889b10637j2810J5867B77127a9077B18315a63663A09577R6592c4580D4603
9295H4729a50937e5681m4201k3218i005j12915d557C37021b20376j0473e1241
9283a43662H3226f1879p6037A1797L57492k5636a32688j19224K8284B2965K589
9272B5554a28201N8155B292a10300j94675B44918a77116A21852c16369q9710a35558
9260d22050J31541H1537b697l7570j95079j5455a5462o6932k12025a38395p4637
9249b13032O7711k3694A24757a13249B44852D5747g0829a8259j78600A15540c25252
$$ plain form
9330 -27048 -131624 -80663 203755 -119045 -240011 406457 -118038 -34768 -133256 -438412
9320 -438412 -201790 47477 -84275 -122136 -110395 1464 74089 -64687 -279838 -185229 -180806 127443
9307 200889 -210637 -223447 -207580 277127 -19077 218315 -163663 109577 206169 -34580 44603
9295 84729 -150937 -55681 -99882 -123100 -9005 -121920 -4557 337021 -220376 -230849 -51241
9283 -143662 83226 -61879 -137916 11797 369289 343653 -132688 -251912 -223628 22965 25554
9272 25554 -128201 -70046 2292 -110300 -304975 244918 -177116 121852 -316369 -406079 -135558
9260 -422050 -290509 81537 -2697 -40267 -235346 -250801 -15462 -82394 -294419 -138395 -213032
9249 -213032 -145321 -169015 124757 -113249 244852 45747 -70829 -18259 -196859 115540 -325252
9237c65368O0482i8877A35969H383J69276c32397J12972G4552a5047m1469f075
9225i413j9138k51642d3930A5087Q4059A849J18768J00590a86444P4580B05360
9213c37156a64095d8963k457j28690n6768M8634F6053J30253e403A76815B6285
9201c1341j06773E5973J01326f8447m1939B29056g7760p7723G4771b6415F3166
9189F7568i2068j25727l0644G4559K47420E8136Q3320a50477O8210k38508g1582
9177H9728c06969d8460B37142c42047J48457N7242j3823P2302j15587P7686l56687
9166d72457a22247p1477r429i8314A60644b40666f7886j9821j42269i4782n5626
9155a50408q0223f6273l6239H7353a58728b2359A9829a47366j54052N2275c4932
$$ plain form
9237 -365368 -304886 -98877 135969 8383 177659 -332397 -219425 74552 -15047 -56516 -6075
9225 -9413 -28551 -280193 -43930 15087 99146 1849 120617 221207 -186444 -111864 205360
9213 -337156 -164095 -48963 -51420 -180110 -236878 -188244 66053 196306 -5403 176815 26285
9201 -31341 -138114 55973 157299 -68447 -110386 229056 -77760 -155483 74771 -26415 63166
9189 67568 -92068 -217795 -248439 74559 321979 58136 141456 -150477 -82267 -320775 -71582
9177 89728 -306969 -48460 237142 -342047 -193590 -136348 -150171 -77869 -193456 -115770 -472457
9166 -472457 -122247 -193724 -203153 -98314 160644 -240666 -67886 -87707 -229976 -94782 -150408
9155 -150408 -230631 -66273 -102512 87353 -158728 -22359 19829 -147366 -301418 -249143 -34932
9143c10602G9619a49304j44639a35749L3885j20551i6742j89742N7065b3709j6981
9132d0690I7455a24267C0685a57773b2876A32193R7083b3177r3264N4177A61879
9120f8859A90944b71970l745B95697b17127R543o927A47562a38816K0037A65488
9108d3781j99445h5322r4918d0180j38677l3745a1401J307B89578a9245m359B52907
9095a51367j89836R7693G583K48236A04164a22488j32617a06115H9046c46756
9084H7770b19753L0321B32584a36997C2520a28885H5134b20957f9744j25446a625
9072H8351b18205B06547p6431a32100j67597e9037F4350B3431a7050q7843k06362
9061c11255C15682j31136q4647L3529a62963A49392A4597L56372c3757k3275k6468
$$ plain form
9143 -310602 79619 -149304 -293943 -135749 -101864 -222415 -96742 -286484 -229419 -23709 -40690
9132 -40690 97455 -124267 30685 -157773 -22876 132193 229276 -23177 -116441 -62264 161879
9120 -68859 190944 -271970 -275715 295697 -217127 -207584 -214511 147562 -138816 -118779 165488
9108 -43781 -243226 -85322 -180240 -40180 -178857 -212602 -11401 -10094 289578 -19245 -23604 252907
9095 -151367 -341203 -243510 7583 255819 104164 -122488 -255105 -106115 89046 -346756
9084 87770 -219753 -189432 232584 -136997 32520 -128885 85134 -220957 -69744 -195190 -1625
9072 88351 -218205 206547 130116 -132100 -299697 -59037 64350 23431 -17050 -104893 -311255
9061 -311255 315682 184546 99899 133428 -162963 149392 14597 370969 -33757 -57032 -83500
9050h3500E8093a17588F1313b97456a04641K1185D4039L13945A14983f9736j86839
9039b56575i8959G0625P2656a95526A99883a45467f5217P884C32022H163a31866
9027d7894B51210g070r3771b8380j20217j56214C88562a36270A70227a21479C53382
9015D7680J60178a75067Q1778j23921B61493A11892a01606D3639a72943l0637
9005b03580N9378D9416J70674a60791f7835F6247J33667E408i2624c8365j03387
8994a41752C2333i1783B24036b82097h3225B13291b01423Q2546j5280j86880a48282
8982g1290j85162b2579j65073q2436J18471k20928A32437B7491b58144A57259
8971a21320c2292E0860d7546A13851I654e7465A44814M3486b58656A52092b51434
$$ plain form
9050 -83500 58093 -117588 61313 -297456 -104641 -83456 44039 357984 114983 -69736 -256575
9039 -256575 -98959 70625 143281 -195526 199883 -145467 -65217 -57333 332022 8163 -131866
9027 -47894 251210 -7070 -100841 -28380 -148597 -304811 388562 -136270 170227 -121479 353382
9015 47680 207858 -175067 -93289 -217210 261493 111892 -101606 43639 -172943 -203580
9005 -203580 -144202 49416 220090 -160791 -67835 66247 199914 5408 -92624 -38365 -141752
8994 -141752 32333 -91783 224036 -282097 -83225 213291 -201423 -118877 -134157 -321037 -148282
8982 -71290 -256452 -22579 -187652 -270088 -151617 -372545 132437 27491 -258144 157259
8971 -121320 -32292 50860 -47546 113851 9654 -57465 144814 188300 -258656 152092 -251434
8959b2131j29943e6562C0181A1920c55839a72594A3586O3445Q1713b02808d1911
8947b25541b9085B33449a31222k26088J47697f5407B15217a69470B32562F0908
8936e4366B43521a88394n4835G241J45913J21107Q2856b46959I5905J92893G7010
8924B32389A422a72597a6151B13252k7932J50813j49429A2253K02805I8530K66774
8913C65304Q185J42926r3033L83281M44102J102903J115863M020824J500933D121781
8902B275949o78766n86002m47860K9016k05058j04100j02808J14173l9945J40165
8892C94764p5226N3207j65172D3926i698I7848q130J34502d7036j05321N2130
8881a00227j19938m8792p6830b1016l2103j69914j9541B97759c63724k1941a63971
$$ plain form
8959 -22131 -152074 -56562 30181 11920 -355839 -172594 13586 77031 158744 -202808 -41911
8947 -225541 -29085 233449 -131222 -357310 -209613 -65407 215217 -169470 232562 60908
8936 -54366 243521 -188394 -243229 7241 153154 274261 357117 -246959 95905 288798 77010
8924 232389 1422 -172597 -16151 213252 185320 336133 186704 12253 215058 98530 365304
8913 365304 373489 516415 423382 806663 1250765 2353668 3469531 7490355 8991288 4121781
8902 2275949 1597183 1011181 563321 592337 387279 283179 180371 294544 254599 394764
8892 394764 319538 372745 207573 43926 -9698 97848 89718 224220 -47036 -152357 -100227
8881 -100227 -220165 -268957 -345787 -21016 -53119 -223033 -242574 297759 -363724 -385665 -163971
8869a17126K9694K8944k97493a2086B5842b98909F2427a11794b4933B7950K1859
8858D9809J1367b31318C0447f7438E2865b18783M1300M4368F8363b57761R6714
8847a61047F8688A8200a00812D04030e019k63399B03501r4763d1337m89825e3045
8835F1585A8730d15183a41091l43337e4892k24672A31504h2626j29423a837C9667
$$ plain form
8869 -117126 -87432 -58488 -355981 -12086 25842 -298909 62427 -111794 -24933 27950 49809
8858 49809 61176 -231318 30447 -67438 52865 -218783 -177483 -133115 68363 -257761 -161047
8847 -161047 68688 18200 -100812 404030 -5019 -268418 203501 108738 -41337 -531162 -53045
8835 61585 18730 -415183 -141091 -484428 -54892 -279564 131504 -82626 -212049 -1837 39667
$$ [...]
##END NTUPLES=NMR SPECTRUM
##END=
