
##TITLE=UV1040_TOSA01-ROVE100B_6099550_M4QxPf6Al5
##JCAMPDX= 6.0         $$ Bruker NMR JCAMP-DX V2.0
##DATA TYPE= NMR SPECTRUM
##DATA CLASS= NTUPLES
##ORIGIN= BRUKER
##OWNER= Administrator
$$ 1.72 TOPSPIN		Version 2.1
$$ 2012-05-12 19:47:07.937 -0500  Administrator@TOPSPIN
$$ Compression mode = diff/dup
##.OBSERVE FREQUENCY= 400.13188235
##.OBSERVE NUCLEUS= ^1H
##.ACQUISITION MODE= SIMULTANEOUS (DQD)
##.ACQUISITION SCHEME= undefined
##.AVERAGES= 64
##.DIGITISER RES= 22
##SPECTROMETER/DATA SYSTEM= spect
##.PULSE SEQUENCE= noesygpps1d.comp
##.SOLVENT NAME= COFFEE_meoh
##.SHIFT REFERENCE= INTERNAL, COFFEE_meoh, 1, 14.96685
##AUDIT TRAIL= $$ (NUMBER, WHEN, WHO, WHERE, PROCESS, VERSION, WHAT)
$$ ##TITLE= Audit trail, TOPSPIN		Version 2.1
$$ ##JCAMPDX= 5.01
$$ ##ORIGIN= Bruker BioSpin GmbH
$$ ##OWNER= Administrator
$$ $$ C:\Bruker\TOPSPIN/data/COFFEE/nmr/UV1040_TOSA01-ROVE100B_6099550_M4QxPf6Al5/12/pdata/1/auditp.txt
$$ ##AUDIT TRAIL=  $$ (NUMBER, WHEN, WHO, WHERE, PROCESS, VERSION, WHAT)
(   1,<2012-05-12 19:47:03.046 -0500>,<Administrator>,<TOPSPIN>,<go>,<TOPSPIN 2.1>,
      <created by zg
	started at 2012-05-12 19:35:32.781 -0500,
	POWCHK enabled, PULCHK disabled,
       configuration hash MD5:
       AF F2 23 6B 01 CD 40 DD E5 A1 38 A0 06 EA F7 77
       data hash MD5: 64K
       73 BA E3 42 5C 00 BE 2B 63 A3 98 6C 57 DA 78 12>)
(   2,<2012-05-12 19:47:05.921 -0500>,<Administrator>,<TOPSPIN>,<proc1d>,<TOPSPIN 2.1>,
      <Start of raw data processing
       efp LB = 0.3 FT_mod = 6 PKNL = 1 PHC0 = 0 PHC1 = 0 SI = 128K 
       data hash MD5: 128K
       07 64 35 BB 01 95 4F D2 F5 19 D7 9B 0A B6 FE 7C>)
(   3,<2012-05-12 19:47:07.156 -0500>,<Administrator>,<TOPSPIN>,<proc1d>,<TOPSPIN 2.1>,
      <pk PHC0 = 39.25415 PHC1 = 0 
       data hash MD5: 128K
       BE A0 D0 49 45 E7 E3 AF 98 35 90 68 E9 B1 B5 28>)
(   4,<2012-05-12 19:47:07.625 -0500>,<Administrator>,<TOPSPIN>,<proc1d>,<TOPSPIN 2.1>,
      <abs ABSG = 1 
       data hash MD5: 128K
       0D 3A 51 06 39 D6 AE 4B 05 59 CB 53 34 AB 13 82>)
(   5,<2012-05-12 19:47:07.703 -0500>,<Administrator>,<TOPSPIN>,<proc1d>,<TOPSPIN 2.1>,
      <abs ABSG = 2 
       data hash MD5: 128K
       F0 4E 48 BE A2 8C 0D DE 4F A3 22 0F 21 B0 2C 9B>)
(   6,<2012-05-12 19:47:07.750 -0500>,<Administrator>,<TOPSPIN>,<proc1d>,<TOPSPIN 2.1>,
      <abs ABSG = 3 
       data hash MD5: 128K
       D9 07 4D 9D EB C6 89 4A AC 12 99 E2 71 1C A4 EC>)
(   7,<2012-05-12 19:47:07.796 -0500>,<Administrator>,<TOPSPIN>,<proc1d>,<TOPSPIN 2.1>,
      <abs ABSG = 4 
       data hash MD5: 128K
       B9 FB 2A 54 F9 13 EB 4A 2A CB 99 3A 58 71 E7 A1>)
(   8,<2012-05-12 19:47:07.843 -0500>,<Administrator>,<TOPSPIN>,<proc1d>,<TOPSPIN 2.1>,
      <abs ABSG = 5 
       data hash MD5: 128K
       D5 39 1A 04 6C 1E 1B BF DE 8D 4B 39 90 0A 2C 94>)
$$ ##END=
$$ 
$$ $$ hash MD5
$$ $$ 5F 54 4A 98 8A 50 63 4F 0C D0 57 5F 69 65 10 B4
##$RELAX= 
##$RELAX= 
##$RELAX= 
##$RELAX= 
##$RELAX= 
##$RELAX= 
##$RELAX= 
##$RELAX= 
$$ [...]
##$TP07= 0
##$TPNAME0= <>
##$TPNAME1= <>
##$TPNAME2= <>
##$TPNAME3= <>
##$TPNAME4= <>
##$TPNAME5= <>
##$TPNAME6= <>
##$TPNAME7= <>
##$TPOAL= (0..7)
0.5 0.5 0.5 0.5 0.5 0.5 0.5 0.5
##$TPOFFS= (0..7)
0 0 0 0 0 0 0 0
##$TUNHIN= 0
##$TUNHOUT= 0
##$TUNXOUT= 0
##$USERA1= <user>
##$USERA2= <user>
##$USERA3= <user>
##$USERA4= <user>
##$USERA5= <user>
##$V9= 5
##$VALIST= <valist>
##$VCLIST= <CCCCCCCCCCCCCCC>
##$VD= 0
##$VDLIST= <DDDDDDDDDDDDDDD>
##$VPLIST= <PPPPPPPPPPPPPPP>
##$VTLIST= <TTTTTTTTTTTTTTT>
##$WBST= 2048
##$WBSW= 25
##$XGAIN= (0..3)
0 0 0 0
##$XL= 0
##$YL= 0
##$YMAX_a= 11399736
##$YMIN_a= -5516889
##$ZGOPTNS= <>
##$ZL1= 120
##$ZL2= 120
##$ZL3= 120
##$ZL4= 120
##$ABSF1= 14.96685
##$ABSF2= -5.58568
##$ABSG= 5
##$ABSL= 3
##$ALPHA= 0
##$AQORDER= 0
##$ASSFAC= 0
##$ASSFACI= 0
##$ASSFACX= 0
##$ASSWID= 0
##$AUNMP= <proc_prof1d_extract.lims>
##$AXLEFT= 0
##$AXNAME= <>
##$AXNUC= <1H>
##$AXRIGHT= 0
##$AXTYPE= 0
##$AXUNIT= <>
##$AZFE= 0.1
##$AZFW= 0.1
##$BCFW= 0
##$BC_mod= 0
##$BYTORDP= 0
##$COROFFS= 0
##$CY= 15
##$DATMOD= 1
##$DC= 0
##$DFILT= <>
##$DTYPP= 0
##$F1P= 0
##$F2P= 0
##$FCOR= 0.5
##$FTSIZE= 131072
##$FT_mod= 6
##$GAMMA= 0
##$GB= 0
##$INTBC= 1
##$INTSCL= 1
##$ISEN= 128
##$LB= 0.3
##$LEV0= 0
##$LPBIN= 0
##$MAXI= 10000
##$MC2= 0
##$MEAN= 0
##$ME_mod= 0
##$MI= 0
##$NCOEF= 0
##$NC_proc= -3
##$NLEV= 6
##$NOISF1= 0
##$NOISF2= 0
##$NSP= 0
##$NTH_PI= 0
##$NZP= 0
##$OFFSET= 14.96685
##$PC= 1
##$PHC0= 39.25415
##$PHC1= 0
##$PH_mod= 1
##$PKNL= yes
##$PPARMOD= 0
##$PPDIAG= 0
##$PPIPTYP= 0
##$PPMPNUM= 2147483647
##$PPRESOL= 1
##$PSCAL= 4
##$PSIGN= 0
##$PYNMP= <proc.py>
##$REVERSE= no
##$SF= 400.130005505707
##$SI= 131072
##$SIGF1= 0
##$SIGF2= 0
##$SINO= 400
##$SIOLD= 131072
##$SPECTYP= <>
##$SREGLST= <1H.CDCl3>
##$SSB= 0
##$STSI= 131072
##$STSR= 0
##$SW_p= 8223.68421052632
##$SYMM= 0
##$S_DEV= 0
##$TDeff= 65536
##$TDoff= 0
##$TI= <>
##$TILT= no
##$TM1= 0
##$TM2= 0
##$TOPLEV= 0
##$USERP1= <user>
##$USERP2= <user>
##$USERP3= <user>
##$USERP4= <user>
##$USERP5= <user>
##$WDW= 1
##$XDIM= 131072
##$YMAX_p= 434598266
##$YMIN_p= -24586
##$CURPLOT= <Network HP LaserJet P1505>
##$CURPRIN= <$Network HP LaserJet P1505>
##$DFORMAT= <normdp>
##$LAYOUT= <+/1D_H.xwp>
##$LFORMAT= <normlp>
##$PFORMAT= <normpl>
##$SURQMSG= 1
$$ End of Bruker specific parameters
$$ ---------------------------------
##NTUPLES= NMR SPECTRUM
##VAR_NAME=  FREQUENCY,     SPECTRUM/REAL,   SPECTRUM/IMAG
##SYMBOL=    X,             R,               I
##VAR_TYPE=  INDEPENDENT,   DEPENDENT,       DEPENDENT
##VAR_FORM=  AFFN,          ASDF,            ASDF
##VAR_DIM=   131072,        131072,          131072
##UNITS=     HZ,            ARBITRARY UNITS, ARBITRARY UNITS
##FACTOR=    0.0627417313425165, 1,          1
##FIRST=     8223.62146879498, -2222,        -105404
##LAST=      0,             -478,            -107023
##MIN=       0,             -24586,          0
##MAX=       8223.62146879498, 434598266,    0
$$ Real data points
##PAGE= N=1
##DATA TABLE= (X++(R..R)), XYDATA
$$ [...]
$$ plain form
63680 378141 381919 386309 390568 394728 399441 404949 410301 413916 415176 415223 415814 417639 420176 422860 425683
63665 425683 428782 432265 436535 441991 448193 454010 458793 462725 465905 468124 469985 473027 477650 481618
63651 481618 481953 478215 472951 468942 466901 465930 465205 464668 464587 465002 465600 465989 466197 466809 468332 470528 472675
63634 472675 474389 475812 477182 478793 481350 485656 491583 497746 502531 505268 506434 507244 509164 513022
63620 513022 517875 521147 520886 518029 515821 516746 520417 524649 528008 530778 533808 537185 540235 542297 543193
63605 543193 543125 542378 541046 538941 535884 532228 528886 526515 524688 522123 517955 512749 508118 505287 504181
63590 504181 504072 504845 507001 510271 513076 514216 514684 516703 520918 525688 529513 533093 538260 545785 555193
63575 555193 565992 577884 590086 601692 612854 624830 638833 655323 674218 695024 716991
$$ packed form
63680C78141L778M390M259M160M713N508N352L615J260M7N91J825K537K684K823
63665D25683L099L483M270N456O202N817M783L932L180K219J861L042M623L968
63651D81618L35l738n264m009k041r71p25n37q1M15N98L89K08O12J523K196K147
63634D72675J714J423J370J611K557M306N927O163M785K737J166Q10J920L858
63620E13022M853L272k61k857k208R25L671M232L359K770L030L377L050K062Q96
63605E43193o8p47j332k105l057l656l342k371j827k565m168n206m631k831j106
63590E04181j09P73K156L270K805J140M68K019M215M770L825L580N167P525R408
63575E55193J0799J1892J2202J1606J1162J1976J4003J6490J8895K0806K1967
$$ plain form
63564 716991 739867 764242 790434 817629 845296 874890 908510 945992 985158 1025197 1067882
63553 1067882 1114665 1164358 1214833 1265532 1316984 1369017 1420874 1472017 1521190 1565419 1601650
63542 1601650 1629119 1648857 1661435 1666700 1665343 1658921 1648295 1633603 1615957 1597482 1579072 1559274
63530 1559274 1535992 1508292 1476091 1439388 1398808 1356201 1313609 1271858 1230762 1190503 1152242
63519 1152242 1117438 1086940 1060747 1038456 1019773 1004404 991546 980300 971146 966266 967249 972745
63507 972745 979681 986873 996133 1009473 1026581 1045837 1066611 1089398 1114378 1141058 1169165 1198993
63495 1198993 1230989 1265628 1303495 1344835 1389267 1436497 1487004 1541174 1597826 1654362 1708293
63484 1708293 1757740 1800416 1833399 1854838 1865421 1867373 1862234 1850318 1832301 1810407 1787466 1765070
$$ packed form
63564G16991K2876K4375K6192K7195K7667K9594L3620L7482L9166M0039M2685
63553A067882M6783M9693N0475N0699N1452N2033N1857N1143M9173M4229L6231
63542A601650K7469J9738J2578N265j357o422j0626j4692j7646j8475j8410j9798
63530A559274k3282k7700l2201l6703m0580m2607m2592m1751m1096m0259l8261
63519A152242l4804l0498k6193k2291j8683j5369j2858j1246r154m880R83N496
63507I72745O936P192R260J3340J7108J9256K0774K2787K4980K6680K8107K9828
63495A198993L1996L4639L7867M1340M4432M7230N0507N4170N6652N6536N3931
63484A708293M9447M2676L2983K1439J0583J952n139j1916j8017k1894k2941k2396
$$ plain form
63472 1765070 1743028 1720310 1695928 1668887 1637959 1602068 1560908 1515052 1465592 1413697 1360232
63461 1360232 1305587 1250145 1195051 1142145 1092755 1046825 1003615 962946 925256 890743 859158
63450 859158 830382 804517 781239 759714 739349 720273 702972 687881 675338 665382 657381 650374
63438 650374 643976 638487 633997 629920 625615 620923 615845 610325 604753 600144 597261 595877 595332 595501 596713
63423 596713 598923 601443 603486 604780 605769 607266 609625 612150 613727 614147 614338 615094 616185 617029 617551 617848
63407 617848 617643 616853 616230 616542 617371 617533 616671 615720 615863 617680 621334 626812 633751 641537 649842 658744
63391 658744 668216 677941 687809 698394 710787 725927 743778 763016 782092 801285 823217 850412
63379 850412 882538 917081 952688 990482 1031703 1075457 1119811 1163947 1207737 1249794 1287886
$$ packed form
63472A765070k2042k2718k4382k7041l0928l5891m1160m5856m9460n1895n3465
63461A360232n4645n5442n5094n2906m9390m5930m3210m0669l7690l4513l1585
63450H59158k8776k5865k3278k1525k0365j9076j7301j5091j2543r956q001p007
63438F50374o398n489m490m077m305m692n078n520n572m609k883j384n45J69J212
63423E96713K210K520K043J294R89J497K359K525J577M20J91P56J091Q44N22K97
63407F17848k05p90o23L12Q29J62q62r51J43J817L654N478O939P786Q305Q902
63391F58744R472R725R868J0585J2393J5140J7851J9238J9076J9193K1932K7195
63379H50412L2126L4543L5607L7794M1221M3754M4354M4136M3790M2057L8092
$$ plain form
63368 1287886 1321813 1354558 1389710 1428382 1469275 1511100 1554118 1599686 1649328 1704188 1764314
63357 1764314 1827963 1892157 1954305 2012889 2066324 2111964 2147058 2170399 2182379 2183924 2176380 2162257
63345 2162257 2144672 2125334 2103721 2078685 2050129 2018564 1983727 1944518 1900092 1850431 1796162
63334 1796162 1738449 1678937 1619195 1560286 1503121 1448838 1398299 1351610 1308702 1269979 1235691
63323 1235691 1205107 1177332 1152823 1133067 1118764 1109304 1104112 1103431 1107365 1115132 1125846 1139348
63311 1139348 1155706 1174661 1196244 1221417 1251290 1285917 1324385 1365838 1409988 1456945 1507126
63300 1507126 1561075 1618694 1678595 1738713 1797592 1854801 1910076 1962345 2009572 2049329 2079599
63289 2079599 2099366 2108743 2108724 2100838 2086743 2067611 2043868 2015917 1985022 1952829 1919807 1884689
$$ packed form
63368A287886L3927L2745L5152L8672M0893M1825M3018M5568M9642N4860O0126
63357A764314O3649O4194O2148N8584N3435M5640L5094K3341J1980J545p544j4123
63345B162257j7585j9338k1613k5036k8556l1565l4837l9209m4426m9661n4269
63334A796162n7713n9512n9742n8909n7165n4283n0539m6689m2908l8723l4288
63323A235691l0584k7775k4509j9756j4303r460n192o81L934P767J0714J3502
63311A139348J6358J8955K1583K5173K9873L4627L8468M1453M4150M6957N0181
63300A507126N3949N7619N9901O0118N8879N7209N5275N2269M7227L9757L0270
63289B079599J9767R377j9p886j4095j9132k3743k7951l0895l2193l3022l5118
$$ plain form
63277 1884689 1845730 1801961 1753120 1699366 1641864 1582970 1524811 1467947 1412249 1358742 1309452
63266 1309452 1265307 1225221 1187647 1152291 1119846 1090597 1063892 1038725 1014242 989660 964090
63255 964090 936804 907851 878313 849601 822385 796497 772030 749907 730807 714002 698148
63244 698148 683051 669707 658546 648691 639367 631091 624713 619866 615292 610398 605618 601208 596510
63231 596510 590789 584306 578064 572604 567410 561646 555308 549420 545068 542333 540289 537947 535086 532257
63217 532257 530182 529186 529082 529582 530738 532713 535052 536651 536944 536864 537986 540822 544580 548547 552892 557888
63201 557888 563239 568686 574615 581361 588471 595426 602692 611143 620623 630057 639137 648961 660683 674252
63187 674252 689008 704962 722826 743048 765374 789177 813770 838588 863620 889608 917251
$$ packed form
63277A884689l8959m3769m8841n3754n7502n8894n8159n6864n5698n3507m9290
63266A309452m4145m0086l7574l5356l2445k9249k6705k5167k4483k4582k5570
63255I64090k7286k8953k9538k8712k7216k5888k4467k2123j9100j6805j5854
63244F98148j5097j3344j1161r855r324q276o378m847m574m894m780m410m698
63231E96510n721o483o242n460n194n764o338n888m352k735k044k342k861k829
63217E32257k075r96j04N00J156J975K339J599K93q0J122K836L758L967M345M996
63201E57888N351N447N929O746P110O955P266Q451R480R434R080R824J1722J3569
63187F74252J4756J5954J7864K0222K2326K3803K4593K4818K5032K5988K7643
$$ plain form
63176 917251 946165 975275 1004481 1035235 1068857 1104671 1140577 1175299 1209204 1242837 1275713
63165 1275713 1307292 1338402 1370591 1404186 1437933 1470680 1502408 1533096 1561456 1585686 1605112
63154 1605112 1620163 1630863 1636361 1636118 1630519 1619688 1602555 1578189 1547786 1514269 1479830 1444824
63142 1444824 1409239 1373981 1339874 1306527 1273658 1243126 1217967 1199167 1184704 1172261 1161674
63131 1161674 1154063 1149804 1148444 1149743 1153555 1159255 1166438 1175660 1187180 1199503 1210769 1221524 1234416
63118 1234416 1250816 1269103 1286652 1302123 1315394 1326871 1337749 1349464 1361611 1371465 1376788 1378134
63106 1378134 1377053 1372982 1363710 1348516 1329054 1307053 1282711 1255781 1226950 1197398 1167677 1137570
63094 1137570 1106776 1075660 1045587 1018243 994087 971798 949996 929063 910322 893830 878334
$$ packed form
63176I17251K8914K9110K9206L0754L3622L5814L5906L4722L3905L3633L2876
63165A275713L1579L1110L2189L3595L3747L2747L1728L0688K8360K4230J9426
63154A605112J5051J0700N498k43n599j0831j7133k4366l0403l3517l4439l5006
63142A444824l5585l5258l4107l3347l2869l0532k5159j8800j4463j2443j0587
63131A161674p611m259j360J299L812N700P183R222J1520J2323J1266J0755J2892
63118A234416J6400J8287J7549J5471J3271J1477J0878J1715J2147R854N323J346
63106A378134j081m071r272j5194j9462k2001k4342k6930k8831k9552k9721l0107
63094A137570l0794l1116l0073k7344k4156k2289k1802k0933j8741j6492j5496
$$ plain form
63083 878334 863368 849994 839165 830626 823929 819273 816658 815175 813889 812615 811184 808828 805206
63070 805206 801368 798755 797663 797486 798029 799756 803022 807909 814633 823315 833246 843001 851443 858350 864247
63055 864247 869906 875828 881756 886825 890578 893722 897587 902950 909611 916862 924020 930722 937016 943110
63041 943110 948838 953630 957245 960212 963287 966724 970335 973943 977479 980903 984240 987399 989858 991101
63027 991101 991654 993056 996350 1001102 1006387 1012148 1019000 1027207 1036509 1046591 1057187 1068216 1080345
63014 1080345 1094700 1111242 1128243 1144528 1161632 1182375 1207612 1235777 1265459 1296754 1329964
63003 1329964 1364781 1401615 1442311 1488438 1539608 1594371 1652031 1712725 1776424 1842923 1912414
62992 1912414 1985007 2059819 2135471 2211550 2288911 2368430 2449993 2532768 2615843 2698378 2779655
$$ packed form
63083H78334j4966j3374j0829q539o697m656k615j483j286j274j431k356l622
63070H05206l838k613j092j77N43J727L266M887O724Q682R931R755Q442O907N897
63055H64247N659N922N928N069L753L144L865N363O661P251P158O702O294O094
63041I43110N728M792L615K967L075L437L611L608L536L424L337L159K459J243
63027I91101N53J402L294M752N285N761O852Q207R302J0082J0596J1029J2129
63014A080345J4355J6542J7001J6285J7104K0743K5237K8165K9682L1295L3210
63003A329964L4817L6834M0696M6127N1170N4763N7660O0694O3699O6499O9491
62992A912414P2593P4812P5652P6079P7361P9519Q1563Q2775Q3075Q2535Q1277
$$ plain form
62981 2779655 2859396 2937957 3015904 3093297 3169349 3242633 3311551 3374714 3431010 3479360 3518381
62970 3518381 3546316 3561500 3563079 3551148 3526008 3487521 3435769 3372299 3299922 3220873 3135894
62959 3135894 3045764 2953058 2861370 2773142 2689325 2610967 2539799 2476924 2422069 2374724 2335074
62948 2335074 2303140 2277848 2257915 2243239 2234526 2231772 2233862 2239617 2248548 2260621 2275878 2294404
62936 2294404 2316065 2339933 2364263 2387363 2408556 2428213 2446832 2464082 2478818 2490043 2497582
62925 2497582 2501383 2500233 2491887 2474878 2449840 2418566 2381982 2339612 2290974 2236858 2178891 2118242
62913 2118242 2055326 1990854 1926586 1864507 1805383 1748716 1694251 1642962 1596091 1553600 1514067
62902 1514067 1475936 1438469 1401840 1366888 1334557 1304927 1276897 1249432 1222856 1198104 1174919
$$ packed form
62981B779655P9741P8561P7947P7393P6052P3284O8918O3163N6296M8350L9021
62970C518381K7935J5184J579j1931k5140l8487n1752o3470p2377p9049q4979
62959C135894r0130r2706r1688q8228q3817p8358p1168o2875n4855m7345l9650
62948B335074l1934k5292j9933j4676q713k754K090N755Q931J2073J5257J8526
62936B294404K1661K3868K4330K3100K1193J9657J8619J7250J4736J1225P539
62925B497582L801j150q346j7009k5038l1274l6584m2370m8638n4116n7967o0649
62913B118242o2916o4472o4268o2079n9124n6667n4465n1289m6871m2491l9533
62902A514067l8131l7467l6629l4952l2331k9630k8030k7465k6576k4752k3185
$$ plain form
62891 1174919 1151925 1128605 1106050 1085290 1065931 1047120 1028929 1011877 995646 979273 962465
62880 962465 946054 931157 918285 907072 896537 885760 874624 863797 853967 845454 838540 833539
62868 833539 830309 828242 826911 826112 825164 823065 819664 815775 811778 807158 801962 797437 794263 791259 787087
62853 787087 782299 778369 775516 772990 770859 769683 768673 766028 761357 756337 752687 750712 749930 749663 748740
62838 748740 746143 742600 740303 740415 741888 743232 744187 744915 744932 743946 742803 742359 742060 740791 738656 736791
62822 736791 735683 734797 733828 733337 733968 735690 737993 740348 742389 744018 745409 746711 747785 748405 748450 747605
62806 747605 745240 741176 736525 733282 732826 734829 737636 739697 740759 741666 742892 743667 743138 742196 743069 746710
62790 746710 751522 755290 757620 759646 762065 764569 766793 768537 769086 767533 764152 760601 758338 757458 757345
$$ packed form
62891A174919k2994k3320k2555k0760j9359j8811j8191j7052j6231j6373j6808
62880I62465j6411j4897j2872j1213j0535j0777j1136j0827r830q513o914n001
62868H33539l230k067j331p99r48k099l401l889l997m620n196m525l174l004m172
62853G87087m788l930k853k526k131j176j010k645m671n020l650j975p82k67r23
62838G48740k597l543k297J12J473J344R55P28J7r86j143m44k99j269k135j865
62822G36791j108q86r69m91O31J722K303K355K041J629J391J302J074O20M5q45
62806G47605k365m064m651l243m56K003K807K061J062R07J226P75n29r42Q73L641
62790G46710M812L768K330K026K419K504K224J744N49j553l381l551k263q80j13
$$ plain form
62775 757345 757732 758695 760219 762349 765256 768642 771476 772980 773691 774968 777597 781343 785807 791072 797424
62760 797424 804885 813165 821708 829700 836522 842422 848382 855090 862442 870425 879977 892304 907503 924443
62746 924443 941975 959690 977606 995897 1015130 1036036 1058671 1082413 1107156 1133901 1163617
62735 1163617 1196133 1230773 1267619 1307420 1350770 1398280 1451149 1510408 1575691 1645812 1720627
62724 1720627 1801186 1887850 1979525 2075407 2176387 2283754 2397021 2513764 2631031 2746073
62714 2746073 2856183 2958900 3052496 3135685 3206870 3264045 3305189 3328299 3331578 3314575 3279122
62703 3279122 3228268 3164202 3087907 3000794 2905463 2804254 2698071 2587718 2475843 2366235
62693 2366235 2261087 2159980 2061906 1967288 1877364 1792499 1712266 1636854 1567138 1503216 1443972
$$ packed form
62775G57345L87R63J524K130K907L386K834J504P11J277K629L746M464N265O352
62760G97424P461Q280Q543P992O822N900N960O708P352P983R552J2327J5199J6940
62746I24443J7532J7715J7916J8291J9233K0906K2635K3742K4743K6745K9716
62735A163617L2516L4640L6846L9801M3350M7510N2869N9259O5283P0121P4815
62724A720627Q0559Q6664R1675R5882J00980J07367J13267J16743J17267J15042
62714B746073J10110J02717R3596Q3189P1185N7175M1144K3110L279j7003l5453
62703C279122n0854o4066p6295q7113r5331j01209j06183j10353j11875j09608
62693B366235j05148j01107r8074r4618q9924q4865q0233p5412o9716o3922n9244
$$ plain form
62682 1443972 1388484 1336889 1289366 1245224 1203802 1165461 1130738 1099313 1070986 1047020 1028790
62671 1028790 1015079 1002378 988396 974133 961989 953012 946714 942435 939829 938735 939578 943500 951091
62658 951091 961218 971926 982483 993993 1008127 1025786 1046851 1070694 1096761 1124963 1155649
62647 1155649 1189360 1226776 1268687 1315419 1366274 1420173 1476853 1536604 1598829 1661978 1725376
62636 1725376 1789913 1856156 1922717 1987328 2048639 2105932 2157835 2202417 2237974 2262774 2274850
62625 2274850 2273354 2259603 2235498 2201458 2157282 2104478 2045973 1983620 1917688 1848832 1778776
62614 1778776 1708751 1638996 1570401 1504992 1443813 1385622 1328736 1273228 1220477 1171562 1127079
62603 1127079 1087648 1053326 1022884 994615 967732 942528 919644 899740 883131 868909 854892
$$ packed form
62682A443972n5488n1595m7523m4142m1422l8341l4723l1425k8327k3966j8230
62671A028790j3711j2701j3982j4263j2144q977o298m279k606j094Q43L922P591
62658I51091J0127J0708J0557J1510J4134J7659K1065K3843K6067K8202L0686
62647A155649L3711L7416M1911M6732N0855N3899N6680N9751O2225O3149O3398
62636A725376O4537O6243O6561O4611O1311N7293N1903M4582L5557K4800J2076
62625B274850j496j3751k4105l4040m4176n2804n8505o2353o5932o8856p0056
62614A778776p0025o9755o8595o5409o1179n8191n6886n5508n2751m8915m4483
62603A127079l9431l4322l0442k8269k6883k5204k2884j9904j6609j4222j4017
$$ plain form
62592 854892 839442 823175 808204 795803 785415 775754 766236 757242 749408 742759 736603 730576 725652
62579 725652 723300 723307 723361 721484 718223 715599 714555 714484 714852 716024 718310 721254 724276 727369 730706 734039
62563 734039 736986 739814 743563 749146 756269 763535 770016 776634 785322 796656 809062 820802 831997
62550 831997 844120 858200 874456 893201 914942 939613 966606 995579 1026538 1059239 1093444
62539 1093444 1129819 1169696 1213595 1260692 1309966 1361190 1414487 1469411 1524700 1578334 1627679
62528 1627679 1670354 1705541 1734031 1756547 1772304 1779432 1776468 1763302 1741231 1712297 1677898 1637704
62516 1637704 1590755 1538219 1484234 1432881 1384707 1337249 1288765 1240270 1193847 1150394 1109779
62505 1109779 1072214 1038317 1008030 980373 954419 929991 907354 886632 867711 850422 834684
$$ packed form
62592H54892j5450j6267j4971j2401j0388r661r518q994p834o649o156o027m924
62579G25652k352PN4j877l261k624j044p1L68J172K286K944L022L093L337L333
62563G34039K947K828L749N583P123P266O481O618Q688J1334J2406J1740J1195
62550H31997J2123J4080J6256J8745K1741K4671K6993K8973L0959L2701L4205
62539A093444L6375L9877M3899M7097M9274N1224N3297N4924N5289N3634M9345
62528A627679M2675L5187K8490K2516J5757P128k964j3166k2071k8934l4399m0194
62516A637704m6949n2536n3985n1353m8174m7458m8484m8495m6423m3453m0615
62505A109779l7565l3897l0287k7657k5954k4428k2637k0722j8921j7289j5738
$$ plain form
62494 834684 820561 808198 797571 788362 780239 773183 767351 762782 759468 757454 756345 754969 752398
62481 752398 749483 748474 750467 753904 756481 758067 760637 765367 771016 775700 779345 783571 789614 797321
62467 797321 806215 816739 829958 846228 864569 883549 902731 923185 946598 974055 1005689 1041095
62455 1041095 1079563 1119964 1161008 1201956 1242929 1284243 1325431 1364984 1401073 1432599 1459642
62444 1459642 1482719 1501565 1514997 1522271 1524109 1521832 1515924 1506367 1494138 1481163 1468516 1455855
62432 1455855 1443236 1432529 1426048 1424315 1426060 1430166 1436840 1447032 1461365 1479594 1500619 1523081
62420 1523081 1546284 1570476 1596093 1623134 1651319 1679958 1706982 1728937 1743097 1749348 1749102 1742693
62408 1742693 1728944 1707198 1678569 1644901 1607420 1566700 1523070 1476641 1427651 1377309 1327773
$$ packed form
62494H34684j4123j2363j0627r209q123p056n832m569l314k014j109j376k571
62481G52398k915j009J993L437K577J586K570M730N649M684L645M226O043P707
62467G97321Q894J0524J3219J6270J8341J8980J9182K0454K3413K7457L1634L5406
62455A041095L8468M0401M1044M0948M0973M1314M1188L9553L6089L1526K7043
62444A459642K3077J8846J3432P274J838k277n908r557j2229j2975j2647j2661
62432A455855j2619j0707o481j733J745M106O674J0192J4333J8229K1025K2462
62420A523081K3203K4192K5617K7041K8185K8639K7024K1955J4160O251k46o409
62408A742693j3749k1746k8629l3668l7481m0720m3630m6429m8990n0342m9536
$$ plain form
62397 1327773 1280885 1237246 1196664 1158904 1123692 1090577 1059364 1030396 1004126 980776 960695
62386 960695 944517 932326 922995 915005 907964 902757 900049 899095 898465 897754 897993 900152 903655 906881 908823
62371 908823 909450 908524 905168 899178 891799 884343 876596 867541 857138 846317 835564 824693 813931
62358 813931 803995 794966 786168 777385 769203 761946 755252 749011 743710 739485 735791 732404 729828 728289
62344 728289 727308 726676 726826 727705 728353 728337 728470 729277 729874 729587 729832 732900 739235 747044 754364 760479 765613
62327 765613 770372 775596 781944 789634 798991 810807 825328 841240 856611 870740 884418 898807
62315 898807 914960 934148 957487 985025 1015812 1048829 1083429 1119389 1157344 1198760 1244568
62304 1244568 1294291 1347472 1405320 1469448 1539364 1612899 1689259 1770013 1856666 1948626 2043845
$$ packed form
62397A327773m6888m3639m0582l7760l5212l3115l1213k8968k6270k3350k0081
62386I60695j6178j2191r331p990p041n207k708r54o30p11K39K159L503L226J942
62371I08823O27r26l356n990p379p456p747r055j0403j0821j0753j0871j0762
62358H13931r936r029q798q783q182p257o694o241n301m225l694l387k576j539
62344G28289r81o32J50Q79O48j6J33Q07N97k87K45L068O335P809P320O115N134
62327G65613M759N224O348P690R357J1816J4521J5912J5371J4129J3678J4389
62315H98807J6153J9188K3339K7538L0787L3017L4600L5960L7955M1416M5808
62304A244568M9723N3181N7848O4128O9916P3535P6360Q0754Q6653R1960R5219
$$ plain form
62293 2043845 2139848 2233478 2321168 2400486 2470395 2529269 2574047 2602641 2616186 2617564 2608286 2588067
62281 2588067 2556945 2516372 2468142 2413259 2352020 2284690 2212175 2136567 2060839 1987418 1917250
62270 1917250 1850606 1788191 1730669 1677562 1627699 1580693 1537013 1496557 1458069 1420245 1382722
62259 1382722 1345690 1309228 1273469 1238930 1206123 1175053 1145539 1117896 1092758 1069982 1048132
62248 1048132 1025664 1002842 981961 965138 952030 940331 928399 916598 905991 896760 888623 881991
62236 881991 877698 875809 875510 876052 877034 877872 877885 877303 877582 880261 885668 892995 901443 911044 922360 935553
62220 935553 949948 964636 979376 994635 1010852 1028160 1046840 1067477 1090356 1115349 1142845
62209 1142845 1174179 1210367 1250729 1293613 1338502 1386820 1440531 1500397 1565622 1634946 1708068
$$ packed form
62293B043845R6003R3630Q7690P9318O9909N8874M4778K8594J3545J378r278k0219
62281B588067l1122m0573m8230n4883o1239o7330p2515p5608p5728p3421p0168
62270A917250o6644o2415n7522n3107m9863m7006m3680m0456l8488l7824l7523
62259A382722l7032l6462l5759l4539l2807l1070k9514k7643k5138k2776k1850
62248A048132k2468k2822k0881j6823j3108j1699j1932j1801j0607r231q137o632
62236H81991m293j889k99N42R82Q38J3n82K79K679N407P327Q448R601J1316J3193
62220I35553J4395J4688J4740J5259J6217J7308J8680K0637K2879K4993K7496
62209A142845L1334L6188M0362M2884M4889M8318N3711N9866O5225O9324P3122
$$ plain form
62198 1708068 1786209 1871058 1962886 2059952 2159948 2261392 2362993 2462208 2555431 2639493 2712178
62187 2712178 2771497 2815666 2844139 2857763 2857447 2843231 2814939 2773144 2719027 2653784 2578601 2494960
62175 2494960 2404671 2309786 2212591 2115450 2020543 1929817 1844760 1765607 1691019 1619485 1551177
62164 1551177 1487789 1430534 1379216 1333244 1292293 1255517 1221430 1189553 1161245 1137770 1118234
62153 1118234 1100612 1084265 1070062 1058224 1047544 1037021 1027080 1018616 1011752 1006099 1001650 998790
62141 998790 997844 999016 1002414 1007663 1013834 1020188 1026832 1034378 1043240 1053511 1065146 1077832 1091040
62128 1091040 1104713 1119716 1136990 1156376 1176813 1197676 1219225 1241660 1264541 1287586 1311390
62117 1311390 1336666 1363181 1390299 1418443 1449238 1484020 1522907 1565581 1612270 1663312 1718136
$$ packed form
62198A708068P8141Q4849R1828R7066R9996J01444J01601R9215R3223Q4062P2685
62187B712178N9319M4169K8473J3624l16j4216k8292m1795n4117o5243p5183q3641
62175B494960r0289r4885r7195r7141r4907r0726q5057p9153p4588p1534o8308
62164A551177o3388n7255n1318m5972m0951l6776l4087l1877k8308k3475j9536
62153A118234j7622j6347j4203j1838j0680j0523r941q464o864n653m449k860
62141I98790r46J172L398N249O171O354O644P546Q862J0271J1635J2686J3208
62128A091040J3673J5003J7274J9386K0437K0863K1549K2435K2881K3045K3804
62117A311390K5276K6515K7118K8144L0795L4782L8887M2674M6689N1042N4824
$$ plain form
62106 1718136 1775440 1834515 1895958 1960810 2029003 2098589 2166342 2229018 2284094 2329548 2363591
62095 2363591 2385322 2395614 2396633 2390098 2376238 2354550 2324981 2288110 2244760 2196001 2143122 2087218
62083 2087218 2029246 1970913 1914749 1862411 1813404 1766554 1722464 1683358 1650471 1622734 1598346
62072 1598346 1576663 1558049 1542605 1529704 1518455 1508323 1499577 1493151 1489644 1488363 1487715 1486373 1483517
62059 1483517 1478324 1470279 1460037 1448958 1437705 1426285 1415383 1406174 1398422 1390277 1380629 1370228
62047 1370228 1359597 1347463 1332717 1316681 1301795 1288932 1277740 1268787 1263284 1260908 1259902 1259505
62035 1259505 1260505 1263120 1266171 1268965 1272365 1277107 1282481 1287904 1294724 1305058 1319207 1335326 1351493
62022 1351493 1367321 1383704 1401733 1422052 1444859 1470280 1498626 1530014 1563850 1599329 1636709
$$ packed form
62106A718136N7304N9075O1443O4852O8193O9586O7753O2676N5076M5454L4043
62095B363591K1731J0292J019o535j3860k1688k9569l6871m3350m8759n2879n5904
62083B087218n7972n8333n6164n2338m9007m6850m4090l9106l2887k7737k4388
62072A598346k1683j8614j5444j2901j1249j0132q746o426l507j281o48j342k856
62059A483517n193q045j0242j1079j1253j1420j0902r209p752q145r648j0401
62047A370228j0631j2134j4746j6036j4886j2863j1192q953n503k376j006l97
62035A259505J000K615L051K794L400M742N374N423O820J0334J4149J6119J6167
62022A351493J5828J6383J8029K0319K2807K5421K8346L1388L3836L5479L7380
$$ plain form
62011 1636709 1677544 1723173 1773186 1825616 1878393 1930529 1982468 2035701 2091597 2149985 2208851
62000 2208851 2265588 2318294 2365794 2406851 2439809 2462878 2474572 2474277 2462810 2442189 2414382 2380212
61988 2380212 2339532 2292126 2238083 2177567 2110913 2039276 1964906 1890443 1817741 1747358 1679180
61977 1679180 1613430 1550863 1492067 1437088 1385980 1339219 1296893 1257849 1220523 1184779 1152175
61966 1152175 1124102 1100104 1078295 1056947 1035429 1014087 993667 974708 957167 940729 925481
61955 925481 911997 900740 891694 884588 879022 874291 869564 864424 859013 853763 849473 847395 848249 850957
61941 850957 853322 854481 855897 859285 864172 868216 869618 868653 867112 866615 867163 867055 864542 859654 853794
61926 853794 847577 840230 831590 823310 816940 811756 805821 798534 790769 783019 775067 767430 761497 757769
$$ packed form
62011A636709M0835M5629N0013N2430N2777N2136N1939N3233N5896N8388N8866
62000B208851N6737N2706M7500M1057L2958K3069J1694k95j1467k0621k7807l4170
61988B380212m0680m7406n4043o0516o6654p1637p4370p4463p2702p0383o8178
61977A679180o5750o2567n8796n4979n1108m6761m2326l9044l7326l5744l2604
61966A152175k8073k3998k1809k1348k1518k1342k0420j8959j7541j6438j5248
61955I25481j3484j1257r046p106n566m731m727n140n411n250m290k078Q54K708
61941H50957K365J159J416L388M887M044J402r65j541m97N48j08k513m888n860
61926H53794o217p347q640q280o370n184n935p287p765p750p952p637n933l728
$$ plain form
61912 757769 755104 752178 748785 745331 741901 738358 734750 731275 728293 726504 726407 727460 728522 729339 730868
61897 730868 733858 737913 742322 746963 751840 756449 760371 764057 768439 774074 781202 790196 801271 813921
61883 813921 827233 840770 854769 869511 884944 901036 918192 936979 957217 977430 995668
61872 995668 1011179 1024975 1038321 1051117 1062356 1071754 1079854 1086664 1091453 1094176 1095940 1097479 1098161
61859 1098161 1097153 1094748 1091832 1088820 1085861 1083488 1082385 1083090 1086345 1092819 1101761 1111031 1119527 1128587
61845 1128587 1139678 1151641 1161912 1169751 1176187 1181067 1182427 1179223 1172723 1164548 1155006 1144156 1132798
61832 1132798 1121240 1108392 1093414 1077250 1061396 1046088 1030951 1016472 1003273 990593 977099
61821 977099 962992 949834 938280 927298 915711 903386 890839 878806 868346 860229 853945 848287
$$ packed form
61912G57769k665k926l393l454l430l543l608l475k982j789r7J053J062Q17J529
61897G30868K990M055M409M641M877M609L922L686M382N635P128Q994J1075J2650
61883H13921J3312J3537J3999J4742J5433J6092J7156J8787K0238K0213J8238
61872I95668J5511J3796J3346J2796J1239R398Q100O810M789K723J764J539O82
61859A098161j008k405k916l012k959k373j103P05L255O474Q942R270Q496R060
61845A128587J1091J1963J0271P839O436M880J360l204o500q175r542j0850j1358
61832A132798j1558j2848j4978j6164j5854j5308j5137j4479j3199j2680j3494
61821I77099j4107j3158j1554j0982j1587j2325j2547j2033j0460q117o284n658
$$ plain form
61809 848287 843134 839646 838480 839023 840872 844790 851271 859069 866320 872786 880144 890318 904118 921148
61795 921148 940322 960600 981778 1004523 1029412 1056272 1084685 1114472 1145091 1175176 1203518
61784 1203518 1230183 1255845 1280243 1302125 1320510 1335151 1345803 1352048 1354073 1352884 1349366 1343773
61772 1343773 1336519 1328969 1322984 1319766 1319244 1320339 1321810 1323236 1325302 1328846 1333628 1338358 1341871 1343734
61758 1343734 1343632 1340801 1334461 1324551 1311799 1297115 1280792 1261989 1239249 1212192 1182701 1153756
61746 1153756 1126951 1101708 1076995 1052955 1030464 1009851 990717 972562 954997 937648 920385
61735 920385 903613 888172 875132 865522 859486 855414 850709 844037 836360 829382 823697 819019 815279
61722 815279 812369 809320 805029 799765 794922 791228 788143 785131 782519 780634 778869 776192 772318 767974
$$ packed form
61809H48287n153l488j166N43J849L918O481P798P251O466P358J0174J3800J7030
61795I21148J9174K0278K1178K2745K4889K6860K8413K9787L0619L0085K8342
61784A203518K6665K5662K4398K1882J8385J4641J0652O245K025j189l518n593
61772A343773p254p550n985l218n22J095J471J426K066L544M782M730L513J863
61758A343734j02k831o340r910j2752j4684j6323j8803k2740k7057k9491k8945
61746A153756k6805k5243k4713k4040k2491k0613j9134j8155j7565j7349j7263
61735I20385j6772j5441j3040r610o036m072m705o672p677o978n685m678l740
61722H15279k910l049m291n264m843l694l085l012k612j885j765k677l874m344
$$ plain form
61708 767974 764226 761727 760375 759541 758710 757915 757454 757371 757452 757590 757875 758573 760290 763728 768731 773891 777741
61691 777741 780106 781619 782247 781255 778615 775464 772892 770985 769237 767162 764337 760607 756524 752905 749773
61676 749773 746585 743701 742484 743322 744569 744497 743562 743625 745386 747792 749891 752045 754894 758051 760530 762128
61660 762128 763771 766385 769730 772540 773850 773953 773878 774099 774166 773585 772501 771333 770222 769098 767834 765952
61644 765952 762588 757252 750493 743555 737651 733680 731931 731478 730303 726848 721371 715285 709472 703886
61630 703886 698583 694110 690636 687362 683262 678024 672026 665700 659249 652874 647023 642375 639417 637843
61616 637843 636473 634074 630355 626064 622259 619716 618789 619331 620621 621697 621870 620850 618619 615635 613117
61601 613117 612558 614595 618576 623328 628145 632835 637102 640222 641512 641089 640039 639599 640153 641296 642831
$$ packed form
61708G67974l748k499j352q34q31p95m61q3Q1J38K85O98J717L438N003N160L850
61691G77741K365J513O28r92k640l151k572j907j748k075k825l730m083l619l132
61676G49773l188k884j217Q38J247p2r35O3J761K406K099K154K849L157K479J598
61660G62128J643K614L345K810J310J03p5K21O7n81j084j168j111j124j264j882
61644G65952l364n336o759o938n904l971j749m53j175l455n477o086n813n586
61630G03886n303m473l474l274m100n238n998o326o451o375n851m648k958j574
61616F37843j370k399l719m291l805k543r27N42J290J076J73j020k231k984k518
61601F13117n59K037L981M752M817M690M267L120J290m23j050m40N54J143J535
$$ plain form
61586 642831 645101 647964 650147 650458 649443 648942 650017 652100 654242 656271 658381 660401 662072 663440 664367
61571 664367 664077 661797 657553 651959 645644 639401 634271 630626 627453 623487 619008 615592 613931 612761
61557 612761 610278 605988 600820 595982 592159 589284 586489 582604 577296 571619 567003 563723 560725 556863
61543 556863 552006 546997 542777 539536 536498 532729 528326 524513 522161 520538 518103 514309 509917 505570
61529 505570 500973 495771 490512 486216 483431 482098 481817 481719 480549 477645 473709 470118 467659 466358 466139
61514 466139 466851 467768 468017 467707 467920 469229 470829 471600 471551 471569 471967 471886 470390 467887 466194 466995 470207 473981
61496 473981 476442 477227 477182 477011 476837 476925 477900 479811 481635 482352 482315 482984 485264 488547 491539 493768 495894
61479 495894 498535 501176 502675 502811 502768 503842 506203 509211 512326 514990 516147 515095 512860 511677 512690
$$ packed form
61586F42831K270K863K183L11j015n01J075K083K142K029K110K020J671J368R27
61571F64367k90k280m244n594o315o243n130l645l173l966m479l416j661j170
61557F12761k483m290n168m838l823k875k795l885n308n677m616l280k998l862
61543E56863m857n009m220l241l038l769m403l813k352j623k435l794m392m347
61529E05570m597n202n259m296k785j333k81r8j170k904l936l591k459j301k19
61514D66139P12R17K49l10K13J309J600P71m9J8L98q1j496k503j693Q01L212L774
61496D73981K461P85m5j71j74Q8R75J911J824P17l7O69K280L283K992K229K126
61479D95894K641K641J499J36m3J074K361L008L115K664J157j052k235j183J013
$$ plain form
61464 512690 514739 515657 514254 510978 507328 504824 503922 503726 503189 502434 502137 501943 500893 499469 499524 501619
61448 501619 504012 505178 505743 506747 507609 507531 507560 509066 511041 511190 509417 507966 508069 508657 508733 508870 509624
61431 509624 510393 510861 511925 514043 515985 516548 516438 517262 519411 521953 523840 524230 522539 519465 517336 518129
61415 518129 521423 525254 528569 531699 534822 537260 538369 538196 537238 536355 536709 538794 541571 543475 544276
61400 544276 544959 545743 545436 543273 540443 539086 540180 542937 545925 548338 550347 552564 555213 557896 560230
61385 560230 562391 564546 566156 566646 566659 567625 569811 571752 572153 571614 571771 573222 575062 576176 576305 575975
61369 575975 575999 577002 578981 581277 583307 585172 587194 589085 590153 590267 590098 590289 590757 590907 590129 588112
61353 588112 585150 582311 580810 580948 581982 583175 584516 586091 587263 587071 585340 582915 580901 579946 580070
$$ packed form
61464E12690K049R18j403l276l650k504r02j96n37p55k97j94j050j424N5K095
61448E01619K393J166N65J004Q62p8K9J506J975J49j773j451J03N88P6J37P54
61431E09624P69M68J064K118J942N63j10Q24K149K542J887L90j691l074k129P93
61415E18129L294L831L315L130L123K438J109j73r58q83L54K085K777J904Q01
61400E44276O83P84l07k163k830j357J094K757K988K413K009K217K649K683K334
61385E60230K161K155J610M90J3R66K186J941M01n39J57J451J840J114J29l30
61369E75975K4J003J979K296K030J865K022J891J068J14j69J91M68J50p78k017
61353E88112k962k839j501J38J034J193J341J575J172j92j731k425k014r55J24
$$ plain form
61338 580070 580623 580503 579019 576738 575124 575244 577086 580024 583320 586040 587221 586738 585707 585584 586957
61323 586957 589501 592754 596412 599951 602550 603675 603727 604078 606275 610761 616256 620905 624338 628000 632859
61308 632859 637469 639365 638288 636893 637994 641958 647173 652225 656874 661468 666327 671634 677257 682559
61294 682559 686881 690505 694879 701538 710692 721038 731067 740404 749586 758678 766763 773083 777992 782066
61280 782066 784851 785611 785129 785514 787897 791354 794539 797354 800301 803205 805553 807390 808771 808813 806545
61265 806545 802600 798967 797082 797006 798283 800328 801906 801774 800530 800649 803693 808419 812766 816943 823070
61250 823070 831987 842016 851295 860063 869861 881351 893841 906472 918936 931065 942417 952327
61238 952327 959937 964349 965392 964225 962514 960904 958797 955618 951547 946889 941657 936195 931377 927479
$$ packed form
61338E80070N53j20j484k281j614J20J842K938L296K720J181m83j031j23J373
61323E86957K544L253L658L539K599J125N2L51K197M486N495M649L433L662M859
61308F32859M610J896j077j395J101L964N215N052M649M594M859N307N623N302
61294F82559M322L624M374O659R154J0346J0029R337R182R092Q085O320M909M074
61280G82066K785P60m82L85K383L457L185K815K947K904K348J837J381M2k268
61265H06545l945l633j885p6J277K045J578j32j244J19L044M726M347M177O127
61250H23070Q917J0029R279Q768R798J1490J2490J2631J2464J2129J1352R910
61238I52327P610M412J043j167j711j610k107l179m071m658n232n462m818l898
$$ plain form
61224 927479 923604 919022 914337 910201 905510 898523 889809 882490 878969 878622 879426 880727 883285 887235 891252
61209 891252 893792 894536 894692 896235 900508 906971 913540 918683 923000 928260 935279 943430 952018 961054 970334
61194 970334 978573 984195 986974 988464 990702 994561 999305 1003501 1006092 1006605 1004934 1001574 997845 995059
61180 995059 993215 991153 988271 985345 983231 981521 979314 976769 974937 974244 974123 974189 974951 977050 980363
61165 980363 984205 988091 992043 996264 1000640 1004669 1008144 1011912 1017399 1025095 1034026 1043097 1052388 1062418
61151 1062418 1072780 1082439 1091004 1098691 1105363 1110906 1116523 1124143 1134030 1144128 1152507 1159612 1167377
61138 1167377 1176944 1188137 1200613 1214389 1229352 1245048 1261060 1277011 1292088 1305065 1315059 1322158
61126 1322158 1327382 1332199 1337826 1344466 1350987 1355658 1357593 1357491 1356808 1356107 1354520 1351122 1346467 1342064 1338243
$$ packed form
61224I27479l875m582m685m136m691o987q714p319l521l47Q04J301K558L950M017
61209H91252K540P44J56J543M273O463O569N143M317N260P019Q151Q588R036R280
61194I70334Q239N622K779J490K238L859M744M196K591N13j671l360l729k786
61180I95059j844k062k882k926k114j710k207k545j832o93j21O6P62K099L313
61165I80363L842L886L952M221M376M029L475L768N487P696Q931R071R291J0030
61151A062418J0362R659Q565P687O672N543N617P620R887J0098Q379P105P765
61138A167377R567J1193J2476J3776J4963J5696J6012J5951J5077J2977R994P099
61126A322158N224M817N627O640O521M671J935j02o83p01j587l398m655m403l821
$$ plain form
61111 1338243 1333459 1326297 1317369 1308323 1299487 1289672 1278133 1265507 1252602 1239398 1225709 1211865
61099 1211865 1198107 1183999 1169110 1153870 1139185 1125475 1112457 1099621 1086838 1074897 1065370
61088 1065370 1059197 1055308 1051463 1046633 1041433 1036053 1029222 1020265 1010871 1003377 998066 993570 989315 985954
61074 985954 983669 981821 980515 981071 984459 990346 998031 1007227 1017510 1028243 1039785 1053813 1071407
61061 1071407 1091479 1112082 1132941 1155720 1181817 1210670 1240477 1270125 1300104 1331563 1364614
61050 1364614 1397803 1429643 1460467 1492087 1525342 1558658 1589505 1616746 1640835 1662202 1680434
61039 1680434 1694989 1705714 1712290 1714030 1710895 1704230 1695683 1685551 1672846 1657033 1638970 1619869
61027 1619869 1600030 1579133 1557293 1535017 1512316 1488862 1465188 1442883 1423061 1405303 1388785
$$ packed form
61111A338243m784p162q928r046q836r815j1539j2626j2905j3204j3689j3844
61099A211865j3758j4108j4889j5240j4685j3710j3018j2836j2783j1941r527
61088A065370o173l889l845m830n200n380o831q957r394p494n311m496m255l361
61074I85954k285j848j306N56L388N887P685R196J0283J0733J1542J4028J7594
61061A071407K0072K0603K0859K2779K6097K8853K9807K9648K9979L1459L3051
61050A364614L3189L1840L0824L1620L3255L3316L0847K7241K4089K1367J8232
61039A680434J4555J0725O576J740l135o665q547j0132j2705j5813j8063j9101
61027A619869j9839k0897k1840k2276k2701k3454k3674k2305j9822j7758j6518
$$ plain form
61016 1388785 1373923 1362010 1353396 1346915 1341284 1336420 1333187 1332363 1334102 1338051 1343735 1351056 1360482 1372505
61002 1372505 1386981 1403419 1421804 1442583 1465787 1490882 1517766 1547262 1580213 1616506 1655431
60991 1655431 1696598 1740101 1786194 1835316 1888262 1945906 2008795 2077050 2150278 2227565 2308292
60980 2308292 2393292 2484330 2581833 2684038 2789320 2898556 3013923 3136006 3263773 3397113
60970 3397113 3537532 3686040 3842306 4006797 4182198 4371516 4576036 4796537 5035567
60961 5035567 5296936 5583638 5898227 6245531 6633866 7073275 7573084 8140611 8781032
60952 8781032 9498694 10299932 11194870 12196001 13316147 14569830 15975497 17551076 19301319
60943 19301319 21204000 23200415 25189340 27028181 28556064 29646317 30265496 30495600
$$ packed form
61016A388785j4862j1913q614o481n631m864l233q24J739L949N684P321R426J2023
61002A372505J4476J6438J8385K0779K3204K5095K6884K9496L2951L6293L8925
60991A655431M1167M3503M6093M9122N2946N7644O2889O8255P3228P7287Q0727
60980B308292Q5000R1038R7503J02205J05282J09236J15367J22083J27767J33340
60970C397113J40419J48508J56266J64491J75401J89318K04520K20501K39030
60961E035567K61369K86702L14589L47304L88335M39409M99809N67527O40421
60952H781032P17662Q01238Q94938J001131J120146J253683J405667J575579J750243
60943A9301319J902681J996415J988925J838841J527883J090253O19179K30104
$$ plain form
60935 30495600 30496828 30434714 30418900 30478994 30567072 30569024 30328064 29693848 28587183 27040925
60925 27040925 25184829 23185480 21185693 19277293 17505684 15885371 14413499 13080437
60917 13080437 11876990 10795671 9828042 8963937 8193714 7509254 6902186 6362946 5882469
60908 5882469 5453568 5070063 4725959 4416295 4137626 3886753 3659977 3454383 3268779
60899 3268779 3102220 2952370 2816250 2691866 2578025 2473040 2374709 2281499 2193179 2110507
60889 2110507 2034547 1965505 1901717 1840657 1781682 1726782 1677646 1632964 1590035 1548207 1508964
60878 1508964 1472960 1438820 1405085 1371727 1339265 1307772 1277378 1248672 1221909 1196688 1172918
60867 1172918 1151228 1131652 1112706 1092666 1071569 1051370 1034228 1020884 1010350 1000770 990789 980338
$$ packed form
60935C0495600J228o2114j5814O0094Q8078J952k40960o34216j106665j546258
60925B7040925j856096j999349j999787j908400j771609j620313j471872j333062
60917A3080437j203447j081319r67629q64105p70223o84460o07068n39240m80477
60908E882469m28901l83505l44104l09664k78669k50873k26776k05594j85604
60899C268779j66559j49850j36120j24384j13841j04985r8331r3210q8320q2672
60889B110507p5960o9042o3788o1060n8975n4900m9136m4682m2929m1828l9243
60878A508964l6004l4140l3735l3358l2462l1493l0394k8706k6763k5221k3770
60867A172918k1690j9576j8946k0040k1097k0199j7142j3344j0534r580r981j0451
$$ plain form
60855 980338 970138 960659 952015 944591 938904 934663 930859 927145 924427 923568 924144 925017 925634 926147 926641
60840 926641 926954 927111 927355 927670 927585 926454 923864 920059 916018 912759 910346 907905 904610 900076 893668 884479
60824 884479 872663 860000 848130 836717 824478 811762 800728 792640 786137 778865 770127 761193
60812 761193 753497 747358 742282 737642 732851 727534 722046 717589 715325 715313 716511 717729 718291 717865 716337
60797 716337 714320 713350 714866 718833 723786 728305 732016 735089 737388 738610 739001 739394 740510 742493 745072
60782 745072 747853 750356 752016 752427 751640 750164 748541 746881 744883 742337 739481 736819 734751 733429 732652
60767 732652 731740 729838 726762 723286 720295 717919 715898 714231 712724 710287 705890 700300 695728 693355
60753 693355 692046 689946 686419 681878 676582 670456 663531 655790 647018 637493 628397 620820 614699 609384
$$ packed form
60855I80338j0200r479q644p424n687m241l804l714k718q59N76Q73O17N13M94
60840I26641L13J57K44L15q5j131k590l805m041l259k413k441l295m534o408r189
60824H84479j1816j2663j1870j1413j2239j2716j1034q088o503p272q738q934
60812G61193p696o139n076m640m791n317n488m457k264j2J198J218N62m26j528
60797G16337k017r70J516L967M953M519L711L073K299J222L91L93J116J983K579
60782G45072K781K503J660M11p87j476j623j660j998k546k856k662k068j322p77
60767G32652r12j902l076l476k991k376k021j667j507k437m397n590m572k373
60753F93355j309k100l527m541n296o126o925p741q772r525r096p577o121n315
$$ plain form
60739 609384 604814 601325 598716 596462 594726 594224 594939 595618 594675 591273 585850 580096 576028 574289 573536
60724 573536 572180 570356 569292 569137 568811 568062 568192 570207 573317 576076 578225 580652 583999 587959 591588
60709 591588 593869 594371 593902 594218 596565 600570 604752 607959 610204 612369 615231 618513 620958 621647 621082
60694 621082 620431 619968 619077 617616 616195 614966 613373 611497 610409 610528 610781 610254 609534 609275 608477 605677
60678 605677 601181 596530 592076 586678 579760 572180 564832 557764 551039 545253 540645 536746 533457 531456
60664 531456 530799 530072 527947 525077 523498 524346 526851 529391 530902 531260 530913 530368 529808 529161 528540 528339 528722
60647 528722 529288 529602 529825 530458 531583 532828 534190 536457 540446 545912 551592 556552 561221 566680 573059
60632 573059 579225 584265 588642 593337 598376 602918 606512 609428 611894 613843 615462 617137 618732 619732
$$ packed form
60739F09384m570l489k609k254j736n02P15O79r43l402n423n754m068j739p53
60724E73536j356j824j064j55l26p49J30K015L110K759K149K427L347L960L629
60709E91588K281N02m69L16K347M005M182L207K245K165K862L282K445O89n65
60694F21082o51m63q91j461j421j229j593j876j088J19K53n27p20k59p98k800
60678F05677m496m651m454n398o918p580p348p068o725n786m608l899l289k001
60664E31456o57p27k125k870j579Q48K505K540J511L58l47n45n60o47o21k01L83
60647E28722N66L14K23O33J125J245J362K267L989N466N680M960M669N459O379
60632E73059O166N040M377M695N039M542L594K916K466J949J619J675J595J000
$$ plain form
60618 619732 620233 620843 621350 620632 618489 616445 615795 615678 614271 611267 607892 604831 601582 597874 594281 591011
60602 591011 587381 583351 580542 580502 582386 583508 582317 579937 578510 578817 580053 581360 582680 584224 585935
60587 585935 587767 589746 591329 591389 589666 587763 587572 588761 588921 586500 582570 579186 576993 575211 573127
60572 573127 570569 567477 564184 561920 561850 563495 564922 564669 562826 560216 557441 555012 553650 553864 555564
60557 555564 558359 561860 565497 568417 569960 570197 569972 570499 572593 575755 578153 578143 576008 573719 572928 573680
60541 573680 575113 576708 578556 580923 583967 587577 591261 594468 597206 600139 603995 609002 614584 619240
60527 619240 621258 620418 618713 618355 619300 620098 621006 624287 630783 638169 644087 649417 656593 665793 675148
60512 675148 684258 695020 708546 723366 737558 750973 764218 776825 787914 797875 807754 817092
$$ packed form
60618F19732N01O10N07p18k143k044o50j17j407l004l375l061l249l708l593l270
60602E91011l630m030k809m0J884J122j191k380j427L07J236J307J320J544J711
60587E85935J832J979J583O0j723j903j91J189J60k421l930l384k193j782k084
60572E73127k558l092l293k264p0J645J427k53j843k610k775k429j362K14J700
60557E55564K795L501L637K920J543K37k25N27K094L162K398j0k135k289p91P52
60541E73680J433J595J848K367L044L610L684L207K738K933L856N007N582M656
60527F19240K018q40j705l58R45P98R08L281O496P386N918N330P176R200R355
60512F75148R110J0762J3526J4820J4192J3415J3245J2607J1089R961R879R338
$$ plain form
60500 817092 823608 825303 822160 815731 807929 800573 795299 793035 793461 795338 797541 799797 802578 806557
60486 806557 812252 819992 830009 842487 857503 874877 894010 913957 933843 953310 972466 991377
60474 991377 1009591 1026059 1039499 1049082 1055054 1058524 1060356 1060335 1057753 1052608 1045732 1037900 1029486 1021030
60460 1021030 1013341 1006776 1001152 996688 994351 994728 997265 1001232 1006785 1014363 1023637 1034079 1046282 1061738
60446 1061738 1081250 1104283 1129868 1157666 1188272 1223051 1263375 1309337 1359305 1411274 1464278
60435 1464278 1517783 1570217 1619393 1664308 1705215 1741488 1770435 1788823 1795027 1789396 1773183 1747437
60423 1747437 1712474 1668206 1615475 1557048 1496529 1436100 1375993 1316185 1257716 1202109 1150488
60412 1150488 1103685 1062247 1025722 992624 961738 932968 906582 882366 859988 839434 820542
$$ packed form
60500H17092O516J695l143o429p802p356n274k264M26J877K203K256K781L979
60486H06557N695P740J0017J2478J5016J7374J9133J9947J9886J9467J9156J8911
60474I91377J8214J6468J3440R583N972L470J832k1k582n145o876p832q414q456
60460A021030p689o565n624m464k337L77K537L967N553P578R274J0442J2203J5456
60446A061738J9512K3033K5585K7798L0606L4779M0324M5962M9968N1969N3004
60435A464278N3505N2434M9176M4915M0907L6273K8947J8388O204n631j6213k5746
60423A747437l4963m4268n2731n8427o0519o0429o0107n9808n8469n5607n1621
60412A150488m6803m1438l6525l3098l0886k8770k6386k4216k2378k0554j8892
$$ plain form
60401 820542 802824 786289 771651 759131 747911 737573 729168 723698 720134 716158 710563 703798 696429
60388 696429 688330 679609 671283 664531 659676 656053 652575 648500 643968 639729 636214 633238 630729 628939
60374 628939 627483 625178 621745 618830 618101 618983 619589 619337 619062 618922 618128 616900 616696 617839 618590 617589
60358 617589 615889 615523 617135 619997 623264 626063 627335 627098 627237 629598 633583 636956 638726 639859 641265
60343 641265 642668 643814 645302 647519 649827 651681 653709 656807 660764 664688 668298 671823 674935 676917
60329 676917 677990 679453 682144 685465 688429 691079 694250 698257 702437 705967 708725 711351 714755 719466
60315 719466 725177 730962 736146 740777 744991 748266 749981 750678 752075 755469 760474 765566 769535 772155
60301 772155 773759 774670 775135 775663 777150 780376 785285 791122 797558 805138 814028 822757 829227 832954 835435
$$ packed form
60401H20542j7718j6535j4638j2520j1220j0338q405n470l564l976n595o765p369
60388F96429q099q721q326o752m855l623l478m075m532m239l515k976k509j790
60374F28939j456k305l433k915p29Q82O06k52k75j40p94j228k04J143P51j001
60358F17589j700l66J612K862L267K799J272k37J39K361L985L373J770J133J406
60343F41265J403J146J488K217K308J854K028L098L957L924L610L525L112J982
60329F76917J073J463K691L321K964K650L171M007M180L530K758K626L404M711
60315G19466N711N785N184M631M214L275J715O97J397L394N005N092L969K620
60301G72155J604R11M65N28J487L226M909N837O436P580Q890Q729O470L727K481
$$ plain form
60286 835435 838233 841613 845063 847961 849371 848444 845711 842947 841064 839141 836330 833395 831208 828895
60272 828895 825072 820106 815464 811393 807104 802880 800026 798692 797665 796556 796290 796945 797152 796656 797684
60257 797684 802304 809599 816946 823264 829591 837065 845811 855659 866723 878985 892002 905204 918217
60244 918217 930965 943477 955144 964144 968509 968205 965314 961606 956794 949842 940896 930757 919238
60231 919238 905669 890848 877096 866155 857900 851223 845261 839649 834405 829862 826251 823313 820825
60218 820825 819300 819408 820709 821766 821642 820577 819070 817036 814220 810806 807169 803351 799171 794745 790766
60203 790766 788245 787724 788435 788505 786573 783102 779724 777476 776270 775849 776284 777345 778258 778611 778985 780173
60187 780173 782027 783513 783828 783255 782962 784039 786603 789756 792399 794004 794667 794902 795575 797515 800642 803810
$$ packed form
60286H35435K798L380L450K898J410r27k733k764j883j923k811k935k187k313
60272H28895l823m966m642m071m289m224k854j334j027j109k66O55K07m96J028
60257G97684M620P295P347O318O327P474Q746R848J1064J2262J3017J3202J3013
60244I18217J2748J2512J1667R000M365l04k891l708m812o952q946j0139j1519
60231I19238j3569j4821j3752j0941q255o677n962n612n244m543l611k938k488
60218H20825j525J08J301J057j24j065j507k034k816l414l637l818m180m426l979
60203G90766k521n21P11P0j932l471l378k248j206m21M35J061R13L53L74J188
60187G80173J854J486L15n73k93J077K564L153K643J605O63K35O73J940L127L168
$$ plain form
60171 803810 806011 807376 808522 809512 810305 811697 814573 818386 821654 824117 827191 831970 837890 843751 849051
60156 849051 853836 858331 863332 869911 877975 886128 893811 902472 913389 925166 935070 942570 950001 959537
60142 959537 970772 981727 991254 999778 1008228 1016779 1024543 1030394 1034302 1037668 1041820 1046317 1049494 1050739
60128 1050739 1051455 1053276 1055901 1057271 1055610 1050739 1043494 1034513 1024087 1013030 1003078 995824 991127 986977
60114 986977 981201 973286 964526 956747 951042 947347 944704 942055 939016 935779 932188 927509 921483 915088
60100 915088 909659 905624 902800 901467 902065 903947 905524 905900 905559 905280 905380 906287 908747 912689 916675 919297
60084 919297 920579 921309 921711 921822 922705 925928 931658 938364 944734 951059 958258 966264 974087 981154 987937
60069 987937 995277 1003401 1011613 1018734 1023931 1027347 1029910 1032472 1035215 1037894 1040349 1042561 1044512 1046425
$$ packed form
60171H03810K201J365J146R90P93J392K876L813L268K463L074M779N920N861N300
60156H49051M785M495N001O579Q064Q153P683Q661J0917J1777R904P500P431R536
60142I59537J1235J0955R527Q524Q450Q551P764N851L908L366M152M497L177J245
60128A050739P16J821K625J370j661m871p245q981j0426j1057r952p254m697m150
60114I86977n776p915q760p779n705l695k643k649l039l237l591m679o026o395
60100I15088n429m035k824j333N98J882J577L76l41k79J00R07K460L942L986K622
60084I19297J282P30M02J11Q83L223N730O706O370O325P199Q006P823P067O783
60069I87937P340Q124Q212P121N197L416K563K562K743K679K455K212J951J913
$$ plain form
60055 1046425 1049023 1053060 1058368 1063711 1067816 1070394 1071988 1073128 1073972 1074624 1075242 1075598 1074930 1072605 1068836
60040 1068836 1064479 1060229 1056299 1052765 1049665 1046505 1042112 1035639 1027795 1020623 1015658 1012496 1009508 1005860
60026 1005860 1002257 999604 997580 995260 992776 991337 991356 991463 990097 987405 984648 982027 978213 972222 964712
60011 964712 956890 948918 940256 931140 922636 915047 906989 896634 883733 870099 858135 849050 842489
59998 842489 837559 833791 830980 828542 825570 821630 817197 813223 810532 809664 810930 814316 819486 825903
59984 825903 832718 838602 842417 844443 846507 850299 855826 861872 867556 872707 877006 879840 881299 882543
59970 882543 884555 886877 888060 887167 884473 880824 876729 872109 866550 859599 851051 841306 831408 822386
59956 822386 814293 806138 797110 787686 778957 770964 762478 752753 742713 733800 726264 719411 713097 708017
$$ packed form
60055A046425K598M037N308N343M105K578J594J140Q44O52O18L56o68k325l769
60040A068836m357m250l930l534l100l160m393o473p844p172m965l162k988l648
60026A005860l603k653k024k320k484j439J9J07j366k692k757k621l814n991p510
60011I64712p822p972q662r116q504p589q058j0355j2901j3634j1964r085o561
59998H42489m930l768k811k438k972l940m433l974k691q68J266L386N170O417
59984H25903O815N884L815K026K064L792N527O046N684N151M299K834J459J244
59970H82543K012K322J183q93k694l649m095m620n559o951q548r745r898r022
59956H22386q093q155r028r424q729p993q486r725j0040q913p536o853o314n080
$$ plain form
59942 708017 704606 702561 701445 700911 700333 699119 697598 696676 696413 695886 694824 694376 695697 698672 702728 707976
59926 707976 714552 721484 727288 731356 733912 735125 735414 736219 739039 743362 746654 746863 744290 740767 737766
59911 737766 735645 733971 732063 729645 727359 726247 726484 727141 727548 728368 730767 734704 738528 740255 739118
59896 739118 736101 733181 731854 732156 733075 733846 734468 735076 735409 735284 735142 735575 736473 737040 736730 735933 735665 736631
59878 736631 738601 740710 742362 743640 744667 744972 744089 742659 742198 743628 746633 750628 755605 761585 767901
59863 767901 773759 779128 784481 789866 794748 798570 801026 802065 802152 802297 803155 804221 804476 803793 803105 803246
59847 803246 804309 806246 809383 813956 819593 825649 831804 838011 844031 849323 853390 856121 857926 859532
59833 859532 861542 864152 867386 871425 876465 882388 889018 896679 905918 916395 926483 934463 940107 944931
$$ packed form
59942G08017l411k045j116n34n78j214j521r22k63n27j062m48J321K975M056N248
59926G07976O576O932N804M068K556J213K89Q05K820M323L292K09k573l523l001
59911G37766k121j674j908k418k286j112K37O57M07Q20K399L937L824J727j137
59896G39118l017k920j327L02R19P71O22O08L33j25j42M33Q98N67l10p97k68R66
59878G36631J970K109J652J278J027L05q83j430m61J430L005L995M977N980O316
59863G67901N858N369N353N385M882L822K456J039Q7J45Q58J066K55o83o88J41
59847H03246J063J937L137M573N637O056O155O207O020N292M067K731J805J606
59833H59532K010K610L234M039N040N923O630P661R239J0477J0088P980N644M824
$$ plain form
59819 944931 950895 958877 968105 976854 983827 989047 993335 996957 998998 998275 994677 989490 984572 981245
59805 981245 979631 978739 977374 975299 973448 972855 973575 974928 976588 978947 982466 987148 992772 999152 1005844
59790 1005844 1011940 1016461 1018851 1018946 1016858 1013360 1010111 1008788 1009650 1011232 1011518 1009192 1003938 996332 987789
59775 987789 979920 973137 966201 957879 948858 941156 935613 930937 925609 919908 915346 912607 910874 908869
59761 908869 905878 901888 897486 893617 890772 888274 884929 880431 875451 870206 863845 855887 847681 841519
59747 841519 838345 836980 835610 833464 830877 828366 826166 824410 823137 821921 819876 816432 812147 808452
59733 808452 806394 805735 805422 804840 804325 804527 805608 807159 808441 808436 806116 801394 795931 792379 792357 795290 799402
59716 799402 803453 807062 809701 810354 808660 805903 804228 804891 807575 811214 814933 818251 821050 823783 827342
$$ packed form
59819I44931N964P982R228Q749O973N220M288L622K041p23l598n187m918l327
59805I81245j614q92j365k075j851n93P20J353J660K359L519M682N624O380O692
59790A005844O096M521K390R5k088l498l249j323Q62J582K86k326n254p606q543
59775I87789p869o783o936q322r021p702n543m676n328n701m562k739j733k005
59761I08869k991l990m402l869k845k498l345m498m980n245o361p958q206o162
59747H41519l174j365j370k146k587k511k200j756j273j216k045l444m285l695
59733H08452k058o59l13n82n15K02J081J551J282nk320m722n463l552k2K933M112
59716G99402M051L609K639O53j694k757j675O63K684L639L719L318K799K733L559
$$ plain form
59701 827342 832350 838692 845894 853630 861522 868706 874121 877379 879224 881227 885071 891705 900765 910980
59687 910980 921491 932503 944180 955332 964244 970911 977452 985719 995160 1003666 1010006 1014610 1018235
59674 1018235 1020844 1022020 1021863 1021104 1020587 1020837 1021867 1023187 1024081 1023958 1022444 1019385 1015083 1010469 1006557
59659 1006557 1003563 1000799 997593 994057 990878 988615 987361 986702 985785 983728 980370 976557 973461 971677
59645 971677 971120 971424 972043 972168 971194 969415 967928 967721 968998 971291 973849 975975 977559 979424 982638 987191
59629 987191 991767 995109 997144 998353 998596 997342 994917 992661 991589 991422 991163 990231 988672 986554 983620
59614 983620 979604 974601 968936 962735 955959 949033 943123 939145 936464 933265 928625 923546 919473 916523
59600 916523 914084 912582 913265 916274 920215 923933 927545 931270 934476 936741 938880 941755 944640 945798
$$ packed form
59701H27342N008O342P202P736P892P184N415L258J845K003L844O634R060J0215
59687I10980J0511J1012J1677J1152Q912O667O541Q267R441Q506O340M604L625
59674A018235K609J176j57p59n17K50J030J320Q94j23j514l059m302m614l912
59659A006557k994k764l206l536l179k263j254o59r17k057l358l813l096j784
59645I71677n57L04O19J25r74j779j487k07J277K293K558K126J584J865L214M553
59629I87191M576L342K035J209K43j254k425k256j072j67k59r32j559k118k934
59614I83620m016n003n665o201o776o926n910l978k681l199m640n079m073k950
59600I16523k439j502O83L009L941L718L612L725L206K265K139K875K885J158
$$ plain form
59586 945798 944466 941414 937826 934524 932129 930945 930481 929645 927538 923706 917999 910973 904239 899375 896279
59571 896279 893373 889601 885475 881865 878649 875121 871181 867472 864587 862543 860820 858706 855961 853281
59557 853281 851572 850395 847790 842362 835174 828785 824603 822004 820038 818956 819496 821445 823789 826046
59543 826046 828561 831344 833428 833861 832875 831501 830372 829516 829027 829074 829271 829065 829053 830826 834706 838459 839473
59526 839473 837866 836254 836389 837182 836434 833571 830024 827414 826129 825416 824319 822397 819869 817216 814709
59511 814709 812414 810505 809253 808591 807977 806875 805327 804060 803998 805500 807859 809809 810742 811168 811696 812069
59495 812069 811910 812100 814370 819265 825344 830823 835519 840653 847105 854415 861509 868167 875560 885230 897490
59480 897490 911161 925061 939276 954495 970457 985692 998382 1006841 1009754 1007271 1001805 996542
$$ packed form
59586I45798j332l052l588l302k395j184m64q36k107l832n707p026o734m864l096
59571H96279k906l772m126l610l216l528l940l709k885k044j723k114k745k680
59557H53281j709j177k605n428p188o389m182k599j966j082N40J949K344K257
59543H26046K515K783K084M33r86j374j129q56m89M7J97k06j2J773L880L753J014
59526H39473j607j612J35P93p48k863l547k610j285p13j097j922k528k653k507
59511H14709k295j909j252o62o14j102j548j267o2J502K359J950R33M26N28L73
59495H12069j59J90K270M895O079N479M696N134O452P310P094O658P393R670J2260
59480H97490J3671J3900J4215J5219J5962J5235J2690Q459K913k483n466n263
$$ plain form
59468 996542 992863 990048 987285 984625 981954 978813 975871 974920 976463 978724 980136 981394 983601 985742
59454 985742 985833 983721 980755 977229 972186 965583 958545 951271 942721 933022 924297 918058 913183 907695 901463
59439 901463 895863 891508 887653 883524 879113 874743 870769 867710 865920 865038 864393 864034 864762 866953 869853
59424 869853 872358 874168 875872 878188 881488 885875 891217 896919 902061 906106 909368 912587 916226 920390
59410 920390 925048 929770 933537 935645 936895 939002 942558 946404 949427 952023 955132 958703 962200 966022
59396 966022 971173 977812 985186 992791 1000379 1006989 1011450 1014259 1017700 1023423 1030773 1038075 1044580 1050272
59382 1050272 1054532 1056160 1054682 1050914 1046190 1041445 1036968 1032673 1028545 1024911 1022097 1019857 1017542 1014950
59368 1014950 1012589 1011028 1010614 1012103 1016845 1025723 1038225 1053010 1068994 1085526 1102223 1119484 1138848
$$ packed form
59468I96542l679k815k763k660k671l141k942r51J543K261J412J258K207K141
59454I85742R1k112k966l526n043o603p038p274q550r699q725o239m875n488o232
59439I01463n600m355l855m129m411m370l974l059j790q82o45l59P28K191K900
59424H69853K505J810J704K316L300M387N342N702N142M045L262L219L639M164
59410I20390M658M722L767K108J250K107L556L846L023K596L109L571L497L822
59396I66022N151O639P374P605P588O610M461K809L441N723P350P302O505N692
59382A050272M260J628j478l768m724m745m477m295m128l634k814k240k315k592
59368A014950k361j561m14J489M742Q878J2502J4785J5984J6532J6697J7261J9364
$$ plain form
59355 1138848 1161893 1188732 1218300 1249987 1283995 1319541 1353346 1380558 1397384 1402903 1398969 1388853
59343 1388853 1375880 1362769 1351735 1344731 1343263 1347685 1356513 1366284 1372264 1370058 1357582 1336101 1309333
59330 1309333 1281273 1254491 1229958 1207796 1187857 1169914 1153899 1140197 1129447 1121781 1116355 1111952
59318 1111952 1108070 1105145 1103566 1102908 1102527 1102689 1104428 1108085 1112466 1115899 1117953 1119708 1122304 1125581 1128244
59303 1128244 1129143 1128196 1126236 1124339 1123337 1123660 1125354 1128360 1132915 1139563 1148514 1159146 1170506 1182258
59289 1182258 1194755 1208210 1222275 1236509 1250746 1264982 1279577 1295703 1314484 1334938 1353638
59278 1353638 1367707 1377855 1387341 1398015 1408512 1416323 1420273 1420475 1417107 1410344 1400916 1389813 1377552
59265 1377552 1364326 1350561 1336687 1322521 1307539 1291849 1276405 1262160 1249289 1237380 1226131
$$ packed form
59355A138848K3045K6839K9568L1687L4008L5546L3805K7212J6826N519l934j0116
59343A388853j2973j3111j1034p004j468M422Q828R771N980k206j2476k1481k6768
59330A309333k8060k6782k4533k2162j9939j7943j6015j3702j0750p666n426m403
59318A111952l882k925j579o58l81J62J739L657M381L433K054J755K596L277K663
59303A128244Q99r47j960j897j002L23J694L006M555O648Q951J0632J1360J1752
59289A182258J2497J3455J4065J4234J4237J4236J4595J6126J8781K0454J8700
59278A353638J4069J0148R486J0674J0497P811L950K02l368o763r428j1103j2261
59265A377552j3226j3765j3874j4166j4982j5690j5444j4245j2871j1909j1249
$$ plain form
59254 1226131 1215699 1206472 1198700 1192421 1187574 1183860 1180551 1177040 1173976 1173221 1175742 1179711 1181670 1179700
59240 1179700 1174553 1167485 1158168 1145470 1129404 1111315 1092700 1074836 1059086 1046340 1036021 1026650
59228 1026650 1017653 1009926 1004378 1000728 998148 996486 996174 997213 998904 1000679 1002769 1005885 1010415 1016119
59214 1016119 1022563 1029716 1038029 1048060 1060186 1074605 1091168 1108877 1125902 1140712 1153417 1165577
59202 1165577 1178374 1191108 1201787 1209010 1212934 1214481 1214230 1212448 1209777 1207116 1204680 1201665 1197228
59189 1197228 1191675 1186463 1183103 1182080 1182577 1183179 1183083 1182816 1183648 1186284 1190405 1195307 1200286 1204380 1206773
59174 1206773 1208106 1210530 1215529 1222215 1228651 1234168 1239117 1242844 1243682 1241200 1236963 1232523 1227810 1222009
59160 1222009 1214779 1205888 1194838 1181959 1169016 1157664 1147762 1138184 1128793 1120534 1113771 1107583 1100809
$$ packed form
59254A226131j0432r227p772o279m847l714l309l511l064p55K521L969J959j970
59240A179700n147p068r317j2698j6066j8089j8615j7864j5750j2746j0319r371
59228A026650q997p727n548l650k580j662l12J039J691J775K090L116M530N704
59214A016119O444P153Q313J0031J2126J4419J6563J7709J7025J4810J2705J2160
59202A165577J2797J2734J0679P223L924J547k51j782k671k661k436l015m437
59189A197228n553n212l360j023M97O02r6k67Q32K636M121M902M979M094K393
59174A206773J333K424M999O686O436N517M949L727Q38k482m237m440m713n801
59160A222009p230q891j1050j2879j2943j1352r902r578r391q259o763o188o774
$$ plain form
59147 1100809 1093187 1085422 1078598 1073466 1069901 1067134 1064706 1062848 1061714 1060883 1060166 1060301 1062094 1065251 1068832
59132 1068832 1072486 1076428 1080512 1084316 1088100 1092699 1098296 1104096 1109509 1114986 1121373 1128886 1137052 1145330
59118 1145330 1153443 1161186 1168124 1173729 1178041 1182145 1187379 1193772 1199798 1204125 1207062 1209682 1212037 1213234
59104 1213234 1213082 1212705 1213283 1214834 1216407 1217021 1216247 1214197 1211019 1206291 1199193 1189643 1178841 1168169 1157827
59089 1157827 1147132 1135769 1124056 1112293 1100803 1090354 1081493 1073438 1064699 1055050 1045928 1038485
59077 1038485 1032096 1025334 1017803 1010395 1004094 999005 994525 990229 986591 984632 984709 986011 987696 990019
59063 990019 993551 997743 1001501 1005227 1011009 1020244 1031967 1044002 1055055 1065208 1075023 1084770 1094144
59050 1094144 1102443 1109391 1115847 1123040 1131053 1138854 1145939 1152782 1159372 1164627 1168157 1171486 1176253 1181899
$$ packed form
59147A100809p622p765o824n132l565k767k428j858j134q31p17J35J793L157L581
59132A068832L654L942M084L804L784M599N597N800N413N477O387P513Q166Q278
59118A145330Q113P743O938N605M312M104N234O393O026M327K937K620K355J197
59104A213234j52l77N78J551J573O14p74k050l178m728p098r550j0802j0672j0342
59089A157827j0695j1363j1713j1763j1490j0449q861q055q739r649r122p443
59077A038485o389o762p531p408o301n089m480m296l638j959P7J302J685K323
59063I90019L532M192L758L726N782R235J1723J2035J1053J0153R815R747R374
59050A094144Q299O948O456P193Q013P801P085O843O590N255L530L329M767N646
$$ plain form
59036 1181899 1186407 1188876 1190161 1191133 1191615 1191171 1189884 1187983 1185424 1182252 1178818 1175282 1171224 1166037 1159585
59021 1159585 1152376 1145255 1138894 1133357 1128120 1122589 1116504 1109820 1102534 1094902 1087459 1080447 1073496 1066322
59007 1066322 1059468 1053799 1049335 1045200 1040726 1036132 1031986 1028451 1025312 1022407 1019765 1017457 1015571 1014232
58993 1014232 1013490 1013137 1012752 1012055 1011310 1011225 1012224 1013856 1015253 1016305 1017964 1021113 1025430 1029814 1033802 1037988
58977 1037988 1042841 1047568 1050682 1051860 1052828 1055983 1062165 1070233 1078868 1088072 1098366 1109275 1119720
58964 1119720 1129826 1141158 1154826 1170215 1186042 1201821 1217674 1233342 1248218 1262048 1274955
58953 1274955 1287020 1298309 1308970 1318590 1325789 1329169 1328757 1326073 1322942 1320618 1319800 1320782 1323544 1328075
58939 1328075 1334558 1342849 1352079 1361362 1370812 1381199 1392616 1404080 1414553 1423811 1432154 1439878 1447343
$$ packed form
59036A181899M508K469J285R72M82m44j287j901k559l172l434l536m058n187o452
59021A159585p209p121o361n537n237n531o085o684p286p632p443p012o951p174
59007A066322o854n669m464m135m474m594m146l535l139k905k642k308j886j339
58993A014232p42l53l85o97p45q5R99J632J397J052J659L149M317M384L988M186
58977A037988M853M727L114J178R68L155O182Q068Q635R204J0294J0909J0445
58964A119720J0106J1332J3668J5389J5827J5779J5853J5668J4876J3830J2907
58953A274955J2065J1289J0661R620P199L380m12k684l131k324q18R82K762M531
58939A328075O483Q291R230R283R450J0387J1417J1464J0473R258Q343P724P465
$$ plain form
58926 1447343 1455291 1464678 1476034 1488802 1501249 1511591 1519813 1528170 1539268 1553695 1570041 1586959
58914 1586959 1604329 1622527 1641721 1662246 1684619 1708450 1732078 1754123 1774992 1796098 1817967
58903 1817967 1839836 1860822 1880797 1900246 1919945 1940453 1961043 1979332 1993076 2002532 2010052 2017098
58891 2017098 2022773 2025910 2027293 2028515 2029365 2027993 2023680 2018019 2013005 2009063 2005533 2002077 1998742 1995181
58877 1995181 1990569 1983994 1974533 1961643 1946151 1930239 1915475 1901217 1885834 1869112 1852332 1836184
58865 1836184 1820055 1803768 1788712 1776399 1766607 1757815 1749116 1740945 1734047 1728331 1723016 1717855 1713978
58852 1713978 1713053 1715268 1718701 1721527 1724500 1730102 1739207 1749995 1760588 1771497 1784558 1800395 1817913
58839 1817913 1835602 1852352 1867592 1881711 1895991 1911124 1926098 1939356 1950683 1960937 1970299
$$ packed form
58926A447343P948R387J1356J2768J2447J0342Q222Q357J1098J4427J6346J6918
58914A586959J7370J8198J9194K0525K2373K3831K3628K2045K0869K1106K1869
58903A817967K1869K0986J9975J9449J9699K0508K0590J8289J3744R456P520P046
58891B017098N675L137J383J222Q50j372m313n661n014l942l530l456l335l561
58877A995181m612o575r461j2890j5492j5912j4764j4258j5383j6722j6780j6148
58865A836184j6129j6287j5056j2313r792q792q699q171o898n716n315n161l877
58852A713978r25K215L433K826K973N602R105J0788J0593J0909J3061J5837J7518
58839A817913J7689J6750J5240J4119J4280J5133J4974J3258J1327J0254R362
$$ plain form
58828 1970299 1978118 1984442 1990452 1996921 2003161 2007872 2010362 2010716 2009501 2007624 2005681 2002876 1997060 1986380
58814 1986380 1970794 1951853 1931455 1911001 1891124 1871608 1851609 1830413 1808127 1785566 1763476
58803 1763476 1741958 1720739 1700100 1681265 1665269 1651326 1637071 1620894 1603432 1586167 1569336
58792 1569336 1552234 1534922 1518203 1502112 1486038 1470518 1457242 1446593 1436602 1425394 1413512
58781 1413512 1402479 1391962 1380016 1365935 1351354 1338171 1326492 1315108 1303183 1290909 1279062
58770 1279062 1268568 1260238 1254307 1250132 1246685 1243489 1240909 1239490 1239248 1239826 1241187 1243628 1246940 1249983
58756 1249983 1251586 1251796 1251797 1252603 1254262 1256312 1258372 1260014 1260567 1259565 1257208 1254100 1250693 1247192 1243588
58741 1243588 1239337 1233266 1224489 1213610 1202612 1193216 1185361 1177420 1167846 1156613 1145127 1134903 1126442
$$ packed form
58828A970299P819O324O010O469O240M711K490L54j215j877j943k805n816j0680
58814A986380j5586j8941k0398k0454j9877j9516j9999k1196k2286k2561k2090
58803A763476k1518k1219k0639j8835j5996j3943j4255j6177j7462j7265j6831
58792A569336j7102j7312j6719j6091j6074j5520j3276j0649r991j1208j1882
58781A413512j1033j0517j1946j4081j4581j3183j1679j1384j1925j2274j1847
58770A279062j0494q330n931m175l447l196k580j419k42N78J361K441L312L043
58756A249983J603K10JQ06J659K050K060J642N53j002k357l108l407l501l604
58741A243588m251o071q777j0879j0998r396p855p941r574j1233j1486j0224q461
$$ plain form
58728 1126442 1119373 1113357 1108511 1104913 1102124 1099554 1097177 1095558 1095094 1095510 1096225 1097009 1097994 1099110 1099892
58713 1099892 1099963 1099330 1097906 1095132 1090671 1085289 1080275 1075902 1071232 1065711 1060029 1054935 1050041 1044701 1039409
58698 1039409 1035276 1032501 1030476 1029108 1028833 1029380 1029847 1030230 1031667 1034680 1038274 1041360 1044031 1046722 1049081
58683 1049081 1050637 1051874 1053676 1056234 1059372 1063464 1069005 1075588 1082319 1089120 1096687 1105181 1113857 1122094
58669 1122094 1130030 1138096 1146587 1155800 1165834 1176007 1185073 1192319 1198020 1202785 1207047 1211364 1216471
58656 1216471 1222564 1228936 1234737 1239788 1244408 1248851 1253213 1257430 1260927 1262666 1262155 1260257 1258380 1256826
58642 1256826 1254331 1249282 1241001 1229827 1216392 1201183 1184615 1167186 1149472 1132057 1115438 1099816
58630 1099816 1084895 1070001 1054637 1039047 1024050 1010202 997362 985378 974928 967072 961808 957770
$$ packed form
58728A126442p069o016m846l598k789k570k377j619m64M16P15P84R85J116P82
58713A099892P1o33j424k774m461n382n014m373m670n521n682n094m894n340n292
58698A039409m133k775k025j368k75N47M67L83J437L013L594L086K671K691K359
58683A049081J556J237J802K558L138M092N541O583O731O801P567Q494Q676Q237
58669A122094P936Q066Q491R213J0034J0173R066P246N701M765M262M317N107
58656A216471O093O372N801N051M620M443M362M217L497J739n11j898j877j554
58642A256826k495n049q281j1174j3435j5209j6568j7429j7714j7415j6619j5622
58630A099816j4921j4894j5364j5590j4997j3848j2840j1984j0450p856n264m038
$$ plain form
58618 957770 953729 949871 946934 944528 941288 936774 932299 929509 928779 929527 931502 935034 940365 947430 956047
58603 956047 965557 974456 981415 986880 992740 999817 1006345 1009675 1009103 1006251 1002842 998972 993789 987199
58589 987199 980279 974196 969226 965035 961517 958884 956918 954713 951608 948029 944818 941994 938939 935773
58575 935773 933512 932533 931860 930622 929488 929733 931366 933017 933416 932229 929796 926943 924823 924044 924062 924197
58559 924197 924938 927185 930499 933496 936109 939919 945707 952101 957487 961986 966413 970410 973169 975410
58545 975410 978946 984216 989542 993083 994490 994402 993386 991885 990418 989106 987498 985404 983508 982587 982419
58530 982419 982097 981399 981275 982940 986858 992723 999953 1007948 1016270 1025033 1034955 1046465 1058752 1070282
58516 1070282 1080576 1091057 1103707 1119182 1136608 1154825 1173128 1191044 1208348 1225611 1243996
$$ packed form
58618I57770m041l858k937k406l240m514m475k790p30P48J975L532N331P065Q617
58603I56047R510Q899O959N465N860P077O528L330n72k852l409l870n183o590
58589I87199o920o083m970m191l518k633j966k205l105l579l211k824l055l166
58575I35773k261r79o73j238j134K45J633J651L99j187k433k853k120p79J8J35
58559I24197P41K247L314K997K613L810N788O394N386M499M427L997K759K241
58545I75410L536N270N326L541J407q8j016j501j467j312j608k094j896r21j68
58530I82419l22o98j24J665L918N865P230P995Q322Q763R922J1510J2287J1530
58516A070282J0294J0481J2650J5475J7426J8217J8303J7916J7304J7263J8385
$$ plain form
58505 1243996 1264135 1285682 1308379 1332982 1360588 1391382 1424480 1458623 1492438 1524438 1553644
58494 1553644 1580210 1604721 1626768 1644917 1658219 1666992 1671672 1671745 1666629 1657314 1646132 1634858 1623731
58481 1623731 1612438 1601036 1589270 1575688 1558522 1537468 1513892 1489251 1463988 1438093 1411966
58470 1411966 1386226 1361155 1336881 1313958 1293376 1275932 1261537 1248865 1235923 1221798 1208041
58459 1208041 1197507 1191266 1187351 1183033 1177535 1171801 1166568 1161890 1157931 1154747 1151365 1146467 1140122 1133856
58445 1133856 1128961 1125829 1124790 1126036 1128189 1128438 1125192 1119944 1115871 1115138 1118011 1123597 1130445 1136818
58431 1136818 1141363 1143808 1145101 1147139 1152085 1160955 1172575 1184698 1196410 1208612 1222020 1236020
58419 1236020 1250166 1265572 1283607 1303859 1324426 1343861 1362012 1379371 1396285 1412363 1425969
$$ packed form
58505A243996K0139K1547K2697K4603K7606L0794L3098L4143L3815L2000K9206
58494A553644K6566K4511K2047J8149J3302Q773M680P3n116r315j1182j1274j1127
58481A623731j1293j1402j1766j3582j7166k1054k3576k4641k5263k5895k6127
58470A411966k5740k5071k4274k2923k0582j7444j4395j2672j2942j4125j3757
58459A208041j0534o241l915m318n498n734n233m678l959l184l382m898o345o266
58445A133856m895l132j039J246K153K49l246n248m073p33K873N586O848O373
58431A136818M545K445J293K038M946Q870J1620J2123J1712J2202J3408J4000
58419A236020J4146J5406J8035K0252K0567J9435J8151J7359J6914J6078J3606
$$ plain form
58408 1425969 1434779 1437685 1435867 1431513 1426046 1420106 1414407 1409537 1405428 1401981 1399859 1399770 1401444 1404237
58394 1404237 1408309 1414110 1421106 1428186 1435148 1442572 1450228 1456747 1461007 1462836 1462154 1458405 1451257 1441279
58380 1441279 1429733 1418190 1408212 1400565 1394531 1388604 1382075 1375555 1370121 1366588 1365419 1366425 1368536
58367 1368536 1370811 1373826 1379096 1386779 1394840 1401157 1405836 1410766 1417222 1424561 1431139 1435912 1438883 1440345
58353 1440345 1440180 1438127 1434418 1429633 1423900 1416876 1408734 1400643 1393855 1388696 1384662 1380943 1376665 1371448
58339 1371448 1366325 1363310 1363324 1365341 1368334 1373009 1380233 1388562 1395190 1399375 1403310 1409249 1417110 1425432
58325 1425432 1433523 1441868 1451051 1460965 1470872 1479983 1488108 1495644 1502746 1509014 1514576 1520867 1529326 1539619
58311 1539619 1550159 1560159 1570026 1579936 1589413 1598563 1608525 1620250 1633716 1648547 1664513 1681189
$$ packed form
58408A425969Q810K906j818m354n467n940n699m870m109l447k122q9J674K793
58394A404237M072N801O996P080O962P424P656O519M260J829o82l749p148r978
58380A441279j1546j1543r978p647o034n927o529o520n434l533j169J006K111
58367A368536K275L015N270P683Q061O317M679M930O456P339O578M773K971J462
58353A440345j65k053l709m785n733p024q142q091o788n159m034l719m278n217
58339A371448n123l015J4K017K993M675P224Q329O628M185L935N939P861Q322
58325A425432Q091Q345R183R914R907R111Q125P536P102O268N562O291Q459J0293
58311A539619J0540J0000R867R910R477R150R962J1725J3466J4831J5966J6676
$$ plain form
58299 1681189 1698001 1714885 1732142 1749670 1767236 1785355 1804504 1823370 1839394 1851622 1861651
58288 1861651 1871264 1880620 1889590 1899289 1910890 1924032 1937875 1952889 1969954 1988330 2006301 2023807
58276 2023807 2042740 2064310 2087634 2111603 2136758 2164063 2192687 2220518 2246763 2272591 2298873
58265 2298873 2324590 2348477 2371216 2394608 2418979 2442912 2465535 2487592 2509871 2532038 2553648
58254 2553648 2575152 2597163 2619961 2644407 2671954 2702624 2734304 2765413 2797065 2831112 2867246
58243 2867246 2903810 2940418 2977895 3016470 3056093 3097718 3141937 3186961 3230450 3273058 3317645
58232 3317645 3365139 3413855 3463047 3514140 3567808 3622643 3677965 3735556 3797212 3862590 3930750
58221 3930750 4001906 4076213 4152596 4230417 4311004 4396022 4485395 4578076 4673948 4773791 4878122
$$ packed form
58299A681189J6812J6884J7257J7528J7566J8119J9149J8866J6024J2228J0029
58288A861651R613R356Q970R699J1601J3142J3843J5014J7065J8376J7971J7506
58276B023807J8933K1570K3324K3969K5155K7305K8624K7831K6245K5828K6282
58265B298873K5717K3887K2739K3392K4371K3933K2623K2057K2279K2167K1610
58254B553648K1504K2011K2798K4446K7547L0670L1680L1109L1652L4047L6134
58243B867246L6564L6608L7477L8575L9623M1625M4219M5024M3489M2608M4587
58232C317645M7494M8716M9192N1093N3668N4835N5322N7591O1656O5378O8160
58221C930750P1156P4307P6383P7821Q0587Q5018Q9373R2681R5872R9843J04331
$$ plain form
58210 4878122 4986957 5100154 5217587 5339815 5468644 5605762 5750698 5901574 6057893
58201 6057893 6220807 6390580 6566083 6747391 6936556 7134846 7341337 7555251 7777594
58192 7777594 8009318 8249761 8498105 8754622 9019455 9292211 9573886 9867384 10175118
58183 10175118 10498102 10838455 11200461 11587766 12001464 12442213 12912151 13413507 13947353
58174 13947353 14514826 15117389 15755038 16427013 17135533 17886211 18683850 19531008 20431668
58165 20431668 21391942 22414696 23497091 24636220 25834339 27096921 28430051 29843182
58157 29843182 31350943 32968906 34710652 36591809 38633217 40857132 43284439 45939133
58149 45939133 48851667 52055274 55585091 59486517 63821241 68662988 74094864 80215523
$$ packed form
58210D878122J08835J13197J17433J22228J28829J37118J44936J50876J56319
58201F057893J62914J69773J75503J81308J89165J98290K06491K13914K22343
58192G777594K31724K40443K48344K56517K64833K72756K81675K93498L07734
58183A0175118L22984L40353L62006L87305M13698M40749M69938N01356N33846
58174A3947353N67473O02563O37649O71975P08520P50678P97639Q47158R00660
58165B0431668R60274J022754J082395J139129J198119J262582J333130J413131
58157B9843182J507761J617963J741746J881157K041408K223915K427307K654694
58149D5939133K912534L203607L529817L901426M334724M841747N431876O120659
$$ plain form
58141 80215523 87138507 94976524 103833930 113826282 125103095 137838073 152188397 168249702
58133 168249702 186025598 205440160 226436246 249130633 273860538 300943394 330176835
58126 330176835 360347563 389063412 413074588 429053076 434598266 429043054 413620707
58119 413620707 390885423 363761715 334777746 305760363 277877973 251793372 227810217
58112 227810217 206003329 186320659 168637899 152783498 138565274 125797891 114315015
58105 114315015 103971076 94645921 86246660 78696848 71923243 65854137 60422885 55564374
58097 55564374 51210074 47292996 43756807 40556571 37653513 35014025 32611675 30424674
58089 30424674 28431286 26610423 24945037 23421272 22025036 20742090 19560282 18469164
$$ packed form
58141H0215523O922984P838017Q857406R992352J1276813J2734978J4350324J6061305
58133A68249702J7775896J9414562K0996086K2694387K4729905K7082856K9233441
58126C30176835L0170728K8715849K4011176J5978488N545190n555212j5422347
58119D13620707k2735284k7123708k8983969k9017383k7882390k6084601k3983155
58112B27810217k1806888j9682670j7682760j5854401j4218224j2767383j1482876
58105A14315015j0343939r325155q399261p549812o773605o069106n431252m858511
58097E5564374m354300l917078l536189l200236k903058k639488k402350k187001
58089C0424674j993388j820863j665386j523765j396236j282946j181808j091118
$$ plain form
58081 18469164 17458596 16519844 15646500 14832201 14069045 13350326 12672949 12035017 11433027
58072 11433027 10863744 10326576 9821273 9345119 8895157 8471442 8074971 7703747 7353785
58063 7353785 7022802 6710014 6413386 6130181 5859506 5601577 5355235 5119108 4894634
58054 4894634 4684890 4490456 4309062 4139191 3981217 3834675 3697077 3566356 3442600
58045 3442600 3326696 3218771 3118378 3024741 2936369 2851688 2770349 2692923 2619467 2549561 2483396
58034 2483396 2421221 2361835 2303337 2245537 2190051 2137824 2088157 2040462 1995263 1952737 1911787
58023 1911787 1871604 1833049 1797445 1764570 1732749 1700535 1667722 1635052 1603453 1573306 1544028
58012 1544028 1514474 1484041 1453426 1424316 1398386 1376290 1357257 1339656 1322220 1304703 1287348
$$ packed form
58081A8469164j010568r38752q73344q14299p63156p18719o77377o37932o01990
58072A1433027n69283n37168n05303m76154m49962m23715l96471l71224l49962
58063G353785l30983l12788k96628k83205k70675k57929k46342k36127k24474
58054D894634k09744j94434j81394j69871j57974j46542j37598j30721j23756
58045C442600j15904j07925j00393r3637q8372q4681q1339p7426p3456o9906o6165
58034B483396o2175n9386n8498n7800n5486n2227m9667m7695m5199m2526m0950
58023A911787m0183l8555l5604l2875l1821l2214l2813l2670l1599l0147k9278
58012A544028k9554l0433l0615k9110k5930k2096j9033j7601j7436j7517j7355
$$ plain form
58001 1287348 1270214 1253438 1237786 1224159 1212386 1200880 1187695 1171983 1154553 1137086 1120673
57990 1120673 1105160 1090018 1075448 1062033 1049637 1037617 1026047 1015614 1006090 996117 984989 973528
57978 973528 962578 951848 941053 931006 922292 913724 903611 892180 881470 872987 866480 860788
57966 860788 854797 847510 838159 826761 814292 802176 791536 782518 774165 765586 757360 750974 746522
57953 746522 742085 736141 729466 723670 718810 713792 708411 703503 699392 695550 691738 688376 685795 683971
57939 683971 682796 681802 679985 676892 673610 671627 670857 669753 667240 663640 659905 656872 655122 654575 654270
57924 654270 653261 651598 649774 647642 644728 641114 637114 632592 627662 623404 620556 618034 614211 609249
57910 609249 604559 600336 595513 590100 585542 582442 579868 577482 576464 577387 578716 578592 576907 574649 572231
$$ packed form
58001A287348j7134j6776j5652j3627j1773j1506j3185j5712j7430j7467j6413
57990A120673j5513j5142j4570j3415j2396j2020j1570j0433r524r973j1128j1461
57978I73528j0950j0730j0795j0047q714q568j0113j1431j0710q483o507n692
57966H60788n991p287r351j1398j2469j2116j0640r018q353q579q226o386m452
57953G46522m437n944o675n796m860n018n381m908m111l842l812l362k581j824
57939F83971j175r94j817l093l282j983p70j104k513l600l735l033j750n47l05
57924F54270j009j663j824k132k914l614m000m522m930m258k848k522l823m962
57910F09249m690m223m823n413m558l100k574k386j018R23J329j24j685k258k418
$$ plain form
57895 572231 569606 567268 566083 566425 567881 569326 569177 566585 562779 560144 559507 559344 558155 556357 555135
57880 555135 554731 554936 556238 559336 564111 569856 575734 580461 582834 583626 585666 590529 596177 599412 599739
57865 599739 598859 597125 592979 586056 578524 572496 567760 563020 558012 553250 548751 544263 540278 537751
57851 537751 536960 537285 537880 538003 537147 535610 534797 536072 539090 541865 542711 541695 539975 538342 536916 535952
57835 535952 536147 538021 541489 546194 551746 557359 561816 564449 565846 567031 568146 568628 568509 568587 569173 569530
57819 569530 569042 568193 567795 567711 566983 565007 562088 558933 555996 553180 550000 546214 542338 539070 536074 532085
57803 532085 526753 521660 518689 517844 517672 517544 518364 520849 524217 527179 529561 532311 536206 541129 546447
57788 546447 551650 556527 560894 564266 565932 565701 564628 564607 566822 570654 574298 576318 576374 574747 571834
$$ packed form
57895E72231k625k338j185L42J456J445j49k592l806k635o37j63j189j798j222
57880E55135m04K05J302L098M775N745N878M727K373P92K040M863N648L235L27
57865E99739q80j734m146o923p532o028m736m740n008m762m499m488l985k527
57851E37751p91L25N95J23q56j537q13J275L018K775Q46j016j720j633j426r64
57835E35952J95J874L468M705N552N613M457K633J397J185J115M82j19P8N86L57
57819E69530m88q49l98q4p28j976k919l155k937k816l180l786l876l268k996l989
57803E32085n332n093k971q45j72j28Q20K485L368K962K382K750L895M923N318
57788E46447N203M877M367L372J666k31j073k1K215L832L644K020N6j627k913
$$ plain form
57773 571834 568337 565377 563735 562968 561727 559182 555799 552556 549730 546890 543931 541611 540886 541877 543592
57758 543592 544590 544003 541972 539030 535096 529509 522277 514745 508430 503461 498861 494139 489715 485779 481717
57743 481717 477099 472458 468590 465653 463384 461620 460050 458006 455207 452408 450636 449995 449738 449372 449188
57728 449188 449832 451729 454736 458059 460881 463454 467089 472470 478473 483474 487357 491232 495398 498841
57714 498841 500951 502576 504916 508264 512357 517109 522313 527256 531383 534956 538397 541371 543110 543285
57700 543285 541919 538916 534596 530422 528067 527562 527262 526003 524541 524449 526273 529324 532662 535536 537282
57685 537282 537713 537596 537996 538960 539368 538305 536242 534657 534686 536224 538102 539146 539291 539633 541182 543746
57669 543746 546402 548706 550738 552163 552324 551540 551361 552962 555959 559286 562500 565627 568477 570923 573277
$$ packed form
57773E71834l497k960j642p67j241k545l383l243k826k840k959k320p25R91J715
57758E43592R98n87k031k942l934n587p232p532o315m969m600m722m424l936m062
57743D81717m618m641l868k937k269j764j570k044k799k799j772o41k57l66j84
57728D49188O44J897L007L323K822K573L635N381O003N001L883L875M166L443
57714D98841K110J625K340L348M093M752N204M943M127L573L441K974J739J75
57700E43285j366l003m320m174k355n05l00j259j462r2J824L051L338K874J746
57685E37282M31j17M00R64M08j063k063j585K9J538J878J044J45L42J549K564
57669E43746K656K304K032J425J61p84j79J601K997L327L214L127K850K446K354
$$ plain form
57654 573277 575562 577082 577615 578355 580366 582591 582915 581080 579015 578158 577964 577491 576939 576752 576391 575045
57638 575045 572846 570568 568604 566908 565397 563933 562440 561340 561037 560628 558291 553710 549099 546800 546832
57623 546832 547825 549312 551569 553960 555438 556825 560922 569859 583280 599376 616615 634224 652121
57610 652121 671164 692845 718025 746004 774840 802224 826081 844872 857394 862104 857187 842254
57598 842254 819851 794276 768571 743288 718096 693582 671132 651921 636393 624065 613543
57587 613543 603517 594123 586607 581286 576762 571778 566973 563849 562546 561704 560355 558868 557881 557154 556051
57572 556051 554794 554602 556431 559787 563110 565360 566908 568638 570545 571701 571411 569849 567687 565815 565324
57557 565324 566816 569352 570883 570265 568340 566722 566174 566659 568144 570374 572277 572741 572099 572023 573655 576350
$$ packed form
57654E73277K285J520N33P40K011K225L24j835k065q57j94m73n52j87l61j346
57638E75045k199k278j964j696j511j464j493j100l03m09k337m581m611k299L2
57623E46832R93J487K257K391J478J387M097Q937J3421J6096J7239J7609J7897
57610F52121J9043K1681K5180K7979K8836K7384K3857J8791J2522M710m917j4933
57598H42254k2403k5575k5705k5283k5192k4514k2450j9211j5528j2328j0522
57587F13543j0026r394p516n321m524m984m805l124j303q42j349j487r87p27j103
57572E56051j257j92J829L356L323K250J548J730J907J156k90j562k162j872m91
57557E65324J492K536J531o18j925j618n48M85J485K230J903M64o42p6J632K695
$$ plain form
57541 576350 578594 579861 581175 583837 587776 591448 593468 594074 594549 595398 595844 595346 594821 595778 598666 602576
57525 602576 606154 608387 609000 608876 609666 612137 615089 616750 617079 617771 619986 623111 626025 628529 631004
57510 631004 633590 636458 640194 644882 649249 651759 652492 652984 654200 655714 657244 659861 664656 670688 675427
57495 675427 677404 677732 678778 681943 687108 693711 701593 710674 720237 728875 735353 739574 742679 745940
57481 745940 749544 752721 755087 757457 761073 766425 773108 780469 787845 794472 799893 804580 809588 815465
57467 815465 821854 828230 834586 841230 848341 855960 864062 872336 880172 887203 893773 900603 907962 915198
57453 915198 921106 924932 927171 929213 932072 935654 939454 943459 947817 952133 955999 959998 965129 971201
57439 971201 976971 982058 987369 992997 997098 998191 997653 998466 1001905 1006879 1012316 1018546 1025994 1033939 1041344
$$ packed form
57541E76350K244J267J314K662L939L672K020O06M75Q49M46m98n25R57K888L910
57525F02576L578K233O13j24P90K471K952J661L29O92K215L125K914K504K475
57510F31004K586K868L736M688M367K510P33M92J216J514J530K617M795O032M739
57495F75427J977L28J046L165N165O603P882R081R563Q638O478M221L105L261
57481G45940L604L177K366K370L616N352O683P361P376O627N421M687N008N877
57467H15465O389O376O356O644P111P619Q102Q274P836P031O570O830P359P236
57453I15198N908L826K239K042K859L582L800M005M358M316L866L999N131O072
57439I71201N770N087N311N628M101J093n38Q13L439M974N437O230P448P945P405
$$ plain form
57424 1041344 1048008 1054173 1059778 1064971 1070801 1078327 1087100 1095398 1102155 1108042 1114457 1121985 1130250 1138901
57410 1138901 1148058 1157762 1167490 1176643 1185366 1194503 1204665 1215564 1226407 1236867 1247543 1259398
57398 1259398 1272669 1286356 1299041 1310354 1321345 1333072 1345169 1356471 1366956 1378146 1391210
57387 1391210 1405414 1419005 1431001 1441396 1450150 1457116 1463105 1470028 1479436 1491219 1504072 1516961
57375 1516961 1529910 1543622 1558573 1574382 1589847 1603774 1616043 1627875 1640821 1655373 1670691
57364 1670691 1685843 1701044 1717226 1734404 1751221 1766682 1781790 1798489 1817138 1836043 1853673
57353 1853673 1870321 1887137 1904521 1922243 1940271 1958535 1976435 1993584 2010658 2028466 2046553
57342 2046553 2063829 2080353 2097220 2114737 2132122 2149358 2167947 2189057 2211945 2235119 2258213
$$ packed form
57424A041344O664O165N605N193N830P526Q773Q298O757N887O415P528Q265Q651
57410A138901R157R704R728R153Q723R137J0162J0899J0843J0460J0676J1855
57398A259398J3271J3687J2685J1313J0991J1727J2097J1302J0485J1190J3064
57387A391210J4204J3591J1996J0395Q754O966N989O923R408J1783J2853J2889
57375A516961J2949J3712J4951J5809J5465J3927J2269J1832J2946J4552J5318
57364A670691J5152J5201J6182J7178J6817J5461J5108J6699J8649J8905J7630
57353A853673J6648J6816J7384J7722J8028J8264J7900J7149J7074J7808J8087
57342B046553J7276J6524J6867J7517J7385J7236J8589K1110K2888K3174K3094
$$ plain form
57331 2258213 2281739 2305599 2328964 2351437 2373385 2395194 2417082 2439742 2464281 2491122 2519429
57320 2519429 2548091 2577024 2607150 2638996 2671594 2703006 2732189 2760195 2789136 2819907 2851430
57309 2851430 2882343 2912722 2943456 2974495 3004887 3034511 3064597 3095988 3127770 3158353 3187265
57298 3187265 3215137 3242513 3269715 3297508 3326577 3356224 3384853 3412209 3439975 3469402 3499508
57287 3499508 3528745 3557579 3587860 3620033 3652628 3684596 3716607 3749578 3783220 3816753 3849941
57276 3849941 3882757 3915036 3947229 3980430 4014673 4048176 4079582 4110164 4142378 4176669 4211281
57265 4211281 4244995 4278465 4312629 4347386 4382435 4418192 4454953 4491937 4527982 4562835 4597209
57254 4597209 4631918 4667351 4703520 4740223 4777307 4814802 4852541 4889847 4926143 4961859 4998079
$$ packed form
57331B258213K3526K3860K3365K2473K1948K1809K1888K2660K4539K6841K8307
57320B519429K8662K8933L0126L1846L2598L1412K9183K8006K8941L0771L1523
57309B851430L0913L0379L0734L1039L0392K9624L0086L1391L1782L0583K8912
57298C187265K7872K7376K7202K7793K9069K9647K8629K7356K7766K9427L0106
57287C499508K9237K8834L0281L2173L2595L1968L2011L2971L3642L3533L3188
57276C849941L2816L2279L2193L3201L4243L3503L1406L0582L2214L4291L4612
57265D211281L3714L3470L4164L4757L5049L5757L6761L6984L6045L4853L4374
57254D597209L4709L5433L6169L6703L7084L7495L7739L7306L6296L5716L6220
$$ plain form
57243 4998079 5035188 5072569 5109670 5146563 5183119 5218437 5251608 5282626 5312291 5341735 5372262
57232 5372262 5404916 5439754 5475974 5512960 5550619 5588622 5626377 5664276 5703931 5746276 5790140
57221 5790140 5833667 5876598 5920074 5964467 6008548 6050894 6091228 6130158 6168223 6205518 6241931
57210 6241931 6277589 6313158 6349625 6387586 6426906 6467282 6508859 6551958 6596412 6641543 6686794
57199 6686794 6732338 6779301 6829216 6882547 6937539 6991382 7042928 7093406 7143836 7192867 7238381
57188 7238381 7280422 7320828 7360062 7396071 7426713 7452021 7473449 7491991 7507944 7521751 7534011
57177 7534011 7544874 7554284 7562853 7571894 7582338 7593844 7605189 7615519 7625280 7635979 7649089 7665300
57165 7665300 7684802 7707879 7734725 7764812 7796958 7830290 7864872 7901168 7939168 7978350 8018590
$$ packed form
57243D998079L7109L7381L7101L6893L6556L5318L3171L1018K9665K9444L0527
57232E372262L2654L4838L6220L6986L7659L8003L7755L7899L9655M2345M3864
57221E790140M3527M2931M3476M4393M4081M2346M0334L8930L8065L7295L6413
57210F241931L5658L5569L6467L7961L9320M0376M1577M3099M4454M5131M5251
57199F686794M5544M6963M9915N3331N4992N3843N1546N0478N0430M9031M5514
57188G238381M2041M0406L9234L6009L0642K5308K1428J8542J5953J3807J2260
57177G534011J0863R410Q569R041J0444J1506J1345J0330R761J0699J3110J6211
57165G665300J9502K3077K6846L0087L2146L3332L4582L6296L8000L9182M0240
$$ plain form
57154 8018590 8060841 8106645 8156732 8210094 8264541 8318096 8369704 8418867 8465240 8508807 8550095
57143 8550095 8589964 8629395 8669277 8709746 8749648 8787551 8823744 8860324 8898667 8937650 8975405
57132 8975405 9012084 9049553 9088705 9128579 9168340 9208780 9251230 9295862 9341746 9388171 9435477
57121 9435477 9484839 9537311 9592648 9648859 9703207 9753562 9798461 9836290 9865507 9885793 9897973
57110 9897973 9902417 9898294 9884943 9863247 9835161 9802599 9767603 9733192 9703036 9680003 9665138 9657671
57098 9657671 9655454 9655481 9654728 9651007 9643237 9631033 9614213 9592731 9567026 9538255 9507906 9476810 9444476
57085 9444476 9409502 9370627 9327404 9280108 9229301 9175348 9118216 9057790 8994375 8928488 8860058
57074 8860058 8788415 8713317 8635260 8554190 8468727 8377522 8280796 8179393 8072705 7958667 7835722
$$ packed form
57154H018590M2251M5804N0087N3362N4447N3555N1608M9163M6373M3567M1288
57143H550095L9869L9431L9882M0469L9902L7903L6193L6580L8343L8983L7755
57132H975405L6679L7469L9152L9874L9761M0440M2450M4632M5884M6425M7306
57121I435477M9362N2472N5337N6211N4348N0355M4899L7829K9217K0286J2180
57110I897973M444m123j3351k1696k8086l2562l4996l4411l0156k3033j4865p467
57098I657671k217K7p53l721p770j2204j6820k1482k5705k8771l0349l1096l2334
57085I444476l4974l8875m3223m7296n0807n3953n7132o0426o3415o5887o8430
57074H860058p1643p5098p8057q1070q5463r1205r6726j01403j06688j14038j22945
$$ plain form
57063 7835722 7703747 7563060 7413490 7254396 7084785 6903573 6710532 6506693 6292820
57054 6292820 6067929 5830486 5580634 5319776 5048382 4765894 4472568 4169479 3857025
57045 3857025 3536288 3213406 2901846 2620608 2392036 2240982 2192663 2268276 2481366 2836627
57035 2836627 3331318 3960731 4723625 5614896 6606688 7653007 8748685 10001083 11613506
57026 11613506 13741422 16328139 19080261 21618858 23675381 25180488 26220751 26948287
57018 26948287 27517928 28057229 28646230 29303485 29989735 30631394 31153861 31511302 31699748
57009 31699748 31746066 31680488 31512823 31226978 30791780 30176542 29362331 28345737 27136804
57000 27136804 25756658 24239347 22635112 21007696 19423809 17941103 16600925 15425971
$$ packed form
57063G835722j31975j40687j49570j59094j69611j81212j93041k03839k13873
57054F292820k24891k37443k49852k60858k71394k82488k93326l03089l12454
57045C857025l20737l22882l11560k81238k28572j51054m8319P5613K13090L55261
57035B836627M94691O29413P62894Q91271R91792J046319J095678J252398J612423
57026A1613506K127916K586717K752122K538597K056523J505107J040263P27536
57018B6948287N69641N39301N89001O57255O86250O41659N22467L57441J88446
57009C1699748M6318o5578j67665k85845m35198o15238q14211j016594j208933
57000B7136804j380146j517311j604235j627416j583887j482706j340178j174954
$$ plain form
56992 15425971 14420663 13574108 12865529 12269929 11762267 11320467 10927322 10570284 10240038
56983 10240038 9930300 9638765 9366339 9114304 8882712 8671449 8481345 8313564 8169057
56974 8169057 8048981 7953709 7879723 7818025 7756311 7681757 7581719 7445163 7267519 7054532
56964 7054532 6819093 6573367 6324422 6076019 5831253 5592073 5358021 5127213 4898138
56955 4898138 4670015 4442494 4216020 3991751 3770304 3551294 3335072 3124178 2921963
56946 2921963 2730139 2548755 2378123 2219419 2073219 1938660 1814450 1699959 1595063
56937 1595063 1499755 1414268 1338760 1272299 1212793 1158526 1109316 1065770 1028028 995785 968789
56926 968789 946371 926955 909098 892835 878949 866871 854344 839327 821367 800952 778666
$$ packed form
56992A5425971j005308q46555p08579n95600n07662m41800l93145l57038l30246
56983A0240038l09738k91535k72426k52035k31592k11263j90104j67781j44507
56974H169057j20076r5272p3986o1698o1714p4554j00038j36556j77644k12987
56964G054532k35439k45726k48945k48403k44766k39180k34052k30808k29075
56955D898138k28123k27521k26474k24269k21447k19010k16222k10894k02215
56946B921963j91824j81384j70632j58704j46200j34559j24210j14491j04896
56937A595063r5308q5487p5508o6461n9506n4267m9210m3546l7742l2243k6996
56926I68789k2418j9416j7857j6263j3886j2078j2527j5017j7960k0415k2286
$$ plain form
56915 778666 755554 733337 713379 695849 680414 667109 655879 646003 636973 629489 624563 621932
56903 621932 620441 619932 621626 626496 634365 644944 658598 675196 692821 708498 719994 726353 727114
56890 727114 721938 711220 696484 679799 662828 646505 631430 618395 608365 601829 598257 596499
56878 596499 595933 597141 601450 609963 622983 639942 659462 679658 698750 715573 729467 739592
56866 739592 744322 741477 729635 709744 685323 660511 637628 616805 597690 580636 565914 552511
56854 552511 538593 523121 506663 490872 477446 467204 459583 453278 447850 444353 443745 445100 446405
56841 446405 446971 447843 449590 451052 451131 450698 451434 453365 455107 456594 460058 467669 479063 491960 504498
56826 504498 516144 526744 535602 541619 543824 541830 536191 528250 519247 509712 500168 492095 487285 486101
$$ packed form
56915G78666k3112k2217j9958j7530j5435j3305j1230r876r030p484m926k631
56903F21932j491n09J694M870P869J0579J3654J6598J7625J5677J1496O359P61
56890G27114n176j0718j4736j6685j6971j6323j5075j3035j0030o536l572j758
56878E96499n66J208M309Q513J3020J6959J9520K0196J9092J6823J3894J0125
56866G39592M730k845j1842j9891k4421k4812k2883k0823j9115j7054j4722j3403
56854E52511j3918j5472j6458j5791j3426j0242p621o305n428l497o08J355J305
56841D46405N66Q72J747J462P9m33P36J931J742J487L464P611J1394J2897J2538
56826E04498J1646J0600Q858O017K205j994n639p941r003r535r544q073m810j184
$$ plain form
56812 486101 487130 488857 491147 494913 501123 510562 523873 541107 561616 584916 611184 640325 671065
56799 671065 701638 730881 757737 780130 795536 802750 802259 795102 782466 766370 749361 733108
56787 733108 718355 706483 699620 698413 701081 705984 714211 728294 749125 775701 807402 844662
56775 844662 887105 932594 978760 1024182 1067034 1103337 1127777 1136496 1128977 1107710 1076759 1040578
56763 1040578 1003309 968102 936379 907749 881260 857183 837262 822926 813774 808557 807278 811339
56751 811339 821630 837465 857666 881704 909003 937519 963646 983461 993974 993784 983207 963802
56739 963802 937480 906031 871332 835506 800531 767913 738833 714151 693936 677391 663638
56728 663638 652475 644154 638817 636485 637323 641359 648074 656554 665877 674888 681745 684279 681117 672338
$$ packed form
56812D86101J029J727K290L766O210R439J3311J7234K0509K3300K6268K9141L0740
56799F71065L0573K9243K6856K2393J5406P214m91p157j2636j6096j7009j6253
56787G33108j4753j1872o863j207K668M903Q227J4083K0831K6576L1701L7260
56775H44662M2443M5489M6166M5422M2852L6303K4440Q719p519k1267l0951l6181
56763A040578l7269l5207l1723k8630k6489k4077j9921j4336r152n217j279M061
56751H11339J0291J5835K0201K4038K7299K8516K6127J9815J0513j90j0577j9405
56739I63802k6322l1449l4699l5826l4975l2618k9080k4682k0215j6545j3753
56728F63638j1163q321n337k332Q38M036O715Q480R323R011O857K534l162q779
$$ plain form
56714 672338 658910 641711 621260 598367 574732 552470 532661 514506 496337 477529 459101
56703 459101 442354 427429 413489 399898 386783 374735 364428 356295 349938 343886 336570 327876
56691 327876 319386 312801 308311 304738 300982 296861 292602 288135 283346 278706 274984 272274 269856 267215
56677 267215 264696 262770 261133 259189 257113 255721 255320 255289 254816 253533 251498 249226 247756 247920 249345
56662 249345 250790 251674 252524 253739 254828 255405 256164 258097 261207 264674 267885 270638 272591 273190 272180
56647 272180 269908 267339 265879 266524 268714 270595 270999 270693 271084 272345 273671 274843 276415 278586 280959
56632 280959 283400 286159 289084 291624 293759 296058 298585 300615 301776 302799 304672 307506 310506 312632
56618 312632 313136 312056 310517 310085 311404 313723 315884 317372 318206 318411 318108 317846 318184 318820 318536 316400
$$ packed form
56714F72338j3428j7199k0451k2893k3635k2262j9809j8155j8169j8808j8428
56703D59101j6747j4925j3940j3591j3115j2048j0307q133o357o052p316q694
56691C27876q490o585m490l573l756m121m259m467m789m640l722k710k418k641
56677B67215k519j926j637j944k076j392m01l1m73j283k035k272j470J64J425
56662B49345J445Q84Q50J215J089N77P59J933L110L467L211K753J953N99j010
56647B72180k272k569j460O45K190J881M04l06L91J261J326J172J572K171K373
56632B80959K441K759K925K540K135K299K527K030J161J023J873K834L000K126
56618C12632N04j080j539m32J319K319K161J488Q34K05l03k62L38O36k84k136
$$ plain form
56602 316400 313070 310641 310778 313048 315476 316779 317486 318688 320472 322130 323230 323810 324044 324465 325919
56587 325919 328427 330690 331781 332717 334912 337515 338058 335774 332562 330280 328745 326982 324841 322498 319824
56572 319824 317406 316880 318886 321656 322989 322912 322951 323317 322414 319208 314791 311292 309889 310090 310505 310301 310102
56555 310102 311095 313116 314390 313653 311629 309592 307458 304612 301892 301067 302471 304604 306089 306675 306235
56540 306235 304371 301624 299752 299875 301145 302053 302374 303039 304552 306436 308050 309304 310533 312052 313805
56525 313805 315147 315083 313073 309814 307163 307058 310087 314786 318664 320418 321133 322914 326510 330897 335110
56510 335110 339542 344945 350847 355791 359070 361546 364557 368384 372165 375256 378286 382563 388609 395731
56496 395731 403065 410414 417559 423344 426377 426700 425987 425778 426059 425963 425308 424809 424876 424920 424160 422754 421518
$$ packed form
56602C16400l330k429J37K270K428J303P07J202J784J658J100N80K34M21J454
56587C25919K508K263J091R36K195K603N43k284l212k282j535j763k141k343k674
56572C19824k418n26K006K770J333p7L9L66r03l206m417l499j403K01M15k04j99
56555C10102R93K021J274p37k024k037k134k846k720q25J404K133J485N86m40
56540C06235j864k747j872J23J270R08L21O65J513J884J614J254J229J519J753
56525C13805J342o4k010l259k651j05L029M699L878J754P15J781L596M387M213
56510C35110M432N403N902M944L279K476L011L827L781L091L030M277O046P122
56496C95731P334P349P145N785L033L23p13k09K81r6o55m99O7M4p60j406j236
$$ plain form
56479 421518 420467 418279 413833 408089 403627 402078 402563 402985 402274 400867 399478 398178 396617 394598 392416
56464 392416 390849 390523 390999 390896 389420 387393 386225 386274 386897 387683 388613 389261 388934 387695 386317 385003 383132
56447 383132 380585 378352 377264 376829 375957 374345 372643 371652 371800 373015 374522 375006 373525 370405 367076
56432 367076 365073 365072 366581 368422 369720 370386 370480 369519 367199 364684 364155 366579 370545 373642 374490 373178
56416 373178 370583 367925 366392 366343 367027 367592 368130 369283 371109 372972 374388 375434 376385 377369 378387 379307
56400 379307 379813 379615 378683 377241 375729 374880 375376 377096 379004 380152 380554 380712 380651 380008 378918 378218 378638
56383 378638 380146 382111 383862 385061 385795 386330 386709 386697 386278 385995 386541 388145 390468 392851 394437 394423 392774
56366 392774 390642 389672 390747 393436 396465 398582 399334 399440 400289 402689 406118 409392 411786 413200 413626
$$ packed form
56479D21518j051k188m446n744m462j549M85M22p11j407j389j300j561k019k182
56464C92416j567l26M76j03j476k027j168M9O23P86R30O48l27j239j378j314j871
56447C83132k547k233j088m35q72j612j702r91J48J215J507M84j481l120l329
56432C67076k003jJ509J841J298O66R4r61k320k515n29K424L966L097Q48j312
56416C73178k595k658j533m9O84N65N38J153J826J863J416J046R51R84J018R20
56400C79307N06j98r32j442j512q49M96J720J908J148M02J58o1o43j090p00M20
56383C78638J508J965J751J199P34N35L79j2m19k83N46J604K323K383J586j4j649
56366C92774k132r70J075K689L029K117P52J06Q49K400L429L274K394J414M26
$$ plain form
56351 413626 413130 412214 411537 411150 410604 409879 409677 410554 412233 413987 415366 416421 417684 420017 423828 428152
56335 428152 431160 432190 432698 434445 437167 439005 439090 438510 438420 438240 436644 433696 431038 430048 430593 431763
56319 431763 433228 435557 439444 444731 450124 454006 455861 456799 458348 460846 463478 465651 467495 468981
56305 468981 469544 469144 468965 470219 472587 474671 475862 477044 479286 482441 485365 487276 488532 489963 491673
56290 491673 492909 493264 493468 494449 496035 497574 499594 503496 509239 514711 518216 520447 523027 526137 528889
56275 528889 531154 533495 535822 537687 539632 542734 546938 551375 556194 562371 569571 576033 581090 586074
56261 586074 591883 597270 600728 602951 606059 611030 616840 621687 624341 624882 624794 625829 628238 630771 632782
56246 632782 635343 639547 644788 649778 654543 660227 667447 675977 685679 696569 708030 718948 728715
$$ packed form
56351D13626m96r16o77l87n46p25k02Q77J679J754J379J055J263K333L811M324
56335D28152L008J030N08J747K722J838Q5n80r0j80j596k948k658r90N45J170
56319D31763J465K329L887N287N393L882J855R38J549K498K632K173J844J486
56305D68981N63m00j79J254K368K084J191J182K242L155K924J911J256J431J710
56290D91673J236L55K04R81J586J539K020L902N743N472L505K231K580L110K752
56275E28889K265K341K327J865J945L102M204M437M819O177P200O462N057M984
56261E86074N809N387L458K223L108M971N810M847K654N41q8J035K409K533K011
56246F32782K561M204N241M990M765N684P220Q530R702J0890J1461J0918R767
$$ plain form
56233 728715 737475 745463 752726 759453 766109 773323 781864 792366 804651 817737 830852 844024 857383
56220 857383 870683 884155 899115 916825 937173 959164 982233 1006372 1031468 1057342 1084031
56209 1084031 1111431 1139316 1168446 1200729 1237144 1276237 1316003 1356713 1400398 1448038 1499128
56198 1499128 1554037 1614775 1682671 1756803 1835754 1920032 2011840 2113047 2224063 2344229 2472673
56187 2472673 2609019 2753611 2906760 3067463 3233126 3400610 3567124 3730076 3886701
56178 3886701 4034272 4170368 4292603 4398239 4484257 4547820 4586926 4601003 4590803 4557408
56168 4557408 4501473 4423833 4326766 4214136 4090175 3958247 3820523 3678376 3533187 3387081
56158 3387081 3242786 3102506 2967175 2837031 2712389 2593380 2479566 2370765 2267933
$$ packed form
56233G28715Q760P988P263O727O656P214Q541J0502J2285J3086J3115J3172J3359
56220H57383J3300J3472J4960J7710K0348K1991K3069K4139K5096K5874K6689
56209A084031K7400K7885K9130L2283L6415L9093L9766M0710M3685M7640N1090
56198A499128N4909O0738O7896P4132P8951Q4278R1808J01207J11016J20166J28444
56187B472673J36346J44592J53149J60703J65663J67484J66514J62952J56625
56178C886701J47571J36096J22235J05636Q6018O3563L9106J4077j0200l3395
56168D557408n5935p7640r7067j12630j23961j31928j37724j42147j45189j46106
56158C387081j44295j40280j35331j30144j24642j19009j13814j08801j02832
$$ plain form
56149 2267933 2172385 2084249 2002458 1926125 1855119 1789335 1728360 1672030 1620593 1574066 1531917
56138 1531917 1493473 1458163 1425391 1394654 1365804 1338806 1313438 1289797 1268872 1251769 1238323
56127 1238323 1227128 1217030 1208030 1200624 1194859 1190243 1186265 1182777 1179934 1177742 1175733 1173524 1171693
56114 1171693 1171391 1172834 1175065 1177590 1181189 1186453 1192739 1199576 1207925 1218560 1230210 1241018 1251134
56101 1251134 1262064 1274049 1286180 1298857 1313910 1332049 1352212 1373844 1397915 1425073 1454604
56090 1454604 1486131 1520775 1559690 1602650 1649041 1699299 1754683 1816479 1885785 1962947 2046675
56079 2046675 2134792 2226113 2320295 2415523 2508095 2595165 2676422 2752019 2820433 2879838 2930722
56068 2930722 2975810 3017891 3058449 3097334 3132583 3161198 3181145 3192226 3194670 3188074 3172620 3149929
$$ packed form
56149B267933r5548q8136q1791p6333p1006o5784o0975n6330n1437m6527m2149
56138A531917l8444l5310l2772l0737k8850k6998k5368k3641k0925j7103j3446
56127A238323j1195j0098r000p406n765m616l978l488k843k192k009k209j831
56114A171693l02J443K231K525L599N264O286O837Q349J0635J1650J0808J0116
56101A251134J0930J1985J2131J2677J5053J8139K0163K1632K4071K7158K9531
56090A454604L1527L4644L8915M2960M6391N0258N5384O1796O9306P7162Q3728
56079B046675Q8117R1321R4182R5228R2572Q7070Q1257P5597O8414N9405N0884
56068B930722M5088M2081M0558L8885L5249K8615J9947J1081K444o596j5454k2691
$$ plain form
56056 3149929 3121076 3084403 3036831 2977207 2907386 2830599 2750065 2668919 2590055 2515572 2446893
56045 2446893 2385209 2331124 2284106 2243167 2208077 2179304 2156829 2139655 2126458 2116207 2108213
56034 2108213 2102191 2098488 2097831 2100580 2106131 2113185 2120846 2129630 2141067 2155934 2173204 2191278 2209877
56021 2209877 2229960 2252144 2276182 2301748 2328620 2356083 2383362 2410800 2439531 2469865 2501009
56010 2501009 2532445 2564397 2596883 2629692 2663587 2700155 2739991 2782154 2825560 2869706 2913970
55999 2913970 2957880 3002334 3048836 3097059 3145028 3192262 3240776 3292151 3345629 3400174 3456307
55988 3456307 3514402 3573067 3631083 3689600 3750663 3814761 3881458 3951233 4024836 4101636 4180239
55977 4180239 4260226 4342071 4426170 4513195 4604475 4700716 4801066 4904652 5012191 5125023
$$ packed form
56056C149929k8853l6673m7572n9624o9821p6787q0534q1146p8864p4483o8679
56045B446893o1684n4085m7018m0939l5090k8773k2475j7174j3197j0251p994
56034B108213o022l703o57K749N551P054P661Q784J1437J4867J7270J8074J8599
56021B209877K0083K2184K4038K5566K6872K7463K7279K7438K8731L0334L1144
56010B501009L1436L1952L2486L2809L3895L6568L9836M2163M3406M4146M4264
55999B913970M3910M4454M6502M8223M7969M7234M8514N1375N3478N4545N6133
55988C456307N8095N8665N8016N8517O1063O4098O6697O9775P3603P6800P8603
55977D180239P9987Q1845Q4099Q7025R1280R6241J00350J03586J07539J12832
$$ plain form
55967 5125023 5243513 5367560 5497622 5633998 5776098 5923668 6077793 6239568 6408832
55958 6408832 6585312 6769833 6963241 7165417 7376608 7598330 7831592 8075462 8328716
55949 8328716 8591536 8864391 9146983 9439964 9746118 10068127 10406643 10762232 11137516
55940 11137516 11535530 11957714 12405601 12882627 13391703 13932383 14503012 15104580 15740168
55931 15740168 16411727 17119936 17866613 18655430 19491133 20379457 21326076 22333564 23400798
55922 23400798 24526993 25714740 26968203 28291977 29694677 31190927 32796724 34525473
55914 34525473 36391662 38415556 40620799 43030623 45670860 48574286 51778235 55321622
55906 55321622 59250439 63625338 68521015 74023176 80233172 87273192 95279190 104386957
$$ packed form
55967E125023J18490J24047J30062J36376J42100J47570J54125J61775J69264
55958F408832J76480J84521J93408K02176K11191K21722K33262K43870K53254
55949H328716K62820K72855K82592K92981L06154L22009L38516L55589L75284
55940A1137516L98014M22184M47887M77026N09076N40680N70629O01568O35588
55931A5740168O71559P08209P46677P88817Q35703Q88324R46619J007488J067234
55922B3400798J126195J187747J253463J323774J402700J496250J605797J728749
55914C4525473J866189K023894K205243K409824K640237K903426L203949L543387
55906E5321622L928817M374899M895677N502161O209996P040020Q005998R107767
$$ plain form
55898 104386957 114725296 126414937 139565051 154273237 170635877 188755704 208732718
55891 208732718 230647190 254537718 280341257 307767353 336137644 364248308 390289980
55884 390289980 411891617 426442063 431774262 426973155 412797808 391386225 365441546
55877 365441546 337437825 309219022 281970782 256353904 232661725 210966218 191229929
55870 191229929 173361955 157235507 142702437 129611321 117816561 107181527 97586145
55863 97586145 88932699 81139551 74130832 67834810 62186274 57122899 52580546 48496496
55855 48496496 44815421 41489129 38474150 35734128 33241700 30973361 28904502 27012988
55847 27012988 25284245 23707448 22268104 20948768 19735478 18618859 17589612 16637159
$$ packed form
55898A04386957J0338339J1689641J3150114J4708186J6362640J8119827J9977014
55891B08732718K1914472K3890528K5803539K7426096K8370291K8110664K6041672
55884C90289980K1601637J4550446N332199m801107j4175347k1411583k5944679
55877C65441546k8003721k8218803k7248240k5616878k3692179k1695507j9736289
55870A91229929j7867974j6126448j4533070j3091116j1794760j0635034r595382
55863I7586145q653446p793148p008719o296022n648536n063375m542353m084050
55855D8496496l681075l326292l014979k740022k492428k268339k068859j891514
55847B7012988j728743j576797j439344j319336j213290j116619j029247r52453
$$ plain form
55839 16637159 15752495 14928649 14158148 13433050 12747766 12099587 11486653 10907506 10362101
55830 10362101 9850776 9372116 8923328 8501984 8105488 7729746 7370747 7027313 6700333
55821 6700333 6389554 6092893 5808694 5536849 5277736 5031567 4798751 4579554 4373378
55812 4373378 4179251 3996668 3825096 3663387 3510822 3367944 3234993 3110235 2991481
55803 2991481 2878888 2774532 2679131 2590581 2506098 2424842 2348027 2276961 2211237 2148772 2087782
55792 2087782 2028542 1972571 1920081 1869377 1819058 1769615 1722141 1676611 1632290 1589010 1547176
55781 1547176 1507248 1469681 1434401 1399791 1363555 1325571 1288759 1256101 1227801 1202402 1179309
55770 1179309 1158623 1139400 1119962 1099816 1080040 1061844 1045570 1030676 1015880 999747 981931
$$ packed form
55839A6637159q84664q23846p70501p25098o85284o48179o12934n79147n45405
55830A0362101n11325m78660m48788m21344l96496l75742l58999l43434l26980
55821F700333l10779k96661k84199k71845k59113k46169k32816k19197k06176
55812D373378j94127j82583j71572j61709j52565j42878j32951j24758j18754
55803B991481j12593j04356r5401q8550q4483q1256p6815p1066o5724o2465o0990
55792B087782n9240n5971n2490n0704n0319m9443m7474m5530m4321m3280m1834
55781A547176l9928l7567l5280l4610l6236l7984l6812l2658k8300k5399k3093
55770A179309k0686j9223j9438k0146j9776j8196j6274j4894j4796j6133j7816
$$ plain form
55759 981931 963410 944987 926392 907634 890136 875256 862447 850228 838440 828140 819586 811745
55747 811745 803809 796100 789226 783199 777619 772307 767659 764533 763499 764114 765318 766672 768487 770635
55733 770635 772212 772775 772918 773111 772971 772265 771634 771590 771726 771544 770961 769218 764469 755449 742698 727392
55717 727392 710162 691877 674181 657955 642526 627735 615528 607884 604144 601999 600117 598014
55705 598014 594304 587328 577301 566049 554816 543868 533828 525401 517779 509084 498735 488102
55693 488102 478689 470890 464501 459206 454492 450150 446651 443929 440280 434084 426364 419864 415513 411546
55679 411546 406417 400815 396132 392454 388980 385358 381758 378362 375365 372833 370171 366495 361872 357396
55665 357396 353599 349526 343947 336994 330099 324597 320645 317292 313449 309004 304884 301927 300099 299102
$$ packed form
55759I81931j8521j8423j8595j8758j7498j4880j2809j2219j1788j0300q554p841
55747H11745p936p709o874o027n580n312m648l126j034O15J204J354J815K148
55733G70635J577N63J43J93j40p06o31m4J36j82n83j743m749r020j2751j5306
55717G27392j7230j8285j7696j6226j5429j4791j2207p644l740k145j882k103
55705E98014l710o976j0027j1252j1233j0948j0040q427p622q695j0349j0633
55693D88102r413p799o389n295m714m342l499k722l649o196p720o500m351l967
55679D11546n129n602m683l678l474l622l600l396k997k532k662l676m623m476
55665C57396l797m073n579o953o895n502l952l353l843m445m120k957j828r97
$$ plain form
55651 299102 299215 300846 303634 306640 309060 310311 310052 308823 307915 307739 307053 304830 302018 300127 298809
55636 298809 296449 292601 288082 283102 277206 271020 266082 262712 259833 257252 256287 257489 259409 260432
55622 260432 260554 260583 260787 261114 261757 262913 264776 267946 272575 276888 278188 276077 273210 271969 271773 270676
55606 270676 268215 265237 262087 258680 255888 255262 257306 260961 264795 267968 270213 271609 272354 272333 271096
55591 271096 268666 266144 265051 266120 268839 271907 274112 275241 276246 278037 280077 280813 279535 276953
55577 276953 273772 269704 264396 258427 252707 247493 242636 238247 234474 230925 226863 221903 216434 211574
55563 211574 208562 207514 206942 205330 203083 201896 202178 202397 201192 198731 195488 191212 186077 181544 178834
55548 178834 177406 176022 174416 172779 170476 166795 162545 159501 158325 158100 157808 157261 156672 156310 156643 157866
$$ packed form
55651B99102J13J631K788L006K420J251k59j229r08j76o86k223k812j891j318
55636B98809k360l848m519m980n896o186m938l370k879k581r65J202J920J023
55622B60432J22K9K04L27O43J156J863L170M629M313J300k111k867j241j96j097
55606B70676k461k978l150l407k792o26K044L655L834L173K245J396P45k1j237
55591B71096k430k522j093J069K719L068K205J129J005J791K040P36j278k582
55577B76953l181m068n308n969n720n214m857m389l773l549m062m960n469m860
55563B11574l012j048n72j612k247j187K82K19j205k461l243m276n135m533k710
55548A78834j428j384j606j637k303l681m250l044j176k25k92n47n89l62L33J223
$$ plain form
55532 157866 159071 158696 156286 153358 152080 153074 154762 155059 153731 152748 153923 156709 159171 160808 163081
55517 163081 166997 171708 176251 181247 187631 194625 200424 204487 207945 211868 216062 219479 221098 220558
55503 220558 218538 216332 214540 212536 209674 206413 203560 200980 197915 194233 190536 187317 184631 182247
55489 182247 179504 175510 170236 165008 161252 159219 158481 158804 159683 159922 158903 157573 156878 155918 153297 149809
55473 149809 147889 148435 149981 151171 152242 153508 154217 153979 153921 155110 156607 156414 154031 151067 149334 149066
55457 149066 149068 148157 146190 143756 141129 137968 134224 130789 128625 127642 127164 127151 128039 129559 130753 131226 131470
55440 131470 131832 132095 132205 132390 132333 131230 129026 126624 124454 121860 118462 115144 112951 111868 111473 111928
55424 111928 113325 114688 114860 114147 113971 114947 116256 117017 117368 117843 118417 118695 118676 118835 119588 121000 122876
$$ packed form
55532A57866J205l75k410k928j278R94J688K97j328r83J175K786K462J637K273
55517A63081L916M711M543M996O384O994N799M063L458L923M194L417J619n40
55503B20558k020k206j792k004k862l261k853k580l065l682l697l219k686k384
55489A82247k743l994n274n228l756k033p38L23Q79K39j019j330o95r60k621l488
55473A49809j920N46J546J190J071J266P09k38n8J189J497j93k383k964j733k68
55457A49066Kr11j967k434k627l161l744l435k164r83m78j3Q88J520J194M73K44
55440A31470L62K63J10J85n7j103k204k402k170k594l398l318k193j083l95M55
55424A11928J397J363J72p13j76R76J309P61L51M75N74K78j9J59P53J412J876
$$ plain form
55407 122876 124790 126025 125977 124913 124048 124305 125057 124688 122658 120408 119745 120793 122122 122451 121488 119424
55391 119424 116632 113888 111943 110663 109287 107711 106615 106174 105597 104511 103881 104827 107135 109675 111725
55376 111725 113080 113395 112501 111276 111134 112381 113834 114425 114629 115778 118284 121115 123064 124087 125044 126298
55360 126298 127090 126629 125441 125054 126256 128133 129138 128814 128108 128144 129036 129927 129983 129160 128012 127017 126390 126476
55342 126476 127758 130088 132313 133171 132415 130629 128242 125412 122682 120825 119831 118794 117076 115049 113401
55327 113401 112314 111665 111538 112154 113590 115765 118352 120664 122225 123513 125339 127290 127767 126180 124144
55312 124144 123572 124238 124297 122809 120615 118819 117526 116441 115898 116813 119787 124375 129047 132051 132781 132303
55296 132303 132273 133457 135467 137416 138208 136656 132357 126614 121747 119201 118683 119000 119080 118238 116468 114833
$$ packed form
55407A22876J914J235m8j064q65K57P52l69k030k250o63J048J329L29r63k064
55391A19424k792k744j945j280j376j576j096m41n77j086o30R46K308K540K050
55376A11725J355L15q94j225j42J247J453N91K04J149K506K831J949J023R57J254
55360A26298P92m61j188l87J202J877J005l24p06L6Q92Q91N6q23j148r95o27Q6
55342A26476J282K330K225Q58p56j786k387k830k730j857r94j037j718k027j648
55327A13401j087o49j27O16J436K175K587K312J561J288J826J951M77j587k036
55312A24144n72O66N9j488k194j796j293j085n43R15K974M588M672L004P30m78
55296A32303l0J184K010J949P92j552m299n743m867k546n18L17Q0q42j770j635
$$ plain form
55280 114833 114807 116661 119015 120415 120871 121348 122275 123237 123800 123864 123318 122033 120339 118974 118400 118468 118783 118984
55262 118984 118599 117161 114834 112558 111210 110823 111014 111914 114063 117280 120228 121498 120957 119684 118770 118436
55246 118436 118168 117295 115448 112968 111008 110839 112694 115478 117896 119680 121372 123048 123817 122830 120457
55231 120457 118074 116762 116522 116860 117684 119287 121655 124358 127147 130026 132487 133346 132092 130102 129619
55216 129619 131397 134034 135661 135603 134252 132254 130372 129360 129210 129025 128403 128397 130142 132912 134733 134938
55200 134938 134937 136190 138434 140377 141135 140283 137499 133312 129693 128597 129835 131314 131484 130669 129851 129198
55184 129198 128430 127850 128109 129217 130557 131764 132882 133673 133524 132303 130783 129818 129462 129215 128870 128739 129160
55167 129160 130097 131218 132185 132950 133833 135092 136310 136495 135058 132455 129629 127159 125358 124816 126090 128795
$$ packed form
55280A14833k6J854K354J400M56M77R27R62N63O4n46j285j694j365n74O8L15K01
55262A18984l85j438k327k276j348l87J91R00K149L217K948J270n41j273r14l34
55246A18436k68q73j847k480j960j69J855K784K418J784J692J676P69r87k373
55231A20457k383j312k40L38Q24J603K368K703K789K879K461Q59j254j990m83
55216A29619J778K637J627n8j351j998j882j012j50j85o22oJ745K770J821K05
55200A34938jJ253K244J943P58q52k784m187l619j096J238J479J70q15q18o53
55184A29198p68n80K59J108J340J207J118P91j49j221j520r65l56k47l45j31M21
55167A29160R37J121R67P65Q83J259J218J85j437k603k826k470j801n42J274K705
$$ plain form
55151 128795 131562 133100 132863 130797 127136 122808 119418 118153 118821 120295 121793 123475 125877 129074 132432
55136 132432 135114 136787 137727 138163 137783 136356 134672 134107 135014 136206 136459 136069 136403 138228 140945 143224
55120 143224 143932 142736 140346 138068 136707 135945 135003 133585 131869 130073 128625 128342 129627 131631 132987
55105 132987 133253 132941 132352 131458 130987 132299 135530 138854 140450 140577 140802 141612 141795 140203 137333 134937
55089 134937 134554 136498 139859 143153 145083 144961 142831 139612 137004 136452 137708 138917 138666 137531 136984
55074 136984 137327 137613 137337 137030 137040 136960 136789 137676 140576 144630 147702 148397 147075 145169 143963 143758 143624
55057 143624 142230 139497 137169 137029 138773 140437 140839 140676 141111 142341 144055 146280 148952 151177 151885
55042 151885 151074 149812 149046 148877 148771 148069 146498 144626 143570 143786 144435 144490 144159 144478 145761 147376 148937
$$ packed form
55151A28795K767J538k37k066l661m328l390j265O68J474J498J682K402L197L358
55136A32432K682J673R40M36l80j427j684n65R07J192K53l90L34J825K717K279
55120A43224P08j196k390k278j361p62r42j418j716j796j448k83J285K004J356
55105A32987K66l12n89q94m71J312L231L324J596J27K25Q10J83j592k870k396
55089A34937l83J944L361L294J930j22k130l219k608n52J256J209k51j135n47
55074A36984L43K86k76l07J0q0j71Q87K900M054L072O95j322j906j206k05j34
55057A43624j394k733k328j40J744J664M02j63M35J230J714K225K672K225P08
55042A51885q11j262p66j69j06p02j571j872j056K16O49N5l31L19J283J615J561
$$ plain form
55025 148937 150602 152058 152328 151210 150007 150045 151038 151596 150950 149535 148326 148316 150216 153765 157415 159533
55009 159533 159955 159738 159436 158559 157022 156215 157764 161456 165064 166450 165555 164160 163827 164271 163868 161540
54993 161540 157876 154344 151808 150070 148581 147105 145780 144862 144503 144479 144208 143375 142535 142742 144443 147008
54977 147008 149446 151301 152724 153910 154692 154629 153525 151949 151075 151626 152909 153305 151920 149410 146997 145101
54961 145101 143402 141953 141524 142642 144758 146748 148058 149080 150477 152443 154644 156532 157566 157399 156201
54946 156201 154683 153535 152802 152130 151628 152141 154382 157931 161275 162861 162218 160370 159166 159884 162188 164586
54930 164586 165942 166292 166216 166052 166018 166489 167508 168350 168279 167523 166822 166134 164682 162438 160770 161106 163370 166098
54912 166098 167827 168093 167457 166975 167491 169113 171293 173433 175219 176413 176791 176525 176305 176656 177230 177055 175484
$$ packed form
55025A48937J665J456K70j118j203L8R93N58o46j415j209j0J900L549L650K118
55009A59533M22k17l02q77j537q07J549L692L608J386q95j395l33M44m03k328
54993A61540l664l532k536j738j489j476j325r18l59k4k71q33q40K07J701K565
54977A47008K438J855J423J186P82o3j104j576q74N51J283L96j385k510k413j896
54961A45101j699j449m29J118K116J990J310J022J397J966K201J888J034j67j198
54946A56201j518j148p33o72n02N13K241L549L344J586o43j848j204P18K304K398
54930A64586J356L50p6j64l4M71J019Q42p1p56p01o88j452k244j668L36K264K728
54912A66098J729K66o36m82N16J622K180K140J786J194L78k66k20L51N74j75j571
$$ plain form
54895 175484 172828 170159 168624 168725 170057 171731 173190 174559 176262 178403 180511 181685 181133 178832 175672
54880 175672 172602 169711 166656 163950 163075 164870 168303 171353 172766 172653 171879 171474 172153 173556 174134 172784
54864 172784 170725 170963 175520 183660 193000 201650 208776 213895 216756 218062 219529 222713 227848 233898
54850 233898 239495 243680 246039 246620 245875 244416 242513 239772 235553 229801 223316 217129 211797 207491 204378
54835 204378 202369 200557 197646 193411 189376 187468 188028 189559 190454 190477 190380 190501 190256 189064 187424 186806
54819 186806 188491 192569 198116 204204 210454 216577 221855 225704 228651 232023 236369 240757 244060 246393
54805 246393 248557 250524 251438 251003 249696 247350 242848 236123 229609 226286 226335 226803 224767 220056 214610
54790 214610 210051 206539 203494 200471 197190 193348 188969 184906 182540 182631 184485 186512 187549 187356 185984
$$ packed form
54895A75484k656k669j535J01J332J674J459J369J703K141K108J174n52k301l160
54880A75672l070k891l055k706q75J795L433L050J413j13p74m05O79J403N78j350
54864A72784k059K38M557Q140R340Q650P126N119K861J306J467L184N135O050
54850B33898N597M185K359N81p45j459j903k741m219n752o485o187n332m306l113
54835B04378k009j812k911m235m035j908N60J531Q95K3r7J21k45j192j640o18
54819A86806J685M078N547O088O250O123N278L849K947L372M346M388L303K333
54805B46393K164J967R14m35j307k346m502o725o514l323M9M68k036m711n446
54790B14610m559l512l045l023l281l842m379m063k366R1J854K027J037j93j372
$$ plain form
54775 185984 183374 179836 176333 173706 171919 170482 169190 167968 166597 165382 165594 168037 171360 173052
54761 173052 172233 170354 168965 168166 167797 168632 171248 174636 177178 178374 178604 177939 176486 175326 175509 176290
54745 176290 175980 174724 174798 177546 181441 184072 184889 184853 184310 182792 180666 179553 180731 183915 187882 191593
54729 191593 194382 195685 195194 193148 190182 186991 184255 182600 182312 183156 184688 186669 188990 191273 192791
54714 192791 193005 192190 191515 192319 195073 199014 203025 206908 211503 217475 224438 231627 238979 246819 254644
54699 254644 261061 265151 267300 268430 269072 269471 269826 269744 268120 264484 260109 256773 254643 252377 249249
54684 249249 245946 242992 239620 235008 229796 225436 222533 220648 219282 218086 216240 212752 207851 203504
54670 203504 201932 203646 207131 210369 212484 213909 215297 216754 218197 219893 222123 224692 227384 230663
$$ packed form
54775A85984k610l538l503k627j787j437j292j222j371j215K12K443L323J692
54761A73052q19j879j389p99l69Q35K616L388K542J196K30o65j453j160J83P81
54745A76290l10j256P4K748L895K631Q17l6n43j518k126j113J178L184L967L711
54729A91593K789J303m91k046k966l191k736j655k88Q44J532J981K321K283J518
54714A92791K14q15o75Q04K754L941M011L883M595N972O963P189P352P840P825
54699B54644O417M090K149J130O42L99L55q2j624l636m375l336k130k266l128
54684B49249l303k954l372m612n212m360k903j885j366j196j846l488m901m347
54670B03504j572J714L485L238K115J425J388J457J443J696K230K569K692L279
$$ plain form
54656 230663 235082 240074 244323 247423 250093 252502 253616 252862 251178 249412 246742 242065 236231 231328
54642 231328 228027 225121 221647 218050 214979 212245 209528 207150 205551 204655 204168 203962 203888 203813 204053 205106
54626 205106 206694 207683 207280 205869 204423 203548 203079 202059 199258 194567 189841 187289 186913 186725 185731 185241
54610 185241 186506 188515 189473 189358 189457 190020 190134 189896 190987 194437 198818 201430 200863 197975 194774 192775
54594 192775 192256 192670 193492 194511 195435 195650 194692 192776 190625 188868 187663 186656 185221 183141 181187 180521
54578 180521 181285 182276 182264 181127 179507 178157 177981 179667 182440 184091 183443 182180 182917 185868 188876 190581
54562 190581 191919 194004 196001 196071 193711 190265 187451 185911 185099 184291 183716 184523 187258 190720 193015 193623
54546 193623 193580 193735 193902 193869 194110 194973 196107 197143 198055 198260 196452 192284 187442 183996 182251 181223 180702
$$ packed form
54656B30663M419M992M249L100K670K409J114p54j684j766k670m677n834m903
54642B31328l301k906l474l597l071k734k717k378j599q96m87k06p4p5K40J053
54626B05106J588R89m03j411j446q75m69j020k801m691m726k552l76j88r94m90
54610A85241J265K009R58j15R9N63J14k38J091L450M381K612n67k888l201j999
54594A92775n19M14Q22J019R24K15r58j916k151j757j205j007j435k080j954o66
54578A80521P64R91j2j137j620j350j76J686K773J651o48j263P37K951L008J705
54562A90581J338K085J997P0k360l446k814j540q12q08n75Q07K735L462K295O08
54546A93623m3J55J67l3K41Q63J134J036R12K05j808m168m842l446j745j028n21
$$ plain form
54529 180702 181453 183498 185559 186665 187417 189106 192051 195216 197211 197438 196480 195524 195302 195646 196134 196808
54513 196808 197818 198725 198816 198055 197019 195864 194066 191468 188978 187827 188427 190164 191915 192574 191611 189643
54497 189643 188123 188030 189052 190480 192556 196138 201037 205489 207762 207923 207592 208139 209491 210519 210179 208370
54481 208370 206188 205363 206944 210298 213737 216254 218156 219813 220562 219550 217135 214558 212440 210560 209109
54466 209109 209047 210843 213730 216626 218918 219823 218077 213376 207676 203908 203377 205041 207036 208092 207786
54451 207786 206586 205828 206732 209077 211429 212786 213366 213676 213671 213119 212023 210313 207764 204588 201496 198804
54435 198804 196214 193954 193240 194781 197450 199454 200485 201737 203907 206202 207579 208247 209522 212494 216972
54420 216972 221545 224694 226091 226707 227460 228139 228099 227614 227738 229012 231047 233319 235516 237115 237620 237549 238165
$$ packed form
54529A80702P51K045K061J106P52J689K945L165J995K27r58r56k22L44M88O74
54513A96808J010R07R1p61j036j155j798k598k490j151O00J737J751O59r63j968
54497A89643j520r3J022J428K076L582M899M452K273J61l31N47J352J028l40j809
54481B08370k182q25J581L354L439K517J902J657P49j012k415k577k118j880j451
54466B09109o2J796K887K896K292R05j746m701n700l768n31J664J995J056l06
54451B07786j200p58R04K345K352J357N80L10nn52j096j710k549l176l092k692
54435A98804k590k260p14J541K669K004J031J252K170K295J377O68J275K972M478
54420B16972M573L149J397O16P53O79m0m85J24J274K035K272K197J599N05p1O16
$$ plain form
54403 238165 239638 240319 238712 235651 233553 233728 235262 236510 236831 236535 235845 234577 232744 230886 229480
54388 229480 228205 226292 223771 221853 221450 221663 220777 218871 218271 220647 224573 227061 227018 225918 225252 224804
54372 224804 223881 222952 222948 223529 223177 221082 218272 216590 216854 218252 219427 219989 220729 222329 224160 224857 224061
54355 224061 223018 223150 224511 226115 227442 228894 230728 232205 232290 230950 229284 228319 228051 227857 227640 228073
54339 228073 229610 231582 232628 232037 230562 229902 231418 235109 239720 243877 247209 250219 253133 255362 256351
54324 256351 256442 256321 255960 254843 253135 251882 251900 252952 254104 254517 254022 253521 254597 257881 261868 264362
54308 264362 265129 265923 267565 268526 267366 265375 265390 268687 274265 280551 286312 290250 291375 290077 287741
54293 287741 285171 282436 280012 278627 277747 275786 272342 268863 266388 264013 260600 256733 253717 251671
$$ packed form
54403B38165J473O81j607l061k098J75J534J248L21k96o90j268j833j858j406
54388B29480j275j913k521j918m03K13q86j906o00K376L926K488m3j100o66m48
54372B24804r23r29mN81l52k095k810j682K64J398J175N62P40J600J831O97p96
54355B24061j043J32J361J604J327J452J834J477Q5j340j666r65k68j94k17M33
54339B28073J537J972J046n91j475o60J516L691M611M157L332L010K914K229R89
54324B56351R1j21l61j117j708j253J8J052J152M13m95n01J076L284L987K494
54308B64362P67P94J642R61j160j991J5L297N578O286N761L938J125j298k336
54293B87741k570k735k424j385q80j961l444l479k475k375l413l867l016k046
$$ plain form
54279 251671 250079 249421 250512 252540 253584 253227 253036 254062 255398 255966 256317 257408 258512 257774 254618 250411
54263 250411 246783 244287 242843 242363 242422 242083 240884 239668 239733 241270 243158 244243 244220 243303 241809 240379
54247 240379 239926 240693 241781 242192 242095 242362 243009 242948 241442 239090 237022 235682 234778 233991 233207 232405 231803 231928
54229 231928 233094 234942 236903 238969 241480 244154 245912 245978 244984 244673 246459 250296 254772 258167 259410
54214 259410 258335 255551 252311 250055 249413 249654 249607 249188 249354 250482 251632 251918 251856 252544 253977 255215 256116
54197 256116 257824 261131 265045 267558 267625 266111 264903 265350 267372 269861 271792 272876 273266 273052 272408 271872
54181 271872 271884 272010 271183 268956 266145 263961 262685 261526 259720 257453 255440 253716 251332 247646 243638
54166 243638 241190 240969 241671 241678 240779 239854 239560 240072 241528 243763 245889 247126 247905 249261 251114 252032 250837
$$ packed form
54279B51671j592o58J091K028J044l57j91J026J336N68L51J091J104p38l156m207
54263B50411l628k496j444m80N9l39j199j216O5J537J888J085k3r17j494j430
54247B40379m53P67J088M11r7K67O47o1j506k352k068j340r04p87p84q02o02J25
54229B31928J166J848J961K066K511K674J758O6r94l11J786L837M476L395J243
54214B59410j075k784l240k256o42K41m7m19J66J128J150K86o2O88J433J238R01
54197B56116J708L307L914K513O7j514j208M47K022K489J931J084L90k14o44n36
54181B71872J2J26q27k227k811k184j276j159j806k267k013j724k384l686m008
54166B43638k448k21P02Pq99r25k94N12J456K235K126J237P79J356J853R18j195
$$ plain form
54149 250837 247743 243911 240640 238989 239226 240317 240690 239703 237823 235550 233204 231721 232270 234595 236975
54134 236975 238480 240071 242750 245829 248068 249493 250789 251771 251836 251406 251465 251915 251755 250823 250262 251148 253573
54117 253573 256955 260308 262402 262699 262105 261874 261948 261418 260348 259791 260054 260364 260380 260509 260445 259075 256532 254795
54099 254795 255208 256722 257671 257982 258256 257777 255303 251349 247989 246370 245802 245271 244606 243979 243550 243853 245390
54082 245390 247363 247876 246110 243613 242634 243617 244989 245191 244265 243436 243638 244747 246166 247818 250105 252866
54066 252866 254979 255556 255204 255340 256468 257909 259275 261116 263677 265865 266284 264906 263105 262302 263068 265240
54050 265240 268169 270896 272665 273431 273611 273488 273223 273366 274639 277051 279635 281358 282109 282694 284136 287002
54034 287002 290977 294860 297380 298496 299725 302784 307970 314125 319925 324689 328078 329811 330063 329598 329033
$$ packed form
54149B50837l094l832l271j651K37J091L73r87j880k273k346j483N49K325K380
54134B36975J505J591K679L079K239J425J296R82O5m30N9M50j60r32n61Q86K425
54117B53573L382L353K094K97n94k31P4n30j070n57K63L10J6J29o4j370k543j737
54099B54795M13J514R49L11K74m79k474l954l360j619n68n31o65o27m29L03J537
54082B45390J973N13j766k497r79R83J372K02r26q29K02J109J419J652K287K761
54066B52866K113N77l52J36J128J441J366J841K561K188M19j378j801q03P66K172
54050B65240K929K727J769P66J80j23k65J43J273K412K584J723P51N85J442K866
54034B87002L975L883K520J116J229L059N186O155N800M764L389J733K52m65n65
$$ plain form
54019 329033 328239 326799 324742 322317 319327 315385 310780 306407 302742 299502 296609 294849 295027 296794 298901
54004 298901 300522 301849 303427 305301 306966 307974 308482 309165 310580 312626 314798 316872 319016 321284 323525
53989 323525 325931 329123 333361 338172 343156 348565 354558 360511 365801 370763 375897 380609 383979 386631
53975 386631 390425 395991 401852 406536 410445 414887 420104 425151 429130 431829 433621 435329 437641 440019
53961 440019 440914 439668 437494 435717 433975 431311 428187 425730 423442 419599 414054 408763 404978 401595
53947 401595 397174 392025 387044 381811 375487 368873 363856 360917 358610 355587 351878 347948 343785 339567
53933 339567 336302 334882 334839 334706 333530 331707 330428 330507 331522 331843 329830 325476 320836 318334 318331 318585 316498
53916 316498 312045 308180 308032 311711 316253 318766 319176 319592 321507 324477 327527 330876 335505 341337 346696
$$ packed form
54019C29033p94j440k057k425k990l942m605m373l665l240k893j760J78J767K107
54004B98901J621J327J578J874J665J008N08O83J415K046K172K074K144K268K241
53989C23525K406L192M238M811M984N409N993N953N290M962N134M712L370K652
53975C86631L794N566N861M684L909M442N217N047L979K699J792J708K312K378
53961D40019Q95j246k174j777j742k664l124k457k288l843n545n291l785l383
53947D01595m421n149m981n233o324o614n017k939k307l023l709l930m163m218
53933C39567l265j420m3j33j176j823j279P9J015L21k013m354m640k502lK54k087
53916C16498m453l865j48L679M542K513M10M16J915K970L050L349M629N832N359
$$ plain form
53901 346696 349948 351298 352500 354856 358051 361128 364163 368310 374311 381771 390098 399405 409739 419778
53887 419778 427178 430414 429944 427651 425527 424690 424926 424980 423840 421986 420993 421801 423960 426803 430551 435572
53871 435572 441149 446002 449971 454215 459508 465165 470166 474663 479595 485170 490694 495985 501981 509298
53857 509298 516912 523257 528400 534001 540846 547615 552915 557628 563794 571339 577401 579396 577692 574552
53843 574552 571395 568114 564428 560512 556262 551183 545418 540079 535994 532668 528946 524228 518487 511585
53829 511585 503426 494655 486322 478614 470559 461470 452256 444713 439625 436023 432318 427727 422496 417193
53815 417193 412182 407550 403159 398733 394159 389761 386048 383135 380568 377754 374440 370687 366617 362344
53801 362344 358142 354496 351788 349839 347792 344706 340475 335983 332173 329075 326138 323402 321870 322434
$$ packed form
53901C46696L252J350J202K356L195L077L035M147O001P460Q327R307J0334J0039
53887D19778P400L236m70k293k124q37K36N4j140j854r93Q08K159K843L748N021
53871D35572N577M853L969M244N293N657N001M497M932N575N524N291N996P317
53857E09298P614O345N143N601O845O769N300M713O166P545O062J995j704l140
53843E74552l157l281l686l916m250n079n765n339m085l326l722m718n741o902
53829E11585q159q771q333p708q055r089r214p543n088l602l705m591n231n303
53815D17193n011m632m391m426m574m398l713k913k567k814l314l753m070m273
53801C62344m202l646k708j949k047l086m231m492l810l098k937k736j532N64
$$ plain form
53787 322434 324735 327390 329263 330239 330753 330739 329350 326021 321825 319309 320425 324653 329631 333512 336066
53772 336066 337616 338019 337333 336644 337121 338419 338909 337579 335116 333074 332512 333503 335332 336929 337551 337370
53756 337370 337202 337641 338779 340749 343936 348318 353038 357146 360654 364528 369621 375853 382415 388612 394396
53741 394396 400061 405579 410501 414689 418836 423793 429386 434355 437674 439641 441455 443887 446583 448660
53727 448660 449812 450763 452511 455196 457974 460026 461186 461175 458838 453184 445124 437190 431112 426337 421378
53712 421378 415859 410582 406065 401930 397644 393145 388620 384228 380266 377190 375193 373942 372943 372074 371549
53697 371549 371326 370748 368988 365938 362467 359666 358016 357445 357867 359161 360769 361921 362355 362372 362134 361470
53681 361470 360473 359719 359644 360164 361058 362157 363012 363137 362886 363328 364883 366857 368812 371302 374468 377065 378168
$$ packed form
53787C22434K301K655J873R76N14j4j389l329m196k516J116M228M978L881K554
53772C36066J550M03o86o89M77J298M90j330k463k042n62R91J829J597O22j81
53756C37370j68M39J138J970L187M382M720M108L508L874N093O232O562O197N784
53741C94396N665N518M922M188M147M957N593M969L319J967J814K432K696K077
53727D48660J152R51J748K685K778K052J160j1k337n654q060p934o078m775m959
53712D21378n519n277m517m135m286m499m525m392l962l076j997j251r99q69n25
53697C71549k23n78j760l050l471k801j650n71M22J294J608J152M34J7k38o64
53681C61470r97p54p5N20Q94J099Q55J25k51M42J555J974J955K490L166K597J103
$$ plain form
53664 378168 379019 381539 385579 389427 392845 397475 403769 409557 412800 414250 415984 418430 420401 421429
53650 421429 422483 424526 427703 432052 437753 444333 450575 455764 460323 464875 469222 472802 475679 478457
53636 478457 481448 484479 487382 490111 492353 493565 493764 493904 495093 497551 500597 503398 505248 505343 503202
53621 503202 499621 496519 495183 495044 494651 493341 491317 488662 485397 482369 480820 480748 480707 479720 478512 478289
53605 478289 479121 480301 481592 483070 484155 483896 482285 480415 479184 478530 478183 478461 479756 481535 482507 481965
53589 481965 480736 480468 481982 484536 486887 488715 490637 493141 496223 499946 504444 509074 512527 514437
53575 514437 516165 519269 523763 528605 533314 538125 543027 547872 553267 560133 568205 576001 582568 588293
53561 588293 593728 598688 603103 607783 613449 619518 624701 628480 631403 634292 637862 642808 649460 657295
$$ packed form
53664C78168Q51K520M040L848L418M630O294N788L243J450J734K446J971J028
53650D21429J054K043L177M349N701O580O242N189M559M552M347L580K877K778
53636D78457K991L031K903K729K242J212J99J40J189K458L046K801J850R5k141
53621E03202l581l102j336j39l93j310k024k655l265l028j549p2m1r87j208k23
53605D78289Q32J180J291J478J085k59j611j870j231o54l47K78J295J779R72n42
53589D81965j229k68J514K554K351J828J922K504L082L723M498M630L453J910
53575E14437J728L104M494M842M709M811M902M845N395O866Q072P796O567N725
53561E88293N435M960M415M680N666O069N183L779K923K889L570M946O652P835
$$ plain form
53547 657295 665332 672918 679702 685151 688917 691736 695052 699370 703591 706403 707781 708558 709034 708877 708229
53532 708229 707912 708183 708053 706442 703595 700774 698798 697444 696087 694212 691447 687920 684714 683110 682965
53517 682965 682581 680624 677508 674363 671431 668272 664954 661952 659303 657022 656096 657692 661122 663858 664147
53502 664147 662805 661947 662719 664732 666932 668336 668506 668052 668320 670021 672577 675306 678775 684245 692023
53487 692023 700925 709223 715821 720970 726376 734142 744851 756887 768161 778176 787872 798056 808950
53474 808950 820951 834612 849811 865910 882881 901360 921426 942359 963997 987325 1013036
53463 1013036 1040309 1067795 1095282 1123694 1153916 1186257 1220588 1256066 1291075 1324530 1357317
53452 1357317 1391615 1428706 1468175 1509182 1551333 1593876 1635324 1674933 1713808 1753346 1793036
$$ packed form
53547F57295Q037P586O784N449L766K819L316M318M221K812J378P77M76j57o48
53532G08229l17K71j30j611k847k821j976j354j357j875k765l527l206j604j45
53517F82965l84j957l116l145k932l159l318l002k649k281r26J596L430K736K89
53502F64147j342q58P72K013K200J404J70m54K68J701K556K729L469N470P778
53487F92023Q902Q298O598N149N406P766J0709J2036J1274J0015R696J0184J0894
53474H08950J2001J3661J5199J6099J6971J8479K0066K0933K1638K3328K5711
53463A013036K7273K7486K7487K8412L0222L2341L4331L5478L5009L3455L2787
53452A357317L4298L7091L9469M1007M2151M2543M1448L9609L8875L9538L9690
$$ plain form
53441 1793036 1831096 1867059 1902273 1937642 1972482 2006315 2040158 2074631 2108041 2138236 2165876
53430 2165876 2193853 2223481 2253223 2281590 2309176 2336726 2363110 2387084 2409878 2433865 2458878
53419 2458878 2481669 2499238 2511320 2519516 2525403 2529932 2533309 2534550 2531944 2524737 2513923 2500897 2485834
53406 2485834 2467888 2446519 2422036 2395197 2366792 2337513 2307880 2278318 2249345 2221271 2193639
53395 2193639 2165402 2135901 2105345 2074211 2042736 2011287 1980679 1951661 1924427 1899010 1875808
53384 1875808 1855349 1837830 1823167 1811154 1801288 1792936 1786169 1782003 1781164 1782885 1785640 1788959 1793886
53371 1793886 1801561 1811905 1823917 1836943 1851410 1868468 1889102 1913534 1941279 1971555 2003557
53360 2003557 2036742 2071329 2108466 2149259 2193512 2239934 2287786 2337846 2391416 2448858 2509474
$$ packed form
53441A793036L8060L5963L5214L5369L4840L3833L3843L4473L3410L0195K7640
53430B165876K7977K9628K9742K8367K7586K7550K6384K3974K2794K3987K5013
53419B458878K2791J7569J2082Q196N887M529L377J241k606p207j0814j3026j5063
53406B485834j7946k1369k4483k6839k8405k9279k9633k9562k8973k8074k7632
53395B193639k8237k9501l0556l1134l1475l1449l0608k9018k7234k5417k3202
53384A875808k0459j7519j4663j2013r866q352o767m166q39J721K755L319M927
53371A793886P675J0344J2012J3026J4467J7058K0634K4432K7745L0276L2002
53360B003557L3185L4587L7137M0793M4253M6422M7852N0060N3570N7442O0616
$$ plain form
53349 2509474 2572342 2636827 2702591 2769620 2838283 2909292 2983715 3062540 3145284 3229205 3311288
53338 3311288 3391503 3472857 3557521 3644321 3731105 3817936 3905963 3994090 4079252 4159984 4237646
53327 4237646 4313748 4387868 4458719 4525533 4587651 4644233 4695271 4741582 4782847 4816833 4841562
53316 4841562 4857284 4865249 4865540 4857338 4840620 4816322 4785100 4746878 4701190 4647165 4583909 4512044
53304 4512044 4434371 4353763 4270715 4184192 4094545 4004075 3914590 3825842 3736917 3648099 3560782
53293 3560782 3476251 3395144 3317525 3242939 3170653 3100124 3031060 2963109 2896115 2830763 2768347
53282 2768347 2709644 2654427 2602228 2553041 2507109 2464541 2425405 2389621 2356526 2325151 2295406
53271 2295406 2268577 2246063 2227740 2211810 2196129 2179537 2162217 2145122 2129034 2114095 2100280
$$ packed form
53349B509474O2868O4485O5764O7029O8663P1009P4423P8825Q2744Q3921Q2083
53338C311288Q0215Q1354Q4664Q6800Q6784Q6831Q8027Q8127Q5162Q0732P7662
53327D237646P6102P4120P0851O6814O2118N6582N1038M6311M1265L3986K4729
53316D841562J5722P965K91q202j6718k4298l1222l8222m5688n4025o3256p1865
53304D512044p7673q0608q3048q6523q9647r0470q9485q8748q8925q8818q7317
53293C560782q4531q1107p7619p4586p2286p0529o9064o7951o6994o5352o2416
53282B768347n8703n5217n2199m9187m5932m2568l9136l5784l3095l1375k9745
53271B295406k6829k2514j8323j5930j5681j6592j7320j7095j6088j4939j3815
$$ plain form
53260 2100280 2088102 2078334 2071062 2065576 2061302 2058338 2056862 2056692 2057772 2060526 2065267 2071803 2080118 2090923
53246 2090923 2104857 2121519 2140057 2160545 2183951 2210671 2239840 2270312 2301836 2334914 2369801
53235 2369801 2405966 2442464 2478728 2514979 2551744 2588892 2625429 2660424 2693709 2725113 2753304
53224 2753304 2776363 2793758 2807051 2818079 2826782 2831299 2829952 2822571 2809932 2792637 2770947 2745427
53212 2745427 2717097 2686736 2654311 2619362 2581771 2541835 2499731 2455423 2409156 2361515 2312789
53201 2312789 2262902 2212341 2162521 2114369 2066945 2018403 1968234 1917559 1867198 1816690 1765735
53190 1765735 1715517 1667630 1622304 1578573 1535696 1493486 1451716 1410551 1371519 1336705 1306474
53179 1306474 1278939 1252215 1226340 1202327 1180183 1158910 1138054 1118135 1099578 1082165 1065703
$$ packed form
53260B100280j2178r768p272n486m274k964j476j70J080K754M741O536Q315J0805
53246B090923J3934J6662J8538K0488K3406K6720K9169L0472L1524L3078L4887
53235B369801L6165L6498L6264L6251L6765L7148L6537L4995L3285L1404K8191
53224B753304K3059J7395J3293J1028Q703M517j347p381j2639j7295k1690k5520
53212B745427k8330l0361l2425l4949l7591l9936m2104m4308m6267m7641m8726
53201B312789m9887n0561m9820m8152m7424m8542n0169n0675n0361n0508n0955
53190A765735n0218m7887m5326m3731m2877m2210m1770m1165l9032l4814l0231
53179A306474k7535k6724k5875k4013k2144k1273k0856j9919j8557j7413j6462
$$ plain form
53168 1065703 1050343 1035777 1020675 1003623 984511 964711 945940 929060 913647 898365 881829
53157 881829 863456 843794 824128 805761 789422 775005 761722 748736 735750 722896 710172
53146 710172 697358 684545 672272 660851 649835 638510 626721 614949 603701 593141 583181 573609
53134 573609 564230 555182 546986 539908 533359 526375 518718 511047 503918 497159 490565 484746 480627 478178
53120 478178 476132 473292 469782 466627 464102 461036 456160 449887 444144 440362 438233 436785 436009 436542 438042
53105 438042 438841 437548 434498 431334 429543 429475 430268 430449 429013 426307 423675 422122 421634 421708 421880 421523 419975
53088 419975 417455 415141 413581 411629 407947 403224 399726 398661 399094 399604 399848 400013 399872 399297 399000 399773
53072 399773 401355 402913 404360 406285 408755 411149 413225 415372 417550 418995 419551 420424 422676 425476 426931
$$ packed form
53168A065703j5360j4566j5102j7052j9112j9800j8771j6880j5413j5282j6536
53157H81829j8373j9662j9666j8367j6339j4417j3283j2986j2986j2854j2724
53146G10172j2814j2813j2273j1421j1016j1325j1789j1772j1248j0560r960r572
53134E73609r379r048q196p078o549o984p657p671p129o759o594n819m119k449
53120D78178k046k840l510l155k525l066m876o273n743l782k129j448p76N33J500
53105D38042P99j293l050l164j791o8P93J81j436k706k632j553m88P4J72l57j548
53088D19975k520k314j560j952l682m723l498j065M33N10K44J65j41n75k97P73
53072C99773J582J558J447J925K470K394K076K147K178J445N56Q73K252K800J455
$$ plain form
53057 426931 426535 425704 425718 426163 425941 424992 424111 423568 422945 422314 422583 424345 427065 429840 432295 434126 434269
53040 434269 431508 426023 419643 414252 410422 407859 406590 406900 408175 408633 406879 403614 401270 401653 404043
53025 404043 405870 405284 402811 400427 399344 399140 398955 398871 399593 400974 401559 399886 396079 391880 389230 388861
53009 388861 389917 390649 389702 387231 384643 382843 380925 377373 372580 369063 368581 369972 370835 370715 371261 373497
52993 373497 376398 378441 379232 379089 378278 377441 377705 379307 380923 381467 381809 383411 385827 387145 386731 385887
52977 385887 385572 385127 383870 382486 381834 381496 380716 379955 380177 381002 380952 379568 378245 378582 380598 382811 383577
52960 383577 382213 379314 376305 374473 374262 375482 377844 380917 383885 386089 387771 389637 391647 392966
52946 392966 393378 394006 396077 399306 401992 402521 400540 397026 393627 391700 391509 392339 393532 395087 397037
$$ packed form
53057D26931l96q31J4M45k22r49q81n43o23o31K69J762K720K775K455J831J43
53040D34269k761n485o380n391l830k563j269L10J275M58j754l265k344L83K390
53025D04043J827n86k473k384j083k04j85q4P22J381N85j673l807m199k650l69
53009C88861J056P32r47k471k588j800j918l552m793l517m82J391Q63j20N46K236
52993C73497K901K043P91j43q11q37K64J602J616N44L42J602K416J318m14q44
52977C85887l15m45j257j384o52l38p80p61K22Q25n0j384j323L37K016K213P66
52960C83577j364k899l009j832k11J220K362L073K968K204J682J866K010J319
52946C92966M12O28K071L229K686N29j981l514l399j927j91Q30J193J555J950
$$ plain form
52931 397037 398740 399476 399531 399913 400982 402069 402657 403175 404196 405432 406234 406748 407828 409830 412090 413649
52915 413649 414067 413533 412759 412869 414778 418299 422196 425445 428023 430225 431874 432865 433965 435979 438171
52900 438171 438529 435968 431547 427173 423813 421424 419801 418657 417415 415843 414603 414210 413698 411518 407880
52885 407880 404966 404260 404759 404738 404340 405034 406847 407722 406069 402840 400281 399331 399137 398698 397977 397278 396502
52868 396502 395602 395244 396263 398470 400546 401326 400859 399977 399181 398338 397274 396093 394865 393508 392278 391853
52852 391853 392422 392930 391905 389150 386118 384423 384394 385265 386267 387099 387635 387815 387884 388292 389229 390442 391527
52835 391527 392142 391979 390950 389593 388933 389609 391188 392567 393062 393032 393509 395194 397714 399774 400238 399210
52819 399210 398013 398029 399680 402542 406087 409986 413862 417177 419588 421276 422816 424673 426708 428086 427846
$$ packed form
52931C97037J703P36N5L82J069J087N88N18J021J236Q02N14J080K002K260J559
52915D13649M18n34p74J10J909L521L897L249K578K202J649R91J100K014K192
52900D38171L58k561m421m374l360k389j623j144j242j572j240l93n12k180l638
52885D07880k914p06M99k1l98O94J813Q75j653l229k559r50j94m39p21o99p76
52868C96502r00l58J019K207K076P80m67q82p96q43j064j181j228j357j230m25
52852C91853N69N08j025k755l032j695k9Q71J002Q32N36J80O9M08R37J213J085
52835C91527O15j63j029j357o60O76J579J379M95l0M77J685K520K060M64j028
52819C99210j197J6J651K862L545L899L876L315K411J688J540J857K035J378k40
$$ plain form
52804 427846 425850 423196 421521 421722 423386 425360 426714 427148 426776 425763 424228 422341 420212 417529 413482
52789 413482 407533 400416 393953 389466 386539 383820 380901 378811 378488 379360 379898 379289 378075 377131 376463 375261
52773 375261 372984 370146 367849 366597 365833 364880 364135 364801 367208 369845 370531 368536 365141 362131 360107
52758 360107 358552 357149 356482 357305 359510 362210 364707 367015 369421 371944 374457 376985 379492 381530 382518
52743 382518 382345 381346 379684 377167 373830 370340 367586 366006 365400 365175 364710 363798 362920 362828 363696 364926 365897
52726 365897 366501 366702 365992 363882 360776 357889 356274 356232 357445 359183 360435 360475 359540 358593 358280 358439 358749
52709 358749 359326 360313 361264 361424 360514 358868 356951 355121 353791 353249 353164 352746 351795 351255 352275 354747 357327
52692 357327 359074 360566 363011 366472 369586 371101 371224 371235 372264 374826 379116 384860 390737 394765 395909
$$ packed form
52804D27846j996k654j675K01J664J974J354M34l72j013j535j887k129k683m047
52789D13482n949p117o463m487k927k719k919k090l23Q72N38o09j214r44o68j202
52773C75261k277k838k297j252p64r53p45O66K407K637O86j995l395l010k024
52758C60107j555j403o67Q23K205K700K497K308K406K523K513K528K507K038R88
52743C82518j73r99j662k517l337l490k754j580o06k25m65r12q78r2Q68J230R71
52726C65897O04K01p10k110l106k887j615m2J213J738J252M0r35r47l13J59L10
52709C58749N77R87R51J60r10j646j917j830j330n42q5m18r51n40J020K472K580
52692C57327J747J492K445L461L114J515J23J1J029K562M290N744N877M028J144
$$ plain form
52677 395909 395170 394598 395220 396321 396673 395984 394907 394093 393655 393370 392812 391258 388051 383543 379390 377343
52661 377343 377672 379166 380771 382623 385058 387135 387195 385134 383242 383869 386484 387918 385819 381307 377807
52646 377807 377711 380610 384369 387094 388100 387753 386847 385896 384840 383605 382839 383500 385604 387997 389678 390722
52630 390722 391562 392156 392551 393534 395604 397652 397891 396158 394207 393591 394275 395545 397047 398319 398469 397264
52614 397264 395829 395310 395312 394690 393462 392938 393979 395960 397467 397516 396280 395227 396178 399411 403024 405115
52598 405115 406279 408619 412306 414758 413872 410738 408139 407418 407994 409198 410963 412849 413772 413125 411335
52583 411335 409026 406443 404002 402660 403110 404983 407358 409727 412042 414110 415553 416367 417102 418342 420252
52568 420252 422631 425177 427606 429673 431101 431523 430737 429284 428529 429586 432002 433917 433743 431424 428026
$$ packed form
52677C95909p39n72O22J101L52o89j077q14m38k85n58j554l207m508m153k047
52661C77343L29J494J605J852K435K077O0k061j892O27K615J434k099m512l500
52646C77807r6K899L759K725J006l47r06r51j056j235p66O61K104K393J681J044
52630C90722Q40N94L95R83K070K048K39j733j951o16O84J270J502J272J50j205
52614C97264j435n19Ko22j228n24J041J981J507M9j236j053R51L233L613K091
52598D05115J164K340L687K452q86l134k599p21N76J204J765J886R23o47j790
52583D11335k309k583k441j342M50J873K375K369K315K068J443Q14P35J240J910
52568D20252K379K546K429K067J428M22p86j453p55J057K416J915j74k319l398
$$ plain form
52553 428026 424580 421669 419618 418411 417647 417085 417169 418454 420592 422517 423641 424305 425001 425859 427096 429241
52537 429241 432356 435465 437158 436570 433648 429062 424239 420866 419712 420172 421281 422705 424357 425839 427112
52522 427112 429209 433153 438266 442486 444372 444069 442358 439801 436968 434572 432928 431886 431552 432383 434231
52507 434231 435911 436196 434861 432564 430302 429190 429964 432067 433743 433691 432198 430203 427837 424756 421567
52492 421567 419802 420235 421942 423378 423892 423846 423723 423679 423837 424379 425063 425073 423855 421980 420617 420171 420052 419977
52474 419977 420634 422494 424719 426170 426996 428132 429527 430104 429454 428341 427359 426293 425161 424674 425221 426450
52458 426450 428311 431203 434433 435970 434875 432926 432629 434544 437672 441381 445437 449054 451803 454883
52444 454883 459566 464731 467918 468800 469441 470788 471055 468544 464278 460600 458401 456967 455556 453927 451928
$$ packed form
52553D28026l446k911k051j207p64n62Q4J285K138J925J124O64O96Q58J237K145
52537D29241L115L109J693n88k922m586m823l373j154M60J109J424J652J482J273
52522D27112K097L944N113M220J886l03j711k557k833k396j644j042l34Q31J848
52507D34231J680K85j335k297k262j112P74K103J676n2j493j995k366l081l189
52492D21567j765M33J707J436N14m6j23m4J58N42O84J0j218j875j363m46j19p5
52474D19977O57J860K225J451Q26J136J395N77o50j113r82j066j132m87N47J229
52458D26450J861K892L230J537j095j949k97J915L128L709M056L617K749L080
52444D54883M683N165L187Q82O41J347K67k511m266l678k199j434j411j629j999
$$ plain form
52429 451928 449559 446942 443694 439124 433721 429507 427992 428554 429677 430827 432016 432568 431937 431138 431687
52414 431687 433358 434618 435242 436789 440145 444122 447141 449013 450265 450889 450820 450956 452533 455729 459621
52399 459621 463360 466748 469853 472658 475135 477202 478523 478569 476949 473721 469490 465152 461230 457568 454051
52384 454051 451392 450371 450289 449241 446502 443662 442463 442290 441030 438018 434814 432988 432441 432314 432519 433548
52368 433548 435305 436868 437361 436808 436250 437012 439443 442349 444262 445337 447246 450900 455054 457780 458650
52353 458650 458777 459283 460682 463447 468087 474530 482227 490941 500716 510924 520143 527327 532443 535619
52339 535619 536358 534300 530316 526058 522428 518990 514978 510456 506261 503080 500843 499045 497445 496347
52325 496347 496217 497200 499043 501331 503721 506179 509108 512987 517717 522551 526948 531177 535778 540774 545880
$$ packed form
52429D51928k369k617l248m570n403m214j515N62J123J150J189N52o31p99N49
52414D31687J671J260O24J547L356L977L019J872J252O24o9J36J577L196L892
52399D59621L739L388L105K805K477K067J321M6j620l228m231m338l922l662l517
52384D54051k659j021q2j048k739k840j199j73j260l012l204j826n47j27K05J029
52368D33548J757J563M93n53n58P62K431K906J913J075J909L654M154K726Q70
52353D58650J27N06J399K765M640O443P697Q714R775J0208R219P184N116L176
52339E35619P39k058l984m258l630l438m012m522m195l181k237j798j600j098
52325D96347j30R83J843K288K390K458K929L879M730M834M397M229M601M996N106
$$ [...]
##END NTUPLES=NMR SPECTRUM
##END=
