
##TITLE=UV1041_TOSA01-ROVE100B_6099594_KRDsTV3hNo
##JCAMPDX= 6.0         $$ Bruker NMR JCAMP-DX V2.0
##DATA TYPE= NMR SPECTRUM
##DATA CLASS= NTUPLES
##ORIGIN= BRUKER
##OWNER= Administrator
$$ 1.72 TOPSPIN		Version 2.1
$$ 2012-05-12 21:14:44.812 -0500  Administrator@TOPSPIN
$$ Compression mode = diff/dup
##.OBSERVE FREQUENCY= 400.13188235
##.OBSERVE NUCLEUS= ^1H
##.ACQUISITION MODE= SIMULTANEOUS (DQD)
##.ACQUISITION SCHEME= undefined
##.AVERAGES= 8
##.DIGITISER RES= 22
##SPECTROMETER/DATA SYSTEM= spect
##.PULSE SEQUENCE= zg30
##.SOLVENT NAME= COFFEE_meoh
##.SHIFT REFERENCE= INTERNAL, COFFEE_meoh, 1, 14.98061
##AUDIT TRAIL= $$ (NUMBER, WHEN, WHO, WHERE, PROCESS, VERSION, WHAT)
$$ ##TITLE= Audit trail, TOPSPIN		Version 2.1
$$ ##JCAMPDX= 5.01
$$ ##ORIGIN= Bruker BioSpin GmbH
$$ ##OWNER= Administrator
$$ $$ C:\Bruker\TOPSPIN/data/COFFEE/nmr/UV1041_TOSA01-ROVE100B_6099594_KRDsTV3hNo/10/pdata/1/auditp.txt
$$ ##AUDIT TRAIL=  $$ (NUMBER, WHEN, WHO, WHERE, PROCESS, VERSION, WHAT)
(   1,<2012-05-12 21:14:37.359 -0500>,<Administrator>,<TOPSPIN>,<go>,<TOPSPIN 2.1>,
      <created by zg
	started at 2012-05-12 21:13:30.515 -0500,
	POWCHK enabled, PULCHK disabled,
       configuration hash MD5:
       AF F2 23 6B 01 CD 40 DD E5 A1 38 A0 06 EA F7 77
       data hash MD5: 64K
       DB F7 45 E1 F7 4E 10 CC 0F F0 FF 7D 59 CD DD 4E>)
(   2,<2012-05-12 21:14:40.187 -0500>,<Administrator>,<TOPSPIN>,<proc1d>,<TOPSPIN 2.1>,
      <Start of raw data processing
       efp LB = 0 FT_mod = 6 PKNL = 1 PHC0 = 0 PHC1 = 0 SI = 32K 
       data hash MD5: 32K
       51 4C E3 C8 47 C0 D4 D9 EE A2 04 4D 84 1D E6 61>)
(   3,<2012-05-12 21:14:40.546 -0500>,<Administrator>,<TOPSPIN>,<proc1d>,<TOPSPIN 2.1>,
      <pk PHC0 = 211.0638 PHC1 = 0 
       data hash MD5: 32K
       D9 43 9F C1 2A F7 97 4B FF D9 94 10 2A 48 17 4A>)
(   4,<2012-05-12 21:14:40.609 -0500>,<Administrator>,<TOPSPIN>,<proc1d>,<TOPSPIN 2.1>,
      <abs ABSG = 1 
       data hash MD5: 32K
       25 38 FC E2 6B F3 8F 9F 89 EA 4D 88 74 D4 B4 CC>)
(   5,<2012-05-12 21:14:40.640 -0500>,<Administrator>,<TOPSPIN>,<proc1d>,<TOPSPIN 2.1>,
      <abs ABSG = 2 
       data hash MD5: 32K
       21 1F 58 28 6F 6D D4 21 B8 C9 36 2D 1C 4C 81 A0>)
(   6,<2012-05-12 21:14:40.703 -0500>,<Administrator>,<TOPSPIN>,<proc1d>,<TOPSPIN 2.1>,
      <abs ABSG = 3 
       data hash MD5: 32K
       E4 3D 06 D4 77 E4 6A 92 4C AD 8D D0 26 B1 A0 26>)
(   7,<2012-05-12 21:14:40.734 -0500>,<Administrator>,<TOPSPIN>,<proc1d>,<TOPSPIN 2.1>,
      <abs ABSG = 4 
       data hash MD5: 32K
       46 2F 88 23 E4 EE BA 76 DD 38 25 C8 FE 7F DC 93>)
(   8,<2012-05-12 21:14:40.765 -0500>,<Administrator>,<TOPSPIN>,<proc1d>,<TOPSPIN 2.1>,
      <abs ABSG = 5 
       data hash MD5: 32K
       DB 54 6A 31 39 F2 36 4B 42 A5 E3 BB 56 D2 80 B9>)
$$ ##END=
$$ 
$$ $$ hash MD5
$$ $$ D2 98 B9 91 AD 67 D6 04 41 C9 54 72 78 4E 83 3A
##$RELAX= 
##$RELAX= 
##$RELAX= 
##$RELAX= 
##$RELAX= 
##$RELAX= 
##$RELAX= 
$$ Bruker specific parameters
$$ --------------------------
$$ [...]
##$TP= (0..7)
150 150 150 150 150 150 150 150
##$TP07= 0
##$TPNAME0= <>
##$TPNAME1= <>
##$TPNAME2= <>
##$TPNAME3= <>
##$TPNAME4= <>
##$TPNAME5= <>
##$TPNAME6= <>
##$TPNAME7= <>
##$TPOAL= (0..7)
0.5 0.5 0.5 0.5 0.5 0.5 0.5 0.5
##$TPOFFS= (0..7)
0 0 0 0 0 0 0 0
##$TUNHIN= 0
##$TUNHOUT= 0
##$TUNXOUT= 0
##$USERA1= <user>
##$USERA2= <user>
##$USERA3= <user>
##$USERA4= <user>
##$USERA5= <user>
##$V9= 5
##$VALIST= <valist>
##$VCLIST= <CCCCCCCCCCCCCCC>
##$VD= 0
##$VDLIST= <DDDDDDDDDDDDDDD>
##$VPLIST= <PPPPPPPPPPPPPPP>
##$VTLIST= <TTTTTTTTTTTTTTT>
##$WBST= 2048
##$WBSW= 25
##$XGAIN= (0..3)
0 0 0 0
##$XL= 0
##$YL= 0
##$YMAX_a= 535413
##$YMIN_a= -647607
##$ZGOPTNS= <>
##$ZL1= 120
##$ZL2= 120
##$ZL3= 120
##$ZL4= 120
##$ABSF1= 14.98061
##$ABSF2= -5.57192
##$ABSG= 5
##$ABSL= 3
##$ALPHA= 0
##$AQORDER= 0
##$ASSFAC= 0
##$ASSFACI= 0
##$ASSFACX= 0
##$ASSWID= 0
##$AUNMP= <proc_prof1d_extract_pilot.lims>
##$AXLEFT= 0
##$AXNAME= <>
##$AXNUC= <1H>
##$AXRIGHT= 0
##$AXTYPE= 0
##$AXUNIT= <>
##$AZFE= 0.1
##$AZFW= 0.1
##$BCFW= 0
##$BC_mod= 0
##$BYTORDP= 0
##$COROFFS= 0
##$CY= 15
##$DATMOD= 1
##$DC= 0
##$DFILT= <>
##$DTYPP= 0
##$F1P= 0
##$F2P= 0
##$FCOR= 0.5
##$FTSIZE= 32768
##$FT_mod= 6
##$GAMMA= 0
##$GB= 0
##$INTBC= 1
##$INTSCL= 1
##$ISEN= 128
##$LB= 0
##$LEV0= 0
##$LPBIN= 0
##$MAXI= 10000
##$MC2= 0
##$MEAN= 0
##$ME_mod= 0
##$MI= 0
##$NCOEF= 0
##$NC_proc= -8
##$NLEV= 6
##$NOISF1= 0
##$NOISF2= 0
##$NSP= 0
##$NTH_PI= 0
##$NZP= 0
##$OFFSET= 14.98061
##$PC= 1
##$PHC0= 211.0638
##$PHC1= 0
##$PH_mod= 1
##$PKNL= yes
##$PPARMOD= 0
##$PPDIAG= 0
##$PPIPTYP= 0
##$PPMPNUM= 2147483647
##$PPRESOL= 1
##$PSCAL= 4
##$PSIGN= 0
##$PYNMP= <proc.py>
##$REVERSE= no
##$SF= 400.13
##$SI= 32768
##$SIGF1= 0
##$SIGF2= 0
##$SINO= 400
##$SIOLD= 32768
##$SPECTYP= <>
##$SREGLST= <1H.CDCl3>
##$SSB= 0
##$STSI= 32768
##$STSR= 0
##$SW_p= 8223.68421052632
##$SYMM= 0
##$S_DEV= 0
##$TDeff= 65536
##$TDoff= 0
##$TI= <>
##$TILT= no
##$TM1= 0
##$TM2= 0
##$TOPLEV= 0
##$USERP1= <user>
##$USERP2= <user>
##$USERP3= <user>
##$USERP4= <user>
##$USERP5= <user>
##$WDW= 1
##$XDIM= 32768
##$YMAX_p= 453886274
##$YMIN_p= -765968
##$CURPLOT= <Network HP LaserJet P1505>
##$CURPRIN= <$Network HP LaserJet P1505>
##$DFORMAT= <normdp>
##$LAYOUT= <+/1D_H.xwp>
##$LFORMAT= <normlp>
##$PFORMAT= <normpl>
##$SURQMSG= 1
$$ End of Bruker specific parameters
$$ ---------------------------------
##NTUPLES= NMR SPECTRUM
##VAR_NAME=  FREQUENCY,     SPECTRUM/REAL,   SPECTRUM/IMAG
##SYMBOL=    X,             R,               I
##VAR_TYPE=  INDEPENDENT,   DEPENDENT,       DEPENDENT
##VAR_FORM=  AFFN,          ASDF,            ASDF
##VAR_DIM=   32768,         32768,           32768
##UNITS=     HZ,            ARBITRARY UNITS, ARBITRARY UNITS
##FACTOR=    0.250966925370066, 1,           1
##FIRST=     8223.43324360095, -191985,      -83229
##LAST=      0,             102029,          28001
##MIN=       0,             -765968,         0
##MAX=       8223.43324360095, 453886274,    0
$$ Real data points
##PAGE= N=1
##DATA TABLE= (X++(R..R)), XYDATA
$$ [...]
23794 99043 318031 -8511 801380 -6212 210501 -142918 -67483 -202887 -42221 154267 -241672
23782 -144459 -157063 -159926 65331 -27158 -158568 -6173 144645 151696 14412 -60053 256198
23770 28805 -95161 347645 112473 132148 201511 460311 -198885 -86997 70618 240720 88940
23758 -276059 198963 -153622 210899 -24721 -190425 -125173 106086 -127056 146494 -198132
23747 -43825 -208866 -428993 211701 -110829 -47545 -50537 327917 92661 68787 -88329 -259936
23736 -259936 -44456 -172399 38381 12862 158644 -73017 165870 -200841 83818 -286535
23725 -89931 -431624 -103729 127112 66822 120172 -184459 63779 -179465 78664 -43193 -173754
23714 -173754 -79271 223973 -557171 257451 12326 -311589 -244219 -158062 -37778 244640
23703 41736 113135 -104125 -223644 19602 58510 189318 59828 234038 -154341 18796 -215602
23691 -105290 250904 -74830 -51345 -24306 -26566 -8057 -59310 153230 168904 -262228 39623
23679 211992 158605 21287 57026 190975 -4331 105303 -85488 -26927 -210155 -147262 84158
23667 -87327 27676 91260 -171277 70121 -122282 -55858 -60403 -1269 -210964 46413 129307
23656 129307 8015 268867 -184842 77848 263951 -238650 -239874 155371 161860 -48880 -182455
23645 -182455 4077 -56015 62909 -284285 175454 -233473 -57601 -129303 24125 -130739 52079
23633 291967 37429 165554 66127 -374674 158582 -18950 -273448 247801 8417 -274446
23622 164902 -150862 -347151 69498 102940 97217 -65033 -90936 -97616 -115634 10699 -67414
23610 27405 91351 -99088 -76671 168739 -273386 -59878 17122 -138633 1963 355023 -183175
23598 87893 -146779 213241 190423 -233298 -94801 -72413 25815 -276750 391285 -143025
23587 327776 -86459 54699 -320114 39404 522066 64120 29748 176669 90421 -116754 -32
23575 -26712 81758 49731 78100 -188456 124791 -138035 4799 350622 -152033 193255 205004
23564 205004 -78835 -39721 60065 -85194 -133901 34155 262929 -164527 -87735 177182 6323
23552 26864 -50840 -178219 402 -149683 174695 -232253 -266103 -88956 -79396 -181670 183787
23540 -160284 -33231 -1120 173340 -19276 71421 -26793 111595 -167392 49460 36826 -5356
23528 -354073 -42504 -170589 32125 -45633 -362485 55832 -68085 -101925 257938 49067 179481
23517 179481 11738 17007 -279374 29625 -193833 91638 -63274 120262 -12744 -25166 -27636
23506 -27636 -93816 210439 -107508 107278 -32038 69583 -161564 -151576 94900 -57610 -179896
23495 -179896 156776 -122168 -394887 -143312 271910 188742 -231853 171801 177687 -16297
23484 41064 -137821 -284986 -64049 162087 -288126 -94514 -58884 51072 63803 -41869 39546
23472 -158474 85762 -97425 166494 165474 -67172 100102 18929 -22162 -233488 -139994 172715
23460 185822 -7925 -59719 -361420 -147469 -143297 -182758 -96239 -57384 -87068 85922 283309
23449 283309 68428 -65750 -172101 -49821 163857 -235320 -34417 -309911 43113 34644 70465
23438 70465 112182 209525 134025 -215420 57191 221882 -158454 118515 11546 -174227 289150
23426 -184128 359944 28682 286236 -151623 -69935 15989 -242434 -73524 -82620 -199830 -347654
23415 -347654 -98529 201258 339580 -259374 -300832 62725 -16778 141602 68866 -305396
23404 9986 -313036 -21739 -10094 -228061 -223214 384069 420219 -104591 -375659 -173482 -208403
23393 -208403 73949 -79067 -118095 107300 -128300 -211726 64740 155155 255111 90638 -35650
23381 241000 -219332 -218354 -181771 53640 33134 -122467 -2734 -400396 37821 161055 118257
23370 118257 -68728 97174 3959 -5419 19590 -454969 337104 22297 176232 -90952 -171942
23359 -171942 -98733 -200501 -310906 -80243 241883 -49290 37509 -874 -38473 -182345 -259820
23348 -259820 -67942 128784 180625 185357 -176877 -173418 160565 -94766 -130969 -87882 32405
23336 10196 73923 39645 -53483 40177 315433 -51677 19548 -241328 -64653 299821 -218847
23324 51340 -140327 -41272 12268 140467 448941 122800 -124769 -41578 -201725 -109822
23314 -109822 -227105 7950 -123750 -37249 140036 -9920 -58094 -105630 -148975 -39041 -334170
23303 -334170 83047 -35372 183989 -297733 10718 -55596 140714 124730 -255510 -195116 -62981
23291 -47717 183560 -29399 -11226 109859 -192325 303248 64910 -117480 -186761 60906 -65457
23279 -776 145554 -77603 -141505 180630 42433 128417 143885 24627 68188 -11264 -220863
23268 -220863 -421154 13161 -100221 108535 -12115 68139 -65492 -249361 -37815 -143508
23258 -143508 -111532 152432 -169911 108131 61374 -16288 -382490 -556261 386685 -217174
23247 -102520 -99788 -168098 -41891 -59820 348739 -77469 -278267 219072 -24191 84458 -49480
23235 56762 182601 126877 54929 -81107 -547644 -266062 -96692 73938 -294736 77414 134265
23224 134265 358584 -91661 308803 118610 92244 333411 -49146 -222126 -360117 -187099
23214 -187099 69629 -139230 -78061 115658 154653 -128165 36871 -249038 -3349 -18086 -191880
23203 -191880 50606 126588 -23204 261117 245364 193149 -129789 -9338 202931 15476 -31893
23191 -158720 -419265 -86596 55507 -77132 -75014 -110354 -46081 -66107 -177250 12209 186974
23180 186974 -318826 68170 -264407 -135256 116595 -145215 -222650 121883 -55153 -65141
23170 -65141 -155966 39694 -98557 -333735 102707 52317 204323 151507 -182542 98178 -71362
23158 -164073 -161040 -340055 117657 -55918 178258 163456 -137805 -167113 15671 359451 -1613
23146 -119207 -161703 127010 155372 -48678 49886 -225585 -165792 209891 34879 105257 127957
23135 127957 -245646 146873 -4926 -23562 46248 -115362 -54786 124139 -142748 -91272 -162736
23124 -162736 22771 -123384 69367 184013 -235903 4451 -179114 -293406 200345 144433
23114 144433 125388 11878 37416 37186 -315303 16940 50081 -72506 -71005 -87636 -237487 304563
23101 -40824 -112911 -93371 -172315 -185292 -324411 -21557 113170 -183797 -57495 13942 257465
23090 257465 188984 141459 -128961 -97462 113402 -39580 -28348 -75052 144076 14312 -64065
23078 -205148 95299 -162698 39000 100048 169327 37958 15497 145512 -330962 -20585 119328
23066 102556 -235642 173257 -146132 -87183 356442 -309420 -155824 -184471 -63123 -260938
23056 -260938 -176422 227380 68014 -331355 27693 -71006 -92580 -115388 -194339 148669 -154015
23044 -207128 15973 -128209 2951 93073 785 69961 -148231 -285804 -94624 26483 -246528
23032 -313838 -26908 -22375 37790 -165817 164178 123219 153166 -60006 -330015 112043 -201499
23020 117556 -8246 28354 200515 98245 -163486 -115160 -257467 211452 -14843 123544 271238
23009 271238 62244 132771 -111666 10727 -228504 79374 134606 -217270 -96699 -75682 137022
22997 109166 101700 232681 -11041 -367992 -110002 220412 -288715 165352 -95454 -99743 218734
22985 79351 -41271 -146338 140395 -90601 -48162 57415 209247 105815 25824 212857 -98163
22973 -120997 -110397 -216863 51018 -173175 -211337 -75719 -85770 105233 -147412 -192403 -297517
22962 -297517 244445 -13153 -185194 -11276 132523 217207 -76549 -283266 -214521 144593
22951 -62886 -90265 38908 40824 -34260 483270 -282634 -32457 188995 168622 310094 -37097
22939 -280900 80530 -228401 -179985 171167 5716 271945 -176869 280320 -360786 71216
22928 93191 -237143 -277253 -181529 -130334 39934 204271 -137628 -135204 -318908 147983 43003
22916 -153064 -39690 -55582 149023 -304922 -186094 299512 -211753 -29078 46548 -132751
22905 -90767 97060 -205988 -96335 41887 -195282 149409 152419 -146547 -36306 -344575 -9708
22893 -32271 26667 15197 110187 -125488 -205602 -137902 -438 964 -169478 -102823 -85573 -191017
22881 -191017 19098 -75351 206838 -357482 -147408 236809 -226144 -177674 -68057 36868
22870 30926 -32230 255078 -120000 -32036 201274 -10356 154742 -317607 162251 -9435 -118001
22859 -118001 -315197 95954 230775 321515 -148174 -55149 52281 -72817 136824 -167874
22848 194215 59651 94523 -206618 -132548 -110203 -19688 114214 -77182 -233047 292159 48077
22836 -121851 174765 -261916 215384 -25689 -18374 -161409 -151617 64968 -218145 -184634 -322892
22825 -322892 -136762 157778 -56878 68144 114207 339386 22288 59657 -127744 83818 -207238
22813 -112882 152479 -45769 -112037 -55586 172772 62498 -52907 107864 -99070 -123365 65267
22801 -129906 -356747 -365618 -97317 -158998 186351 417 -355275 -216476 -54146 -79235 -442275
22790 -442275 175235 -68138 -266997 43577 -113431 -180670 -139494 153585 85714 -131386
22779 -253075 311889 -135196 70617 -27035 -92971 -155721 181080 6439 203104 -39675 -69504
22768 -69504 395813 47594 -110609 -314274 124307 -74590 -340076 134683 -264039 214837
22757 -72785 -255632 60048 -269321 -227622 -113418 137817 -11779 -84170 -189544 -229256 -51922
22745 126001 -160417 248390 188289 -168926 232847 -121318 56213 63214 -86884 -106104 14510
22733 297568 -13611 20551 149281 101713 -378527 -408215 -156134 227026 -271447 108415
22722 -79089 165363 -25630 53890 175691 -94489 -172315 92659 -109599 40578 -188611 -23487
22710 74952 -233201 -102634 -79492 62422 230728 126570 246472 213235 -3307 -199118 -224048
22699 -224048 100554 152895 49689 -163211 146540 -31616 -8968 270495 281012 130023 -6222
22687 -252606 -100282 -26511 29728 -31055 -18142 -13797 125322 179487 -47692 196783 197833
22676 197833 -8239 84788 -171692 190779 9579 -167448 12111 3940 -32720 63722 -68818
22664 242810 -415128 -94375 289134 86874 -167623 -57475 62045 -190091 -149617 -97335 23716
22652 -92750 -156061 -142524 115755 152146 -119149 184609 599927 -74340 -240788 -117202
22641 -505411 110236 107689 151342 -104134 82851 162178 -166088 44809 133596 -45031 -98662
22630 -98662 -52436 -166882 146035 -358494 -27240 318333 164402 201141 -284563 -277652 -31580
22618 -36498 189972 -194786 -19836 -200279 103073 -13502 -247762 104527 190077 37567
22607 67871 -391091 351592 -168979 -137091 147462 -452461 -192168 249254 -40466 -286345
22597 -286345 218934 -209649 -95124 -215070 -60055 -349536 57404 150563 138989 -127796
22586 55854 -217671 -143436 316823 95723 -58478 232718 5884 78743 -65526 45643 5065
22574 -18182 -79520 87302 -44729 148572 -144204 159197 -201751 -144466 -225747 -117195 -34346
22562 264139 -155875 120572 112118 -137561 -363838 -218638 -55018 -155695 -408063 -240427
22552 -240427 176472 -36536 -164432 304196 -134989 -72722 15892 263875 62232 -17467
22541 136185 -101416 -36758 -144099 -90244 -116429 -245039 -113097 27356 86523 83113 -30909
22529 7938 -160244 -175068 62233 128619 -148650 22485 -71640 161210 120794 -159050 74492
22517 91464 -142857 -266743 -38544 15491 -193238 173522 -220252 23735 33546 -319735 -173559
22506 -173559 62621 -82358 19861 -9499 94717 -146041 -14301 226913 92058 -102562 682
22494 -121190 168364 -185751 -168623 -197547 210100 134437 -27563 127201 -40897 -180436
22484 -180436 -476586 83222 -11022 74337 102074 -162525 5283 14259 -178538 -220785 -40215
22472 -151108 53803 -28479 -32586 36931 -168576 -130652 128038 25092 -149090 79498 -111667
22460 -114941 -64917 -15058 -129918 162705 115122 -111018 -85453 10964 32022 462006 300891
22449 300891 -235406 112839 -19288 17113 -210752 -41823 -171545 -264829 233857 150395
22439 150395 83759 -92945 -10101 327266 237420 -71136 -51875 95608 -460104 147858 9101
22427 -186862 -140492 201226 65371 7844 52370 -332142 -112748 90818 40103 -106958 191010
22415 29565 215035 -131166 -50760 -88656 -240068 225453 -191754 -45648 -141411 35959 -261055
22403 -37419 -347431 78506 -66073 -9827 -140992 102828 -117970 92981 -19899 -94898 -115356
22392 -115356 225836 -67579 22842 -250607 -185838 -81618 -138797 -117663 92856 75976 -111613
22380 -79931 -186591 -180682 88183 -94740 -11824 -127591 195455 405497 -181773 249463 -440707
22368 111362 159272 -243959 -198564 -61234 184688 -162920 -290802 -89750 -44175 168501
22357 -101321 82536 51358 116703 205577 -126442 17271 -47235 -183333 351152 110782 47891
22345 82362 -190206 -173032 -161306 -391123 -91589 -228172 -41699 -107044 91101 243048 -183176
22333 16592 395940 -180588 -223908 -21383 -39815 86515 1377 176193 -130830 -93761 27988
22321 27683 -104044 -4571 -316489 -63323 205271 -161792 -90798 64953 -44796 149702 85431
22310 85431 -274562 -144979 -104361 195886 121392 -173022 -57614 93703 218268 341873
22300 341873 -130318 -68275 -220552 -111270 53594 47603 131161 29230 -88862 -211119 114466
22288 -3528 -258877 -110761 93684 -57524 -157319 -97464 229845 -94809 39070 -35363 53346
22276 -168952 -248686 -32209 -35473 7864 60335 -421249 -189448 263512 -149508 130701 -184349
22264 47373 -308960 148214 86284 -102317 -9968 27548 -212452 -294088 -119762 -420244 -179955
22252 90190 6633 170796 565 169735 28032 290620 -215897 100787 -179311 -212692 -72515
22240 198027 34382 20511 -157731 -75606 -166077 -246921 -230626 -95786 -111622 106579 142203
22229 142203 -88815 18004 -210594 114806 -43410 -267800 -196473 -83347 -141742 -110605 -132861
22218 -132861 -262673 234193 -20570 267612 -510736 -132163 89491 -109522 104285 118773
22208 118773 -240414 -114130 -39467 281855 136142 -87736 -7926 136818 -146001 -125507
22198 -125507 8889 159807 -171813 -91868 -166377 -64184 -32894 -67479 39723 140877 -127660
22186 -147113 15760 113009 38574 358286 12993 216634 147563 -199402 54699 -45211 -37193
22175 -37193 -59950 57977 -186314 233340 206098 -138366 96517 96860 162871 -114885 -190572
22164 -190572 -103418 -195138 132387 71374 -226360 10549 78248 -141015 -131594 36214 -70859
22152 -839 278827 281262 74425 -247283 -524139 -236206 34337 307117 -24121 -39313 27539
22140 -17190 -58024 107725 -13445 -82244 -278800 18111 7052 -357894 69914 -433867 -233584
22129 -233584 -15014 -201620 197542 78754 -49665 -326426 166240 -107081 144528 289087
22119 289087 282302 -332647 2673 -9832 259695 85166 -46572 -71730 18701 -22658 -363515
22108 -363515 113723 -188240 -86687 34765 55552 266426 -414575 48394 296552 196274
22098 196274 -24646 -22208 11246 -97862 -50563 -268693 -253404 -98330 119529 -66428 50962
22086 -21324 -51578 -131642 182984 -167662 -62805 -209055 65744 -132863 44780 439532 156572
22074 284070 247198 6111 284552 -500176 297130 -152858 -472443 -146607 -234559 105954
22063 -196908 -164560 -181173 110751 -22139 9106 362692 -267285 30296 9396 -167252 -133773
22052 -133773 348054 17183 -225353 -208127 131379 -140706 138988 65455 222522 -71929
22041 7923 -49682 -81094 -369654 -169191 -97013 212641 8424 -73881 -171134 -7048 -185561
22030 -185561 -200808 -263075 -57185 -167693 -102705 -312540 -131103 -91456 12230 133426 -55322
22018 -89242 -339850 -138922 36209 -13416 19964 -513355 79383 199996 -69223 -51348 -86519
22007 -86519 -141208 -52125 141014 -260345 95842 175718 237831 -157856 -221552 159452 -256432
21995 92132 -226225 -151892 -36737 -62301 -112260 -186164 -13246 -72071 25664 -153116 -51497
21983 -214038 -197543 175682 -49702 -339024 -231968 218527 10113 93279 66188 -255031
21972 -364357 109498 -27708 -202111 10877 -34282 -64699 -42197 -170060 189812 -219403
21961 -240031 -112023 31013 -45973 170623 127037 97031 68181 -75785 -84070 181196 -135048
21949 128684 -292475 -123848 247358 276918 -104744 58053 -225836 -36012 -45352 113046
21938 230279 93015 -216557 -17978 -195780 -329703 145225 95610 19159 211539 72213
21927 -185097 -28182 -335891 180231 -126713 -18925 -256360 -147760 121959 -36586 187507
21916 -259510 -265910 -123940 -230354 64759 -149969 104938 -145223 -249493 36144 -67018
21905 -212255 29475 235825 -341895 -52922 62346 6588 -58199 -111401 -180168 -323765 18255
21893 -127281 67664 219397 60766 101013 -78410 305216 -272707 -74012 90420 206734 116982
21882 116982 -140027 -38435 -201140 -206766 48983 100290 -191684 -214886 -405689 -76784 17240
21870 2302 60692 171311 52900 190840 -63147 -385934 -122964 88995 114345 13713 -513798
21858 -126300 -104833 135133 152432 -30721 -357898 6272 142410 -156819 40634 -148996 52492
21846 21563 -45367 -101165 51340 -191798 -117958 108205 -290310 -11662 65117 -226646 89752
21834 219169 -2106 -3017 -16744 43257 -198572 -118324 -143179 25441 172219 13772 313487
21823 313487 10054 -36523 -93863 -104264 113900 -48230 120316 158155 -55549 150993 -51889
21811 -182072 163633 -220682 -44439 -87262 -332490 15142 -473666 -93814 -56648 45959 159919
21800 159919 170110 -226458 -8749 -46362 -40175 -60971 -278385 -197883 -16350 -90518 -595918
21789 -595918 -377693 117079 -150970 1728 234443 204180 -48711 -333241 389183 -278104
21778 30721 95648 382845 229565 111690 247970 8825 -376487 17243 -51142 -147642 -79236
21767 -79236 -178166 -250106 -5958 -2129 -127990 -449263 -274444 -102292 -224930 155795 -1845
21755 47715 -160853 137509 79327 207093 -176682 150526 -196394 -117312 -112083 210787
21744 -133793 -54111 -48867 -107260 38145 -179822 36152 102884 -310288 -21397 10639 61411
21733 61411 -23809 155596 31324 -23857 170796 -269304 -9216 -192483 -161912 165395 -193107
21721 10115 -294943 -7920 -231177 -86562 353627 -5420 -179867 93463 23641 31401 34035 208438
21709 208438 -93789 -355975 146811 150935 -247386 -174469 -175991 -4034 -29177 128159 82261
21698 82261 -50278 -296112 -357919 163831 -173818 -241344 317955 -118446 168781 -55299
21687 -101927 -56966 -137086 -82746 -39825 128262 9596 -186894 76534 -113141 -288829 -303687
21676 -303687 157284 -195893 -187061 -43124 -390214 -98832 -77814 57252 51967 131880 -15275
21664 -431487 66417 183710 23913 -53404 45842 146252 91816 -68983 938 39063 -49388
21652 24436 -138038 64764 36838 140990 -46767 -277532 -62194 32566 -118561 87306 14873
21640 -54668 29302 -130551 -339171 -207476 78649 81989 138907 150174 188082 199818 -26449
21628 106529 -39022 86907 -36733 21758 -102145 -180126 244047 -295044 18543 -225405 -134951
21617 -134951 -383181 -196501 -104903 -92060 -184946 86225 -125642 -244195 -283142 -142642
21607 -142642 -149929 -105948 -33574 48683 -225410 59687 -211910 -209833 -98070 115880 -106127
21595 -287694 105410 -250131 -306922 111897 40658 -334452 69394 -120832 112102 -368597
21584 -247089 -109906 -73044 -15477 111604 -120531 100576 65659 -27305 -62051 158585
21573 -139693 -73412 47796 -84880 -39621 365083 -63963 -179508 -142248 -282287 228911 -5171
21561 12353 -243127 434416 -254293 42299 -81254 -135108 2589 -112249 210177 56675 172290
21550 172290 67055 178696 -30081 -175507 -57955 47523 -15527 -218733 538 135173 -139128
21538 -215725 33915 -68180 -174146 -211192 64626 -88269 -2293 -335588 146771 -252670 -50155
21526 156018 83767 121884 -128207 -171942 -14474 -29896 -415905 75026 -234775 -260358 -71786
21514 -169168 242645 79009 88284 104764 101604 170390 -408604 61928 -243154 -64515 -78747
21503 -78747 32744 38900 89989 -284361 237512 140585 -138578 -310211 -267681 -113978 3739
21491 196161 -398649 -49064 5810 -788 -149073 -31155 -147056 -418259 -106835 -259438 6124
21479 -220314 178253 214248 -73188 63035 -116338 -242458 138955 139883 -149053 -91892 -363903
21468 -363903 -95610 -473263 -210412 -100020 -124356 -158136 -151702 -59289 -341383 91767 56260
21457 56260 -128620 -136798 -217935 -332989 -291136 11670 -68748 -49064 -151020 122920 47966
21445 336154 -8462 -137502 -357460 -291332 -9664 44207 -158342 -178575 1559 160537 83801
21434 83801 -154457 -22501 158859 -34711 89922 108279 -287285 63241 125515 183775 216512
21423 216512 106895 554353 248378 191405 -153620 295967 -48764 24470 38481 -33995
21412 -48980 152047 161188 -238162 -94650 4965 117325 908 -173617 5449 -132826 219453
21400 -110563 213187 -337687 -66000 -276451 -72227 -184442 -213221 -69908 63824 -168952
21389 -352594 161659 96661 18241 141075 -168880 -213563 238172 -24855 167472 -403175
21378 -8692 -75734 -140555 -142943 214862 54945 -145533 17596 -119244 -30544 202533 -105030
21366 -176731 400467 1813 -91554 -138497 8388 -269067 100523 231417 10591 -25973 -34044
21355 -34044 170212 88633 -61783 -128678 -343994 -315920 -256558 87650 196770 -24045 206328
21343 171512 -92666 -128600 -18736 -116500 134034 -127579 -75801 148844 360145 -65017 -120019
21332 -120019 10535 -368036 -196815 -120484 75927 -161276 45849 -274457 -18025 -296652
21322 -296652 -249917 -297 3148 -71597 -33625 -45017 134912 -12727 81140 101653 -291750 -250190
21310 -250190 -244289 -26764 137616 -272157 -93160 -140303 279777 162369 -208098 -53843 -110688
21299 -110688 -116691 88088 -5000 77475 206597 -482282 2960 -287186 65170 -53272 78320
21287 -70447 -27398 22728 -149875 29690 -29465 35453 -40510 -436382 -15732 49447 -89941
21275 -123336 -322008 73931 11232 -365515 282282 -81270 37949 88638 65090 50439 -277538
21263 -341838 -112611 426283 -186108 63373 -18679 88320 180126 91264 8113 -262110 -86474
21251 108999 -288265 72015 -73712 -223077 -114759 -417961 -125530 141164 -43344 -111002
21241 -111002 42892 77425 79752 -53942 159868 198549 -28762 -82120 33122 -58126 34157
21229 202790 56971 -149619 196431 -23056 -9860 -34931 307732 80192 -411559 31979 -21146
21217 96677 -87273 -42661 106527 -170147 -120635 -29971 -253247 -156490 -100016 -213414 172483
21205 -17163 -160263 -19895 -93360 -2065 -23886 -170120 81601 -9399 -208447 -195918 170156
21193 40408 -38298 -37641 -256580 -118596 24277 -80305 52873 -47297 -191932 -152019 -131997
21182 -131997 -122764 64151 -38235 -26095 -171112 -309731 15304 135516 -44015 12677 -89121
21170 -85755 126520 -131535 -109461 138991 181944 96567 -224674 -87333 17144 106790 187051
21159 187051 101724 -242874 -310303 -137507 -112365 100603 -190113 21001 -147027 -77850
21149 -77850 93420 242928 -225434 -144921 110328 -162590 -259798 -113498 62940 -117443
21138 206621 40567 -136788 -40002 -115470 63513 -18813 -66401 164533 -212758 -245455 -224375
21127 -224375 -187043 -142449 -437777 -108498 -148319 -249484 -125987 -222109 -297900 -53937 -153330
21116 -153330 99715 -76585 65047 -67107 -5133 61037 -31604 76595 75273 -315053 223845
21104 -251142 34723 136208 -240137 69877 204692 286857 46164 -63376 -449957 -372750 -131608
21092 -225948 -227289 -194014 -16083 211804 -201982 -93117 109344 81049 89714 160296 -19005
21080 183998 21366 -131637 165065 69592 -59499 241212 -166468 -24407 20001 -80085 -190073
21069 -190073 -311582 -26053 -200989 -107523 -98042 199831 7818 304013 138811 -80651 -20627
21057 -37366 20770 212494 -112694 -387776 -20235 -211627 -104409 -406238 -162744 -212650
21047 -212650 224347 19288 21289 -639 112964 115721 -252512 -78677 10312 -217951 -97343
21035 -202241 -145639 82940 -87987 255761 -277383 -181407 -60449 168732 17397 -169713 -110269
21024 -110269 57508 104638 143414 -256967 491 139640 -334093 114962 236149 196346 -294876
21012 -293945 -146843 -344826 -117681 133742 -82080 -48140 -110743 72671 -228859 285486
21001 98286 148943 39943 250694 104603 -110803 -162595 -361996 -87559 -191116 172756
20990 125474 31223 -233682 453494 -170599 -37280 88099 -133548 511326 -307207 746 259365
20979 259365 -189402 -9684 74849 125167 -58670 7683 -110861 225718 -48640 23571 325218
20968 325218 -96213 158563 -14265 -122460 -5748 -565894 126035 332846 -59709 210011
20957 45989 -130975 -108840 128986 -14328 -125871 -24696 -246987 -78434 -108245 -273833 323211
20945 -190328 75444 16367 306412 -164342 3666 28470 -127207 -247018 -123048 -203039 -248228
20934 -248228 71198 -73235 -152769 -245433 -423654 -143088 52671 13743 275167 -200241 -269350
20923 -269350 13646 -94618 -111014 -310854 81995 -236707 -81485 -283395 -73932 -34548 346698
20911 38305 -124535 -46134 -320985 -35771 119400 -255193 -45626 -163332 92704 -116926
20900 -114814 27943 -62787 58835 -1051 162719 -31071 79182 -102313 152114 -47814 -257420
20889 -257420 -127947 -77180 -165101 -3831 -106446 -39289 51138 -172626 176146 44286 -11254
20877 68668 91016 -6351 -1951 -284542 -41906 -170041 24353 -91242 36205 39633 58331 -78260
20864 -81277 -107152 -82607 141309 -290569 -34968 -178397 -172904 184378 231408 -182196 -236539
20853 -236539 -340459 -9635 -24910 -442577 -134061 63827 107193 -139034 202237 -97380 -120461
20842 -120461 -248907 123882 -133184 370835 -281429 -107104 228043 -283409 -114200 77095
20831 169442 38462 -63790 -308934 -171885 77866 -206779 -32152 -116541 350319 -64512 79582
20819 35515 -144720 40732 -157555 53600 -378286 344 -115135 -30521 -108982 -72595 -43436
20808 -43436 -178907 -114869 141135 368 -270242 20644 48058 -396363 -181970 158463 -228429
20796 -332825 -131406 -2144 -214158 -75515 64092 -75936 145324 98178 31733 62697 -399464
20784 29203 -95700 -10389 165361 189632 -287558 133736 -43931 -12657 -247663 104771 -30227
20772 -100170 -269040 -117980 -335773 -5084 9831 74934 -25272 98060 2400 -279567 -135386
20760 -89607 122289 -38829 -28562 -118395 200229 -107993 82015 63607 25050 -92429 5669
20748 198822 -375280 -67223 19419 -121319 -11196 370429 -319988 -235686 306763 -68295
20737 -4585 110154 -203509 -132928 -136464 -189179 -37694 -202562 -164219 -214565 115584 -99789
20725 -179920 -245186 -368418 181704 -299730 -188719 -118448 33086 -167798 -65647 -306986
20715 -306986 -90358 57662 32671 -257466 -126951 12526 90981 3504 60327 -1382 -140045
20704 -140045 -97304 -183478 51164 -68072 -129258 -9949 -184400 -176223 60372 -80416 -264550
20693 -264550 -182451 -428497 152266 69878 160886 155146 77598 -212981 -224669 -141458 -112239
20682 -112239 -55529 -370504 -276375 37103 -162690 967 -37329 28062 149531 32511 120266
20671 120266 33439 -15403 107296 30154 -119417 -7345 299956 83265 108370 -213561 7564
20659 52298 -207135 -70307 -164606 -197898 76558 87392 -316988 -73438 -15820 13138 -116701
20647 -31348 -265802 -76779 266078 -169903 -27475 -267918 358322 -82439 53454 215473
20637 215473 -67750 -154421 -112459 -191400 -76859 56277 148785 -32776 318572 32487 -137819
20625 83885 150779 -395883 74763 16027 -451877 165652 31381 -211045 -153586 -304948 230591
20613 -364200 -76725 -144150 36268 100229 -174108 -53154 20814 -106495 228527 -66864 -368316
20602 -368316 -52438 216613 198712 -121062 -4399 29387 210619 -78105 -140855 165847 -133955
20590 428930 85023 -250681 21855 -101326 -26929 13285 -126106 119395 -113514 73170
20579 216582 194514 2184 -129996 -77291 -145891 168464 -29736 36300 -236927 223666 -436850
20567 255420 -293732 -25092 262340 188814 198163 -329199 -157283 133196 -135228 53611
20556 -3180 -99280 399699 353247 -154387 111252 204170 20183 56064 238217 -73514 -304211
20545 -304211 10333 105599 -30750 200229 -120830 -188454 -22360 3130 -116709 -120635 55700
20533 -231385 -116387 -142487 -234807 2966 -41640 -103629 -2642 -63358 422494 -48173 -40198 -128186
20521 -128186 -245361 -439872 67574 -87095 5116 162877 -277121 -71631 -198691 70881 58370
20510 58370 84155 -183615 186862 91331 -168836 -220701 293527 -387207 53820 -175351
20499 -14552 -13296 -272786 159825 -76234 193203 -128115 -67358 380837 70531 82366 -185607
20487 -160774 -100150 62277 276788 37763 -312113 109918 -261412 -57333 -26495 213389
20476 -35655 10473 -46248 -121218 -271556 -33478 20237 -233257 -397274 -125126 -362917 46506
20464 -196992 -1908 -187534 -259194 -58368 -260120 68044 -150294 -74884 304195 47087 300119
20453 300119 -115490 1883 12557 146712 -180729 -66886 18645 18288 108789 220374 240245
20442 240245 -195916 27607 -405021 -162851 -337805 -293260 -176062 39325 145207 -240194
20431 103015 -117199 -233051 -218354 68038 -166899 16740 68798 -333571 -88109 204439
20420 -318699 -231989 10920 -265924 -28200 39106 -1511 23269 -32536 -123306 -123222 -113011 -38249
20407 35342 30148 44614 -53582 153135 179930 -3026 -315077 141386 324429 1242 196040
20396 196040 -88688 -161835 47582 -34986 -211664 47431 -237383 -236916 21547 -464004 89920
20384 77882 200522 80668 55715 6085 -189735 -59588 -97014 -206504 -149876 -107506 59187
20372 61016 9967 67402 -365040 -371392 113290 -134967 32172 -212302 -116694 -84588 29765
20360 -38945 -186346 38850 -169344 -48036 217354 -137542 -171827 157586 132594 -257433
20349 -69652 5715 -132824 -216390 -114794 -143594 -167819 156901 -177503 -120417 105043 -324881
20337 -352804 -18978 -16409 62181 -80841 -92814 -93571 -264794 -556303 24148 -48949 -180136
20326 -180136 -82965 5237 57206 -219746 -150438 68563 -152800 -218145 -225708 26453 -133759
20314 193258 -267442 -48349 155204 -56156 69583 28805 300588 -195131 -200255 -71236 -166727
20303 -166727 309926 -305512 346095 22761 4922 -151963 111932 -38199 36627 -73169 -110665
20292 -110665 -181194 251348 61694 -192570 72920 -16686 7519 -31887 -384131 235369 123330
20281 123330 76066 180229 -52957 34517 157841 -246386 -69409 104336 -330566 95611
20270 112893 61008 314914 -144645 96024 -275530 -412976 -152183 31438 184376 -125028
20259 -110611 35524 -15093 -41499 81953 -169037 -146982 -9589 28847 -61576 27355 -106645
20247 -74744 10695 -157205 47143 26632 -242739 -45070 -24 -204320 -154334 -444217 32171
20235 308118 -194523 117420 -295083 30593 -206538 -64804 126846 176798 -50036 141941
20224 -63401 258373 -136348 98203 32535 62949 -136730 -60513 -190822 93252 -6039 -267069
20213 -267069 -142557 -311578 -162849 -17565 -154771 -81539 -19718 -492049 -137320 -227689
20203 -227689 -91572 -209493 156549 -157270 -23169 -127269 108502 -241957 -105357 -90289
20193 -90289 69815 -87770 -130793 221640 -140511 241920 204015 -205671 -122542 -209541 -123959
20182 -123959 -16634 262478 -364642 144421 -268769 -96076 224618 -81735 -186768 -317624
20172 -317624 -50573 2278 -211287 -110379 207203 -387497 -422875 -132537 -77873 63152 97667
20161 97667 -19472 57995 -96424 -204804 35461 -166535 -223058 62427 -21343 -134508 -75523
20150 -75523 -117792 83469 21072 21931 -214647 8325 -246700 115118 16300 -111139 63223
20138 7742 -52959 -56173 -364065 -35054 -58763 321138 -39673 12475 148134 450503 -218783
20126 -186958 -13991 174260 -403842 -235191 -82562 -133696 -19716 5940 -21654 88885 -39620
20114 74705 -366719 -144251 28134 54803 -140604 -181947 -14376 70162 -185089 -77135 -104495
20103 -104495 316094 90685 34299 17058 70718 1501 -204293 -89627 -293132 230484 -38098
20091 133180 112228 -200636 276364 -140145 95218 -387917 -343270 -260859 -241382 109156
20080 3417 -197406 -11588 -39002 -104763 -265039 74971 108277 -195046 49897 -41396 -332202
20069 -332202 -283484 -90255 -128578 -362095 113593 -237683 -327319 -162106 -23576 80716 190053
20058 190053 -188115 -30337 -275984 16160 64527 276606 -196321 -78985 -2646 -260073 -95146
20046 49107 60333 53829 -66173 -303957 121069 -45535 -93428 -111472 -127741 106557 -228367
20034 198765 -95725 56311 114801 207852 209465 215867 40064 39257 193394 -98653 -28438 242237
20021 -324288 147242 -45625 -177312 -31315 226283 -70793 -90419 -176229 -98751 -480703 -46389
20009 -336920 -220179 -98069 231445 -129977 -154149 -163470 -59301 50763 -271469 -31521 78770
19997 84991 -86508 63417 -187776 -185741 221061 84250 -24123 -17334 -96653 4452 -9722 -145226
19985 -145226 213176 -74314 -159542 228246 -192337 -180727 -224899 -28533 32320 55789 -61991
19973 22483 26808 -208509 -226673 -211966 188747 86394 110752 119612 -84883 -355772 346381
19961 -31083 -32537 -52263 31560 120191 -269242 428226 210603 -150072 -53337 -327104 5424
19949 322449 147974 -216966 -209374 -41653 -112082 -158247 -180967 55561 -183826 -311402 -47376
19937 -195545 -402558 -338782 -23579 11951 142939 -63919 -160193 -290535 -187372 -287926
19927 -287926 -141684 108943 62506 -42672 28290 -107474 34392 -376333 -122707 -160323
19917 -160323 -53488 -273748 -87211 -85555 -103921 267161 -79434 -201373 -182735 -122015 -152656
19906 -152656 -40520 -263596 -67888 -85311 173631 -233513 -116788 -102011 -256239 -179352
19896 -179352 -214517 -157244 37485 27314 52130 -270856 -41944 45196 37997 -121913 -202441
19885 -202441 -213511 -304314 -23285 -247863 -43462 -79035 47604 -114626 -56922 -51853 -260425
19874 -260425 -187518 -369209 -320770 -57111 -196740 350763 -3892 -42980 -175350 -133536 96322
19862 -134179 -11778 -88911 -147318 173156 158000 -191833 -42291 126424 -219942 336609
19851 148676 2124 16211 334026 -57202 -301446 -47673 23296 48393 99533 -103403 141663
19839 22970 -173377 -252723 -66978 -120985 109151 -109973 172275 -270715 86798 -420397
19828 -67213 34267 51298 48107 52010 -198446 -348882 -80081 72656 88371 15333 233855
19817 233855 43608 -248669 49098 -19563 -159079 143069 -7106 -127263 2167 -300894 -113409
19805 -264134 38458 15054 -218387 185888 53166 -321469 -583924 20101 159388 -98331
19794 -185678 13285 -39361 290542 -301698 168317 -150447 -251460 -277593 85686 -83464
19783 130533 -101052 -82923 -25997 5406 -105211 36854 641 -166190 83098 -200910 6387
19771 -395856 -147148 -309655 120593 -59123 -58577 146844 65101 -80540 -401468 -62128 -141873
19760 -141873 -199674 -300237 195906 57720 298034 -266574 -54075 42785 -38842 -131106 -287892
19749 -287892 9638 136825 54575 189721 -51589 38295 -81064 54281 136681 -49668 161418
19737 -268465 30666 -43073 -273733 7986 237778 227142 -181053 -12590 114994 -136320 48444
19725 174633 48395 -239372 72084 -53266 -45228 57118 -297352 149870 111534 79159 12580
19713 90236 -117418 -139579 -40212 -180753 70286 -194486 335020 -101483 -212038 230649
19702 -118631 -210421 3711 -86488 67022 -190353 68223 248279 -103768 55067 176817 -48917
19690 -55959 -96856 119185 -41770 -100058 -92047 -22215 280132 -66805 22686 -107506 197498
19678 -158660 146552 -177939 -107205 152299 -199228 214517 30972 75216 -65632 -147581
19668 -147581 -14014 40457 -159865 34869 -118730 68477 -128947 -399576 259784 -96762
19657 -142341 -290804 -255020 -389465 -15736 -120657 194110 25309 33414 159549 542 299414
19646 299414 92231 -153398 -257530 -170456 -150765 -56573 -176742 34325 -16218 -18720 166573
19634 -234168 -86671 -135541 74598 -25637 227811 -6731 -275933 -123763 54967 120804 -51116
19622 160401 -65543 155180 -126815 -85951 -254919 -48934 -105645 73626 -65056 -109509 -107774
19611 -107774 -100511 83517 -90390 -51824 208536 -17807 -437940 193280 152317 -1706 15737
19599 -168591 -98399 106106 -86604 161671 -54290 -239993 4970 -237758 82372 -32113 265387
19587 321419 72230 -5659 67686 -114681 -144135 -205304 -283210 -44766 10485 -521734 -313490
19576 -313490 -138459 -143998 -384246 -214958 -22995 -232786 -333122 69159 -40067 -46490 175146
19564 -110834 110360 87282 -85468 116136 -264385 -155798 -8757 122139 119380 -126572 181257
19552 59992 -279808 133092 -172090 40708 -109561 -436593 -57675 -17239 -228908 -247327
19542 -247327 -34439 -12961 86350 -198251 -48192 83370 10135 -166647 157636 -89064 172843
19530 -61660 -109440 -105220 210070 -252296 -203937 -254584 56320 -227192 -80784 -194752 104598
19518 -202415 -95181 -228846 -132148 -57935 96439 -162875 -49951 -228741 139140 162791 202473
19507 202473 267403 230380 7966 -207013 147928 -162159 -355661 -66790 219879 -15974 26024
19495 76378 101091 -400716 -356286 -341128 146239 134147 161907 270246 -53727 24614 214744
19484 214744 -104898 -512110 -95407 120389 -176945 -192618 46837 -95787 99252 -197945
19473 -204757 -291658 113803 27838 72974 -265398 -275233 38833 -53484 -58277 -151332 -80998
19462 -80998 -26112 196714 180070 -67142 238301 -3879 269410 235289 -177101 127390 -49321
19450 177607 -333299 316154 -393891 -359009 -419482 -74849 -363378 -84180 -1720 174966 -20346
19438 -271073 159815 -335445 -38664 -89300 144260 96068 -438263 -98401 -331651 -382397
19428 -382397 -47454 42154 -167108 107025 -36667 -66566 388466 130569 131003 -174512 -157951
19417 -157951 58731 103377 143648 -210151 65010 -62891 156240 -71361 -424537 -37822 -182970
19406 -182970 -71312 -60233 61219 -106007 115861 28475 -73895 54361 -371176 257703 326422
19395 326422 -12019 57350 -96378 35479 -110488 -185278 -91796 -152345 -300279 -133078 -111965
19384 -111965 55482 -8237 157061 333670 -87589 74641 -198816 10806 -266702 -188 -11223
19373 -11223 -229510 17867 42134 -117608 240943 -145606 169554 -191886 -65952 -55471
19363 -55471 -31394 -75272 -162192 14089 134063 -247324 -35833 203202 38251 -41 -102117
19352 -102117 -222114 -191133 77974 163539 -78516 -295576 -186650 166881 -119391 -320631
19342 -320631 -205063 -195174 -51494 35990 -40738 155527 -64595 -146200 -157053 -171550 -219198
19331 -219198 -59967 -39632 70979 -283902 -97803 -43411 1851 3134 -178967 -106683 -236470
19320 -236470 68644 41614 -305169 -173591 -252455 -95466 146019 -77835 -126703 -145938 151339
19308 -48095 35598 95561 -104253 119196 -130126 51470 -197034 -252441 224210 -153644
19297 -33254 -444511 -345524 -123223 77901 -267043 -106766 16162 307865 -329252 -19670
19286 -185894 -90260 -78446 164937 72676 337634 -289839 224017 10601 -164372 31413
19275 -286674 -70329 237794 -133338 -84199 -68941 51529 -11255 -57034 -463907 -331358 -132067
19263 -115758 -199561 -172941 -182753 -130159 -475037 -194569 92104 -316221 404651 -71726 -180339
19252 -180339 218149 -280765 -165648 -266951 5135 -207421 -235113 -170915 65508 189449
19242 189449 170213 -1189 -260253 -77629 97921 -168193 -143389 -11249 -112538 -143570 -89296
19231 -89296 -181411 37516 103428 -107691 55566 -136511 -199480 -61331 -89197 -135345 -7305
19219 -35029 203968 31530 26650 243904 -64607 236683 -123496 117705 -135208 -100948 40255
19207 -140904 -404 105991 104757 294564 -131207 183408 -439281 -305330 41117 82924 156349
19196 156349 -100844 -171949 58455 -25725 -307347 -251623 191048 -336441 7995 -130397 116498
19184 -37908 14328 66281 -34379 -266643 -337608 -28169 6954 -258368 -48145 -171095 -236109
19173 -236109 -82264 31327 -175894 300437 97488 -266209 108498 -45975 -209229 -73652
19162 -169343 -91299 -10011 120558 159594 -9296 -372404 -65974 83117 47353 -117013 43861
19150 -1268 -139268 -75827 130297 -20002 -76165 -153561 129312 -384579 -122121 -469799 -113909
19138 114497 -113996 28421 -91764 42111 -30920 414616 -129585 -301891 -98772 -228392
19128 -228392 -113423 -48228 -137550 -120634 333369 212320 119745 -446918 72225 -91583 -117315
19117 -117315 -26708 437953 -192511 -191694 -281197 72120 -311166 16856 106833 -107309 -124927
19106 -124927 83723 -104357 56421 -127478 105101 142270 -307369 39422 -63035 -133690 47039
19094 232293 -175266 172180 -103236 -457355 -195698 -214997 -150810 216985 -120567 -411831
19084 -411831 -262603 -53033 105004 -67594 -298435 -134346 104393 30873 -318253 -173384
19074 -173384 35719 -130667 -122683 -140888 -157463 -356739 -75274 -152997 131922 6697 -74849
19062 -220363 -29029 -142401 -362679 237018 -245979 223030 -44178 -27839 168037 236274
19052 236274 -40356 -77777 229349 41575 -148926 -478092 43359 -179581 -190042 237555
19041 -197782 16462 -177697 -325875 171689 172389 -84166 -65114 -54437 109565 -12969 57898
19029 108410 -123687 -118993 -33350 -83057 82014 -9652 96259 -12647 118712 27847 68360
19018 68360 52575 13970 -13769 -188913 63423 138803 -90735 64616 140918 -251120 94000
19006 15777 82299 51635 -181722 45872 -90287 304061 -55164 154070 223148 -110186 195222
18994 -138374 -85660 19257 -114189 -45067 -162190 -93252 -122897 -134936 -40693 -86931 48739
18982 -107141 -152407 -362081 -544747 -178657 -134024 5285 -143665 -178704 -78539 -83593 37926
18970 277676 91135 -99799 -258423 -142451 83097 -312738 -16356 391923 -270105 -203097
18960 -203097 21175 1827 -130804 172928 -237166 160543 -500544 103966 -70160 -205777
18950 -205777 -329779 150929 371679 26409 -27211 -121361 -83391 -38449 -77713 -69951 -51956
18939 -51956 -100794 -106247 -233656 -7222 289631 -53268 -93608 -22661 -227925 -160819 150464
18927 109196 -30665 30461 -250271 -135233 -400795 236537 34442 -234570 -300354 -173424
18917 -173424 -142095 -271845 -176968 -116124 77881 119869 144141 195948 -17110 -62728 -149804
18906 -149804 77407 -251641 -49098 3806 -108930 85369 -13095 238398 -224811 -159646 60494
18894 -340220 -48076 -2212 97925 -19062 81300 290795 -91674 227461 -2528 44953 124254
18883 124254 -196052 -63778 -191848 150442 219926 -217009 -95244 -148351 -168795 172180
18872 -114988 -164200 70995 -276455 48521 28319 56916 27076 -155878 -156468 -350336 175741
18860 -49730 -158294 -10222 153974 -190576 188368 154099 134020 85868 97818 -179978 87347
18848 -340727 -346061 -188914 -170404 99172 -107253 53114 -93502 211432 131488 -41558 -170196
18837 -170196 -41367 -166004 41041 152593 172316 -238354 -45482 162088 -101966 339482
18826 97548 418875 118188 30672 -19866 -40250 -27527 142536 -139856 387753 -91051 -156567
18815 -156567 -402460 -173478 -325987 229467 -51872 -31131 262683 -150282 237455 54980
18804 146817 -191967 -4792 -205527 -328718 -102781 -124061 77245 136659 140183 134891 32531
18792 225716 -93474 -46223 -142327 -23357 296361 19079 -31588 311281 72320 -148689 65335
18780 79084 23655 -152502 -319375 -148490 -120244 -921 23403 138238 -108064 -295189 -149415
18769 -149415 -108509 -122410 -202231 -332025 -4474 -75606 -190956 -159639 -129895 -236455 -220140
18758 -220140 -269134 142814 11719 -307764 170298 184428 -309141 -178368 18368 -149864
18747 -189223 108135 -279283 -459 -10216 -55823 -17948 -334839 -25980 36161 -184681 1761
18735 -46678 -200341 128079 -82520 307519 -223376 -71987 -67034 5795 -339076 -2851 -28804
18724 -28804 -159701 100438 -33981 5323 -123260 32425 -384380 -56200 -192625 -49190 39059
18712 -41275 -101681 -2478 -4460 -150074 292313 -89469 -95678 -74296 75106 -90890 -123155 -144830
18700 -144830 -129027 -84037 -324781 -226636 205884 62298 -144150 46296 -47613 -338557 314485
18688 70344 -296504 106585 -124101 -94426 50637 30297 106469 137321 120151 -165522 15510
18676 148826 74728 171503 -172140 27121 -7564 -95241 101829 -61078 132738 -100041 73214
18664 -21789 19602 -112450 29209 -41211 23740 77406 -115317 87519 -100642 -122614 228945
18652 -93130 235602 61044 -202525 -302056 60004 -9465 130815 27633 -164266 -2000 164273
18640 -269715 3380 -57283 6271 141045 63659 29534 -281618 -259550 252008 -130513 -117292
18629 -117292 152720 -351381 -362484 136563 155218 32176 -268569 -99660 -243765 -165909
18619 -165909 451069 -38464 -199451 263898 64420 -112588 -70542 -7090 16449 -71930 45900
18607 82316 228948 -375191 88166 -202506 -169815 274572 -101101 19258 209992 -156775
18596 186617 -237476 -11779 -250401 -107739 227167 146057 -134635 -42752 -2143 -306340
18586 -306340 -352035 -81275 -161302 82850 112269 -223761 10713 -75764 -106764 111532 -2386
18574 -86 -29939 22275 -300656 -191151 -359699 -264372 -213436 -255346 -261121 150763 32663 -733
18561 135062 -185713 -119922 -108974 -39466 75219 38248 -40048 -20488 108096 8356 -230513
18549 -390965 -248917 258984 -108739 41804 -28991 -182756 -136755 -67877 177332 -407889
18538 -162191 -42654 -194932 -84291 90441 139832 -146938 -403448 -7414 -78927 -91697 -134927
18527 -134927 -187880 -278311 147883 -240452 -76691 348106 89368 -296534 1952 -185178 -116306
18516 -116306 166074 -162098 -267415 -62022 105859 140090 241347 239673 -129099 35092
18505 289943 75328 -50041 203977 -103852 -40758 393372 -80176 -227439 7491 305143 -114195
18493 -89236 85446 -48559 -276905 -27495 -56904 34647 -160087 98250 -107026 -211483 -21646
18481 66796 51881 -113033 -35334 -270147 -20193 195219 166908 39677 76092 24035 -140954
18469 -355146 -94860 124187 -203483 293751 191366 -388620 19508 173237 83597 -404635
18458 -59102 -48945 -55699 -101912 157255 55509 -55309 50867 -494619 12280 -190255 139229
18446 252588 -89205 -50452 167616 3092 -125319 -187559 -214049 -28437 -57469 -43130 95798
18434 -227407 -326660 -3909 -260910 -524221 232301 -18634 -345139 -66085 -264583 52943 -175224
18422 1067 25062 78190 -149979 -69898 -54099 -247144 -52874 124301 62482 -1912 -126928
18411 -126928 -207710 -200480 -7778 -63718 186558 188816 124299 -37534 -201596 230839 -479569
18399 -66536 -121452 -26242 64478 94382 22905 8722 -64482 -129606 122585 -35056 -67721 -201254
18387 -201254 84084 -14022 -193679 -121902 -118755 78523 -68050 91861 -6834 235391 113624
18375 33418 234073 -97605 -107409 -21888 144096 172053 219791 -40559 -144328 -424219 -41221
18363 -212716 -81838 -98197 74492 -57455 18552 207098 -77870 280597 -324969 -136342 247356
18351 -255263 -230211 -127661 -159722 -47558 -29394 -293470 -124069 654 -16491 -294078 21823
18339 32038 -9435 -219119 -173700 18392 400000 -161215 -229238 170564 351192 -56210 33973
18327 391346 -276606 -34766 85682 -198557 -4058 -116167 -16520 -115771 -33265 -273048 -37468
18315 -125070 -91922 -36437 6410 -76830 -281798 -118476 26971 74622 146431 326721 72817
18303 -65232 35201 -42191 -347871 -16565 -440344 70915 80187 -225820 56885 -80656 -56270
18292 -56270 -171603 -165452 -209255 139672 -162090 -35949 -133040 -126467 106702 -364416 -215996
18281 -215996 83852 -383756 -291935 111159 -234737 -40871 311765 -249152 -261371 55761
18270 -244039 16442 71487 -225885 29179 -311830 -30433 -12776 145164 -39613 -91800 -121013
18259 -121013 -173346 245685 -110817 1774 -26440 -22297 -10973 26870 198795 -362365 -144913
18247 -41731 -88794 -21681 -282877 -45845 57324 72951 -303409 -301567 58751 108866 217201
18236 217201 75666 -249324 45997 -68664 403486 777 35905 29672 -132089 54417 34509
18225 34509 -67001 24547 40632 -109929 -133415 -174846 -125467 -278306 -197640 -283321 181061
18213 -51517 14470 -15345 247304 -159851 -114619 155661 -74786 -177626 5803 -19559 74821
18201 128664 -144870 -133996 -128591 62298 169638 34306 -357631 261053 -232548 -98557 -67561
18190 -67561 -97915 -109809 -107682 77355 -98517 -262388 70077 174131 -317230 87772 164535
18179 164535 -247749 -63000 82261 -256243 -48117 -7793 -210943 -359050 453286 120751
18168 51350 17998 -92673 40626 283370 -536155 -147804 -132351 -30499 219780 -226442 -132763
18157 -132763 -187181 83302 220895 332106 299532 -17942 205067 90483 166743 -121958 68134
18145 28618 -57187 -137869 19203 82370 38617 -91605 -56848 168756 -190526 74691 160241
18134 160241 -166280 -94886 -40526 259783 84367 378409 242032 314601 175709 -68087
18123 20048 -145927 194575 183662 -199542 28489 146695 -52432 247612 -37797 -58936 -127152
18112 -127152 -100898 158862 87450 -136449 -282006 -354147 -17606 118449 232756 -162570
18101 -68856 -16272 -70684 137896 -9214 -83019 -3994 89527 -80112 -79662 29155 -121148 290396
18088 -259533 58118 116878 -137652 -239685 252294 60417 -11668 239016 -34921 -169145
18078 -169145 -188157 -73106 118848 248397 -374426 67753 115534 182019 -177562 -30238 -89928
18067 -89928 -489952 351330 -216654 166563 -19330 -78886 -110055 -264760 71595 102649 -29951
18055 168218 -19197 -59263 -367421 -77969 -225044 -236142 96804 -185584 90963 -81329 1899
18043 -75631 151706 -25899 -430474 -341690 50910 155021 -346570 -34168 -222214 325325
18032 -55696 359187 1536 -262897 -205102 -65830 -370677 -246120 169440 -109493 -42726 -85986
18021 -85986 -208190 -156971 78604 56442 -161423 -3418 66200 238548 -181166 -113153 245904
18009 184894 86526 -74774 -160772 -108194 -62661 -419622 74855 227201 23386 207492 -436318
17997 -441912 59949 -212349 -12586 -151879 94848 -192889 18631 119029 192742 -217538
17986 158754 74963 -247164 43633 144423 -9670 77373 -1230 163577 -69680 238687 206279
17975 206279 -78035 50184 -93963 -42393 56786 -138235 191014 88354 -149511 32636 -80947
17963 -55097 -74289 -371741 127551 354917 249942 79635 -42433 42702 24151 -136580 -305036
17952 -305036 39640 -108336 11770 248300 121523 247574 313426 39748 -186881 150544
17941 184621 -27970 25606 -204707 -13437 -90537 88115 137961 -266756 -73863 -77618 156156
17929 -57017 72590 117005 74377 259299 -211406 -25041 -92483 82958 -1631 413865 56071
17917 -55146 -138213 12294 -182336 -93851 -239797 224446 218237 -218192 52678 -221847 -94568
17905 -1075 -176388 -6620 84379 47867 -108562 -221044 92868 59937 133502 -148230 187870
17893 -340460 55355 21480 190757 38674 -5780 83944 -61835 -87895 -34813 240538 -276305
17881 170775 -301250 22930 182072 -133761 -192272 -100827 166631 -79885 -107044 -139968 -273346
17870 -273346 -63142 -94561 -99635 43704 -249461 -272321 -36729 7926 -39596 -51314 -918 -6627
17858 -6627 72809 173887 9512 24764 27697 -300316 -110840 8169 110138 -182352 213858
17846 -5058 -189400 -150449 -68070 52841 353056 10174 -103731 -149930 31037 207392 61993
17834 -139289 26850 -251755 106132 -230889 -196117 222935 253423 89310 85816 -86101 203553
17822 -258104 49060 -334419 85569 25561 149939 -113892 228154 59835 -114217 215258
17811 42151 111532 -17874 119625 194573 28436 22580 -181858 492964 -118243 -41631 -26580
17800 -26580 64923 -315840 -133848 21581 -91354 17032 273104 4141 108972 -280639 -237345
17789 -237345 131315 -59110 -87169 -175392 58274 -59793 78575 11355 39084 89576 14241
17777 70916 -27736 2427 -123240 55193 -10457 -205864 -318463 294896 -430191 201040 42603
17765 -193580 17808 34896 -469587 -81650 22050 -128328 93509 -217857 264262 -2353 51920
17753 37224 -64780 122573 115620 197577 89167 -280307 -66215 192107 -138909 36000 -161838
17741 75585 -17444 124964 36046 180900 -48840 -86132 -391149 -199987 -60260 -20108 -274104
17730 -274104 72636 69051 108023 219789 -305184 -80889 27976 -56433 269628 -278657 -52553
17718 93664 -247652 168237 -3008 -177187 -157133 322782 -129296 181943 7476 -229752 -101769
17706 116539 17741 258033 -169682 1087 -88796 88994 308750 5430 67739 -135186 165865
17694 -80038 -161099 81142 111367 77167 151482 -35146 -15727 427480 -243357 -29561 114939
17682 -219427 -317739 -43358 -241653 185926 -21275 -126944 49836 363582 -106960 46515
17671 32107 -211911 167831 106885 362931 553379 -107696 79506 -153149 38235 183441
17661 183441 39029 -14129 320620 -106811 -145763 -210174 300716 315468 183500 117350 30585
17649 -47163 -88875 283592 -95382 -266287 -69531 -51767 -178762 32791 -139425 -36396 182690
17637 194783 100752 -133647 220578 -122889 249006 63882 121595 209421 -222635 11550
17626 117989 216903 -41106 -23056 -46228 -13412 -293426 130621 103256 -97101 99781 -367925
17614 101679 -34808 228550 -159022 -14852 287803 162855 -14816 -112314 160622 160397 110802
17603 110802 239493 100059 -13264 117714 -121986 -2708 -122878 -102611 -19696 -173535
17593 -173535 -61050 -112732 100318 223783 15039 150391 97617 102314 46039 198626 41558
17581 124112 51337 32740 -25858 412827 -125724 -51378 129864 -52951 91125 -27267 -82428
17570 -82428 65054 47004 170257 19978 225241 32005 278229 452282 18617 101941 -102088
17558 12830 144367 -268525 -6471 383729 -95113 121242 205530 285675 -29799 189057 398238
17547 398238 166803 -94226 186858 -154237 187561 -105559 265710 -115243 -206620 -73347
17536 53594 104291 207303 -182198 -25311 65888 -99965 -111476 86441 229521 262930 238333
17525 238333 -284953 -160809 359597 -29326 59151 -5247 23505 253205 163434 65727 -1749
17513 812 25802 130248 -237676 186957 409833 -20635 421402 437022 -2423 249688 -61785
17501 131640 113316 49943 23672 38928 138558 167934 37391 -59078 44159 -46704 -84831
17490 -84831 338432 239308 183499 268446 53210 -58646 11429 -50058 165222 86005 218761
17479 218761 -79763 81012 281028 311282 -53100 107183 269339 227799 128813 69453 353601
17468 353601 246839 107505 305570 274237 -157141 -174260 289958 39977 128879 -2454 -146728
17457 -146728 358389 400383 90233 -89717 162423 -231431 166247 79265 31706 647762
17447 647762 -247333 137746 -79279 260219 -2526 172191 398807 39460 69052 61113 78306
17436 78306 205292 83864 90068 508564 181524 251435 57159 -22138 274530 103501 65731
17425 65731 455236 218392 -21676 24743 25567 -149212 -768 396947 468554 228361 4882 163553
17413 163553 314672 441511 172684 -66679 252404 193793 285267 178031 211317 -11313
17402 153758 340352 136655 -50759 292273 229210 -44170 225161 -10129 222510 153575
17392 153575 181265 -127049 121222 391805 -145330 -1672 338258 -7206 399649 218281
17382 218281 134567 242369 446074 80245 41862 446697 296379 160421 286397 101513
17371 47103 321027 -22302 178859 4339 245946 121971 -114139 -89997 -199180 -21649 -82363
17360 -82363 291456 -302018 233223 31988 200670 -1935 -116616 221809 66227 136303 -262611
17348 275301 102525 37918 308204 -84153 20594 56375 42962 333411 131838 -150030
17337 -149082 170193 172618 326205 64604 52444 138600 287121 80245 400877 -1910 -24251
17326 -24251 -134421 -199699 86096 -22312 -44703 115944 144544 208476 -39324 90442 123765
17315 123765 372011 170304 413425 625045 116014 106452 110499 35952 196009 416394
17305 416394 -12906 -133037 285326 117932 248306 142827 212641 429160 -81524 351690
17294 441113 145883 296343 216621 661095 382300 355594 372422 253667 312525 -76302
17283 -36059 447322 110704 102041 -91493 443777 232076 24254 60835 77895 259891 267891
17272 267891 213295 319945 183599 183520 107918 271251 -49277 299962 -25383 316556 310881
17261 310881 202007 418231 -100615 281686 219600 223718 364463 414503 167798 -44531
17250 340205 88007 276319 256405 340138 230288 -502444 296823 423048 519305 483528
17240 483528 299820 113891 241085 335307 263107 99334 101683 285616 162845 53721 549859
17229 549859 90832 261116 143614 110557 -16228 571758 309375 258304 435611 180730
17218 154628 361254 151466 194771 252056 70954 255741 109472 -167122 175911 286835
17208 286835 62542 366428 -212257 564617 313718 22883 289374 402747 212178 200118
17198 200118 370018 509894 350015 182351 102882 531800 343779 354322 91281 348035
17188 348035 291147 72014 83844 243330 407267 93458 209783 455197 279583 286641 286986
17177 286986 297287 225304 227201 49312 554003 509842 164397 71312 341721 250424 402223
17166 402223 353528 147616 347816 154478 129226 58616 104931 240414 93453 139940 167952
17155 167952 396144 -92772 138992 155130 373295 218353 -33347 529865 109387 68413
17145 68413 198192 -151698 83217 442066 204483 168010 229638 537498 128647 222863
17135 222863 -140153 220310 266817 514458 128502 202232 226996 285700 293448 452841 228802
17124 228802 352592 24274 80473 340364 392741 592264 592806 257475 237510 184426 573502
17113 573502 397140 291273 783145 435444 479452 34901 494437 614094 166657 351823
17103 351823 128060 146268 542340 279897 571707 443119 670015 584277 371868 160767
17092 569147 340704 243413 287347 -68461 253428 402388 215798 37885 424590 478308
17082 478308 252712 617004 299243 382651 307704 -5893 256940 517048 217519 620503
17072 620503 379644 262118 408267 289670 196796 424995 290380 314658 415458 452748
17062 452748 187855 401829 381334 613652 490883 420601 701670 425567 279696 303974
17052 303974 449890 834293 632430 256509 211038 616958 418196 291960 428518 487588
17042 487588 102708 421603 437658 550603 741066 570946 398163 682154 654035 740640
17032 740640 902400 380082 576544 408378 435640 654773 282221 690595 357222 555577
17022 555577 567478 640610 693304 569320 616977 567959 573452 894693 737091 477012 707876
17011 707876 587825 604488 616505 763091 727585 389549 665123 745099 747183 668024 789023
17000 789023 304330 626948 478038 729922 760414 555439 547662 656157 549651 590192
16990 590192 634351 546156 687613 595703 673743 315133 831180 1147352 891198 552566
16980 552566 1088464 718309 545580 1021195 511682 997004 1396409 750299 805172 1037572
16970 1037572 842912 749635 806451 816821 571495 818448 685635 983404 615821 776711
16960 776711 791023 981662 862803 1001582 749943 847894 926918 798471 910848 825465
16950 825465 988421 1028261 958529 989359 1221981 919214 999527 1107557 1001884 1025751
16940 1025751 1039658 1008484 1334906 1149419 1040650 1217610 1199659 1146713 1105239 884833
16930 884833 1079818 937518 973688 1302329 1073086 1253352 1033462 799421 1268486 1300203
16920 1300203 1434025 1226362 1125782 1146179 1098043 1491895 1179719 1342290 1252847 1320921
16910 1320921 1376249 1258616 1327228 1184334 1213674 1446427 1413933 1285686 1663251 1595678
16900 1595678 1523791 1356661 1734305 1533271 1409186 1696538 1534335 1667941 1611059 1613110
16890 1613110 1635604 1601376 1614107 1570268 1700660 1935330 1653354 1545164 1577676 1847638
16880 1847638 1646599 1708678 2118159 2010649 2011552 1721585 1970452 2049993 1806374 2169146
16870 2169146 2327576 2232767 1896595 2205331 2101868 2182095 2383589 2356109 2281524 2019771
16860 2019771 2427968 2268680 2318186 2266612 2314490 2441742 2686839 2737313 2263766 2455269
16850 2455269 2878549 2793948 2706461 2502336 2686231 2955937 2898845 2423043 2633998 3206364
16840 3206364 3326003 3158534 3130818 3325327 3477562 2991332 3528053 3642140 3307788 3612739
16830 3612739 3600996 3984394 3858688 3718315 3744400 3687562 3750599 3962458 4228964 4025784
16820 4025784 4339542 4292579 4439988 4308723 4774329 4569373 4593005 4530193 4863350 5061398
16810 5061398 5323176 5238370 5637714 5285366 5560892 5641145 5703675 5671186 5758727 6002519
16800 6002519 6235374 6041503 6387964 6765778 6732129 6958115 7217385 7317533 7191195 7598640
16790 7598640 7807870 7507049 7846933 7793377 8301051 8844239 8629859 9063957 9257097 9076241
16780 9076241 9816061 9898770 10391256 10560213 10978510 10932073 11445657 11506584 11972961 12052813
16770 12052813 12573816 13138986 13477419 13848743 14223176 14736254 15243228 15985515 15884330
16761 15884330 17205699 17468028 17983026 18745030 19139629 19949905 20946706 21282645 22461043
16752 22461043 23177065 23651461 24843285 25968505 27082494 28080863 29141504 30398018
16744 30398018 31721015 33259433 34424094 36037627 37779856 40036542 41750944 43429843
16736 43429843 46173018 48260697 50676130 53547362 56429279 59291506 62754549 66065968
16728 66065968 69950570 74023135 78426340 82994954 87697490 93171502 98635829 104864092
16720 104864092 110906269 117416792 124074711 131331006 138468237 146134561 153486834 160875454
16712 160875454 167961817 174557152 180994886 186601805 191297815 195228979 197958537 199069721
16704 199069721 199726336 198058232 195799055 192298470 187840358 182235605 175659362 168653816
16696 168653816 161394000 153717644 145945746 138677050 131172442 123654857 116801489 109963825
16688 109963825 103524411 97262894 91171764 86460674 81357447 76620654 71781266 67851419
16680 67851419 63757056 60341352 57138856 53894163 51256871 48108257 45794819 43130752
16672 43130752 41153906 39032413 37224554 35542753 33644803 32072453 30702513 29458978
16664 29458978 28113048 27062501 25718315 24752426 23832802 22657570 21978474 20967056
16656 20967056 20297977 19056136 18845641 18053424 17527447 16937738 16137408 15419794 15211042
16647 15211042 14434613 14383658 13101819 13299073 12765898 12463288 12001466 11989062 10938441
16638 10938441 11089867 10595188 10570604 10012739 9618404 9317933 9316500 9182231 8611533 8670289
16628 8670289 8202335 7964250 8069433 7852001 7822424 7394428 7306131 7083728 6653653 6871806
16618 6871806 6593837 6247362 6140427 5845819 5896216 5918158 5616655 5211299 5346907 5410088
16608 5410088 5221638 5162604 5219508 4708855 4680620 4688099 4709175 4339628 4621603 4365933
16598 4365933 4121884 3737954 4161291 4028154 3621789 3758948 3567112 3882443 3369589
16589 3369589 3495146 3517186 3566578 3324805 3266219 3309341 3310428 3100162 2987466 3041707 2773074
16578 2773074 3239135 3044132 2811227 2618078 2776334 2900366 2842287 2894649 2724307 2492068
16568 2492068 2816658 2608871 2466264 2477509 2202529 2178333 2359123 2687488 2208127 1722989
16558 1722989 2231978 2181935 2130275 2162673 1852414 2035798 1907037 1952809 1790897 2054756
16548 2054756 1909628 1655659 1486994 1861010 1845262 1849777 1626655 1418165 1521184 1554095
16538 1554095 1696863 1606040 1800978 1643687 1390248 1652198 1697250 1727489 1562571 1404053
16528 1404053 1513063 1818792 1538446 1363109 1192978 1278531 1384198 1332541 1330514 1375326
16518 1375326 1302257 1157861 1227299 1318032 1190251 1297716 923675 969597 1209907 1228302
16508 1228302 1360067 1121874 1078629 1085238 794052 805297 953978 1113771 1342262 1142379
16498 1142379 1175168 1064989 905124 1271572 933088 1187500 761636 979512 1133513 959742
16488 959742 815401 939957 1145789 1011587 782162 730769 1074114 1137827 455566 783991
16478 783991 850081 736244 744101 548926 585008 604335 870067 979780 628830 549425 885119
16467 885119 518835 744781 920141 955452 528670 690323 638599 616304 870700 566650
16457 566650 644779 866808 711353 611706 891836 637614 614042 831754 965779 384568
16446 865012 397957 631678 640627 591143 628032 735223 612450 498716 680938 390016
16436 390016 461786 592297 756296 291146 512848 286295 752287 348638 378831 433018
16426 433018 425481 923955 525436 735905 443933 535672 892842 203926 570092 404816
16416 404816 374248 476962 740101 343129 225372 772697 437050 215721 381686 726384
16406 726384 557729 511713 424805 641988 467458 314099 732151 331248 357712 212424
16396 212424 434481 593125 395340 300143 485272 482253 391159 302968 104874 153735 429203
16385 429203 189710 481892 779727 269162 392210 402292 495209 241695 265224 180989
16375 180989 430582 306370 262107 151677 346551 184246 399019 270627 375638 482158
16365 482158 244094 351899 346094 274506 103268 379782 179428 267751 497290 416405
16355 416405 33404 190037 332215 175489 319010 159843 332950 317798 81253 269096
16345 269096 289512 570240 33516 228990 306956 644704 168656 498929 219880 379979
16335 379979 184712 415790 91902 70921 -144796 511470 189584 261301 70335 166008
16325 166008 -8509 436419 276251 516609 342192 281222 180688 216495 379097 -56310
16314 223508 167711 -137260 388390 21760 142785 582315 216842 379518 242503 166478
16304 166478 151531 383339 329502 -18605 244771 78457 252975 440756 276658 83548
16293 30445 577213 20285 332163 359320 121147 243161 78583 402403 208419 -244924
16282 -50093 -103473 372004 137268 142141 472511 63057 599778 109038 15706 372140 319521
16271 319521 -53710 63506 268042 415601 140188 484969 145925 12355 598095 139014
16260 250934 72111 401970 249758 187445 220248 -105600 128776 7888 47655 272792 265767
16249 265767 138001 86758 158132 177042 180235 53367 37751 5097 240411 234739 158815 299831
16237 299831 -47488 104012 193218 102094 160868 151940 145092 -85188 328922 158060 110216
16226 110216 9585 250977 74834 -37352 -324754 96917 139701 213608 167098 250642 95219
16214 -4950 379255 -84146 -235422 96876 -129370 165802 193196 -167927 -77306 161688 12941
16202 22763 117205 194050 253283 384896 82533 373157 -96459 -61218 -21072 339885 60884
16190 54051 397237 -153296 139256 -94493 106989 159290 -114642 -107890 212616 -10950 -144886
16179 -144886 -205675 -21178 -107196 -43887 -7609 26170 3007 -173513 100064 -22921 -84051
16168 -84051 99457 296517 130875 44679 5678 -1837 11789 32283 -9282 -36166 275167 92554
16155 -238079 -55558 -113951 111216 106670 271371 -135732 169087 143462 9195 -112282 116201
16143 -155797 -267731 173757 -95643 110166 154257 -101623 16535 120756 21136 61041
16133 61041 -3545 -59947 -392493 -68282 197557 -149526 -99983 -192355 113976 -44300 -120772
16122 -120772 -148435 -279442 59593 -187850 210594 -174262 136481 -336025 393733 -227963
16111 -208789 286185 -82778 437314 87246 -87208 -224260 1774 -169102 -6734 -40709 83613
16099 460412 -58814 119361 -1744 98731 -108666 342692 279158 18747 64358 -125093 -21749
16087 -97393 210051 -81477 106289 42314 -134403 307897 66935 92898 153542 54234 -152525
16075 140066 -215287 -62501 28434 86749 -50560 -223603 259240 473032 60287 95086 419001
16064 419001 -56575 314069 -47362 188282 -152454 -174225 -134726 6589 135000 102121 -216068
16052 167799 -14626 -31797 187972 -134109 23749 -43528 -170588 -150022 -183626 -123598 -187134
16041 -187134 -58145 -132799 -181217 88369 196613 -36145 35916 -284441 325927 63816 -210712
16029 -267397 -24940 5188 -229458 -111382 38162 -203081 -180861 254555 77930 21370 20522
16018 20522 158658 -226425 -260218 217704 36159 213791 -238646 -256705 182212 -49135
16007 55184 -5342 89709 32539 -147806 127389 -16385 -166473 -232552 148264 105831 -367427
15995 -253956 189123 5859 -34456 160369 144303 29259 57524 -106551 -315439 -66377 -25639
15983 7199 -136237 106268 251003 25124 -284175 -61290 -68351 -121841 93880 -135490 41458
15971 112316 145679 28690 -37439 197622 461584 141199 -16462 218112 40600 195328
15961 195328 79048 -391711 205345 174387 -257907 28912 -47140 38397 213653 136907 48094
15949 51373 -80969 -18450 -387860 -120394 -139379 139361 -47747 220531 18143 -248702 -81763
15937 -141959 -176931 -35988 -232640 58093 -4994 -23336 -110889 -119419 -255983 237536 -109757
15925 -463145 120702 96116 -178899 -102308 328311 123134 -100525 185802 -242413 -155769
15915 -155769 68517 -220646 29393 -29753 -214609 -124111 -59187 29111 -268228 -106040 254918
15903 -125243 -148530 16021 48728 29177 54890 -189442 -108795 -112675 -369172 -109384 24895
15891 -156548 21249 119368 83540 283438 106552 37297 -207777 63631 -146976 142201
15880 91176 -182888 -265125 -53192 -6922 -362350 -295399 77501 95884 377698 -125063 153546
15868 -131463 -38316 -130478 89009 87045 135879 96998 341213 -126889 104962 -68390 -343238
15857 -343238 55402 -85859 -170000 137783 -32991 -63478 139610 253313 -17750 -340046 18541
15845 -241934 -397069 42645 167633 313040 -284186 149762 210838 38617 -251992 -311587
15835 -311587 273607 -113659 167348 330889 75895 -129530 -122806 137736 -88486 -114258
15825 -114258 111567 -234521 -258244 -6875 -144884 9035 -236590 174272 -251819 -283284 5446
15813 -213712 -68162 205380 -75399 -136928 -404840 210869 -6326 -54180 80136 89433 460756
15802 460756 103564 113534 -11905 55646 -196582 -163303 -152684 234181 61727 115365 110770
15791 110770 -92270 -97596 -28802 -85268 -4285 -217322 -116890 42178 -344826 49900 421584
15780 421584 -28423 66618 26811 -160308 148017 25262 -144877 10766 -6901 122470 180508
15769 180508 395440 -77014 83247 150929 -165968 73373 39404 -42122 37114 -310850 77934
15757 149188 176925 -356376 40024 -54393 -240419 -99388 -47776 194712 -63731 185384 -379937
15745 -139378 -58089 283197 -35060 -48049 -199541 357864 77422 -52327 197134 -390067
15734 -109475 -352298 -48667 -247146 112499 -300154 320794 -330974 -260965 -305826 -273485
15724 -273485 -42326 3307 -319449 20787 -99401 -234742 156914 -32363 -124250 -109182 -11427
15712 -150932 -43114 -173609 190545 -103146 -118962 -101339 24625 -251421 -332937 -300138 -87595
15700 -100067 -78148 12605 -396 192818 133616 -114859 -29191 -296089 -90510 -59919 -67660
15689 -67660 -43914 -104088 -96952 110525 390056 -69795 18253 14059 5082 -85879 -217614 54544
15676 112997 217534 -95248 48376 -102744 109883 -53387 -61614 -51909 -204810 -274174 154920
15664 26135 -103267 6289 -122885 -6765 77305 55661 169961 -280363 -47282 -294266 -8743
15652 -111532 140100 -47562 -187379 -16870 -81256 145854 146903 114767 -124649 228335 339775
15641 339775 -261478 184692 -366937 25551 94887 -41978 311786 -33617 259321 -63668
15630 270280 -44694 320609 1176 -353856 298730 -214336 -6055 -72878 -351096 65665 -115655
15618 280558 51867 194678 295991 382078 119119 198498 313776 -48823 -243161 -215422
15608 -215422 -124028 -208243 -4324 175400 -76746 -871 151149 -135525 -134887 299482 -54702 203785
15595 76474 -10135 381360 187680 124162 231061 -53610 -423421 -353025 -98828 178060 1853
15583 -62390 -49261 -466789 -144827 417329 -446349 -514041 64720 -181250 -104530 -22650 -253581
15572 -253581 -258242 -73539 82965 -175235 -92835 190546 -25125 35583 -49085 178489 185330
15561 185330 -52331 50925 30701 -138062 -145501 -133321 141163 -64425 -130723 -57625 47536
15549 103379 -40040 -78079 -71603 52006 -79962 45738 -21956 111490 5468 -150537 171607
15537 -54350 210623 -179244 402714 -40432 -39714 -184610 -110825 59757 -229443 -291 144956
15525 -146175 -50105 75872 14452 -5228 86492 -198272 207073 -5448 134319 -28626 77987
15513 -5818 70656 246107 -69966 40721 47629 47721 -169242 -69256 -130316 -124416 -128205 199613
15500 195089 149383 -162303 130718 21760 20143 138737 -78402 129447 -142232 -161225 -20134
15488 -586536 120758 80772 109429 41903 31045 85358 -85758 275995 -301712 -109644 46673
15476 327834 50398 43199 -86359 186416 -136951 -61151 97621 81424 646 30634 -11686 -296283
15464 -296283 -10957 -92665 22941 -198047 -73357 2386 -105796 46052 -4121 313428 -61465
15452 -87686 268928 -115902 -103533 70446 -141360 284732 -182627 279375 79080 -116597
15441 -148687 32832 -113606 85688 -265886 -19899 -78744 111262 -240528 158817 238562
15431 238562 156425 -31085 282631 -135399 -112029 60666 268568 193994 -454321 66878 -105609
15419 106954 -28356 188048 -7062 -102866 -23863 65399 144137 95956 -123103 -140788 154826
15407 25521 31497 -76476 306513 29695 49439 -199019 -143713 16537 -155944 -22851 -65582
15396 -65582 -170891 132597 124710 -167194 -264678 -227747 -94434 2835 83163 -36752 219188
15384 -272685 -195517 -28543 -37107 -98988 46764 34588 305423 -63900 -428830 -90416 -28995
15372 287533 -272724 122414 -23904 281963 -135290 -126239 -24073 -38971 145488 -5104 -112326
15361 -112326 -49465 28185 -234451 -328012 201732 -143863 -270139 -14881 -152277 -8496 133913
15349 227631 -38117 224656 73449 60067 157381 138209 -279679 -432570 148510 101520 200436
15338 200436 116454 -108993 -240328 -185457 291323 -117062 36734 111162 313353 195483
15328 195483 -56288 252252 212636 178167 6873 39977 152121 -120855 133630 28665 40670
15317 40670 -43883 -54215 106894 53796 -4672 -123521 210775 276506 3135 242743 -115053
15305 226332 -101514 -602 334678 -379266 84362 5088 229681 -32564 214274 -177946 -331333
15294 -331333 193556 158406 108067 169931 171706 352368 -157550 -186243 98533 -180086 -151533
15283 -151533 51396 288868 75810 100617 47081 -50129 -275079 -67931 -140373 322832 129727
15271 -91080 288274 106866 -368852 -193346 -110990 -30141 175564 -244343 -60521 -125828
15261 -125828 -185798 84979 217038 -69054 -34230 6755 65732 -36654 -3353 42051 -36998 109661
15248 -93407 111395 -111771 116187 326079 -118188 95063 124747 255659 72858 398694
15238 398694 36953 169553 379684 969489 1035939 430437 1060639 852069 -159534 480292
15227 128090 49806 241113 210876 184960 9465 -103261 110427 -12277 -22404 225447 30848
15215 -12902 218837 591368 80819 155001 555635 88395 58614 426019 128324 58336 223658
15204 223658 145430 245214 -65834 299021 375421 -108489 -201997 -305639 63953 -109525 -104327
15193 -104327 -9896 336348 -137357 251030 185330 -80925 40007 -127046 345570 -29307 111452
15181 -39488 198486 -20782 169061 3152 157068 251100 517396 86317 41014 -387390 90708
15169 84686 216236 -363558 145389 69072 294989 99562 -117215 -54284 193940 -248051
15158 -66254 -305136 46582 221735 298276 203713 131258 -151209 73984 -85290 375474 -115101
15146 283383 72856 142185 21645 -80807 -71861 -62370 164867 -123021 110984 15049 30639
15135 30639 279603 365087 177361 137797 -123878 -241123 15411 -50358 -318047 28880 108251
15124 108251 161699 215080 91467 -84171 306877 -98108 229206 29131 392389 -94984 82676
15112 45197 35204 293510 83423 42913 -195308 -184097 186305 412992 304607 47883 311164
15101 311164 368751 -167693 420468 260549 260766 193326 192660 233130 419392 349808 90347
15089 -53073 80128 331997 274348 68138 50487 109025 437442 273213 -19403 110988 -199026
15077 133262 31577 -26210 25717 97639 -153249 -142612 -78730 66990 175672 145957 -18553
15065 42345 296289 235716 338060 366987 192192 -28703 393088 476986 278828 323295 45583
15053 -135150 303089 291436 217152 111764 167772 289511 -111456 -217915 237736 306871
15043 306871 112168 390745 260019 -5819 321819 -44638 34383 117750 171677 23043 119189
15032 119189 -10391 11909 112362 250685 411138 258529 81752 -22869 223732 393364
15022 393364 -7518 267587 -57639 249126 346998 109206 117563 240239 49339 49491 132223
15011 132223 134114 248571 79036 67942 44650 219199 208455 217375 -52810 393970 529749
15000 529749 299936 98838 -49109 -35816 -49803 142168 203003 248919 129302 148445 393492
14989 393492 270563 214225 -50477 431181 7000 443554 -117512 241945 505837 -38054
14978 155774 84760 103497 192770 117885 66495 167324 364594 237691 354113 119488
14967 79436 257842 274730 475098 224676 294134 -1381 448463 7161 432453 215918 90553
14955 256700 455334 112238 162727 346280 480487 450323 241780 250126 -9720 83839 444661
14944 444661 88441 -28897 479185 179934 629935 564619 -30387 178700 -25310 301443
14933 152105 262935 -39527 202762 211479 107921 218545 371641 89322 299938 474600
14923 474600 150967 203009 240811 608276 -31130 427751 548732 389896 307780 202596
14913 202596 340152 394386 426902 61719 220014 316884 736135 336766 392725 487021 326925
14902 326925 76881 294012 585812 253504 61833 525934 138791 315484 343876 382624
14892 382624 351870 269410 480641 305107 608977 404293 18917 132499 266121 440564
14882 440564 252430 166836 396295 228669 136736 340983 182177 251598 412497 250980
14872 250980 200981 -97638 271836 422388 444227 556614 303170 214556 122964 570757
14862 570757 370363 615413 307600 335270 458605 462338 672828 103848 430818 247669
14852 247669 379986 243149 397067 353019 144921 337880 880801 693027 626031 665764
14842 665764 426916 704437 593113 398533 432319 355088 327721 645132 350701 389846
14832 389846 736260 580297 441698 263482 692992 578124 705527 570999 748765 606140
14822 606140 446019 594798 488930 378305 734289 563448 617894 655931 723503 596418
14812 596418 525010 545413 670985 481155 332692 421454 504335 235360 901867 321854
14801 516981 400804 513187 442901 656850 784780 417970 601551 277470 598865 236216
14790 722666 426093 254918 625363 482938 540705 362851 633426 529243 452660 343874
14780 343874 783478 635456 396735 579527 446804 580905 502394 514833 224766 557729
14770 557729 502311 409283 751697 626314 495190 915526 764339 603006 636186 442567
14760 442567 224190 406497 768833 261320 477459 301334 416569 531655 265028 713207
14750 713207 652681 346766 646140 544897 593519 694204 821465 995696 530370 627262
14740 627262 850575 718605 474841 790380 606920 475467 593349 991124 854151 944365
14730 944365 771239 639171 660486 426573 603427 669108 766159 461924 641074 839690
14720 839690 848596 835529 920653 675213 657815 956638 827262 923990 287134 919858 943726
14709 943726 1112317 836019 880813 544163 737519 646481 941063 789052 855499 1062135
14699 1062135 790532 1215662 824110 887167 822006 784801 924352 1019925 875112 1045020
14689 1045020 941972 619472 788521 987346 566975 877834 998118 878590 1047196
14680 1047196 709928 950253 1132871 955568 805514 1183937 991554 818742 853934 1000345
14670 1000345 1134927 1130727 804991 977188 1293840 1277811 979266 1346001 733197 990450
14660 990450 944146 1065393 1301031 1288078 1165899 815880 846660 957206 1238634 1046756
14650 1046756 1003834 977092 1225041 1191538 1096347 1220378 1018399 1001629 1107722 1082440
14640 1082440 1097905 1139900 1001451 992039 1353979 1163342 1191200 1731541 1233462 999926
14630 999926 1557806 953521 1552756 1012319 1324359 1227589 1374560 1019324 1045837 1207239
14620 1207239 1400546 1389342 1502693 1342384 1485349 1171205 1391745 1399245 1498257 1502933
14610 1502933 1437240 1262839 1465131 1501086 1445143 1731696 1495687 1580258 1712654 1391476
14600 1391476 1311451 1515690 1456919 1630573 1491494 1499041 1161269 1506895 1541937 1501032
14590 1501032 1601998 1669463 1777175 1844996 1778339 1726806 1976725 1762070 2086038 1826376
14580 1826376 1967128 1641270 1736119 1743452 1972189 1497942 2077968 1938380 1807848 2165452
14570 2165452 1850030 2294324 2305148 2081917 2143907 2017287 2212643 2367173 2110689 2292683
14560 2292683 2265159 2061192 2186021 2384021 1903298 2280149 2459220 2455827 2330409 2624098
14550 2624098 2725842 2576733 2792004 2768275 3394773 3117719 3224910 3386253 3676724 3951939
14540 3951939 4068379 4768935 5205403 5767996 6589279 8177182 10571140 14550808 21983390
14531 21983390 31987485 28950925 17860830 11204161 7578915 5339564 4211070 3828812
14523 3828812 3148990 2698144 2634670 2574230 2899633 2754004 2524385 2307950 2470659 2249534
14513 2249534 2483331 2510976 2535830 2589642 2362989 2694203 2993624 2753657 2429385 2877888
14503 2877888 2435240 2990485 3020114 2550722 2625300 3100590 3002546 2909010 2875203 3156735
14493 3156735 3056008 3026868 3273285 3233977 3086365 3122513 3124869 3369277 3484399 3070296
14483 3070296 3348070 3334863 3223147 3691886 3599274 3887034 3772160 4067581 3529072 3648803
14473 3648803 3469952 3811356 3925053 4000002 3709021 3763483 3958762 4217446 4344470 4178003
14463 4178003 4496188 3994994 4387128 4287003 4184935 4415595 4385103 4576956 4631158 4643728
14453 4643728 4713023 4834790 4816934 4948555 5010307 5023275 4802125 4903655 5147325 5053289
14443 5053289 5147497 5500421 5283883 5636582 5688612 5466405 5676941 5690268 5637992 5927874
14433 5927874 5772515 6067929 5931683 6142286 6106828 6355965 6541959 6399199 6409766 6702178
14423 6702178 6649392 6746836 7232849 6907163 7309047 7104113 7535132 7447341 7367365 7580430
14413 7580430 8018905 8016034 7567983 7846074 8203679 8035314 8071686 8187892 8650774 8666432
14403 8666432 8723641 9049414 9048879 8904539 9195582 9607503 9763962 9633058 9837858 9995568
14393 9995568 9867902 10307361 10623188 10657448 10673720 11097108 11359423 11608109 11470127 11683658
14383 11683658 11911903 12352440 12588591 12882622 13091162 13217096 13574692 13656414 13634954 13998390
14373 13998390 14001953 14277717 14971984 14869456 15054442 15592683 15686001 16073110 16390431 16273848
14363 16273848 17035673 17073665 17596915 17754644 18215412 18605602 18908352 19502803 19681688
14354 19681688 20340085 20250253 20897362 21397539 22050220 22253147 22713698 23331455 23826708
14345 23826708 24391458 24870641 25540441 26255076 26268833 27063389 27843294 28584687 29337011
14336 29337011 30032632 30368370 31369228 31955047 32724391 33650823 34679558 35934220 36401367
14327 36401367 37753825 38407806 39807168 41039655 42046465 43013820 44374690 45491090
14319 45491090 46893667 48378134 50140489 51486148 53118033 54848912 56869444 58443388
14311 58443388 60126430 62490876 64790408 66367895 69117719 71212398 74030978 76684400
14303 76684400 79560065 82305595 85405228 88898160 92323038 95892408 99536015 103597284
14295 103597284 108063890 112417880 117015345 122038624 127415673 133160461 138723894 145409021
14287 145409021 151871695 158779142 165971623 173605353 181986638 190433933 199752719 209178876
14279 209178876 219647812 230424431 241699975 253069734 265318032 278195476 291069900
14272 291069900 304498804 318438190 331787416 345272387 358241777 371010583 382510560
14265 382510560 394045455 405006668 415030657 424213009 432380629 439613181 445988111
14258 445988111 450621083 452492803 453336335 453886274 450336222 443366009 436695834 428247389
14250 428247389 419425649 408839658 398088939 385495172 373256825 360501079 346902831
14243 346902831 333603293 320221697 306608782 293289302 279907652 267566059 255220947
14236 255220947 243375823 231471444 220504491 209539767 198968754 189066472 179965558
14229 179965558 171375829 163365884 155682980 148116836 141326067 135155873 129353081 123973291
14221 123973291 118458250 113403641 108625653 104388083 100249885 96334652 92412482 88734333
14213 88734333 85520334 81812776 79144014 76356399 73379581 70859152 68586799 66183612
14205 66183612 63755028 62018193 59780580 57918403 56220934 54462475 52677094 51112359
14197 51112359 49618792 48072668 46363880 45373919 44356504 43528441 41924695 40853303
14189 40853303 39409244 38368715 37153678 36542567 35559394 34952359 33704965 32970539 32195487
14180 32195487 31156750 30598353 29777539 29187690 28450450 27523242 26851456 26660214 26157978
14171 26157978 25183332 24661265 24289809 23897811 22925649 22544800 22119252 21626870 21062748
14162 21062748 20445514 20396610 19533204 19484596 19120086 18681466 18242346 17986897 17368174 17113715
14152 17113715 17001084 16660631 16409888 16257809 16030772 15620714 15405398 14777303 14615851
14143 14615851 14362812 14373864 14260379 13707548 13652269 13151676 13318173 12712569 12784891 12455267
14133 12455267 12336961 11963713 12193191 11669154 11423686 11593879 11390126 11107375 10771769
14124 10771769 10770807 10559097 10730945 10275555 10024854 9829190 9983616 9703125 9384982 9581854
14114 9581854 9538050 9180649 9069362 8853627 8644785 8655417 8620668 8681676 8418893 8507702
14104 8507702 8230699 7938093 8098208 7656822 7782072 7742156 7580133 7407035 7451938 7269579
14094 7269579 7261310 7065986 6515023 6817619 7049496 6620393 6789159 6625843 6338922 6108179
14084 6108179 6263427 6083441 6295307 6287842 6163161 6026195 6040574 5694090 5886766 5731914
14074 5731914 5911422 5663629 5515096 5522705 5322276 5315940 5615286 5247342 4922595 5145731
14064 5145731 4978323 5243327 4802515 4699366 4781607 4373315 4794428 4739218 4404121 4565945
14054 4565945 4462730 4479189 4601985 4429970 4291903 4195115 4410049 4376271 4318921 4482675
14044 4482675 4292471 4453790 4245332 4026415 3710827 3851776 3984171 3388587 3762062
14035 3762062 4154955 3444994 3741814 3706620 3899229 3525522 3212359 3397913 3283788 3975161
14025 3975161 3504357 3365985 3470438 3645794 3386934 3307547 3180263 3415479 3434074 3302334
14015 3302334 3152735 3096046 3319362 2984126 2926630 3076609 3098456 3125694 3188797 2672799
14005 2672799 3178763 2781639 2905356 2537416 2677694 2944806 2755650 2654308 2816090
13996 2816090 2360967 2847501 2700637 2956883 2716163 2265723 2507625 2762694 2371535
13987 2371535 2556923 2628900 2900773 2538947 2471204 2495768 2784295 3007161 3179300 3218261
13977 3218261 3647844 4089018 5376475 6863577 10319858 16742158 26739752 29937208
13969 29937208 20369122 13746875 10423383 7581518 6593522 5055458 4750428 4172835
13961 4172835 3922743 3402198 3707635 3433032 2923745 3320754 2922931 2998803 2519193 2565531
13951 2565531 2747693 2481280 2590255 2228532 2567981 2441469 2201527 2131810 2314700 2087521
13941 2087521 2207841 2117639 2083789 2225574 2198997 2383269 2107965 2345423 2057531 2056511
13931 2056511 2045904 1914273 1767355 1881807 1610010 2009711 1875620 1872042 2119729 1729175
13921 1729175 2422057 1724912 1704898 1815628 1740919 2082693 1455202 1773680 1644109 1500928
13911 1500928 1698853 1808383 1500199 1557892 1374060 1601519 1433232 1790258 1775340 1727001
13901 1727001 1616233 1421790 1716802 1573175 1739296 1527157 1713730 1549164 1518445 1773109
13891 1773109 1330683 1487242 1540718 1246724 1294466 1617804 1476559 1636865 1557762 1352274
13881 1352274 1202869 1456703 1151064 1358346 1160727 927035 1267063 1315996 1563286 1406174
13871 1406174 1294934 1223058 1188317 1092681 1479506 1752681 1023868 1301821 1222672 1072754
13861 1072754 1552585 1114961 1304858 1481894 1362522 1021186 1595386 1127291 1442337
13852 1442337 1401483 1156207 1173238 1129800 999238 1139856 1339661 1399093 1008132 1360625
13842 1360625 1172820 1134588 1060944 934491 1230522 844863 1410992 863691 1264991 1175259
13832 1175259 691650 1121618 874935 1362487 844354 1016261 1169527 1126048 1065444 1245536
13822 1245536 1197988 768082 1126143 878319 1082561 976069 1186343 962672 947550 871997
13812 871997 868189 978117 1133309 1041084 1265448 1166387 606120 931886 1106476 789548
13802 789548 1059944 442805 852305 1142823 1100764 1150471 1075412 1148896 698819 844502
13792 844502 859569 696396 1009266 1052981 683127 796429 1087625 785775 1008577 893378
13782 893378 907232 621407 819769 902235 1110251 518459 758079 860849 753745 838581
13772 838581 932547 796974 623315 824816 1214955 705417 870526 745618 972733 614273
13762 614273 662738 696446 710964 687605 791918 822818 1071398 464665 751942 442577
13752 442577 540091 735153 535353 727372 904266 730490 584987 459880 738859 541278
13742 541278 520111 964252 633009 679947 889502 763753 1016126 595321 1038740 664497
13732 664497 1165765 480266 990555 140681 553002 825201 858300 856543 711839 1009074
13722 1009074 741552 441920 608595 617851 702472 466407 771357 877718 233361 459399
13712 459399 504430 555829 506762 876751 518998 778803 699710 653679 808075 387672
13701 624232 563817 716619 461021 121755 479757 713631 654910 641858 503992 441920
13691 441920 445139 839773 613581 465701 607933 666777 614707 752976 699784 638882 486097
13680 486097 746904 601654 444668 492494 557566 450444 463066 838911 723167 699776
13670 699776 478104 614735 622984 392318 808730 259584 452618 272639 762298 560105
13660 560105 279694 532636 239473 745463 166658 621485 311109 388091 431768 605610
13650 605610 507704 566481 599832 165032 585423 631809 188484 828330 628432 572132
13640 572132 637706 154451 811741 570701 373894 780466 354359 300283 510723 495654
13630 495654 597050 740753 15331 528812 469735 292258 203168 430931 280845 554424
13620 554424 280633 648067 5959 545822 585403 325915 291664 544550 364231 420306
13610 420306 455487 367128 87235 656549 574984 247896 413840 734238 640650 227297
13599 493740 513370 158163 277996 495075 500177 359669 221748 371518 304490 124080
13588 391443 306987 781998 500424 433770 169844 833744 612267 527973 682564 17361
13577 113520 673307 412893 312075 446063 396117 315227 294028 57836 370155 48902
13566 532970 559122 270313 479881 225611 131755 299744 168226 469625 487868 224094
13555 -51868 134980 159546 222940 157602 11904 275889 688364 267137 23781 507170 155960
13543 649876 138938 518816 263327 162861 344693 86323 218232 148141 307614 415670
13533 415670 33906 363441 261940 451121 276054 156082 533678 284431 376139 278383
13523 278383 177236 174298 195556 325956 170738 495990 447344 588711 486020 824938
13513 824938 600815 452127 201448 177642 529286 -150508 337298 76317 188349 46916
13502 96715 224022 447034 319361 429937 313498 178723 65984 8619 486145 222535
13491 352567 214125 323016 339298 252875 371512 237867 -50514 58869 37443 44168 174424
13480 174424 206918 98233 178207 249228 78494 184167 431216 143277 194234 275698 250345
13469 250345 459335 435602 360670 226318 185162 131781 624061 478719 204768 529592
13459 529592 328205 300126 314364 196496 205990 191120 649120 318764 528015 -116377
13448 274685 401922 270062 398662 320139 310834 170285 381583 163867 170874 19888 129397
13437 129397 242193 235821 386882 19591 218330 249830 140271 260232 269995 433400 243027
13426 243027 400624 286902 413028 216965 318290 504070 305629 380117 334829 207422
13416 207422 16706 158329 329050 105502 164711 82941 -89246 412910 222760 -82826
13405 266447 112430 189867 -63719 238089 348241 255585 26280 380560 291488 181203
13395 181203 -10761 401439 369150 225231 327005 319278 209945 -38725 464111 52206 406876
13384 406876 143261 328847 141410 249082 249956 298060 263184 72495 -15710 363719 191387
13373 191387 619807 266433 144758 157874 607435 54910 -68216 291627 170646 570677
13363 570677 534575 490628 102137 156994 264605 629319 235947 180830 1092 -15145 45851
13351 230012 87194 231431 364564 -14113 195035 224085 -133106 75141 396718 322604
13341 322604 43390 455658 506448 32406 207564 279885 149801 -17908 52230 483065 13849
13329 408726 206972 252062 412271 506615 182563 94334 121045 217477 -131079 245047
13318 301303 362340 138721 308682 -53311 414702 193169 290550 -16596 428794 98977
13307 7732 350795 529440 128638 43664 147994 211511 -107606 246022 493381 107858
13296 320404 233021 325861 138805 160307 214781 241077 -9577 627476 135687 23178 127652
13285 127652 160040 -99307 316750 93819 134393 267636 153780 -90284 -10037 462761 516384
13274 516384 198574 -101180 96949 210228 244264 -83167 -158179 466332 209 313673 83637
13262 181711 178166 76312 230803 322497 95609 79961 227004 23146 261747 -57690 487472
13250 13894 -63454 188765 66460 378845 300526 195863 -49961 68159 -32706 51864 334554
13239 334554 -46821 104764 174606 473157 182822 324318 -223727 186086 -39131 100672
13228 12463 112291 -38955 85883 211242 71795 93415 273589 339977 43703 534135 19498
13216 97196 339550 245447 367880 268780 188954 92482 59464 326063 -275327 65127 176566
13205 176566 126362 234246 88759 47482 190246 138844 324205 412686 93915 244463 52545
13193 251603 58690 -121263 58051 -4194 140051 -43323 363053 350256 -30764 -158524 181824
13181 -73901 204125 528193 106961 279564 55943 266211 -138254 259094 180192 114120
13171 114120 467305 -181256 455689 11937 112673 -104224 117970 -245739 -25323 100161
13160 321443 131304 149073 278543 -8777 -46922 237829 161999 -81036 53669 57387 160141
13149 160141 -91838 19366 142909 304911 34202 167169 22526 230051 -129935 238822
13138 78288 -46948 -12578 5643 -72243 230607 6272 -378144 245871 238164 185299 174785 -132955
13125 15662 78321 122587 -101076 190990 -27688 387810 405855 -142015 23318 94792 25762
13113 -91147 181141 99775 150587 120925 469522 15049 41451 -78896 74773 -43412 156370
13101 25759 198401 -279251 7949 240882 305967 -88709 45945 64044 -185712 -78578 182890
13089 47072 -153735 71476 -132395 177423 82433 148811 -112712 103594 108062 25374 46668
13078 46668 278331 282413 265031 28695 -64368 20227 -328912 -107454 154042 -54460 5076
13066 -142416 467489 -196654 240300 175052 420298 110148 184734 449055 213996 220192
13056 220192 169367 136589 176874 75411 172728 55913 14003 -83203 97423 95293 -87746 -139855
13044 -139855 136186 112397 384164 22683 217305 112804 106689 334694 390389 -63806 122918
13032 33392 298615 53631 302012 259947 241832 -280238 -103877 109645 52412 -155705
13021 193044 -160547 -76671 223156 30685 23639 111537 140470 -58406 -48545 13380 -119972
13009 239592 344679 -125172 -64621 336752 216121 348038 -151571 -245050 127622 223755
12999 223755 159125 308773 40345 153051 74323 54082 177426 -275086 91494 -36608 82424
12987 -247427 -274245 121381 71418 50744 474085 11403 9218 -11518 -69411 220618 119705
12976 119705 -128234 -47926 36852 267783 -286966 9846 177573 171133 229099 -323427 -125706
12964 278579 -64464 -12036 95425 -58456 -220914 -198732 264191 180921 188743 203228 181964
12953 181964 11953 272129 222914 132691 502558 149391 224540 14084 137949 -165226
12942 -173197 104041 15035 -18570 -713 102672 108118 43485 6707 -2431 -102844 413032 51397
12929 87957 -157934 -121415 99748 230313 -26847 -74030 -44957 -101053 10053 8485 116688
12918 116688 3379 149298 224680 65805 197901 -37493 193310 -143012 46048 139529 304952
12907 304952 417485 26292 312953 292760 254644 -122635 -205980 -62860 131071 37921 135918
12896 135918 -37544 147652 375876 220474 -48084 124812 63867 7423 53531 -89928 -172778
12885 -172778 342340 -413766 212077 -80331 52759 100783 63674 79375 180351 -245649
12874 -12908 131309 116511 154577 277019 131645 6527 -161319 -428123 -123359 43091 -228245
12862 -314280 32280 133150 506 453341 85621 263319 -281615 -23192 179699 100133 134872
12851 134872 168112 -29873 -137079 283642 -99984 187483 -264351 235259 -97093 -310178
12841 -310178 130090 -9103 -346814 92374 -279363 89789 226513 68302 163651 -5596 -145156
12830 -145156 -128679 144826 45894 -213874 129116 182288 99878 33251 159159 222146 -60380
12818 114351 106745 203816 -251584 215109 313661 52729 99037 -49623 -1102 39035 136967
12807 136967 -244704 151158 -169628 30712 -154363 142334 60055 236266 151243 229177
12797 229177 -96118 181908 -78555 44883 -10834 92997 -21332 307123 -29020 -36559 -91400
12786 -91400 -138097 137630 -86005 240622 -482035 103533 324548 -169015 35496 7041 287
12774 -187725 -157017 265779 -305728 122053 -76708 171313 172621 145596 -41483 275449 15488
12762 84896 -39224 55029 -170679 -14917 21002 -196992 158650 44464 148714 20794 45280
12751 45280 -190979 -225576 149797 147572 -186005 -165642 391738 112011 -45237 263892 13750
12739 -149293 267752 50663 -21026 92226 -158357 -24976 98987 -40303 -28975 98677 -46602
12727 123192 215309 -86188 1202 57969 -230225 77491 -95483 46889 17654 134625 168448
12716 168448 -353685 -107069 96869 183063 411005 -295744 52761 142894 75584 9198 9571
12705 9571 -73593 54346 -124725 142769 131518 -193976 26445 301824 -18674 75446 38673
12694 38673 370657 -186178 -63268 -54113 22078 -145623 130603 258808 232128 84487 360828
12683 360828 -242656 94763 -94138 129881 252544 74767 -43218 -51051 44774 74790 57513
12672 57513 -44476 75667 -37590 -254811 -129022 18776 47771 117196 175255 60827 12725
12660 455879 237501 -33755 394556 9997 219284 -316150 307261 299956 481128 150086
12649 -55837 -96977 138565 218521 51518 112925 201682 381693 361630 376194 123846 15562
12637 96629 -78127 269642 366673 271205 -17825 37896 212847 -129067 77185 -57551 200200
12625 153727 218723 40581 58201 -147726 91211 105205 109985 239708 101351 254609 -39847
12613 88414 154184 342333 94356 -15021 -15795 10967 457617 -40916 174975 128377 243835
12602 243835 46342 214644 116290 50667 361630 147225 11583 44064 114932 -153347 -43363
12590 168007 255379 314546 168976 -86610 54209 610650 -144603 255827 65354 -26780 53911
12578 -11046 327093 87911 -118505 142568 44314 -493205 -89099 89110 120466 512339 -143830
12566 51339 -158356 32854 151678 -260551 146527 134019 -175301 114658 19476 58261
12556 58261 292035 -216469 274082 -64033 -351536 88987 -55306 97853 234900 51489 -241499
12544 222718 -105222 -154354 278243 45621 169327 262682 -27918 208538 57186 -17269 90621
12532 -27748 -126670 -12644 155693 7638 -296850 -72020 341389 -70570 404099 -329729 -20879
12520 -90403 188154 -112492 -159750 -232075 -138251 -7425 64864 -64335 80564 -292023 227832
12508 -126634 -45414 -206704 -100516 109146 -383990 328084 278099 202233 198464 143438 -229828
12496 167265 -203013 35480 120267 134885 -148921 -101348 -218962 -35022 91732 -59555 58230
12484 144937 -281747 -180411 44310 -119957 -3075 254657 178364 -82646 117903 55936 139
12472 -38029 25863 30639 -224842 -68480 -92764 -220238 -323237 -89421 55788 -56918 30193
12460 76157 -224957 -166572 -198626 60279 126606 -8681 -44271 334730 154821 -33498 -477358
12449 -477358 -82057 -84833 159397 105045 -152182 -67792 218814 55030 434187 40713 107450
12438 107450 -116757 253799 -100944 -370718 165933 -211927 11018 26277 8562 31939
12428 31939 -77371 137672 -64057 -146495 142386 13011 -35014 -202383 123576 174687 -202544
12416 -78159 214580 238688 63434 63395 -161472 -238399 169213 296422 62165 86911 45655
12405 45655 -64331 -62707 -168612 -137012 -437230 -263909 -166153 426267 -141913 307098 -163339
12393 -230146 -229468 -108251 156017 81771 -33376 -113770 70731 5189 -107880 -148972 -65564
12381 -43747 63797 -303214 -13642 -188474 40053 37003 30556 -143636 191093 61656 52285
12370 52285 -241586 -164960 -241030 180416 166890 253206 64308 -333051 -115425 93665 -53085
12358 2856 -41221 -126510 215618 271247 176827 100966 -114830 100555 -121596 191864 -155419
12346 -165137 164894 -111406 -5492 -68690 250034 -23529 325605 183619 24527 -103748
12335 -136119 214605 -15503 -147020 -101406 -63933 -100448 238788 -148156 -34561 240635
12324 46304 304908 235877 -155661 24771 473733 -280381 257941 139990 73887 -19185
12313 78260 -225682 -26283 191584 -211345 -188445 -122970 224079 43448 -134105 -6322 -208015
12302 -208015 212326 36388 -338752 217542 163975 301523 92747 -128644 -43898 4024 37201
12291 37201 5233 -77820 208634 172471 71862 -96501 259168 462844 -150400 160399 24975
12279 -165786 -170668 -65519 102490 108937 -94871 160165 231297 -63082 -124903 57786 -25727
12267 -79670 -133879 37350 169844 408686 47661 358926 487135 311261 -15718 188276
12256 46856 -17259 88332 -207658 -14793 -26386 144002 174420 260215 144705 -245361 -84462
12244 60464 60579 237078 -33098 -22162 142976 -50542 99821 196800 104881 14438 204436
12233 204436 -277537 -9652 241479 265410 153118 -284385 132047 194125 -33074 -14799 27962
12221 255073 -90472 222285 314369 225520 15763 416711 -175216 269972 237177 99117 88511
12210 88511 230072 349522 -157554 304755 451202 129345 143461 218173 -89656 109915
12199 148510 152369 248620 5730 241310 78871 74709 161370 52956 155215 -48610 309931
12187 27143 -84978 242628 141214 -55180 325505 223675 379937 205994 204236 -54104 188979
12175 70493 41507 277076 -11630 252746 186585 237197 -102681 -91065 -31677 81897 -152748
12163 252762 59243 -428168 187482 68777 445672 -91780 77718 79933 51191 519337 191125
12151 -151163 -335433 -40160 -23247 211791 178322 -68667 -85133 30266 -131405 133281 135031
12140 135031 -73082 -81904 193155 95353 212167 -412641 206993 -154309 -306340 -56149
12129 134906 139147 -243093 113769 -471344 19680 278111 122498 -58223 125533 124087 -219934
12117 -125406 6009 121697 260783 -28383 369640 -186253 -20053 102647 -228282 -259651
12107 -259651 246859 -371257 -98414 -155368 129530 140591 -53703 -35922 -211408 -52676 -142362
12096 -142362 166147 -253479 -79656 -235608 215928 91268 287163 -21992 55711 224602
12086 224602 122539 105396 18591 -105871 -239877 92538 -182523 -75450 26475 -55810 199347
12074 -255070 -88838 -188350 35443 -19029 -108161 104121 110585 194021 -194267 -73976 395633
12062 115688 238090 246392 153180 144910 104581 650445 658019 1009989 643728 484500 359043
12051 359043 -153724 441046 -182935 55630 -134587 144957 222933 -4745 54420 -69408 211658
12039 -41286 -238959 53061 15912 150581 -557423 136773 -357189 -62527 233219 78640
12028 150085 -57311 26414 -106079 -129062 213553 214850 180882 -123941 127427 245363 -165731
12016 -122795 -77915 218506 143031 -233064 -108904 -45955 113914 -134664 -194088 173457
12005 -245995 -134441 21669 -199220 -51863 -96091 249062 55332 -162638 56327 -36844 -204081
11994 -204081 -69879 40706 169019 62065 -163535 96983 29272 161623 -44605 -99076 -127325
11983 -127325 85129 81149 76055 16779 107201 -144868 -12626 142263 195373 -201976 -173164
11972 -173164 235450 -124687 -20524 -6531 -177088 -120643 200582 156726 -161877 260511
11961 75517 -89672 101659 -134356 238302 201642 326538 137934 166528 -243159 337387
11950 214191 150104 -128840 306997 -43626 4120 -200261 35699 15701 126141 -189824 -217464
11939 -217464 -196330 -227247 -166109 -166744 105282 -171298 140073 21335 373493 -146473 -262447
11928 -262447 86430 -30009 -159500 234628 196216 -336763 -276505 90283 -5493 -516342 -12850
11916 70069 -103649 -185245 -29344 -81650 141952 135568 80812 32746 134850 -116074 60628
11904 -68408 68372 251997 -53516 -80743 199672 -355053 53307 -153636 124772 124298 -234966
11892 2644 -96883 113921 230035 210176 -136898 -107957 231890 160933 96758 252028 -199741
11880 42977 -202481 -237028 -53329 -174408 -68558 -56592 96238 -32755 -233016 215283 223294
11869 223294 14355 66549 -25526 -89737 -124048 -69492 155996 188278 -30224 -50257 102481
11857 -91254 -111077 101181 -106318 91887 -199953 173649 -245112 -332983 -164221 -247770
11847 -247770 -123324 80979 -11831 337680 -22827 115662 -2310 148367 188396 -425666 -308959
11836 -308959 -85578 261063 175173 5343 -96767 -83388 24097 -316650 258914 205419 301842
11825 301842 -225194 -26455 -177818 -235241 152600 -76407 -86304 -88827 -128239 364082 -70941
11813 -276365 -176022 -114862 -345969 83687 -245575 -15112 12294 -84619 50866 -106050 161262
11801 -233338 -209110 64328 -249799 -158291 -14929 226080 -267562 -244685 -171301 -140828 15328
11789 -343046 -284737 -183371 -165835 35008 -223093 69555 202286 91719 -34659 -54360 -155510
11778 -155510 68883 172618 -111002 -133838 165606 30984 -276720 20813 -155615 -56849
11767 -237186 253946 337648 -73601 -85994 -158082 -113146 -180794 -215951 -53575 -151820 -23562
11755 -67925 -146100 295345 18662 -324814 -4224 -152690 313269 -125634 -64875 183704 -94469
11743 -155964 -25796 159871 421255 -84467 -266489 -114315 -296510 -104768 266482 -77544
11732 88464 83425 39168 98724 275658 345511 -164978 -257199 -672874 -95181 27008 76455
11721 76455 -104044 46404 46047 40455 133083 283137 -157526 -185391 74412 -38983 -257663
11710 -257663 -113174 -111422 -107531 -295632 202164 151113 82645 -1231 -213274 -69778 -25839
11698 305304 61463 -4783 -3866 246351 -4973 -14440 -10951 -49731 51533 186374 -336864 141878
11685 148591 -101361 271640 -51011 89946 -65979 130181 -15647 -219651 41970 76614 164759
11674 164759 256282 5959 686696 24344 -5698 -232600 -16018 -40436 -236885 222959 -44768
11662 33842 113070 -107270 41719 26000 271255 -297140 -66956 114180 95636 -203801 107184
11650 227394 212996 184423 57475 56036 363750 138591 105106 -59606 -66925 -118781 -159807
11639 -159807 5228 -125380 -166147 -31871 137055 -41094 40174 1066 -125943 292895 1229
11627 253431 -159422 40870 -163759 -67163 -75987 70114 196130 116467 134450 57389 73336
11616 73336 97288 38033 -48278 217097 -264162 -449040 -161076 -123454 256048 184476 -50063
11604 -247762 51861 102946 -42231 -404133 147450 -98467 141381 324637 -108112 193584
11593 23448 99926 -36288 3474 125329 360420 -35865 -25707 -6059 113586 121320 -262604
11581 123259 -23536 53337 -16484 -152978 -143673 282337 -171855 107785 186376 -216029 -171413
11570 -171413 262267 250028 -62356 35324 -15064 162808 -55918 180843 -80079 -158884 -69307
11558 197930 130145 -31621 116774 -352518 34225 -204303 312659 198261 -112501 147857
11547 -56414 -389162 36451 58364 134030 95354 -329324 19794 85492 44745 97701 -19483
11535 241011 -133824 -197092 -867 -110015 138694 2906 -179852 127180 183406 29088 -31565
11523 14472 63084 90032 -4125 -120904 -51174 225756 237587 -170110 -74886 169718 47764
11511 -20151 255439 492066 174002 33871 23749 -10525 -103791 21469 243309 -50054 -14029
11499 277381 -142938 -123530 -116794 -42867 8940 -162901 -17708 282823 261033 343552 -22491
11487 25061 276428 187605 -8005 -14396 531383 39494 85495 205130 145106 166072 -219347
11475 -1547 268172 -207767 237795 83506 329014 233091 359222 4102 -139079 147216 -39667
11463 222046 -20151 -163570 79250 215520 11600 256289 346726 303910 84594 -268927 -138909
11452 -138909 -63721 235073 322216 35065 11086 -81849 160841 330637 432038 267317
11442 267317 42264 5003 183616 113238 88701 181964 -84047 238350 -130899 -141000 147584
11430 158398 14676 -308546 -79021 168447 -197305 255327 -278842 143969 -109849 153538
11419 -135471 200155 129245 -150058 -17523 79847 964 13643 107330 34245 -68447 -88125
11408 -88125 143142 -62760 196904 63880 -182908 184368 -79951 14157 -12544 179934 180405
11397 180405 -91518 -81576 96832 -7139 -55958 228721 -38209 85828 -240198 -1765 -79486 240750
11384 54141 -27679 -47291 -37539 -52393 -237373 135084 148305 65077 -80367 21467 -86362
11372 35858 -2755 53367 31725 19103 -31633 188394 312166 -269909 121194 158339 -56671
11360 119902 27558 25534 -12273 111097 64381 102155 22745 -171414 -324555 -135370 -10852
11348 -143005 -6464 34542 -81891 106739 182293 53141 206276 8143 -351566 43799 206140
11337 206140 140732 78465 -312877 36880 -492432 21838 10285 207595 166951 41273 -481024
11325 1868 89967 16284 -79012 179832 -26572 -10341 228960 382149 -157114 -232577 -37005
11313 473923 -124087 -25280 -260746 -246312 90652 -146682 136319 206352 -68686 -44096 -293743
11302 -293743 12283 -204296 180822 -258118 278642 107358 29341 -91400 109826 197070
11292 197070 -140236 -7219 63232 45490 -131592 212349 265501 159061 193787 -194179 -147807
11281 -147807 -134224 -179423 -323501 -268654 -193549 -377091 139626 233496 38500 -111911 -320328
11270 -320328 216498 -207687 153515 18334 -93789 -113604 -26465 -10123 291764 -288867
11259 -205990 -33720 304296 -126041 240623 -233954 -58505 -194745 -120706 -71163 114445
11248 -161986 -62896 -155614 -420345 -197500 38326 99228 -247427 -203063 242380 -619127
11237 -125045 -148395 138724 -189086 -139867 289155 58490 -74913 184197 -103455 -204895
11227 -204895 -73397 -38298 114473 88846 68610 -28849 10352 124842 234656 -41753 -33838
11216 -33838 -297081 322126 -67805 82676 330660 -267380 -233795 -263675 -33315 132441 98009
11205 98009 -45360 -238299 -21031 -188352 -211478 48802 -136797 -140909 1987 -242528 51144
11193 9185 -21974 -30397 -114625 5687 120760 -227637 -42706 -119054 -119267 -57313 120872 101059
11181 101059 43198 -248409 -236784 -60414 81471 189013 -121817 92958 -176461 -270705 -187701
11170 -187701 -211345 48197 -11681 42932 -97244 -233906 13949 -96220 -407067 -87304 -107400
11159 -107400 139529 303498 279372 94903 158396 104664 -148528 120297 156997 115178 -29069
11147 -182857 -165376 -184273 -96584 52978 255291 -193755 -86080 45959 12771 59046 26237
11135 8308 -146644 -141517 -516782 -475547 330626 254932 -12288 -103707 -51888 88893 155470
11124 155470 9214 412149 -191659 -100601 40224 -36364 185751 266082 -247423 -164064 78452
11112 73685 -2988 31892 244003 274449 233422 -42389 97623 -363660 -34649 46706 53385 24640
11099 19060 92877 141870 -38651 273289 -3070 453467 -199533 403572 95999 89797 -203226
11087 204412 140582 69815 74001 -18297 93645 94992 -110093 -101453 641721 179032 296685
11076 296685 273044 644201 161031 68757 236552 94396 -99884 -60768 188389 136386 245864
11065 245864 257391 332650 379262 267865 59278 169545 50211 55240 298768 351447 156537
11053 206342 275314 342874 388585 275650 323864 452619 516833 476673 601300 239935 745155
11042 745155 457946 400955 594265 493598 711430 669373 686557 835538 538971 845496
11032 845496 610347 747907 663254 599355 732183 446641 1101799 716423 781078 473923
11022 473923 712426 679303 709298 834365 640234 419827 567208 479394 702300 479336
11012 479336 558668 773054 498864 966212 697309 294913 822918 555069 479840 518897
11002 518897 156866 723577 682891 684248 505428 514232 668171 362638 226120 830489
10992 830489 542632 311370 733861 480739 433257 532467 565549 885089 562244 742137
10982 742137 767576 340253 769543 634737 415005 602630 647390 510213 978747 878749
10972 878749 902334 821922 774922 718138 732828 1248144 1291670 1305860 1487310 1577590 1487194
10961 1487194 2023952 2071019 2410081 2378437 2496548 2405074 2539573 2514348 2010540 1961871
10951 1961871 1695529 1790357 1239423 1413228 1666978 1350525 1085122 1228815 845124 1259292
10941 1259292 1096962 1121402 1370449 844280 652804 1058742 637732 541636 480646 395796
10931 395796 242436 313890 185133 191569 268033 317021 144931 161332 41098 230097 -69275
10919 219621 173436 -90051 127256 146111 10685 133098 -22451 79934 54096 258359 -307784
10907 -113592 56583 -61225 -37794 67086 65599 -201840 69153 -300646 -110748 349832 233802
10896 233802 -104292 -73305 -211933 -272866 -154762 -165429 -172093 -110415 42379 239620 157085
10885 157085 359340 -111712 138833 299665 -135000 -55219 301029 237235 33945 -188919
10874 91650 -33192 88350 -360172 128482 -40579 -279414 -233121 148679 -29199 229848 91630
10862 256619 -442982 309538 225256 -59832 -22706 -2937 309223 107601 103046 166266 -99408
10850 151910 -4370 197720 108551 -195816 -242133 -109225 -47864 54300 220946 -349765 -439305
10839 -439305 152531 25929 190522 -197251 205545 -36071 -348550 29936 -146556 156376
10828 338660 -52582 -11641 -180263 -36470 23352 346963 -242949 -91956 -47231 207689 10355
10816 -53163 33858 -32797 66358 -404907 139086 46946 -329443 -180958 -157875 -105991 -32615
10804 -172396 -139957 94659 -77023 37736 -86986 -100270 -32797 110838 196413 275894 -99262
10792 302397 -636 186666 -186010 -59576 207512 174523 -184906 -216015 -307165 202565 127288
10781 127288 267937 -227872 -139759 96552 -97918 -62750 9239 348081 -267769 114566 -173895
10769 -79225 112916 25636 36245 205482 29736 -73952 42147 -237169 -122947 -466430 127760
10757 -12195 36107 48292 -487452 -128861 -307242 -152023 302958 -109126 -99415 -72070 -88224
10746 -88224 -151874 -158831 -82779 -69600 -115346 -101311 352390 210206 -122967 329393 -70352
10734 227498 -92117 -100123 115994 -171049 -135571 203065 61983 41605 -3436 -40562 69574
10722 -327012 -349126 203036 -180304 -129622 28142 -169804 70729 -36838 302 117784 -157910
10710 -123447 -36085 -202558 166764 -128744 243656 -122203 -240605 32517 182989 101057
10700 101057 -161574 -224901 -205192 -42243 -271139 -269185 -183011 -40124 -40352 -317076 -133706
10688 238742 51708 123553 -120925 1678 -26964 -154702 -59269 -248930 -98096 -73462 -425542
10677 -425542 -102955 -265861 -152113 32031 -156249 -13005 -13492 -74271 128133 182689 -195463
10665 -2939 222312 -47743 -99143 -29779 142156 -71983 199706 -40529 -89536 72329 75350
10654 75350 66761 69496 68173 -11090 146018 -171682 -85708 -37398 -27982 -68203 -88461 140145
10641 -157501 45167 -122469 -259563 -284261 -91619 -376978 -40002 -398825 368879 83571
10630 -171972 21109 14355 -146163 98857 50298 -40383 -59678 -165035 52996 -252493 -88314
10618 -49343 -125048 341256 -92257 -246605 -126632 239593 121815 104060 -99175 -228785
10608 -228785 -8213 -237229 -237609 -253914 121838 -206696 33387 -249697 14674 19809 -81381
10596 -130931 415664 -9463 -244656 -85729 -69914 -78703 -216133 135378 -37642 -23989 -228918
10585 -228918 232534 317226 -281423 13894 -104308 -109730 13666 32786 -226076 -200418 168147
10573 84526 2487 94413 -21781 -171439 190773 -83333 152741 -281549 58551 -283526 33543
10561 -17093 -170404 297621 -237852 -178235 5899 -630 -157377 -36849 -7156 -270972 -10072
10549 177263 335257 -363563 58768 -350164 -97354 62717 401343 76767 -225591 24824
10538 -88513 -57417 315905 -45644 12911 -169639 292800 -63178 -132598 136192 182889 -167166
10526 -319702 30471 -193988 107045 -222974 106839 -27128 -70075 119088 -53023 15254
10515 -196278 53574 32990 -50606 131114 97509 102567 -91706 261869 -273941 -456407 130098
10503 -200337 79989 -159295 -189917 68666 96192 -145633 186201 -152633 -115910 -485845
10493 -485845 21830 -13457 -69605 50771 -99238 180803 -112259 -115067 16619 -295128 114394
10481 139562 -237274 -18319 224222 -12147 -37534 147183 -62389 -17142 -31600 304847 -271799
10469 -41967 211988 560877 219752 347922 198070 401877 -35033 226820 -271483 -161404
10459 -161404 68818 102058 -18542 61680 152285 -464807 181459 -109706 -177033 22420 -41354
10447 -69247 452259 91485 -124283 -243766 -53192 -210937 24470 -3593 -230483 55947 -238595
10435 30685 -5921 -182974 -12964 -56419 33207 -198054 88435 -216979 9982 188357 -123602
10423 43878 -126062 -59444 69906 -235022 -88359 -221025 -11731 -156020 -98368 -73423 1837
10411 283918 113186 -61441 -641524 -106398 -102547 51830 167519 -61928 -30084 119311 14769
10399 -249786 -83066 -65446 175208 -80712 -97667 60851 98508 -156911 53761 181083 165453
10388 165453 -116061 -62615 -141935 -17668 351950 214428 -156711 79785 82112 -43825 126203
10376 -143081 75174 135128 67961 430389 -95490 -68177 41260 155426 10062 184425 157512
10365 157512 147972 258706 226867 100419 126317 39288 -123377 156316 401579 148140
10354 187831 157027 444351 231875 437996 144588 130261 403885 331976 361727 46552
10343 338541 116798 143774 290528 319638 25396 437749 242417 285808 154323 412257
10333 412257 148859 320204 -76881 98932 78587 325900 291656 400851 367824 347848 515284
10322 515284 -73233 219017 82223 352540 -151517 301389 156706 118912 67614 228884
10312 228884 311781 -21898 302360 126320 -159578 241208 214570 134863 148573 232428 15666
10300 498337 -29054 -100277 50167 262183 46745 -2316 -296088 -91047 -246267 62350 -287088
10288 131472 -134410 -140360 80912 413034 -209691 -93697 100391 64995 -260666 -29948 76574
10276 -17916 208613 -63528 40194 25173 416759 129859 -149922 -99664 -68497 -217973 -186711
10265 -186711 -360590 74738 111291 -132542 -70145 3074 -206968 -165149 -126208 66398 -15135
10253 186971 89255 -23803 -70589 142745 -15860 439 282715 106120 346448 358010 250994
10242 250994 271856 443883 15896 114482 -93162 60038 257090 -424548 -114387 39076 -368973
10230 113080 -129498 -396437 202340 46773 96382 19405 97925 -23624 -28466 -152565 124608
10218 -22726 -27497 9327 -36006 89264 138770 177656 -216404 -109643 -108676 5041 -55220 -73250
10206 -73250 57461 181793 284583 -69965 -299748 -227611 230953 -304252 -72447 -148362 -559662
10195 -559662 89453 -120188 -96462 111365 32320 236756 51414 115397 -92161 143256 -203658
10183 -136836 -107294 -88696 -120190 -127202 171119 -103815 -203695 -382604 52009 -285597 20168
10171 260727 -224038 -391439 -224117 -225026 311892 80241 -49842 -288782 120034 -47490 49692
10159 -25731 -13036 -45724 219284 -765968 115540 -7346 66826 190733 -100047 33770 -187398
10147 -321539 -344350 -11805 -155123 -239024 111469 -187591 -5816 48557 -175722 -47884 209770
10135 233155 -296253 379639 -241256 -185219 -213520 -30724 5003 -407783 -168573 235063
10124 117257 20140 18707 365113 113755 -115579 -116430 26516 238323 -370407 152718 -207560
10112 1225 38946 -155910 -15038 -208759 -142311 -51667 51644 -121568 -150011 -235270 66038
10100 436000 172231 18508 -8201 -133273 30596 -277689 -132189 -195027 -233045 469751 -89899
10088 20293 1848 -234642 -44006 -84495 -414508 -31058 22486 -116614 -169057 178943 30106
10076 187850 4178 -71414 -143130 -285850 19998 -321896 -458898 -123211 -180369 -316756 -54621
10064 483565 -257906 145285 50890 168788 -167894 168468 -72656 -16833 -226569 -172751
10054 -172751 -279532 -263387 -368556 187351 -170088 296538 312775 143758 -46993 -42930
10044 -42930 83737 -96964 -128704 -176874 52633 -376198 -21613 -181372 -363932 80244 386127
10033 386127 -158009 -165079 -97816 15618 -169653 -149759 54609 -317101 93227 73953 297116
10022 297116 15114 -56605 43782 -231315 -250945 -2289 -142275 -61933 -206627 33508 52506
10011 52506 -48710 -329007 -250417 106724 -273920 -66907 -3831 -158606 -73627 53119 -337424
9999 -200157 -18803 -285761 -122105 -63886 -89430 -70162 -222049 -251474 212267 -22585 54750
9987 -125221 -246871 66861 -7461 -116397 -73084 -104165 133993 -93194 -126775 -26973 -113007
9976 -113007 -204322 -142554 -185322 13202 -309952 -42392 -35829 346268 -49494 -186709 16437
9964 334675 33153 50383 95641 -130795 170617 -104638 124872 -229552 -341719 183689
9953 122820 -141881 101671 175402 33491 -426952 185497 -165532 14948 -72881 -162662 -187758
9942 -187758 -34321 -16795 -323058 50562 -4350 22845 106147 -70528 82758 -15943 -230017
9931 -230017 130848 4413 -283390 -93911 -86485 -326211 -42932 49271 -31451 -31079 -177583 -102957
9919 -102957 -196377 -124478 -215372 366216 111291 79201 -105747 -439958 -187017 -12799 -124959
9908 -124959 155515 18779 -356159 -206272 138883 115022 41653 -213177 46399 314857
9898 314857 -123265 109718 -302199 141743 93141 144047 72912 -177755 39173 -164900
9887 -162410 12467 -396665 80921 -68403 -458456 58444 -133743 -75964 -2166 -120854 -3878
9875 129095 66368 83599 -213995 -294472 86512 219590 42682 35315 19258 109993 9570 -349804
9862 24424 37624 -182692 -272592 -274848 309788 -18629 91297 5050 -17297 -68167 191988 -427622
9849 167745 -358932 32184 -280534 -263873 -137472 -254304 123804 14539 191824 125059
9839 125059 -81924 -199964 -241118 -71397 -59127 -328507 1763 40579 70778 -91641 -124060
9828 -124060 -155377 -332225 -520112 -77493 188313 -232505 -105937 -116306 280258 40457
9817 -124414 49646 -278621 9502 -283136 -151052 -205700 -14465 -108956 78234 73419 167944
9806 167944 -104193 1756 -163230 40350 228616 -85428 -155200 -257934 -101130 44480 -534248
9794 285729 180806 -273404 227220 290531 1387 -198179 129089 290762 -158999 -141347
9784 -141347 -59729 -66107 -167101 -178969 -98335 -91959 -141984 -174750 -14790 -195618 -304636
9773 -304636 106314 98136 183247 -106997 -176188 245159 -77478 -131802 -333351 -221702 -74383
9761 -2923 -67644 31867 126592 -159698 -372087 -65800 -105597 129892 49123 243361 -43837
9749 -354066 169148 -36454 -166669 -70969 -226228 -44141 -108677 -25662 293491 -296468 23987
9737 -54921 157943 222709 -130584 -345523 -179065 -3696 -74928 -39507 -32130 -162458 -110027
9726 -110027 -150676 -321963 -278906 184522 -45718 -95745 20250 -47406 -210756 -15959 -77166
9715 -77166 103243 113236 -198855 -55922 234407 244360 102461 -113598 -156598 37625 -191074
9703 -106594 -154468 -287724 -312574 20233 -221904 -2728 -295996 -48829 -2835 -290842 -142362
9691 -35297 -44446 -58088 -194413 -60621 -140831 67468 -50543 -234351 204884 13739 -161428
9679 -168820 65315 -230589 -241638 -28874 -151585 -339672 -2002 57955 -177027 -88897 227272
9667 -90774 210943 90727 -18037 10432 45775 145780 66883 179587 435851 -287654 62173
9655 142587 5635 126148 133576 -55984 -67779 151483 -53409 -24642 -75266 358431 231318
9644 231318 -228670 460482 -158531 -345813 -29357 -287080 -46326 58068 33153 -254975
9633 -59921 27160 -78957 -76452 119741 -88896 -73269 105223 -177136 233142 -121869 -157961
9622 -157961 -46803 206871 -200338 -55044 168186 -75592 -359253 -364388 -197842 -34590 -41089
9611 -41089 -33448 45736 -100453 121667 16754 -146315 -288750 -340186 -106945 67315 -97975
9599 -8296 -106263 -231425 -114017 37459 -163546 -121840 -505643 -189327 159181 -311923 -81823
9587 -59818 -411017 -13224 11748 69009 -135050 201790 254413 -178493 -43987 -27070 -200921
9576 -200921 268244 -34272 -83333 -259657 -130669 -174257 -99761 223969 -278390 -121895
9565 -124011 198747 28464 133065 227151 43067 -117942 -9880 -48264 -185433 100543 34900
9553 -166548 -97504 -94878 -82516 -137615 10587 -148045 216717 16076 192317 27807 -394885
9541 -75385 -260941 -116391 68404 -91757 -222522 -215093 64670 129614 42484 -40812 18750
9529 242116 -236461 -518473 55478 57306 -96381 -202509 -136222 -145057 -38617 -161735 -252135
9518 -252135 103283 -129684 -117605 -38240 182335 -157010 -14119 25046 -31270 -290995 -178681
9507 -178681 -217023 -228511 -78973 112209 153426 -83186 -148938 -4396 -59484 80326 -143913
9495 -20724 -360977 -190626 131427 -182689 -47582 7683 -20403 -7582 13834 -139775 -119370
9484 -119370 -30572 185128 98205 81547 -298116 -425361 -23739 4462 -84030 -8173 -16752 -86669
9472 -86669 -111671 -210264 -84525 -262789 -280119 -267636 193060 116664 -120970 46363 -3633
9460 125531 -82763 -401216 -54962 -23073 -146962 206087 -230147 230 13605 -231921 129962
9448 -2857 -61757 -139507 31534 31449 -226328 17369 100721 -164647 -275569 7802 -173131 66943
9435 -74869 -141641 -65103 -61073 -12177 -122540 85879 6148 128771 36570 12271 95343 -299917
9422 -291394 -195950 121067 -225866 238262 -252928 -200196 -144803 -50825 -78262 107769 -80014
9410 -283090 261291 -85580 7640 64589 -222824 -161377 -102059 82508 158839 209559 329479
9399 329479 44610 -347805 11132 289751 -108114 -310958 9618 -261179 -260047 -328263 -419568
9388 -419568 -109773 86890 -63590 -84709 16139 -236008 58975 -109697 17619 -33093 108236
9376 -148981 8697 -120500 155949 -456283 101273 85564 425244 22638 -299234 282204
9365 -91842 -173518 -287404 -110786 -324216 -383070 -170356 201186 -116648 -177928 35627 -172786
9353 -33719 150697 -41064 69315 -2198 -137193 -113972 35756 -151077 -283887 -168372 -78394
9341 -182259 -182681 68276 -127556 143462 -4135 -189151 -145720 181890 -109474 78021 -20009
9329 -449538 -340935 -121161 -477146 -62588 -124660 -81573 -63443 -28545 -190037 108306 -45911
9317 197570 -149272 31782 -67419 -306016 86823 75634 -182708 336601 -189157 -89604 -111795
9306 -111795 -233300 337624 157995 -191299 -20934 -179881 -88757 90797 -6 -283617 -193788
9295 -193788 -436605 87945 25248 -182223 -316472 -191328 -79329 -12147 -30132 -26329 -257015
9284 -257015 110816 -3429 28784 -132228 278331 219004 -267261 325092 152284 154642 -338625
9272 96155 77535 -21219 -70316 -225826 287421 42289 -98334 -309673 -222616 191888 -153364
9260 90020 51026 193182 -279449 -279404 -280449 -164709 42283 -120283 119264 -44692 -19360 -71547
9248 -71547 -60022 -162712 -307454 -223654 177945 -128779 -126737 -193381 122105 50986 93465
9237 93465 145568 -96862 171110 -204458 54065 -52501 -319525 -242331 133877 50175 -27218
9225 -328599 -248992 63950 -73459 -114344 -58075 -318978 -92202 103683 -57871 -240480 -142708
9214 -142708 -328988 -54895 207741 -127504 47107 -64960 41166 -46748 -65824 225153 199582
9203 199582 -2288 -163986 -120521 -333002 119091 103881 35188 -82062 -237271 90814 -232256
9191 44142 115293 -60138 -172820 -107313 103013 -152444 142986 28605 -327631 -161197 109779
9179 -60588 -195919 25480 -204035 -10915 -24002 -66770 61370 -40205 -294830 47706 -201583
9167 199238 65582 52868 160612 -193590 -179948 -136127 -443694 -266389 -132213 123973
9156 -215282 -140588 134703 -17770 29410 -91780 -315638 -164994 25459 -311353 46091 -221121
9144 95382 -144459 29541 210569 156097 103721 241700 139546 182914 -2057 69820 -28964
9132 -153639 -302559 -303214 -79413 66333 81363 -81697 -149406 202529 -123263 -219353 -123345
9121 -123345 191308 -198318 -175839 -224310 -114382 100192 67005 170863 -67645 371611
9110 -371554 -313221 -267329 275672 108371 -47144 109248 -169211 52203 51222 68125 -71095
9098 26186 -94290 -68701 -125112 -16156 -4179 -162775 -125753 131698 -329525 -76321 -86187 -140510
9086 -140510 -82384 24710 110322 -85362 -528225 -63427 -176025 -244499 193032 -156237 139143
9074 72872 30277 20232 -240957 -61244 -503317 -196417 -337044 -125340 -206841 -78961 -292901
9063 -292901 -200760 144455 164707 -158714 -258043 -61376 62079 86964 -71677 -408056 125491
9051 -18092 -113944 -26292 54903 -315771 -210931 9846 -585 425901 -91201 63588 -198388 91897
9038 19571 -140212 244382 -239612 -129683 -365959 62268 -378303 58615 -10293 -149530
9028 -149530 -157451 -344711 92458 75302 196059 -164502 -10524 -122087 -9389 1880 268872
9017 268872 100761 -103827 53362 -115969 46606 -78592 -168093 -231476 -288307 -129103 270837
9005 -235406 86842 -1617 172529 -409056 93390 -123623 20520 -147119 -105501 -48315 -175310
8994 -175310 -129300 170076 -167356 -102947 269248 -298079 100734 21982 -327609 -25150
8983 -141339 261661 -230292 51163 -98085 -149288 -88805 121299 -161947 -49789 143137 -79551
8971 73328 150570 -89517 -270097 60210 -194161 -48190 -82575 -325409 25245 -66630 -196605
8960 -196605 305982 156420 79797 -185888 -309689 52599 -187041 -143218 1100 -52881 17196
8948 173565 137433 -145040 -90281 -89874 40257 -224261 -159758 81797 -283078 -193870 167059
8936 -1022 648690 -38498 193430 187184 99176 -433626 72195 117886 100973 -73321 366956
8924 -5395 60668 116835 -83411 -82092 193168 437069 -127203 -115984 496938 112049 66006
8913 66006 305938 342499 524776 712478 1480708 2560701 4899228 10249269 7033271
8904 7033271 4053967 1765935 1265283 862684 315438 426508 564518 253892 269809
8895 269809 152308 482294 211368 316711 175891 165303 161055 61400 -61400 -31720 -209104
8884 -209104 101830 -187690 -30211 -161869 -34832 145646 26299 69610 53487 30423 36030
8873 36030 282477 -143028 -345251 -54827 -245117 -52501 -177701 98292 -145264 232249
8862 174411 -15916 -206581 26380 -121106 67007 3074 95910 -47185 -91081 -74769 -26385
8850 2778 83979 62815 122525 19477 -134818 -87598 219370 28178 -142302 -85170 -168153
8839 -168153 -99580 79466 -58401 43398 -98042 -101154 -208980 -185903 132895 -5193 -112279
8828 -112279 -269925 -141216 -25124 8899 26494 -248214 -75607 179906 -214113 -40268 -148708
8817 -148708 -120671 -101040 -48624 -90503 -204365 -211936 -279733 -82392 -33344 -129959 32307 -40500
8804 -64072 -140310 126467 -140391 -208067 102474 -33540 -133315 97490 -267354 -70287 -17736
8792 -383079 -13533 -178098 -273420 -140468 24810 60751 -452677 -173192 45324 -4424 -161877
8781 -161877 26409 -114937 81818 -61040 229775 -82199 -105947 30116 74562 -7994 -38297
8770 -38297 284679 -52706 -150720 -64741 -348695 -228536 -92960 -66911 -68281 -64666 32028 -43670
8757 103719 -65077 -209744 73452 23221 73665 -141602 -101002 -14077 -50173 -138410 -191303
8746 -191303 -258676 56059 -107065 383301 288511 -302735 158791 -53865 -118575 -9113 -354607
8735 -354607 -81333 -184675 -89794 23443 -13093 186756 -54742 -26341 -164277 -357173 -122640
8723 -306904 198403 -79310 -234134 -7526 60869 -206372 -31202 131448 -323998 -2706 -148390
8712 -148390 -76965 -162317 -3050 4523 104927 4921 -87143 228525 -47010 -199437 -330525
8701 -330525 357572 41128 -222915 -378813 -137338 -95364 -36127 155989 79072 -49822 -60620
8690 -60620 -426631 -121714 -288179 197752 -72385 -148285 -57501 221143 170659 65654 -246497
8678 259136 40258 -165906 30707 -256917 95540 36044 -175292 -1479 99028 -306468 205361
8666 122553 289785 210405 -179767 -95925 -52751 123959 147016 4178 -8374 -338124 4390
8654 225922 -10990 64283 -281165 -38162 231666 -2433 78772 104776 138332 -62468 158097
8642 -269804 -29735 300940 -183033 159802 -47418 27507 -244181 62877 -113422 -154751 -237511
8631 -237511 167120 -109273 72274 -93820 13310 -326904 -337667 118343 319 -67735 -7164
8619 -198979 272813 -58911 -88262 -91547 -95934 -95077 -290952 -112992 -90188 12327 47649 86671
8607 86671 162142 -86955 -320478 -124184 -31071 -59739 -356093 201302 302716 -13245 85340
8595 123742 -34985 -113153 113777 -175502 70703 -81830 -216801 -132848 31044 8880 -103524
8583 -400404 68368 89030 -124543 -98978 62244 -46123 166341 -194243 22357 -45529 -388024
8572 -388024 -69001 -130646 -249111 -332929 -273114 19152 227840 44778 -127511 -135813 -597160
8561 -597160 -72948 5293 -60451 -73025 -131051 9181 -206923 -28795 -201366 -199892 11628 -61541
8548 163877 -105089 -26383 137913 12109 -91962 255784 -279752 114582 -182446 -228999
8538 -228999 -66260 88693 -67311 -404911 28030 -10567 -42168 -100875 -336296 -179814 -107769
8527 -107769 58616 -130273 -157517 -27723 -141997 87799 -184369 -154366 99918 133807 66725
8515 1677 -177120 1662 -49660 -110602 -5020 -36179 -5841 128671 166502 -116117 -112314 -27617
8502 -307087 -4744 83588 -25000 19240 -160863 -117657 182602 -86439 -285343 -54942 -117357
8491 -117357 -64588 44410 54624 -413672 -11512 53066 38030 33644 -126704 -259861 164232
8479 -323843 -69484 210183 -4621 41498 215138 -43011 -199661 -146908 -91321 -3219 13221
8467 139284 218995 -4245 -29120 -52085 165969 197836 76644 -62540 -273147 -31086 -207079
8456 -207079 -14262 154472 -182947 422813 212104 36089 -125127 -324013 -132329 33630
8445 134384 -48686 119958 -113255 -162874 -24035 150157 -81830 -45154 23559 -79244 6685
8433 -399983 -1417 14795 117913 -80017 88104 73675 -364855 -99341 100946 -264232 -130472
8421 -423527 28503 -192340 -127420 139845 -252975 -110362 634 -208387 -149210 -63048 26341
8409 -27720 82354 74556 -240370 82605 -44417 -192715 29084 -153463 3243 -130827 14967
8397 -63832 -51978 155011 -100961 -53514 127636 -138726 7382 206506 -286761 258306 -89421
8385 -352791 -313553 -183222 -66474 -126320 138125 -213625 245492 178369 79241 62977 -84078
8373 33174 -141504 -376289 -43425 -98680 6066 149517 -26665 324467 18787 65930 -157111
8361 77980 -276617 -137027 -361189 -57068 -147177 -146102 83787 193064 149819 113165 -170323
8349 -21346 345633 -101715 -170892 -284200 -296359 48912 -120386 -57897 -115426 -348382 26084
8337 240601 187163 34807 -191116 36171 88295 -45053 -259047 -306578 -258087 -63034 -71695
8326 -71695 -117053 285153 -127484 -79405 -194768 -228537 52470 -251406 68129 -38376 -22918
8315 -22918 32206 -86587 227073 -246685 -91767 126679 -57713 -208841 240018 -40019 82661
8303 -97802 87967 -4935 40572 153085 308561 61232 -81596 121500 399183 85758 -25740
8291 -60139 43796 -432223 17628 91801 -222789 133489 -99027 -16137 88905 86585 -103413
8279 48231 187556 -291458 -132120 135862 72 -140759 -54893 -99804 166859 -535220 -80789
8267 -89515 -93154 -331998 104338 -104843 87475 -262597 -458551 46903 -112606 235109 11776
8255 -15046 -143205 -185734 -40903 -85755 -82176 216730 66901 -114720 375018 162038 73017
8243 3374 -48153 269232 -102095 -20460 -174449 -128812 -297526 -9956 -49560 -38930 -94284
8232 -94284 -68644 -5270 -33175 -137953 -168871 100814 -29507 -69250 -44746 -287178 -43753
8220 -246984 -17335 205142 -373367 -214004 -113721 -259171 98920 -178387 136037 37199
8209 72719 74697 143823 -144353 -123925 145807 158709 -345788 272750 -176553 -345712 90793
8197 -59659 -103052 56043 39351 -98646 55273 305344 -260985 -66205 27348 -34139 -175325
8186 -175325 -94725 -211106 -110883 -157375 248786 85921 -203711 -324804 -229094 -15950 -213394
8175 -213394 274931 91548 8536 12172 -79995 -157027 182316 -45150 116449 -233756 51085
8163 62675 89612 111679 48508 -35539 -78274 75448 8097 134598 142329 75466 58405 -125076
8150 -152369 -6145 231064 31408 -52824 59276 -127454 184958 -88586 -368221 -102521 14960
8138 112432 24614 -200885 -40672 -303039 -129152 241 -5345 -238128 147696 -69147 -125532
8127 -125532 321805 127436 150005 47140 -387126 138344 107549 43903 152098 28767 -202691
8115 120417 -155835 -405705 32640 57468 -76944 87603 -27525 -67180 -183616 -304498 -112839
8103 -174794 273912 166403 -140815 3606 -283516 -136205 10627 134310 -10997 -142155
8093 -142155 160791 -323161 118525 65691 79015 -326221 -447055 -205187 -176873 29227
8082 101111 102169 -288161 183797 -68367 24302 -336526 -44003 -59001 -231983 -187799 290236
8070 -190962 143865 118131 -269424 -111493 61130 -64565 -13192 40940 -400576 -221505 112141
8058 -59938 -171652 74998 -94387 60460 -337366 -296077 -325145 -470526 41315 74094 -17212
8046 67623 104395 158441 200292 -232805 -56899 -52834 -51703 96540 -8876 77352 -373367 73159
8033 -208473 -401134 -219838 -349544 -71502 43347 -74098 70898 -232430 -302238 238057 -112400
8021 -68470 -68271 36403 -138625 -218 -84076 -13653 203712 -20655 87346 -64341 -162985 -153369
8009 -153369 -106088 -202235 -358668 -50291 68905 12898 -658 829 -124428 288150 244631 93629
7996 -356452 -60593 -70033 -183450 72671 509987 -149514 -60120 115705 -281529 125303 48995
7984 43973 -321326 232227 -171885 269343 -126047 187151 -97829 17984 150537 20625
7973 19507 -128431 62741 273447 -92760 -6553 -134545 -18079 33618 -275247 258141 -199691
7961 -46451 -67877 257694 -13808 45700 -2906 -71265 -65156 -152753 31632 -99640 246536 -395366
7948 95202 -51266 -117323 -85969 26510 -116772 -116252 -105111 -378702 -106200 158120 -270647
7936 -262771 -131247 -278982 -29819 94950 -94872 78017 -404876 -96690 -346829 -180520 -118302
7925 -118302 -72855 -32351 -202775 -31460 -60240 -292881 -58095 -146511 79543 -147360 -150100
7914 -150100 -128246 53978 -12536 -13128 -154990 -87884 -516157 48147 184070 9370 -286298
7902 57415 228400 -166086 387523 115548 -254747 -185657 108771 -179093 -132473 -12045
7891 -67315 -97210 105082 46928 -90493 5273 -90009 -5356 -35732 -104594 -19571 13581 139045
7879 139045 113341 94971 100055 60290 -133201 147067 -25934 103472 -33775 156377 100701
7868 100701 152000 209129 206638 -75149 -161629 104187 -108772 -28702 203567 -127604 149174
7856 289130 78006 -257226 -313695 145863 -27001 -245955 -297934 -177784 -139913 -58874 -207488
7845 -207488 -5193 219545 29113 -15846 -36865 -259897 22052 -298199 -69572 -133372 167052
7833 -37 -42631 -249466 -201709 -164710 -173033 -179629 110564 -151788 172899 106629 3737 -60423
7820 -247003 -165162 -43701 -176162 -274669 -83275 -316408 228424 282585 167446 -167340 -245476
7809 -245476 160582 -72731 -175701 -413008 -22383 25169 -131144 -53867 -95412 269995 -359619
7797 -64772 -59362 -13308 -151569 -360547 192655 194065 -23359 65959 -109366 129768 -1749
7785 -268760 -313090 -61616 -368471 -28455 -239413 -48043 137125 -145027 -165235 -61583 -27022
7773 -48466 -338197 162319 -10920 31700 281578 -90734 92422 -68832 -200477 -61481 -48505
7762 -48505 83595 355702 4546 47372 295788 368667 -320118 -11227 -54169 -154909 -213370
7751 -213370 78369 -11065 -332981 -2042 -43072 51163 11759 -38457 -137425 42264 106005 -158460
7738 -19211 -67460 -43957 -134115 43219 45969 7202 -86367 181102 -156988 13167 -187033 106892
7725 92116 -204586 -143045 50620 -29497 136382 -40978 10166 -1111 73595 -187085 284192
7713 302998 172704 -173296 124309 -191211 24616 -20726 -241165 -467908 368582 231906
7703 231906 18526 81257 -229422 -226854 -132156 276918 263502 -133891 52390 176560 -19817
7691 116366 126601 -54036 -211306 -353430 214551 -136708 -231252 31598 126237 22012 -115664
7679 381642 -163365 -208671 91698 -15160 252667 -268401 130362 -34934 181070 45857 184773
7668 184773 -86305 -1901 135484 -26827 288042 -42364 84436 -26762 -58322 -312473 19575
7656 -136377 175807 150801 -60623 286395 163068 -180209 -280244 -43995 -213216 158655
7645 134123 -219151 -28730 201619 85423 97327 -103795 122647 119494 8247 3353 81128
7634 81128 72504 -58077 -348544 8569 -171669 58796 -73043 83466 -316527 -91980 10205 100455
7622 100455 162974 152281 -33941 -29488 45 138712 106951 -422049 -77050 53859 -40959 -165268
7610 -165268 48250 -2961 -132249 -197319 204361 -5515 69377 -246721 -187883 202383 367615
7599 367615 -22205 -120454 -122878 -189228 -32423 121915 -254355 -66084 125999 -13288 96537
7587 125292 -495525 36121 218504 -172453 -133167 171307 105286 -224681 -160914 -40630 107470
7575 -42239 -119092 134146 281775 -58573 -190817 -46170 -318806 -186657 -8035 -94305 -90084
7564 -90084 172220 -170653 -87159 204460 -115049 -70549 -238979 -176983 -115794 -267541 -7189
7552 176687 54696 -6027 -34340 -66037 -180726 -499742 -191903 158554 -11347 56470 24524
7540 66624 104487 -182456 60462 -173829 -57914 104158 116433 -215004 11072 396294 77990
7528 -534718 284809 -70975 -112759 -62370 21619 -91070 -169433 168492 -37097 -180357 -69178
7516 32508 -147588 -124209 199175 238448 68510 260405 -69810 -94296 176912 -12059 425373
7504 -153748 -83826 92847 -356555 -212893 -199536 -25264 -128897 -56153 -332036 217613 -126706
7492 -41779 172218 -125325 -7920 -87592 87617 -338526 -202722 293768 209125 141194 -29319
7480 -203270 -27773 -299575 -251927 6359 52710 -128170 296311 32250 -183426 167700 -395295
7468 -145670 -48252 -171213 -110131 -5468 -74700 82276 89041 -211845 25878 15741 -152142
7456 -70868 -12025 189220 -199604 -94558 189066 61442 -137994 283165 394330 36624 171727
7445 171727 54085 -63046 233421 174005 68207 18198 -145414 40645 100934 -77257 -51089
7434 -51089 9929 -67201 -282671 -74508 199598 -42138 -105977 -474191 -129852 -303038 66332
7422 -174601 315317 26724 -155252 264857 -171180 -209419 -19046 -235639 -355321 214799
7411 147125 -9769 -275098 41712 -198061 1672 73417 113545 -15243 -101949 -192059 -119087 20026
7398 -195155 269388 -72605 -92142 -65699 -98244 -19141 -135254 -25488 -11627 -163752 -80181
7386 -156351 31280 28674 -221698 -154873 110702 -178723 -337467 -547026 92521 64177 -218481
7374 116434 -4890 106555 260811 -10130 4167 82930 -174801 -146747 -15073 99893 -17734
7362 -189039 205860 118771 17944 -100013 132261 63929 -283805 18069 -46119 179165 7788
7350 62593 -82776 -255896 -202217 -126474 -232892 -285262 -30260 372687 -227348 -91554 -54597
7339 -54597 130346 115724 -174268 122955 278249 -268584 -18556 -51959 -116051 -13246 -95522
7328 -95522 -6820 -91612 -169068 -176021 204973 -4659 -70266 85030 279113 -73830 -51685 114761
7315 43051 -184463 101558 -1807 184650 -292847 -147920 -78436 -257000 -65130 -9141 209075
7303 -211678 -18154 87111 -282101 23784 -65981 -193318 -17537 182491 -186866 3799 22005
7292 22005 -141396 -48639 132047 -266411 -47584 -56796 -365086 -3682 -132006 -19010 169163
7280 -75043 -57495 -11030 -406557 -188888 -56753 546645 -121736 -43234 -334580 33111 331581
7269 331581 -148008 52246 -217998 -341889 -405407 90772 156155 26836 -377543 -82366 -218350
7258 -218350 174394 348341 290028 2131 43279 92532 -205769 -72870 44576 113234 -137645
7246 -201274 -114924 198532 -282693 55719 -327557 47160 11849 -36053 -17814 -305104 -112061
7234 -85426 -102677 64378 -64746 -370936 232421 60914 -34675 -132526 -90513 332914 -213216
7222 147189 7893 67343 44987 179649 -210096 141432 -93841 252577 58370 -178934 133971
7210 -313634 178872 2440 14106 25848 -249309 -9765 -173451 141531 -64820 270903 45438
7198 -90739 339534 -187147 17170 -76576 126058 79059 -64204 -19756 -179884 -75679 -14897
7186 77083 -168107 -47103 226148 247904 -261810 -64490 -115049 65813 77272 185226 50822
7174 -75279 -98181 -28403 -61695 234358 -89720 327976 138607 -260634 -180381 304956 214382
7163 214382 -39610 38131 -83821 -262950 143765 107903 -80457 34706 34900 -38857 11749 -78310
7150 144506 -189959 -136479 1192 26107 119541 44284 302900 -8603 306188 97785 112912
7139 112912 79027 -6820 30301 -268683 -172253 -141733 -101646 14277 -40262 -241580 -296 292395
7126 -194194 -73341 74290 -169908 -182963 240708 -65688 242085 -122312 -100396 31055 -95034
7114 170652 -104638 7489 180353 -102694 -86848 -287840 113383 319711 154363 -230276
7103 -216332 -72982 -345532 -416315 36311 -44040 256658 -99523 -14991 -116702 -16858 -231970
7092 -231970 -241471 100146 69100 -240992 -87747 -197456 -91460 128912 -61765 -2023 -320145
7081 -320145 62409 16969 13633 140120 -838 21199 -11662 62175 -155041 109825 133410 -170107
7068 291286 202812 57308 66426 -597 -270274 41308 167526 221553 -4545 67153 -67204 -70830
7056 -70830 -74182 17833 -21712 339276 167747 -261399 -40361 -311339 -145969 -154083 48810
7044 21647 -22343 -99150 -157366 -120795 -168050 8841 -306556 25395 99379 -155400 19948 117922
7032 117922 -230675 79329 -33299 271783 412253 -16742 282003 -271968 -209401 -66005 -344094
7021 -344094 -94300 -129406 216688 88620 68745 111910 150465 211080 102045 13840 -42817
7009 173159 -122294 -35191 -139383 -58657 128997 143496 161066 -133862 -58185 46630 -244011
6997 49579 -161743 69622 -370462 260007 -201696 -335783 190602 -179385 129741 89928
6987 89928 -315701 -234532 -73310 133761 -70079 -108732 -518444 116384 49799 -151905 108488
6975 -193417 -284943 -458583 -367421 -9135 -180651 9305 -6969 94481 -76018 231896 41128 163838
6963 163838 260023 62332 -51713 -270639 -20342 73618 123367 -89314 142464 -407098 49531
6951 125887 32525 62056 139077 -1847 -52806 45635 155662 147797 -43563 14642 -40850 -54712
6939 -54712 -143146 -307009 42434 172658 36265 108659 -69218 121880 54457 147720 -293017
6927 -64878 65034 9883 25876 171454 12255 39195 -89904 101480 -75644 -42984 45964 -180049
6914 -22185 48766 383907 3183 235882 -474104 -205375 22233 49040 155653 121715 -170492
6902 1049 290076 -112376 11381 -159026 -153100 -5709 201027 -312671 105771 -259536 28501
6890 -346245 -215673 -143911 -226276 68511 -232305 101848 218209 5790 -4177 232675 138896
6879 138896 -80542 -136485 -190463 18847 60778 -185982 210060 -79719 83102 63777 -101955
6867 -38436 -414448 15316 119011 375744 -91380 215907 -89701 204551 102743 390000
6857 390000 -55033 -145838 -442225 330762 -26061 -253740 24954 69968 135077 19058 278943
6846 278943 -171443 -86000 -23765 -88012 -225813 38383 -381601 -92336 71765 -123573 -128638
6835 -128638 189315 -74787 -112499 3230 -355587 14264 -96463 -119475 -79669 -93618 -63628
6824 -63628 151012 -77699 188455 127835 -24272 -161050 -165230 -134781 259203 179675 17369
6812 -145336 149132 -179553 274407 152568 -126976 -140134 260039 -112390 72631 -109734
6801 -46977 -6605 48421 -140805 -185731 -164718 109892 -74627 -215263 33182 -54977 353057
6789 -17925 -7598 -203473 -219743 -50868 -198128 -60972 190621 271005 -236417 -399874 -108626
6777 -45500 62469 -278180 -3992 430284 -23842 36228 -220985 -6486 -235292 -10549 -89587
6766 -89587 181170 193597 -44071 -60396 132584 -309935 75777 -58815 261829 94210 110506
6755 110506 -43990 8342 -262627 1815 -180364 49020 -229078 -113035 223436 326182 93312
6743 367444 -172016 -87645 -116125 70042 224371 349847 248750 -253972 254864 -191194
6732 261708 -24415 142047 -165921 -259277 97930 17514 119439 15850 -122652 -95283 76558
6720 150459 132221 118900 70178 37109 -32474 144996 101957 214874 95533 -189705 -80346
6708 -101216 128541 7843 8309 -39208 -23675 104877 -40442 34784 -117836 85910 -218764
6696 1957 -86608 5214 257012 -225042 -403585 -263195 -36619 88944 25785 -75617 -66676 36373
6683 -155890 67097 -25943 -63612 81411 17893 99372 -10199 -51136 170989 -187795 187549
6671 278725 -276081 -25661 -63901 -300574 61379 173350 -140657 -60115 -189622 -449928
6661 -449928 -183665 -217941 77228 165580 -12081 -120980 -189376 13803 -327658 -76550 -56546
6650 -56546 -44200 -79197 119887 254869 -92657 -171423 -150453 -172612 64330 196939 112726
6639 112726 93687 -72940 203931 -164594 60883 65062 178116 -92944 -27180 -23613 -334300
6628 -334300 -86767 139497 11451 -80868 -98131 -161154 296531 29304 72993 180488 201131
6617 201131 -83926 -77648 -70637 -2262 -253121 -245596 50125 -74695 -203651 -235417 -182971 -112514
6605 -112514 233524 -98709 -214553 -5720 141556 75695 30637 132447 -144651 -179712 14615
6593 1710 166490 221757 167094 21125 -11783 251233 -149269 -22702 -91148 141172 198306
6582 198306 391583 -290931 -103147 -172585 123472 146310 317229 -165057 80638 -81019
6571 61588 -115249 -332718 -41236 -163719 328439 -38222 -153817 108398 17759 -63211 162433
6559 -107030 -72673 385965 -270395 1828 40799 157360 82914 28905 -55621 164201 -331797
6547 -70400 -100933 -336298 -131238 -232920 124133 224530 62624 -54950 -296726 -76190 -303235
6536 -303235 -127180 -21057 327529 -18746 -90357 -6606 -210995 3122 21619 -127467 202690
6524 225310 -81988 273296 -365665 -7810 474900 -68629 20205 191404 4400 -106714 80621
6512 148323 -234739 217657 127568 137558 112637 36076 -22375 -244122 225647 -105174 -72204
6501 -72204 322763 -158269 -86541 -174577 203163 106884 70974 45833 -140211 -192048 109443
6489 -64735 364755 -95515 233821 -321882 -52636 -166039 -168126 -38754 -321745 -42951 91441
6477 -325600 181887 361912 -141651 69367 10449 -220682 -63692 75379 -5006 242174 -53169
6465 281662 -103147 -138298 -130248 -69508 23336 -134260 -122216 -73873 -77522 -230184 47476
6453 -209403 -83078 278642 116176 -44693 262445 -27727 212002 48908 46416 120867 -222361
6441 -241613 -231775 -73603 24047 61857 -181878 -67753 -37756 -40898 68906 -17285 -228415 -77479
6428 -225854 -319454 -230576 -2725 -148548 71731 -316702 39467 -235935 -30433 186658 -52638
6416 -2255 179006 -319894 81986 105169 41261 93921 76106 -113805 61918 -5172 -155966
6405 -155966 183451 337097 123862 -119040 -109091 -85312 -140475 -74343 -120026 -1485 -175945
6394 -175945 41347 -210503 -252395 229150 14933 22006 -224540 30508 -174809 15828 -4331
6382 -26602 -209295 -174660 -120648 -71760 46757 -90025 -342984 44622 19167 -34214 -35923 -93637
6370 -93637 25252 192435 -87790 -164370 -297782 -38552 104099 -215520 -122892 4828 -162963
6358 -44643 217283 264853 253542 65858 -55521 -296091 31405 201734 159113 288671 9995
6346 20423 33112 139062 50723 -79621 117932 279252 -183550 153292 -141838 187059
6335 81283 23015 -172073 -134636 -130118 -39566 215013 -189618 230616 107223 83120 78009
6324 78009 -115786 53407 170128 177262 -410457 -22883 -199835 -4042 68146 -141097 -143612
6313 -143612 27890 22735 329540 -129774 -119203 -1575 82153 -117902 -182959 236274 113940
6301 65101 355138 -196364 -221241 -204810 -38948 -46018 69932 -17401 144838 97076 139958
6290 139958 13468 -121820 56082 10125 148909 -233080 309586 26797 261906 -97953 -171127
6279 -171127 8097 -94788 -181021 4628 -93051 242993 98041 123655 71738 -115570 2926 -179482
6266 -332037 -109155 -160575 -30681 136396 337715 56362 329682 -229439 -400232 206144
6255 4429 220765 -203003 236657 23649 -31406 -223124 103305 90676 316096 -235779 -207532
6244 -207532 280325 8419 -53646 -186598 92834 75811 -111219 18468 270553 97719 6121
6232 -4410 -458595 -76901 185554 37793 -99469 -242212 143115 -59507 -214074 -294164 -114831
6220 129330 -169696 140951 -112725 363834 102426 191829 340654 60675 -43014 341239
6209 -41991 -334467 125815 -117296 -26536 -112988 -138366 271525 -263886 -135931 -211862 -193163
6198 -193163 -144807 -149605 -139973 42142 124607 -22612 55605 201494 -60473 276356 64704 -209029
6185 -11201 -81517 -139554 -28541 -51109 -40285 -283652 -344534 -30831 -121629 -120010 -22820 34986
6172 211128 -138127 -5377 134444 12092 -55831 187873 197878 -56120 34673 245968 -107616
6160 94434 -34244 6098 -123869 352347 21916 -48708 330030 66420 -8382 259857 -169208
6148 -175417 248244 -44094 -97233 -245018 -38168 70668 -86425 -141665 87594 212652 102168
6136 24663 99405 -66763 -92495 96187 167266 110783 -57229 -123515 -208546 -21643 -200222 136257
6123 -223026 56178 111337 -124830 -36843 -147343 -186492 -105998 -156138 127704 162945 -256092
6111 48857 -253477 57980 -185487 -281835 190777 128050 166600 235101 -13156 -198412 156832
6099 221972 -20281 -136751 -184262 -72267 -114961 -451656 -33982 94761 71990 -166099 29558
6087 113515 184071 61140 215455 80999 70099 -14285 -70417 -166552 202635 138570 -77 98339
6074 83675 2617 -270623 -140754 -170910 -177426 -220464 145569 -35960 205006 -72032 26677
6062 -20083 216248 175957 101307 -161223 749 126478 240770 -120652 -118440 187423 269971
6051 269971 102634 39187 -209552 59111 56611 -82298 82145 -271489 147770 -32831 151115
6039 -10132 -235501 278407 230637 -96284 141793 -175960 -148540 193612 89117 -299312 -6651
6027 -8697 -211405 -105574 207528 307953 143342 7000 -153336 -61179 92141 -87093 7427
6015 56290 -114801 176569 97359 -120566 -88544 -277154 80070 -256806 -240281 22889 90465
6004 90465 66997 -381243 95485 -143438 213162 -17017 -330939 -143507 -87283 56080 -228782
5992 43619 169435 15225 -114721 142074 -103565 189501 -18082 318287 387121 -204773
5981 -63227 25725 -288785 90740 12325 -83789 257771 -430850 -68936 -94729 -314325 -51308
5969 -398831 -132032 114470 -274958 10096 -102919 109748 -220064 -476687 -70845 137638
5958 -149199 85118 -262214 191833 -138664 -115858 -100821 126001 29768 40716 66250 -2840
5946 -120593 -134476 11013 -71288 149261 -138942 207204 159559 137409 -242904 -49259 -25855
5935 -25855 7692 -27219 -78715 215974 7699 -161618 -101064 231026 -218705 -298878 -208051
5924 -208051 278019 276134 -117144 -164422 79362 117745 6560 23511 -32203 316527 -12610
5912 36496 1349 93999 397728 216329 119778 -177466 -73587 -67954 27310 -47122 247924
5900 219442 167113 -137383 124698 150974 25173 -194783 102475 -34169 -261558 224957
5889 -28599 187448 74137 29666 71759 56403 -346627 169182 148617 250461 107815 163512
5878 163512 136439 146635 57514 192371 302228 -265518 87180 -136390 -107610 -303092 -109687
5866 52244 40424 -88649 -60359 118346 41558 42802 3155 -361376 175720 237377 -21523 382468
5853 -297877 -130599 165664 166533 170170 -18706 -53695 64522 138983 -115550 59413 -188437
5841 228763 -65335 91432 -217279 164856 23892 113400 263805 -148932 -73327 414 176463
5830 176463 -253610 30188 -237794 41166 23073 76596 -253624 -10688 -102795 -41554 -230387
5819 -230387 -903 -206932 -114884 -77356 -99399 -105431 -389393 36777 12610 -156335 249869
5807 29409 368923 -253041 311680 -210226 72860 24115 -84681 -202342 -325932 -508915
5797 -508915 -39465 176426 67979 36666 -29216 517 -1186 -176773 125984 -159898 -39291
5785 123860 -269424 -31316 54799 34911 68102 -188999 -124055 -67051 184052 -220063 56876
5773 193820 -19225 -195407 168483 14639 -15836 16578 -113087 -63597 89406 -140335 -59677
5761 -111452 -123326 -285512 -155082 -130930 224567 -358566 264288 -138951 -195103 -142861
5751 -142861 -13847 -26598 -66095 -50032 -99721 38244 10980 -47991 61142 66451 46253 63805
5739 63805 -17316 -192925 -2195 -70043 -61211 -16056 39480 -192218 -99524 92189 -79885 144307
5726 109374 21824 208561 72308 -208146 41028 132967 -70478 20785 -18283 -102430 -86804
5715 -86804 -163521 98053 27256 93780 -151094 -437339 176064 63178 -208992 -183338 136385
5703 -160295 93120 134321 -181964 154500 270422 75378 -186368 -275678 -65739 12692 124101
5692 124101 -48844 28379 -44445 -111580 2384 30455 -67392 109370 12181 -72643 -14658 -87993
5680 -87993 -165149 -307986 -40255 -14346 182052 -256669 -77911 -144528 -152426 196478 -292466
5668 243461 73697 204682 214460 120579 -217339 133488 -52239 -288719 -97143 58541 -96539
5656 347141 23187 53168 55232 -200769 83245 249162 169757 18044 -49206 -17448 -106935
5645 -106935 -46329 79483 -52093 102645 -47664 142543 -10549 153225 14776 160360 89441
5634 89441 21239 -288096 155827 -118549 139179 -10942 -238261 -131720 -118888 178056
5623 -154715 -392139 -24880 -32491 -73925 31993 -121993 71190 160975 252484 -112623 -76008
5612 -76008 -277831 -156014 -43555 39701 -9020 42459 74754 59068 48025 94672 -24516 217573
5599 51996 6873 165188 -251564 -393698 5361 89507 110335 -465426 -112110 -61615 55815
5587 -204755 20509 14785 -47570 -79805 272760 -130405 -27082 -14147 -46213 -67900 347033
5575 -259 -132952 -107702 -44591 115483 44466 -217305 221429 -98009 -303101 -266519 282483
5563 -78515 442427 231336 -136014 -136495 -13940 259831 -84270 -204745 72830 197413 198869
5552 198869 116304 -194450 102195 -38517 -63319 27842 33767 33006 -16827 188024 60424 381432
5540 381432 -60023 -86237 -246095 41277 -108636 287769 158436 118507 -111001 121064
5529 -211191 199986 -110073 259969 -321748 -300001 100060 223261 132148 -238799 17059
5518 -44415 -96176 -116426 147556 105439 18802 -102688 -72892 216637 -133819 33303 -30316
5506 232547 -9390 -203197 121608 222069 -59959 73448 86871 31861 -71126 -35007 -132935
5495 -132935 188197 -224652 -66791 113444 57617 78919 -125683 -326047 78881 95387 -100061
5483 -150910 -292432 24583 314526 -223559 13075 -195874 171059 -48207 -160175 34631
5472 44270 -211223 211036 -76041 115175 -138469 -69831 9599 -83802 -187924 -195255 80051
5460 -64494 220509 -160322 34812 -160970 -119353 -44134 22968 135012 -215645 -264873 57965
5448 -62035 294534 -124257 241111 212510 -115400 -122298 -82866 -77762 136803 -9377 64925
5436 -189046 -188369 10507 72654 -10391 198044 343201 -18375 -207127 253438 -29824 -21631
5425 -21631 -248194 -42590 221131 -157577 -37625 163129 -113483 -225578 -175547 101500
5414 -53541 -126280 -59794 -11971 -315266 -20341 -169086 -18265 191806 321509 -152799 -113051
5403 -113051 -10751 -187427 -128751 246422 26227 -337887 85697 393704 148538 48091 -213955
5391 107577 -141823 -58607 46306 134435 -212258 -121538 29706 265956 226996 -257262 -82710
5379 -137963 97080 -98184 10278 64295 -76473 -197408 -156453 -48609 -247858 -17788 -83131
5368 -83131 234041 -267622 -138675 24407 -134390 130669 -236605 125249 272794 -249517
5357 -353039 347183 340140 -95421 -2215 -224941 179462 -365540 2540 -2786 -298235 -208617
5346 -208617 -188577 -14671 -195666 -143972 -82949 278652 -16072 -144903 62726 199179 378525
5335 378525 -322908 -81377 -192884 184205 157242 93573 333036 81200 24959 58404 217732
5324 217732 -167035 26447 250307 43099 -11219 51668 15532 -193087 -283348 -123398 30210
5312 -46083 -32883 -294534 223956 82568 240162 134949 -108421 114451 9223 55163 -217504
5300 116785 189387 -289388 -76991 85449 61009 34093 -21512 -182677 27085 -59855 -124624
5289 -124624 245828 -88153 -207315 229701 -49310 182902 116542 91835 52799 -427234 144007
5277 56228 -38762 74471 -73778 -65925 -34609 7566 132947 -196001 210721 -218056 5985 70485
5265 70485 267894 6202 -19044 -329463 -171958 9659 56260 -32442 80012 233854 -22166
5253 52428 -297172 18701 -41778 -293950 126044 19710 80241 137369 261859 -201872 -215816
5242 -215816 -51695 -224617 165558 113543 200512 291406 48839 7851 470 -11841 -27044 16476
5229 39262 -390780 65045 -184420 47880 456 117040 138878 -207141 -141046 173093 -142660
5217 109185 89276 116190 50732 -11876 150687 -263064 -200063 -51237 386309 -131554 -84425
5206 -84425 -265038 -18100 269437 -194584 142331 -44192 191888 184709 240588 275484 -113151
5194 -49906 -31634 34955 -111003 20537 -144747 101736 258719 84390 115829 22774 197175
5183 197175 185825 -69780 -127843 65759 -73929 226425 102408 -144196 -6852 -181940 -558604
5172 -558604 123385 85860 254585 144171 146458 17429 133107 -315025 309374 78236 54297
5161 54297 65358 -149998 -34883 35603 -22586 110267 68016 19913 -63976 42278 79362
5150 79362 -7189 -44179 105854 92541 -260159 127993 -197738 -202314 -73826 225504 -126434
5138 228514 -222544 102277 16981 42272 -33422 -134339 -104084 101841 231570 -357753
5127 -91107 1139 -150547 38760 60927 177442 -62237 -9773 -115980 199105 -121536 228213
5115 138164 186617 81561 -149930 -196186 51039 24580 -381203 33514 124264 196272 185556
5104 185556 -263887 -129862 -144883 248940 -47156 -40237 50487 154775 -22381 -273016 -329567
5093 -329567 51195 -249069 -147 -183191 41244 -21499 101084 177522 -221838 -46527 295775
5081 71340 28995 -40511 -76551 -144887 -90355 -45667 -97676 -61849 -31690 232452 190357 191430
5069 191430 227658 18552 -37050 312817 18359 -189966 -235726 371484 -179688 -295834 37936
5057 66464 -66124 -99774 177317 129219 14671 132481 193241 47289 -115545 -301106 154137
5045 -36365 490211 253797 -69506 -20119 -158517 150682 -61962 -272603 242833 304228 -5576
5033 -135008 -139072 -270626 -159131 -280970 -200191 12441 -306194 68415 18146 166252 -129088
5021 -12437 -31585 216743 34867 233704 -156534 73711 223801 306475 148113 -283876 1027
5009 -334788 16341 133796 -103965 94648 537178 -361706 245821 47153 68848 -107324
4998 98807 -83176 -52144 -82685 250099 308980 -34765 111764 227265 -96713 164581 96861
4987 96861 60662 -93453 -255424 78073 22331 -130573 -102330 -15416 -20394 -184366 30492
4975 89578 165943 -297620 418696 38084 63178 59151 -47322 51223 -69772 -270223 230835
4963 -158949 -364074 196663 -98297 65755 -165844 -8983 -247288 -231871 157688 189462 -22471
4951 95881 128459 -229727 -141444 275260 -128698 -302759 -84808 -190960 20400 216299 -186387
4939 -61286 37703 -47568 -64893 -211154 174688 -141012 -272561 -171117 233579 -31259 78145
4927 189931 351149 114394 -20433 60430 -116116 176199 -43352 -227159 189250 -308251
4916 9754 69195 -66153 57486 -113611 96499 194729 23539 -86346 -202945 300404 16540
4904 -136353 -111392 247987 361210 404360 -208194 -69594 57517 151662 293191 -88784 -8470
4892 83955 6099 31253 -139305 175626 -17444 124099 -26865 -164121 -136697 -32490 219360
4880 -277517 -2497 -35413 24689 -73843 -198810 -149494 180294 -98998 86666 -28698 40370
4868 46511 98342 -162554 227560 -145762 39020 -71858 113750 256914 36766 253150 -20334
4856 -194571 357622 -48813 -63336 132564 -38430 -30912 -166969 -126936 86194 281383 73539
4844 -79163 41483 -7396 104198 139983 190561 -345165 -296290 110441 -75996 61628 -5286 37790
4831 48585 -41751 -125221 101357 127357 50389 374217 -55806 -306379 -181562 -32258 -3363
4819 -145669 -27877 355462 113088 23542 -263844 122255 -241654 -191443 136791 304611
4809 304611 -69198 -79878 291795 -63296 -151455 4082 -222044 74499 -243363 -86054 -138534
4798 -138534 -157812 337059 235922 74273 -165936 -111675 -16117 291590 -167286 154761
4787 146132 -418381 -85806 166195 -225927 379233 32223 -166048 -334887 203702 224949
4777 224949 -89937 203419 -148800 -38285 38911 124725 -12713 -358127 176439 -80579 313509
4765 125361 79195 -51785 -225846 -22851 148460 -103731 -127560 -54268 14131 95947 269268
4754 269268 212124 32654 141505 87596 -157015 131241 108286 -125571 136993 150028 -71821
4742 -90658 7839 -106318 111633 -46154 342106 67870 339150 -22291 -185710 289954 167823
4731 167823 -9196 231679 -597 -72918 -398964 -96475 288604 -28663 120590 -397854 -129896
4719 -26290 -202683 58854 213999 -63645 -28040 175199 172728 -145895 126735 -16745 133230
4707 173299 17174 -378216 -223378 -242904 21558 53909 226092 159475 -108465 -3491 -145639
4696 -145639 220478 36448 77495 -36798 155707 146656 -45884 -9650 -12600 34977 188939 54014
4683 -121293 165315 142493 86639 -154554 -93625 33602 115442 -161754 37457 23529 -200373
4671 173038 45301 113145 -46695 139843 -11399 163204 -18545 181701 -179633 202832 6755
4659 191302 20114 -73583 -66700 -197881 -34844 -134035 -25384 166128 157939 -179407 68686
4647 75305 225850 152520 146844 341851 85088 -198536 -651377 -526474 -172204 114367 -146151
4635 -230475 121161 -295819 247454 94739 151551 45732 62902 -29512 -292303 -51528 50188
4623 98963 -170716 -33331 139664 -429853 -81946 -24683 -388295 33477 50865 33161 -259687
4611 166545 -88545 274742 -66451 171739 -43143 204356 -208532 310449 161324 -235983
4600 91052 -85762 219031 31926 -58472 -143975 -13324 79368 119839 84218 -21295 -184807
4589 -184807 -161530 -323974 -270677 54875 70172 61565 201347 -15828 -46878 351599 -146137
4577 73559 34314 -38015 -78068 15397 -95741 19346 -285069 211527 135786 -58660 31374
4565 -146917 25395 -266090 -81036 207137 -412008 -234 134171 120862 -64506 -148820 77610
4553 21517 4800 49179 100064 -13231 214639 112091 127473 104640 115091 -1294 351543 99467
4540 -133261 208497 148682 -6254 -17500 -190120 86718 -349253 -57370 -579796 -205858 -171870
4529 -171870 -51624 222465 -15886 275730 -64491 89202 6846 -111136 -117265 84466 -15317
4517 -72821 -67696 7404 -205973 126934 290108 21212 -72547 86858 -277636 15709 -179689
4505 29432 -321096 190998 57628 372638 296520 180480 -146071 -118797 8817 143427 -304760
4493 -108629 13830 242642 293442 -94094 -130042 -114164 -574 97582 -62439 33694 87050 74315
4481 74315 230874 174113 322469 236417 -49224 -161015 -183309 -44505 -20555 -43715 22784
4469 -160632 -222962 54976 119816 -226634 -31204 127011 71216 -213198 -58354 37491 -246843
$$ [...]
##END NTUPLES=NMR SPECTRUM
##END=
