
##TITLE=UV1041_TOSA01-ROVE100B_6099594_KRDsTV3hNo
##JCAMPDX= 6.0         $$ Bruker NMR JCAMP-DX V2.0
##DATA TYPE= NMR SPECTRUM
##DATA CLASS= NTUPLES
##ORIGIN= BRUKER
##OWNER= Administrator
$$ 1.72 TOPSPIN		Version 2.1
$$ 2012-05-12 21:27:47.687 -0500  Administrator@TOPSPIN
$$ Compression mode = diff/dup
##.OBSERVE FREQUENCY= 400.13188235
##.OBSERVE NUCLEUS= ^1H
##.ACQUISITION MODE= SIMULTANEOUS (DQD)
##.ACQUISITION SCHEME= undefined
##.AVERAGES= 64
##.DIGITISER RES= 22
##SPECTROMETER/DATA SYSTEM= spect
##.PULSE SEQUENCE= noesygpps1d.comp
##.SOLVENT NAME= COFFEE_meoh
##.SHIFT REFERENCE= INTERNAL, COFFEE_meoh, 1, 14.96675
##AUDIT TRAIL= $$ (NUMBER, WHEN, WHO, WHERE, PROCESS, VERSION, WHAT)
$$ ##TITLE= Audit trail, TOPSPIN		Version 2.1
$$ ##JCAMPDX= 5.01
$$ ##ORIGIN= Bruker BioSpin GmbH
$$ ##OWNER= Administrator
$$ $$ C:\Bruker\TOPSPIN/data/COFFEE/nmr/UV1041_TOSA01-ROVE100B_6099594_KRDsTV3hNo/12/pdata/1/auditp.txt
$$ ##AUDIT TRAIL=  $$ (NUMBER, WHEN, WHO, WHERE, PROCESS, VERSION, WHAT)
(   1,<2012-05-12 21:27:42.171 -0500>,<Administrator>,<TOPSPIN>,<go>,<TOPSPIN 2.1>,
      <created by zg
	started at 2012-05-12 21:16:12.031 -0500,
	POWCHK enabled, PULCHK disabled,
       configuration hash MD5:
       AF F2 23 6B 01 CD 40 DD E5 A1 38 A0 06 EA F7 77
       data hash MD5: 64K
       E2 3A DF 20 3B 5E 03 84 85 EF 82 92 03 03 F8 CB>)
(   2,<2012-05-12 21:27:45.437 -0500>,<Administrator>,<TOPSPIN>,<proc1d>,<TOPSPIN 2.1>,
      <Start of raw data processing
       efp LB = 0.3 FT_mod = 6 PKNL = 1 PHC0 = 0 PHC1 = 0 SI = 128K 
       data hash MD5: 128K
       3A 60 A4 36 8F B7 B5 E1 54 34 F9 10 42 0A 6B 38>)
(   3,<2012-05-12 21:27:46.890 -0500>,<Administrator>,<TOPSPIN>,<proc1d>,<TOPSPIN 2.1>,
      <pk PHC0 = 33.44788 PHC1 = 0 
       data hash MD5: 128K
       D5 17 D3 D4 13 47 A0 5B 5E 6D 9E 9A 60 26 F5 E2>)
(   4,<2012-05-12 21:27:47.296 -0500>,<Administrator>,<TOPSPIN>,<proc1d>,<TOPSPIN 2.1>,
      <abs ABSG = 1 
       data hash MD5: 128K
       EA BB 66 3B C1 E6 48 71 2B 4D 0D 72 14 DE 00 87>)
(   5,<2012-05-12 21:27:47.375 -0500>,<Administrator>,<TOPSPIN>,<proc1d>,<TOPSPIN 2.1>,
      <abs ABSG = 2 
       data hash MD5: 128K
       5B 9F 5B B9 59 98 D1 61 98 CE F5 F1 45 BE 8D A1>)
(   6,<2012-05-12 21:27:47.453 -0500>,<Administrator>,<TOPSPIN>,<proc1d>,<TOPSPIN 2.1>,
      <abs ABSG = 3 
       data hash MD5: 128K
       53 3E D7 90 14 BC F6 00 F0 9E 36 98 76 11 37 7F>)
(   7,<2012-05-12 21:27:47.531 -0500>,<Administrator>,<TOPSPIN>,<proc1d>,<TOPSPIN 2.1>,
      <abs ABSG = 4 
       data hash MD5: 128K
       03 99 C9 53 B1 F5 27 6C CD 6A 1F C4 2A 67 AD 2F>)
(   8,<2012-05-12 21:27:47.593 -0500>,<Administrator>,<TOPSPIN>,<proc1d>,<TOPSPIN 2.1>,
      <abs ABSG = 5 
       data hash MD5: 128K
       B0 A2 A2 F9 17 85 8C 0D 03 D3 72 E0 F9 C3 B7 C2>)
$$ ##END=
$$ 
$$ $$ hash MD5
$$ $$ E8 C8 71 71 D0 D0 34 88 1E FE 37 78 B5 7B 9B AC
##$RELAX= 
##$RELAX= 
##$RELAX= 
##$RELAX= 
##$RELAX= 
##$RELAX= 
##$RELAX= 
##$RELAX= 
$$ [...]
##$TP07= 0
##$TPNAME0= <>
##$TPNAME1= <>
##$TPNAME2= <>
##$TPNAME3= <>
##$TPNAME4= <>
##$TPNAME5= <>
##$TPNAME6= <>
##$TPNAME7= <>
##$TPOAL= (0..7)
0.5 0.5 0.5 0.5 0.5 0.5 0.5 0.5
##$TPOFFS= (0..7)
0 0 0 0 0 0 0 0
##$TUNHIN= 0
##$TUNHOUT= 0
##$TUNXOUT= 0
##$USERA1= <user>
##$USERA2= <user>
##$USERA3= <user>
##$USERA4= <user>
##$USERA5= <user>
##$V9= 5
##$VALIST= <valist>
##$VCLIST= <CCCCCCCCCCCCCCC>
##$VD= 0
##$VDLIST= <DDDDDDDDDDDDDDD>
##$VPLIST= <PPPPPPPPPPPPPPP>
##$VTLIST= <TTTTTTTTTTTTTTT>
##$WBST= 2048
##$WBSW= 25
##$XGAIN= (0..3)
0 0 0 0
##$XL= 0
##$YL= 0
##$YMAX_a= 11071970
##$YMIN_a= -5905740
##$ZGOPTNS= <>
##$ZL1= 120
##$ZL2= 120
##$ZL3= 120
##$ZL4= 120
##$ABSF1= 14.96675
##$ABSF2= -5.58578
##$ABSG= 5
##$ABSL= 3
##$ALPHA= 0
##$AQORDER= 0
##$ASSFAC= 0
##$ASSFACI= 0
##$ASSFACX= 0
##$ASSWID= 0
##$AUNMP= <proc_prof1d_extract.lims>
##$AXLEFT= 0
##$AXNAME= <>
##$AXNUC= <1H>
##$AXRIGHT= 0
##$AXTYPE= 0
##$AXUNIT= <>
##$AZFE= 0.1
##$AZFW= 0.1
##$BCFW= 0
##$BC_mod= 0
##$BYTORDP= 0
##$COROFFS= 0
##$CY= 15
##$DATMOD= 1
##$DC= 0
##$DFILT= <>
##$DTYPP= 0
##$F1P= 0
##$F2P= 0
##$FCOR= 0.5
##$FTSIZE= 131072
##$FT_mod= 6
##$GAMMA= 0
##$GB= 0
##$INTBC= 1
##$INTSCL= 1
##$ISEN= 128
##$LB= 0.3
##$LEV0= 0
##$LPBIN= 0
##$MAXI= 10000
##$MC2= 0
##$MEAN= 0
##$ME_mod= 0
##$MI= 0
##$NCOEF= 0
##$NC_proc= -3
##$NLEV= 6
##$NOISF1= 0
##$NOISF2= 0
##$NSP= 0
##$NTH_PI= 0
##$NZP= 0
##$OFFSET= 14.96675
##$PC= 1
##$PHC0= 33.44788
##$PHC1= 0
##$PH_mod= 1
##$PKNL= yes
##$PPARMOD= 0
##$PPDIAG= 0
##$PPIPTYP= 0
##$PPMPNUM= 2147483647
##$PPRESOL= 1
##$PSCAL= 4
##$PSIGN= 0
##$PYNMP= <proc.py>
##$REVERSE= no
##$SF= 400.130005548352
##$SI= 131072
##$SIGF1= 0
##$SIGF2= 0
##$SINO= 400
##$SIOLD= 131072
##$SPECTYP= <>
##$SREGLST= <1H.CDCl3>
##$SSB= 0
##$STSI= 131072
##$STSR= 0
##$SW_p= 8223.68421052632
##$SYMM= 0
##$S_DEV= 0
##$TDeff= 65536
##$TDoff= 0
##$TI= <>
##$TILT= no
##$TM1= 0
##$TM2= 0
##$TOPLEV= 0
##$USERP1= <user>
##$USERP2= <user>
##$USERP3= <user>
##$USERP4= <user>
##$USERP5= <user>
##$WDW= 1
##$XDIM= 131072
##$YMAX_p= 447700622
##$YMIN_p= -29721987
##$CURPLOT= <Network HP LaserJet P1505>
##$CURPRIN= <$Network HP LaserJet P1505>
##$DFORMAT= <normdp>
##$LAYOUT= <+/1D_H.xwp>
##$LFORMAT= <normlp>
##$PFORMAT= <normpl>
##$SURQMSG= 1
$$ End of Bruker specific parameters
$$ ---------------------------------
##NTUPLES= NMR SPECTRUM
##VAR_NAME=  FREQUENCY,     SPECTRUM/REAL,   SPECTRUM/IMAG
##SYMBOL=    X,             R,               I
##VAR_TYPE=  INDEPENDENT,   DEPENDENT,       DEPENDENT
##VAR_FORM=  AFFN,          ASDF,            ASDF
##VAR_DIM=   131072,        131072,          131072
##UNITS=     HZ,            ARBITRARY UNITS, ARBITRARY UNITS
##FACTOR=    0.0627417313425165, 1,          1
##FIRST=     8223.62146879498, 2075,         -105964
##LAST=      0,             5180,            -106001
##MIN=       0,             -29721987,       0
##MAX=       8223.62146879498, 447700622,    0
$$ Real data points
##PAGE= N=1
##DATA TABLE= (X++(R..R)), XYDATA
$$ [...]
61357E53231L224N352O263M850K505J072P02N37M44R24J684J647N15o93j066j020
$$ 553231 556455 561807 568070 572920 575425 576497 577199 577736 578180 579104 580788 582435 582950 582257 581191 580171
61341E80171j569k877m209m968n184m910l884k125n29j91j094j935j595m27M07
$$ 580171 578602 575725 571516 566548 561364 556454 552570 550445 549916 549725 548631 546696 545101 544674 545081
61326E45081N70P35J191J231L76o10p01KO97J236J991K639K280R43o8K89J685
$$ 545081 545651 546386 547577 548808 549184 548574 547873 547875 548572 549808 551799 554438 556718 557661 557593 557882 559567
61309E59567L199M378N131N298M922M419L987L358K483J961K201K735K925K933
$$ 559567 562766 567144 572275 577573 582495 586914 590901 594259 596742 598703 600904 603639 606564 609497
61295F09497L387M465N838P221Q398R075R183R151R287R169Q230O729N562N204
$$ 609497 612884 617349 623187 630408 638806 647881 657064 666215 675502 684671 692901 699630 705192 710396
61281G10396N306N178M330K775J214O16J161K010K567L398N014O395N971L932
$$ 710396 715702 720880 725210 727985 729199 729815 730976 732986 735553 738951 743965 750360 756331 760263
61267G60263K246K012K060Q36j301k532j863o6J508K329K769L346M141M899N419
$$ 760263 762509 764521 766581 767417 766116 763584 761721 761655 763163 765492 768261 771607 775748 780647 786066
61252G86066N715N915O222P036Q704J0932J2698J3233J2941J2860J3272J3345
$$ 786066 791781 797696 803918 810954 819658 830590 843288 856521 869462 882322 895594 908939
61240I08939J2186R702O324K483j213l733m345l708l738n751q806j0455r534p669
$$ 908939 921125 930827 937151 939634 938421 934688 930343 926635 922897 917146 908340 897885 888351 880682
61226H80682p317q684r708r101p943p680p826o939m955l030j523L14K617M331
$$ 880682 873365 864681 854973 845872 837929 830249 822423 815484 810529 807499 805976 806290 808907 813238
61212H13238M669M003L047K182J883K665M184N343N806O451P825R138R537R309
$$ 813238 817907 821910 824957 827139 829022 831687 835871 841214 847020 853471 861296 870434 879971 889280
61198H89280R018Q357P021O050O888R234J1030J0758Q777O249L685J050j352k816
$$ 889280 898298 906655 913676 919726 926614 935848 946878 957636 966413 972662 976347 977397 976045 973229
61184I73229k908j827j46J453K231J609k49k217l061k741k407k809l178k329m77
$$ 973229 970321 968494 968348 969801 972032 973641 973392 971175 968114 965373 962966 960157 956979 954650 954173
61169I54173R24J072O84Q14J716K997M074M297L544K991M233P054R120Q793P308
$$ 954173 955097 956169 956853 957667 959383 962380 966454 970751 974295 977286 981519 988573 997693 1006486 1013794
61154A013794P059Q413R502Q822O793M746L411K734K440K432K875L903N132N808
$$ 1013794 1020853 1029266 1038768 1047590 1054383 1059129 1062540 1065274 1067714 1070146 1073021 1076924 1082056 1087864
61140A087864N788N931P106R220J1665J4063J6016J6814J6159J4598J2609J0111
$$ 1087864 1093652 1099583 1106689 1115909 1127574 1141637 1157653 1174467 1190626 1205224 1217833 1227944
61128A227944P711P135Q884J0457Q969N002J732N03l87k243l919m127l618l645
$$ 1227944 1235655 1242790 1251674 1262131 1271100 1276102 1277834 1278337 1277950 1275707 1271788 1267661 1264043 1260398
61114A260398l985l950l968m651n383n256m649m571n303o673q653j0595j1033
$$ 1260398 1256413 1252463 1248495 1243844 1238461 1233205 1228556 1223985 1218682 1212009 1203356 1192761 1181728
61101A181728r669q509r438j1606j2914j3066j3156j3021j1453q728o608n642
$$ 1181728 1172059 1163550 1154112 1142506 1129592 1116526 1103370 1090349 1078896 1070168 1063560 1057918
61089A057918m685l342k727l307m107m762o318r002j1052j1074r922q960p869
$$ 1057918 1053233 1049891 1047164 1043857 1039750 1034988 1028670 1019668 1008616 997542 987620 978660 970791
61076I70791n720l042j198m70j21K21M85J015K341M444P002R811J2348J3724J3957
$$ 970791 965071 962029 960831 960361 960240 960461 960946 961961 964302 968746 975748 985559 997907 1011631 1025588
61061A025588J4399J5971J7918J9312K0673K2782K5001K6429K7774L0228L3066
$$ 1025588 1039987 1055958 1073876 1093188 1113861 1136643 1161644 1188073 1215847 1246075 1279141
61050A279141L4382L3833L2687L1384K9219K6547K4985K4844K4230K1608J7606
$$ 1279141 1313523 1347356 1380043 1411427 1440646 1467193 1492178 1517022 1541252 1562860 1580466
61039A580466J3602J0010O826M405K596K74l239p196j0668j3765j6810j9370k1028
$$ 1580466 1594068 1604078 1610904 1615309 1617905 1618179 1614940 1607744 1597076 1583311 1566501 1547131 1526103
61026A526103k2232k3400k4082k3942k3723k4138k4460k3401k0916j8191j6151
$$ 1526103 1503871 1480471 1456389 1432447 1408724 1384586 1360126 1336725 1315809 1297618 1281467
61015A281467j4828j3740j2145r430n944k929r90O06K473M024M933O545J0184
$$ 1281467 1266639 1252899 1240754 1231324 1225380 1222451 1221461 1222067 1224540 1228564 1233497 1240042 1250226
61002A250226J4794J8079J9588K0822K2467K3602K4042K5350K8525L2383L5543
$$ 1250226 1265020 1283099 1302687 1323509 1345976 1369578 1393620 1418970 1447495 1479878 1515421
60991A515421L8669M3190M8637N3064N5890N8603O2366O6469O9853P2999P7174
$$ 1515421 1554090 1597280 1645917 1698981 1754871 1813474 1875840 1942309 2012162 2085161 2162335
60980B162335Q2428Q7740R2875R8852J06353J14860J23729J32814J41358J47678
$$ 2162335 2244763 2332503 2425378 2524230 2630583 2745443 2869172 3001986 3143344 3291022
60970C291022J51369J54795J60866J70041J81212J94679K11855K32263K53447
$$ 3291022 3442391 3597186 3758052 3928093 4109305 4303984 4515839 4748102 5001549
60961E001549K74273K95981L19704L46027L78143M22147M81950N56147O41689
$$ 5001549 5275822 5571803 5891507 6237534 6615677 7037824 7519774 8075921 8717610
60952H717610P37797Q44302R60199J087808J234476J404633J593964J797985K017451
$$ 8717610 9455407 10299709 11259908 12347716 13582192 14986825 16580789 18378774 20396225
60943B0396225K232868K366139K293342J933892J342257O98256J90818r2393j70396
$$ 20396225 22629093 24995232 27288574 29222466 30564723 31262979 31453797 31361404 31191008
60934C1191008r9126O6166K39689K83079O7903m20278j051099j633751k034722
$$ 31191008 31091882 31158048 31397737 31680816 31748719 31328441 30277342 28643591 26608869
60925B6608869k225462k246955k155415j998025j811530j621001j438197j267384
$$ 26608869 24383407 22136452 19981037 17983012 16171482 14550481 13112284 11844900
60917A1844900j112670r77318q59522p54369o59800n77450n08331m50827m02764
$$ 11844900 10732230 9754912 8895390 8141021 7481221 6903771 6395440 5944613 5541849
60908E541849l62648l28428k97308k67665k40005k15544j94604j76334j59349
$$ 5541849 5179201 4850773 4553465 4285800 4045795 3830251 3635647 3459313 3299964
60899C299964j42738j27150j14415j05444r8977r2905q6147p8574p0220o1529
$$ 3299964 3157226 3030076 2915661 2810217 2711240 2618335 2532188 2453614 2383394 2321865
60889B321865n3625m7164m1580l6263l1564k7651k3679j9404j6352j5505j4950
$$ 2321865 2268240 2221076 2179496 2143233 2111669 2084018 2060339 2040935 2024583 2009078 1994128
60878A994128j2017p149l297j754r91L14J549K085K664L816M706M595M100L846
$$ 1994128 1982111 1974962 1971665 1969911 1968920 1969234 1970783 1972868 1975532 1979348 1984054 1988649 1992749 1996595
60864A996595L183J314j287l742o179r251j2835j6164j8820k0832k2389k4036
$$ 1996595 1999778 2001092 1999805 1996063 1989884 1980633 1967798 1951634 1932814 1911982 1889593 1865557
60852A865557k6528k9781l2528l3785l4088l4561l5280l5402l4495l2929l1208
$$ 1865557 1839029 1809248 1776720 1742935 1708847 1674286 1639006 1603604 1569109 1536180 1504972
60841A504972k9606k8149k6511k4343k2098k0827k0475j9439j6902j4716j5273
$$ 1504972 1475366 1447217 1420706 1396363 1374265 1353438 1332963 1313524 1296622 1281906 1266633
60830A266633j7902j9366j8085j5904j5074j5422j5670j5915j6910j7914j7400
$$ 1266633 1248731 1229365 1211280 1195376 1180302 1164880 1149210 1133295 1116385 1098471 1081071
60819A081071j5706j4958j5966j6908j5835j3133j0542q862p852p528q080q777
$$ 1081071 1065365 1050407 1034441 1017533 1001698 988565 978023 969161 961309 953781 945701 936924
60807I36924q409p002n995o380p475q005p630o967o620o751p224p701p831p654
$$ 936924 928515 921513 915518 909138 901663 893658 886028 879061 872441 865690 858466 850765 842934 835280
60793H35280p643q032q451q471q189p917p578o897o062n639n784n935n453m473
$$ 835280 827637 819605 811154 802683 794494 786577 778999 772102 766040 760401 754617 748682 743229 738756
60779G38756l872m385n784p079p545p293o691n637l937k198j537k203l153l302
$$ 738756 734884 730499 724715 717636 710091 702798 696107 690470 686533 684335 682798 680595 677442 674140
60765F74140k668j958j541j252q46j92P73J873K782L458M115M476L707J631n05
$$ 674140 671472 669514 667973 666721 665875 665683 666456 668329 671111 674569 678684 683160 686867 688498 687993
60750F87993j309r56p04r34p85J06O09k89j749j973p34K11m75j876k182j257o77
$$ 687993 686684 685728 685024 684090 683305 683411 684020 683731 681982 680009 679275 679486 679011 677135 674953 673696 673019
60733F73019j286k136k293k437l577n038n203l972l054l622m962n782n750n240
$$ 673019 671733 669597 667304 664867 661290 656252 651049 647077 644023 640401 635439 629657 623907 618667
60719F18667m494l716l328l520m012m591n307n902n852n213m563l820k190K40
$$ 618667 614173 610457 607129 603609 599597 595006 589699 583797 577945 572732 568169 564349 562159 562399
60705E62399K104K701L077M091M631L339J197N62J902L284L223K524K747M030
$$ 562399 564503 567204 570281 574372 579003 582342 583539 584101 586003 589287 592510 595034 597781 601811
60691F01811N092M802L285J843J872L436M940M718K894J103M59L97l51k247m535
$$ 601811 606903 611705 614990 616833 618705 622141 627081 631799 634693 635796 636255 636652 636301 634054 629519
60676F29519o044o253n645n052m750m626n004o301p743p759o229n069n590o599
$$ 629519 623475 617222 611577 606525 601775 597149 592145 585844 578101 570342 564113 559044 553454 546855
60662E46855o476n759n789n885m305j668p64k540m561m291k052K14J438J625J014
$$ 546855 540379 534620 528831 522946 518641 516973 516209 513669 509108 504817 502765 502979 504417 506042 507056
60647E07056K77M37J448J764M27j332j723q73k92m29j52J292L077L903L536K839
$$ 507056 507333 507770 509218 510982 511409 510077 508354 507481 507189 506760 506608 507900 510977 514880 518416 521255
60631E21255K590K757K882K930L375M265M780M313L629M034N481O578O612O430
$$ 521255 523845 526602 529484 532414 535789 540054 544834 549147 552776 556810 562291 568869 575481 581911
60617E81911O863P346O913N750M917M916N274N230M365K822J327P16J071J560
$$ 581911 588774 596120 603033 608783 613700 618616 623890 629120 633485 636307 637634 638350 639421 640981
60603F40981J328J36j836m116n801o091n286m432l772k583q47J54k94j128j067
$$ 640981 642309 642445 640609 636493 630692 624601 619315 614883 611111 608528 607681 607835 607541 606413 605346
60588F05346l93L1M19J208J429k01k965m727m859m750n216n304m391l675m333
$$ 605346 604953 604984 605403 606611 608040 607839 604874 600147 595288 590538 585322 580018 575627 571952 567619
60573E67619n446n240l612j980j067l24M63N04n40j544j281j44L50m21j459j531
$$ 567619 562173 556933 553321 551341 550274 549950 550413 550917 550377 548833 547552 547408 547758 547337 545878 544347
60557E44347o71O0pl97j21J141K683L490L242K472J846J594J624J836J956J464
$$ 544347 543676 543736 543729 543332 543211 544352 547035 550525 553767 556239 558085 559679 561303 563139 565095 566559
60541E66559L01n02K85K339L743L205J708J162J820K112J115J32J048L629N441
$$ 566559 566860 566358 566643 568982 572725 575930 577638 578800 580620 582732 583847 583979 585027 588656 594097
60526E94097M666K287P97J174K066K046J505J556K137K474K910M553P268R632
$$ 594097 598763 601050 601847 603021 605087 607133 608638 610194 612331 614805 617715 622268 629536 639168
60512F39168J1196J3012J5391J6856J6382J5026J4084J3042J0919Q364O577N136
$$ 639168 650364 663376 678767 695623 712005 727031 741115 754157 765076 773440 780017 785153
60500G85153K800k36k843n028p379q886p761m460j584l60O25K690N109O833Q233
$$ 785153 787953 787717 784874 779846 772467 763581 755820 751360 749776 749416 750041 752731 757840 764673 772906
60485G72906J0102J2322J4506J6764J8972K0384K0733K0574K0063J8590J6117
$$ 772906 783008 795330 809836 826600 845572 865956 886689 907263 927326 945916 962033
60474I62033J3435J0540O379J039l548o047p298q278q234o418m139l241l592l849
$$ 962033 975468 986008 992387 993426 989878 983831 976533 968255 960021 953603 949464 946223 942631 938782
60460I38782l723l656l080j070J686L497M118M815O154P497Q794J1063J4524J7762
$$ 938782 935059 931403 928323 927253 928939 932436 936554 941369 947523 955020 963814 974877 989401 1007163
60446A007163J9599K0875K3497K8306L4463M0561M5812N0239N4076N7195N9154
$$ 1007163 1026762 1047637 1071134 1099440 1133903 1174464 1220276 1270515 1324591 1381786 1440940
60435A440940N9596N8178N4230M7206L7673K7091J6117L941j0136k5052l8598
$$ 1440940 1500536 1558714 1612944 1660150 1697823 1724914 1741031 1744972 1734836 1709784 1671186
60424A671186m9236n6730o1551o4267o5229o4349o1505n7278n2697m8104m3190
$$ 1671186 1621950 1565220 1503669 1439402 1374173 1309824 1248319 1191041 1138344 1090240 1047050
60413A047050l8338l4724l2516l0307k7151k3980k1981k0745j9142j7054j5072
$$ 1047050 1008712 973988 941472 911165 884014 860034 838053 817308 798166 781112 766040
60402G66040j3363j2045j1617j1825j1145q870o606o079o529o200n416n766o851
$$ 766040 752677 740632 729015 717190 706045 697175 690569 684490 677961 671761 666345 660579 653728
60389F53728o487m333k708l133m188l827k102n49j37q22k147l310l397k330j228
$$ 653728 647241 642908 640200 637067 632879 629052 626950 626401 626264 625442 623295 619985 616588 614258 613030
60374F13030j280k527l903m113k549N9K075K574K227J982J553L46p69l97Q76P87
$$ 613030 611750 609223 605320 601207 598658 598717 600792 603366 605593 607575 609128 609474 608705 608308 609184 609971
60358F09971j432l794m153k697j071k00J37M48J089K087K782K231N67o12N7K081
$$ 609971 608539 604745 600592 597895 596824 596624 596761 597209 598298 600385 603167 605398 605965 605353 605410 607491
60342F07491L688L787K912K339K667L400L801L892M188M565M236L135K345K489
$$ 607491 611179 614966 617878 620217 622884 626284 630085 633977 638165 642730 646966 650101 652446 654935
60328F54935K736K306J989K804L990L995K906K190K298K402K383L175M854O173
$$ 654935 657671 659977 661966 664770 668760 672755 675661 677851 680149 682551 684934 688109 692963 699136
60314F99136O410O113N524M046K000J196K698N200O661O594N859N102M418L885
$$ 699136 705546 711659 717183 721229 723229 724425 727123 732323 738984 745578 751437 756539 760957 764842
60300G64842L659L818M522N745O785O925O773P866J0469J2908J3621J2891J1873
$$ 764842 768501 772319 776841 782586 789371 796296 803069 810935 821404 834312 847933 860824 872697
60287H72697J0860R250O492K406k656p384r957r688p757n962n226n490o172o355
$$ 872697 883557 892807 899299 901705 899049 891665 881708 872020 864263 858301 853075 847585 841413 835058
60273H35058n331l499k125j973k796m179n835o994o747n394m299l965l435k023
$$ 835058 829727 826228 824103 822130 819334 815155 809320 802326 795579 790185 785886 781921 778486 776463
60259G76463l53R44K187L623M670N094N799P494R635J1552J3552J6027J8571K0930
$$ 776463 776110 777054 779241 782864 787534 792628 798427 805921 815556 827108 840660 856687 875258 896188
60245H96188K3625K6365K7028K3802J7639J1088N174j096q343j5420k0510k2749
$$ 896188 919813 946178 973206 997008 1014647 1025735 1030909 1029813 1021470 1006050 985540 962791
60233I62791k2726k1913k1498k1214j9697j6451j2841j0548r596q697p079n196
$$ 962791 940065 918152 896654 875440 855743 839292 826451 815903 806307 797610 790531 785335
60221G85335l926l552l335k038M33J974K41l992p030o641m582l506l173j781L30
$$ 785335 781409 777857 774522 772484 772917 774891 775132 771140 764110 757469 752887 749381 746208 744427 744757
60206G44757Q93p27k681l462l506l518l101j915p25l49m80m31k81m90q70p56j4
$$ 744757 745650 744923 742242 738780 735274 731756 728655 726740 726015 725666 725186 724755 724474 723984 723114 722358 722344
60189G22344O87O78J61Q9J153K887M097M180L701L465L521L415K964K361J790
$$ 722344 723031 723709 723870 723959 725112 727999 732096 736276 739977 743442 746963 750378 753342 755703 757493
60174G57493J364J140R52M88j99p08q80q71n36M67J774K401K129J908K414L173
$$ 757493 758857 759997 760949 761437 761238 760530 759650 758779 758243 758710 760484 762885 765014 766922 769336 772509
60158G72509L675M271N202N779N509N206N904P393Q735R515R664Q941P686P228
$$ 772509 776184 780455 785657 791436 796945 802151 808055 815448 824183 833698 843362 852303 859989 867217
60144H67217Q303R796J0306J0182J0589J1236J0765R034P329O418N871N363N188
$$ 867217 875520 885316 895622 905804 916393 927629 938394 947428 954757 961175 967046 972409 977597
60131I77597N239M788L500J701m70l138n774p280p251o431n837n948o664p331
$$ 977597 982836 987624 991124 992825 992355 989217 983443 976163 968912 962481 956644 950696 944032 936701
60117I36701p100n972n104n280n689n264m559m802n538n052l138j667j983l278
$$ 936701 929601 923629 918525 913245 907556 902292 897733 892931 887393 882341 879203 877536 875553 872275
60103H72275m149m388m447m208l297j911o21L25J023J615K245K850K899J838J8
$$ 872275 868126 863738 859291 855083 851786 849875 849254 849579 850602 852217 854462 857312 860211 862049 862067
60088H62067j289j015P77L057M546M580L720L278L748M130L520K784L572N906
$$ 862067 860778 859763 860540 863597 868143 872723 876443 879721 883469 887599 891119 893903 897475 903381
60074I03381P835P599N318K633J346K231M370N774N410M285L881M119L926L176
$$ 903381 911216 918815 924133 926766 928112 930343 934713 940487 945897 950182 954063 958182 962108 965284
60060I65284K688K605K319J812J705J983K167K594M003N701N841L851J110j070
$$ 965284 967972 970577 972896 974708 976413 978396 980563 983157 987160 992861 998702 1002553 1003663 1002593
60046A002593k592l442l211k450k724m290n224m143k543k900n192o805n731k858
$$ 1002593 1000001 996559 993348 990898 988174 983884 978660 974517 971974 969074 963882 957077 951346 948488
60032I48488q69j454l623m774l534j276k60q06j475j693k430l939m644l367j294
$$ 948488 947619 946165 942542 937768 934234 932958 932698 931892 930417 928724 926294 922355 917711 914344 913050
60017I13050m70j263k488l358m052m711n049m985m985n649p205r204j0597j0459
$$ 913050 912580 911317 908829 905471 901419 896708 891659 886674 881689 876040 868835 859631 849034 838575
60003H38575q927o927n111l601k755l083m162m741m426m255m964n642n037l378
$$ 838575 829648 822721 817610 814009 811254 808171 804009 799268 794842 790587 785623 779981 774944 771566
59989G71566j875r42N8J529L066M159M768N036M924M405L823L813M619N605N903
$$ 771566 769691 768749 768807 770336 773402 777561 782329 787365 792289 796694 800517 804330 808949 814554 820457
59974H20457N637N767O315N745L049l82k435l131m143n835o861o787o832p309
$$ 820457 826094 831861 838176 843921 846970 846588 844153 841022 836879 831044 824183 817396 810564 803255
59960H03255o649m268k530l967p698j0386j0209q357o919o691p071p131o573n932
$$ 803255 796606 792338 789808 785841 778143 767757 757548 749191 742272 735581 728510 721379 714806 708874
59946G08874n807n826n042l496k357k135j799m17J213J609N46r22j859k080j816
$$ 708874 703067 697241 692199 688703 686346 684211 682412 681995 683208 684817 685363 684441 682582 680502 678686
59931F78686j489j476j589j205j89R68K085L478M786M790L167J419J092J872K270
$$ 678686 677197 675721 674132 672927 672738 673706 675791 679269 684055 688845 692012 693431 694523 696395 698665
59916F98665J518M2j263j598p99M6m85k113k841j666o6J94o40j360j834k450k624
$$ 698665 700183 700225 698962 697364 696565 696611 696126 694013 691172 689506 689440 689634 688994 687634 685800 683350 680726
59899F80726j584m0O12K47k60o32j076j094q8J221J541R97Q73J530K029J816J386
$$ 680726 679142 679102 679714 679961 679701 679069 677993 676899 676811 678032 679573 680570 681443 682973 685002 686818 688204
59882F88204J263J443J808K035J354l99j856j518J55J351J351R40P55Q03J511
$$ 688204 689467 690910 692718 694753 696107 695708 693852 692334 692489 693840 695191 696131 696886 697689 699200
59867F99200L366N428N920M753L826M397N715O729P537Q401Q827Q613Q539R064
$$ 699200 702566 707994 713914 718667 722493 726890 732605 739334 746871 755272 764099 772712 781251 790315
59853G90315R343Q532P096N855M575K611K95j338j901j862j712j647j833k231
$$ 790315 799658 808190 815286 821141 825716 828327 828622 827284 825383 823521 821809 820162 818329 816098
59839H16098k341j731p55j61k9M06J646K973L027J472j77P3K431N105O570P166
$$ 816098 813757 812026 811271 811110 811081 811487 813133 816106 819133 820605 820428 820501 822932 828037 834607 841773
59823H41773P777P973O853N277N362P556R658R478P228M525K148j62k332l607
$$ 841773 849550 857523 864376 869653 875015 882571 892229 901707 908935 913460 915608 915446 913114 909507
59809I09507l551k595j576j064j186j761k505l066k947j648P17L122M422M532
$$ 909507 905956 903361 901785 900721 899535 897774 895269 892203 889256 887608 888325 891447 895869 900401
59795I00401M424M989O154P100O952N436L343K028J898J715J45k268l714l612
$$ 900401 904825 909814 915968 923068 930020 935456 938799 940827 942725 944440 944585 942317 938603 934991
59781I34991l360m373o375q114q923r088r229r702j0184r731p788n231l602l238
$$ 934991 931631 927258 920883 912769 903846 894758 885529 875827 865643 855912 848124 842893 839291 836053
59767H36053l032k300j728j955k281j643k17Q49Q49qj179k120k427k191k043k352
$$ 836053 833021 830721 828993 827038 824757 823114 822897 823746 824595 824587 823408 821288 818861 816670 814627 812275
59751H12275k767k931l085l424l456k802k183k645l910m502l675k449k359l692
$$ 812275 809508 806577 803492 800068 796612 793810 791627 788982 785072 780570 776895 774446 772087 768395
59737G68395n315n937n288m163l497l435l268k407j221o98j199j870j525k4J428
$$ 768395 763080 757143 751855 747692 744195 740760 737492 735085 733864 733166 731967 730097 728572 728548 729976
59722G29976J581N19n33p80o26o28k62J406L979N685N358L760K470K030J917J819
$$ 729976 731557 732076 731543 730763 730137 729509 729247 730653 734632 740317 745675 749435 751905 753935 755852 757671
59706G57671K001K397K279J359O21J328L285M774M454K871J631J553K107K477
$$ 757671 759672 762069 764348 765707 766328 767656 770941 775715 780169 783040 784671 786224 788331 790808
59692G90808K413K099K002K897N134P495P846N707L324L114M659N437M221K380
$$ 790808 793221 795320 797322 800219 805353 812848 820694 826401 829725 832839 837498 842935 847156 849536
59678H49536J732K414L326L685L448K796J857Q09%l9J035K518K585P2l672n784
$$ 849536 851268 853682 857008 860693 864141 866937 868794 869603 869603 869564 870599 873117 875702 875774 872102 866318
59662H66318m936k575q34l18m22p70j312j679j467r32n93l63K19J036J420J038
$$ 866318 861382 858807 857973 857655 857233 856463 855151 853472 852005 851073 850480 850117 850336 851372 852792 853830
59646H53830K58m62r58j144q73j71O45J201J282R88P90J210K107K551J830M42
$$ 853830 854088 853626 852668 851524 850651 850480 851125 852326 853608 854596 855386 856596 858703 861254 863084 863526
59630H63526m96o27n49n78j82Q62J519N35j721l441l471k508j925k111k578l083
$$ 863526 863030 862403 861854 861276 861094 861956 863475 864010 862289 858848 855377 852869 850944 848833 846255 843172
59614H43172l771m453m641m377m286m644n057n277n560n857n402l863k232j754
$$ 843172 839401 834948 830307 825930 821644 817000 811943 806666 801106 795249 789847 785984 783752 781998
59600G81998k164j832J65K744L896K856R72M05K020M654O492O757N874M415K790
$$ 781998 779834 778002 778167 780911 784807 787663 788635 789040 791060 795714 802206 808963 814837 819252 822042
59585H22042J697J769K492K430R38j194l055m548n568n471m171k858k594l050
$$ 822042 823739 825508 828000 830430 831368 830174 827119 822571 817003 811532 807361 804503 801909 798859
59571G98859l410l623l808l350j925n80m48j022j086p41r58j659j976k106l092
$$ 798859 795449 791826 788018 784668 782743 782163 781715 780693 779607 778866 777908 776249 774273 772167 769075
59556G69075m710n370m445l171k734k740k098m76J525K883K756J397L55Q72K281
$$ 769075 764365 758995 754550 751379 748645 745905 743807 743331 744856 747739 750495 751892 752247 753119 755400
59541G55400L079L050K920K368M12k255l477k599j330r46o07N75J683J558Q43
$$ 755400 758479 761529 764449 766817 767229 764974 761497 758898 757568 756622 756015 756590 758273 759831 760674
59526G60674R07J676J919J154R3m76m76m33r21j855k344j893j498k374l796l759
$$ 760674 761581 763257 765176 766330 766423 765947 765471 765038 764117 762262 759918 758025 756527 754153 750357 746598
59510G46598j953k76O3Q2R13J963K322K262K136J370n4o47M51J719J484O73J360
$$ 746598 744645 744369 744432 744514 745427 747390 749712 751974 754110 755480 755426 754779 755230 756949 758433 759106 760466
59493G60466L413M712M341L574L706M580N384N685N536N506O459Q445J0183J0729
$$ 760466 763879 768591 772932 776506 780212 784792 790176 795861 801397 806903 813362 821807 831990 842719
59479H42719J1244J3816J8569K2993K4004K0010J1518J115p436j1498j1414r463
$$ 842719 853963 867779 886348 909341 933345 953355 964873 965988 958552 947054 935640 926177
59467I26177p298n251l556k677k276j261N84J999J777L82o06k65P54R93k37k170
$$ 926177 918879 913628 910072 907395 905119 903858 904442 906441 908218 908600 907994 907729 908483 909476 909239 907069
59451I07069l549m136m727n796o957p877q782r574r533q524p504p187p011o334
$$ 907069 903520 899384 894657 888861 881904 874027 865245 855671 846138 837614 830110 822923 815912 809578
59437H09578n592n317m975l923k666j982j548p47n3j86n42RJ206J862J882K304
$$ 809578 803986 798669 793694 789771 787105 785123 783575 782828 782775 782589 782047 782056 783262 785124 787006 789310
59421G89310L448M572N326O148P138P795Q012Q096P770O402M360K931K613K559
$$ 789310 792758 797330 802656 808804 815942 823737 831749 839845 847615 854017 858377 861308 863921 866480
59407H66480K013J339J290J985K928L424K974J842J235K232M644P278R101R579
$$ 866480 868493 869832 871122 873107 876035 879459 882433 884275 885510 887742 892386 899664 908765 918344
59393I18344Q561O721N604O200P745Q872R421J0024J0434R624P380M548J836o22
$$ 918344 926905 933626 939230 945430 953175 962047 971468 981492 991926 1001550 1008930 1013478 1015314 1014692
59379A014692k752m596o613q799r939q952o546m374l033k198k050k782l212j884
$$ 1014692 1011940 1007344 1000731 991932 981993 973041 966495 962121 959088 956890 954840 952058 948846 946962
59365I46962O44K470L280M633P241J0079J2469J5036J8006K0453K1948K3396K5614
$$ 946962 947606 950076 953356 957989 965230 975309 987778 1002814 1020820 1041273 1063221 1086617 1112231
59352A112231K8476L1686L4533L4483K8307J5951J728r435j5694j7869j7198j4750
$$ 1112231 1140707 1172393 1206926 1241409 1269716 1285667 1287395 1277960 1262266 1244397 1227199 1212449
59340A212449j1289o426O84Q411J1867P007m990j8561k8425l2675l2492l0338
$$ 1212449 1201160 1194734 1195418 1203829 1215696 1222703 1217713 1199152 1170727 1138052 1105560 1075222
59328A075222k8072k5802k2644j8706j5332j2946j0173o105k193n09j029j928
$$ 1075222 1047150 1021348 998704 979998 964666 951720 941547 935442 933249 932740 931711 929783
59316I29783k002j542j184r42k73J449M174O657P351O235M879M505M936N691O675
$$ 929783 927781 926239 925055 924113 923840 925289 929463 936120 943471 949706 954585 959090 964026 969717 976392
59301I76392P400P144O651P864J0852J2845J1818R495Q983J0732J2734J3607J3535
$$ 976392 983792 990936 997587 1005451 1016303 1029148 1040966 1050461 1059444 1070176 1082910 1096517 1110052
59288A110052J2973J2422J2901J4697J6190J5764J4317J3858J4190J3268J0715
$$ 1110052 1123025 1135447 1148348 1163045 1179235 1194999 1209316 1223174 1237364 1250632 1261347
59277A261347Q509P757P038M758J362j802m373o652q535r812j0884j2245j3571
$$ 1261347 1269856 1277613 1284651 1289409 1290771 1288969 1284596 1277944 1269409 1259597 1248713 1236468 1222897
59264A222897j3980j3026j1248r864r804j0767j1406j0777r223p451n399k794
$$ 1222897 1208917 1195891 1184643 1174779 1164975 1154208 1142802 1132025 1122802 1115351 1109952 1107158
59252A107158j08K037L858N739P196P750Q250R656J0913R797N921J222k656n799
$$ 1107158 1107050 1109087 1112945 1118684 1125880 1133630 1141880 1151536 1162449 1172246 1178167 1179389 1176733 1170934
59238A170934q629j0894j2584j4271j5811j6127j5036j3843j3269j2315j0176
$$ 1170934 1162305 1151411 1138827 1124556 1108745 1092618 1077582 1063739 1050470 1038155 1027979
59227A027979p903o820o494n713m584m038l886l084j652o73l31N60K640M867N936
$$ 1027979 1020076 1013256 1006762 1001049 996465 992427 988541 985457 983805 983132 982801 983361 986001 990868 996804
59212I96804N964O021O569P246P912R018J0644J1784J1243R205P347P028P710
$$ 996804 1002768 1008789 1015358 1022604 1030516 1039534 1050178 1061962 1073205 1082410 1089757 1096785 1104495
59199A104495P620N710K426j276m821p777r516r696q740p410o233n529n541o113
$$ 1104495 1112115 1117825 1120251 1118975 1114154 1106377 1096861 1087165 1078425 1071015 1064782 1059253 1053712 1047599
59185A047599o593o481n942n296m283k467j88J428J652R55N65J338L101M894N822
$$ 1047599 1041006 1034525 1028583 1023287 1019004 1016537 1016349 1017777 1019429 1020384 1020949 1022287 1025388 1030282 1036104
59170A036104N762N349N209N251M748L179R03j062j985k129k297k797l206l345
$$ 1036104 1041866 1047215 1052424 1057675 1062423 1065602 1066505 1065443 1063458 1061329 1059032 1056235 1053029 1049684
59156A049684l814n087o465o703n513l673j792L2J281R92p46k287k331j506j141
$$ 1049684 1045870 1040783 1034318 1027615 1022102 1018429 1016637 1016669 1017950 1018942 1018196 1015909 1013578 1012072 1010931
59141A010931j191o01P61J981K748L625M448M045K153K59m43o78j515k234j441
$$ 1010931 1009740 1009139 1009900 1011881 1014629 1018254 1022702 1026747 1028900 1029159 1028716 1028038 1026523 1024289 1022848
59126A022848L03R32k6o36N39K269K522J326N33J286K844L750L296K005J293K418
$$ 1022848 1023151 1024083 1024057 1023421 1023960 1026229 1028751 1030077 1030610 1031896 1034740 1038490 1041786 1043791 1045084 1047502
59110A047502N096P477Q108P632P683Q509Q782P765O465O179O826P285O839N690
$$ 1047502 1052598 1060075 1068183 1075815 1083498 1092007 1100789 1108554 1115019 1121198 1128024 1135309 1142148 1147838
59096A147838M292K824J247l45j601k272k687l482m657n436n548o001p704r777
$$ 1147838 1152130 1154954 1156201 1155856 1154255 1151983 1149296 1145814 1141157 1135721 1130173 1124172 1116468 1106691
59082A106691j0393r205p650o867o550o213o248p074q232r017r197q609o999m946
$$ 1106691 1096298 1087093 1079443 1072576 1066026 1059813 1053565 1046491 1038259 1029242 1020045 1011436 1004437 999491
59068I99491l919m512n391m919l089r83R19K734M127M613M646N233O486P572Q035
$$ 999491 995572 991060 985669 980750 977661 976678 977597 980331 984458 989071 993717 998950 1005436 1013008 1021043
59053A021043Q188Q239Q045P888Q497R950J1241J1318J0088Q179O262M846M187
$$ 1021043 1029231 1037470 1045515 1053403 1061900 1071850 1083091 1094409 1104497 1112676 1118938 1123784 1127971
59040A127971L974L370J797k95j656j454l01J31j122l118m122l761l315l714m324
$$ 1127971 1131945 1135315 1137112 1136817 1135161 1133707 1133406 1133537 1132415 1129297 1125175 1121414 1118099 1114385 1110061
59025A110061m229l695l530l794m171m945o494q236r256r626r977j0051r012p161
$$ 1110061 1105832 1102137 1098607 1094813 1090642 1085697 1079203 1070967 1061711 1052085 1042108 1032057 1023045 1015884
59011A015884n862n592n429m850m589n027n046l615j557n56r48j789k629l830
$$ 1015884 1010022 1004430 999001 994151 989562 984535 979489 975874 974317 973761 972813 971024 968395 964565
58997I64565n048m951l133j189q15j545j548l52O69O08K80M99O23ll53Q10K601
$$ 964565 959517 954566 951433 950244 949429 947884 946336 945984 946653 947261 947541 948040 948663 948660 948307 949117 951718
58980I51718L163K689K956L896L341R64l06J574M524N411M505M266N172N773O100
$$ 951718 954881 957570 960526 964422 967763 968727 968421 969995 974519 979930 984435 988701 993873 999646 1005746
58965A005746P792J0664J2226J1366J0005J0036J0760J0774J0478J1119J2617
$$ 1005746 1013538 1024202 1036428 1047794 1057799 1067835 1078595 1089369 1099847 1110966 1123583
58954A123583J3808J4002J3119J1084Q283N792M082K251k72k050j229J640L974
$$ 1123583 1137391 1151393 1164512 1175596 1183879 1189671 1193753 1196004 1195732 1193682 1192453 1194093 1198067
58941A198067M472M570O100Q686J0405J0423R917J0361J1702J2686J2595J1971
$$ 1198067 1202539 1207109 1213209 1221895 1232300 1242723 1252640 1263001 1274703 1287389 1299984 1311955
58929A311955J1556J1156J0124Q553P340P048P249P116O373N607N878P885J1152
$$ 1311955 1323511 1334667 1344791 1353344 1360684 1367732 1374981 1382097 1388470 1394077 1399955 1407840 1418992
58916A418992J4111J5369J4919J3932J3599J4437J6203J7944J8538J7934J7473
$$ 1418992 1433103 1448472 1463391 1477323 1490922 1505359 1521562 1539506 1558044 1575978 1593451
58905A593451J8229J9344J9110J7485J6327J6926J8441J9096J8010J5388J1884
$$ 1593451 1611680 1631024 1650134 1667619 1683946 1700872 1719313 1738409 1756419 1771807 1783691
58894A783691Q414O027N040M496K875n92n206r126j0647r660p799o720o528o444
$$ 1783691 1792105 1798132 1803172 1807668 1810543 1809951 1804745 1795619 1784972 1775312 1767513 1760793 1754265 1747821
58880A747821o454p085p991q256q200r312j1841j4016j4520j4481j5680j7565
$$ 1747821 1741367 1734282 1726291 1718035 1709835 1700523 1688682 1674666 1660146 1645665 1629985 1612420
58868A612420j7585j4506j0341q496j0275j3533j4873j3022r607o705m594k679
$$ 1612420 1594835 1580329 1569988 1561492 1551217 1537684 1522811 1509789 1500182 1493477 1488883 1486204
58856A486204j425j653k427j662J008L713N163O173P635Q847R007Q922R904J2017
$$ 1486204 1484779 1483126 1480699 1479037 1480045 1483758 1488921 1495094 1502729 1511576 1520583 1529505 1539409 1551426
58842A551426J4595J7357J9680J9959J7403J3825J2006J2525J3560J3439J2074
$$ 1551426 1566021 1583378 1603058 1623017 1640420 1654245 1666251 1678776 1692336 1705775 1717849
58831A717849J0168Q458P771Q576J0133J1033J0756J0038R661R551Q980P138L706
$$ 1717849 1728017 1736475 1744246 1752822 1762955 1773988 1784744 1794782 1804443 1813994 1822974 1830112 1833818
58818A833818n73m238o640q708j1457j4337j6191j7332j9209k1933k3760k3485
$$ 1833818 1833245 1829007 1822367 1813659 1802202 1787865 1771674 1754342 1735133 1713200 1689440 1665955
58806A665955k2203k1766k2301k2254k0615j8257j6778j6527j6320j5100j3436
$$ 1665955 1643752 1621986 1599685 1577431 1556816 1538559 1521781 1505254 1488934 1473834 1460398
58795A460398j2836j3861j5584j6867j7344j6958j5620j3873j2964j3318j3683
$$ 1460398 1447562 1433701 1418117 1401250 1383906 1366948 1351328 1337455 1324491 1311173 1297490
58784A297490j2727j0887r661r522r736r870j0222j0755j0795j0105r328r039
$$ 1297490 1284763 1273876 1264215 1254693 1244957 1235087 1224865 1214110 1203315 1193210 1183882 1174843
58772A174843r026q708p762o220m401k874k043j736j511j197q35l74J25M20O52
$$ 1174843 1165817 1157109 1149347 1143127 1138726 1135852 1133809 1132073 1130562 1129365 1128530 1128156 1128281 1128701 1129353
58757A129353J450K744L200J907J16l8J605L042K785J366p2j379k942m689o230
$$ 1129353 1130803 1133547 1136747 1138654 1138770 1138732 1140337 1143379 1146164 1147530 1147458 1146079 1143137 1138448 1132218
58742A132218p282p433o309m466l359l772m888n498n495n593o111o924q071r475
$$ 1132218 1124936 1117503 1111194 1106728 1103369 1099597 1094709 1089211 1083716 1078123 1072012 1065088 1057017 1047542
58728A047542j0177q851n551k335j545l288n011m035n50K492K800J411J063K470
$$ 1047542 1037365 1028514 1022963 1020628 1019083 1015795 1010784 1006749 1006199 1008691 1011491 1012902 1013965 1016435
58714A016435L658L111J758R84R7k486o208q493p989o106m739l972k983k100k404
$$ 1016435 1020093 1023204 1024962 1025946 1026043 1023557 1017349 1008856 1000867 994761 990022 986050 983067 980967 978563
58699I78563l647m178l207j896j566j810j266K83J690K098J882J844K264K966
$$ 978563 974916 970738 967531 965635 964069 962259 960993 961276 962966 965064 966946 968790 971054 974020
58685I74020L664L957L536K742K468L268M916O874Q612R399Q658P102O619Q148
$$ 974020 977684 981641 985177 987919 990387 993655 998571 1005445 1014057 1023456 1032114 1039216 1045835 1053983
58671A053983J0224J0597Q973P162O575O749O663O460O954P929Q075O830N436
$$ 1053983 1064207 1074804 1083777 1090939 1097514 1104263 1110926 1117386 1124340 1132269 1140344 1147174 1152610
58658A152610N441O462O484M641K698K934N154O989P040O378O480O897N902K900
$$ 1152610 1158051 1164513 1170997 1175638 1178336 1181270 1186424 1193413 1200453 1206831 1213311 1220208 1226110 1229010
58644A229010q35l688n399p073r719j2903j5050j5314j4728j4907j6070j7254
$$ 1229010 1228175 1224487 1219088 1212015 1202296 1189393 1174343 1159029 1144301 1129394 1113324 1096070
58632A096070j8091j8875j9016j7260j4023j1675j1473j1742j0397p923o380o522
$$ 1096070 1077979 1059104 1040088 1022828 1008805 997130 985657 973915 963518 955595 949215 942693
58620I42693p414q081p968o607m365k866l077l623k671o90N80J223K692M637M941
$$ 942693 935279 927198 919230 912623 908258 905392 902315 898692 896021 895331 895911 897134 899826 904463 909404
58605I09404L461K984N297Q528R914R453Q899Q365O176J817k681m855m394l165
$$ 909404 912865 915849 921146 929674 939588 949041 957940 966305 972481 974298 971617 966762 962368 959203
58591I59203l028m004m717m459m207n100o530o765n230l209k095k021k324k457
$$ 959203 956175 952171 947454 942995 938788 933688 927158 920393 915163 911954 909859 907838 905514 903057
58577I03057k121j265k56N34J215J879J859N73j160j961j886k156k874k736j357
$$ 903057 900936 899671 899415 899949 901164 903043 904902 905475 904315 902354 900468 898312 895438 892702 891345
58562H91345j71k74r96j428j842k557k798j976q69k04Q52L224N917P046O456N728
$$ 891345 891174 890900 889904 888476 886634 884077 881279 879303 878434 878230 879082 882306 888223 895269 901725 907453
58546I07453N741N712M739L139J943J760K359K921K799K178J713J370L93j142
$$ 907453 913194 918906 923645 926784 928727 930487 932846 935767 938566 940744 942457 943827 944220 943078
58532I43078j702r0K754M744M943M156L740M660P096J0088J1988J2189J1931J2525
$$ 943078 941376 941286 944040 948784 953727 957883 961623 966283 973379 983467 995455 1007644 1019575 1032100
58518A032100J3439J3254J1898J0599J0004R805R957J0726J1550J1463J0918J1678
$$ 1032100 1045539 1058793 1070691 1081290 1091294 1101099 1111056 1121782 1133332 1144795 1155713 1167391
58506A167391J4401J7617J9791K1216K3062K5470K7625K9043K9861L0020K8953
$$ 1167391 1181792 1199409 1219200 1240416 1263478 1288948 1316573 1345616 1375477 1405497 1434450
58495A434450K6212K2176J8136J5537J4560J3563J0640N794Q95k717n484q182
$$ 1434450 1460662 1482838 1500974 1516511 1531071 1544634 1555274 1561068 1561963 1559246 1553762 1545580
58483A545580j0404j1424j1718j2468j4031j5939j8068k0591k2879k3720k2890
$$ 1545580 1535176 1523752 1512034 1499566 1485535 1469596 1451528 1430937 1408058 1384338 1361448
58472A361448k1564k0749k0183j9219j7977j6903j5859j4407j2653j1001r325
$$ 1361448 1339884 1319135 1298952 1279733 1261756 1244853 1228994 1214587 1201934 1190933 1181608
58461A181608p203m875l266k897l276l554l307k611j746j098r79j385k051k762
$$ 1181608 1174405 1169530 1166264 1163367 1160091 1156537 1153230 1150619 1148873 1147775 1146796 1145411 1143360 1140598
58447A140598l367l659l568l343l140k709j973j628k265l126k785r76J271L327
$$ 1140598 1137231 1133572 1130004 1126661 1123521 1120812 1118839 1117211 1114946 1111820 1109035 1108059 1109330 1112657
58433A112657N324O655N997L734K565M169O558O594M304K734L945O960R742J1478
$$ 1112657 1117981 1124636 1130633 1134367 1136932 1141101 1147659 1154253 1158557 1161291 1165236 1172196 1181938 1193416
58419A193416J2607J3817J5416J6896J7162J5947J4581J4322J4477J3549J1661
$$ 1193416 1206023 1219840 1235256 1252152 1269314 1285261 1299842 1314164 1328641 1342190 1353851
58408A353851R966Q080M317j177n685p075n933l872j529P70K045J770Q67N13Q74
$$ 1353851 1363817 1371897 1376214 1375037 1369352 1362277 1356344 1352472 1350943 1351713 1353758 1355528 1356395 1356908 1357782
58393A357782J795L501N679P051O962O407O380O317N194L042K24l610q305j1880
$$ 1357782 1359577 1363078 1368757 1375808 1382770 1389177 1395557 1401874 1407068 1410110 1410334 1406724 1398419 1386539
58379A386539j2218r754o971n566n305n352n282m813l681j972J42K689N320O982
$$ 1386539 1374321 1364567 1357596 1352030 1346725 1341373 1336091 1331278 1327597 1325625 1325767 1328456 1333776 1340758
58365A340758P139O885P781R838J1624J2091J1403J0150Q665P012M960K213p67
$$ 1340758 1347897 1354782 1362563 1372401 1384025 1396116 1407519 1417669 1426334 1433346 1438306 1440519 1439752
58352A439752k719l071k828l048l311k885k619m022o698q462q064o385m735l358
$$ 1439752 1437033 1433962 1431134 1428086 1424775 1421890 1419271 1415249 1408551 1400089 1392025 1385640 1380905 1377547
58338A377547k047r89k92M52J641L195M819O145O585N818M580M158M846N725O118
$$ 1377547 1375500 1374511 1374219 1374671 1376312 1379507 1384326 1390471 1397056 1402874 1407454 1411612 1416458 1422183 1428301
58323A428301O439P260Q347R191R877J0810J1853J2309J1635R974Q095O935O982
$$ 1428301 1434740 1442000 1450347 1459538 1469415 1480225 1492078 1504387 1516022 1525996 1534091 1541026 1548008
58310A548008P920Q918R338R230R241J0049J1682J3355J4301J4747J5531J6719
$$ 1548008 1555928 1564846 1574184 1583414 1592655 1602704 1614386 1627741 1642042 1656789 1672320 1689039
58298A689039J7357J6968J6484J6988J8191J8906J8649J7815J6635J4919J2874
$$ 1689039 1706396 1723364 1739848 1756836 1775027 1793933 1812582 1830397 1847032 1861951 1874825
58287A874825J1266J0573J0504J0607J0957J1964J3670J5467J6678J7406J8497
$$ 1874825 1886091 1896664 1907168 1917775 1928732 1940696 1954366 1969833 1986511 2003917 2022414
58276B022414K0307K1916K2307K2005K2553K4347K6171K7163K7879K8848K9340
$$ 2022414 2042721 2064637 2086944 2108949 2131502 2155849 2182020 2209183 2237062 2265910 2295250
58265B295250K8577K7154K6129K5449K4444K3299K2890K3373K3922K3859K3363
$$ 2295250 2323827 2350981 2377110 2402559 2427003 2450302 2473192 2496565 2520487 2544346 2567709
58254B567709K3077K3461K4463K5663K6846K8344L0408L2582L4412L6339L8726
$$ 2567709 2590786 2614247 2638710 2664373 2691219 2719563 2749971 2782553 2816965 2853304 2892030
58243B892030M0540M0582L9827M0521M2856M4752M5267M5688M6522M6139M3906
$$ 2892030 2932570 2973152 3012979 3053500 3096356 3141108 3186375 3232063 3278585 3324724 3368630
58232C368630M2194M3334M6585M9926N2911N5853N8160N9661O1812O5493O9242
$$ 3368630 3410824 3454158 3500743 3550669 3603580 3659433 3717593 3777254 3839066 3904559 3973801
58221C973801P1747P4237P8176Q2456Q5432Q7918R1393R5002R7276R9216J02539
$$ 3973801 4045548 4119785 4197961 4280417 4365849 4453767 4545160 4640162 4737438 4836654 4939193
58210D939193J06410J09280J12564J18763J27025J34323J40363J47554J56519
$$ 4939193 5045603 5154883 5267447 5386210 5513235 5647558 5787921 5935475 6091994
58201F091994J65455J73725J82461J91575J99677K07135K15891K26083K36034
$$ 6091994 6257449 6431174 6613635 6805210 7004887 7212022 7427913 7653996 7890030
58192G890030K45672K56699K69335K82127K95028L09496L25405L41087L56591
$$ 7890030 8135702 8392401 8661736 8943863 9238891 9548387 9873792 10214879 10571470
58183A0571470L73856L93681M15548M40075M68429M99764N32630N68215O08426
$$ 10571470 10945326 11339007 11754555 12194630 12663059 13162823 13695453 14263668 14872094
58174A4872094O51420O92999P31695P68452Q02528Q33008Q63550Q99923R42936
$$ 14872094 15523514 16216513 16948208 17716660 18519188 19352196 20215746 21115669 22058605
58165B2058605R89452J040175J100175J171371J250975J338299J436628J546980
$$ 22058605 23048057 24088232 25188407 26359778 27610753 28949052 30385680 31932660
58157C1932660J666030J791458J923504K060597K200475K347035K509633K694644
$$ 31932660 33598690 35390148 37313652 39374249 41574724 43921759 46431392 49126036
58149D9126036K904311L143852L421388L740174M099880M506867M975175N518574
$$ 49126036 52030347 55174199 58595587 62335761 66435641 70942508 75917683 81436257
58141H1436257O153033O906349P810815Q883560J0126075J1542237J3140337J4916400
$$ 81436257 87589290 94495639 102306454 111190014 121316089 132858326 145998663 160915063
58133A60915063J6850748J8916500K1077039K3304470K5641931K8166129L0660107
$$ 160915063 177765811 196682311 217759350 241063820 266705751 294871880 325531987
58126C25531987L2167783L1025199K5729113J6117688L807069q585188j8781270
$$ 325531987 357699770 388724969 414454082 430571770 434378839 425793651 407012381
58119D07012381k5698017k9403401l0571301k9991709k8337466k6104597k3629178
$$ 407012381 381314364 351910963 321339662 291347953 263010487 236905890 213276712
58112B13276712k1136152j8777936j6641267j4749724j3088029j1630343j0349688
$$ 213276712 192140560 173362624 156721357 141971633 128883604 117253261 106903573
58105A06903573r219377q221005p347222o589908n930860n349121m831183m368933
$$ 106903573 97684196 89463191 82115969 75526061 69595201 64246080 59414897 55045964
58097E5045964l954121l580779l248188k955972k699725k474466k277490k104101
$$ 55045964 51091843 47511064 44262876 41306904 38607179 36132713 33855223 31751122
58089C1751122j945472j795168j654102j525567j409330j303930j210500j129846
$$ 31751122 29805650 28010482 26356380 24830813 23421483 22117553 20907053 19777207
58081A9777207j058684r92674r30755q73275q18543p64718p13000o65686o22594
$$ 19777207 18718523 17725849 16795094 15921819 15103276 14338558 13625558 12959872 12337278
58072A2337278n82094n44086n09475m78121m49369m23210l99291l76358l54334
$$ 12337278 11755184 11211098 10701623 10223502 9774133 9350923 8951632 8575274 8220940
58063H220940l35107l19608l05900k91851k77952k65784k55407k45969k37299
$$ 8220940 7885833 7566225 7260325 6968474 6690522 6424738 6169331 5923362 5686063
58054E686063k29121k20121k09403j97766j86305j75192j64865j56603j50541
$$ 5686063 5456942 5236821 5027418 4829652 4643347 4468155 4303290 4146687 3996146
58045C996146j44828j38085j31193j25290j19874j14419j09937j07040j03970
$$ 3996146 3851318 3713233 3582040 3456750 3336876 3222457 3112520 3005480 2901510
58036B901510r8728r2046q6287q2214p8621p4402o9391o3813n8327n4149n1815
$$ 2901510 2802782 2710736 2624449 2542235 2463614 2389212 2319821 2256008 2197681 2143532 2091717
58025B091717n0258m8078m5109m1959l8902l6170l4443l4057l4374l4609l4436
$$ 2091717 2041459 1993381 1948272 1906313 1867411 1831241 1796798 1762741 1728367 1693758 1659322
58014A659322l3359l0863k7905k6715k7936k9389k8795k6500k4254k2786k1911
$$ 1659322 1625963 1595100 1567195 1540480 1512544 1483155 1454360 1427860 1403606 1380820 1358909
58003A358909k1656k1598k0291j7213j4353j4047j5918j7707j8304j8211j7572
$$ 1358909 1337253 1315655 1295364 1278151 1263798 1249751 1233833 1216126 1197822 1179611 1162039
57992A162039j5858j3454j1751j1347j1482j1361j1023j0848j1089j1825j2580
$$ 1162039 1146181 1132727 1120976 1109629 1098147 1086786 1075763 1064915 1053826 1042001 1029421
57981A029421j2346j0813r175q762r289r476q880q103p657p691q395r437r595
$$ 1029421 1017075 1006262 997087 988325 979036 969560 960680 952577 944920 937229 928834 919397 909802
57968I09802q268o915p473r529j0713r925q571q314r022r549r339q578p669p035
$$ 909802 901534 894619 887146 877617 866904 856979 848408 840094 831072 821523 812184 803606 795937 788902
57954G88902o875o647n517l524j724q59o43o07q87j735k894m007n170o453p228
$$ 788902 782027 775380 769863 766339 764615 763756 763113 762506 761619 759884 756990 752983 747813 741360 734132
57939G34132o644m807k986k403l017l758l902l801m009m175l533k308j704k212
$$ 734132 727488 722681 719695 717292 714275 710517 706615 702814 698805 694630 691097 688789 687085 684873
57925F84873k834k568j802j541j820j810j210o22p29j650l046m328m887m591l903
$$ 684873 682039 679471 677669 676128 674308 672498 671288 670666 669937 668287 665241 660913 656026 651435 647532
57910F47532l245k618k126k198k721k618j175O71J331N96k41j71M44N21o31k717
$$ 647532 644287 641669 639543 637345 634624 632006 630831 631502 632833 633429 633188 633017 633461 633982 633351 630634
57894F30634m476m582l084j524j030r86m74k14j483l524l845j406K018M139M480
$$ 630634 626158 621576 618492 616968 615938 614952 614478 614264 612781 609257 605412 604006 606024 610163 614643
57879F14643L833K807J892J988L581N707O712N951M284L027K934L844M809M739
$$ 614643 618476 621283 623175 625163 628744 634451 641163 647114 651398 654425 657359 661203 666012 670751
57865F70751L308J235n78j963l282m633n633n916n453m429l073j755j016j212
$$ 670751 674059 675294 674716 672753 669471 664838 659205 653289 647836 643407 640334 638579 637563 636351
57851F36351k072k678k142m33J552K617J971l97l471n428m999k979j633k071k924
$$ 636351 634279 631601 629459 629026 630578 633195 635166 634769 631298 625870 620871 617892 616259 614188 611264
57836F11264k434j037p23k147l815m212l495k597j735n25R69K017J889M79j511
$$ 611264 608830 607793 607070 604923 601108 596896 593401 590804 589069 588544 589513 591530 593419 593898 592387
57821E92387k858k681j180O58J990K448J824K51j304j611n65N67O54o4n02kJ178
$$ 592387 589529 586848 585668 586326 588316 590764 592588 592839 591535 589924 589359 589926 590580 590516 590014 590012 591190
57804E91190K175K157J168M40J272L373N065N369M984M727M102K457P72P87K409
$$ 591190 593365 595522 596690 597130 598402 601775 606840 612209 617193 621920 626022 628479 629251 630038 632447
57789F32447L369J865j283l734m149l079j835j265j543k433l505m486n524o786
$$ 632447 635816 637681 636398 632664 628515 625436 623601 622336 620793 618360 614855 610369 604845 598059
57775E98059p661p008m700k417j958k950l249j859l05l98j629j880k06K353M430
$$ 598059 590398 583390 578690 576273 574315 571365 568116 566257 565952 565554 563925 562045 561839 564192 568622
57760E68622N675O245O007M708K390n89l467n114m921l737l140l615m167l893
$$ 568622 574297 580542 586549 591257 593647 593058 589591 584477 579556 575819 572679 569064 564897 561004
57746E61004l048k290j741j338j236j236n63J084K778L461L274L025K818K241
$$ 561004 557956 555666 553925 552587 551351 550115 549552 550636 553414 556875 560149 563174 565992 568233
57732E68233J660K137L795N208M986L458K207K230L132M027M547M728M415L505
$$ 568233 569893 572030 575825 581033 586019 589477 591684 593914 597046 601073 605620 610348 614763 618268
57718F18268K569K568L632M670M608L602K631K256K332K517K479J860O73n25j418
$$ 618268 620837 623405 627037 631707 636315 639917 642548 644804 647136 649653 652132 653992 654665 654140 652722
57703F52722k407l597l955k608n94J77m91j043p68p16j604k551k729k766l346
$$ 652722 650315 646718 642763 640155 639561 639738 639247 638204 637436 636720 635116 632565 629836 627070 623724
57688F23724l849l587l256l724m149k949j68K457L543L101J888Q06N97J166J437
$$ 623724 619875 616288 613032 609308 605159 602210 602042 604499 608042 611143 613031 613837 614434 615600 617037
57673F17037Q35M01J349L075L890L369K515J901J159L58K69R00J119K50j008j698
$$ 617037 617872 618273 619622 622697 626587 629956 632471 634372 635531 635889 636158 637058 638177 638427 637419 635721
57657F35721j648j101l26L7o98k064k630j858q55p23j175j482j790k582l439l331
$$ 635721 634073 632972 632646 632683 631985 629921 627291 625433 624578 623855 622680 621198 619408 616826 613387 610056
57641F10056j814O02K852L727K613M42p46l2J205J121k54j435j700j570j373o62
$$ 610056 608242 608844 611696 615423 618036 618478 617732 617700 618905 620026 619772 618337 616637 615067 613694 613032
57625F13032P18K118L059L869M971O247P509Q917J0502J1945J3360J5664J9420
$$ 613032 613750 615868 618927 622796 627767 634014 641523 650440 660942 672887 686247 701911 721331
57612G21331K3670K6883K8906L1139L4683L8917M1982M1876L6920K6357J1623
$$ 721331 745001 771884 800790 831929 866612 905529 947511 989387 1026307 1052664 1064287
57601A064287l562j5522k3252k8144l1382l2681l1648k9076k6129k3093j9865
$$ 1064287 1060725 1045203 1021951 993807 962425 929744 898096 869020 842891 819798 799933
57590G99933j7054j5453j4665j3375j1166r122q243p879o434l385q2J569J055
$$ 799933 782879 767426 752761 739386 728220 719098 710855 702976 696542 693157 693075 694644 695699
57577F95699k87o88L62J982L122L399K847J693N94L54Q59J066N60K52P07P64q00
$$ 695699 695412 694724 695086 697068 700190 703589 706436 708129 708723 709077 709936 711002 711562 711814 712521 713285 712485
57560G12485k870l045r76J098J492J008J066J477J265N87M26J036J874K651L314
$$ 712485 709615 706570 705594 706692 708184 709192 710258 711735 713000 713587 714013 715049 716923 719574 722888
57545G22888L341K318J150J426L171M287K933q5j982r72J926M092M008K456J226
$$ 722888 726229 728547 729697 731123 734294 738581 741514 741429 739447 738475 740401 744493 748501 750957 752183
57530G52183J121J637K168K714L172K828J298l94n94J011K885L443K900K782L801
$$ 752183 753304 754941 757109 759823 762995 765823 767121 766727 766133 767144 770029 773472 776372 779154 782955
57515G82955M938M907L929L386L881M537M366L617L211L428L778L799L370K644
$$ 782955 787893 792800 796729 800115 803996 808533 812899 816516 819727 823155 826933 830732 834102 836746
57501H36746K181K765M388N937O647P177Q169Q507O757L942K806M009N142M383
$$ 836746 838927 841692 846080 852017 858664 865841 874010 882517 889274 893216 896022 900031 905173 909556
57487I09556L102L502N210O023N027L330K216K187L424N831Q589J0653J1587J1326
$$ 909556 912658 916160 921370 927393 932420 935750 937966 940153 943577 949408 957997 968650 980237 991563
57473I91563R704P191N271M843M899M242L878N877J0040J3544J4129J2067Q900
$$ 991563 1001267 1008458 1013729 1018572 1023471 1027713 1031591 1037468 1047508 1061052 1075181 1087248 1096148
57460A096148N940M373M875O264O124L904J868J830K355Q16k817o104p463p576
$$ 1096148 1102088 1106461 1111336 1117600 1123724 1127628 1129496 1131326 1133681 1134497 1131680 1125576 1118113 1110537
57446A110537p463o971n604l586j494L88J911K990M052N790Q030R496R379Q640
$$ 1110537 1103074 1096103 1090499 1086913 1085419 1085807 1087718 1090708 1094760 1100550 1108580 1118076 1127455 1136095
57432A136095R020J0946J3115J4131J3943J3455J3174J2671J1293R184P514P566
$$ 1136095 1145115 1156061 1169176 1183307 1197250 1210705 1223879 1236550 1247843 1257027 1264541 1272107
57420A272107R462J1818J2907J2280J1012J0356J0471J0743J0834J0846J0650
$$ 1272107 1281569 1293387 1306294 1318574 1329586 1339942 1350413 1361156 1371990 1382836 1393486
57409A393486R862Q638P920Q450R863J1114J1553J1300J0825J0508J0434J0349
$$ 1393486 1403348 1411986 1419906 1428356 1438219 1449333 1460886 1472186 1483011 1493519 1503953 1514302
57397A514302R958R433R306R667R837R329Q742R063J0253J1186J1018J0038R063
$$ 1514302 1524260 1533693 1542999 1552666 1562503 1571832 1580574 1589637 1599890 1611076 1622094 1632132 1641195
57384A641195Q660R203J1055J3972J6562J7130J5378J2921J1657J1811J2059J1609
$$ 1641195 1649855 1659058 1670113 1684085 1700647 1717777 1733155 1746076 1757733 1769544 1781603 1793212
57372A793212J1356J2476J4422J5381J4570J3160J2627J3165J4112J5126J6116
$$ 1793212 1804568 1817044 1831466 1846847 1861417 1874577 1887204 1900369 1914481 1929607 1945723
57361A945723J6668J6430J5795J5447J5350J4895J3962J3221J3356J4485J6204
$$ 1945723 1962391 1978821 1994616 2010063 2025413 2040308 2054270 2067491 2080847 2095332 2111536
57350B111536J7826J8683J8674J8388J8385J8532J8429J8139J8041J8203J8374
$$ 2111536 2129362 2148045 2166719 2185107 2203492 2222024 2240453 2258592 2276633 2294836 2313210
57339B313210J8383J8123J7515J6870J6872J7704J8617J8863J8514J7865J6828
$$ 2313210 2331593 2349716 2367231 2384101 2400973 2418677 2437294 2456157 2474671 2492536 2509364
57328B509364J5719J5775J7606J9795K0452J9783J9616K0662K1750K1892K1470
$$ 2509364 2525083 2540858 2558464 2578259 2598711 2618494 2638110 2658772 2680522 2702414 2723884
57317B723884K1096K0695K0197J9997K0268K0761K1483K2509K3047K2016J9812
$$ 2723884 2744980 2765675 2785872 2805869 2826137 2846898 2868381 2890890 2913937 2935953 2955765
57306B955765J8170J7968J8477J9066K0117K1648K2717K2965K3312K4161K4387
$$ 2955765 2973935 2991903 3010380 3029446 3049563 3071211 3093928 3116893 3140205 3164366 3188753
57295C188753K3313K2328K3105K5172K6652K6694K5977K5478K5806K7074K8452
$$ 3188753 3212066 3234394 3257499 3282671 3309323 3336017 3361994 3387472 3413278 3440352 3468804
57284C468804K8565K7286K6218K6437K6979K6776K6843K8623L1142L1953L0565
$$ 3468804 3497369 3524655 3550873 3577310 3604289 3631065 3657908 3686531 3717673 3749626 3780191
57273C780191K8943K8581K8904K8823K8309K7923K7900K8163K8429K8253K7574
$$ 3780191 3809134 3837715 3866619 3895442 3923751 3951674 3979574 4007737 4036166 4064419 4091993
57262D091993K6957K6655K6030K4925K4665K6233K8140K8125K6653K6509K8800
$$ 4091993 4118950 4145605 4171635 4196560 4221225 4247458 4275598 4303723 4330376 4356885 4385685
57251D385685L1480L2410L1870L1217L0848L0555L0521L0763L0649K9903K9163
$$ 4385685 4417165 4449575 4481445 4512662 4543510 4574065 4604586 4635349 4665998 4695901 4725064
57240D725064K8834K8416K7735K7625K8475K9274K9074K8387K8023K7568K6385
$$ 4725064 4753898 4782314 4810049 4837674 4866149 4895423 4924497 4952884 4980907 5008475 5034860
57229E034860K5257K5492K6966K8464K9558L0621L1213L0220K7904K6323K6894
$$ 5034860 5060117 5085609 5112575 5141039 5170597 5201218 5232431 5262651 5290555 5316878 5343772
57218E343772K8602K9494K9219K9125L0169L1738L2695L2839L2780L2751L2220
$$ 5343772 5372374 5401868 5431087 5460212 5490381 5522119 5554814 5587653 5620433 5653184 5685404
57207E685404L0830K9133K7992K7613K7512K7268K6796K6104K5298K4836K5290
$$ 5685404 5716234 5745367 5773359 5800972 5828484 5855752 5882548 5908652 5933950 5958786 5984076
57196E984076K6775K8990L1589L4110L5908L6868L7976M0164M2710M3811M2917
$$ 5984076 6010851 6039841 6071430 6105540 6141448 6178316 6216292 6256456 6299166 6342977 6385894
57185F385894M1345M0192L8829L6301L3247L1264L0708L0135K7950K4014J9570
$$ 6385894 6427239 6467431 6506260 6542561 6575808 6607072 6637780 6667915 6695865 6719879 6739449
57174F739449J5986J3676J2096J0654R374Q404P282N428L280K147K738M602P033
$$ 6739449 6755435 6769111 6781207 6791861 6801235 6809639 6816921 6822349 6825629 6827776 6830514 6835116 6842149
57161F842149R756J2518J5014J7520K0802K4818K8466L1058L3158L5223L6407
$$ 6842149 6851905 6864423 6879437 6896957 6917759 6942577 6971043 7002101 7035259 7070482 7106889
57150G106889L5637L3301L0894K9391K8779K8714K8763K8202K6500K4154K2496
$$ 7106889 7142526 7175827 7206721 7236112 7264891 7293605 7322368 7350570 7377070 7401224 7423720
57139G423720K2488K3925K5677K6551K6168K5084K3983K2965K2113K2421K4945
$$ 7423720 7446208 7470133 7495810 7522361 7548529 7573613 7597596 7620561 7642674 7665095 7690040
57128G690040K9046L2695L4984L7149M0473M4432M7841N0799N4240N8222O1810
$$ 7690040 7719086 7751781 7786765 7823914 7864387 7908819 7956660 8007459 8061699 8119921 8181731
57117H181731O4239O5241O4525O1891N7661N2231M5349L6432K5598J4118M020
$$ 8181731 8245970 8311211 8375736 8437627 8495288 8547519 8592868 8629300 8654898 8669016 8673036
57106H673036k837o024o903p092o570m420j234P76M41j274l348o041r366j2029
$$ 8673036 8670199 8664175 8657272 8650180 8643610 8639190 8637956 8638732 8639173 8637899 8634551 8628510 8619144 8607115
57092H607115j3172j3545j3696j2610r583n972l590k829l713o978j2344j7648
$$ 8607115 8593943 8580398 8566702 8554092 8544509 8538537 8534947 8532118 8528405 8521427 8509083 8491435
57080H491435k1745k6606l4297m3568n1830n8815o5552p1437p5373p8535q2680
$$ 8491435 8469690 8443084 8408787 8365219 8313389 8254574 8189022 8117585 8042212 7963677 7880997
57069G880997q6804q8922r0253r4087j01043j09076j17645j28132j40162j51399
$$ 7880997 7794193 7705271 7615018 7520931 7419888 7310812 7193167 7065035 6924873 6773474
57059F773474j61368j72186j85148j99686k15772k34098k53894k73785k94642
$$ 6773474 6612106 6439920 6254772 6055086 5839314 5605216 5351322 5077537 4782895
57050D782895l18069l42437l64211l82884m00503m16752m28883m36090m39118
$$ 4782895 4464826 4122389 3758178 3375294 2974791 2558039 2129156 1693066 1253948
57041A253948m35879C95387d035l68134l27206k73778k12042j53156j08442q9627
$$ 1253948 818069 395387 -4035 -372169 -699375 -973153 -1185195 -1338351 -1446793 -1536420
57031a536420j11782j83682k95630m28070n69481p14200q59732j046841j399205
$$ -1536420 -1648202 -1831884 -2127514 -2555584 -3125065 -3839265 -4698997 -5745838 -7145043
57022g145043k048275k949298l791529m167819l873129l027886j923050p95958
$$ -7145043 -9193318 -12142616 -15934145 -20101964 -23975093 -27002979 -28926029 -29721987
57014b9721987K35658J102089J736363K108639K255507K250021K157288K023459
$$ -29721987 -29486329 -28384240 -26647877 -24539238 -22283731 -20033710 -17876422 -15852963
57006a5852963J883373J759558J659367J581981J524570J479313J432772J374077
$$ -15852963 -13969590 -12210032 -10550665 -8968684 -7444114 -5964801 -4532029 -3157952
56998c157952J300004f47401D58597R91311Q76829P70662O73863N85273N06044
$$ -3157952 -1857948 -647401 458597 1449908 2326737 3097399 3771262 4356535 4862579
56989D862579M36581L73643L13968K57638K05635J57689J14909Q0867N7186M0855
$$ 4862579 5299160 5672803 5986771 6244409 6450044 6607733 6722642 6803509 6860695 6901550
56979F901550K8128J8207J0894M023l380p846n138L350R903N643j4256m8005q7436
$$ 6901550 6929678 6947885 6958779 6962802 6959422 6951576 6946438 6949788 6959691 6965334 6951078 6903073 6815637
56966F815637j21960j44732j55359j57022j52812j45310j37052j29445j22484
$$ 6815637 6693677 6548945 6393586 6236564 6083752 5938442 5801390 5671945 5549461
56957E549461j16625j13400j13200j14306j15438j17607j22171j28766j36334
$$ 5549461 5432836 5319436 5206236 5091930 4976492 4858885 4736714 4607948 4471614
56948D471614j44474j52284j57773j60147j61208j62865j64649j65251j64871
$$ 4471614 4327140 4174856 4017083 3856936 3695728 3532863 3368214 3202963 3038092
56939C038092j64209j62688j59795j56875j55236j53457j48940j41587j33486
$$ 3038092 2873883 2711195 2551400 2394525 2239289 2085832 1936892 1795305 1661819
56930A661819j25460j16267j05381r4280q4347p5263o6140n7103m9075m3015l9674
$$ 1661819 1536359 1420092 1314711 1220431 1136084 1060821 994681 937578 888503 845488 805814
56919H05814l9176m0382m1334m0807l9035l6932l5091l3492l1641k8826k4711
$$ 805814 766638 726256 684922 644115 605080 568148 533057 499565 467924 439098 414387
56908D14387j9706j4593j0007o496m551l938l362j533J593N167Q651J1929J4279
$$ 414387 394681 380088 370081 363585 359034 355096 351734 350201 351794 356961 365612 377541 391820
56895C91820J4228J0875N018j414o910j1282j5060j8223j9824j9107j6632j3738
$$ 391820 406048 416923 421941 420527 413617 402335 387275 369052 349228 330121 313489 299751
56883B99751j1085q365n382k554j52K128M480O649Q682J1283J4787J8159J9652
$$ 299751 288666 280301 274919 272365 272213 274341 278821 285470 294152 305435 320222 338381 358033
56870C58033J8392J5009J0890O826K189m360j2842k0845k5304k5370k2938k0430
$$ 358033 376425 391434 402324 409150 411339 406979 394137 373292 347988 322618 299680 279250
56858B79250j8980j8503j8173j6698j3484r913q264q894r784r348q267p747p474
$$ 279250 260270 241767 223594 206896 193412 183499 175235 166341 156557 147209 138942 131195 123721
56845A23721o421m639k945j653o17O6M15J011K269L839N311O766Q081Q686Q734
$$ 123721 117300 112661 109716 108063 107446 107512 107927 108938 111207 115046 120357 127123 135204 143890 152624
56830A52624R402J1083J2511J2668J2390J2885J3647J3290J1409Q391M368k6k962
$$ 152624 162026 173109 185620 198288 210678 223563 237210 250500 261909 270300 274668 274642 271680
56817B71680l234k070j421j214j19J844L598N356Q194J1498J3339J3604J4390
$$ 271680 268446 266376 264955 263741 263622 265466 269064 274420 282614 294112 307451 321055 335445
56804C35445J6762J9487K1807K5067L0088L4740L5823L2253K5091J5582M874n189
$$ 335445 352207 371694 393501 418568 448656 483396 519219 551472 576563 592145 597019 591830
56792E91830j2739j7367j9817k0365j8540j4404r108l873R88N734J0410J4765
$$ 591830 579091 561724 541907 521542 503002 488598 479490 475617 476605 482339 492749 507514
56780E07514J8765K2715K6731L0490L3913L7800M2853M7742M9229M4956L5543
$$ 507514 526279 548994 575725 606215 640128 677928 720781 768523 817752 862708 898251
56769H98251K3076Q584p493k2911l3986l8982l9662l8623l6398l2270k6761k1605
$$ 898251 921327 929911 922418 899507 865521 826539 786877 748254 711856 679586 652825 631220
56757F31220j7441j3145p751j929L158P650J2535J7735K1854K4224K5926K7675
$$ 631220 613779 600634 592883 590954 594112 601762 614297 632032 653886 678110 704036 731711
56745G31711K7583K2717J2852J027r899j9419k7500l2698l3973l2958l2169l1631
$$ 731711 759294 782011 794863 795890 785991 766572 739072 706374 672401 639443 607274 575643
56733E75643k9454k5362k1338j8543j5780j1747p038k939L08L034N157O721Q423
$$ 575643 546189 520827 499489 480946 465166 453419 446381 443442 443750 446784 451941 458662 467085
56720D67085J0387J1139Q972L992k098p927j3165j7577k0540k1857k2297k2792
$$ 467085 477472 488611 497583 501575 499477 491550 478385 460808 440268 418411 396114 373322
56708C73322k3292k2829k0777j7757j5117j3716j3432j3721j4088j3907j2463
$$ 373322 350030 327201 306424 288667 273550 259834 246402 232681 218593 204686 192223
56697A92223r756o899n186m832m987m770l970l040k722l346m220m202l135k069
$$ 192223 182467 175568 170382 165550 160563 155793 151823 148783 146061 142715 138495 134293 131158 129089
56683A29089j762j771j614j817k888m063m197l257j902l04J435K368J726L92K3
$$ 129089 127327 125556 123942 122125 119237 115174 110977 107720 105818 105514 106949 109317 111043 111435 111458
56668A11458R59K243L250L796L170R25j511j980n17O16J07q38n76R67K907M509
$$ 111458 112417 114660 117910 121706 124876 125801 124290 122310 121793 122409 122516 121678 121102 122069 124976 129485
56652A29485N021L804J468k81n69k15j63k25J20P27J187J324Q94k24j296j303
$$ 129485 134506 138310 139778 139497 138928 138713 138550 138325 138445 139172 140359 141683 142577 142353 141057 139754
56636A39754n54m29j223j564n49R33J646J614J518J667K224L416M856N563N152
$$ 139754 139200 138771 137548 135984 135435 136368 138014 139628 141146 142813 145037 148453 153309 158872 164024
56621A64024M128K867J537J080K478M623M804K228p36j735j187o19j28R41K212
$$ 164024 168152 171019 172556 173636 176114 180737 185541 187769 187033 185298 184111 183492 183364 184305 186517
56606A86517K938L397M096M468L800K564J570O73l48o68L15J480J303J0j151j991
$$ 186517 189455 192852 196948 201416 205216 207780 209350 210023 209675 209007 209322 210802 212105 212115 210964 208973
56590B08973l046l804l082j103M57N89j84j098k158l587n110o068n859m490l003
$$ 208973 205927 202123 199041 197938 198395 198984 198800 197702 195544 191957 186847 180779 174920 170430 167427
56575A67427k887m447o254o647n304l057r88p0o35j647j558m29Q0o30j118m01
$$ 167427 164540 160093 153839 147192 141888 138831 137843 137773 137138 135491 133933 133504 133584 132954 131836 131435
56559A31435M53N24Q47K210L070J864p4m77K40P8p33j58J728K367O64j402j858
$$ 131435 131888 132412 133259 135469 138539 140403 140329 139852 140092 140170 139437 139279 141007 143374 144038 142636 140778
56542A40778j143m95%O63J017N65j60k11P09K063K791J967J30n76J203L789M325
$$ 140778 139635 139140 139140 139803 140820 141385 141225 141014 141723 143786 146577 148544 148674 148098 149301 153090 157415
56525A57415K629J261J632K200J314j14j02J528L038K982J562K38M54K354M504
$$ 157415 160044 161305 162937 165137 166451 166337 166235 167763 170801 173783 175345 175583 176037 178391 182895
56510A82895N270M503L293K377J784J736K646M057M861M856N005N893O894P154
$$ 182895 188165 192668 195961 198338 200122 201858 204504 208561 213422 218278 223283 229176 236070 243224
56496B43224O487N209L886L239L277K768P67j467j746j21R96K57j039j468j694
$$ 243224 249711 254920 258806 262045 265322 268090 268857 267390 265644 265523 266519 266776 265737 264269 262575
56481B62575k855m197l998k011K99J558J465M27p47j149o23j22n52j534j932j290
$$ 262575 259720 255523 251525 249514 249813 251371 252836 253263 252516 251367 250744 250622 250070 248536 246604 245314
56465B45314k10N46O98L63j38l51qN66N45o37k570l976l809k260n04N41Q27P64
$$ 245314 245104 245650 246348 246711 246573 246222 246214 246780 247325 246688 244118 240142 236333 234073 233569 234110 234937 235701
56447B35701Q10J464K625K843N39l408n696m281r10J232J249M02m99j536k176
$$ 235701 236511 237975 240600 243443 243982 240574 234878 230597 229687 230919 232168 232570 232071 230535 228359
56432B28359j567k96N6q30j749j915j593r17K06J102R57M22Q41J899K024J182
$$ 228359 226792 226496 226552 225722 223973 222058 220465 219548 219754 220856 221813 222235 223076 224975 226999 228181
56416B28181J046K009K328J064k64j01R31J456J401J358J221O37r3n91r02p86
$$ 228181 229227 231236 233564 234628 234364 234263 235194 236650 238051 239409 240630 241267 241174 240583 239681 238895
56400B38895L37K085L075K824K370K293J707J91q82k54J190J712J002M9l68M6
$$ 238895 239232 241317 244392 247216 249586 251879 253586 253777 252895 252641 253831 255543 256545 256594 256226 256272
56384B56272J452L358M641M948N127N395M424J571j317j998q71j15m03m18M85
$$ 256272 257724 261082 265723 270671 275798 281193 285617 287188 285871 283873 283002 282887 282484 282066 282551
56369B82551J044P6j635k331j527m50l15p51m56P59J424N46o76n11N94O89m96
$$ 282551 283595 283671 282036 279705 278178 277728 277413 276662 276206 276965 278389 278935 278259 277748 278342 279031 278535
56352B78535j093j89P72M75k26p8M85M04m0J00Q03J478K171L064L562L078K167
$$ 278535 277442 277253 278025 278500 278274 278196 278681 279085 279045 279145 279948 281426 283597 286661 290223 293301 295468
56335B95468J787J991K322K665K878K355J063J17K56N85oj138j934k769m395o003
$$ 295468 297255 299246 301568 304233 307111 309466 310529 310646 310902 311487 311481 310343 308409 305640 301245 295242
56319B95242n966m331k913k813l181k695j106J012L078M616N147M487L083J852
$$ 295242 289276 284945 282032 279219 276038 273343 272237 273249 276327 280943 286090 290577 293660 295512
56305B95512J498J797J750Q07k78l94M49J527K770M357N259M092J707Q84K683
$$ 295512 297010 298807 300557 301364 301086 300692 301141 302668 305438 309795 315054 319146 320853 321737 324420
56290C24420M957N423M496L818L719L604L402L114K108L94n62K68J822K632K990
$$ 324420 329377 334800 339296 343114 346833 350437 353839 356953 359061 359455 358893 359161 360983 363615 366605
56275C66605L881M906N053M644M662M850M253L149K835L751N198O466P101O687
$$ 366605 370486 375392 380445 385089 389751 394601 398854 402003 404838 408589 413787 420253 427354 434041
56261D34041N528M867N266N639M973L926L385K826J679R03J245J328p2j120Q22
$$ 434041 439569 444436 449702 455341 460314 464240 467625 470451 472130 473033 474278 475606 475534 474414 475236
56246D75236M683O624N512M347N555P635P834O045M516M839O513P886P802O657
$$ 475236 479919 486543 492055 496402 501957 509592 517426 523471 527987 532826 539339 547225 555027 561684
56232E61684O014O812Q273R148R439R835J0288J0493J1102J2804J4639J4965J3937
$$ 561684 567698 574510 582783 591931 601370 611205 621493 631986 643088 655892 670531 685496 699433
56219F99433J3290J3800J4706J5594J6941J8619J9728K0336K1706K4156K6325
$$ 699433 712723 726523 741229 756823 773764 792383 812111 832447 854153 878309 904634
56208I04634K7257K7954K9932L3175L6316L8360L9685M1642M5168M9547N2929
$$ 904634 931891 959845 989777 1022952 1059268 1097628 1137313 1178955 1224123 1273670 1326599
56197A326599N4742N6982O2118P0196P9044Q6879R3483R9312J04939J11248J18840
$$ 1326599 1381341 1438323 1500441 1570637 1649681 1736560 1830043 1929355 2034294 2145542 2264382
56186B264382J27139J35055J42159J48043J51193J50122J45422J39102J31874
$$ 2264382 2391521 2526576 2668735 2816778 2967971 3118093 3263515 3402617 3534491
56177C534491J22406J09239R2180P2094N0557K9415R125j1974l5109n8251p7771
$$ 3534491 3656897 3766136 3858316 3930410 3980967 4010382 4019507 4007533 3972424 3914173 3836402
56166C836402r2667j04920j15677j23598j27669j29245j30065j29984j28049j24501
$$ 3836402 3743735 3638815 3523138 3399540 3271871 3142626 3012561 2882577 2754528 2630027
56156B630027j20263j15311j09051j01876r5268r0210q6171q1837p6590p1068
$$ 2630027 2509764 2394453 2285402 2183526 2088258 1998048 1911877 1830040 1753450 1682382
56146A682382o6097o1418n6165n0565m5966m2788l9694l5631l1338k7784k4499
$$ 1682382 1616285 1554867 1498702 1448137 1402171 1359383 1319689 1284058 1252720 1224936 1200437
56135A200437k0999j8530j8485j9759j9802j7818j5205j3166j1698j0647r961
$$ 1200437 1179438 1160908 1142423 1122664 1102862 1085044 1069839 1056673 1044975 1034328 1024367
56124A024367q998p083m769l220k622k253j672p78N50J759J691O23P83L162N381
$$ 1024367 1015369 1008286 1003517 1000297 997675 995422 993750 992972 993522 995281 996972 997595 998378 1001540 1006921
56109A006921M992L369L723O510R542J1624J3000J3153J1525R955J1055J4260
$$ 1006921 1011913 1015282 1019005 1025515 1035057 1046681 1059681 1072834 1084359 1094314 1105369 1119629
56097A119629J6669J7594J8963K1295K2878K3461K5234K9177L3439L6400L8705
$$ 1119629 1136298 1153892 1172855 1194150 1217028 1240489 1265723 1294900 1328339 1364739 1403444
56086A403444M1486M5174N0664N8905O8419P6002Q0748Q4970R0187R4827R6721
$$ 1403444 1444930 1490104 1540768 1599673 1668092 1744094 1824842 1909812 1999999 2094826 2191547
56075B191547R5343R0625Q2140P0792N9263M9672M2427L7617L5190L3340K9284
$$ 2191547 2286890 2377515 2459655 2530447 2589710 2639382 2681809 2719426 2754616 2787956 2817240
56064B817240K2512J5164Q755K888k550o685r979j4676k2149l1818m2930n4903
$$ 2817240 2839752 2854916 2863671 2866559 2864009 2857324 2847345 2832669 2810520 2778702 2735772 2680869
56052B680869o5692p2599p5257p5372p3541o9187o3414n8420n3758m6812l7413
$$ 2680869 2615177 2542578 2467321 2391949 2318408 2249221 2185807 2127387 2073629 2026817 1989404
56041A989404k8549k2015j7045j3481j2137j1435q155k673J048J784K821N931
$$ 1989404 1960855 1938840 1921795 1908314 1896177 1884742 1876587 1873914 1874962 1876746 1879567 1885498
56029A885498Q604R242J0175J2935J5116J4959J4841J6913J9253J9667J9716K1577
$$ 1885498 1894102 1903344 1913519 1926454 1941570 1956529 1971370 1988283 2007536 2027203 2046919 2068496
56017B068496K4138K5461K6217K7614K8845K9334L0491L2627L3391L2000L1450
$$ 2068496 2092634 2118095 2144312 2171926 2200771 2230105 2260596 2293223 2326614 2358614 2390064
56006B390064L3671L6070L6100L5641L7284L9675M0470M0816M2841M5312M5727
$$ 2390064 2423735 2459805 2495905 2531546 2568830 2608505 2648975 2689791 2732632 2777944 2823671
55995B823671M4626M4306M5262M6866M9376N2566N4677N5284N6571N9509O1973
$$ 2823671 2868297 2912603 2957865 3004731 3054107 3106673 3161350 3216634 3273205 3332714 3394687
55984C394687O2879O4517O8165P1368P2469P3724P6731P9164P9549Q0797Q5006
$$ 3394687 3457566 3522083 3590248 3661616 3734085 3807809 3884540 3963704 4043253 4124050 4209056
55973D209056Q9345R1429R4188J00526J07637J11863J15076J20673J27258J32070
$$ 4209056 4298401 4389830 4484018 4584544 4692181 4804044 4919120 5039793 5167051 5299121
55963E299121J37077J45636J56116J64708J71684J79332J86707J92204J98483
$$ 5299121 5436198 5581834 5737950 5902658 6074342 6253674 6440381 6632585 6831068
55954F831068K09038K22383K35042K47567K62344K78324K93262L08220L24836
$$ 6831068 7040106 7262489 7497531 7745098 8007442 8285766 8579028 8887248 9212084
55945I212084L41497L57133L74767L96211M17862M37436M59681M89051N22085
$$ 9212084 9553581 9910714 10285481 10681692 11099554 11536990 11996671 12485722 13007807
55936A3007807N54243N88587O29430O72515P10484P43723P77019Q10036Q40573
$$ 13007807 13562050 14150637 14780067 15452582 16163066 16906789 17683808 18493844 19334417
55927A9334417Q72975R13557R61191J011693J067563J134043J210025J292547
$$ 19334417 20207392 21120949 22082140 23093833 24161396 25295439 26505464 27798011
55919B7798011J385346J492557J609074J728066J852616J988786K133593K282846
$$ 27798011 29183357 30675914 32284988 34013054 35865670 37854456 39988049 42270895
55911D2270895K444662K631563K845689L086043L362763L687656M058273M469674
$$ 42270895 44715557 47347120 50192809 53278852 56641615 60329271 64387544 68857218
55903F8857218M935498N479485O115584O857648P737926Q788868J0013426J1399374
$$ 68857218 73792716 79272201 85387785 92245433 99983359 108772227 118785653 130185027
55895A30185027J2954264J4699496J6645376J8806626K1220158K3892622K6732375
$$ 130185027 143139291 157838787 174484163 193290789 214510947 238403569 265135944
55888B65135944K9549493L2013121L3424421L2551858K8037021J9370976P617788
$$ 265135944 294685437 326698558 360122979 392674837 420711858 440082834 447700622
55881D47700622m923710j5909931k3971570k8877284l1079961l1249855l0046078
$$ 447700622 442776912 426866981 402895411 374018127 342938166 311688311 281642233
55874B81642233k8021784k5578695k2988783k0449287j8096220j5988164j4124837
$$ 281642233 253620449 228041754 205052971 184603684 166507464 150519300 136394463
55867A36394463j2491690j1073297r840469q758540p810217o990551o282976n660015
$$ 136394463 123902773 112829476 102989007 94230467 86420250 79429699 73146723 67486708
55859F7486708n104500m611747m173333l776352l417610l102704k830795k592836
$$ 67486708 62382208 57770461 53597128 49820776 46403166 43300462 40469667 37876831
55851C7876831k383198k200320k037098j883062j736016j601265j480120j368734
$$ 37876831 35493633 33293313 31256215 29373153 27637137 26035872 24555752 23187018
55843B3187018j266785j177332j098949j026863r60741r02828q50019p96511p43035
$$ 23187018 21920233 20742901 19643952 18617089 17656348 16753520 15903501 15106990 14363955
55834A4363955o94862o51915o09416n67366n30556m99419m69204m38675m11997
$$ 14363955 13669093 13017178 12407762 11840396 11309840 10810421 10341217 9902542 9490545
55825I490545l91224l73751l57790l44014l31213l16408k99940k84972k71902
$$ 9490545 9099321 8725570 8367780 8023766 7692553 7376145 7076205 6791233 6519331
55816F519331k58549k45603k36099k29512k22065k13121k05639j99992j92979
$$ 6519331 6260782 6015179 5779080 5549568 5327503 5114382 4908743 4708751 4515772
55807D515772j83689j74899j67627j59515j49862j41400j35518j30014j23252
$$ 4515772 4332083 4157184 3989557 3830042 3680180 3538780 3403262 3273248 3149996
55798C149996j16717j11739j07040j01049r4097q7162q0888p6286p3910p2093
$$ 3149996 3033279 2921540 2814500 2713451 2619354 2532192 2451304 2375018 2301108 2229015
55788B229015o8550o3727n9924n7266n3799m9444m6555m5958m5648m4141m2307
$$ 2229015 2160465 2096738 2036814 1979548 1925749 1876305 1829750 1783792 1738144 1694003 1651696
55777A651696m1034l9548l7008l3842l0834k8497k7497k8036k8772k7981k5644
$$ 1651696 1610662 1571114 1534106 1500264 1469430 1440933 1413436 1385400 1356628 1328647 1303003
55766A303003k2945k0456j8475j8161k0023k1994k1397j8469j5865j5186j5947
$$ 1303003 1280058 1259602 1241127 1222966 1202943 1180949 1159552 1141083 1125218 1110032 1094085
55755A094085j7208j8068j7334j4910j2747j2404j2737j2088j1175j1195j0737
$$ 1094085 1076877 1058809 1041475 1026565 1013818 1001414 988677 976589 965414 954219 943482
55744I43482p978m715m284o149o478m032j651j446k134j983j318r66o55lQ28J892
$$ 943482 935504 930789 926505 920356 913878 909846 908195 906749 904615 902632 901314 900348 899693 899690 900518 902410
55728I02410L212L816K919J658J404Q98k239p465j1762j3996j5748j7690j8260
$$ 902410 905622 909438 912357 914015 915419 916317 914078 906613 894851 880855 865107 847417 829157
55715H29157j6687j4359j2353j0191p851o510o368o103n312n389p106r367j1066
$$ 829157 812470 798111 785758 775567 767716 761206 754838 748735 743423 738034 730928 721561 710495
55702G10495j2190j2579j1659j0021r176r226q801p719p345p842p590o177n408
$$ 710495 698305 685726 674067 664046 654870 645644 636843 629124 621779 613937 606347 600170 594762
55689E94762o297p457p690p913q965r648q670o905o025o120o160n768n207m525
$$ 594762 588465 581008 573318 565405 556440 546792 538122 531217 525192 519072 512912 507144 501937 497412
55675D97412l740l195k929k615k517l480n366o771o825o254o067o319o649o939
$$ 497412 493672 490477 487548 484933 482416 478936 473570 466799 459974 453720 447653 441334 434685 427746
55661D27746o983o532n951n740n347l791j539k53m33q31n35K2L99Q56J271R87
$$ 427746 420763 414231 408280 402540 397193 393402 391863 391610 391177 390346 389811 389833 390232 391088 392359 393346
55645C93346K03n4K27j54j621l372n073p048q376p314m481l140m926p454p738
$$ 393346 393549 393495 393722 393568 391947 388575 383502 376454 368078 360764 356283 353143 348217 340763 333025
55630C33025o094m658l812k373l99N37k85j710k119r51J046K409K160Q77O0K58
$$ 333025 326931 322273 318461 316088 315689 316226 315941 314231 312112 311161 312207 314616 316776 317653 317713 317971
55614C17971O30N44M59P05P60L54J93O50Q44r7j716k970l463l245k239o03J052
$$ 317971 318601 319145 319604 320309 321069 321423 321616 322266 323110 323013 321297 318327 314864 311619 309380 308777 309829
55597C09829K322L216L515K858J657P64L8j232k356j589Q95K393J108j438k744
$$ 309829 312151 315367 318882 321740 323397 324161 324199 322967 320611 319022 319917 322310 323418 321980 319236
55582C19236k391j360J09K019L092J783j471m510n750n254m085l611m866p391
$$ 319236 316845 315485 315594 317613 320705 322488 321017 316507 310757 305503 301418 297807 292941 285550
55568B85550r115q357n613k776j153r60j814k824k935k139j646j989k014p87M74
$$ 285550 276435 268078 262465 259689 258536 257576 255762 252938 250003 247864 246218 244229 242215 241428 241902
55553B41902o0j994l075k256r23r21k423m087m561l483j502M06J592J774Q77p18
$$ 241902 241842 239848 236773 234517 233594 232673 230250 226163 221602 218119 216617 217023 218615 220389 221266 220548
55537B20548j976k254k327l310m592m360k401p78j016k076k065o43J211K670L192
$$ 220548 218572 216318 213991 210681 206089 201729 199328 198550 197534 195458 193393 192750 193961 196631 199823
55522A99823K433J025M46J158J956K048K398L908N726O737P313Q000P908O279
$$ 199823 202256 203281 203727 204885 206841 208889 211287 215195 220921 227658 234971 242971 250879 257158
55508B57158M480M267M954M492K701J186N39r3r31j379j970m084p301r233q710
$$ 257158 261638 265905 270859 275351 278052 279238 279777 279684 278753 277374 275404 271320 264019 254786 246076
55493B46076p262o528n959m305k074j092k190m326n764n531m004k329j192k26
$$ 246076 238814 232286 226327 222022 219948 218856 216666 212340 206576 201045 197041 194712 193520 193294
55479A93294R67J817J612R91J234K221K419J247P5K21J104J284N13j31J56J044
$$ 193294 194261 196078 197690 198681 199915 202136 204555 205802 205877 206098 207202 208486 208999 208868 209024 210068
55463B10068J617J261K7j378k001j359K7R52N57q26k094k729l475n153p192q214
$$ 210068 211685 212946 212973 211595 209594 208235 208262 209214 209771 208945 206851 204122 200647 195494 188302 180088
55447A80088p945p403p014o060m471l635m231m729l549j568o89q01l02Q37R21
$$ 180088 172143 164740 157726 151666 147195 143560 139329 134600 131051 129483 128794 127993 127691 128528 129449
55432A29449n20j887k079j884j943j389L00J701J331O0l1J376K567K294J168M02
$$ 129449 128929 127042 124963 123079 121136 119747 120047 121748 123079 123139 123108 124484 127051 129345 130513 130915
55416A30915L70P80J479K338K838K304O15j567l313l973l361j728J90J431J469
$$ 130915 131285 132065 133544 135882 138720 141024 141639 140072 136759 132786 129425 127697 127887 129318 130787
55401A30787N90n97j840l058l811l641k737j568J2K168L728K972K84j562p42J243
$$ 130787 131377 130780 128940 125882 122071 118430 115693 114125 114137 116305 120033 123005 123289 121727 120985 122228
55385A22228J833Q02j65m15q53j815k357j887j122r19j119q77M38K635M424M245
$$ 122228 124061 124863 124698 124283 123430 121615 119258 117371 116249 115330 114211 113334 113772 116407 120831 125076
55369A25076K100p3q22j031k034k872j558J416L323L001J938J176j65k257k975
$$ 125076 127176 127103 126281 125250 123216 120344 118786 120202 123525 126526 128464 129640 129475 127218 124243
55354A24243q71K134L037J590j37r99j567k101j843n36Q24J215O20l00q80p11
$$ 124243 123372 125506 128543 130133 129996 128997 127430 125329 123486 122950 123774 124989 125609 125309 124429 123718
55338A23718J5M75J77j74M95J928K504J135j363l098k980j513M2R33J219J057
$$ 123718 123733 124208 124385 124211 124706 126634 129138 130273 128910 125812 122832 121319 121361 122294 123513 124570
55322A24570K41j182k277k072j001n64j324k148j869p80J39O35R50Q31q9j245
$$ 124570 124811 123629 121352 119280 118279 117715 116391 114243 112374 111594 111733 112368 113318 114149 114060 112815
55306A12815j539p35L83J188J704J871J288J04o34j10J065J436L95j044j376k87
$$ 112815 111276 110541 110924 112112 113816 115687 116975 117079 116445 116335 117400 118836 119231 118187 116811 116524
55290A16524J009J192L04n10n18r2J43J85K23l6q71j674j420j12J027J079N35
$$ 116524 117533 118725 119029 118519 118001 117909 118052 118237 118460 118424 117553 115879 114459 114347 115374 116453 116988
55273A16988M01P15O63L6l77q3J54o36k052k647j792l82M83P19P60P13O71J143
$$ 116988 117389 118104 118767 118803 118426 118343 118497 117861 115809 113162 111370 110988 111471 112190 112950 113663 114334 115477
55255A15477K177K614J322r19k011j226j43m37j664j979n71J505K680K439J424
$$ 115477 117654 120268 121590 120671 118660 117434 117291 116854 115190 113211 112640 114145 116825 119264 120688
55240A20688M85n7j92K52J357K408K245O99q77j256q60q14j030m68R28J936J862
$$ 120688 121173 121116 120924 121176 122533 124941 127186 127885 127008 125752 124892 124078 123048 122580 123508 125444 127306
55223A27306J335J026P03J22k36Q9P26J071R39L66m65q68k31P16L55j506k961
$$ 127306 128641 129667 130370 130492 130256 130345 131071 132142 133081 133447 132982 132114 131883 132599 132954 131448 128487
55206A28487k399m89J120J882K115J797R31K09L2l66j439j948p01J048R70r47
$$ 128487 126088 125599 126719 128601 130716 132513 133444 133653 133685 133319 131880 129932 129231 130279 131249 130302
55190A30302k384k053j035m94m7Q71J726J885J611J198L38q06j202n64k02j105
$$ 130302 127918 125865 124830 124336 124289 125160 126886 128771 130382 131580 131918 131112 129910 129346 129144 128039
55174A28039k207j977q32l57o46j88J493K720J916j20j104mJ815K239P78j006
$$ 128039 125832 123855 123023 122666 122020 121832 123325 126045 127961 127841 126737 126733 128548 130787 131565 130559
55158A30559j402n38L3n08j345j491j176j063r34k42N92O62J55J18N65K75j101
$$ 130559 129157 128619 128652 128144 126799 125308 124132 123069 122135 121893 122485 123147 123302 123420 123985 124260 123159
55141A23159k014j023J069K185J615P31J089K592L641K792K77k020k344r45K81
$$ 123159 121145 120122 121191 123376 124991 125722 126811 129403 133044 135836 136113 134093 131749 130804 131085
55126A31085J41o54r71r38j239j624j339o07l07m07k3J026J961K390K472J778
$$ 131085 131226 130572 129601 128663 127424 125800 124461 123854 123547 123140 123117 124143 126104 128494 130966 132744
55110A32744l86l010l634j572P69J054J24L09J794K647J857M36l88m19Q8P30O08
$$ 132744 132358 129348 125714 124142 124911 125965 126089 126398 128192 130839 132696 133132 132744 132325 132413 133143 133751
55093A33751q25k441k405p29O09M56j15J76Q85R55N59O32J223J432O65q25k354
$$ 133751 132926 130485 128080 127351 127960 128416 128301 128477 129362 130317 130876 131508 132731 134163 134828 134003 131649
55076A31649l178k785j354L09J543K245K462K270K173K814L869M019K550J97j916
$$ 131649 128471 125686 124332 124641 126184 128429 130891 133161 135334 138148 142017 146036 148586 148783 146867
55061A46867l317l671k386K90K665L237K392J552J221Q48K01l18n14o08o94p66
$$ 146867 143550 139879 137493 137783 140448 143685 146077 147629 148850 149698 149899 149581 149067 148459 147765 146999
55045A46999j057j649k013j574m97P67K145L398L533J928l23j344p55J19J16o76
$$ 146999 145942 144293 142280 140706 140209 140976 143121 146519 150052 151980 151657 150313 149558 149677 149793 149117
55029A49117j617k116j505M93K931M267M084L269K411J213k09p10L65K009K618
$$ 149117 147500 145384 143879 144372 147303 151570 155654 158923 161334 162547 162338 161628 161993 164002 166620
55014A66620J734J13j299j912j642j125j318k259k669j485N74J650Q97n94j143
$$ 166620 168354 168467 167168 165256 163614 162489 161171 158912 156243 154758 155332 156982 157879 157285 156142
54999A56142l95L19l98k213l241k358p16k35r73j189p4J005O46m34n20N93J533
$$ 156142 155747 156066 155668 153455 150214 147856 147140 146905 145932 144743 144669 145674 146320 145886 145366 145959 147492
54982A47492J524J310J692K253K097J171K12l42q01j579k503k989k669j663l44
$$ 147492 149016 150326 152018 154271 156368 157539 157751 157409 156608 155029 152526 149537 146868 145205 144861
54967A44861Q56J453J191N37M83J407K392K265J120J67O3J32n09j658k344k007
$$ 144861 145717 147170 148361 148898 149381 150788 153180 155445 156565 156732 156795 156927 156418 154760 152416 150409
54951A50409r71J53J076J803K208J935R04k20n51j72j98j153j959j352J72R18
$$ 150409 149438 149591 150667 152470 154678 156613 157517 157297 156746 156574 156376 155223 153264 151912 152084 153002
54935A53002L12n73p72m02K76J308K105J548j24r21K76J892J886P33M80J468K005
$$ 153002 153314 152741 151969 151567 151843 153151 155256 156804 156680 155759 156035 157927 159813 160546 161026 162494 164499
54918A64499J251M43P57J494J312J48q87r18J03J581K585K403J356O51J030K028
$$ 164499 165750 166193 166950 168444 169756 169904 169017 168099 168202 169783 172368 174771 176127 176778 177808 179836
54902A79836K815L137L001K114L92j414k363k411k154j752q85K51P49P3j206k115
$$ 179836 182651 185788 188789 190903 191295 189881 187518 185107 182953 181201 180316 180567 181316 181389 180183 178068
54886A78068k300k047j617j108p72r40j477j655q94N20J726K193J992J232j83
$$ 178068 175768 173721 172104 170996 170224 169284 167807 166152 165258 165778 167504 169697 171689 172921 172738
54871A72738j861k524j142J518L306L043J717R73J029R62N36N97J644L085M267
$$ 172738 170877 168353 167211 168729 172035 175078 176795 177768 178797 179759 180295 180892 182536 185621 189888
54856A89888N320O381O823O173N192N058N667N770M746L218J778J73j740l225
$$ 189888 195208 201589 208412 214585 219777 224835 230502 236272 241018 244236 246014 246187 244447 241222
54842B41222l669l732m537o036p048o839n752m321k700j276r27j890k892k374
$$ 241222 237553 233821 229284 223248 216200 209361 203609 199288 196588 195312 194385 192495 189603 187229
54828A87229m93R42P88J06O68K388L210J858k73p13J095L361M379M275M084M106
$$ 187229 186736 187678 188466 188572 189240 191628 194838 196696 196423 195710 196805 200166 204545 208820 212904 217010
54812B17010L959L596L302K940K146J256J287K599M171M513L082O10j761l426
$$ 217010 220969 224565 227867 230807 232953 234209 235496 238095 242266 246779 249861 250471 248710 245284
54798B45284m409m777m380l408k863l730n598o916o834o007n150l848j708J47
$$ 245284 240875 236098 231718 228310 225447 221717 216119 209203 202369 196362 191212 187364 185656 185803
54784A85803J27j583l129l248k372j514j225j697k745l412k734j174k40l73m03
$$ 185803 185930 184347 181218 177970 175598 174084 172859 171162 168417 165005 162271 161097 160857 160484 160081
54769A60081M31J182P57l13o87o9P37J113J075P94N02N91J140J569J270L33o42
$$ 160081 160512 161694 162451 162138 161451 161382 162119 163232 164307 165101 165603 166194 167334 168903 170173 170506 169864
54752A69864j088o35N76J485R36o63j465n58R30J814K492L401L323J214j273j464
$$ 169864 168776 168141 168717 170202 171138 170475 169010 168452 169382 171196 173688 177089 180412 181626 180353 178889
54736A78889M48J468Kk156k692j636l63O06J410J587N69j030j797j110L81J668
$$ 178889 179337 180805 180807 178651 175959 174323 173960 174566 175976 177563 178132 177102 175305 174195 174576 176244
54720A76244K216K079J595R72J44o65m95J376L936N086M237L164L554M769N090
$$ 176244 178460 180539 182134 183106 183250 182585 182090 183466 187402 192488 196725 199889 203443 208212 213302
54705B13302M380L933M135L845K520J545K518M949O690O493N243M356L728K135
$$ 213302 217682 221615 225750 229595 232115 233660 236178 241127 247817 254310 259553 263909 267637 269772
54691B69772n24k548k622j894k673n367p915q445p297n874m695l519k539k148
$$ 269772 269248 266700 264078 262184 259511 254144 246229 237784 230487 224613 219918 216399 213860 211712
54677B11712j943j195k10j51j218k013j238O56K051K062J284P45O41M12j47l67
$$ 211712 209769 208574 208364 208213 206995 204982 203744 204400 206451 208513 209797 210542 211183 211595 211448 211081
54661B11081L97J630K083J460J006K026M270O363P399P483O882N525L429R77j443
$$ 211081 211478 213108 215191 216651 217657 219683 223953 230316 237715 245198 252080 257605 261034 262011 260568
54646B60568l612n205n845n627n134m672l965k939k351l017m590n681n286l802
$$ 260568 256956 251751 245906 240279 235145 230473 226508 223569 221218 218201 213611 207930 202644 198842
54632A98842k498k173k459k385j475k55L53M4n52n75K42J456K365K333J029j136
$$ 198842 196344 194171 191712 189327 187852 187597 187950 187994 187442 186867 187109 188565 190930 193263 194292 193156
54616A93156k860k925j610o12j101k253k431j418n56o29p39J38J552K332K363
$$ 193156 190296 187371 185761 185149 184048 181795 179364 177946 177390 176761 176022 176160 177712 180044 182407
54601A82407K374K388J618j8j419j754j470j447j873k428k865k928k308j225n00
$$ 182407 184781 187169 188787 188769 187350 185596 184126 182679 180806 178378 175513 172585 170277 169052 168552
54586A68552l50J97J987M206N141M216K418Q39l88j536k501k881k408j114O65
$$ 168552 168202 168399 170386 174592 179733 183949 186367 187206 186818 185282 182781 179900 177492 176378 177043
54571A77043K288L114K870J664p8j527j700m89Q85J082J74o55p74o54q01j090
$$ 177043 179331 182445 185315 186979 186901 185374 183674 183185 184070 185152 185326 184671 183897 183243 182442 181352
54555A81352j308j452j304m99O06J008M87J10P62J967K755K912K546J362n57j866
$$ 181352 180044 178592 177288 176789 177395 178403 178890 179000 179762 181729 184484 187396 189942 191304 190747 188881
54539A88881j364J03N24m97j296p45K11L10j23l0N64P70L37l55j351k947m454
$$ 188881 187517 187620 188144 187647 186351 185606 185817 186127 186004 185974 186538 187308 187645 187290 185939 182992 178538
54522A78538m416k501j78J016J164J344J872J975J087k26q26k73P68J300J150
$$ 178538 174122 171621 171443 172459 173623 174967 176839 178814 179901 179675 178849 178576 179344 180644 181794
54507A81794J018J348J514O71q33j686j350o98n69n74K2R84J604J969K640L238
$$ 181794 182812 184160 185674 186345 185512 183826 182476 181778 181209 180635 180657 181641 183245 185214 187854 191092
54491A91092K686R70m50m30N27J286J614J985K426K420J772Q83K07p9Q4N76R31
$$ 191092 193778 194748 194298 193868 194395 195681 197295 199280 201706 204126 205898 206781 206988 206909 206993 207569 208500
54474B08500O08l55j233j397j035q99j274j516r09J39M28l18r14n29k23j385l217
$$ 208500 209108 208753 207520 206123 205088 204189 202915 201399 200490 200629 201057 200739 199825 199296 199073 197688 194471
54457A94471l400j349R30J745J741K105K454J938J079P94N46o42j966j729j59
$$ 194471 191071 189722 190652 192397 194138 196243 198697 200635 201714 202508 203054 202412 200446 198717 198558
54442A98558P75L56p3L30N51k81j266j182j62R98K014K629K182Q02q7L78J099
$$ 198558 199333 199689 199616 199946 200497 200216 198950 197768 197606 198604 200618 203247 205429 206231 206144 206522 207621
54425B07621O80l66n71R2K86n27j419j439m92J080K785L786L479K256J014N4o86
$$ 207621 208301 207935 207364 207456 207742 207215 205796 204357 203865 204945 207730 211516 214995 217251 218265 218319 217633
54408B17633p63K55J621K055J478R01O74J66o88j027n94k93o07o78K50J622K446
$$ 217633 216870 217125 218746 220801 222279 223180 223854 224020 223332 222305 221711 221418 220811 220133 220383 222005 224451
54391B24451K445J744M65o77n95M16L05k030m745n196l370j448o04r3N58O21k5
$$ 224451 226896 228640 229105 228428 227833 228249 228554 226524 221779 216583 213213 211765 211161 211068 211626 212247 212222
54374B12222L1J670L497L402J266r77j639p90L56Q41O82O42J290K187K354J620
$$ 212222 212253 213923 217420 220822 222088 221111 219472 218682 219038 219879 220561 221203 222493 224680 227034 228654
54358B28654R79J163J525J031j38r51j264j967l248l834k704o89O13J009J628
$$ 228654 229633 230796 232321 233352 233214 232263 230999 229032 225784 221950 219246 218557 219170 220179 221807
54343B21807K794L297K289Q30N22J188J121l06j533q82J167K621K481J589J047
$$ 221807 224601 227898 230187 231017 231539 232727 233848 233542 232009 231127 232294 234915 237396 238985 240032
54328B40032R12Q20J013J842K669K255L74j721k755k774k546k254j600q77r34
$$ 240032 240944 241764 242777 244619 247288 249543 249917 248196 245441 242667 240121 237867 236267 235390 234456
54313B34456j752k013p00J430K770K893K795L213L663L445K694J988J511J216
$$ 234456 232704 230691 229991 231421 234191 237084 239879 243092 246755 250200 252894 254882 256393 257609
54299B57609J286J767K067J627Q38O01R98J275J140J251K063K951L015K151Q28
$$ 257609 258895 260662 262729 264356 265194 265795 266793 268068 269208 270459 272522 275473 278488 280639 281467
54284B81467o48j983k546k096j605k332m017n008m459l445l320l885m061l734
$$ 281467 280819 278836 276290 274194 272589 270257 266240 261232 256773 253328 250008 246123 242062 238328
54270B38328l722m115l865k261L6J788K335J683K72r56r92R4J082J146Q11P19
$$ 238328 234606 230491 226626 224365 224401 226189 228524 230207 230479 229523 228531 228625 229707 230853 231664 232383
54254B32383L93o81j491o24J329K218J303Q2k76n92j750k723k062l83L26n59j776
$$ 232383 232776 232095 230604 229980 231309 233527 234830 234912 234636 234044 232294 229571 227509 227126 227452 226893 225117
54237B25117k161j691o84O01J295L82j600k419o03K638M661M202K380J204J480
$$ 225117 222956 221265 220581 221182 222477 222859 221259 218840 218237 220875 225536 229738 232118 233322 234802
54222B34802K072J116j813m813n406l188j98J354J015j72r64o45O28J747J614
$$ 234802 236874 237990 236177 231364 225958 222770 222572 223926 224941 224769 223805 223160 223788 225535 227149
54207B27149O10L24J399K551K364J141P1n73j279j967k058j523p32M09J939K779
$$ 227149 227759 228083 229482 232033 234397 235538 235609 235036 233757 231790 229732 228209 227477 227886 229825 232604
54191B32604J702n30j546l22J489J875R60L21P13J548K049J884Q96p83k372k864
$$ 232604 234306 233776 232230 231908 233397 235272 236232 236553 237266 238814 240863 242747 243643 242860 240488 237624
54175B37624k029o79L2n97k369m032l961j675J247K456J241q02j633q94J42L20
$$ 237624 235595 234916 234948 234351 231982 227950 223989 222314 223561 226017 227258 226456 224823 223929 224071 224391
54159B24391j69l61J96J045J588J783J856J626O53r26k229k510j940j223p71n20
$$ 224391 224222 223861 224057 225102 226690 228473 230329 231955 232608 231682 229453 226943 225003 223780 223009 222489
54143B22489k74K01J160K447L176K521R60K2M10J007M19r15j134M01J957J564
$$ 222489 222215 222416 223576 226023 229199 231720 232680 232702 233112 234119 234538 233623 232489 232890 234847 236411
54127B36411m74k142k396k099k190k190j213M06J527J711J402Q98Q8p88j118p67
$$ 236411 235937 233795 231399 229300 227110 224920 223707 224113 225640 227351 228753 229651 229739 228951 227833 227066
54111B27066j54O99K246M147M853L248K15k182k834k280j551j070p23l77j07k2
$$ 227066 226912 227611 229857 234004 238857 242105 242320 240138 237304 235024 233473 232403 231680 231303 231196 231174
54095B31174p9J2M36R24R81O22M28P11J047J078J108J387J250m2j793k292j023
$$ 231174 231095 231107 231543 232467 233448 234070 234498 235209 236256 237334 238442 239829 241079 241037 239244 236952 235929
54078B35929M28K91j080j658l41J612K084O21j179j701j032l33j07P0L83M73L85
$$ 235929 236357 236648 235568 233910 233569 235181 237265 237886 236707 235006 233974 233641 233534 233604 233987 234460 234845
54061B34845P46J492J453P6j330j094N78J989K222J854J630J617J704J814J484
$$ 234845 235591 237083 238536 238612 237282 236188 236766 238755 240977 242831 244461 246078 247782 249596 251080
54046B51080L11r43r15L95J319P14o39j430j516j392r82q0P49Q57O28P99J090
$$ 251080 251391 250448 249533 249928 251247 251961 251322 249892 248376 246984 246002 245922 246671 247528 248156 248955 250045
54029B50045O70j86k83O24J299Q28j6K00J630K907K656J009m91n02O58J486J336
$$ 250045 250715 250529 250246 250870 252169 252997 252981 253181 254811 257718 260374 261383 260892 260390 261048 262534 263870
54012B63870J293K532M523N763N798N446N296N258N452O126O532N359K778N91
$$ 263870 265163 267695 272218 277981 283779 289225 294521 299779 305231 311357 317889 323248 326026 326617
53998C26617l59j315l139m361l402j435p65j103m8K689M340L195J194Q58J637
$$ 326617 326258 324943 321804 317443 314041 312606 311841 310738 310690 313379 317719 320914 322108 322966 324603
53983C24603J454M80P31K510L882L949M224N819P332O974N450M946O026P073O646
$$ 324603 326057 326537 327268 329778 333660 337609 341833 347652 354984 361958 367408 372354 378380 385453 392099
53968C92099M952L095J945J892K660L191K504Q94l39m87o4J65K4m20j217k337
$$ 392099 397051 400146 402091 403983 406643 409834 412338 413232 412893 412406 412342 412507 412531 412111 410894 408557
53952D08557l606m964o165o326m833k816k429m184o212o749o122n391m411k673
$$ 408557 404951 399987 393822 387496 382663 379847 377418 373234 367022 360273 354151 348760 344349 341676
53938C41676r57l55l59K73J058K13k387m534m584l317k257j550m39J278L240N034
$$ 341676 340719 340364 340005 340278 341336 341549 339162 334628 330044 326727 324470 322920 322481 323759 326999 332033
53922C32033N916M956K405R9n51l07q07k245l445l805l821l829l462k523j501
$$ 332033 337949 342905 345310 345409 344858 344551 343744 341499 338054 334249 330428 326599 323137 320614 319113
53907C19113r17q75j284j969k422k068r07N29J858L035L841L792K761J427R08
$$ 319113 318196 317321 316037 314068 311646 309578 308671 309200 311058 314093 317934 321726 324487 325914 326822
53892C26822J961M260O393O902N696M026K909K215J708J987L441N037N485N247
$$ 326822 328783 333043 339436 346338 352034 356060 358969 361184 362892 364879 368320 373357 378842 384089
53878C84089N925P790R296R231Q036O744N858N692O533P886Q612Q503Q747J0211
$$ 384089 390014 397804 407100 416331 424367 431111 436969 442661 449194 457080 465692 474195 482942 493153
53864D93153J2246J3862J5030J6031J6397J5543J3684J1180P770L539p9j607j432
$$ 493153 505399 519261 534291 550322 566719 582262 595946 607126 614896 618435 618356 616749 615317
53851F15317j246j848k701l436m342n315n519m645l553l247l802m682n548o375
$$ 615317 614071 612223 609522 606086 601744 596429 590910 586265 582712 579465 575663 570981 565433 559058
53837E59058p058p257o609n272m209m477n918p149p433p771r281j1167j1639j0367
$$ 559058 552000 544743 538134 532862 528653 524176 518258 511109 503676 495905 486624 475457 463818 453451
53823D53451q758p801p096o041m697l229j715q16j342k863l971m326n000o293
$$ 453451 444693 436892 429796 423755 419058 415829 414114 413298 411956 409093 405122 400796 395796 389503
53809C89503o847n788m336l957m170l684k727k559l264l580k871j875j548k105
$$ 389503 382656 376868 372532 368575 364405 360721 357994 355435 352171 348591 345720 343845 342297 340192
53795C40192l171l981l738k640k082k828l545k475j15J400J300P93O17M5j158
$$ 340192 337021 333040 329302 326662 324580 321752 318207 315732 315617 317017 318317 319110 319727 319772 318614
53780C18614j703q65J8m66j477j188M64J863K125J860J560Q29l67r31O2J931K998
$$ 318614 316911 316046 316064 315598 314121 312933 313397 315260 317385 319245 320805 321634 321267 320336 320398 322329 325327
53763C25327K483J245N96P63Q18M2j012j207l15P64J366J941L106M457N049M764
$$ 325327 327810 329055 329651 330414 331232 331274 330262 329055 328740 329504 330870 332811 335917 340374 345423 350187
53747C50187M467M831N610O159O161N718N170N013N532O327O451N340L521K159
$$ 350187 354654 359485 365095 371254 377415 383133 388303 393316 398848 405175 411626 416966 420487 422646
53733D22646J971K523K707J921P84M63J177J810J328J83l20R4K73p08k298l305
$$ 422646 424617 427140 429847 431768 432552 433015 434192 436002 437330 437513 437193 437287 437560 436852 434554 431249
53717D31249l462l500l932m456m579m357m321m832n626n912n070l517k589l202
$$ 431249 427787 424287 420355 415899 411320 406963 402642 397810 392184 386272 381202 377685 375096 371894
53703C71894m639n195m068k160q56n68q21j218j721k281k777l187l267k311N2
$$ 371894 367255 362060 357992 355832 354976 354408 353587 352369 350648 348367 345590 342403 339136 336825 336877
53688C36877K730L756K464L96n10j48O9o26j381r72O93K554L429K797J055o46
$$ 336877 339607 343363 345827 346223 345713 345565 345634 345008 343627 342655 343348 345902 349331 352128 353183 352537
53672C52537j128j52J388K483L037L610M338M601L970L010K708L287L973L957
$$ 352537 351409 351257 352645 355128 358165 361775 366113 370714 374684 377694 380402 383689 387662 391619
53658C91619L199K148J161N02N25J251K046K268K158K511L532M679N545O107N973
$$ 391619 394818 396966 398127 398629 399154 400405 402451 404719 406877 409388 412920 417599 423144 429251 435224
53643D35224M487K023K04J58J296K543L887N605O764O057L911K343K521L585M087
$$ 435224 439711 441734 441938 442096 443392 445935 449822 455427 462191 468248 472159 474502 477023 480608 484695
53628D84695L472J911j31j674j649k66P14j34k263l906m010k986j947j694k149
$$ 484695 488167 490078 489947 488273 486624 486358 487072 486938 484675 480769 476759 473773 471826 470132 467983
53613D67983k518k221j691j754k374k657k186j371m24R33K391K947K420J895J885
$$ 467983 465465 463244 461553 459799 457425 454768 452582 451211 450787 451720 454111 457058 459478 461373 463258
53598D63258J367l15j778j365J85O30n67j516n73J673L377L363J795k55j482j156
$$ 463258 464625 464310 462532 461167 461352 461982 461415 459899 459326 460999 464376 467739 469534 469279 467797 466641
53582D66641M84K742M976O387O061M170K494K509L420L367K231J669K393L200
$$ 466641 467125 469867 474843 481230 487291 491461 493955 496464 499884 503251 505482 507151 509544 512744
53568E12744L118K892L582M860N748O087O357O722P010P216P394P422P299P167
$$ 512744 515862 518754 522336 527196 532944 539031 545388 552110 559120 566336 573730 581152 588451 595618
53554E95618O908O357O095P075R052J0415J0188R200Q522P851O465M857M017L659
$$ 595618 602526 608883 614978 622053 631105 641520 651708 660908 669430 677281 683746 688603 692620 696279
53540F96279K667J047K8L6q1j341l155m223m262m031l976l614k427r21k90j075
$$ 696279 698946 699993 700021 700057 699976 698635 695480 691257 686995 682964 678988 675374 672947 672026 671736 670661
53524F70661k539l560l701l071j719rP37o86l439n041m176k040l37P54J704K135
$$ 670661 668122 664562 660861 657790 656071 656062 656799 656113 652674 647633 643457 641417 641080 641834 643538 645673
53508F45673J643J145J637K242J400l38p56O27J800J551J456L245N796O571N161
$$ 645673 647316 648461 650098 652340 653740 653402 652646 653273 655073 656624 658080 661325 667121 673692 678853
53493F78853L620L554M501N245N377N167M976N273O553Q601J0384J1096J0950
$$ 678853 682473 686027 690528 695773 701150 706317 711293 716566 723119 731720 742104 753200 764150
53480G64150J0610J0294R935R836J0513J2003J3940J6236J9009K1718K3220K3173
$$ 764150 774760 785054 794989 804825 815338 827341 841281 857517 876526 898244 921464 944637
53468I44637K2776K3402K4936K6199K6757K7227K7915K8272K8170K8630L0493
$$ 944637 967413 990815 1015751 1041950 1068707 1095934 1123849 1152121 1180291 1208921 1239414
53457A239414L3035L4822L5615L6445L8090M0260M2283M3775M4545M4565M4276
$$ 1239414 1272449 1307271 1342886 1379331 1417421 1457681 1499964 1543739 1588284 1632849 1677125
53446A677125M4275M4508M4239M3081M1529M0212L9129L7997L6928L6277L5943
$$ 1677125 1721400 1765908 1810147 1853228 1894757 1934969 1974098 2012095 2049023 2085300 2121243
53435B121243L5334L4090L2588L1499L1040L0778L0315K9929L0109L0459K9651
$$ 2121243 2156577 2190667 2223255 2254754 2285794 2316572 2346887 2376816 2406925 2437384 2467035
53424B467035K6999K3535K0884J9361J8001J6297J4762J3522J1555Q130M200J253
$$ 2467035 2494034 2517569 2538453 2557814 2575815 2592112 2606874 2620396 2631951 2640081 2644281 2645534
53412B645534q85l990r094j5039j9728k2241k3358k4385k5976k7955k9790l0978
$$ 2645534 2644649 2640659 2631565 2616526 2596798 2574557 2551199 2526814 2500838 2472883 2443093 2412115
53400B412115l1218l0514k9399k8881k9790l1923l3998l4801l4318l3476l2791
$$ 2412115 2380897 2350383 2320984 2292103 2262313 2230390 2196392 2161591 2127273 2093797 2061006
53389B061006l1713k9516k6490k3778k2090k0976j9446j7016j3980j0936q347
$$ 2061006 2029293 1999777 1973287 1949509 1927419 1906443 1886997 1869981 1856001 1845065 1836718
53378A836718o330m569k503J39K999N600Q020J0655J3352J5393J6637J8137K1040
$$ 1836718 1830388 1825819 1823316 1823455 1826454 1832054 1840074 1850729 1864081 1879474 1896111 1914248 1935288
53365A935288K5090K8748L0890L1973L3450L6267M0081M3829M6796M8987N0622
$$ 1935288 1960378 1989126 2020016 2051989 2085439 2121706 2161787 2205616 2252412 2301399 2352021
53354B352021N1756N2733N4585N8181O2904O6962O9341P0879P3011P6017P9152
$$ 2352021 2403777 2456510 2511095 2569276 2632180 2699142 2768483 2839362 2912373 2988390 3067542
53343C067542Q1953Q4652Q7429R0022R2092R3551R4535R5294R5878R5694R4032
$$ 3067542 3149495 3234147 3321576 3411598 3503690 3597241 3691776 3787070 3882948 3978642 4072674
53332D072674R1453Q9840R0036R0117Q7429Q1987P6275P1664O6866O0520N3496
$$ 4072674 4164127 4253967 4344003 4434120 4521549 4603536 4679811 4751475 4818341 4878861 4932357
53321D932357M7406M2111L6240K9281K1696J3470M219n443j4213k1972l0006l8982
$$ 4932357 4979763 5021874 5058114 5087395 5109091 5122561 5126780 5121337 5107124 5085152 5055146 5016164
53309E016164m8020n6332o4457p2857q0405q5664q9180r2899r7281j00477j00874
$$ 5016164 4968144 4911812 4847355 4774498 4694093 4608429 4519249 4426350 4329069 4228592 4127718
53298D127718r9287r7693r6679r5333r3135r0639q8203q5340q1778p8266p5682
$$ 4127718 4028431 3930738 3834059 3738726 3645591 3554952 3466749 3381409 3299631 3221365 3145683
53287C145683p3929p2363p0699o8901o6685o3839o0640n7286n3358m8738m4490
$$ 3145683 3071754 2999391 2928692 2859791 2793106 2729267 2668627 2611341 2557983 2509245 2464755
53276B464755m1792m0220l8276l5498l2683k9995k6515k2290j9252j8805j9550
$$ 2464755 2422963 2382743 2344467 2308969 2276286 2246291 2219776 2197486 2178234 2159429 2139879
53265B139879j8835j6036j2970j1358j1138j1239j0748r008n769j798J361K958
$$ 2139879 2121044 2105008 2092038 2080680 2069542 2058303 2047555 2038547 2032778 2030980 2032341 2035299
53253B035299L993O084R587J3312J5888J7036J7648J8941K1514K4830K7627K9091
$$ 2035299 2039292 2045376 2054963 2068275 2084163 2101199 2118847 2137788 2159302 2184132 2211759 2240850
53241B240850K9705L0758L2999L5986L8767M0784M2046M2818M3575M4775M6002
$$ 2240850 2270555 2301313 2334312 2370298 2409065 2449849 2491895 2534713 2578288 2623063 2669065
53230B669065M5736M2899L8564L5039L2997L0660K6378K0755J5345J0357N042
$$ 2669065 2714801 2757700 2796264 2831303 2864300 2894960 2921338 2942093 2957438 2967795 2972837
53219B972837l86m960q789j3085j8319k3718k8664l3156l6801l8957m0154m1882
$$ 2972837 2972451 2967491 2958702 2945617 2927298 2903580 2874916 2841760 2804959 2766002 2725848 2683966
53207B683966m4457m6604m7785m9153n1344n3000n2901n2112n2433n3738n4559
$$ 2683966 2639509 2592905 2545120 2495967 2444623 2391623 2338722 2286610 2234177 2180439 2125880
53196B125880n4439n4087n3781n3278n2887n3047n3059n1731m9209m6857m5394
$$ 2125880 2071441 2017354 1963573 1910295 1857408 1804361 1751302 1699571 1650362 1603505 1558111
53185A558111m4312m3014m1366l9348l7241l5942l5820l5593l3718l0521k7527
$$ 1558111 1513799 1470785 1429419 1390071 1352830 1316888 1281068 1245475 1211757 1181236 1153709
53174A153709k5077k2410j9815j8581j8659j8489j7595j7249j7876j7964j6695
$$ 1153709 1128632 1106222 1086407 1067826 1049167 1030678 1013083 995834 977958 959994 943299
53163I43299j5654j6385j7881j8230j7514j7265j7958j8731j8934j8501j7225
$$ 943299 927645 911260 893379 875149 857635 840370 822412 803681 784747 766246 749021
53152G49021j5148j3320j2820j3267j3401j2854j2274j2007j1791j1584j1607
$$ 749021 733873 720553 707733 694466 681065 668211 655937 643930 632139 620555 608948
53141F08948j1708j1567j1321j1102j0421q938p468p035p292p117o402n885n432
$$ 608948 597240 585673 574352 563250 552829 543891 536423 529388 522096 514979 508577 502692 497260
53128D97260m134k268j479k499m028m634m516m634n058n200n000m935n134n231
$$ 497260 493126 490858 489379 486880 482852 478218 473702 469068 464010 458810 453810 448875 443741 438510
53114D38510m908m115k904j449j58M29j54j996m267n342m234j901l35k50n60j99
$$ 438510 433602 429487 426583 425134 424976 425405 425251 423255 418988 413646 409412 407511 407176 406926 406366 406167
53098D06167N40Q50O05J17m27p83n94j38l03j211j667q04M51N28p23k116k790
$$ 406167 406707 407557 408162 408279 407852 407069 406475 406337 406034 404823 403156 402352 402803 403331 402608 400492 397702
53081C97702k759k117q56O39J767K504L211L716L353J967K37j096j785j926j812
$$ 397702 394943 392826 391970 392609 394376 396880 400091 403807 407160 409127 409364 408268 406483 404557 402745
53066D02745j761j630o23J648M177N401M915L624K384J316L49n31j466k324k334
$$ 402745 400984 399354 398731 400379 404556 409957 414872 418496 420880 422196 422545 422014 420548 418224 415890
53051D15890j233m04j333l011k763j58J900R94j598k953k333j310j023j265j741
$$ 415890 414657 414253 412920 409909 407146 406988 408888 409882 408284 405331 402998 401688 400665 399400 397659
53036C97659k420k782k178j102q33j677k656k895k434j692j101j080j432j140
$$ 397659 395239 392457 390279 389177 388344 386667 384011 381116 378682 376990 375889 374809 373377 372237
53022C72237K25J323P63m54j36J563K065L22j432j008O15J109K23n73q03j349
$$ 372237 372462 373785 374548 374094 373958 375521 377586 377908 376476 375468 376083 377192 377415 376842 376039 374690
53006C74690k492l307l093k103q63K70Q81P32J42m83j228k058k152r26P89J672
$$ 374690 372198 368891 365798 363695 362832 363102 363983 364715 364857 364374 363146 361088 358936 358010 358799 360471
52990C60471J747K043K642K474J150l02r25q52n68k02J6l86j206j474q73m33j116
$$ 360471 362218 364261 366903 369377 370527 370225 369300 368448 367880 367678 367694 367308 366102 364628 363755 363322 362206
52973C62206k300k522j332J86N95n03k078k529j251O61J756K060K660L512L083
$$ 362206 359906 357384 356052 356238 356833 356330 354252 351723 350472 351133 352889 354949 357609 361121 364204
52958C64204P51j803k641j972j246p68K08J459J727Q69L27R69J750J493P13N75
$$ 364204 364955 363152 360511 358539 357293 356525 356733 358192 359919 360788 361115 362084 363834 365327 366040 366615
52942C66615Q90N47m75r76m73L4l34j109j454j411j282o63P74J986J506l09j372
$$ 366615 367505 368052 367577 366601 366128 366162 365828 364719 363265 361854 360572 359909 360683 362669 364175 363866 362494
52925C62494n48J005J797K133L123M394M173J706j469k957j791Q25K726K773J796
$$ 362494 361946 362951 364748 366881 370004 374398 378571 380277 378808 375851 374060 374885 377611 380384 382180
52910C82180J415J953K275J836J688K685L714L100J023q96j946k593k753j702
$$ 382180 383595 385548 387823 389659 391347 394032 397746 400846 401869 400973 399027 396434 393681 391979
52896C91979L1N89p17k291k513j751j246j206j108j023j472k415l312l755l588
$$ 391979 392010 392599 391882 389591 387078 385327 384081 382875 381767 380744 379272 376857 373545 369790 366202
52881C66202k851k103k085k620k647j749p25j89K91R36J007K70p2P72J446K23
$$ 366202 363351 361248 359163 356543 353896 352147 351422 351233 351524 352460 353467 353737 353665 354437 355883 356106
52865C56106k329m009l664j729J136M175N789M774K257N48P1o58j980k272q05
$$ 356106 353777 349768 346104 344375 345511 349686 355475 360249 362506 363054 363125 362467 360487 358215 357410
52850C57410O69M36p06r46j47L79Jp59j394j809j819j220k98N00J190J921K296
$$ 357410 358079 358515 357809 356863 356716 357095 357096 356337 354943 353134 351315 350095 349797 350297 351487 353408 355704
52833C55704J766N31n97j117j138q58l51K24P46J408K426L381L359J998J19r34
$$ 355704 357470 358001 357404 356287 355149 354291 353940 354164 354910 356318 358744 362125 365484 367482 367601 366667
52817C66667n60O26J480J414P52J61L1M27J247K140K552K227J506Q20J91m02o11
$$ 366667 366107 366733 368213 369627 370379 370540 370571 370998 372245 374385 376937 379164 380670 381490 381681 381279 380668
52800C80668k95j45r11k160k752k486k252k430k275j327l63k35o03o33l47m46
$$ 380668 380373 380228 379317 377157 374405 371919 369667 367237 364962 363635 363272 363037 362434 361801 361454 361008
52784C61008j170k220l458m777n406m337j710R50K253K291K017J677O03j346k875
$$ 361008 359838 357618 354160 349383 343977 339640 337930 338880 341133 343424 345441 347118 347721 346375 343500
52769C43500k552p73N63M49j35j00q0j154k539k342m83R10M69o78q99l38m5qN08
$$ 343500 340948 340175 340738 341187 341052 340952 340872 339718 337179 334837 334354 335264 335733 335055 334156 333818 333773 333765 334273
52750C34273J332J611J370J555K463L239L080K119Q13p47k561m193m934m388k809
$$ 334273 335605 337216 338586 340141 342604 345843 348923 351042 351855 351108 348547 344354 339420 335032 332223
52735C32223r21N73J366J466R13o5q15q25m58m54n80K23K009L248K705J072j36
$$ 332223 331302 331875 333241 334707 335620 335555 334740 333915 333457 333003 332423 332646 334655 337903 340608 341680 341544
52718C41544l92p1N74J219J047k44j533j689j319j727k622k587j591j072j341
$$ 341544 341152 341081 341655 342874 343921 343677 342144 340455 339136 337409 334787 332200 330609 329537 328196
52703C28196q67J112K984K875J138l29l32R40K652L755L347J599j16o49k02N26
$$ 328196 327329 328441 331425 334300 335438 335109 334777 335717 338369 342124 345471 347070 346954 346305 346103 346629
52687C46629J458K593L184K555J296N91P06J072J489K081K390J753O27L59J446
$$ 346629 348087 350680 353864 356419 357715 358306 359012 360084 361573 363654 366044 367797 368424 368783 370229
52672C70229K934L782L782K935J094j124k175j340J1j4j375k236j514k81k20j520
$$ 370229 373163 376945 380727 383662 384756 383632 381457 380117 380128 380114 378739 376503 374989 374708 374488 372968
52656C72968k884l240k740k141j792j526j127n98rN29Q01O42K76K61Q17J434J394
$$ 372968 370084 366844 364104 361963 360171 358645 357518 356920 356911 357440 358241 358883 359159 359420 360237 361671 363065
52639C63065O54o8p1O43J463J744J263M21N6P30J936K276Q70j479k960k764j902
$$ 363065 363719 363651 363580 364223 365686 367430 368693 369114 369170 369900 371836 374112 374982 373503 370543 367779 365877
52622C65877j703j972j378M48K134K342J510J037J108N31j198k730k450n95J119
$$ 365877 364174 362202 360824 361272 363406 365748 367258 368295 369403 369934 368736 366006 363556 362961 364080
52607C64080J643J551J732K031J624L18j162k079k368k252j619j66J853L525M167
$$ 364080 365723 367274 369006 371037 372661 372979 371817 369738 367370 365118 363499 363333 365186 368711 372878
52592C72878M059L933L881L247J677k38j639k284k349j775l77J438K610K234K95
$$ 372878 376937 380870 384751 387998 389675 389437 387798 385514 383165 381390 381013 382451 385061 387295 387590
52577C87590k268l987l684j531Q56J852J482J087J495K276K851L281L550L003
$$ 387590 385322 381335 377651 376120 376976 378828 380310 381397 382892 385168 388019 391300 394850 397853
52563C97853J364l52r48o19m77p69p62k05K62L26M22N37k01j971l355l007j589
$$ 397853 399217 398865 397917 397298 396821 396052 395290 395085 395347 395673 396095 396632 396431 394460 391105 388098 386509
52546C86509q58j255j627j248q52j255j947j763m83Q80J257O02q8K74J770L295
$$ 386509 385651 384396 382769 381521 380669 379414 377467 375704 375221 376101 377358 377960 377872 378146 379916 383211
52530C83211L631K799J962J907K100J574M04k47M94K187L505L396J833k20j443
$$ 383211 386842 389641 391603 393510 395610 397184 397588 397341 397835 400022 403527 406923 408756 408536 407093
52515D07093j025N47J611O86j940m223m390k724r03J74R94J839J839M77r56p55
$$ 407093 406068 406615 408226 408912 406972 402749 398359 395635 394732 394906 395900 397739 399578 400055 399099 398344
52499C98344O31R20q95l056l280j487M92J300J145R01Q96P80R2j188k349k392
$$ 398344 398975 399895 399000 395944 392664 391177 391669 392969 394114 395015 395911 396691 396783 395595 393246 390854
52483C90854j022Q63J890J363l15k086k916k495j494q29m47N83K463L866L476
$$ 390854 389832 390695 392585 393948 393633 391547 388631 386136 384642 383813 383366 383949 386412 390278 393754
52468C93754J809M89L2n04j640k462j974n23Q42J690K102J798L74j625k782k247
$$ 393754 395563 396052 396084 395580 393940 391478 389504 388981 389823 391513 393615 395413 395787 394162 391380 389133
52452C89133n27J259K450K948K934K869L361M438N187M728L365K202J681J227
$$ 389133 388606 389865 392315 395263 398197 401066 404427 408865 414052 418780 422145 424347 426028 427255
52438D27255M07l73p36j031j577j907j546j025j184j834k154k145k493l023k563
$$ 427255 427662 427289 426553 425522 423945 422038 420492 419467 418283 416449 414295 412150 409657 406634 404071
52423D04071p84J033J575R62R5m78m66L38J369J395K59l61Q78K851L353K109Q94
$$ 404071 403287 404320 405895 406857 406952 406474 406008 406346 407715 409110 409369 409008 409886 412737 416090 418199 419093
52406D19093Q81J491J946K378K868K768J786Q72J121K435L891M853N024L944J400
$$ 419093 419974 421465 423411 425789 428657 431425 433211 434083 435204 437639 441530 446383 451407 455351 456751
52391D56751j737l864m191l588l614m734n704m921k402LN32o59j938k058j094
$$ 456751 455014 451150 446959 443371 439757 435023 429319 424398 421996 421999 422531 421872 419934 417876 416782
52376D16782J46Q72N87o56k084k705k139p66Q01J924K049J298P30J213K243K675
$$ 416782 416928 417800 418387 417731 415647 412942 410803 410037 410838 412762 414811 416109 416839 418052 420295 422970
52360D22970K484K666L373L415K077M21N8J364L448N314O516P103P428P755P968
$$ 422970 425454 428120 431493 434908 436985 437406 437464 438828 442276 447590 454106 461209 468637 476392 484360
52345D84360Q000Q325R168R397P385L235j050l979n847p125p235n987m875n400
$$ 484360 492360 500685 509853 519250 526635 529870 528820 524841 518994 511869 504634 498647 493772 488372
52331D88372o852p202n626k941j79J934K615J699M52L62J187J456P92L87J088
$$ 488372 481520 474318 468692 465751 465572 467506 470121 471820 472272 472634 473821 475277 476069 476456 477544
52316D77544K337L317M045M952O238P812R121R194P774O198N962O526O010M054
$$ 477544 479881 483198 487243 492195 498433 506245 515366 524560 532334 538532 544494 551020 557030 561084
52302E61084K327J852J684R93O65J483K314J786P47J135K957M241L866K837K570
$$ 561084 563411 565263 566947 567940 568605 570088 572402 574188 574935 576070 579027 583268 587134 589971 592541
52287E92541L255M317N353O064O148N783N704O386P671R325J1240J2912J3487
$$ 592541 595796 600113 605466 611530 617678 623461 629165 635551 643222 652547 663787 676699 690186
52274F90186J2921J2505J3561J5965J8446K0065K0848K1236K1592K2219K3265
$$ 690186 703107 715612 729173 745138 763584 783649 804497 825733 847325 869544 892809
52263H92809K4447K5304K5838K6563K7782K9104K9886K9753K8610K6446K3544
$$ 892809 917256 942560 968398 994961 1022743 1051847 1081733 1111486 1140096 1166542 1190086
52252A190086K0622J8373J6964J6129J5471J4372J2103Q727N724M793N859O989
$$ 1190086 1210708 1229081 1246045 1262174 1277645 1292017 1304120 1312847 1318571 1323364 1329223 1336212
52240A336212O583M939L364K457J958J591J273P31k67j515k755m202n958p293
$$ 1336212 1342795 1347734 1351098 1353555 1355513 1357104 1358377 1359108 1358841 1357326 1354571 1350369 1344411 1337118
52226A337118p349o403n508m928m033k657j330J87L161P742J1788J3122J2383
$$ 1337118 1329769 1323366 1317858 1312930 1308897 1306240 1304910 1305097 1308258 1316000 1327788 1340910 1353293
52213A353293J2229J3909J6035J7016J7297J8271J9818K0192J8309J5173J2649
$$ 1353293 1365522 1379431 1395466 1412482 1429779 1448050 1467868 1488060 1506369 1521542 1534191
52202A534191J1454J0971J0515R972R174P699N666M025L330K821J576P1m95k83
$$ 1534191 1545645 1556616 1567131 1577103 1586277 1593976 1599642 1603667 1606997 1609818 1611394 1611465 1610970 1610687
52188A610687q50k825m746n066m487n278q455j2434j4669j4252j2765j2420j3486
$$ 1610687 1609837 1607012 1602266 1597200 1592713 1587435 1578980 1566546 1551877 1537625 1524860 1512440 1498954
52175A498954j4016j2503j0050q867r080q653o633m542l854l769k886j623j213
$$ 1498954 1484938 1472435 1462385 1453518 1444438 1435785 1429152 1424610 1420756 1416987 1414101 1412478 1411265
52162A411265j268l66J480K828L171L366L626L142K129K423M939P933Q949P597
$$ 1411265 1409997 1409631 1411111 1413939 1417110 1420476 1424102 1427244 1429373 1431796 1436735 1444668 1453617 1461214
52148A461214N496M307M619O030P346P315N945M588M141L951L304K906L654M704
$$ 1461214 1466710 1471017 1475636 1481666 1489012 1496327 1502272 1506860 1511001 1514952 1518256 1521162 1524816 1529520
52134A529520M471L222K915M195N157L920J189p10o24O51J867K585K883K778K281
$$ 1529520 1533991 1537213 1540128 1544323 1549480 1553400 1554589 1553879 1553255 1553906 1555773 1558358 1561241 1564019 1566300
52119A566300J676J238P39n05k916n957q341r139q662q021p835p656o789n294
$$ 1566300 1567976 1569214 1569953 1569448 1566532 1560575 1552234 1543095 1534433 1526412 1518577 1510921 1504132 1498838
52105A498838l793k602j543o31k88n69n88O62L014N159O060N953N749N851N820
$$ 1498838 1495045 1492443 1490900 1490269 1489981 1489412 1488824 1489486 1492500 1497659 1503719 1509672 1515421 1521272 1527092
52090A527092N026L399J621O25P15J246J599K331M603Q187J0967J1148R351P740
$$ 1527092 1532118 1535517 1537138 1537763 1538478 1539724 1541323 1543654 1548257 1556444 1567411 1578559 1587910 1595650
52076A595650P562Q514J0013J1848J3714J5220J6467J7710J8575J8783J9458K2203
$$ 1595650 1603212 1611726 1621739 1633587 1647301 1662521 1678988 1696698 1715273 1734056 1753514 1775717
52064A775717K6639L0412L2124L2717L3313L3552L3120L3162L4471L5508L4195
$$ 1775717 1802356 1832768 1864892 1897609 1930922 1964474 1997594 2030756 2065227 2100735 2134930
52053B134930L0777K7061K3495J9222J4679J1710J0637R212N422j15n331r101
$$ 2134930 2165707 2192768 2216263 2235485 2250164 2261874 2272511 2281723 2287145 2287030 2281699 2272598
52041B272598j1533j2868j3173j2755j2160j1789j1641j1250j0084q517p881q771
$$ 2272598 2261065 2248197 2235024 2222269 2210109 2198320 2186679 2175429 2165345 2156828 2148947 2140176
52029B140176r775r166p518p066q505j0144j0560j0179r521p724m201k60K382
$$ 2140176 2130401 2121235 2113717 2106651 2098146 2088002 2077442 2067263 2057742 2050018 2045817 2045557 2047939
52016B047939L797N157O737Q129R709J2214J5071J6714J6639J6004J5895J5961
$$ 2047939 2051736 2056893 2063630 2071759 2081468 2093682 2108753 2125467 2142106 2158110 2174005 2189966
52004B189966J5083J2671R151N604L016J509L43j156k964m788o658q606j0375
$$ 2189966 2205049 2217720 2226871 2232475 2235491 2237000 2237343 2236187 2233223 2228435 2221777 2213171 2202796
51991B202796j1904j3615j5686j7604j9031k0429k2108k3325k3347k2775k2770
$$ 2202796 2190892 2177277 2161591 2143987 2124956 2104527 2082419 2059094 2035747 2012972 1990202
51980A990202k3365k3711k3635k3833k4387k4322k2922k0719j8863j7868j7219
$$ 1990202 1966837 1943126 1919491 1895658 1871271 1846949 1824027 1803308 1784445 1766577 1749358
51969A749358j6076j4404j3249j3344j3580j2199r687q890j1233j4462j5715j5398
$$ 1749358 1733282 1718878 1705629 1692285 1678705 1666506 1656819 1647929 1636696 1622234 1606519 1591121
51957A591121j5884j7471j8168j7198j6112j6148j6778j7306j7948j8670j8836
$$ 1591121 1575237 1557766 1539598 1522400 1506288 1490140 1473362 1456056 1438108 1419438 1400602
51946A400602j8672j9347k0834k1427k0243j8578j7804j7526j6952j6552j6911
$$ 1400602 1381930 1362583 1341749 1320322 1300079 1281501 1263697 1246171 1229219 1212667 1195756
51935A195756j7253j6529j5102j3965j3073j1793j0361r549r277q747p773p047
$$ 1195756 1178503 1161974 1146872 1132907 1119834 1108041 1097680 1088131 1078854 1070107 1062334 1055287
51923A055287p148p935q711q704p847p349q664j1532j3899j4347j3618j3139j3085
$$ 1055287 1048139 1040204 1031493 1022789 1014942 1007593 998929 987397 973498 959151 945533 932394 919309
51910I19309j2721j1695j0128q247o603n731n000k992J92K588L316M217O868R595
$$ 919309 906588 894893 884765 876518 869915 864184 859184 856192 856384 858972 862288 866505 873373 882968
51896H82968R663P350N417N046M850L819K705J970N79k105m790n768n035l963
$$ 882968 892631 899981 905398 910444 915294 919113 921818 923788 924367 922262 917472 911704 906669 902706
51882I02706l446l093k001J04K556M736P113J0554J4376J6385J5624J3802J2731
$$ 902706 899260 896167 894166 894270 896826 901562 908675 919229 933605 949990 965614 979416 992147
51869I92147J1755R386O220L847J742j984o827r883j0057r690j0969j3070j4196
$$ 992147 1003902 1013288 1019508 1023355 1025097 1023113 1016286 1006403 996346 986656 975687 962617 948421
51856I48421j4378j4443j3760j0957o315j790J076K348L098M188N293M761J202
$$ 948421 934043 919600 905840 894883 888568 886778 887854 890202 893300 897488 902781 907542 908744
51843I08744m408r111j0897j0399r222p747n504k711l51R10J078M37p05k217m388
$$ 908744 904336 895225 884328 873929 864707 856960 851456 848745 848394 849304 850382 850819 850114 847897 843509
51828H43509p399j0495j2456j3070j3231j3316j2592j0578p863n076k158P59K922
$$ 843509 836110 825615 813159 800089 786858 773542 760950 750372 742509 737433 735275 736034 738956
51815G38956M075M967O071O829O818O468N969M766L013K096K604L014J755n61
$$ 738956 743031 747998 754069 760898 767716 774184 780153 784919 787932 790028 792632 795646 797401 796840
51801G96840k250k943l424m044m636n156n216l889j429M2q15k241j715L06J188
$$ 796840 794590 791647 788223 784179 779543 774387 769171 765282 763853 763895 763080 760839 759124 759430 760618
51786G60618P3j427k263l114m258m651l944l491m297n546o088o142o471o897o633
$$ 760618 760691 759264 757001 753887 749629 744978 741034 737543 733246 727700 721612 715470 708999 702102 695469
51771F95469n463l929k778k552l160l613k868j077N76J310J228N19q09k362l497
$$ 695469 690006 686077 683299 680747 677587 673974 671106 670029 670605 671915 673143 673662 672853 670491 666994
51756F66994m092m274l647j934k10Oj085j787j349n41L28J918L836M252K664J116
$$ 666994 662902 658628 654981 653047 652837 652843 651758 649971 648622 648081 648409 650327 654163 658415 661079 662195
51740F62195J184J523J19k444m035m280m580n335n394m320l276l133l257k752
$$ 662195 663379 664902 665021 662577 658542 654262 649682 644347 638953 634633 631357 628224 624967 622215
51726F22215j789j049p14n88o34p58m86N94K277L810M466L982K565O66j180k280
$$ 622215 620426 619377 618663 618075 617441 616683 616197 616791 619068 622878 627344 631326 633891 634557 633377 631097
51710F31097j896O0K533M167M844N758P758J0238J1891J1935J0406Q204P151Q694
$$ 631097 629201 629261 631794 635961 640805 646563 654321 664559 676450 688385 698791 706995 714146 722840
51696G22840J1657J2441Q688K090l645o807q388r544j0304j0612j0820j0680r364
$$ 722840 734497 746938 755626 757716 754071 747264 738876 729332 719028 708416 697596 686916 677552
51683F77552p015n158m906n704o276n949m659k538j53J679K821L914N143N709
$$ 677552 670537 665379 660473 654769 648493 642544 637885 635347 635194 636873 639694 643608 648751 654460
51669F54460N091L992L308K822J852O69K52P32R29l02k737m996n947n766n556
$$ 654460 659551 663543 666851 669673 671525 672194 672446 673178 674107 673805 671068 666072 660125 654359 648803
51654F48803n875n948m832k957j767j753j876j209j95L41N54J138K198L412M750
$$ 648803 642928 636980 632148 629191 627424 625671 623795 622586 622391 622732 623286 624424 626622 630034 634784
51639F34784O149O791N700K973j95k470k928j214J888M460N093M253L160J806
$$ 634784 640933 647724 653424 656397 656202 653732 650804 649590 651478 655938 661031 665284 668444 670250
51625F70250n52l282m582m111l673m527n538n050l291j590k75J165K533L230L751
$$ 670250 669698 666416 661834 657723 654050 649523 643985 638935 635644 634054 633779 634944 637477 640707 644458
51610F44458N188P152P826O550M983M935N981O168M477J837o3m63j69o97k492
$$ 644458 649646 656798 664624 671174 676157 681092 687073 693241 697718 699555 699492 699029 698860 698163 695671
51595F95671l960l002L50L705N258N941P723J0419J1562R321M503n20l893n228
$$ 695671 691711 688709 689059 692764 698022 703963 711686 722105 733667 742988 747491 746971 743078 737850
51581G37850n381n705o896q299q783q357q197q960j0021j0660j0884j0484q510
$$ 737850 732469 726764 719868 711569 702786 694429 686232 677272 667251 656591 645707 635223 626713
51568F26713m830j317M5k10J07J506K098O38j419j944j036m60r31j371q47R6M05
$$ 626713 621883 620566 620611 620401 620508 622014 624112 624750 623331 621387 620351 619891 618960 617589 616742 616838 617243
51551F17243j8k93L11J673L082L899M002L603K912K249K348L823O060P349O779
$$ 617243 617225 616932 617243 618916 621998 625897 629899 633502 636414 638663 641011 644834 650894 658243 665022
51536F65022N525N445O850Q494R463R856R521P499L413j477n374p648q784r083
$$ 665022 670547 675992 682842 691336 700799 710655 720176 727675 731088 729611 724237 716589 707805 698722
51522F98722q186n805k325J364M359O225P329Q605J0710J3358J5608J6743J6951
$$ 698722 690536 684731 682406 683770 688129 694354 701683 710288 720998 734356 749964 766707 783658
51509G83658J7198J8430K0547K2283K2476K1361K0136J9518J9500K0452K3234
$$ 783658 800856 819286 839833 862116 884592 905953 926089 945607 965107 985559 1008793
51498A008793K7698L2161L5181L7231L9727M2890M5332M5322M1796L4637K4877
$$ 1008793 1036491 1068652 1103833 1141064 1180791 1223681 1269013 1314335 1356131 1390768 1415645
51487A415645J4358M554m182j1900j8385k3798k9129l4848l9761m2375m2877m2510
$$ 1415645 1430003 1434557 1430375 1418475 1400090 1376292 1347163 1312315 1272554 1230179 1187302 1144792
51475A144792m1501l9233l6192l3884l2624l0998k8014k4428k1371j8993j7035
$$ 1144792 1103291 1064058 1027866 993982 961358 930360 902346 877918 856547 837554 820519
51464H20519j5516j4226j2575j0623r271q839q467p495o317n237l709j633j78
$$ 820519 805003 790777 778202 767579 758308 749469 741002 733507 727190 721953 718244 716611 716433
51451G16433j97p27l20Q82J598J325N76m38k166m812p800j0055j0436q515n471
$$ 716433 716236 715509 715189 716071 717669 718994 719570 719132 716966 712154 704354 694299 683863 675348 669877
51436F69877l484l461m055l686k620k092k297k638l146m125m839m143k319q58
$$ 669877 666393 662932 658877 655191 652571 650479 648182 645544 642398 638273 633434 629291 626972 626114
51422F26114n15q14j415k552m047n153n592n732n669n259m952n382n972n353l474
$$ 626114 625599 624785 623370 620818 616771 611618 606026 600294 594625 589366 584414 579032 573060 567707 564233
51407E64233k020k241l332l549k130K78K414L352L219K983L037K476P44p12j6
$$ 564233 562213 559972 556640 553091 550961 551239 553653 557005 560224 563207 566244 568720 569464 568752 568736
51392E68736K158L233K487K086L684O081P413P823Q525R562J0231J0708J1536
$$ 568736 570894 574127 576614 578700 582384 588465 595878 603701 612226 621788 632019 642727 654263
51379F54263J2081J1145Q793O265M248K395M38j248k175k084j054J04l6k095m882
$$ 654263 666344 677489 686282 692547 696795 699190 699628 698380 696205 694121 693067 693171 693135 691040 686158
51364F86158o608o859o512o085n341m331l717l742l732k970j460L50K111L623
$$ 686158 679550 672691 666179 660094 654753 650422 646705 642963 639231 636261 634801 635151 637262 640885
51350F40885M670N135N193N339O127P531Q594Q170O183L737J925J096J339K563
$$ 640885 645555 650690 655883 661222 667349 674880 683474 691644 697827 701564 703489 704585 705924 708487
51336G08487L716L095N53j574r05K165N286P281Q985J1156J3224J4515J5574J7515
$$ 708487 712203 715298 715851 714277 713372 715537 720823 728104 737089 748245 761469 775984 791558 809073
51322H09073K0705K4638K8723L2853L7277M2142M7083N1466N4989N7659N9000
$$ 809073 829778 854416 883139 915992 953269 995411 1042494 1093960 1148949 1206608 1265608
51311A265608N8073N4624M9428M2944L4657K4720J4994O859j151j1447k3430l3692
$$ 1265608 1323681 1378305 1427733 1470677 1505334 1530054 1545048 1551907 1550756 1539309 1515879 1482187
51299A482187m0416m5342n0451n4835n6401n5198n3213n1605m9831m7135m3383
$$ 1482187 1441771 1396429 1345978 1291143 1234742 1179544 1126331 1074726 1024895 977760 934377
51288I34377l8510l2546k6552k2292k0370j9380j7567j4907j2949j2770j3726
$$ 934377 895867 863321 836769 814477 794107 774727 757160 742253 729304 716534 702808
51277G02808j4384j4081j3066j1554r437p005n035l746k535j370j496l631o132
$$ 702808 688424 674343 661277 649723 640286 633281 628246 624500 621965 620595 619099 615468 609336
51264F09336o543m729k987k862l539l819l880m109l599j380J658L571L706L023
$$ 609336 602793 598064 595077 592215 588676 584857 580977 576868 573269 571889 573547 577118 580824 583847
51250E83847K451K049J751J679J589R40j93r55o81L70J380J583O39j031k305k420
$$ 583847 586298 588347 590098 591777 593366 594306 594113 593158 592477 592847 594227 595810 596449 595418 593113 590693
51234E90693j976k230l381m255l952l053k662k771k225l11K187L649L286J912
$$ 590693 588717 586487 583106 578851 574899 571846 569184 566413 564188 563877 566064 569713 572999 574911
51220E74911J119J717L240M790N798N806M273J427j163j801n84P22Q18Q6m76n89
$$ 574911 576030 577747 580987 585777 591575 597381 601654 603081 601918 600117 599533 600255 601073 601159 600683 600094
51204F00094l94L68J990L857M726L954K039j3j453k084k244k459k753k492j391
$$ 600094 599700 600068 602058 605915 610641 614595 616634 616621 615168 613084 610840 608381 605628 603136 601745
51189F01745m20j007l104m799m322k060m8L10m39p92j02Q49R19j17j527k664l590
$$ 601745 601325 600318 597214 592415 588093 586033 585985 586295 585856 585064 584962 585811 586730 586613 585086 582422 578832
51172E78832m465m826m092k697j836j893j869q92L22M17n04q12M44K145K447R81
$$ 578832 574367 569541 565449 562752 560916 559023 557154 556262 556584 557001 556497 555685 556129 558274 560721 561702
51156E61702q42j432m35J344K895L741M040M218M574N127N658N784N194M095L218
$$ 561702 560860 559428 558993 560337 563232 566973 571013 575231 579805 584932 590590 596374 601568 605663 608881
51141F08881L052L085K314N06j542k939l370k776j284J65M2k027m333m880l746
$$ 608881 611933 615018 617332 617838 616296 613357 609987 607211 605927 606092 606134 604107 599774 594894 591148
51126E91148k667k515k454j703q40o67p90k63R06J840K112K139K299K379K067
$$ 591148 588481 585966 583512 581809 580969 580302 579512 579249 580155 581995 584107 586246 588545 590924 592991
51111E92991J499J069J072J561K226K394J606L90m2Q55K224K877K620K015J234
$$ 592991 594490 595559 596631 598192 600418 602812 604418 604808 604766 605621 607845 610722 613342 615357 616591
51096F16591R8q50m96J029J848O49j132q96J463L081J796j016k289j105O10P91
$$ 616591 616689 615839 615343 616372 618220 618869 617737 616841 618304 621385 623181 622165 619876 618771 619381 620172
51080F20172n89k192l037l058k668k361k504l067l603l609k920j820r16p22j089
$$ 620172 619583 617391 614354 611296 608628 606267 603763 600696 597093 593484 590564 588744 587828 587106 586017
51065E86017j159k75J231K560L591M774N848N646L668J249L60J433L064L801L625
$$ 586017 584858 584583 585814 588374 591965 596739 602587 608233 611901 613150 613510 614943 618007 621808 625433
51050F25433L515M120N245O315O826O407M998L193K056K117K746K908K438J983
$$ 625433 628948 633068 638313 644628 651454 657861 662859 666052 668108 670225 672971 675879 678317 680300
51036F80300J764J163j48j435j802j357p17J4Q86J127j58k218k874j101J499K618
$$ 680300 682064 683227 683079 681644 679842 678485 677768 677782 678668 679795 679637 677419 674545 673444 674943 677561
51020F77561J951J143J410K216K367J644P87L01r9o98q88L46L012N726P139P321
$$ 677561 679512 680655 682065 684281 686648 688292 689079 689380 689281 688583 687695 688041 691053 696779 703918 711239
51004G11239P238P264P051O709P168R024J1729J4215J5731J5748J3867J0527P432
$$ 711239 718477 725741 732792 739501 746669 755693 767422 781637 797368 813116 826983 837510 844942
50991H44942O498Q321J1835J5270J7160J6889J4893J2359J0289Q704O822L987
$$ 844942 851440 859761 871596 886866 904026 920915 935808 948167 958456 967160 973982 977969
50979I77969N13k439m018m852o551r543j2015j1995j0201r381j0856j3107j4194
$$ 977969 978482 976043 972025 967173 960622 951079 939064 927069 916868 907487 896631 883524 869330
50966H69330j3929j2813j0557p137l992k427j573K44K723M193M606N763Q347J0810
$$ 869330 855401 842588 832031 824894 820902 818475 816902 817146 819869 824062 828668 834431 842778 853588
50952H53588J1847J2154J2790J3387J3143J2313J1495J0528R310Q768R725J1437
$$ 853588 865435 877589 890379 903766 916909 929222 940717 951245 960555 969323 979048 990485
50940I90485J2557J3055J3870J5100J5900J6014J6130J6614J6976J6793J6150
$$ 990485 1003042 1016097 1029967 1045067 1060967 1076981 1093111 1109725 1126701 1143494 1159644
50929A159644J5131J3779J2735J2937J4230J5173J4654J3070J1557J0745J0534
$$ 1159644 1174775 1188554 1201289 1214226 1228456 1243629 1258283 1271353 1282910 1293655 1304189
50918A304189J0511J0129R177Q498R571J2800J6822K0073K2579K5561K9767L5000
$$ 1304189 1314700 1324829 1334006 1342504 1352075 1364875 1381697 1401770 1424349 1449910 1479677 1514677
50906A514677M0817M6670N1542N4568N6292N8497O2229O6517O9511P0453P0013
$$ 1514677 1555494 1602164 1653706 1708274 1764566 1823063 1885292 1951809 2021320 2091773 2161786
50895B161786O8983O7439O5275O2872O0542N7595N2768M5978L8921L3302K8779
$$ 2161786 2230769 2298208 2363483 2426355 2486897 2544492 2597260 2643238 2682159 2715461 2744240
50884B744240K3720J7724J2372R056P250N656L972K468N22k914p612j2137j5693
$$ 2744240 2767960 2785684 2798056 2807112 2814362 2820018 2823990 2826458 2826980 2824066 2816454 2804317 2788624
50871B788624j8685k1431k3670k5781k9051l3901l8921m2649m5512m8853n2754
$$ 2788624 2769939 2748508 2724838 2699057 2670006 2636105 2597184 2554535 2509023 2460170 2407416
50860B407416n6110n8461o0366o1842o1820n9697n6472n3638n1531m9373m6600
$$ 2407416 2351306 2292845 2232479 2170637 2108817 2049120 1992648 1939010 1887479 1838106 1791506
50849A791506m3363l9900l6165l2349k9213k7363k6283k4693k2033j9165j7269
$$ 1791506 1748143 1708243 1672078 1639729 1610516 1583153 1556870 1532177 1510144 1490979 1473710
50838A473710j6419j5719j4513j2781j0595q088o044n495o292o867o015m174k273
$$ 1473710 1457291 1441572 1427059 1414278 1403683 1395595 1389551 1384056 1377764 1370897 1364882 1360708 1358435
50825A358435j84K588N211N902M260K167J965M158P245R432J0322J1051J2851
$$ 1358435 1358251 1360839 1366050 1371952 1376212 1378379 1380344 1384502 1391747 1401179 1411501 1422552 1435403
50812A435403J5500J7499J7967J7760J8306J9946K2166K4964K8847L3565L7936
$$ 1435403 1450903 1468402 1486369 1504129 1522435 1542381 1564547 1589511 1618358 1651923 1689859
50801A689859M1212M3883M6893N0702N5235O0224O5336P0502P6108Q2354Q8670
$$ 1689859 1731071 1774954 1821847 1872549 1927784 1988008 2053344 2123846 2199954 2282308 2370978
50790B370978R4463J00349J07542J15986J24174J31103J37354J43709J49660J54060
$$ 2370978 2465441 2565790 2673332 2789318 2913492 3044595 3181949 3325658 3475318 3629378
50780C629378J56466J57163J56444J54428J50844J44380J33132J16797R7872P9591
$$ 3629378 3785844 3943007 4099451 4253879 4404723 4549103 4682235 4799032 4896904 4976495
50770D976495O2939M6701L0173J4478J115r555j7775k3264k5431k4424k1262j6974
$$ 4976495 5039434 5086135 5116308 5130786 5131901 5122346 5104571 5081307 5055876 5031452 5010190 4993216
50758D993216j2107p254l717l206o755j4092k4170l6118m9422o3397p7178r0387
$$ 4993216 4981109 4973855 4970138 4966932 4960177 4946085 4921915 4885797 4836375 4772978 4695800 4605413
50746D605413j03305j15994j27568j36757j43036j46712j47990j46426j41571
$$ 4605413 4502108 4386114 4258546 4121789 3978753 3832041 3684051 3537625 3396054
50737C396054j33965j25150j16465j07969r8865q8889p8724o8891n9032m9073
$$ 3396054 3262089 3136939 3020474 2912505 2813640 2724751 2646027 2577136 2518104 2469031
50727B469031m0357l4321l0333k6128k0691j5395j1983j0674j0892j2465j5012
$$ 2469031 2428674 2394353 2364020 2337892 2317201 2301806 2289823 2279149 2268257 2255792 2240780
50716B240780j7152j7762j7385j7202j7129j6309j5103j5015j6564j8628k0298
$$ 2240780 2223628 2205866 2188481 2171279 2154150 2137841 2122738 2107723 2091159 2072531 2052233
50705B052233k2021k4340k6490k7196k6205k4393k2683k1522k0938k0464j9184
$$ 2052233 2030212 2005872 1979382 1952186 1925981 1901588 1878905 1857383 1836445 1815981 1796797
50694A796797j6546j3130j0087p751n240j666K610O282Q615J0358J3062J7559
$$ 1796797 1780251 1767121 1757034 1749283 1744043 1742377 1744987 1751269 1759884 1770242 1783304 1800863
50682A800863K3174K8387L2273L5424L9423M5199N1872N7619O1686O5115O9127
$$ 1800863 1824037 1852424 1884697 1920121 1959544 2004743 2056615 2114234 2175920 2241035 2310162
50671B310162P3485P7047P9439Q1061Q1789Q1012P9115P7592P7027P6024P3072
$$ 2310162 2383647 2460694 2540133 2621194 2702983 2783995 2863110 2940702 3017729 3093753 3166825
50660C166825O8601O4215O0349N5728M8896L9514K8302J6415M902n712j5242k3085
$$ 3166825 3235426 3299641 3359990 3415718 3464614 3504128 3532430 3548845 3553747 3548035 3532793 3509708
50648C509708k8126k9882k9259k7564k5152k1667j7191j2421p913l949q93Q72
$$ 3509708 3481582 3451700 3422441 3394877 3369725 3348058 3330867 3318446 3310533 3306584 3305691 3306563
50636C306563J055j002o361j5130k5502l5211m3772n2182o0482o6907o9729o9026
$$ 3306563 3307618 3306616 3300255 3285125 3259623 3224412 3180640 3128458 3067976 3001069 2931340 2862314
50624B862314o6212o2534n8336n3197m6530l8535l0541k3684j7351r851p92Q320
$$ 2862314 2796102 2733568 2675232 2622035 2575505 2536970 2506429 2482745 2465394 2455543 2454751 2463071
50612B463071J6153K3108L0102L6699M1565M4296M5758M6692M6759M5304M2603
$$ 2463071 2479224 2502332 2532434 2569133 2610698 2654994 2700752 2747444 2794203 2839507 2882110
50601B882110L9951L8559L8498L8947L9429M0315M1901M3534M4453M5124M6833
$$ 2882110 2922061 2960620 2999118 3038065 3077494 3117809 3159710 3203244 3247697 3292821 3339654
50590C339654M9900N3348N6515N9985O4436O9427P4137P8579Q3252Q8122R2743
$$ 3339654 3389554 3442902 3499417 3559402 3623838 3693265 3767402 3845981 3929233 4017355 4110098
50579D110098R7035J00945J03540J03508J00745R6554R1871Q6098P8186O8349
$$ 4110098 4207133 4308078 4411618 4515126 4615871 4712425 4804296 4890394 4968580 5036929
50569E036929N7880M7749L8293L0181K4188J9096J0717n269k8926n5030p6720
$$ 5036929 5094809 5142558 5180851 5211032 5235220 5254316 5265033 5259764 5230838 5175808 5099088
50558E099088q9894r4368r2165q5551p6103o4578n1628l8768k8062k0346j4441
$$ 5099088 5009194 4914826 4822661 4737110 4661007 4596429 4544801 4506033 4477971 4457625 4443184
50547D443184r071n064m652q878j6870k7496m0372n4937o9849q3878r6480j06960
$$ 4443184 4434113 4429049 4424397 4415519 4398649 4371153 4330781 4275844 4205995 4122117 4025637 3918677
50535C918677j14027j17113j17411j16631j15089j11854j06567j00149r3650q7180
$$ 3918677 3804650 3687537 3570126 3453495 3338406 3226552 3119985 3019836 2926186 2839006
50525B839006q0384p3353o6566o0149n3731m7171m1051l6055l2128k8589k4972
$$ 2839006 2758622 2685269 2618703 2558554 2504823 2457652 2416601 2380546 2348418 2319829 2294857
50514B294857k1243j7259j2627p439k452J824N646R218J2133J4300J6777K0545
$$ 2294857 2273614 2256355 2243728 2236289 2233837 2235661 2241307 2250525 2262658 2276958 2293735 2314280
50502B314280K4996K8739L1641L4808L8701M2626M6192M9898N3781N6971N9252
$$ 2314280 2339276 2368015 2399656 2434464 2473165 2515791 2561983 2611881 2665662 2722633 2781885
50491B781885O1841O5574O9232P0916P0564O9971P0526P1953P3328P4516P6370
$$ 2781885 2843726 2909300 2978532 3049448 3120012 3189983 3260509 3332462 3405790 3480306 3556676
50480C556676P9919Q5563R2790J00751J09304J19260J31290J44798J58411J71431
$$ 3556676 3636595 3722158 3814948 3915699 4025003 4144263 4275553 4420351 4578762 4750193
50470D750193J84294J97437K10353K22042K32104K40801K48094K53168K55234
$$ 4750193 4934487 5131924 5342277 5564319 5796423 6037224 6285318 6538486 6793720
50461F793720K54339K50868K44338K33359K16914J95214J69201J39782J07659
$$ 6793720 7048059 7298927 7543265 7776624 7993538 8188752 8357953 8497735 8605394
50452H605394P3325L6855j608m0842p8592j12959j43018j67817j86018j97234
$$ 8605394 8678719 8715574 8713966 8673124 8594532 8481573 8338555 8170738 7984720 7787486
50442G787486k02538k02422j95407j80294j58943j35004j10297q4260n6786k9595
$$ 7787486 7584948 7382526 7187119 7006825 6847882 6712878 6602581 6518321 6461535 6431940
50432F431940m658J6781L3255M2770M4040L6760K0513m875l7476p3540j10096
$$ 6431940 6427282 6444063 6477318 6520088 6564128 6600888 6621401 6616526 6579050 6505510 6395414
50421F395414j45564j77440k01891k17176k25541k30021k30943k27263k19765
$$ 6395414 6249850 6072410 5870519 5653343 5427802 5197781 4966838 4739575 4519810
50412D519810k10615k00595j89038j76149j63329j51099j38514j24949j11201
$$ 4519810 4309195 4108600 3919562 3743413 3580084 3428985 3290471 3165522 3054321
50403C054321r8537q7653p8731p1497o4947n7783m9558m0940l2931k6256k1302
$$ 3054321 2955784 2868131 2789400 2717903 2652956 2595173 2545615 2504675 2471744 2445488 2424186
50392B424186j7951j5395j2660r555o879n653o013o620n367j358L834P687R540
$$ 2424186 2406235 2390840 2378180 2368625 2361746 2356093 2350080 2343460 2338093 2336735 2340569 2348256 2357796
50379B357796J0898J2904J4851J5668J5491J4895J3945J2970J3157J5104J7785
$$ 2357796 2368694 2381598 2396449 2412117 2427608 2442503 2456448 2469418 2482575 2497679 2515464
50368B515464K0114K2601K6208L0495L4257L7273M0202M3429M7241N2259N8441
$$ 2515464 2535578 2558179 2584387 2614882 2649139 2686412 2726614 2770043 2817284 2869543 2927984
50357B927984O4526O9809P5455Q2558R0062R6537J02731J10029J17302J22123
$$ 2927984 2992510 3062319 3137774 3220332 3310394 3406931 3509662 3619691 3736993 3859116
50347C859116J24604J26894J28955J28010J22945J16083J09307J01170Q9629P5340
$$ 3859116 3983720 4110614 4239569 4367579 4490524 4606607 4715914 4817084 4906713 4982053
50337D982053O0022M3332K3711J321k1965m4868o7137q7966j05753j19355j28403
$$ 4982053 5042075 5085407 5109118 5110439 5088474 5043606 4976469 4888503 4782750 4663395 4534992
50326D534992j32503j31363j25693j16821j05330r1007p4402n7505m2330k9208
$$ 4534992 4402489 4271126 4145433 4028612 3923282 3832275 3757873 3700368 3658038 3628830
50316C628830j6964m680O879J5597J9700J8928J4019N375p214k3419m1519n9058
$$ 3628830 3611866 3607186 3614065 3629662 3649362 3668290 3682309 3687684 3680470 3657051 3615532 3556474
50304C556474p4276q6891r7493j06229j12110j13975j12163j08595j04804j00639
$$ 3556474 3482198 3395307 3297814 3191585 3079475 2965500 2853337 2744742 2639938 2539299
50294B539299r5545r0129q5262q0418p4451o7723o1826n7217n2772m7829m2876
$$ 2539299 2443754 2353625 2268363 2187945 2113494 2045771 1983945 1926728 1873956 1826127 1783251
50283A783251l7898l1962k5213j9403j5188j0581l752L834R041J1173J2500J4730
$$ 1783251 1745353 1713391 1688178 1668775 1653587 1643006 1639254 1643088 1652129 1663302 1675802 1690532
50271A690532J6606J5495J0381K757m777j0481j4321j7012j8436j7613j4550j1112
$$ 1690532 1707138 1722633 1733014 1735771 1730994 1720513 1706192 1689180 1670744 1653131 1638581 1627469
50259A627469r137q283o913m801l577m344o126p231p223o728n962m501k338l72
$$ 1627469 1618332 1610049 1603136 1598335 1594758 1590414 1584288 1577057 1569834 1563106 1557144 1552643 1550305 1549933
50245A549933O03Q59J263K210L406M536N477N879N310M274M341O567J0088J3049
$$ 1549933 1550536 1551395 1552658 1554868 1558274 1562810 1568287 1574166 1579476 1583750 1588091 1594658 1604746 1617795
50231A617795J4612J5371J6051J6759J7403J7932J7978J7254J6429J6749J8509
$$ 1617795 1632407 1647778 1663829 1680588 1697991 1715923 1733901 1751155 1767584 1784333 1802842
50220A802842K0794K2921K4795K5223K1279J0981l662j7530k6468k9936k9911
$$ 1802842 1823636 1846557 1871352 1896575 1917854 1928835 1925173 1907643 1881175 1851239 1821328
50209A821328k8305k5929k3150k0536j8451j6421j3568r970p020n869n806m960
$$ 1821328 1793023 1767094 1743944 1723408 1704957 1688536 1674968 1664998 1657978 1652109 1646303 1641343
50197A641343k553M47K903M775O510Q202R880J1924J4367J6472J7681J8591K0279
$$ 1641343 1638790 1639237 1642140 1646915 1653425 1661627 1671507 1683431 1697798 1714270 1731951 1750542 1770821
50184A770821K2967K6002K8804L1060L2184L1472K9051K6148K4010K2676K1092
$$ 1770821 1793788 1819790 1848594 1879654 1911838 1943310 1972361 1998509 2022519 2045195 2066287
50173B066287J8354J4695J1024P722M306L73l905q616j4610k2228l0086l6349
$$ 2066287 2084641 2099336 2110360 2118082 2122388 2122761 2118856 2110240 2095630 2073402 2043316 2006967
50161B006967m0894m4771m7695m7808m4395l9247l4434l0167k5779k1587j8555
$$ 2006967 1966073 1921302 1873607 1825799 1781404 1742157 1707723 1677556 1651777 1630190 1611635
50150A611635j7049j7260j9875k4894l0295l3402l3409l1464k8693k5511k2658
$$ 1611635 1594586 1577326 1557451 1532557 1502262 1468860 1435451 1403987 1375294 1349783 1327125
50139A327125k1194k1035k0694j9104j6845j5170j4478j4241j3842j3041j1942
$$ 1327125 1305931 1284896 1264202 1245098 1228253 1213083 1198605 1184364 1170522 1157481 1145539
50128A145539j0926j0369j0252j0167r799r156q443p924p886q280q491p894o627
$$ 1145539 1134613 1124244 1113992 1103825 1094026 1084870 1076427 1068503 1060617 1052337 1043846 1035952 1029325
50115A029325n334m191k670n35J447K302K129K149L210M639N013M059L165L625
$$ 1029325 1023991 1019800 1017130 1016595 1018042 1020344 1022473 1024622 1027832 1032471 1037484 1041543 1044708 1048333
50101A048333M984N924O396P680J0193J2543J3447J3636J4793J7151J9159J9414
$$ 1048333 1053317 1059241 1065637 1073317 1083510 1096053 1109500 1123136 1137929 1155080 1174239 1193653
50089A193653J8086J6462J5750J6299J7394J7716J6375J3751J1177R900J0328
$$ 1193653 1211739 1228201 1243951 1260250 1277644 1295360 1311735 1325486 1336663 1346563 1356891
50078A356891J1969J3895J5607J7601K0727K4899K8977L2305L5604L9817M4736
$$ 1356891 1368860 1382755 1398362 1415963 1436690 1461589 1490566 1522871 1558475 1598292 1643028
50067A643028M9499N3912N8363O2704O6221O8567O9859O9753O7276O2124N5707
$$ 1643028 1692527 1746439 1804802 1867506 1933727 2002294 2072153 2141906 2209182 2271306 2327013
50056B327013N0396M7559M6390M4704M0942L5211K8120J9220P551o396k0469l2903
$$ 2327013 2377409 2424968 2471358 2516062 2557004 2592215 2620335 2639555 2647106 2640710 2620241 2587338
50044B587338m3402n1871n7565o0559o2621o5017o6361o4374n9273n3667m9315
$$ 2587338 2543936 2492065 2434500 2373941 2311320 2246303 2179942 2115568 2056295 2002628 1953313
50033A953313m5705m1907l7979l4082k9843k5393k1793j9599j8034j6322j4905
$$ 1953313 1907608 1865701 1827722 1793640 1763797 1738404 1716611 1697012 1678978 1662656 1647751
50022A647751j4382j4174j3307j1999j1282j1340j1292j0686j0231j0774j2210
$$ 1647751 1633369 1619195 1605888 1593889 1582607 1571267 1559975 1549289 1539058 1528284 1516074
$$ [...]
##END NTUPLES=NMR SPECTRUM
##END=
