
##TITLE=UV1042_TOSA01-ROVE100B_6099729_Sl3A74I5PF
##JCAMPDX= 6.0         $$ Bruker NMR JCAMP-DX V2.0
##DATA TYPE= NMR SPECTRUM
##DATA CLASS= NTUPLES
##ORIGIN= BRUKER
##OWNER= Administrator
$$ 1.72 TOPSPIN		Version 2.1
$$ 2012-05-12 22:21:25.937 -0500  Administrator@TOPSPIN
$$ Compression mode = diff/dup
##.OBSERVE FREQUENCY= 400.13188235
##.OBSERVE NUCLEUS= ^1H
##.ACQUISITION MODE= SIMULTANEOUS (DQD)
##.ACQUISITION SCHEME= undefined
##.AVERAGES= 8
##.DIGITISER RES= 22
##SPECTROMETER/DATA SYSTEM= spect
##.PULSE SEQUENCE= zg30
##.SOLVENT NAME= COFFEE_meoh
##.SHIFT REFERENCE= INTERNAL, COFFEE_meoh, 1, 14.98061
##AUDIT TRAIL= $$ (NUMBER, WHEN, WHO, WHERE, PROCESS, VERSION, WHAT)
$$ ##TITLE= Audit trail, TOPSPIN		Version 2.1
$$ ##JCAMPDX= 5.01
$$ ##ORIGIN= Bruker BioSpin GmbH
$$ ##OWNER= Administrator
$$ $$ C:\Bruker\TOPSPIN/data/COFFEE/nmr/UV1042_TOSA01-ROVE100B_6099729_Sl3A74I5PF/10/pdata/1/auditp.txt
$$ ##AUDIT TRAIL=  $$ (NUMBER, WHEN, WHO, WHERE, PROCESS, VERSION, WHAT)
(   1,<2012-05-12 22:21:19.265 -0500>,<Administrator>,<TOPSPIN>,<go>,<TOPSPIN 2.1>,
      <created by zg
	started at 2012-05-12 22:20:12.359 -0500,
	POWCHK enabled, PULCHK disabled,
       configuration hash MD5:
       AF F2 23 6B 01 CD 40 DD E5 A1 38 A0 06 EA F7 77
       data hash MD5: 64K
       FE F8 76 52 60 91 D8 68 D1 0A BE FB 9E AA A0 2A>)
(   2,<2012-05-12 22:21:21.875 -0500>,<Administrator>,<TOPSPIN>,<proc1d>,<TOPSPIN 2.1>,
      <Start of raw data processing
       efp LB = 0 FT_mod = 6 PKNL = 1 PHC0 = 0 PHC1 = 0 SI = 32K 
       data hash MD5: 32K
       A5 C7 14 02 EB C8 59 51 9D DC 2E 7D F0 B2 60 1D>)
(   3,<2012-05-12 22:21:22.296 -0500>,<Administrator>,<TOPSPIN>,<proc1d>,<TOPSPIN 2.1>,
      <pk PHC0 = 212.6184 PHC1 = 0 
       data hash MD5: 32K
       C5 D3 7D 1D 72 0B E0 0D E5 65 51 1E BE 84 76 1D>)
(   4,<2012-05-12 22:21:22.359 -0500>,<Administrator>,<TOPSPIN>,<proc1d>,<TOPSPIN 2.1>,
      <abs ABSG = 1 
       data hash MD5: 32K
       65 3F B3 A2 98 A3 9C CE 50 AD 57 33 70 A2 E6 B2>)
(   5,<2012-05-12 22:21:22.390 -0500>,<Administrator>,<TOPSPIN>,<proc1d>,<TOPSPIN 2.1>,
      <abs ABSG = 2 
       data hash MD5: 32K
       96 13 C1 22 23 79 2F 71 C5 CB B8 48 08 AB 7F F8>)
(   6,<2012-05-12 22:21:22.421 -0500>,<Administrator>,<TOPSPIN>,<proc1d>,<TOPSPIN 2.1>,
      <abs ABSG = 3 
       data hash MD5: 32K
       3D 28 8F B6 BF 83 1B 8F 06 19 05 4D 61 2C B4 38>)
(   7,<2012-05-12 22:21:22.453 -0500>,<Administrator>,<TOPSPIN>,<proc1d>,<TOPSPIN 2.1>,
      <abs ABSG = 4 
       data hash MD5: 32K
       A0 BF 0A 0A C2 C5 B4 A2 06 93 05 5D 93 B7 8A DE>)
(   8,<2012-05-12 22:21:22.484 -0500>,<Administrator>,<TOPSPIN>,<proc1d>,<TOPSPIN 2.1>,
      <abs ABSG = 5 
       data hash MD5: 32K
       E3 CB 31 12 D8 DF BC 92 40 9F 21 69 A9 75 E1 29>)
$$ ##END=
$$ 
$$ $$ hash MD5
$$ $$ 94 E6 67 BB 9D 29 5C 7C C7 F7 EC 51 64 D8 84 1F
##$RELAX= 
##$RELAX= 
##$RELAX= 
##$RELAX= 
##$RELAX= 
##$RELAX= 
##$RELAX= 
$$ Bruker specific parameters
$$ --------------------------
$$ [...]
150 150 150 150 150 150 150 150
##$TP07= 0
##$TPNAME0= <>
##$TPNAME1= <>
##$TPNAME2= <>
##$TPNAME3= <>
##$TPNAME4= <>
##$TPNAME5= <>
##$TPNAME6= <>
##$TPNAME7= <>
##$TPOAL= (0..7)
0.5 0.5 0.5 0.5 0.5 0.5 0.5 0.5
##$TPOFFS= (0..7)
0 0 0 0 0 0 0 0
##$TUNHIN= 0
##$TUNHOUT= 0
##$TUNXOUT= 0
##$USERA1= <user>
##$USERA2= <user>
##$USERA3= <user>
##$USERA4= <user>
##$USERA5= <user>
##$V9= 5
##$VALIST= <valist>
##$VCLIST= <CCCCCCCCCCCCCCC>
##$VD= 0
##$VDLIST= <DDDDDDDDDDDDDDD>
##$VPLIST= <PPPPPPPPPPPPPPP>
##$VTLIST= <TTTTTTTTTTTTTTT>
##$WBST= 2048
##$WBSW= 25
##$XGAIN= (0..3)
0 0 0 0
##$XL= 0
##$YL= 0
##$YMAX_a= 534081
##$YMIN_a= -639877
##$ZGOPTNS= <>
##$ZL1= 120
##$ZL2= 120
##$ZL3= 120
##$ZL4= 120
##$ABSF1= 14.98061
##$ABSF2= -5.57192
##$ABSG= 5
##$ABSL= 3
##$ALPHA= 0
##$AQORDER= 0
##$ASSFAC= 0
##$ASSFACI= 0
##$ASSFACX= 0
##$ASSWID= 0
##$AUNMP= <proc_prof1d_extract_pilot.lims>
##$AXLEFT= 0
##$AXNAME= <>
##$AXNUC= <1H>
##$AXRIGHT= 0
##$AXTYPE= 0
##$AXUNIT= <>
##$AZFE= 0.1
##$AZFW= 0.1
##$BCFW= 0
##$BC_mod= 0
##$BYTORDP= 0
##$COROFFS= 0
##$CY= 15
##$DATMOD= 1
##$DC= 0
##$DFILT= <>
##$DTYPP= 0
##$F1P= 0
##$F2P= 0
##$FCOR= 0.5
##$FTSIZE= 32768
##$FT_mod= 6
##$GAMMA= 0
##$GB= 0
##$INTBC= 1
##$INTSCL= 1
##$ISEN= 128
##$LB= 0
##$LEV0= 0
##$LPBIN= 0
##$MAXI= 10000
##$MC2= 0
##$MEAN= 0
##$ME_mod= 0
##$MI= 0
##$NCOEF= 0
##$NC_proc= -8
##$NLEV= 6
##$NOISF1= 0
##$NOISF2= 0
##$NSP= 0
##$NTH_PI= 0
##$NZP= 0
##$OFFSET= 14.98061
##$PC= 1
##$PHC0= 212.6184
##$PHC1= 0
##$PH_mod= 1
##$PKNL= yes
##$PPARMOD= 0
##$PPDIAG= 0
##$PPIPTYP= 0
##$PPMPNUM= 2147483647
##$PPRESOL= 1
##$PSCAL= 4
##$PSIGN= 0
##$PYNMP= <proc.py>
##$REVERSE= no
##$SF= 400.13
##$SI= 32768
##$SIGF1= 0
##$SIGF2= 0
##$SINO= 400
##$SIOLD= 32768
##$SPECTYP= <>
##$SREGLST= <1H.CDCl3>
##$SSB= 0
##$STSI= 32768
##$STSR= 0
##$SW_p= 8223.68421052632
##$SYMM= 0
##$S_DEV= 0
##$TDeff= 65536
##$TDoff= 0
##$TI= <>
##$TILT= no
##$TM1= 0
##$TM2= 0
##$TOPLEV= 0
##$USERP1= <user>
##$USERP2= <user>
##$USERP3= <user>
##$USERP4= <user>
##$USERP5= <user>
##$WDW= 1
##$XDIM= 32768
##$YMAX_p= 452008051
##$YMIN_p= -737177
##$CURPLOT= <Network HP LaserJet P1505>
##$CURPRIN= <$Network HP LaserJet P1505>
##$DFORMAT= <normdp>
##$LAYOUT= <+/1D_H.xwp>
##$LFORMAT= <normlp>
##$PFORMAT= <normpl>
##$SURQMSG= 1
$$ End of Bruker specific parameters
$$ ---------------------------------
##NTUPLES= NMR SPECTRUM
##VAR_NAME=  FREQUENCY,     SPECTRUM/REAL,   SPECTRUM/IMAG
##SYMBOL=    X,             R,               I
##VAR_TYPE=  INDEPENDENT,   DEPENDENT,       DEPENDENT
##VAR_FORM=  AFFN,          ASDF,            ASDF
##VAR_DIM=   32768,         32768,           32768
##UNITS=     HZ,            ARBITRARY UNITS, ARBITRARY UNITS
##FACTOR=    0.250966925370066, 1,           1
##FIRST=     8223.43324360095, 49582,        -107924
##LAST=      0,             32909,           -131640
##MIN=       0,             -737177,         0
##MAX=       8223.43324360095, 452008051,    0
$$ Real data points
##PAGE= N=1
##DATA TABLE= (X++(R..R)), XYDATA
$$ [...]
$$ plain form
19533 -12735 -216032 85093 -67718 -229483 -65594 -137537 265879 -22077 -11377 -18701 -79048
19522 -79048 114474 -303743 -367393 -368643 -191693 -379956 -181709 10934 -306991 157360
19511 -265723 -252867 -75963 14179 6973 -106779 271863 -32231 43315 -8238 -162193 105776
19499 -121247 -65815 -85494 -45673 -140408 -122568 -137593 -64678 64209 -198204 -211383 -434578
19488 -434578 -101826 -133987 -497871 -146901 -171077 -146170 -257888 136271 -51427 -145397
19478 -145397 217436 -74789 -10726 144066 208989 162512 -429606 -273058 -162903 -228613
19468 -228613 -67670 366422 46241 -258155 -356457 -112847 -96490 118459 -100995 50596
19457 -106692 -41773 -325862 -1077 -270236 -61368 -477057 21718 -65103 -134174 -81148 -33055
$$ packed form
19533a2735k03297H5093f7718j61765f5594p1943B65879b2077J0700p324o0347
19522g9048A14474c03743o3650j250J76950j88263a81709A0934c06991A57360
19511b65723J2856g5963A4179F973a06779B71863c2231D3315h238j53955A05776
19499a21247N5432j9679L9821r4735J7840j5025f4678F4209a98204j3179k23195
19488d34578a01826l2161l63884a46901k4176K4907j11718A36271e1427r3970
19478a45397B17436g4789a0726A44066O4923m6477d29606J56548J10155o5710
19468b28613f7670C66422D6241b58155r8302a12847J6357A18459a00995E0596
19457a06692d1773k84089a077k69159f1368m15689B1718f5103o9071N3026c3055
$$ plain form
19445 -385808 -68272 -268023 -358289 48380 93727 -65063 -34453 28802 -108306 -74417 -213656
19434 -213656 -73964 28723 72036 -106656 176030 -316345 228659 233310 138671 -61222 100838
19422 -91454 -262318 -26199 268903 -234259 10710 50782 -9398 -159622 -4289 222176 37411
19410 -282610 88603 -227306 -63924 -78370 -304631 -19124 208091 107179 -193383 182354
19399 33464 -132351 249337 -17902 -76881 -77651 -69851 190388 -54114 288842 9183 96987 -121191
19386 280288 22898 -108177 -360953 156547 -95864 -123293 -89321 -247751 -6447 49267 260309
19375 260309 -447813 33367 25878 -13141 139861 -15331 122009 97504 -291037 51333 95016
19364 95016 172904 -154390 190819 -40281 -238877 44212 -422390 -4258 83303 -96382 -98439
$$ packed form
19445c85808f8272j99751r0266D8380M5347f5063L0610B8802a08306L3889j39239
19434b13656g3964B8723M3313a06656A76030c16345B28659M651r4639f1222A00838
19422i1454j70864b6199B68903b34259A0710M0072i398j50224d289B22176C7411
19410b82610H8603b27306f3924j4446k26261a9124B08091j00912a93383A82354
19399C3464a32351B49337a7902n8979p70P800A90388e4114B88842I183Q7804a21191
19386B80288B2898a08177k52776A56547i5864k7429L3972j58430f447D9267K11042
19375B60309d47813C3367p489a3141A39861a5331A22009k4505b91037E1333M3683
19364I5016P7888a54390A90819d0281j98596D4212d22390d258H3303i6382k057
$$ plain form
19353 -98439 111042 -512592 -356859 51733 125350 270486 20117 186072 98449 -105908
19342 -165810 166334 -190124 20609 190534 -119659 273135 27907 71512 -88565 109827
19331 -221140 -108419 -129197 -117035 -67073 -45268 -143488 -15209 -124571 -89722 178758 -348552
19319 -166885 123121 40252 -227495 -465077 -118092 14261 -257532 371134 -115894 -299446
19309 -299446 -316836 -62386 -178249 -513471 217267 32495 -291985 134614 -214262 -188994
19299 -188994 239800 -174929 180852 -176759 -267034 -77456 -201810 -335791 -247044 54302
19288 -365664 -121618 -8397 78236 -498923 -96824 166774 -101250 97723 -300290 -249550 119515
19276 76645 77073 -36366 -115155 242795 173346 72019 229859 125541 -135836 151711 37849
$$ packed form
19353i8439A11042e12592J55733E1733P3617J45136B0117J65955q7623a05908
19342a65810A66334a90124B0609J69925a19659B73135B7907M3605h8565A09827
19331b21140a08419k0778J2162M9962K1805r8220a5209j09362L4849A78758c48552
19319a66885A23121D0252b27495k37582a18092A4261b57532C71134a15894j83552
19309b99446j7390f2386j15863l35222B17267C2495b91985A34614b14262K5268
19299a88994B39800a74929A80852a76759r0275g7456j24354j33981Q8747E4302
19288c65664a21618h397G8236d98923i6824A66774a01250I7723c00290N0740A19515
19276G6645M28c6366p8789B42795o9449G2019J57840j04318a35836A51711C7849
$$ plain form
19264 -176983 163730 -322555 -1842 -91478 110074 -346369 169891 53949 17178 -475764
19253 73824 57970 -259014 -39031 196823 89347 -175222 109511 -205905 -43505 -44924 -111441
19242 -111441 -28476 -292834 189034 -108675 -383951 280783 -133878 -156194 98404 98418 -17040
19230 14190 56541 126979 -178636 128233 76912 -2345 -354034 -55158 183630 -350493 -67448
19218 24033 -3282 132439 203451 -177758 -17790 -234271 32439 -256168 88626 -5867 14889
19206 -156516 -179834 24193 -12174 -192068 -141074 -308941 -107908 -70972 -69245 11843 38017
19195 38017 286839 131793 124763 193130 -127879 -147760 -223608 -142633 -261141 -152347 -123905
19184 -123905 44115 -71091 836 252645 -124695 193379 126552 -168339 -199643 -300712 -139844
$$ packed form
19264a76983A63730c22555a842q9636A10074c46369A69891E3949A7178d75764
19253G3824j5854b59014c9031A96823H9347a75222A09511b05905d3505j419o6517
19242a11441b8476k64358A89034a08675k75276B80783a33878k2316I8404J4a7040
19230A4190M2351P0438a78636A28233n1321b345l51689e5158A83630c50493f7448
19218B4033c282A32439P1012a77758a7790k16481C2439b56168H8626e867A4889
19206a56516k3318B4193a2174j79894N0994j67867a07908L6936J727A1843K6174
19195C8017K48822A31793p030O8367a27879j9881p5848Q0975j18508J08794K8442
19184a23905D4115g1091H36K51809a24695A93379o6827a68339l1304j01069a39844
$$ plain form
19172 -135527 -8524 -5721 107018 -10608 -247080 -131819 267188 95330 -146379 4751 171370
19161 171370 -80409 -13958 -106632 -241048 -55683 180056 -36847 -102071 -105216 -277709 304324
19149 17992 -29009 167133 130434 219313 42994 -60707 -250054 230059 -338443 251513 248301
19138 248301 7504 -22295 334967 -151360 -23471 -33921 87634 -174996 -121407 -57508 -276237
19127 -276237 163467 -198489 -109463 -101427 -269627 212902 -6790 -43525 -136517 -13564 -223755
19116 -223755 -35642 -256723 95238 -382075 -213577 -266781 -183418 11320 170731 -26751 -309680
19105 -309680 161790 22372 30529 -249113 -86276 -36964 124830 -114201 3189 -170590 246074
19093 56882 267811 1507 -210141 49219 -22796 2576 -2746 29927 -126611 -153452 21643 59009
$$ packed form
19172a35527h524K803A07018a0608k36472J15261B67188I5330a46379D751J66619
19161A71370h0409a3958r2674j34416e5683A80056c6847o5224l145j72493C04324
19149A7992b9009A67133l6699Q8879D2994f0707j89347B30059c38443B51513l212
19138B48301G504b2295C34967a51360b3471j0450H7634a74996N3589e7508k18729
19127b76237A63467a98489Q9026Q036j68200B12902f790l6735r2992a3564k10191
19116b23755c5642k21081I5238c82075J68498n3204Q3363A1320J59411b6751k82929
19105c09680A61790B2372Q157b49113h6276c6964A24830a14201C189a70590B46074
19093E6882K10929A507b10141D9219b2796B576b746B9927a26611k6841B1643L7366
$$ plain form
19081 59009 96874 105879 -92501 -62168 -211612 -66777 87340 -341163 -161902 1318 230591
19070 230591 -97000 -201397 -39973 -134653 435097 -222222 -233967 25889 -71321 -232484 -204965
19059 -204965 -174094 -242667 73645 -95624 -6719 -98298 -307579 -509301 -165632 -222164 123044
19047 68476 -361849 61731 134248 130172 29452 24315 332811 -71329 -251689 61090 -15170
19035 -186782 -309868 116950 -274613 -188186 120367 -104878 -158155 -134620 94383 190949
19025 190949 68738 73153 -96976 -231546 -52693 57579 -18386 154561 41036 -13357 183519
19013 4823 -117240 63146 -387121 -194962 -50451 121325 -152272 256041 -228023 -128011
19003 -128011 -121292 27649 14007 -185548 129227 74174 -190085 -72345 -86189 -263049 -47713
$$ packed form
19081E9009L7865R005i2501L0333j49444f6777H7340c41163a61902A318K29273
19070B30591i7000j04397c9973r4680D35097b22222j1745B5889g1321j61163K7519
19059b04965L0871o8573G3645i5624f719r1579k09281k01722a65632n6532A23044
19047F8476c61849F1731P2517m076B9452n137L08496g1329j80360F1090a5170
19035a86782j23086A16950b74613Q6427A20367a04878n3277K3535I4383R6566
19025A90949F8738M415i6976j34570e2693E7579a8386A54561D1036a3357A83519
19013D823a17240F3146c87121J92159e0451A21325a52272B56041b28023J00012
19003a28011O719B7649j3642a85548A29227n5053a90085g2345j3844j76860d7713
$$ plain form
18991 -314548 -175355 161995 -64156 23912 152422 -228729 65868 129630 -104912 -87521
18981 -87521 -249316 221268 274415 205452 -95731 -280713 -22613 53417 -135723 -44033 139846
18969 47581 13988 -77704 -211014 -110046 176782 -425675 17116 -74588 -395114 -49493 -5018
18957 22494 -20019 10556 -131540 96180 -67342 -20064 -60297 -7924 30027 41385 -242659
18945 144029 40959 -9001 -89988 150506 -70753 153318 75388 -166224 138268 -135725 34779
18933 128866 -38698 -235134 -373764 -97409 41758 -154161 30927 -125378 317169 32843
18922 -18676 -237707 -1696 85375 517781 -173660 308427 -216901 151652 81135 -115868
18911 -40582 -72430 -72796 5981 -79053 50227 -186680 54785 -297790 -79695 53489 113523 -79980
$$ packed form
18991c14548J39193A61995f4156B3912J28510b28729F5868O3762a04912J7391
18981h7521j61795B21268N3147o8963i5731j84982b2613E3417a35723d4033A39846
18969D7581A3988g7704j33310J00968A76782d25675A7116g4588l20526d9493e018
18957B2494b0019A0556a31540I6180f7342b0064m0233g924C0027J1358b42659
18945A44029D0959i001q0987A50506g0753A53318G5388a66224A38268a35725C4779
18933A28866c8698j96436j38630i7409D1758a54161C0927a25378C17169C2843
18922a8676k19031a696H5375M32406a73660C08427b16901A51652p0517a15868
18911d0582l1848l66E981g9053E0227a86680E4785b97790g9695E3489O0034g9980
$$ plain form
18898 -194795 59975 20515 121676 -50736 -147236 126930 -126138 -46531 171714 220026 -117237
18886 -102235 -135583 76934 88598 -26335 -170074 -87947 173473 133021 39695 -154564 88986
18874 30189 157062 -200083 33284 69627 165826 -141160 -78765 -185424 55493 85640 219006
18863 219006 -142101 -28077 -198373 20723 -98071 -226494 6698 66740 71655 48683 12785
18851 -96485 85998 -263005 -43633 -162450 69869 126304 -129932 -32405 50754 64119 -70930
18839 11464 -300683 6231 345368 87983 -194983 172234 -6098 -276465 -50728 89668 -22684
18827 202674 -125476 -161078 65165 -245279 57406 191104 -195287 429549 -122185 248417
18816 -200008 144736 -283388 233014 -149601 86465 -110380 -162121 10224 43524 -244723
$$ packed form
18898a94795E9975B0515J01161e0736r6500A26930a26138d6531A71714M8312a17237
18886a02235l3348G6934J1664b6335j43739Q2127A73473m0452C9695a54564H8986
18874C0189J26873b00083C3284L6343R6199a41160O2395j06659E5493L0147J33366
18863B19006a42101b8077j70296B0723i8071j28423F698O0042M915k2972A2785
18851i6485H5998b63005d3633j18817F9869N6435a29932c2405E0754J3365g0930
18839A1464c00683F231L39137H7983a94983A72234f098k70367e0728H9668b2684
18827B02674a25476l5602F5165b45279E7406J33698a95287D29549a22185B48417
18816b00008A44736b83388B33014a49601H6465a10380n1741A0224L3300b44723
$$ plain form
18805 -287997 95081 11782 -152850 186111 18309 -40762 38117 15926 -82987 -14362 142158
18793 -31514 -111695 150814 154900 -122644 -289320 54930 98885 91619 -236223 -280640 -42617
18781 113576 -238460 -46761 -1302 -50963 228407 23395 -211745 -110207 -178026 -95683 -3408
18769 161324 -119557 -73238 -159836 59480 113211 -37159 72722 263165 230124 -210368 -154079
18758 -154079 -37292 7330 80714 -122883 51365 -7598 122695 -297210 -51772 -65629 58511
18746 157663 -184935 -144482 -258099 -186167 -360785 -60860 -29212 -55595 -300015 -227367 -235964
18735 -235964 -84081 -270 -178639 -355648 158170 -294497 -183551 3902 -383745 193641 -91913
18723 -289987 98185 119220 64828 18872 -207792 -201633 -93052 231994 20538 121799 -10493
$$ packed form
18805b87997I5081A1782a52850A86111A8309d0762C8117A5926h2987a4362A42158
18793c1514q0181A50814M086a22644j66676E4930M3955p266b36223m4417d2617
18781A13576b38460d6761a302m9661B28407B3395b11745J01538o7819Q2343c408
18769A61324a19557M6319q6598E9480N3731c7159G2722J90443l3041b10368N6289
18758a54079c7292G330P3384a22883E1365g598A22695b97210e1772j3857E8511
18746A57663a84935M0453j13617P1932j74618f0860b9212k6383k44420P2648q597
18735b35964h4081b70j78369j77009A58170b94497J10946C902c83745A93641i1913
18723b89987I8185K1035n4392A8872b07792O159i3052B31994B0538J01261a0493
$$ plain form
18711 22785 -120201 -69674 -21781 -26018 180140 24643 186140 58584 -244671 30157 -24678
18699 -223637 -105240 -78361 -194188 -279753 -1827 -13618 -157046 60275 -96689 -17061 153507
18687 116215 -14173 -155997 20440 250920 -24524 205780 115358 59414 -335106 -197883
18677 -197883 -263530 221618 -178515 -215044 -315225 -128262 -302491 151366 -134589 -47674
18666 106662 -119913 38984 -119355 -130981 19962 -63256 65574 -252525 -41276 395081 -89434
18654 -538100 15196 -187536 71624 92030 -5050 -101300 -291913 -236651 -145233 84037 -122815
18642 151745 147563 196554 -61506 -83132 -211646 -237105 -100446 -387084 240402 -2645 66889
18630 184088 128124 -90359 105909 233422 -117986 67299 -48972 -132181 -419560 -64788 36254
$$ packed form
18711B2785a20201N0527b1781m237A80140B4643J61497E8584b44671C0157b4678
18699b23637a05240K6879j15827q5565a827j1791j43428F0275i6689a7061A53507
18687A16215a4173j41824B0440K30480b4524B05780r0422n5944c35106J37223
18677a97883o5647B21618a78515l6529j00181a28262j74229A51366a34589d7674
18666A06662a19913C8984a19355j1626A9962f3256F5574b52525d1276C95081h9434
18654e38100A5196a87536G1624K0406e050r6250j90613N5262R1418H4037a22815
18642A51745m182M8991f1506k1626j28514k5459a00446k86638B40402b645F6889
18630A84088n5964i0359A05909J27513a17986F7299d8972q3209k87379f4788C6254
$$ plain form
18618 -111497 -98679 -87450 -337841 -84637 -66505 91125 -110543 255625 -41506 -34786 -119493
18607 -119493 65126 123285 -54894 -120597 245182 -3666 -242827 -33958 -241213 16424 100253
18596 100253 65767 -313370 -323472 254039 126789 3953 -171636 -154279 -341329 -149840
18585 -83841 -64885 -104612 -293690 33779 184948 -200170 -171268 -50167 -366141 -44429 41727
18573 -54343 -79241 -59498 139663 -137586 -272366 50018 137132 -130131 64106 -94610 -1386
18561 -118429 15588 7794 -111321 51138 157234 -47505 146336 140950 200223 -222382 99413
18549 -232691 -184332 -432137 221197 42750 59590 -180020 10636 -114755 -136997 -101846 -224658
18538 -224658 37297 -128157 -330435 6592 3962 -242968 -36098 -59366 -247476 202805 284930
$$ packed form
18618a11497J2818J1229k50391h4637J8132I1125a10543B55625d1506O720q4707
18607a19493F5126N8159e4894o5703B45182c666k39161c3958k07255A6424Q3829
18596A00253l4486c13370j0102B54039A26789C953a71636J7357j87050a49840
18585h3841J8956l9727j89078C3779J51169b00170K8902e0167l15974d4429D1727
18573e4343k4898J9743A39663a37586j34780E0018Q7114a30131F4106i4610a386
18561a18429A5588G794a11321E1138J06096d7505A46336n386N9273b22382I9413
18549b32691M8359k47805B21197D2750J6840a80020A0636a14755k2242L5151j22812
18538b24658C7297a28157k02278F592k630b42968c6098k3268j88110B02805Q2125
$$ plain form
18527 284930 -116685 143120 -168529 -216740 13440 139751 -136730 -36154 -96317 -7619 157348
18515 -191266 -95606 -166719 238016 69712 -97194 244942 -22700 -140254 9009 -17482 87877
18503 -48832 157715 28907 175674 237148 40541 -130904 -193490 32941 -531828 -130600 398230
18491 -349535 -63437 -9286 57754 143256 -177060 -135226 39966 294463 -75181 -78812 -80437 -114103
18479 -114103 -84529 -315266 280226 110600 -288705 -83384 -219571 -943 -111686 -366804
18469 -366804 -133347 61548 64148 53631 -197635 298775 79397 60482 -299507 -276785 -197083
18458 -197083 -255798 27028 30122 -97328 -179295 -37648 -86134 51322 -101250 -333629 168378
18446 -138479 256735 -188105 298659 230154 -167329 -89541 60244 -61097 -92810 42245 -25018
$$ packed form
18527B84930a16685A43120a68529m8211A3440J26311a36730c6154o0163g619A57348
18515a91266i5606p1113B38016F9712i7194B44942b2700j17554I009a7482H7877
18503d8832A57715B8907J46767O1474D0541a30904o2586C2941e31828a30600C98230
18491c49535f3437i286E7754Q5502a77060M1834C9966K54497g5181l631j625l3666
18479a14103K9574k30737B80226A10600b88705h3384j36187i43j10743k55118
18469c66804a33347F1548K600j0517a97635B98775G9397j8915b99507K2722P9702
18458a97083n8715B7028L094i7328q1967c7648m8486E1322a01250k32379A68378
18446a38479B56735a88105B98659o8505a67329P7788F0244f1097l1713D2245b5018
$$ plain form
18434 -274740 -102532 72140 7158 -184063 -67288 83052 21476 174662 92125 -205519 -183729
18423 -183729 112789 -260862 -74766 -51102 -101968 -42094 -237684 -314612 164305 56567 172745
18412 172745 -101480 -127947 249101 -172779 214979 -35842 15216 156831 -228373 -53597
18401 -22680 -103715 113899 -26975 112601 -10555 119931 65272 -215656 -277129 117958 110539
18390 110539 95134 -253075 -174788 -139739 -142259 253601 166932 -4246 166160 6110 -35707
18378 143842 -128192 -314677 46708 85156 108384 -123201 77966 -91391 -60217 -137798 -44974
18366 -313376 -93742 -225807 226927 -106460 -88184 51060 2678 -12010 21131 -53718 -100149
18355 -100149 13719 -343085 -23687 109734 -127195 -40844 136571 142871 145149 -37966 -124360
$$ packed form
18434b74740a02532G2140G158a84063f7288H3052B1476J53186q2537b05519K1790
18423a83729A12789b60862g4766K3664n0866d2094j95590p6928A64305E6567J16178
18412A72745a01480k6467B49101a72779B14979c5842A5216J41615b28373e3597
18401b2680q1035A13899b6975A12601a0555A19931n4659b15656o1473A17958p419
18390A10539j5405b53075P8287L5049k520B53601q6669d246A66160F110c5707
18378A43842a28192j86485D6708L8448K3228a23201G7966i1391L1174p7581d4974
18366c13376i3742j32065B26927a06460J8276E1060B678a2010B1131e3718m6431
18355a00149A3719c43085b3687A09734a27195d0844A36571O300K278c7966q6394
$$ plain form
18344 -124360 -264148 -114170 113925 -2555 73696 142289 344515 -88816 -268761 250199
18333 73975 -124249 -111892 -63642 -157464 70687 302071 161588 -179356 266638 -66504 -244412
18322 -244412 -210100 208287 208247 79392 13147 -29711 115618 -49281 2894 -170097 -114039 -220466
18310 -220466 162644 -109194 297407 205742 -64385 -143839 116012 196088 -201359 126639
18299 -208505 9859 -139052 23805 -25103 -95948 188857 -187411 104321 130513 216787 -177190
18287 -60893 -168615 146927 23384 -3248 -253964 183629 -101692 -95354 -299449 -14203 -4457
18275 5088 -26251 -210014 -250518 -67402 -240858 -127092 49138 -193556 -275539 104255 53251
18264 53251 -293473 224560 38189 -351464 -63418 -48501 -173624 87326 141061 -318686 -98435
$$ packed form
18344a24360j39788a14170A13925b555G3696O8593K02226h8816j79945B50199
18333G3975a24249J2357M8250r3822G0687K31384j40483a79356B66638f6504j77908
18322b44412L4312B08287m0G9392A3147b9711A15618d9281B894a70097N6058j06427
18310b20466A62644a09194B97407r1665f4385p9454A16012Q0076b01359A26639
18299b08505I859a39052B3805b5103p0845A88857a87411A04321K6192Q6274a77190
18287f0893j07722A46927B3384c248k50716A83629a01692O338k04095a4203d457
18275E088b6251j83763m0504f7402j73456J13766D9138a93556q1983A04255n1004
18264E3251b93473B24560C8189c51464f3418J4917j25123H7326N3735c18686i8435
$$ plain form
18252 334487 -30597 -459275 -186886 11597 108233 122023 273 170414 71124 133976 -106629
18240 -61001 -307683 -115395 70597 -20489 -52502 259947 37776 -159786 -149151 -118052 25435
18228 38349 83270 -191934 -109986 -9868 -151281 -123854 -37660 -133076 -114358 14764 264989
18217 264989 -99937 -46297 24973 -250995 346232 7560 296794 -270792 -84873 228016 -68154
18205 -25156 -213534 177245 -93330 -173977 -66537 -183297 -145123 -284304 186517 266151 115031
18193 -163161 -88577 50708 -93882 -120473 -343282 -9503 137772 70159 -180631 320221 -231104
18181 -28162 183584 31424 -146185 -376264 156262 49561 -15581 175512 -67427 56107 -21417
18169 293098 18566 83601 -4331 81457 -434893 185689 -92184 -101765 117427 -60809 27063
$$ packed form
18252C34487c0597m28678a86886A1597R6636J3790B73J70141G1124O2852a06629
18240f1001k46682a15395G0597b0489l2013B59947C7776a59786J0635L1099B5435
18228C8349M4921a91934Q1948i868j41413K7427c7660r5416J8718A4764K50225
18217B64989i9937d6297B4973b50995C46232G560K89234b70792h4873B28016f8154
18205b5156j88378A77245i3330q0647f6537j16760L8174j39181A86517P9634A15031
18193a63161P4584E0708i3882k6591k22809i503A37772o7613a80631C20221b31104
18181b8162A83584C1424a46185k30079A56262D9561a5581A75512f7427E6107b1417
18169B93098A8566O5035d331H1457d34893A85689i2184r581A17427f0809B7063
$$ plain form
18157 294381 431555 -65347 -21247 -34144 300778 -145144 -9443 132311 -68191 296829 26192
18145 -324193 43287 -25385 -14822 -218163 185673 -388489 -114180 -265578 114552 -267390
18134 17236 -174537 62393 -112435 53166 50751 -28506 -53036 85284 103131 236912 -1767
18122 -105972 56319 -22121 -168337 -182264 83316 -132685 -119833 -283939 -205086 87825 -180764
18110 -298589 -45820 -152139 40139 163603 69891 -12691 99342 -120489 -78044 24794 -92805
18098 -27188 -262765 -304071 -343623 19254 235323 4851 206144 -21411 -88248 107216 -40476
18086 67927 -95656 -108068 267339 2854 -362849 -145581 42436 61968 -93141 -130344 -112851
18075 -112851 160115 -153116 -93718 -261106 16792 28176 168881 -78623 142733 -217503
$$ packed form
18157B94381J37174f5347b1247j2897C00778a45144i443A32311f8191B96829B6192
18145c24193D3287b5385J0563k03341A85673c88489a14180j51398A14552b67390
18134A7236a74537F2393a12435E3166k415b8506k4530H5284J7847J33781a767
18122a05972E6319b2121j46216j3927H3316a32685J2852j64106P8853H7825a80764
18110b98589d5820j06319D0139J23464F9891a2691I9342a20489M2445B4794i2805
18098b7188k35577m1306l9552A9254K16069D851K01293b1411o6837A07216d0476
18086F7927i5656j2412B67339B854c62849a45581D2436J9532i3141l7203J7493
18075a12851A60115a53116N9398j67388A6792J1384J40705g8623A42733b17503
$$ plain form
18064 118175 26592 -206791 -74381 259300 -61055 -86208 -142090 -226720 63472 128445 152482
18053 152482 212799 -91277 91467 -168314 -1856 429225 -181539 41185 180464 -39633 -114003
18042 -114003 -267073 -106401 -80689 52952 -201971 -189883 29957 64295 -216375 -435210
18032 -435210 3509 -72041 -330647 -133405 230253 46689 51848 97655 76233 200396 -241907
18020 102663 -200217 141616 -137917 -92260 268109 112472 -145838 48603 -20805 265573
18009 -94804 -122600 -141321 -63127 6580 37428 333890 261867 -98053 -250596 -175095 158103
17997 -25501 180823 657 -141354 373964 -181911 -45766 44352 24408 -20520 74275 -177046
17985 98173 -276686 114196 106699 -78339 93313 66590 -98560 -53318 430471 -276585 27067
$$ packed form
18064A18175B6592b06791g4381B59300f1055k5153n5882q4630F3472O4973K4037
18053A52482O0317i1277I1467a68314a856D29225a81539D1185J39279c9633p4370
18042a14003j53070a06401K5712E2952b01971J2088B9957L4338b16375k18835
18032d35210C509g2041k58606a33405B30253D6689N159M5807k1422J24163b41907
18020A02663b00217A41616a37917M5657B68109A12472a45838D8603b0805B65573
18009i4804k7796j8721f3127F580L0848K96462p2023i8053j52543P5501A58103
17997b5501A80823F57a41354C73964a81911d5766D4352j9944b0520G4275a77046
17985I8173b76686A14196p497g8339I3313k6723i8560M5242D30471b76585B7067
$$ plain form
17973 -106455 -244584 80141 64146 -160903 45952 -2910 -296735 -49965 177865 -44444 -15701
17961 229244 -36673 -353103 67351 42617 135742 32737 332170 -70812 21187 -3467 154302
17949 -96835 -299265 43444 -12621 -298952 21122 -167406 -202531 118986 -268736 -234602 86991
17937 -124831 81656 -170165 372153 -91204 343328 206412 9789 -63514 -183925 149256
17926 -76209 -253416 -119613 121378 -113055 103732 -228640 131740 34465 143140 -279417
17915 -270064 -263404 78028 305780 226538 120080 93923 5470 -83499 -63986 52410 -268811
17903 78424 -93814 274002 65190 -42976 173924 32959 -200613 -33619 66618 65615 -231629
17891 153923 328440 -178861 47975 190023 147660 95375 328830 375 -218811 96853 -55810
$$ packed form
17973a06455j38129H0141j5995a60903D5952b910k93825d9965A77865d4444a5701
17961B29244c6673l16430F7351k4734R3125C2737K99433g0812B1187c467A54302
17949i6835k02430D3444a2621k86331B1122a67406l5125A18986b68736L4134H6991
17937a24831H1656a70165C72153i1204C43328j36916I789f3514j20411A49256
17926g6209j77207a19613A21378a13055A03732b28640A31740C4465J08675b79417
17915b70064O660G8028K27752p9242j06458k6157E470h3499J9513E2410b68811
17903G8424i3814B74002F5190d2976A73924C2959b00613c3619F6618j003b31629
17891A53923J74517a78861D7975J42048m2363n2285K33455C75b18811I6853e5810
$$ plain form
17879 -155549 -265230 29716 1026 -228900 65956 45477 30473 -165850 -30343 182185 -149170
17867 -123702 35450 310052 -313861 12818 -28525 -29619 16043 6973 57844 88411 34036
17855 230607 -176091 129539 -67073 52750 -38993 -45638 -48877 -200951 433078 -113521 -258183
17844 -258183 170780 71766 104689 142800 -117671 123364 15835 203770 27785 3737 163992
17833 163992 16969 56401 -38634 123965 -82663 133873 -228553 73160 -266903 161990
17822 -155325 -5043 219808 275188 11093 -254229 205734 -26990 149096 -228776 -268155 243037
17810 159819 -198189 -84662 -359300 33450 265231 -74145 -113852 139230 248952 -164405
17799 -100167 -41916 91098 53491 -230112 42149 -144746 95098 121920 298997 155406 -240110
$$ packed form
17879a55549j09681B9716A026b28900F5956k0479j5004a65850c0343A82185a49170
17867a23702C5450K74602c13861A2818b8525j094A6043F973N0871L0567C4036
17855B30607a76091A29539f7073E2750c8993o645l239j52074D33078a13521j44662
17844b58183A70780G1766L2923L8111a17671A23364A5835J87935B7785C737J60255
17833A63992A6969L9432c8634A23965h2663A33873b28553G3160b66903A61990
17822a55325e043B19808N5380A1093b54229B05734b6990A49096b28776l9379B43037
17810A59819a98189h4662k74638C3450K31781g4145l9707A39230J09722a64405
17799a00167d1916I1098l7607b30112D2149a44746I5098K6822J77077j43591b40110
$$ plain form
17787 -132153 -656144 -134165 168176 -69325 -116350 -114884 -53736 -84158 -99518 -177582 -113672
17776 -113672 -158755 -91409 -19339 133826 116048 -184254 -195274 -100086 -196718 -20711 18065
17764 -122874 304843 169057 51117 -318527 64337 -130559 122064 -39527 116499 -210973
17753 -14141 -184299 107832 130399 57178 14738 -99256 -183774 -78182 -66775 131127 -114772
17741 80418 60396 221834 -115553 -273377 116023 -21787 -64856 -89948 17770 -163188 229252
17729 -20867 -222493 -102713 415551 -137971 -67038 -98541 -183620 247242 -47930 112696
17718 -111111 -96856 326834 378440 -45381 -52569 -156073 -3019 143543 77059 17310 -40353
17706 -13029 57028 85385 462706 128493 -197340 -116207 195906 152978 234717 215183 41393
$$ packed form
17787a32153n23991a34165A68176f9325m7025J466e3736l0422j5360p8064O3910
17776a13672m5083O7346a9339A33826j7778a84254j1020R5188r6632b0711A8065
17764a22874C04843j35786E1117c18527F4337a30559A22064c9527A16499b10973
17753a4141j70158A07832K2567E7178A4738i9256q4518g8182J1407A31127a14772
17741H0418k0022J61438a15553j57824A16023b1787m3069k5092A7770a63188B29252
17729b0867k01626a02713D15551a37971f7038l1503q5079B47242d7930A12696
17718a11111J4255C26834N1606d5381p188j03504c019A43543o6484A7310d0353
17706a3029E7028K8357L77321A28493a97340Q1133A95906m2928Q1739j9534D1393
$$ plain form
17694 160933 -8936 -19783 -216036 114429 79124 369974 -7244 -140280 62385 -144270 -74945
17683 -74945 -112212 -320681 19424 -395675 175453 -91262 -85664 -233416 12556 160199 149357
17672 149357 -242790 -30330 256497 -136513 108328 186228 -113730 101778 118548 -81625
17661 -18723 37984 38949 295513 -81773 262544 -184431 -33709 240612 131949 -110739 -31463
17649 -91610 -44977 -99894 137652 144025 -185636 35690 47258 -21974 -33021 156552 141513
17638 141513 142561 -7777 80553 150534 9109 164622 -160962 162914 -240519 288397 90544
17626 158884 400135 395762 125601 -50591 -185389 -27437 153558 -111067 91380 -183488
17615 -205423 161919 -180252 -168460 -194276 -30662 184194 -153891 -284455 -157270 -386558
$$ packed form
17694A60933h936j0847j96253A14429l5305K90850g244j33036F2385a44270O9325
17683g4945l7267k08469A9424c95675A75453i1262N598j47752A2556J47643j0842
17672A49357b42790c0330B56497a36513A08328P7900a13730A01778J6770h1625
17661a8723C7984R65K56564h1773B62544a84431c3709B40612j08663a10739c1463
17649i1610d4977n4917A37652O373a85636C5690J1568b1974j1047A56552j5039
17638A41513J048g777H0553O9981I109J55513a60962A62914b40519B88397I0544
17626A58884K41251m373A25601e0591j34798b7437A53558a11067I1380a83488
17615b05423A61919a80252J1792k5816c0662A84194a53891j30564J27185k29288
$$ plain form
17605 -386558 317991 29116 173270 409018 114143 261343 57946 90172 186144 -152696
17594 -38570 -106836 -116015 -16964 141782 276974 150410 128511 285362 -33970 -9573 -15039
17583 -15039 419578 18927 -96573 -49591 -25676 -91665 174456 -25403 158434 218493 -448013
17571 183350 -12261 -69577 -6663 87878 -286892 240700 -332080 49221 51664 -22535 87847
17559 -65896 -38213 324060 129647 -224392 264064 20180 280118 214590 -175496 177313
17548 234995 -372411 98982 194776 372139 -8432 162677 12588 -11478 86809 140682 -52491
17536 -499 62362 -297538 -32981 362662 -151599 -249509 -78819 -107498 49127 156534 -75340
17524 -91591 344558 -112795 87081 -225186 182537 -91578 126413 52801 38840 256537
$$ packed form
17605c86558C17991B9116J44154K35748A14143J47200E7946L2226R5972a52696
17594c8570o8266r179a6964A41782J35192j26564k1899J56851c3970i573n466
17583a5039D19578A8927i6573M6982K3915o5989A74456b5403A58434O0059d48013
17571A83350a2261n7316f663H7878b86892B40700c32080D9221K443b2535H7847
17559f5896K7683C24060A29647b24392B64064B0180K59938o5528a75496A77313
17548B34995c72411I8982R5794J77363h432A62677A2588a1478H6809N3873e2491
17536d99F2362b97538c2981C62662a51599r7910g8819k8679D9127J07407g5340
17524i1591C44558a12795H7081b25186A82537i1578A26413E2801j3961K17697
$$ plain form
17514 256537 391561 -53085 219245 90059 -161290 -75439 80614 -143841 -33282 -41843 -299557
17503 -299557 90328 214629 98976 75195 -96819 -31628 -12377 111932 244562 -73025 69481
17491 65433 -119024 -155402 100924 246162 -182550 228190 14681 178880 314307 -112236
17480 -207467 381795 112543 442489 107453 327160 -155839 179785 262705 -197493 134367
17469 151831 105849 118997 103150 300890 326922 -93634 442470 34146 104519 77441 76600
17458 76600 17335 -42803 -3506 135584 -15162 86623 -23906 36873 71994 83186 -28755 -180096
17446 -180096 317321 -68119 438768 406367 35849 80554 330876 177988 437225 719701
17436 719701 112561 285620 487049 50412 398764 157768 365065 204442 331205 156514
$$ packed form
17514B56537J35024e3085B19245I0059a61290g5439H0614a43841c3282q561k57714
17503b99557I0328J24301I8976k3781i6819c1628a2377A11932J32630g3025F9481
17491F5433a19024l6378A00924J45238a82550B28190A4681J64199J35427a12236
17480b07467C81795A12543L29946A07453K19707a55839A79785Q2920a97493A34367
17469A51831m5982J3148j5847J97740K6032i3634D42470C4146P0373k7078q41
17458G6600A7335d2803c506A35584a5162H6623b3906C6873L5121J1192b8755j51341
17446a80096C17321f8119D38768l2401C5849M4705K50322j52888K59237K82476
17436G19701A12561J73059K01429E0412L48352A57768K07297j60623J26763A56514
$$ plain form
17425 324827 -114894 98225 294553 -2176 496081 201675 304413 -10820 251704 274581
17415 274581 157112 491027 201891 18417 190471 208428 433023 391264 -298728 225272
17404 192665 66039 151839 155486 200760 328843 367964 63955 246614 81812 300245 171877
17393 171877 273910 199984 371251 -212264 86950 94208 298933 4636 71453 192251 -83979
17381 171168 -161657 107178 -43917 -157479 58246 370901 205707 234091 88024 312348
17371 312348 275161 37987 127675 251131 -8334 179245 135248 57101 281488 -98759 333062
17359 293187 98590 560479 -107366 79479 84719 73610 297128 -1493 265010 138277 242272
17348 242272 224828 98870 104553 2623 56975 349688 190595 -268488 174158 -52693 213269
$$ packed form
17425C24827a14894I8225J96328b176D96081B01675J02738a0820B51704K2877
17415B74581j17469L33915B01891A8417J72054J7957K24595m1759b98728B25272
17404A92665F6039Q5800L647M5274J28083L9121F3955J82659H1812K18433j28368
17393A71877J02033p3926J71267b12264H6950P258K04725D636O6817J20798h3979
17381A71168a61657A07178d3917j13562E8246L12655j65194K8384H8024K24324
17371C12348l7187C7987Q9688J23456h334A79245m3997E7101K24387i8759C33062
17359B93187I8590M61889a07366G9479N240j1109K23518a493B65010j26733J03995
17348B42272j7444I8870N683B623N4352K92713j59093b68488A74158e2693B13269
$$ plain form
17336 -502618 211389 159754 209858 140271 316363 59092 3165 283565 84130 227781 278036
17325 278036 60660 130734 236779 181308 187553 127538 158387 316838 -58765 -154207 -156759
17314 -156759 89448 62966 428420 -271355 376108 357801 44711 100854 59862 201229 157034
17303 157034 247928 93876 121590 77524 125011 163406 412765 -61986 245359 226348 100255
17291 -114025 184373 -146399 28591 -19383 -28251 227663 32092 146960 304688 -51370 20089
17279 35137 -142982 406694 -28445 206762 203309 259195 -72447 236110 -175180 217033 276676
17268 276676 193409 413510 27037 212882 111001 374813 117364 321987 262684 47472
17257 -166690 126655 573795 208146 372309 146174 -8446 123956 295039 -65231 284008
$$ packed form
17336e02618B11389n1635N0104o9587J76092E9092C165K80400H4130J43651N0255
17325B78036F0660P0074J06045n5471O245o0015L0849J58451e8765r5442k552
17314a56759H9448k6482L65454b71355C76108j8307D4711N6143m0992J41367m4195
17303A57034R0894I3876K7714m4066M7487L8395K49359f1986B45359j9011A00255
17291a14025A84373a46399B8591a9383q868B27663C2092J14868J57728e1370B0089
17279C5137a42982D06694b8445B06762l453N5886g2447B36110a75180B17033N9643
17268B76676q3267K20101B7037J85845j01881K63812A17364K04623n9303D7472
17257a66690A26655M47140B08146J64163A46174h446A23956J71083f5231B84008
$$ plain form
17246 137603 366093 282169 338062 377270 79369 546721 235201 210594 317528 205067
17236 205067 193504 234477 259337 -65903 125885 420708 153496 -95644 256837 258772 24908
17224 324555 122147 118181 280750 205384 178683 208891 26483 -7383 78846 3083 255573
17213 255573 -3693 -56212 491061 416050 302229 187635 -8925 210282 55705 513440 104398
17201 307655 25750 388072 73569 44390 65193 406914 366034 -71701 -1404 166843 -12060
17189 268551 178919 371150 18494 353780 58535 371444 145755 89823 -126680 296416
17178 479542 -43425 192939 371634 245520 211041 -215368 202762 244070 393627 170259
17167 209970 -68519 578533 171914 65607 214465 170880 163007 12361 -78376 316001 356908
$$ packed form
17246A37603K28490q3924N5893L9208G9369M67352B35201k4607J06934j12461
17236B05067j1563M0973K4860f5903A25885K94823A53496i5644B56837J935B4908
17224C24555A22147l966J62569p5366k6701L0208B6483g383G8846C083K52490
17213B55573c693n2519D91061p5011j13821j14594h925B10282E5705M57735A04398
17201C07655B5750L62322G3569k9179K0803L41721m0880g1701a404A66843a2060
17189B68551q9632J92231A8494L35286E8535L12909A45755n5932a26680B96416
17178D79542d3425A92939J78695j26114l4479b15368B02762M1308J49557A70259
17167B09970f8519E78533A71914F5607J48858m3585p873A2361g8376C16001M0907
$$ plain form
17156 356908 461719 308828 307927 134773 112791 164129 103678 286676 483900 347777 451320
17145 451320 530175 194250 134488 334674 217823 270743 130462 268323 167976 401890
17135 401890 443107 299252 421396 209438 395423 354525 351869 356361 295376 207809 145184
17124 145184 421224 83831 380098 441735 146543 336815 389003 68538 334292 540175
17114 540175 723213 172411 186781 400282 378538 307841 388889 482631 425794 290778 310075
17103 310075 535060 205820 545730 517907 363824 -85811 245118 344404 413486 241173
17093 241173 178432 262029 339691 508818 527284 511923 660835 358378 274648 550206 335333
17082 335333 423119 496731 121561 278306 182924 332612 374518 192712 257712 620964
$$ packed form
17156C56908J04811j52891r01A34773k1982N1338o0451J82998J97224j36123J03543
17145D51320P8855A94250n9762K00186j16851N2920A30462J37861j00347K33914
17135D01890M1217j43855J22144B09438J85985m0898k656M492o0985q7567o2625
17124A45184K76040H3831K96267O1637A46543J90272N2188F8538K65754K05883
17114E40175J83038A72411J4370K13501k1744p0697Q1048R3742n6837j35016J9297
17103C10075K24985B05820L39910k7823j54083h5811B45118R9286O9082j72313
17093B41173o2741Q3597P7662J69127J8466j5361J48912l02457q3730K75558k14873
17082C35333Q7786P3612A21561J56745r5382J49688M1906j81806O5000L63252
$$ plain form
17072 620964 368565 563891 388006 204382 407309 540463 139060 788245 557105 417602
17062 417602 405033 532745 291955 336302 562849 418470 498699 303561 243856 427584
17052 427584 710054 238521 559157 222358 374247 717146 705912 634981 565842 689523
17042 689523 699056 443514 658677 635117 562823 472133 348395 664339 954658 463152
17031 579405 276808 498626 553611 250215 477880 485762 569395 313955 362457 774126
17021 774126 746354 693402 687033 395505 654537 867253 561500 998504 631919 422691
17011 422691 753829 670817 556510 680935 707924 637541 761508 867279 584969 898730
17001 898730 455087 799668 733480 428856 724624 741081 731004 754900 401578 686782
$$ packed form
17072F20964k52399J95326j75885j83624K02927J33154A39060O49185k31140j39503
17062D17602j2569J27712k40790M4347K26547j44379Q0229j95138n9705J83728
17052D27584K82470B38521L20636B22358J51889L42899j1234p0931o9139J23681
17042F89523R533k55542K15163k3560p2294r0690j23738L15944K90319D63152
17031E79405B76808K21818N4985B50215K27665P882Q3633k55440M8502M11669
17021G74126k7772n2952o369k91528K59032K12716l05753M37004l66585k09228
17011D22691L31138q3012j14307J24425K6989p0383J23967J05771k82310L13761
17001H98730m43643L44581o6188l04624K95768J6457j0077K3896l53322K85204
$$ plain form
16991 686782 419740 606819 725263 411472 819762 795542 580777 628085 552848 725493
16981 725493 788204 595170 673342 451625 943449 644970 821887 1123763 628457 975005
16971 975005 606938 765173 648852 807456 588988 746171 1091940 861484 879482 835237
16961 835237 678152 808869 774114 613405 979753 1010642 735633 730719 1061718 890656
16951 890656 634297 1021167 966473 942055 1101138 1105864 1057863 1066107 848455 1303595 1096092
16940 1096092 1278503 1120073 990416 927408 1043245 830821 1188454 984012 1248585 1641692
16930 1641692 1216995 1012820 1149175 1192507 926747 1084163 883530 1044658 1088274 989014
16920 989014 999698 1198689 1199212 932614 1364582 1108499 1558461 1170106 1610156 1148659
$$ packed form
16991F86782k67042J87079J18444l13791M08290k4220k14765M7308p5237J72645
16981G25493O2711j93034P8172k21717M91824k98479J76917L01876m95306L46548
16971I75005l68067J58235j16321J58604k18468J57183L45769k30456J7998m4245
16961H35237j57085J30717l4755j60709L66348L0889k75009m914L30999j71062
16951H90656k56359L86870n4694k4418J59083M726m8001Q244k17652M55140k07503
16940A096092J82411j58430j29657o3008J15837k12424L57633k04442K64573L93107
16930A641692m24697k04175J36355M3332k65760J57416k00633J61128M3616r9260
16920I89014J0684J98991N23k66598M31968k56083M49962l88355M40050m61497
$$ plain form
16910 1148659 1220917 1067678 1187068 1507331 1379042 1234195 1774102 1568548 1272508 1587489
16900 1587489 1519673 1443076 1322533 1546610 1531668 1597095 1626021 1778460 1481235 1825806
16890 1825806 1785692 1677391 1660964 1448548 1616416 1635667 1630327 1872330 1973565 1784319
16880 1784319 1753003 1404148 1782061 1954444 1856883 1429225 1770981 1667853 2043734 2131789
16870 2131789 2133797 2195076 2433827 2125055 2180387 2445305 2155399 2359875 2074311 2457736
16860 2457736 2387840 2466913 2455182 2154869 2671130 2247673 2231380 2491757 2726862 2598103
16850 2598103 2473812 2647550 2997213 3156992 2925034 2674843 3085835 3165063 2947229 2770799
16840 2770799 2992596 2921030 3309982 3511261 3269446 3349520 3346229 3336344 3626215 3592045 3517463
$$ packed form
16910A148659P2258j53239J19390L20263j28289j44847N39907k05554k96040L14981
16900A587489o7816p6597j20543K24077j4942O5427K8926J52439k97225L44571
16890A825806m0114j08301j6427k12416J67868J9251n340K42003J01235j89246
16880A784319l1316l48855L77913J72383r7561m27658L41756j03128L75881Q8055
16870B131789K008O1279K38751l08772N5332K64918k89906K04476k85564L83425
16860B457736o9896P9073j1731l00313N16261m23457j6293K60377K35105j28759
16850B598103j24291J73738L49663J59779k31958k50191M10992P9228k17834j76430
16840B770799K21797p1566L88952K01279k41815Q0074l291r885K89871l4170p4582
$$ plain form
16829 3517463 3527785 3491761 3755192 3625164 3828163 4130607 3952431 4017384 4235798 4290358
16819 4290358 4254024 3934822 4686988 4749466 4769254 4742174 5015849 5098380 4902573 5190232
16809 5190232 5106539 5355947 5366024 5516793 5863417 5769859 5748596 5990189 6238048 6100509
16799 6100509 6313190 6384210 6355727 6668851 6992817 7147791 7000025 7427699 7399398 7708669
16789 7708669 7943983 7838721 8119500 8457288 8414492 8546253 8673525 9116605 9547884 9576855
16779 9576855 9901145 9921223 10353945 10427476 10700098 11157887 11674216 11637395 11719995 12508452
16769 12508452 12868182 12992527 13625146 13854775 14273771 14855293 15825504 15750771 16611027
16760 16611027 17120449 17525497 18082011 18676541 19345467 20281586 20815923 21701903 22765962
$$ packed form
16829C517463J0322l6024K63431j30028K02999L02444j78176O4953K18414N4560
16819D290358l6334l19202P52166O2478J9788k7080K73675Q2531j95807K87659
16809E190232q3693K49408J0077J50769L46624r3558k1263K41593K47859j37539
16799F100509K12681P1020k8483L13124L23966J54974j47766M27674k8301L09271
16789G708669K35314j05262K80779L37788m2796J31761J27272M43080M31279K8971
16779I576855L24290K0078M32722P3531K72622M57789N16329l6821Q2600P88457
16769A2508452L59730J24345O32619K29629M18996N81522R70211p4733Q60256
16760A6611027N09422M05048N56514N94530O68926R36119N34337Q85980J064059
$$ plain form
16751 22765962 23132926 24223736 25758420 26417142 27730060 28396706 29703487 31459344
16743 31459344 32510238 33713176 35661429 37414831 39109544 41000377 42509624 45318233
16735 45318233 47706228 49782150 52410649 55354863 58442230 61597453 65007168 68995067
16727 68995067 72690715 77509717 81891439 86864437 91600394 97315248 103194936 109569288
16719 109569288 115946056 122643215 129706628 137096378 144357225 151780636 159039779 165780383
16711 165780383 172828760 179005784 184503054 189249052 193041651 195848173 197132525 197163333
16703 197163333 196237481 193873559 190349816 185820181 180492307 174274000 167593752 160708534
16695 160708534 153322848 146179876 138892424 131236237 124389473 117527909 111001805 104804426
$$ packed form
16751B2765962L66964J090810J534684O58722J312918O66646J306781J755857
16743C1459344J050894J202938J948253J753402J694713J890833J509247K808609
16735D5318233K387995K075922K628499K944214L087367L155223L409715L987899
16727F8995067L695648M819002M381722M972998M735957N714854N879688O374352
16719A09569288O376768O697159P063413P389750P260847P423411P259143O740604
16711A65780383P048377O177024N497270M745998L792599K806522J284352L0808
16703A97163333r25852k363922l523743m529635n327874o218307o680248o885218
16695A60708534p385686p142972p287452p656187o846764o861564o526104o197379
$$ plain form
16687 104804426 98609972 93132805 87672315 82490251 77545461 73184831 69417564 65457077
16679 65457077 61868869 58620185 55040521 52328666 49572262 47333644 44461767 42305784
16671 42305784 40209157 38448128 36305732 34641513 32948819 31383188 30447827 29049989
16663 29049989 27519939 26630035 25507429 24021130 23216741 22340235 21813460 20674038 20009335
16654 20009335 19385175 18432654 18140567 17331898 16626813 16108235 15290456 15229873 14745995
16645 14745995 14196384 13806875 13119744 12836640 12283366 11904099 11519646 10800693 11094452
16636 11094452 10732749 10272685 10147751 9884716 9588928 9407183 9036928 8973388 8697606
16627 8697606 8407954 8152752 7608476 7425645 7275047 7477834 6642743 7142054 6958136
$$ packed form
16687A04804426o194454n477167n460490n182064m944790m360630l767267l960487
16679F5457077l588208l248684l579664k711855k756404k238618k871877k155983
16671D2305784k096627j761029k142396j664219j692694j565631r35361j397838
16663B9049989j530050q89904j122606j486299q04389q76506n26775j139422o64703
16654B0009335o24160r52521k92087q08669p05085n18578q17779o0583m83878
16645A4745995n49611l89509o87131k83104n53274l79267l84453p18953K93759
16636A1094452l61703m60064j24934k63035k95788j81745l70255o3540k75782
16627H697606k89652k55202n44276j82831j50598K02787q35091M99311j83918
$$ plain form
16618 6958136 6611385 6624168 6278960 6186495 6161929 5816625 5861612 5444054 5696293 5411777
16608 5411777 5197350 5012536 4762439 4790760 4749536 4344359 4278317 4380996 4431927 4144544
16598 4144544 4106335 4179900 3800311 3865177 3851052 4052530 3758369 3968155 3596684 3564392
16588 3564392 3531264 3714549 3145240 3091154 3488386 3301567 3065104 3187778 2929359 2946014
16578 2946014 2882552 2911983 2706903 2644796 2617781 2642994 2371845 2704142 2678877 2525727
16568 2525727 2752787 2234724 2532954 2257814 2499307 2105593 2499910 2270085 2180850 1803848
16558 1803848 2005102 2159203 1995043 1882127 1957627 2187067 1902472 1786530 1754175 1966522
16548 1966522 2164556 1658436 1903997 1720083 1619166 1913333 1703455 1729023 1689670 1311679
$$ packed form
16618F958136l46751J2783l45208r2465k4566l45304M4987m17558K52239k84516
16608E411777k14427j84814k50097K8321m1224m05177o6042J02679N0931k87383
16598D144544l8209P3565l79589O4866j4125K01478k94161K09786l71471l2292
16588C564392l3128J83285n69309n4086L97232j86819k36463J22674k58419J6655
16578B946014o3462K9431k05080o2107k7015K5213k71149L32297k5265j53150
16568B525727K27060n18063K98230k75140K41493l93714L94317k29825q9235l77002
16558A803848K01254J54101j64160j12916P5500K29440k84595j15942l2355K12347
16548A966522J98034n06120K45561j83914j00917K94167k09878K5568l9353l77991
$$ plain form
16538 1311679 1564699 1531873 1628888 1429018 1707655 1401563 1627197 2031782 1549840 1476619
16528 1476619 1487528 1679204 1737971 1604172 1403156 1554136 1211050 1267319 1638802 1002165
16518 1002165 1445703 1195740 1497976 983362 1224075 1361303 1283898 1031339 1179079 1308278
16508 1308278 1278359 1128239 898072 1044350 1219628 1150931 879001 1131831 831368 1049947
16498 1049947 1388894 1141979 1266537 1077860 982117 1311754 919606 863061 1133107 1024491
16488 1024491 923378 922997 716422 824460 824387 877326 995346 965570 684982 1049251 531895
16477 531895 707395 724824 894187 564278 821258 699305 801036 486571 672371 597008
16467 597008 775314 988842 875142 779877 582458 784995 440808 786405 709531 392674
$$ packed form
16538A311679K53020l2826R7015j99870K78637l06092K25634M04585m81942p3221
16528A476619J0909J91676N8767j33799k01016J50980l43086N6269L71483o36637
16518A002165M43538k49963L02236n14614K40713J37228p7405k52559J47740J29199
16508A308278k9919j50120k30167J46278J75278o8697k71930K52830l00463K18579
16498A049947L38947k46915J24558j88677r5743L29637l92148n6545K70046j08616
16488A024491j01113l81k06575J08038p3N2939J18020k9776k80588L64269n17356
16477E31895J75500J7429J69363l29909K56980j21953J01731l14465J85800p5363
16467E97008J78306K13528j13700r5265j97419K02537l44187L45597p6874l16857
$$ plain form
16457 392674 734079 994557 868031 510045 836096 722494 542529 633404 428100 497144
16447 497144 957708 606599 341112 450650 311195 490726 605450 499790 411777 600038
16437 600038 625401 552272 461601 449189 597437 464378 625732 656747 421734 630317
16427 630317 331898 188740 689646 538624 521332 425236 599083 522761 360012 627084
16417 627084 576386 447009 627728 401534 446663 332416 193431 358865 530190 376889
16407 376889 444319 293459 263982 560605 685032 411130 517651 689349 277959 513978
16397 513978 473224 345734 412849 306092 339797 559673 364899 551954 335165 305752
16387 305752 320387 550514 323774 686219 358653 230003 571520 332821 540085 476940
$$ packed form
16457C92674L41405K60478j26526l57986L26051j13602j79965R0875k05304O9044
16447D97144M60564l51109k65487J09538j39455J79531J14724j05660q8013J88261
16437F00038K5363p3129r0671j2412J48248j33059J61354L1015k35013K08583
16427F30317k98419j43158N00906j51022j7292r6096J73847p6322j62749K67072
16417F27084n0698j29377J80719k26194M5129j14247j38985J65434J71325j53301
16407C76889O7430j50860k9477K96623J24427k73902J06521J71698B77959K36019
16397E13978m0754j27490O7115j06757L3705K19876j94774J87055k16789k9413
16387C05752J4635K30127k26740L62445l27566j28650L41517k38699K07264o3145
$$ plain form
16377 476940 557876 388542 294603 282609 305313 617707 247417 389627 454915 152099
16366 -219079 372538 297871 160596 305512 594478 464385 148945 457755 382910 632929
16356 632929 669789 341554 324676 391323 -27880 404143 555332 467019 277037 551060
16346 551060 -14598 436821 392266 155160 249947 476147 305291 215596 32925 139695
16336 139695 481981 366092 165843 544241 313787 245114 480070 -33062 170417 293495
16326 293495 108086 191397 323002 117824 135726 138181 312368 133367 199174 327759
16316 327759 -16861 153866 173641 353863 47963 200392 262219 204634 147857 -193374 175826
16304 -29031 94609 494897 225625 170249 103406 244878 258526 -60487 185739 78826 12107
$$ packed form
16377D76940Q0936j69334r3939j1994K2704L12394B47417J42210O5288A52099
16366b19079C72538p4667j37275J44916K88966j30093A48945L08810p4845K50019
16356F32929L6860l28235j6878O6647b7880D04143J51189q8313j89982K74023
16346E51060a4598D36821m4555A55160R4787K26200j70856q9695C2925J06770
16336A39695L42286j15889A65843L78398k30454o8673K34956c3062A70417J23078
16326B93495A08086Q3311J31605A17824J7902K455J74187A33367O5807J28585
16316C27759a6861A53866J9775J80222D7963J52429O1827n7585n6777a93374A75826
16304b9031I4609M00288B25625n5376o6843J41472J3648f0487A85739G8826A2107
$$ plain form
16292 92396 280636 244997 168595 -24673 437817 105779 7610 536116 129705 112003 326303
16281 326303 -98837 -31781 218460 103346 177206 400382 275304 -100343 207865 46994
16270 248557 94640 80755 441923 420998 -122350 -110035 182221 440467 -93854 555317
16259 274889 -329636 315251 396067 372 124688 86675 140785 -136339 184139 300631 -253947
16247 -99120 421152 64247 205698 66190 366456 274321 129947 71895 209617 162484 -253791
16235 125606 -227210 -3430 -128889 341875 118242 -122741 272728 336132 209209 386041
16225 386041 357615 155404 267589 136530 56431 -50621 205202 323535 400419 241996
16215 241996 370700 -124164 47375 -142391 86979 216791 148012 43442 -41523 176493
$$ packed form
16292I2396J88240l5639p6402b4673D37817A05779G610N28506A29705j7702K14300
16281C26303i8837c1781B18460A03346P3860K23176j25078a00343B07865D6994
16270B48557I4640j3885L61168k0925a22350J2315A82221K58246i3854E55317
16259B74889c29636C15251Q0816C72J24316l8013N4110a36339A84139J16492b53947
16247i9120D21152F4247J41451F6190L00266r2135A29947n8052J37722m7133b53791
16235A25606b27210c430j25459C41875A18242a22741B72728O3404j26923J76832
16225C86041k8426A55404J12185j31059E6431e0621B05202J18333P6884j58423
16215B41996J28704a24164D7375a42391H6979J29812o8779D3442d1523A76493
$$ plain form
16204 -69903 279033 135612 178854 290566 -26876 -348000 -3247 -23544 -146269 -7236 352482
16192 86227 91555 99897 115129 302859 150643 25655 231512 -92094 -95345 -123568 -212663 145372
16179 227094 101621 161513 -58756 -30170 60613 258403 212227 26112 -366029 -203512 -165984
16168 -165984 -105048 77323 104243 339199 128744 257912 98842 -238120 314205 1728 107278
16157 107278 117977 223858 -76325 -268780 -230402 162845 45029 21104 92054 -65788 362760
16145 -37642 -174808 -392595 3694 91106 -44970 147419 52623 85304 -42097 32326 88875
16134 88875 -9395 198733 272272 258723 305211 -290548 -329108 -197868 251524 -260379 11845
16122 -24022 -2503 304750 -103511 17499 73412 81925 94530 167869 319 237154 -55762 -269781
$$ packed form
16204f9903B79033A35612M3242J11712b6876l21124c247k0297j22725g236C52482
16192H6227N328Q342J5232J87730A50643B5655K05857i2094l251k8223q9095A45372
16179B27094A01621N9892e8756K8586F0613J97790m6176B6112c66029J62517L7528
16168a65984O0936G7323K6920K34956A28744J29168I8842b38120C14205A728J05550
16157A07278J0699J05881g6325j92455L8378A62845D5029B1104P0950f5788C62760
16145c7642j37166k17787C694Q7412d4970A47419E2623L2681d2097C2326N6549
16134H8875i395A98733P3539j3549M6488b90548l8560J31240B51524b60379A1845
16122b4022b503C04750a03511A7499N5913Q513J2605P3339C19K36835e5762k14019
$$ plain form
16110 -269781 -190670 -36530 -207591 360123 106710 -239217 238209 47800 2859 -34142 22305
16098 65505 -355145 -43583 125316 261521 -41984 -26429 -80945 116697 24974 21302 -55883
16086 227627 90914 194551 -297758 -3201 -98450 -34297 221429 -307709 121883 -94641 157326
16074 -4464 47204 144010 -43258 -145165 -59237 -212709 -58704 -148958 232529 -66649 -159848
16063 -159848 -123216 164685 -39544 224272 245588 220401 53048 177867 189640 47113 210359
16052 210359 427233 118773 29342 -574 328014 90626 -196641 183645 18465 165557 -29450
16040 -146472 205961 -39644 2869 42507 309391 -27271 -240882 154366 -42565 190521 -278750
16028 -258100 46136 -38236 25192 162812 -82339 -12421 -237905 -89047 -134624 35591 -51975
$$ packed form
16110b69781P9111c6530j71061C60123A06710b39217B38209D7800B859c4142B2305
16098F5505c55145d3583A25316J36205d1984J5555n4516A16697B4974l672e5883
16086B27627I0914J03637b97758c201r5249c4297B21429c07709A21883i4641A57326
16074d464D7204R6806d3258j01907e9237j53472e8704r0254B32529f6649r3199
16063a59848L6632A64685c9544B24272K1316k5187E3048J24819J1773D7113J63246
16052B10359K16874A18773B9342e74C28014I0626a96641A83645A8465J47092b9450
16040a46472B05961c9644B869L9638K66884b7271k13611A54366d2565A90521b78750
16028b58100D6136c8236B5192J37620h2339a2421k25484h9047m5577C5591e1975
$$ plain form
16016 91123 66303 159279 -104122 -290425 -180044 -44672 44807 166950 253486 -324106 158873
16004 30486 373218 67080 -88924 -20152 -89763 138261 -247855 194236 -32013 106804 -153947
15992 -99603 -160964 77383 -36741 -148788 -17742 -270789 -15411 -50699 -139260 292600 -11427
15980 99788 -206267 55549 23484 49714 -294301 -27966 -145427 -29805 -20633 110044 22116
15968 210444 405583 17180 -92208 154868 -35431 138622 10969 -93581 59997 225325 -91747
15956 140672 -158777 -407570 262157 92691 124396 171455 86233 -39697 -194700 -5003 227441
15944 -98434 -326794 62398 -106666 631 -139838 91155 87353 104692 -176589 -371254 82585
15932 8728 -603111 17673 -304257 -1418 175105 146592 -106298 -247559 -143037 -151485 -150665
$$ packed form
16016I1123k4820R2976a04122j86303J10381d4672D4807J22143Q6536c24106A58873
16004C0486L42732F7080h8924b0152o9611A38261b47855A94236c2013A06804a53947
15992i9603o1361G7383c6741j12047a7742k53047a5411l5288q8561B92600a1427
15980I9788b06267E5549B3484K6230b94301b7966j17461b9805R172A10044B2116
15968B10444J95139A7180i2208A54868c5431A38622A0969i3581E9997J65328i1747
15956A40672a58777k48793B62157I2691L1705M7059q5222c9697j55003e003B27441
15944i8434k28360F2398a06666F31a39838I1155l802J7339a76589j94665H2585
15932H728f03111A7673c04257a418A75105k8513a06298j41261J04522q448Q20
$$ plain form
15921 -150665 -14491 201946 333206 -138424 206208 -107982 -192221 11257 -107674 -161139
15911 -161139 160689 257180 -29630 70941 172779 -433332 219821 25587 212677 136817
15901 136817 -192931 113280 -36206 20749 322866 142488 -111973 209784 -49536 114937
15890 27355 78895 -85814 -19037 -46801 -3773 -241987 -150605 41424 170079 -91411 207156
15878 165827 -147707 -314664 81294 93223 -220214 -177996 -58313 -104030 -72790 -183918 122236
15866 -37797 -454597 -41978 -186825 -210159 16109 99731 -119542 -301000 -188103 -131653 -1385
15854 -228316 74928 258822 28322 -143720 55045 -284713 -356170 -104161 36294 -297948
15843 -22344 190116 -348313 56096 30048 33017 123476 -59761 49957 98791 366993 -65985
$$ packed form
15921a50665a4491B01946J31260a38424B06208a07982q4239A1257a07674n3465
15911a61139A60689R6491b9630G0941J01838d33332B19821B5587J87090p5860
15901A36817a92931A13280c6206B0749L02117A42488a11973B09784d9536A14937
15890B7355N1540h5814a9037k7764c773k38214R1382D1424J28655i1411B07156
15878A65827a47707j66957H1294J1929b20214M2218e8313m5717L1240j11128A22236
15866c7797m16800d1978j44847k3334A6109Q3622a19542j81458J12897N6450a385
15854b28316G4928J83894B8322a43720E5045b84713p1457a04161C6294b97948
15843b2344A90116c48313E6096k6048K969R0459e9761D9957M8834K68202f5985
$$ plain form
15831 -68117 -93893 233558 -119665 -150595 43940 -169114 175658 -144175 -83545 -26780 -190766
15820 -190766 44999 -35014 51912 -168196 -19726 240071 -117146 -225132 177406 107182
15810 107182 45870 196330 -291795 -483525 100887 -274048 -276013 -52046 62418 -77380 -126361
15799 -126361 -238119 -65995 -198465 -331334 32851 -39580 -265876 -312979 -55192 81523 -20993
15787 -284340 44923 82611 -32884 -105490 9970 77682 298566 -73131 64432 -635831 -14653
15775 102174 -79776 56451 -306491 -17299 -421849 -269056 -245821 139989 -134150 12530
15764 41001 108916 -161206 -95605 110154 -461588 447891 27660 85592 181585 -109976 50993
15752 -221342 184385 -277199 199440 -43227 -132755 -48515 174626 -9189 244538 -179415
$$ packed form
15831f8117k5776B33558a19665l0930D3940a69114A75658a44175O0630b6780j63986
15820a90766D4999c5014E1912a68196a9726B40071a17146j07986A77406p0224
15810A07182D5870J50460b91795j91730A00887b74048j965e2046F2418g7380m8981
15799a26361j11758f5995j32470j32869C2851c9580k26296m7103e5192H1523b0993
15787b84340D4923L7688c2884p2606I970O7712K20884g3131F4432f35831a4653
15775A02174g9776E6451c06491a7299m04550J52793K3235A39989a34150A2530
15764D1001O7915a61206O5601A10154d61588D47891B7660N7932R5993a09976E0993
15752b21342A84385b77199A99440d3227q9528d8515A74626i189B44538a79415
$$ plain form
15741 29235 -124868 17133 -5110 222998 181964 -331513 -28806 88127 180722 -326718 186455
15729 -261525 252413 202217 -325799 326142 -176714 -158815 44669 -323402 -82306 -280850
15719 -280850 28504 -82668 -83802 116026 -220510 -292711 56268 -344903 143687 99771 -82757
15707 69398 -281723 171807 260660 284569 -22366 -142807 422027 69358 -300334 72188 -115492
15695 -57515 -91299 67922 98705 25199 -217268 -157611 -211822 -12078 6002 19178 -41326 121003
15682 -149898 62675 182812 -27390 274449 26395 78408 8314 -97431 62478 91096 313387
15671 313387 191681 147969 78287 -150835 67682 62048 -145644 -176513 -341603 38360 312032
15660 312032 31869 -121292 201958 283527 -34119 -177384 -260381 1201 40374 4784 -55976
$$ packed form
15741B9235a24868A7133e110B22998m1034c31513b8806H8127R2595c26718A86455
15729b61525B52413n0196c25799C26142a76714J7899D4669c23402h2306j98544
15719b80850B8504h2668j134A16026b20510p2201E6268c44903A43687m3916h2757
15707F9398b81723A71807Q8853K3909b2366j20441D22027F9358c00334G2188a15492
15695e7515l3784F7922L0783B5199b17268N9657n4211a2078F002J3176d1326A21003
15682a49898F2675J20137b7390B74449B6395N2013H314i7431F2478K8618K22291
15671C13387j21706m3712o9682a50835F7682n634a45644l0869j65090C8360K73672
15660C12032C1869a21292B01958Q1569c4119j43265q2997A201L9173D784e5976
$$ plain form
15648 -140667 112345 313429 -54617 -113350 14273 219632 314321 -75647 -67727 273731 106440
15636 127658 -16303 184534 691 -231521 150671 -88340 10892 40819 45368 -127956 -46826
15624 171469 99302 -54920 281349 -45695 -80267 -157063 -214863 -10083 252171 252903 251979 -34573
15611 217919 -97879 -7634 8675 -11103 -227970 -159584 21199 -125019 -154165 113717 184602
15600 184602 -56245 -93924 33806 114714 85683 69076 -64533 -263974 57589 -191608 132455
15588 -229033 -32438 -324557 112525 -108524 35977 142142 -72910 244894 -220618 -204509
15578 -204509 103089 -104130 -248698 -37168 234350 414625 238760 -210766 -139548 62601
15567 145102 -301225 121618 -169473 -361901 -139158 111192 -89311 -294185 123369 -480537
$$ packed form
15648a40667A12345K01084e4617n8733A4273K05359R4689g5647P920B73731A06440
15636A27658a6303A84534F91b31521A50671h8340A0892K9927M549a27956d6826
15624A71469p2167e4920B81349d5695l4572p6796n7800a0083B52171P32r24c4573
15611B17919i7879g634H675a1103k16867O8386B1199a25019k9146A13717P0885
15600A84602e6245l7679C3806Q0908k9031j6607f4533j99441E7589a91608A32455
15588b29033c2438k92119A12525a08524C5977J06165g2910B44894b20618J6109
15578b04509A03089a04130j44568c7168B34350J80275j75865b10766P1218F2601
15567A45102c01225A21618a69473j92428a39158A11192h9311k04874A23369d80537
$$ plain form
15556 -139242 153765 62529 -208385 -18225 -88987 -139361 -71035 -288785 -62716 -37758 72198
15544 257134 -331243 285964 272924 94597 -33842 29233 -145482 -117387 -372846 -235369
15534 -235369 -151558 -229704 159911 -177096 144863 -1862 -276974 -110752 4228 103762 -37523
15522 27776 128896 117567 -69995 20191 147361 -70520 148711 62304 189962 80327 242393
15511 242393 37134 -121257 168086 -167102 -77523 -247060 -198494 -429546 -46646 123198
15500 -60162 -22278 160781 -38790 288093 87536 132033 -3412 138365 -319868 211499 84644
15488 -133760 -52509 136142 -6669 92853 159104 -272390 -190899 -97271 -247075 33041 65160
15477 65160 -278302 -19697 -35565 5595 -5267 74854 -224039 12217 -119091 -95993 41566
$$ packed form
15556a39242A53765F2529b08385a8225p0762n0374O8326k17750f2716K4958G2198
15544B57134c31243B85964j3040I4597c3842B9233a45482K8095k55459J37477
15534b35369Q3811p8146A59911a77096A44863a862k75112a10752D228R9534c7523
15522B7776J01120j1329f9995B0191J27170g0520A48711F2304J27658H0327J62066
15511B42393C7134a21257A68086a67102g7523j69537M8566k31052d6646A23198
15500f0162b2278A60781c8790B88093H7536M4497c412A38365c19868B11499H4644
15488a33760e2509A36142f669I2853O6251b72390Q1491R3628j49804C3041L2119
15477F5160b78302a9697j5868E595e267G4854b24039A2217a19091K3098D1566
$$ plain form
15465 -324689 -279473 9209 -167113 49808 -168903 -196070 39802 227590 -208 -102987 -350502
15454 -350502 -121796 460090 206818 27763 28993 -131515 -461347 -83954 3835 71941 67309
15443 67309 -96831 99407 120815 207763 39048 -126981 -68027 -199327 128555 -36906 -238829
15432 -238829 -147936 12774 -155707 194149 14063 -26911 -73835 -132195 249657 -49205 -203055
15421 -203055 17661 -273519 -200061 -104609 101816 342143 -151304 -83852 290554 226022
15411 226022 62323 42514 106190 -354090 -87161 -81162 -200670 -56465 452600 123972 208673
15400 208673 -88619 -87649 -323950 68624 -91262 35878 -49273 7678 105783 262869 289107 111491
15387 -96512 -79806 -207949 9481 395410 -194095 -251052 -11865 -82781 190729 19742 -43728
$$ packed form
15465c24689M5216I209a67113D9808a68903k7167C9802J87788b08j02779k47515
15454c50502a21796D60090B06818B7763J230a31515l29832h3954C835O8106m632
15443F7309i6831I9407K1408Q6948C9048a26981N8954j31300A28555c6906k01923
15432b38829R0893A2774a55707A94149A4063b6911m6924n8360B49657d9205j53850
15421b03055A7661b73519P3458R5452A01816K40327a51304O7452B90554o4532
15411B26022F2323j9809O3676c54090h7161N999j19508e6465D52600A23972Q4701
15400B08673h8619R70k36301F8624i1262C5878d9273G678R8105J57086K6238A11491
15387i6512J6706j28143I481L85929a94095n6957a1865p0916A90729A9742d3728
$$ plain form
15375 3646 -453719 190213 -62053 41766 -166232 -60681 -261712 -229973 146554 67144 -44344
15363 -164195 523650 103006 34900 -360203 -124154 -281474 -126371 16707 -60106 299976
15352 29919 -273398 -122227 49218 127263 36307 -47112 -125852 -67563 106156 -5003 -229728
15341 -229728 322396 133998 163969 -127077 -92973 319786 25393 137625 12467 293950
15331 293950 140004 56911 -141709 200454 108759 149850 -232220 -194462 189152 162399
15321 162399 -16595 21022 -188504 30075 48364 -82784 -51480 223322 -62208 85805 -256894
15309 -123392 27472 209961 76125 -7795 -13439 139170 109506 57919 -20873 162988 46520
15297 -160127 -200371 -102201 89605 -56754 -102944 191565 -139411 205064 125560 -157205 53446
$$ packed form
15375C646d53719A90213f2053D1766a66232f0681k01031L1739A46554F7144d4344
15363a64195E23650A03006C4900c60203a24154j57320a26371A6707f0106B99976
15352B9919b73398a22227D9218P8045C6307d7112p8740N8289A06156e003k24725
15341b29728C22396A33998K9971a27077L4104C19786B5393J12232A2467K81483
15331B93950A40004E6911a41709B00454r1695M1091b32220L7758A89152k6753
15321A62399a6595B1022a88504C0075J8289h2784L1304B23322f2208H5805b56894
15309a23392B7472J82489G6125g795n644A39170k9664n1587b0873A62988D6520
15297a60127m0244R8170H9605e6754m6190A91565a39411B05064p9504a57205E3446
$$ plain form
15285 -8420 -304271 -29292 112100 216244 64419 175007 74140 176667 249657 95070 104279
15274 104279 -239319 127948 365720 54026 -55439 68295 388032 126754 61036 129481
15264 129481 44022 54030 48883 -102232 -58526 57018 296837 -97908 240931 212659 393800
15253 393800 198902 149304 324905 83833 241520 193886 -44108 153243 9652 131101 71972
15242 71972 11304 228498 62103 -129642 263128 523198 673949 457697 879237 1042090
15232 1042090 1392594 720260 615784 430049 648954 -46232 -113156 221810 231779 367345
15222 367345 199157 323493 57811 85608 -84102 130521 27943 268350 -88086 -14180 265415
15210 207534 90303 -320594 338858 135342 -96118 292182 -70569 37940 48760 -79633 138216
$$ packed form
15285h420k95851b9292A12100J04144F4419J10588G4140J02527P2990I5070R209
15274A04279b39319A27948K37772E4026e5439F8295L19737A26754F1036O8445
15264A29481D4022J0008n147a02232M3706E7018K39819i7908B40931k8272J81141
15253C93800j94898m9598J75601H3833J57687m7634d4108A53243I652J21449n9129
15242G1972A1304K17194F2103a29642B63128K60070J50751k16252M21540J62853
15232A042090L50504o72334j04476j85735K18905d6232o6924B21810R969J35566
15222C67345j68188J24336E7811K7797h4102A30521B7943K40407h8086a4180B65415
15210B07534I0303c20594C38858A35342i6118B92182g0569C7940J0820g9633A38216
$$ plain form
15198 -47344 -2917 100884 209012 225725 -29610 -424516 -12399 -14780 127325 -25247 166477
15186 -198180 -43530 116917 -61324 124070 208935 216057 159132 -177833 -175317 -148822 -106694
15175 -106694 75264 -49031 243796 277221 -160462 29030 -11532 63767 143424 107525 -44091
15163 9617 462815 -109650 21298 153455 -43939 -26306 15455 284965 27411 160261 -109217
15151 -46862 34001 387471 -2781 368335 -165183 -93142 -58543 250809 -110797 103060 -31222
15139 164876 22900 -160051 504602 274966 103385 119543 -155941 110853 -97728 -12759
15128 -334396 118490 533807 342690 267542 132090 214049 78840 -20966 140034 158660
15118 158660 -108191 -10413 -137766 -46812 35529 -124349 35053 120890 -135720 254914
$$ packed form
15198d7344b917A00884J08128J6713b9610l94906a2399k381A27325b5247A66477
15186a98180d3530A16917f1324A24070Q4865P122n6925a77833K516K6495M2128
15175a06694G5264d9031B43796L3425a60462B9030a1532F3767P9657l5899d4091
15163I617M53198a09650B1298J32157d3939J7633A5455K69510B7411J32850a09217
15151d6862C4001L53470b781C68335a65183P2041L4599B50809a10797A03060c1222
15139A64876B2900a60051E04602k29636A03385J6158a55941A10853i7728a2759
15128c34396A18490M15317j91117p5148A32090Q1959G8840b0966A40034J8626
15118A58660a08191a0413j27353d6812C5529a24349C5053Q5837a35720B54914
$$ plain form
15107 327774 203305 152376 113502 294319 204426 152795 -16489 26792 328589 -184640 166896
15095 423028 108293 180011 -36796 321884 -1918 165476 -18858 -215513 -108295 221508
15084 278518 268929 -3512 471758 369793 -227741 453765 31682 48889 -213134 318634 -127685
15072 90845 424710 -3818 95776 211466 -22156 128816 86865 -127546 -57784 24860 248161
15061 248161 111535 314284 502 449936 246073 211266 165653 100220 -22304 193254 158512
15050 158512 121757 482701 157983 65874 289961 464939 234224 140620 -220694 263341
15039 292607 132036 395039 32564 265232 220387 -290118 76718 -36694 353662 102337
15028 98513 105282 144959 113249 -99434 271507 291383 -14696 395226 203552 198700 303648
$$ packed form
15107C27774j24469n0929l8874J80817q9893n1631a6489B6792L01797a84640A66896
15095D23028A08293P1718c6796C21884a918A65476a8858j96655J07218B21508
15084B78518r589c512D71758j01965b27741D53765C1682J7207b13134C18634a27685
15072I0845L33865c818I5776J15690b2156A28816m1951a27546e7784B4860K23301
15061B48161A11535K02749E02M49434k03863l4807m5613o5433b2304A93254l4742
15050A58512l6755L60944A57983F5874K24087J74978k30715r3604b20694B63341
15039B92607A32036K63003C2564K32668m4845b90118G6718c6694C53662A02337
15028I8513O769L9677l1710i9434B71507J9876a4696C95226j91674m852J04948
$$ plain form
15017 303648 146881 -6194 102853 191782 141568 -1652 90879 551529 -59078 294048 86595
15005 287471 153833 74020 321608 270955 270487 257696 489609 272491 445539 229636 88946
14993 158382 134445 67003 284558 -169834 157032 408433 114812 87809 134648 237506
14983 237506 54323 222405 213810 63707 382831 253120 410593 353909 -117023 265960
14972 414228 464040 131078 49878 572595 -94208 86186 -43344 -16320 441073 169302 346723
14961 346723 336755 248871 185373 724177 483526 215952 244934 572247 360545 105465
14950 265593 205015 214425 397167 38052 175377 133137 437372 326412 92862 343280 312213
14939 312213 99687 341606 162042 669835 138274 481385 -17372 251845 433630 152997
$$ packed form
15017C03648A46881f194A02853Q8929n0214a652I0879M60650e9078B94048H6595
15005B87471j33638G4020K47588n0653m68j2791K31913k17118J73048k15903H8946
14993A58382k3937F7003K17555a69834A57032K51401A14812k7003M6839J02858
14983B37506E4323J68082q595F3707L19124j29711J57473n6684a17023B65960
14972D14228M9812A31078D9878N22717i4208H6186d3344a6320D41073A69302J77421
14961C46723r968q7884o3498N38804k40651B15952K8982L27313k11702A05465
14950B65593o0578R410J82742C8052J37325m2240L04235j10960I2862K50418l1067
14939C12213I9687K41919A62042N07793A38274L43111a7372B51845J81785A52997
$$ plain form
14928 -83315 329846 197975 101264 196379 238664 261702 158387 369158 590383 247144
14917 216420 350359 322778 182337 296353 182260 291446 245118 492770 188354 30113
14906 304576 -134600 621296 232161 283461 420887 391757 318756 163033 642791 200877
14895 4386 215218 291123 441024 362301 114603 181414 295818 384559 546800 252602 196439
14884 196439 310995 419363 457323 678812 184428 346006 248219 297042 310908 167411
14874 167411 377915 510588 223573 314959 348490 388867 304929 117378 244592 522337
14864 522337 279800 155182 385866 270776 270512 437779 405645 435792 185401 251095 486989
14853 486989 404523 388567 417737 537811 628337 341116 288613 256010 630718 478016 524001
$$ packed form
14928h3315C29846j31871r6711R5115M2285K3038j03315K10771K21225B47144
14917B16420J33939k7581j40441J14016j14093J09186m6328K47652A88354C0113
14906C04576a34600F21296B32161N1300J37426k9130p3001j55723M79758B00877
14895D386K10832P5905J49901p8723A14603O6811J14404Q8741J62241B52602n6163
14884A96439J14556J08368L7960K21489A84428J61578r7787M8823J3866j43497
14874A67411K10504J32673B23573R1386L3531M0377q3938A17378J27214K77745
14864E22337k42537j24618K30684j15090k64J67267l2134L0147A85401O5694K35894
14853D86989q2466j5956K9170J20074R0526k87221n2503l2603L74708j52702M5985
$$ plain form
14842 524001 313331 564182 466443 465189 523065 225517 132276 513950 365689 746027
14832 746027 322888 584803 385662 400231 603468 524460 567678 454671 623307 520726
14822 520726 646260 294771 632264 453851 437442 503171 462594 858210 478467 679477
14812 679477 471980 530137 266912 459999 811240 129753 595966 753410 594234 726450
14802 726450 256838 359498 490292 713390 380315 487582 1025473 608789 905535 288964
14791 754511 593409 260268 775731 589625 820854 616198 787371 376914 656722 365964
14781 365964 480893 761481 577792 514306 502751 429741 319643 531450 617861 346866
14771 346866 349771 818654 711995 465295 727868 718471 557119 639075 792426 601767
$$ packed form
14842E24001k10670K50851r7739j254N7876B25517r3241L81674j48261L80338
14832G46027C22888K61915j99141J4569K03237p9008M3218j13007J68636j02581
14822E20726J25534B94771L37493j78413j6409O5729m0577L95616l79743K01010
14812F79477k07497N8157k63225J93087L51241A29753M66213J57444j59176J32216
14802G26450B56838J02660J30794K23098l33075J07267N37891m16684K96746B88964
14791G54511j61102B60268N15463j86106K31229k04656J71173C76914K79808k90758
14781C65964J14929K80588j83689o3486j1555p3010j10098K11807Q6411k70995
14771C46866K905M68883j06659k46700K62573r397j61352Q1956J53351j90659
$$ plain form
14761 601767 556476 560689 775339 827658 687032 745640 473977 477493 707184 782233 731067
14750 731067 584049 400907 475777 649526 722313 650495 446161 773438 580280 602769
14740 602769 797870 670004 579565 589115 830205 719525 588604 849391 884177 779152
14730 779152 380311 809920 812689 930593 462707 656581 582353 624078 773787 909918
14720 909918 886311 666438 799182 832990 804230 660707 675875 319625 823616 576513
14710 576513 773179 851879 978859 815546 896486 1107723 1096268 1037458 1155071 766049
14700 766049 774636 892823 968956 726440 1178386 693919 743618 803381 1144685 900417
14690 900417 892771 882645 981259 731477 1105959 695739 661363 811005 800176 781918 1077540
$$ packed form
14761F01767m5291M213K14650N2319j40626N8608k71663L516K29691P5049n1166
14750G31067j47018j83142P4870J73749P2787p1818k04334L27277j93158K2489
14740F02769J95101j27866r0439R550K41090j10680j30921K60787L4786j05025
14730G79152C80311M29609K769J17904D62707J93874p4228M1725J49709J36131
14720I09918k3607k19873J32744L3808k8760j43523J5168C19625N03991k47103
14710E76513J96666P8700J26980j63313Q0940K11237j1455n8810J17613l89022
14700G66049Q587J18187P6133k42516M51946m84467M9699N9763L41304k44268
14690I00417p646j0126R8614k49782L74482m10220l4376J49642j0829j8258K95622
$$ plain form
14679 1077540 622702 1009302 783613 937675 1180011 1127234 904996 1180748 911835 1086088
14669 1086088 683748 914941 878649 911140 1050818 1007190 1099006 1004396 1031235 1091239 1038922
14658 1038922 1212374 974881 837069 837855 844921 1198465 1192690 1302207 1012728 1145577 1176605
14647 1176605 956318 1141568 940093 1325532 1229061 1128439 1368789 1168081 1251213 1222516
14637 1222516 1272942 1088380 1661060 1355909 1249927 1260907 1110906 1295236 1258986 1094997
14627 1094997 1439468 1220037 1056695 1497418 1601854 1292336 1328369 1375067 1178451 1847700
14617 1847700 1652846 1376660 1428125 1396238 1332715 1494127 1657090 1393969 1257454 1451060
14607 1451060 1722559 1313583 1659156 1506531 1634849 1354094 1812534 1755435 1757424 1630924
$$ packed form
14679A077540m54838L86600k25689J54062K42336n2777k22238K75752k68913J74253
14669A086088m02340K31193l6292L2491J39678m3628R1816r4610K6839O0004n2317
14658A038922J73452k37493j37812P86P066L53544n775J09517k89479J32849L1028
14647A176605k20287J85250k01475L85439r6471j00622K40350k00708Q3132k8697
14637A222516N0426j84562N72680l05151j05982J0980j50001J84330l6250j63989
14627A094997L44471k19431j63342M40723J04436l09518L6033M6698j96616O69249
14617A847700j94854k76186N1465l1887o3523J61412J62963k63121j36515J93606
14607A451060K71499m08976L45573j52625J28318k80755M58440n7099J989j26500
$$ plain form
14597 1630924 1200517 1753590 1519525 1559749 1536386 1643109 1824480 1643319 1479508 2008321
14587 2008321 1772073 1849321 1453784 2040818 1871994 1734322 1897835 2062204 1748446 1649204
14577 1649204 1847350 2159129 2061823 2068526 1668026 1878407 1947100 2220670 2209805 2040341
14567 2040341 2102987 2368753 1976048 1832106 2144994 2188679 2194195 2046575 2398378 2678438
14557 2678438 2491904 2235627 2670497 2229289 2588739 2413674 2658743 2633189 2722593 2660255
14547 2660255 2621888 3113412 3242680 2977871 3441767 3833024 3899657 4440227 4521200 4896307
14537 4896307 5721988 6998432 7796564 9940966 14173874 21778463 32809548 29781655
14529 29781655 17895811 11554245 7907900 5723352 4269521 3872218 3551019 3096473
$$ packed form
14597A630924m30407N53073k34065M0224k3363J06723J81371j81161j63811N28813
14587B008321k36248P7248l95537N87034j68824j37672J63513J64369l13758r9242
14577A649204J98146L11779r7306O703m00500K10381O8693K73570j0865j69464
14567B040341O2646K65766l92705j43942L12888M3685N516j47620L51803K80060
14557B678438j86534k56277M34870m41208L59450j75065K45069k5554Q9404o2338
14547B660255l8367M91524J29268k64809M63896L91257O6633N40570Q0973L75107
14537D896307Q25681J276444P98132K144402M232908P604589J1031085l027893
14529B9781655j1885844o341566l646345k184548j453831l97303l21199m54546
$$ plain form
14521 3096473 3005252 2596997 2793081 2377496 2278292 2559494 2521053 2587617 2335397 2512358
14511 2512358 2396035 2591171 2834941 2526812 2571711 2591031 2448460 2797285 2884306 2822587
14501 2822587 2563698 2697606 2709135 2871359 2947816 3264865 3029026 3502801 3312194 3448430
14491 3448430 2795493 3069510 3204452 3297422 3555335 3474432 3249906 3141401 3445417 3494070
14481 3494070 3434397 3607296 3546693 3760543 3419387 3409010 3522983 3635746 3860369 4051364
14471 4051364 3945779 4048271 3978856 4209804 4256955 3970991 4310376 4165105 4288315 4562029
14461 4562029 4486131 4313679 4240426 4491918 4517320 4587706 4664936 4701567 4747534 4659518 5086604
14450 5086604 4813837 4768370 4689618 4911978 5093132 5273929 5250231 5327680 5391430 5326323
$$ packed form
14521C096473r1221m08255J96084m15585r9204K81202l8441O6564k52220J76961
14511B512358j16323J95136K43770l08129M4899J9320j42571L48825Q7021o1719
14501B822587k58889J33908J1529J62224P6457L17049k35839M73775j90607J36236
14491C448430o52937K74017J34942R2970K57913q0903k24526j08505L04016M8653
14481C494070n9673J72899o0603K13850l41156j0377J13973J12763K24623J90995
14471D051364j05585J02492o9415K30948M7151k85964L39385j45271J23210K73714
14461D562029p5898j72452p3253K51492K5402P0386P7230L6631M5967q8016M27086
14450E086604k72767m5467p8752K22360J81154J80797k3698P7449O3750o5107
$$ plain form
14440 5326323 5536217 5456893 5525923 5731946 5574347 5698553 5850012 5632603 6002442 5997836
14430 5997836 6231458 6420874 6424359 6296519 6516878 6447124 6603324 6917359 6595737 6795795
14420 6795795 7024414 7249059 7471724 7332368 7500550 7098330 7788894 7736999 8004896 7962049
14410 7962049 7913337 7995089 7982274 8382581 8116657 8290804 8260128 8769976 9223154 9032099
14400 9032099 9196179 9102028 9186824 9474778 9454517 9795995 9995388 10188037 10064345 10408834
14390 10408834 10535073 10751048 11082614 10867847 11162623 11613443 11593526 11748315 11779647 12446352
14380 12446352 12486817 12648093 12654827 12942996 13236637 13493133 13780074 13606869 14415754 14140162
14370 14140162 14770064 15212150 15284664 15672279 15647549 15899700 16103322 16844365 16833676 17138191
$$ packed form
14440E326323K09894p9324O9030K06023j57599J24206J51459k17409L69839m606
14430E997836K33622J89416L485j27840K20359o9754J56200L14035l21622K00058
14420F795795K28619K24645K22665j39356J68182m02220O90564n1895K67897m2847
14410G962049m8712Q1752j2815M00307k65924J74147l0676N09848M53178j91055
14400I032099J64080r4151Q4796K87954k0261L41478J99393J92649j23692L44489
14390A0408834J26239K15975L31566k14767K94776M50820j9917J54789L1332O66705
14380A2446352M0465J61276O734K88169K93641K56496K86941j73205Q08885k75592
14370A4140162O29902M42086P2514L87615k4730K52151K03622P41043j0689L04515
$$ plain form
14360 17138191 17520013 18137405 18357317 18714617 18924754 19366457 19681643 20003554 20415298
14351 20415298 20813220 21400793 21989283 22139181 22618976 23442649 23644050 24196913 24693093
14342 24693093 24998012 26036211 26424754 26945804 27641072 28276963 29234186 29370908 30512541
14333 30512541 30995564 31813365 32849622 33367035 34569194 35612892 36224377 37465968 38256822
14324 38256822 39228337 40648923 41913657 42688935 44444419 45335848 46666590 48205501
14316 48205501 49771090 51215203 52805998 54735143 56343119 58117422 60152505 62144623
14308 62144623 64408720 66392180 68670557 71118712 73688527 76526796 79097797 82488337
14300 82488337 85506030 88851518 92060461 96115477 99811361 104166720 108348548 112725144
$$ packed form
14360A7138191L81822O17392K19912L57300K10137M41703L15186L21911M11744
14351B0415298L97922N87573N88490J49898M79795Q23673K01401N52863M96180
14342B4693093L04919J038199L88543N21050O95268O35891R57223J36722J141633
14333C0512541M83023Q17801J036257N17413J202159J043698O11485J241591P90854
14324C8256822R71515J420586J264734P75278J755484Q91429J330742J538911
14316D8205501J565589J444113J590795J929145J607976J774303K035083J992118
14308F2144623K264097J983460K278377K448155K569815K838269K571001L390540
14300H2488337L017693L345488L208943M055016L695884M355359M181828M376596
$$ plain form
14292 112725144 117492316 122726956 128127042 134365415 139966288 146209829 153131317 159944721
14284 159944721 167761523 175368934 183996436 192852608 202041826 212017958 222263388 233189265
14276 233189265 244887086 256856565 269227766 282571925 296050304 309984384 324490878
14269 324490878 338787698 352639065 365469827 377644098 388911876 399635322 409576078
14262 409576078 418975580 427334303 434523725 441475318 447544373 451144064 451663462 452008051
14254 452008051 447236887 440208967 433740082 426788301 418604043 409467142 399365332 387919142
14246 387919142 376335494 363717990 350167435 336778365 323965282 310966859 297774048
14239 297774048 285446339 273396171 261461102 249849024 238115362 226889740 216552690
$$ packed form
14292A12725144M767172N234640N400086O238373N600873O243541O921488O813404
14284A59944721P816802P607411Q627502Q856172R189218R976132J0245430J0925877
14276B33189265J1697821J1969479J2371201J3344159J3478379J3934080J4506494
14269C24490878J4296820J3851367J2830762J2174271J1267778J0723446R940756
14262D09576078R399502Q358723P189422O951593O069055L599691N19398L44589
14254D52008051m771164p027920o468885o951781q184258r136901j0101810j1446190
14246C87919142j1583648j2617504j3550555j3389070j2813083j2998423j3192811
14239B97774048j2327709j2050168j1935069j1612078j1733662j1225622j0337050
$$ plain form
14232 216552690 206669855 197125778 188515590 179711851 171322521 162888854 154928842 147767476
14224 147767476 141034395 134848968 128730147 122993951 117637113 112863782 107984582 103884637
14216 103884637 99743930 95845219 92081531 88708704 85446274 81911586 78526216 75951846
14208 75951846 72905611 70867285 68236352 66008070 63943147 61800545 59992759 57718246
14200 57718246 56096851 54345352 52589973 51296876 49657950 48226079 46587743 45587286
14192 45587286 44435905 43216382 42057672 40578272 39427140 38378912 37347780 36486828
14184 36486828 35760921 34326875 33524327 33095622 32189573 31253987 30279159 29574684 28753550
14175 28753550 28295816 27185805 26672728 25868318 25684199 25013214 24391332 23727584 23618938
$$ packed form
14232B16552690r882835r544077q610188q803739q389330q433667p960012p161366
14224A47767476o733081o185427o118821n736196n356838m773331m879200m099945
14216A03884637m140707l898711l763688l372827l262430l534688l385370k574370
14208G5951846l046235k038326k630933k228282k064923k142602j807786k274513
14200E7718246j621395j751499j755379j293097j638926j431871j638336j000457
14192D5587286j151381j219523j158710j479400j151132j048228j031132q60952
14184C6486828p25907j434046q02548m28705r06049r35586r74828p04475q21134
14175B8753550m57734j110011n13077q04410j84119o70985o21882o63748j08646
$$ plain form
14166 23618938 22739065 22472300 21852624 21362545 20957605 20655122 19981404 19946269 19139771
14157 19139771 19103762 18644552 17993052 17964783 17353798 17101606 16564454 16465831 16345828 16006465
14147 16006465 15556361 15334521 15285430 14709584 14418891 14042569 14140719 13762841 13685845 13298621
14137 13298621 13215492 13003890 12760438 12596141 12584805 11834836 12254174 11616586 11805141 11776158
14127 11776158 11081687 11038552 11012333 10597944 10553373 10587485 10521675 10288217 10415347 10235651
14117 10235651 9740074 9690729 9813104 9219643 9261616 9018266 8743868 8804438 8739148 8530105
14107 8530105 8523942 8234613 8197149 7974227 8019798 7748516 7871404 7778668 7736436 7469474
14097 7469474 7552887 7089646 7156260 7047801 7110281 6887754 7052994 7073573 6578007 6504718
$$ packed form
14166B3618938q79873k66765o19676m90079m04940l02483o73718l5135q06498
14157A9139771l6009m59210o51500k8269o10985k52192n37152r8623j20003l39363
14147A6006465m50104k21840m9091n75846k90693l76322R8150l77878p6996l87224
14137A3298621q3129k11602k43452j64297j1336p49969M19338o37588J88555k8983
14127A1776158o94471m3135k6219m14389m4571L4112o5810k33458J27130j79696
14117A0235651m95577m9345J22375n93461M1973k43350k74398O0570o5290k09043
14107H530105o163k89329l7464k22922M5571k71282J22888r2736m2232k66962
14097G469474Q3413m63241O6614j08459O2480k22527J65240K0579m95566p3289
$$ plain form
14087 6504718 6396904 6515986 6178583 6313567 6246738 6445393 6169025 5804691 5989482 5609363
14077 5609363 5721578 5867157 5781607 5610231 5589037 5512345 5462481 5450833 5550298 5446949
14067 5446949 5145506 5048469 4903116 5230412 5228471 4875351 5030182 5162098 4763185 4764343
14057 4764343 4995404 5033102 4660952 4894843 4624201 4644322 4487439 4609382 4512517 4428982
14047 4428982 4325559 3971288 4465635 4171298 4347846 3994719 4192700 4137975 3757883 3853157
14037 3853157 4026295 3696552 3874282 3721867 3346474 3766165 3403666 3463013 3895188 3582531
14027 3582531 3505301 3321410 3478069 3268701 3146091 3380459 3294968 3307675 3186682 3288282
14017 3288282 3320156 3293161 3000078 3233771 3089002 2986275 3061345 2800199 3026435 2881860
$$ packed form
14087F504718j07814J19082l37403J34984o6829J98655k76368l64334J84791l80119
14077E609363J12215J45579q5550j71376k1194p6692m9864j1648R9465j03349
14067E446949l01443r7037j45353L27296j941l53120J54831J31916l98913J158
14057D764343K31061L7698l72150K33891k70642K0121j56883J21943r6865q3535
14047D428982j03423l54271M94347k94337J76548l53127J97981n4725l80092R5274
14037C853157J73138l29743J77730j52415l75393M19691l62499N9347M32175l12657
14027C582531p7230j83891J56659k09368j22610K34368q5491J2707j20993J01600
14017C288282L1874k6995k93083K33693j44769j02727P5070k61146K26236j44575
$$ plain form
14007 2881860 3115774 2960143 3092466 2867266 2658723 2928516 2765023 2897538 2777568
13998 2777568 2821175 2762105 2625110 2555188 2843884 2505108 2595997 2539822 2094070 2390071
13988 2390071 2048910 2236198 2343487 2463398 2689533 2361027 2232300 2814495 2628707
13979 2628707 2997846 3368896 3541321 3797118 4840429 6132876 9093466 15888498 27546006
13970 27546006 30574180 20820533 14350779 10438116 7984631 6101514 5265062 4837281
13962 4837281 4072471 3866316 3580679 3719428 3385330 2876929 2874616 2973721 3075186 2492865
13952 2492865 2596487 2715100 2448537 2444076 2540841 2426645 2233898 2027018 2255193 2087172
13942 2087172 2020528 1865095 2030352 2468341 2084311 2028562 1863062 2089593 2011842 2074455
$$ packed form
14007B881860K33914j55631J32323k25200k08543K69793j63493J32515j19970
13998B777568M3607n9070j36995o9922K88696l38776R0889n6175m45752K96001
13988B390071l41161J87288J07289J19911K26135l28506j28727N82195j85788
13979B628707L69139L71050J72425K55797J043311J292447K960590O795032J1657508
13970B7546006L028174r753647o469754l912663k453485j883117q36452m27781
13962D837281p64810k06155k85637J38749l34098n08401k313R9105J01465n82321
13952B492865J03622J18613k66563m461R6765j14196j92747k06880K28175j68021
13942B087172o6644j55433J65257M37989l84030n5749j65500K26531p7751O2613
$$ plain form
13932 2074455 1846272 2190405 2021957 1968351 2036941 1647229 1975710 1805727 1768623 1886447
13922 1886447 2035462 1897679 1834465 2115861 1776322 1789600 1499454 1838695 1591983 1722748
13912 1722748 1955012 1806588 2117322 1668116 1733668 1520202 1560449 1776123 1507787 1615656
13902 1615656 1426351 1618480 1749713 1765370 1683463 1712545 1636195 1499076 1412149 1557510
13892 1557510 1574480 1477693 1271867 1625932 1304408 1484666 1244284 1641943 1422058 1499768
13882 1499768 1267245 1345578 1565484 1395915 1360738 1469521 1423302 1452351 1308961 1135231
13872 1135231 1495958 1374308 1648780 1317071 1553637 1508669 1319962 959251 1059931 1257304
13862 1257304 1335511 1209144 1344541 1224179 1305850 1359955 1316608 1290858 1417835 1102947
$$ packed form
13932B074455k28183L44133j68448n3606O8590l89712L28481j69983l7104J17824
13922A886447J49015j37783o3214K81396l39539J3278k90146L39241k46712J30765
13912A722748K32264j48424L10734m49206O5552k13466M0247K15674k68336J07869
13902A615656j89305J92129J31233J5657q1907K9082p6350j37119q6927J45361
13892A557510J6970r6787k05826L54065l21524J80258k40382L97659k19885P7710
13882A499768k32523P8333K19906j69569l5177J08783m6219K9049j43390j73730
13872A135231L60727j21650K74472l31709K36566m4968j88707l60711J00680J97373
13862A257304P8207j26367J35397j20362Q1671N4105m3347k5750J26977l14888
$$ plain form
13852 1102947 905394 1262883 1138978 1131692 1024993 1469359 1291501 1213289 1282164 1009850
13842 1009850 1234070 1240081 898272 1222394 905377 1167811 925323 869948 1277023 996922
13832 996922 1282418 1150934 1108088 1143372 778233 1353052 1294413 938663 920747 972517
13822 972517 914866 1094598 1252404 895046 1104989 927470 1276124 953189 890488 1331426
13812 1331426 1016682 948560 962614 969945 624328 973172 843595 952424 732867 1060326
13802 1060326 682226 983280 860854 852511 1114046 858775 910319 714322 785718 840311
13792 840311 847927 877400 995107 599850 823551 904448 965748 721035 697276 1213382 901588
13781 901588 885151 769925 628692 732884 571988 1134216 647998 792311 809545 998990
$$ packed form
13852A102947j97553L57489j23905p286j06699M44366j77858p8212O8875k72314
13842A009850K24220O011l41809L24122l17017K62434k42488n5375M07075k80101
13832I96922K85496j31484m2846L5284l65139N74819n8639l55750j7916N1770
13822I72517n7651J79732J57806l57358K09943j77519L48654l22935o2701M40938
13812A331426l14744o8122J4054P331l45617L48844j29577J08829k19557L27459
13802A060326l78100L01054j22426q343K61535k55271N1544j95997P1396N4593
13792H40311P616K9473J17707l95257K23701Q0897O1300k44713k3759N16106l11794
13781I01588j6437j15226j41233J04192j60896N62228m86218J44313J7234J89445
$$ plain form
13771 998990 1085856 638325 455997 862377 679535 735462 703528 524479 828882 751639
13761 751639 1050259 775732 936358 801273 755352 742059 662492 924747 641771 725554
13751 725554 869847 966454 650034 461389 666643 967055 679707 710018 730315 850331
13741 850331 827365 876759 497500 602827 897337 935958 792376 1046589 790338 840180
13731 840180 741909 397936 460575 862149 434505 598992 873101 515477 761304 651426
13721 651426 686769 890506 810269 692982 615347 472977 900037 677760 570699 524738
13711 524738 658348 828440 645627 827453 468659 771869 587551 580410 638185 673970
13701 673970 633780 905142 521294 681669 426498 800778 648992 667719 434410 920988
$$ packed form
13771I98990Q6866m47531j82328M06380j82842N5927l1934j79049L04403p7243
13761G51639K98620k74527J60626j35085m5921j3293p9567K62255k82976Q3783
13751G25554J44293R6607l16420j88645K05254L00412k87348L0311K0297J20016
13741H50331k2966M9394l79259J05327K94510L8621j43582K54213k56251M9842
13731H40180r8271l43973O2639M01574m27644J64487K74109l57624K45827j09878
13721F51426L5343K03737q0237j17287p7635j42370M27060k22277j07061m5961
13711E24738J33610J70092j82813J81826l58794L03210j84318p141N7775L5785
13701F73970m0190K71362l83848J60375k55171L74280j51786J8727k33309M86578
$$ plain form
13691 920988 553037 595147 341188 674313 597664 563306 386181 217426 511453 653021
13681 653021 589435 502448 439148 413986 363018 455916 401874 421909 702241 502516 762898
13670 762898 792787 737092 575831 518985 390757 431587 438412 496122 109795 527833 551903
13659 551903 605008 585679 492138 127351 607109 233758 381267 705209 671652 367624
13649 367624 538081 602464 626323 461139 256350 338025 644699 338388 91240 632305
13639 632305 323879 383093 658643 541983 789711 557378 442648 470421 539312 762942
13629 762942 365719 136212 365104 690583 901018 896603 210101 329272 647143 251920
13618 246678 566198 606897 507541 243189 235712 448656 470827 207602 725852 375566
$$ packed form
13691I20988l67951M2110k53959L33125p6649l4358j77125j68755K94027J41568
13681F53021o3586q6987o3300k5162n0968R2898n4042K0035K80332j99725K60382
13670G62898K9889n5695j61261n6846j28228M0830O825N7710A09795M18038K4070
13659E51903N3105j9329r3541A27351M79758B33758J47509L23942l3557l04028
13649C67624J70457O4383K3859j65184k04789Q1675L06674l06311I1240N41065
13639F32305l08426N9214K75550j16660K47728k32333j14730K7773O8891K23630
13629G62942C65719A36212K28892L25479K10435m415B10101J19171L17871B51920
13618B46678L19520M0699r9356B43189p477K12944K2171B07602N18250l50286
$$ plain form
13608 375566 70613 229903 733810 213195 667355 631588 628966 328281 582590 655571
13598 655571 90907 648007 663614 421298 284071 315742 320347 394605 581774 293204 469861
13587 469861 526894 477747 616671 486237 486938 527856 237879 398918 170189 93096 355647
13576 355647 489011 402239 182061 319263 192046 183894 514668 381582 553456 484956
13566 484956 438322 375701 519767 485641 199682 300401 778039 304916 655190 259195
13555 417075 483530 145799 505548 265030 204881 314223 481182 227762 378167 348751
13545 348751 218046 437183 -9573 182138 365450 318795 645927 539437 200322 181818
13535 181818 300440 445307 436372 407060 201113 267623 462380 380755 439409 292791 294017
$$ packed form
13608C75566G0613J59290N03907B13195M54160l5767k622l00685K54309P2981
13598F55571I0907N57100J5607k42316j37227L1671M605P4258J87169k88570J76657
13587D69861N7033m9147J38924j30434P01M0918B37879J61039A70189p7093K62551
13576C55647J33364q6772A82061J37202j27217q152L30774j33086J71874o8500
13566D84956m6634o2621J44066l4126A99682J00719M77638C04916L50274B59195
13555D17075O6455A45799L59749k40518o0149J09342J66959B27762J50405k9416
13545C48751j30705K19137i573A82138J83312m6655L27132j06490B00322j8504
13535A81818J18622J44867q935k9312B01113O6510J94757q1625N8654j46618J226
$$ plain form
13524 294017 408307 249142 248890 438497 44468 436961 526347 433395 358006 40356 -44894
13512 97985 330746 123965 108876 375974 165046 199067 65136 141229 230580 174337 573252
13501 573252 157048 -40036 474715 409500 331215 274103 -93694 179572 558962 103826
13490 444421 198048 178573 558922 446434 296843 280676 282540 -65006 167897 475653
13480 475653 1988 166359 253438 471782 205549 278437 115956 278632 101397 300875
13470 300875 554944 167244 449314 401172 -37175 312417 363465 471281 18989 449377
13460 449377 263930 89780 280915 299613 74577 57208 560166 302383 428484 105722
13449 227965 7718 -95932 -120860 381663 216305 93738 465195 257639 299035 167446 77662
$$ packed form
13524B94017J14290j59165k52J89607D4468L92493Q9386r2952p5389D0356d4894
13512I7985K32761A23965j5089K67098A65046L4021F5136P6093Q9351n6243L98915
13501E73252A57048d0036D74715o5215p8285n7112i3694A79572L79390A03826
13490D44421A98048j9475L80349j12488j49591j6167J864f5006A67897L07756
13480D75653A988J64371Q7079K18344B05549P2888A15956J62676A01397J99478
13470C00875K54069A67244K82070m8142c7175C12417N1048J07816A8989M30388
13460D49377j85447H9780J91135J8698G4577j7369N02958k57783J26101A05722
13449B27965G718i5932k4928C81663j65358I3738L71457k07556M1396j31589G7662
$$ plain form
13437 239523 459218 250342 389448 314181 414273 67369 267516 319188 222281 278645
13427 278645 88571 452634 377755 56884 624294 399296 -57401 435149 364026 172681
13416 197183 135115 662138 304809 -22335 195274 90821 417388 265474 155493 122376
13406 122376 -94220 88420 113277 -130255 -98518 305705 719850 182171 353684 282237
13396 282237 211600 40530 323637 9057 550683 508191 210140 95188 461019 54622 128540
13385 128540 456843 15497 337987 370303 39180 26464 79461 -15858 280565 -12039 501360
13373 134109 -35699 250385 214771 378677 361571 231507 -85827 257203 227367 415842
13363 415842 298204 -95212 150115 192075 409273 292154 115316 191936 311623 390945
$$ packed form
13437B39523K19695k08876J39106p5267J00092F7369K00147N1672r6907N6364
13427B78645H8571L64063p4879E6884N67410k24998e7401D35149p1123A72681
13416A97183o2068N27023C04809b2335A95274I0821L26567j51914j09981l3117
13406A22376i4220H8420K4857a30255L1737C05705M14145A82171J71513p1447
13396B82237p0637D0530K83107I057N41626m2492B10140I5188L65831E4622P3918
13385A28540L28303A5497L22490L2316C9180j2716N2997a5858B80565a2039E01360
13373A34109c5699B50385l5614J63906j7106j30064h5827B57203k9836J88475
13363D15842j17638i5212A50115M1960K17198j17119A15316P6620J19687P9322
$$ plain form
13353 390945 306808 94980 402700 292759 -173072 232079 102172 379238 267979 42609
13342 209003 275106 -34808 313714 266195 470124 405297 78727 145912 280447 572608 220039
13330 326403 196603 27189 387901 431227 386812 496252 318735 253140 331806 383830 56575
13318 34434 66639 254065 598811 251107 319387 286007 345691 332754 75443 72633 18452
13306 116299 422751 265484 247782 322042 11458 95025 269335 452183 292669 268445
13296 268445 -34234 301214 361079 252238 70132 290526 385300 -180718 309652 99189
13285 216803 355859 75546 -185321 -42640 -13109 73815 308562 64199 339176 -9315 -146010
13274 -146010 158834 72862 69574 33536 116856 347229 97372 98567 230344 -13850 -60110
$$ packed form
13353C90945q4137I4980L07720j09941a73072B32079A02172K77066j11259D2609
13342B09003O6103c4808C13714m7519K03929o4827G8727O7185J34535K92161B20039
13330C26403j29800B7189L60712M3326m4415J09440j77517o5595P8666N2024E6575
13318C4434L2205J87426L44746B51107O8280l3380N9684j2937G5443k810A8452
13306A16299L06452j57267j7702P4260A1458Q3567J74310J82848j59514k4224
13296B68445c4234C01214N9865j08841G0132K20394R4774a80718C09652I9189
13285B16803J39056G5546a85321d2640a3109G3815K34747F4199K74977i315j36695
13274a46010A58834G2862l288C3536Q3320K30373I7372J195J31777a3850m6260
$$ plain form
13263 -60110 180415 123542 174294 96592 -202162 143680 170943 157567 49852 -56410 340916
13251 -32263 -21157 208864 -53333 413592 18397 43552 557536 295607 332280 64661 275322
13240 275322 14476 218994 471182 175792 19606 169711 2805 105082 -19452 181109
13229 60105 105799 75914 325020 5315 -133317 38487 -189752 262442 190282 -8689 -73078
13218 -73078 234588 142034 287496 183450 225621 436344 121099 142130 10820 134480
13208 134480 218145 -32247 403858 108134 -126718 257998 -15454 142010 18958 331637
13198 331637 366451 177210 7968 87001 126540 459879 115892 -24413 152387 115329 300691
13187 300691 -315306 330922 -143357 325223 -76522 69147 82881 168448 145303 24253 64346
$$ packed form
13263f0110A80415n6873N0752p7702b02162A43680K7263j3376D9852e6410C40916
13251c2263J1106B08864e3333D13592A8397K5155N13984k61929L6673F4661K10661
13240B75322A4476K04518K52188A75792A9606J50105B805J02277a9452A81109
13229F0105M5694k9885K49106E315a33317C8487a89752B62442p2160h689o4389
13218g3078B34588r2554J45462j04046M2171K10723A21099K1031A0820J23660
13208A34480Q3665c2247D03858A08134a26718B57998a5454A42010A8958L12679
13198C31637L4814A77210G968P9033L9539L33339A15892b4413A52387l7058J85362
13187C00691c15306C30922a43357C25223g6522F9147J3734Q5567k3145B4253M0093
$$ plain form
13176 64346 207075 -221950 38511 -96310 243882 101763 -132342 382695 83100 344829
13166 344829 -81220 -80588 99343 137435 -220778 -259254 -49613 81878 -54003 -107024 -119318 310829
13153 -129425 28708 236877 481798 137164 136991 396134 106928 407608 157163 -201178
13142 242924 -97876 37735 318034 258134 17437 350 276848 98206 47911 -56764 -16397
13130 107373 -119331 349234 152983 156153 -170693 153175 288516 206475 357125 111073
13119 36483 326746 222462 103792 59550 -396922 19423 169439 378505 287255 -32295
13108 148488 144160 -123039 -46321 294646 -145436 87949 121934 117192 81044 -275127 241938
13096 -34921 -130688 104864 -232265 152682 154635 149217 74372 100107 157338 104558 -297466
$$ packed form
13176F4346J42729b21950C8511i6310B43882A01763a32342C82695H3100K61729
13166C44829h1220O32I9343L8092b20778l8476d9613H1878e4003n3021j2294C10829
13153a29425B8708K08169K44921A37164j73K59143A06928L00680A57163b01178
13142B42924i7876C7735K80299n9900A7437C50K76498I8206D7911e6764a6397
13130A07373a19331C49234A52983L170a70693A53175J35341q2041J50650A11073
13119C6483K90263j04284A03792m4242c96922A9423J50016K09066r1250c2295
13108A48488m328a23039d6321B94646a45436H7949L3985m742l6148b75127B41938
13096c4921r5767A04864b32265A52682J953n418G4372K5735N7231n2780b97466
$$ plain form
13084 -265895 177836 99351 298942 16540 409710 -901 85243 106198 -179964 134898 -51385
13072 -175162 16035 -256115 -153375 76994 300514 254063 86006 230241 20161 119271 -10289
13060 490942 73615 85438 39729 -33733 -77869 118727 -69991 132889 137787 -84332 -30709
13048 107084 97496 330073 127536 245965 254062 34502 149945 335414 127431 201979 -72739
13036 394251 97187 37735 178461 313793 -11739 484711 140928 -79950 209654 -123601
13025 55008 -44114 26594 305234 -292184 43145 22468 -54679 232416 9161 439455 296151
13014 296151 108904 8059 -202733 -9275 349528 -218254 -36038 199015 -59843 184691 313846
13003 313846 210404 154964 202252 -71462 24092 157850 85269 105202 63359 144007 -333431
$$ packed form
13084b65895A77836p8485J99591A6540L93170i01H5243K0955a79964A34898e1385
13072a75162A6035b56115J02740G6994K23520m6451H6006J44235B0161R9110a0289
13060D90942G3615J1823C9729c3733m4136A18727f9991A32889M898h4332c0709
13048A07084r588K32577A27536J18429Q097C4502J15443J85469A27431P4548g2739
13036C94251I7187C7735J40726J35332a1739D84711A40928g9950B09654a23601
13025E5008d4114B6594K78640b92184D3145k0677e4679B32416I161M30294j43304
13014B96151A08904H059b02733i275C49528b18254c6038A99015e9843A84691J29155
13003C13846j03442n5440M7288g1462B4092J33758p2581J9933m1843Q0648c33431
$$ plain form
12991 187762 117681 -62652 -434639 -91567 160773 372831 -124040 141252 -62590 338577
12980 -14389 123295 -102647 -268210 234686 16118 -228201 88033 63650 52015 -6925 -361148
12969 -361148 308104 -172870 -155929 225122 78536 -486672 -13733 30403 -66511 -44112 -108620
12958 -108620 113375 -61430 173696 -18272 20591 -11413 343419 137057 380427 231175
12948 231175 231427 -74769 201806 27013 286129 -36729 283946 214685 221015 4971 -60534 111389
12935 62978 300463 159408 96982 -221452 423585 -314003 -171643 299877 110548 353708
12925 353708 67241 -123485 442287 138153 -151523 -393 153685 -38928 86197 -99527 160360
12913 -154564 -14759 131664 4148 111873 -8208 206206 101260 -100442 -246998 -95641 60851
$$ packed form
12991A87762p0081f2652l71987i1567A60773K12058a24040A41252f2590C38577
12980a4389A23295a02647j65563B34686A6118b28201H8033k4383j1635f925l54223
12969c61148C08104a72870J6941B25122G8536d86672a3733C0403f6511K2399o4508
12958a08620A13375f1430A73696a8272B0591a1413C43419A37057K43370j49252
12948B31175K52g4769B01806B7013K59116c6729B83946o9261O330D971f0534A11389
12935F2978K37485j41055o2426b21452D23585c14003J42360B99877A10548K43160
12925C53708F7241a23485D42287A38153a51523c93A53685c8928H6197i9527A60360
12913a54564a4759A31664D148J07725h208B06206A01260a00442j46556i5641F0851
$$ plain form
12901 331701 3308 -35379 227247 72951 -106134 329537 272711 200030 -242534 169354 -43179
12889 -7391 -22301 7898 224098 231796 162175 278162 88745 -33733 121854 -4399 23934 -72126
12876 -23445 -182393 -202839 -29060 36938 143998 -145383 136974 -172669 -38929 -227809
12866 -227809 115039 145509 18481 -31792 -9915 160068 -73166 446214 -299261 186819 28242
12854 260684 207808 95041 -84490 -114049 -69525 -58554 119938 236665 297130 -2639 244514
12842 191844 -23839 -13082 141833 72276 109178 -74558 23669 -119971 75999 125960 -187097
12830 249536 95481 117341 -103203 76171 363368 -57240 142247 175934 206048 220655 138549
12819 138549 -7554 377610 19520 -26878 95715 251258 -204412 24145 38555 170006 393201
$$ packed form
12901C31701C308c5379B27247G2951a06134C29537n6826p2681b42534A69354d3179
12889g391j4910G898K16200P698o9621J15987H8745c3733A21854d399B3934g2126
12876b3445j58948k0446b9060C6938J07060a45383A36974a72669c8929j88880
12866b27809A15039L0470A8481c1792i915A60068g3166D46214b99261A86819B8242
12854B60684n2876I5041h4490k9559M4524J0971A19938J16727O0465b639B44514
12842A91844b3839J0757A41833o9557L6902g4558B3669a19971G5999M9961a87097
12830B49536I5481K1860a03203G6171K87197e7240A42247L3687L0114J4607q2106
12819A38549g554C77610A9520b6878I5715J55543b04412B4145J4410J31451K23195
$$ plain form
12808 393201 39646 -147659 89765 80215 -305972 81363 33399 38707 190675 39669 110501
12797 110501 -369221 -24424 5096 -170877 -109375 -85917 32023 56986 40337 -113200 11192
12785 -108980 163327 79130 381696 37668 -118931 77945 -179873 -229915 -124724 -52326
12774 106568 -236082 -251534 -131603 279667 249511 34690 144422 -121954 28245 -109432
12763 -109482 -387359 216364 48169 -118473 5068 -10939 -54473 -181621 189320 42699 64426
12752 64426 255841 281322 -303722 -127986 215060 -297985 -67424 302402 -278703 34326
12741 82483 97379 109882 -44349 283147 -29209 -64770 118647 4211 -109115 155791 -397984
12729 -126299 153298 130224 25848 -154035 25333 -375176 158884 70690 10482 243835
$$ packed form
12808C93201C9646a47659H9765r550c05972H1363C3399N308J51968C9669P0832
12797A10501c69221b4424E096a70877O1502K3458C2023K4963j6649a13200A1192
12785a08980A63327G9130L02566C7668a18931G7945a79873n0042J05191e2326
12774A06568b36082j5452J19931B79667l0156C4690J09732a21954B8245a09432
12763a09482k77877B16364D8169a18473E068a0939m3534j27148A89320D2699K1727
12752F4426J91415K5481c03722a27986B15060b97985f7424C02402b78703C4326
12741H2483J4896J2503d4349B83147b9209l5561A18647D211a09115A55791c97984
12729a26299A53298k3074B5848a54035B5333c75176A58884G0690A0482K33353
$$ plain form
12719 243835 -212146 -138719 287308 35048 106847 -184085 43004 50448 -84684 214037 44352
12707 -166340 256933 123361 -6680 234362 -93496 6782 163770 -349658 -89735 349955 237805
12696 237805 151729 208062 -10864 31897 274856 -148370 -2702 115918 245051 203059 292603
12685 292603 -16500 340756 281793 -12955 130915 -3955 203341 -143495 -21485 212547 -84813
12673 -72844 139248 80165 194065 77193 223593 -222491 -263755 249796 -193611 392596
12662 67330 -19313 157233 64724 -176793 -280278 32153 -100567 299629 -229652 354979
12651 -102150 92262 63880 -107627 -60079 -53780 53863 -156908 217228 258496 107362 247297
12640 247297 66875 -185501 220153 210690 -42255 387724 94088 157921 388973 160685 154561
$$ packed form
12719B43835b12146P3427B87308C5048P1799a84085D3004P444h4684B14037D4352
12707a66340B56933A23361f680B34362i3496F782J56988c49658h9735C49955j12150
12696B37805q6076N6333a0864C1897K42959a48370b702A15918J29133m1992Q9544
12685B92603a6500C40756n8963a2955A30915c955B03341a43495b1485B12547h4813
12673g2844A39248n9083J13900G7193J46400b22491m1264B49796a93611C92596
12662F7330a9313A57233F4724a76793j03485C2153a00567B99629b29652C54979
12651a02150I2262k8382a07627M7548O299E3863a56908B17228M1268A07362J39935
12640B47297F6875a85501B20153r463d2255C87724I4088O3833K31052A60685o124
$$ plain form
12629 154561 265570 198974 195970 235558 246782 -3973 58744 209601 -6973 182817 123814
12618 123814 -194682 -69426 181291 353876 317695 72687 399616 375756 -58967 12956 22019
12607 22019 48126 241853 218298 -26238 -26259 45512 88769 305875 75686 39483 -123979 -208874
12595 -208874 -163609 -424429 53135 183446 91159 3869 197283 391263 -6175 108968 37358
12583 90518 220485 -72931 306869 380887 78370 357754 218446 -87837 127455 -60208 43507
12571 34407 232751 145952 136548 -1337 -312099 -98468 187558 118853 -80758 176508 161978
12560 161978 -66378 35625 7996 -41907 -319452 -335013 191028 60289 109895 59292 332268
12549 332268 255941 -284918 -68371 79169 -213648 33899 311498 68380 -164075 -136205 123034
$$ packed form
12629A54561J11009o6596l004L9588J1224c973E8744J50857f973A82817n9003
12618A23814a94682f9426A81291J72585l6181G2687L26929k3860e8967A2956R063
12607B2019K6107J93727k3555b6238k1D5512M3257K17106G5686l6203a23979q4895
12595b08874M5265k60820E3135J30311I1159C869J93414J93980f175A08968C7358
12583I0518J29967g2931C06869P4018G8370K79384j39308h7837A27455f0208D3507
12571C4407J98344q6799r404a337l10762i8468A87558o8705h0758A76508j4530
12560A61978f6378C5625G996d1907k77545j5561A91028F0289M9606n0603K72976
12549C32268p6327b84918f8371G9169b13648C3899K77599F8380a64075K7870A23034
$$ plain form
12537 40965 -41657 46840 -54500 7179 -143897 -63269 -54729 112263 178764 11351 -198009
12525 -74813 143761 105708 -45914 -478248 40836 -111059 -51818 99981 22965 -142392 168853
12513 117686 84117 357094 263697 189242 209464 74569 -175510 127945 -86043 185647 -2249
12501 79413 -65722 186521 62769 -52824 11882 48266 -124863 -219317 -52736 -25696 -23379
12490 -23379 -130548 -170454 84590 117624 -145810 126179 -54241 4041 272865 -4759 -63937
12479 -63937 330619 71999 97573 157961 132865 433131 55797 -86844 -93866 457540 20979
12467 180238 -158798 134067 157734 227668 -130181 220221 -46003 307668 -141699 -147832
12457 -147832 80573 90286 69637 424322 45658 79074 -86385 -81672 112467 -63965 114228
$$ packed form
12537D0965d1657D6840e4500G179a43897f3269Q540A12263O6501A1351a98009
12525g4813A43761l8053d5914m32334D0836a11059e1818I9981B2965a42392A68853
12513A17686l3569K72977r3397p4455K0222G4569a75510A27945h6043A85647b249
12501G9413f5722A86521F2769e2824A1882L6384a24863r4454e2736b5696K317
12490b3379j07169l9906H4590L3034a45810A26179e4241D041K68824d759n9178
12479f3937C30619G1999K5574O0388k5096L00266E5797h6844p022D57540B0979
12467A80238a58798A34067K3667O9934a30181B20221d6003C07668a41699o133
12457a47832H0573R713k0649L54685D5658L3416h6385M713A12467f3965A14228
$$ plain form
12445 -356606 8540 -256255 -97562 -78235 200508 -4233 -72368 -485214 -373281 172191 -112738
12433 3740 28802 112813 192888 179442 -240886 52409 -5194 36603 -6547 -359892 -11355 -219930
12421 -219930 -141072 79643 -123521 135667 -133748 10120 182982 -112235 -162886 215722
12410 -154408 285626 -7768 511 -93623 -78397 -15668 -196942 -161021 33050 91025 -236930
12398 244861 271622 -211265 340436 -125158 396114 61670 -271637 98503 -81427 2511 -154241
12386 -330961 51014 72071 -203123 -68329 -154214 284346 -99635 50866 91046 14971 -216386
12374 105782 132109 -297417 71694 -206928 232621 -93887 -150568 58478 -164561 23328 -153917
12362 -141860 -179167 -5352 -46089 -20279 36948 115612 219905 -297768 62136 -29262 31754
$$ packed form
12445c56606H540b56255i7562J9327B00508d233o8135m12846J11933A72191a12738
12433C740K5062Q4011Q0075j3446b40886E2409e194C6603f547l53345a1355k08575
12421b19930P8858G9643a23521A35667a33748A0120J72862a12235n0651B15722
12410a54408B85626g768E11i3623J5226a5668j81274L5921C3050N7975b36930
12398B44861K6761b11265C40436a25158C96114F1670b71637I8503h1427B511a54241
12386c30961E1014K1057b03123f8329q5885B84346i9635E0866M0180A4971b16386
12374A05782K6327b97417G1694b06928B32621i3887n6681E8478a64561B3328a53917
12362a41860l7307e352m0737b0279C6948P8664J04293b97768F2136b9262C1754
$$ plain form
12350 289980 -54438 -281804 34098 297513 91986 211064 -157033 13271 554907 -140643
12339 -275086 15414 -233610 12375 252549 126208 -18541 46734 330790 69662 137228 -54365
12327 -197989 280736 30173 -307382 40689 89204 -178729 39999 187790 -252846 101554
12316 -26491 23566 -39684 -194936 -23232 93770 255849 363752 -38728 -318050 157674 192944
12305 192944 -181662 141429 184388 342756 -244164 34167 63128 -217500 297567 -2630
12294 15415 154528 93586 185584 -54816 17053 168541 190781 13387 -69545 431 232872
12283 232872 250844 182342 158251 -277810 -54289 19670 1755 278909 -282723 101363 -55086
12271 -64964 212143 129395 69449 -177219 -122698 -239763 -261473 193744 68884 -138514 218270
$$ packed form
12350B89980e4438k27366C4098K63415I1986J19078a57033A3271N41636a40643
12339b75086A5414b33610A2375K40174A26208a8541D6734K84056F9662O7566e4365
12327a97989B80736C0173c07382D0689M8515a78729C9999J47791b52846A01554
12316b6491B3566c9684j55252b3232I3770J62079J07903c8728k79322A57674L5270
12305A92944a81662A41429M2959J58368b44164C4167K8961b17500B97567b630
12294A5415J39113o0942R1998e4816A7053J51488K2240A3387f9545D31K32441
12283B32872J7972o8502k4091b77810e4289A9670A755K77154b82723A01363e5086
12271f4964B12143q2748n9946a77219N4521j17065k1710A93744F8884a38514B18270
$$ plain form
12259 224308 101063 68284 -49966 23211 71974 278647 -49903 -181989 250820 -16504 61443
12247 -151847 -149581 -68585 147280 -123333 -139019 -225911 97680 235426 149344 277038 8707
12235 -121496 147469 118140 -139227 -118011 139555 148111 -468 -96435 163561 143612 -168524
12223 104513 -156543 -97338 394148 -91752 -105717 -187674 115158 -61304 -288205 -43618 175812
12211 23917 81534 -33109 291549 451762 102377 64149 287384 277972 71401 255942 421385
12200 421385 -62674 12453 69909 10409 -156155 100785 212656 181294 -45836 328247 -63668
12188 11347 268721 -216607 -87294 145051 195945 444169 629651 297945 162408 -99239
12177 296929 15602 382353 118650 128649 -66530 30998 -60462 7494 -259 278120 -143087
$$ packed form
12259B24308A01063l2779d9966B3211M8763K06673d9903j32086B50820a6504F1443
12247a51847K266f8585A47280a23333j5686q6892I7680J37746q6082J27694H707
12235a21496A47469k9329a39227K1216A39555Q556d68r5967A63561j9949a68524
12223A04513a56543N9205C94148i1752j3965q1957A15158f1304k26901d3618A75812
12211B3917N7617c3109B91549J60213A02377l8228K23235r412G1401J84541J65443
12200D21385f2674A2453N7456A0409a56155A00785J11871l1362d5836C28247f3668
12188A1347K57374b16607h7294A45051N0894K48224J85482B97945j35537i9239
12177B96929A5602L66751A18650R999f6530C0998f0462G494b59B78120a43087
$$ plain form
12165 190086 63757 -11100 247028 258862 -187686 354057 28408 110997 -94411 -47714 133713
12153 282670 23022 28605 51619 142080 319736 85696 -325883 43903 44113 10434 -17988 253146
12140 123338 -192184 -331816 207210 -138515 -101929 36940 102940 -463257 170536 9613
12129 -174675 191420 38114 -254840 -42643 -47615 135197 290628 -45223 -76655 -13621 95086
12117 220619 46954 -43340 254942 8349 -39371 158004 94981 -199760 137434 -113154 214043
12105 -79011 113835 25273 -113392 150966 -98264 182903 -301255 -23604 103308 143598
12095 143598 161041 222441 13073 69525 84453 -188068 149298 -424026 -51853 61663 134855
12084 134855 3350 55637 -100935 52337 -7879 242812 -2874 -134307 149718 -97432 344110
$$ packed form
12165A90086F3757a1100B47028J1834a87686C54057B8408Q2589i4411M6697A33713
12153B82670B3022N583K3014R0461J77656H5696c25883D3903K10A0434a7988B53146
12140A23338a92184j39632B07210a38515L6586C6940O6000d63257A70536I613
12129a74675A91420C8114b54840d2643m972A35197J55431d5223l1432a3621I5086
12117B20619D6954d3340B54942H349c9371A58004o3023a99760A37434a13154B14043
12105g9011A13835B5273a13392A50966i8264A82903c01255b3604A03308M0290
12095A43598J7443O1400A3073N6452J4928a88068A49298d24026e1853F1663P3192
12084A34855C350N2287a00935E2337g879B42812b874j31433A49718i7432C44110
$$ plain form
12072 364327 -281473 -80937 -106664 -64513 153230 78562 -3715 16035 -214928 159107 -28454
12060 32420 379551 97499 479882 519111 1264543 484845 176130 408055 -108327 -35007
12049 311505 157094 -189215 143003 193814 70302 2543 32385 160260 -73567 114847 -110435
12037 -276736 8002 -128327 69996 81808 -255075 -98860 120336 152282 -228909 44474 56788
12026 56788 -286416 111802 -78919 -346766 -85367 -254781 -344366 -433379 97737 -49331 179208
12014 110856 -24660 -52952 100698 40015 123886 -165403 -199925 181775 158137 96771 189178
12003 189178 -202401 235685 164601 -30324 153358 82676 163462 268839 -27263 -25366 124565
11991 143786 276925 297144 205972 262898 -84052 -208357 71005 -396788 -208023 -96510 -45266
$$ packed form
12072C64327b81473h0937k5727M2151A53230p4668c715A6035b14928A59107b8454
12060C2420L47131I7499L82383L9229P45432D84845A76130K31925a08327c5007
12049C11505j54411a89215A43003N0811G0302B543K9842J27875g3567A14847a10435
12037b76736H002a28327F9996J1812b55075i8860A20336L1946b28909D4474J2314
12026E6788b86416A11802g8919k67847h5367j69414q9585q9013I7737d9331A79208
12014A10856b4660k8292A00698D0015Q3871a65403l4522A81775k3638o1366R2407
12003A89178b02401B35685p1084c0324A53358p0682Q0786J05377b7263J897A24565
11991A43786J33139K0219r1172N6926h4052j24305G1005c96788J88765i6510d5266
$$ plain form
11979 150932 -179509 179851 555170 -5335 -359693 62157 -182877 25006 108740 136442 75387
11968 75387 -102518 -477695 -44401 -74498 169230 -152766 -542544 110852 92042 -1987 26573
11956 150660 -146020 -245342 78158 12111 2676 83260 114668 4725 -186488 -85837 106375
11944 13861 -177489 295011 69534 35699 -160580 159006 90852 90821 54854 -114228 -23176
11932 278487 -183493 -101422 72630 130998 55511 93583 -216954 -8465 -16496 107065 59490
11921 59490 173658 -266155 -43833 -22719 80053 -241696 183246 -9389 -206409 -9619 154274
11909 160055 123687 -228653 73425 -1321 -123951 196071 -31653 198147 -267652 -129418
11898 -467569 268782 -3994 -734 -84813 -78496 -150291 13804 58734 -40246 -111182 117428 -21415
$$ packed form
11979A50932a79509A79851L75319e335l54358F2157a82877B5006Q3734K7702o1055
11968G5387a02518l75177d4401l0097A69230a52766l89778A10852j8810a987B6573
11956A50660a46020r9322G8158A2111B676Q0584L1408D725a86488h5837A06375
11944A3861a77489B95011F9534l3835a60580A59006o8154l1l5967a14228b3176
11932B78487a83493Q2071G2630N8368E5511L8072b16954h465q031A07065m7575
11921E9490J14168b66155d3833K1114H0053b41696A83246i389j97020i619A54274
11909A60055l6368b28653G3425a321j22630A96071c1653A98147b67652a29418
11898d67569B68782c994g34q4079O317p1795A3804M4930d0246p0936A17428b1415
$$ plain form
11885 -346538 456575 -56633 28645 113933 150165 -35290 53736 72537 38978 -167890 -170341
11874 -170341 -66623 -12961 -171068 67946 -373243 7558 9310 219912 -232813 -135342 -77731
11863 -77731 5802 -334987 -124347 -84417 -55893 -155586 -210855 369745 227855 50932 183563
11852 183563 -182874 22206 -4059 -133502 -354224 279834 -156251 207046 4881 75350 -71140
11840 -77499 -116081 10346 51439 15400 -66745 5062 -3534 -156883 -53912 -229551 -330252
11829 -330252 -7490 246432 -170523 -175728 93763 13392 204649 12221 136132 280459 -300902
11817 285988 -52893 -103474 248480 -90787 -128750 41675 325405 126842 41197 -211763 87097
11805 283811 -48226 -206606 -141683 -262265 83838 168535 -209748 -200738 -108376 135093 236353
$$ packed form
11885c46538D56575e6633B8645Q5288L6232c5290E3736J8801l3559a67890k451
11874a70341f6623a2961j58107F7946c73243G558J752K10602b32813R7471N7611
11863g7731E802c34987a24347L9930K8524r9693n5269C69745j41890E0932J32631
11852A83563a82874B2206d059j29443k20722B79834a56251B07046D881P0469g1140
11840g7499l8582A0346M1093A5400f6745E062c534j53349e3912j75639j00701
11829c30252g490B46432a70523n205I3763A3392J91257A2221J23911J44327c00902
11817B85988e2893n0581B48480i0787l7963D1675K83730A26842D1197b11763H7097
11805B83811d8226j58380O4923j20582H3838Q4697b09748R010R2362A35093J01260
$$ plain form
11794 236353 -48293 62467 266288 -37576 -7427 -37852 207287 -247020 156052 -5260 -227514
11783 -227514 46317 -238493 232753 -168903 30805 306754 -209220 -151075 72282 -168181
11772 -52425 49608 -102187 62074 -275821 76820 106158 -110617 52672 -58396 -116923 63687
11760 -197453 132417 42134 167491 -33413 -267347 222024 102808 -72803 -116850 110975
11749 327898 79465 47892 15386 -104969 -42659 -2818 99243 -204527 -30661 78746 89213
11738 89213 -72594 -166622 -159500 -440673 -21048 3233 215814 117976 -37990 -80405 12817 200694
11726 200694 -88047 -58303 -104204 -21746 95593 -148827 132938 86907 -235819 -88470 -26141
11714 48875 -205313 -45865 242743 50799 136603 245721 -148691 -53191 -299479 -52164 131964
$$ packed form
11794B36353d8293F2467K03821c7576g427l0425B07287b47020A56052e260k22254
11783b27514D6317b38493B32753a68903C0805K75949b09220N8145G2282a68181
11772e2425D9608a02187F2074b75821G6820K9338a10617E2672e8396n8527F3687
11760a97453A32417D2134J25357c3413k33934B22024A02808g2803m4047A10975
11749C27898G9465l1573A5386a04969d2659b818I9243b04527c0661G8746J0467
11738H9213g2594r4028P122k81173b1048C233K12581r7838c7990m2415A2817J87877
11726B00694h8047K9744m5901b1746I5593a48827A32938m6031b35819h8470b6141
11714D8875b05313d5865B42743E0799Q5804J09118a48691e3191k46288e2164A31964
$$ plain form
11702 -316062 -55329 59650 35434 -137009 -107106 -72907 -72877 -213180 -141133 -392997 150923
11690 351889 175245 -257996 116581 -196090 -62274 -242157 -172988 -57418 -6436 -112861
11680 -112861 188436 -37002 -57733 -23847 104127 49278 34215 172637 41968 66064 180391
11669 180391 133053 178093 143971 -23753 -206284 33120 190489 -49600 -121080 318263 -296863
11657 179763 160962 133 257724 -216043 28901 85996 -76275 81574 -125373 -139708 223582
11645 73666 -322725 -341033 -13586 -373853 -39496 41540 55588 111710 -239546 153758 -272496
11633 -113189 278189 35841 -323247 -29312 -149657 -14346 98262 58940 82327 -297710 12787
11621 101894 229136 -23059 -189048 -28363 14919 -83129 -9015 82206 -28636 -9143 93321
$$ packed form
11702c16062e5329E9650k4216a37009K9903L4199L0j40303P2047k51864A50923
11690C51889A75245b57996A16581a96090f2274j79883O9169e7418f436j06425
11680a12861A88436c7002k0731b3847A04127D9278j5063J38422D1968K4096J14327
11669A80391m7338M5040l4122b3753j82531C3120J57369d9600p1480C18263b96863
11657A79763j8801A33K57591b16043B8901N7095g6275H1574a25373j4335B23582
11645G3666c22725j8308a3586l60267c9496D1540J4048N6122b39546A53758b72496
11633a13189B78189C5841c23247b9312j20345a4346I8262l9322K3387b97710A2787
11621A01894J27242b3059j65989b8363A4919h3129i015H2206b8636i143I3321
$$ plain form
11609 183339 -78022 -17168 -33631 -156335 100929 -88976 305553 11581 31418 -14723 380795
11597 70519 219217 -72732 -180357 -10573 -290024 -150514 223564 -40775 105586 144811
11587 144811 156048 61867 77627 -15527 -77512 -64195 -136664 -299427 132921 -228819 575015
11575 316290 -79638 344004 17092 82827 65505 57408 -70721 130438 160863 -30709 -22045
11564 -22045 93979 -25543 4228 10292 -230197 -389817 -237592 28133 298887 -105900 156216
11552 -68126 -104380 129190 -25620 -224312 323584 380430 -437276 -17649 155607 81798 -77898
11540 -24655 82995 -186578 -191444 125500 172278 -93010 -123544 137082 77347 163202 204444
11529 204444 250507 -115693 -13379 -160889 78250 -320101 -12918 164733 -287788 7180 -65248
$$ packed form
11609A83339g8022a7168j6463j22704A00929h8976C05553A1581J9837a4723C80795
11597G0519J48698g2732j07625a0573k79451J39510B23564d0775A05586L9225
11587A44811J1237F1867J5760a5527o1985J3317p2469j62763A32921b28819E75015
11575C16290g9638C44004A7092O5735j7322q097g0721A30438L0425c0709Q664
11564b2045I3979b5543D228O064b30197j59620J52225B8133K70754a05900A56216
11552f8126l6254A29190b5620j98692C23584N6846d37276a7649A55607p3809g7898
11540b4655H2995a86578m866A25500M6778i3010l0534A37082n9735Q5855M1242
11529B04444M6063a15693a3379j47510G8250c20101a2918A64733b87788G180f5248
$$ plain form
11517 -209037 -37749 225591 204932 -41284 119758 -47616 191482 -205116 -27958 317104
11506 146760 -228742 135288 539427 -141051 368568 148893 56044 -9728 135856 178315
11496 178315 -4009 170168 219481 -171829 22521 142504 177679 -125488 320860 385571 306380
11485 306380 216680 297774 95081 52419 378850 -159490 12402 399496 -192461 131506
11474 285204 120635 -126445 -98935 370769 304470 137237 -244032 562 121565 3222 146964
11463 146964 245984 1774 203275 150137 -219923 203431 134346 -58111 148081 158747 49636
11451 60066 369604 457 176872 -205442 -133458 112242 260343 251990 -62522 188186 -163560
11439 -15451 56686 45701 120734 77609 410176 -18580 57716 -166258 -137887 -48786 243452
$$ packed form
11517b09037c7749B25591k0659d1284A19758d7616A91482b05116b7958C17104
11506A46760b28742A35288M04139a41051C68568A48893E6044i728A35856M2459
11496A78315d009A70168M9313a71829B2521J19983L5175a25488C20860O4711p9191
11485C06380q9700Q1094I5081m2662L26431a59490A2402L87094a92461A31506
11474B85204A20635a26445K7510C70769o6299A37237b44032E62J21003C222J43742
11463A46964R9020A774K01501n3138b19923B03431o9085e8111A48081J0666D9636
11451F0066L09538D57J76415b05442P1984A12242J48101q353f2522A88186a63560
11439a5451E6686j0985P5033m3125L32567a8580E7716a66258K8371d8786B43452
$$ plain form
11427 15519 218967 111729 -60435 -61598 172038 -180539 -14559 14298 -265316 36357 -215630
11415 118869 -95515 -39759 82463 -20613 -537129 138687 117708 161319 -135019 14025 -162146
11403 -238677 41636 184275 -180812 -62645 55811 -136913 -54484 253254 -29906 72815 142458
11392 142458 -73701 -77245 -1334 121506 38537 132865 111317 23150 70683 105467 250056
11381 250056 195206 -70073 -241228 411511 18286 -43671 -82391 -421488 149728 -46896 88812
11369 -493608 29336 247521 -44991 85541 -52304 55231 130246 -77706 27471 -144819 -116382
11358 -116382 -245010 -63702 -44018 9950 195030 174000 -28937 -93500 -155707 -324981 -26512
11346 135916 154237 -5136 -38163 -58588 122499 33196 165365 -65438 36842 164341 60986
$$ packed form
11427A5519K03448j07238f0435j163A72038a80539a4559A4298b65316C6357b15630
11415A18869i5515c9759H2463b0613n16516A38687k0979M3611a35019A4025a62146
11403b38677D1636J42639a80812f2645E5811a36913e4484B53254b9906G2815O9643
11392A42458g3701l544a334A21506C8537R4328k1548B3150M7533L4784J44589
11381B50056n4850g0073j71155D11511A8286d3671l8720l39097A49728d6896H8812
11369d93608B9336K18185d4991H5541e2304E5231P5015g7706B7471a44819K8437
11358a16382j28628f3702J9684I950J85080k1030b8937o4563o2207j69274b6512
11346A35916J8321e136l3027k0425A22499C3196J32169f5438C6842J27499F0986
$$ plain form
11334 3946 79480 92784 120416 -181542 188298 -154989 -52027 220437 -174460 -181299 -47981
11322 -42978 83021 -230968 55960 -105971 -226235 355590 -80437 24054 38882 -44750 -36706
11311 -36706 142949 -380479 60927 -68560 -140490 -163220 -339587 255043 -123991 -193287 -29042
11299 -90439 -238187 -261541 -17332 -18785 337297 172151 118948 -143074 -105900 85496 47590
11288 47590 -196009 165443 200976 -70720 -113723 236233 -61364 -225337 -451780 44348 -74201
11276 -37087 311592 -34424 -112109 60836 -1247 -401245 -147583 -262698 -302082 60742 -128605
11264 268010 27518 91047 -46598 -201681 -100323 25812 34010 326424 -151614 23534 -20787
11252 -50104 2389 33657 198895 -166808 106028 191859 -213329 -51387 278032 -48030 -145443
$$ packed form
11334C946P5534J3304K7632a81542A88298a54989e2027B20437a74460o839d7981
11322d2978H3021b30968E5960a05971j20264C55590h0437B4054J4828d4750Q044
11311c6706A42949c80479F0927f8560p1930k2730j76367B55043a23991o9296b9042
11299i0439j47748k3354a7332j453C37297j65146n3203a43074L7174H5496l7906
11288D7590a96009A65443L5533g0720m3003B36233f1364j63973k26443D4348g4201
11276c7087C11592c4424p7685F0836a247l99998a47583j15115l9384F0742a28605
11264B68010B7518O3529d6598j55083a00323B5812Q198K92414a51614B3534b0787
11252e0104B389L1268J65238a66808A06028Q5831b13329e1387B78032d8030r7413
$$ plain form
11241 -145443 -147659 -6462 -154955 52166 -483666 -67253 -122381 -36630 -17329 -1437 -21312 -99450
11229 -99450 -16738 -251753 -91853 136375 -248098 94989 -79766 -16992 20851 -9269 -110852
11218 -110852 102173 -115877 -89825 15197 -207419 -534879 -93637 137752 -215371 -447512
11208 -447512 48057 -32458 -80696 -85084 -51894 -600401 154555 -26396 48443 5038 90134
11197 90134 -230234 47264 -28312 46447 -34525 313324 -17358 -6627 -44345 12074 -229450
11185 246685 -28921 -105507 -354368 221331 19479 -224767 2804 -121581 -236563 72342 146918
11174 146918 49679 21343 290124 1637 39581 -205610 -253375 180933 12742 291264 188399
11163 188399 87937 322861 -53337 -113636 130621 -51801 -93191 55997 209070 46077 66009
$$ packed form
11241a45443k216f462j48493E2166d83666f7253n5128c6630a7329a437j9875p8138
11229i9450a6738k35015i1853A36375b48098I4989g9766a6992B0851i269j01583
11218a10852A02173a15877K6052A5197b07419l27460i3637A37752b15371k32141
11208d47512D8057c2458m8238m388L3190n48507A54555b6396D8443E038Q5096
11197I0134b30234D7264b8312D6447c4525C13324a7358f627l7718A2074b29450
11185B46685b8921p6586k48861B21331A9479b24767B804a21581j14982G2342P4576
11174A46918D9679B1343K68781A637L7944b05610m7765A80933A2742K78522j02865
11163A88399H7937K34924e3337o0299A30621e1801m1390E5997J53073D6077J9932
$$ plain form
11152 66009 60359 -193910 -113166 -81401 -53300 -80 -78617 66852 -38188 -19683 -146319 -20387
11139 -77043 7315 268150 -183513 -44600 291991 85484 -203429 257113 -88333 -146692 -4260
11127 8759 -25562 163200 222770 253408 -173462 -355874 -347946 -6364 -84645 58005 133216 -57135
11114 67866 91598 -51806 -244280 -60999 68221 18990 205635 -220068 99878 79395 260100
11103 260100 20956 11572 33842 127162 -30362 155455 -17067 142888 141122 272673 296563
11092 296563 283313 111515 -86522 126941 -90324 179845 -174804 28460 139322 -145592
11081 -92075 -22795 324866 -18687 241500 114053 6734 130449 218241 139829 13638 45329
11070 45329 103813 181829 226185 277395 163521 412065 121857 331953 -79506 246330 529604
$$ packed form
11152F6009n650a93910Q0744L1765K8101h0p8537F6852c8188J8505j26636b0387
11139g7043G315K60835a83513d4600B91991H5484b03429B57113h8333n8359d260
11127H759b5562A63200N9570L0638a73462j82412P928f364p8281E8005P5211e7135
11114F7866K3732e1806j92474f0999F8221A8990J86645b20068I9878k0483J80705
11103B60100B0956r384K2270R3320c0362A55455a7067A42888j766J31551K3890
11092B96563j3250A11515h6522A26941i0324A79845a74804B8460J10862a45592
11081i2075b2795C24866a8687B41500A14053F734J23715Q7792p8412A3638L1691
11070D5329N8484P8016M4356N1210j13874K48544A21857K10096g9506B46330K83274
$$ plain form
11059 529604 131002 77413 262401 118967 235426 80614 163841 159137 122334 218805 483864
11048 483864 421421 419965 362830 716129 202385 662275 630955 881268 181056 558558
11038 558558 380217 235371 644949 588176 1005137 951749 792773 668909 669171 649610 726348
11027 726348 435421 385797 546461 450269 582906 705083 281247 575023 785614 539703
11017 539703 684712 521029 683735 669390 590385 636540 395472 814776 495694 455906
11007 455906 838577 534628 801193 459254 397435 641960 293204 454538 420784 802869
10997 802869 446882 771025 665698 652043 369877 512118 392696 350356 717527 521388
10987 521388 496811 10103 690059 867463 466326 644841 562408 615855 686625 458578
$$ packed form
11059E29604A31002n3589J84988A18967J16459H0614Q3227m704l6803R6471K65059
11048D83864o2443j456n7135L53299B02385M59890l1320K50313A81056L77502
11038E58558j78341j44846M09578n6773M16961n3388j58976j23864K62j9561P6738
11027G26348k90927m9624J60664r6192J32637J22177B81247K93776K10591k45911
11017E39703J45009j63683J62706j4345p9005M6155k41068M19304l19082l9788
11007D55906L82671l03949K66565l41939o1819K44525B93204J61334l3754L82085
10997H02869l55987L24143j05327j3655k82166J42241j19422m2340L67171j96139
10987E21388k4577A0103O79956J77404m01137J78515q2433N3447P0770k28047
$$ plain form
10977 458578 509134 720059 619004 820637 602375 331257 705121 786309 813964 907374
10967 907374 817419 900254 1091983 1148141 1615875 1611046 1773409 1568660 2071929 2515255
10957 2515255 2557010 2459466 2329775 2414263 2116311 1842832 1859696 1643310 1321381 1106494
10947 1106494 1018801 1339643 893251 1397419 1268082 1423927 1174590 1364635 1068799 943468
10937 943468 782844 710032 499111 332475 416472 354882 201033 342272 503650 432703
10927 432703 189076 369885 -127618 239853 29476 671 177587 24594 345612 259315 -171346
10915 186903 174662 163115 144622 229131 181638 13086 137340 186997 129091 -44089 -43421 16389
10902 411000 171483 105593 121694 10023 5659 -78140 181886 167037 -261069 -89175 65578
$$ packed form
10977D58578N0556K10925j01055K01633k18262k71118L73864Q1188K7655R3410
10967I07374q9955Q2835J91729N6158M67734m829J62363k04749N03269M43326
10957B515255M1755r7544j29691Q4488k97952k73479J6864k16386l21929k14887
10947A106494q7693L20842m46392N04168j29337J55845k49337J90045k95836j25331
10937I43468j60624p2812k10921j66636Q3997o1590j53849J41239J61378p0947
10927D32703A89076J80809a27618B39853B9476F71J76916B4594L21018q6297a71346
10915A86903j2241j1547j8493Q4509m7493A3086J24254M9657n7906d4089O68A6389
10902D11000A71483o5890J6101A0023m364g8140A81886j4849b61069h9175F5578
$$ plain form
10890 237226 64011 -512 -432730 -53947 97336 206655 -170971 -46057 -107229 -138190 -108418
10879 -108418 -23899 -130421 -403634 -245182 194218 -148193 112264 280976 35427 166678
10869 166678 -104310 -26141 -314266 -152728 -33610 -409310 -45957 -56921 143925 -147685
10858 -57367 -37962 -243583 82899 208230 -373332 -11465 -162918 18234 -51620 275181 -308135
10846 88423 31124 -63097 -28681 -30468 -21699 -33952 -45035 -172803 72522 214744 91644 79195
10834 79195 23169 153202 -124712 5213 -134041 -259601 71385 -299565 201205 -12918 -233346
10823 -233346 -198129 -8822 -88762 -157653 -227377 141179 43145 -223125 145202 -174569 -198231
10812 -198231 156249 3666 -35639 -32908 60511 259622 -134080 -128973 193873 -36970 -163979
$$ packed form
10890B37226F4011e12m32218e3947I7336J09319a70971d6057o1172l0961K9772
10879a08418b3899j06522k73213J58452A94218a48193A12264J68712C5427J31251
10869A66678a04310b6141k88125a52728c3610l75700d5957j0964A43925a47685
10858e7367J9405k05621H2899J25331c73332a1465j51453A8234e1620B75181c08135
10846H8423C1124f3097b8681j787Q769j2253j1083j27768G2522J42222I1644j2449
10834G9195B3169J30033a24712E213a34041j25560G1385b99565B01205a2918k20428
10823b33346L5217h822p9940o8891o9724A41179D3145b23125A45202a74569k3662
10812a98231A56249C666c5639K731F0511J99111a34080N107A93873c6970j27009
$$ plain form
10801 -163979 186459 -125981 -63943 -179631 -226705 -27490 173664 28572 -132084 -163043
10791 -163043 -55983 261516 -14151 -195158 111373 -71744 154820 -127184 -82448 -280444
10781 -280444 -255501 582313 189246 104432 -208851 -245876 -10027 31984 -186972 -465548
10771 -465548 -124726 66584 140016 222414 -174455 -81470 240074 101563 41534 -135863
10760 -166666 -108760 -78613 -357437 69866 -18748 -155939 21973 37851 -165392 260440 -109690
10748 29382 -241605 -225641 -22537 156264 48524 -157633 21475 100685 -264775 6407 213477
10737 213477 18485 -10245 -139945 -299095 68916 -122029 67892 -262437 -37399 -464473
10727 -464473 -40252 -157251 -290398 304407 -7887 -99720 -135557 -243705 82905 -264292 106747
$$ packed form
10801a63979A86459a25981O2038j15688m7074b7490A73664B8572a32084l0959
10791a63043e5983B61516a4151j81007A11373g1744A54820a27184M4736j97996
10781b80444K4943E82313A89246q4814b08851l7025a0027C1984a86972k78576
10771d65548a24726F6584P3432Q2398a74455h1470B40074A01563D1534a35863
10760a66666N7906L0147k78824F9866a8748j37191B1973J5878a65392B60440a09690
10748B9382b41605J5964b2537A56264D8524a57633B1475P9210b64775F407K07070
10737B13477A8485a0245j29700j59150F8916a22029F7892b62437c7399m27074
10727d64473d0252j16999j33147C04407g887r1833l5837j08148H2905b64292A06747
$$ plain form
10715 97290 -194988 -48374 125739 -252743 97238 -7652 32137 92934 -137789 118409 168144
10704 168144 -226957 -129992 -30021 297049 -34394 -216090 -9318 -369631 -248371 13900 -88717
10692 182775 -322717 63542 22258 -207950 -158754 52127 -166083 -11823 137254 -1713 177080
10680 -191771 234223 421189 -323263 -209287 64618 -9950 -109415 42350 41483 114308 99411
10669 99411 200607 -1983 -18393 -231444 -38033 50718 -97058 -205339 85132 -6993 -466846
10658 -466846 -160442 -97492 228116 -17423 103999 -91986 -166348 -16323 108801 193680 21868
10646 8429 2717 184093 -223555 904 -239982 103620 17142 -109690 -115312 -376090 130649
10634 94110 -297442 -25238 -118228 -206925 -48118 -55877 -31217 69031 -66723 1533 -389531 -215814
$$ packed form
10715I7290a94988d8374A25739b52743I7238g652C2137O0797a37789A18409M9735
10704A68144b26957R6965c0021B97049c4394j81696i318l60313J21260A3900h8717
10692A82775c22717F3542B2258b07950M9196E2127a66083a1823A37254a713A77080
10680a91771B34223J86966c23263J13976F4618i950r9465D2350q67P2825j4897
10669I9411J01196a983j6410k13051c8033E0718i7058j08281H5132f993m59853
10658d66846a60442O2950B28116a7423A03999i1986p4362a6323A08801Q4879B1868
10646H429B717J81376b23555I04b39982A03620A7142a09690n622k60778A30649
10634I4110b97442b5238r2990q8697d8118p759K4660F9031f6723A533c89531J73717
$$ plain form
10622 -215814 -162656 -157722 252254 109434 72660 -230053 -285804 197045 -1873 -21785 -52800
10611 -52800 -46682 105975 -33326 154631 -32834 -210478 113801 -67895 23416 286058 -76871
10599 -184077 -246107 -130817 -98037 -174097 113990 81433 -51509 16573 -254118 39770 179818
10588 179818 -214204 112205 127062 -254743 205944 73011 -63075 211444 -288299 -16790
10577 -146913 -57660 67735 -267445 -42215 -416350 -236177 181947 -198966 102371 410707
10567 410707 71254 -85258 -36229 -109775 21390 -95423 -117663 33343 99294 -135593 90494
10555 -151152 -343314 -311799 -549099 -207620 -127547 -85788 -56433 -226262 -217178 70897 -5585
10543 -117605 -131422 -68314 234680 -158532 -15646 -90731 -85909 64675 53844 60582 -42053
$$ packed form
10622b15814N3158M934B52254A09434l6774b30053n5751A97045a873j9912l1015
10611e2800O118A05975c3326A54631c2834j77644A13801f7895B3416K62642g6871
10599a84077o2030J15290L2780p6060A13990l2557e1509A6573b54118C9770J40048
10588A79818b14204A12205J4857b54743B05944G3011f3075B11444b88299a6790
10577a46913e7660F7735b67445d2215l74135J80173A81947a98966A02371L08336
10567D10707G1254h5258c6229p3546B1390i5423k2240C3343O5951a35593I0494
10555a51152j92162L1515k37300b07620Q0073M1759K9355j69829R084G0897e585
10543a17605j3817O3108B34680a58532a5646p5085M822F4675j0831O738d2053
$$ plain form
10531 260570 -25108 -6728 -382531 33302 -172073 15623 -9510 -135285 -46471 261919 66477
10519 -277318 -86448 145149 -262907 -261088 -20518 124424 -81137 -160571 -490613 -57154 -10384
10507 98852 -292399 -188647 -98635 -68542 268084 58699 -48312 196938 36551 123387 143146
10496 143146 43445 -122476 120757 242098 -269340 -390556 -39466 -156117 88637 256639
10486 256639 -299224 84998 -105254 453566 84878 186313 71870 31491 21140 -316816
10475 -218810 -233543 -72270 24624 -598378 16486 -166645 204144 435399 261423 127910
10464 300499 384415 133498 82234 27021 -201902 -41841 -12616 169932 167707 2994 62235
10453 62235 20433 344898 -169091 19477 -90825 -15508 77979 -195124 -127416 -9149 -159623
$$ packed form
10531B60570b5108f728l75803C3302a72073A5623i510j25775d6471B61919F6477
10519b77318h6448A45149b62907J819b0518A24424h1137p9434l30042e7154a0384
10507I8852b92399J03752R0012L0093B68084E8699d8312A96938C6551Q6836J9759
10496A43146D3445a22476A20757J21341b69340j21216c9466j16651H8637J68002
10486B56639b99224H4998a05254D53566H4878J01435G1870C1491j0351c16816
10475b18810j4733g2270B4624e98378A6486a66645B04144K31255j73976A27910
10464C00499Q3916A33498n1264B7021b01902d1841a2616A69932k225B994N9241
10453F2235B0433L24465a69091A9477i0825a5508G7979a95124O7708i149j50474
$$ plain form
10442 -159623 -83829 121901 124506 2335 -129427 -97036 37462 -112152 -200414 -138148 257789
10430 32362 234348 6118 -328832 -164007 60481 -18511 -175745 263736 98138 197822 25525
10418 -115755 186546 99216 -35611 -56174 -204344 -85251 -232180 53719 -99747 -121945 -84644
10407 -84644 61270 8772 204880 -189172 120056 179610 21051 106924 -32081 103770 158705
10396 158705 62812 -47787 182034 78968 -1913 -300304 64834 -101991 207545 -165045 -28248
10384 104826 10928 135321 63566 207220 4732 -82722 79743 42071 -136722 152529 46441
10372 282072 -39028 -51511 9738 -11221 87215 -179513 -288377 244637 295723 251507 -93854
10360 138980 375583 -75330 -111132 720731 226774 219001 -60785 115439 448201 511089 256357
$$ packed form
10442a59623P5794A21901K605B335a29427L2391C7462a12152q8262O2266B57789
10430C2362K01986F118c28832a64007F0481a8511j57234B63736I8138R9684B5525
10418a15755A86546q7330c5611k0563j48170h5251j46929E3719i9747k2198L7301
10407h4644F1270H772J96108a89172A20056N9554B1051Q5873c2081A03770N4935
10396A58705F2812d7787A82034G8968a913k98391F4834a01991B07545a65045b8248
10384A04826A0928J24393F3566J43654D732h2722G9743l7672a36722A52529D6441
10372B82072c9028j2483I738a1221H7215a79513j08864B44637N1086m4216i3854
10360A38980K36603g5330l5802G20731B26774p773f0785A15439L32762O2888k54732
$$ plain form
10349 256357 426352 275123 135796 437394 134085 349694 176837 231161 -100022 107173
10338 155492 -126549 384204 330379 308347 355111 297685 147409 716882 457419 447746 414965
10327 414965 79266 591378 -14327 86991 587877 -73122 49286 268306 -114575 329134
10316 183866 191699 125992 49816 48955 114254 54689 88111 -64638 -124947 332613 203735 68546
10303 53278 346016 176128 -99925 -109904 -104566 209168 257733 300777 123507 75071 -281272
10291 64709 -36627 -310411 -9965 54511 86919 -2799 -83579 241819 -36743 79394 -15099 -283699
10279 -283699 -44600 -80973 -105242 -165402 33365 261907 -313345 41868 -203732 -296846 21561
10267 -312845 57179 -17062 -50247 226267 11075 13279 52074 112294 -312798 186742 112050
$$ packed form
10349B56357J69995j51229A35796L01598A34085K15609j72857N4324a00022A07173
10338A55492a26549C84204n3825k2032M6764n7426A47409N69473k59463r673l2781
10327D14965G9266N12112a4327H6991N00886g3122D9286K19020a14575C29134
10316A83866P833o5707D9816q61O5299E4689L3422f4638o0309C32613j28878F8546
10303E3278K92738j69888i9925r979N338B09168M8565M3044A23507m8436b81272
10291F4709c6627k73784i965E4511L2408b799q0780B41819c6743G9394a5099k68600
10279b83699d4600l6373k4269o0160C3365K28542c13345D1868b03732r3114B1561
10267c12845E7179a7062l3185B26267A1075K204L8795O0220c12798A86742p4692
$$ plain form
10256 112050 105609 257810 -11368 99426 -195117 85398 220300 72694 311834 204486 -226414
10244 240929 -69534 316080 177037 206596 -7240 -179691 -159468 -35569 -85167 75632 -288970
10232 277467 -101636 -204280 51715 -199878 44266 -149005 205045 -228706 -18016 530384
10221 326654 -231630 -107461 34436 -29751 138195 -15224 190159 139604 48241 -73102 67817
10209 -108834 -4958 47654 -94228 279565 -31667 233146 54012 142126 -338217 130417 -93292
10197 -123868 100516 132086 -137698 -171779 -199857 80699 -66984 2616 -24304 -197927 39078
10185 19047 -79555 -487243 97776 -181357 -426436 48903 -17883 -145787 165875 -292278
10174 -114619 -448653 180143 -177539 -51786 28079 -137439 85273 68167 -94988 -28393 -47718
$$ packed form
10256A12050o441J52201a1368I9426a95117H5398J34902G2694K39140j07348b26414
10244B40929f9534C16080j39043K9559g240j72451K0223c5569m9598G5632b88970
10232B77467a01636j02644E1715a99878D4266a49005B05045b28706a8016E30384
10221C26654b31630a07461C4436b9751A38195a5224A90159n0555D8241g3102F7817
10209a08834d958D7654i4228B79565c1667B33146E4012Q8114c38217A30417i3292
10197a23868A00516L1570a37698l4081k8078H0699f6984B616b4304j73623C9078
10185A9047g9555m07688I7776a81357k45079D8903a7883j27904A65875b92278
10174a14619l34034A80143a77539e1786B8079a37439H5273j7106i4988b8393j9325
$$ plain form
10163 -47718 -62759 -325904 52134 -90063 316581 -218180 -128306 -165399 -63223 -130947 -106724
10152 -106724 -346864 100244 -36745 -116810 -252069 -250009 38078 222699 -74424 190482 -94912
10140 -274547 -158442 193181 -229793 70592 -269344 108860 42039 -57175 355933 63297
10129 -28369 -164109 -39720 -77134 -395095 -239980 -45206 61879 71754 32732 260830 65377
10117 -165322 173479 -39680 163097 -28427 -89661 -296650 -58371 -231788 10349 -300808
10106 -12563 -139541 330346 268943 -81697 -73387 146743 -6528 79506 40309 -151683 21877
10094 -152086 -343824 -254175 -66684 49680 -11769 -105725 -153143 -160250 -255903 -46761 280436
10082 -112541 108956 -56732 96620 -7916 -13693 -222854 88358 -183522 -297525 198920 -22765
$$ packed form
10163d7718j5041k63145E2134i0063C16581b18180Q9874l7093f3223o7724K4223
10152a06724k40140A00244c6745q0065j35259K060C8078J84621g4424A90482i4912
10140b74547J16105A93181b29793G0592b69344A08860D2039e7175C55933F3297
10129b8369j35740c9720l7414l17961J55115d5206F1879R875C2732K28098F5377
10117a65322A73479c9680A63097b8427o1234k06989e8371j73417A0349c00808
10106a2563j26978C30346o1403h1697Q310A46743f528G9506l9197a51683B1877
10094a52086j91738Q9649f6684D9680a1769r3956m7418p107r5653d6761B80436
10082a12541A08956e6732I6620g916n777k09161H8358a83522j14003A98920b2765
$$ plain form
10070 126717 11981 16998 -40491 -234313 208725 -161051 162345 -166410 -152730 153394
10059 -315107 -137268 -370582 -321108 -144145 -84651 30948 -130261 -75454 -286622 -57673
10048 -59484 -57400 -99781 -86385 -110146 52249 116335 38440 -79449 -201414 -22582 -88641 -88792
10036 -88792 -41114 274678 -389032 12500 -77683 -257499 -301 -111320 -186288 -161801 -250263
10025 -250263 -34393 -63418 11262 -230614 -361137 301809 -232172 126358 -354251 -199689
10015 -199689 -57940 -3364 235535 -309031 118630 280151 -132804 -19566 117678 -277623
10004 27829 -189355 160905 -180106 24384 -171713 -252506 42324 -18831 -87995 -153035 33226
9992 -164837 348857 -247121 -35166 46496 79457 202145 -157922 32021 -114894 122698
$$ packed form
10070A26717A1981N017d0491j93822B08725a61051A62345a66410J3680A53394
10059c15107a37268k33314M9474a44145N9494C0948a30261N4807k11168e7673
10048e9484K084m2381J3396k3761E2249O4086C8440g9449j21965b2582o6059j51
10036h8792d1114B74678c89032A2500g7683j79816c01j11019p4968K4487q8462
10025b50263c4393k9025A1262b30614j30523C01809b32172A26358c54251J54562
10015a99689e7940c364B35535c09031A18630J61521a32804a9566A17678b77623
10004B7829a89355A60905a80106B4384a71713q0793D2324a8831o9164o5040C3226
9992a64837C48857b47121c5166D6496L2961J22688a57922C2021a14894A22698
$$ plain form
9981 -194690 -4249 -32632 -199406 -334170 286528 -51393 -150226 284056 -228759 98924 -101312
9969 -109780 -163747 -129586 -183784 -184234 65987 64556 341943 79910 -164973 4009 130589 -201380
9956 -245687 -115159 -401636 98437 -76175 294587 -331167 -162361 -124018 263173 -181519
9945 -137483 -16459 -122163 -63016 -100822 120375 -42505 60305 -78178 -279768 393123 14131
9933 74794 -311688 -107286 194898 27485 146704 -396876 -63765 -120285 -227169 80782 170537
9922 170537 112940 79791 284420 -42167 -53817 -456820 191910 126371 18924 -129309 -229983
9911 -229983 -54685 117853 -176610 -238094 -80534 -195658 -45335 -229047 -162792 -238651 -195180
9900 -195180 -114744 -351366 193345 -69619 82406 53745 -223634 166258 94784 -66021 -164872
$$ packed form
9981a94690d249k8383j66774j34764B86528e1393r8833B84056b28759I8924a01312
9969a09780n3967L4161n4198m50F5987j431K77387G9910a64973D009J26580b01380
9956b45687a15159k86477I8437g6175B94587c31167a62361L8343B63173a81519
9945a37483a6459j05704N9147l7806A20375d2505F0305g8178k01590C93123A4131
9933G4794c11688a07286A94898B7485J19219c96876f3765n6520j06884H0782Q9755
9922A70537n7597l3149K04629d2167j1650m03003A91910o5539A8924a29309j00674
9911b29983e4685A17853a76610o1484h0534j15124d5335j83712O6255p5859M3471
9900a95180Q0436k36622A93345f9619H2406k8661b23634A66258p1474f6021r8851
$$ plain form
9889 -164872 35621 13591 -129578 -274103 -1754 -235055 83312 31244 -110980 74503 -53237
9877 -281747 -84873 129267 67856 -55514 354719 160452 -13987 -288001 170163 -5237 37489
9865 124232 158938 -190495 -70238 195096 -151572 6749 -15115 -74823 291854 -404242 147914
9853 240176 -356305 -77659 -184802 -130093 60260 -178238 -38887 -165560 61513 -50080 -205774
9842 -205774 -165614 -147554 -274879 148492 -85813 -105003 -323358 143411 -68807 -104271 -405929
9831 -405929 -238577 54638 -116697 -216177 -79957 -137920 158297 -163462 -271601 -226944 -286178
9820 -286178 -103756 78676 66191 74046 -8248 153871 48384 -228164 -50845 -258571 -202162
9809 -202162 -36642 -185165 -42884 -234238 -332522 -51490 -162118 -205256 62406 136224 -231371
$$ packed form
9889a64872C5621A3591a29578j44525a754k33301H3312C1244a10980G4503e3237
9877b81747h4873A29267o1411e5514C54719A60452a3987k74014A70163e237C7489
9865A24232L4706a90495g0238A95096a51572F749a5115n9708B91854d04242A47914
9853B40176c56305g7659j07143N4709F0260a78238c8887j26673F1513e0080j55694
9842b05774M0160J8060j27325A48492h5813j9190k18355A43411f8807l5464l01658
9831d05929J67352E4638a16697r9480g9957n7963A58297a63462j08139M4657n9234
9820b86178a03756G8676j2485P855h248A53871D8384b28164e0845k07726N6409
9809b02162c6642j48523d2884j91354r8284e1490j10628m3138F2406P3818b31371
$$ plain form
9797 -105380 -41474 -323989 -67875 -383234 -98230 -282082 -170994 -354392 -269276 -212432 -207419
9786 -207419 -157035 59139 -102431 166610 54751 -214719 -21734 83383 99445 -147102 294401
9774 -271092 73981 149334 -123252 -82240 320983 160722 -77628 222799 -64117 35985 4255
9762 -269238 -96790 -118426 8856 -253797 -62510 -76348 277587 -7742 -159312 -261903 28586
9750 -392050 -241410 -124840 -100335 -108156 268906 -56151 91979 149433 -171561 -343354 -22285
9738 42283 102403 -67998 -108417 -39152 62238 -236133 -297274 182132 -75253 -204636 -189466
9727 -189466 -218980 -198232 44756 -135869 -73099 -106836 55628 49379 161434 -189218 451048
9715 35393 -42913 -157240 -357656 -108823 62923 -170387 2413 150415 -124497 -438008 -280378
$$ packed form
9797a05380d1474k82515f7875l15359i8230j83852J11088j83398Q5116N6844N013
9786b07419N0384E9139a02431A66610E4751b14719b1734H3383J6062a47102B94401
9774b71092G3981P5353a23252M1012C20983j60261g7628B22799f4117C5985D255
9762b69238i6790k1636H856b53797f2510j3838B77587g742j51570j02591B8586
9750c92050J50640J16570K4505p821B68906e6151I1979N7454a71561j71793b2285
9738D2283O0120f7998m0419c9152F2238b36133o1141A82132g5253j29383J5170
9727a89466k9514K0748D4756a35869O2770l3737E5628o249J12055a89218D51048
9715C5393d2913j14327k00416a08823F2923a70387B413J48002a24497l13511J57630
$$ plain form
9704 -280378 -366257 -100240 342496 -6146 56107 -105210 231505 -39734 141043 17737 184260
9693 184260 -115033 -450699 159159 94441 -123140 -199167 191777 -132807 165862 -118827
9682 294057 -64775 127879 -203977 -325137 -185311 90771 -100961 187309 -1250 -30441 -139603
9671 -139603 208259 -239911 272105 -254543 69482 -19901 -14178 39270 -191887 -225352 -118979
9660 -118979 43792 8857 -140166 -40832 -96334 9997 -67313 -263431 80293 517485 -128990
9648 86557 -12298 133923 -430209 36081 -87891 68943 -165528 37533 47092 -145214 -256450
9637 -256450 270616 211746 -105900 -34752 -219934 3871 110417 33152 -155184 224866 -34154
9625 -91763 17295 -217626 -54170 -9606 -194407 -344370 -181141 113712 73996 -341656 -99024
$$ packed form
9704b80378q5879a00240C42496f146E6107a05210B31505c9734A41043A7737J66523
9693A84260a15033l35666A59159o4718a23140p6027A91777a32807A65862a18827
9682B94057f4775A27879b03977j21160J39826I0771a00961A87309a250k9191j09162
9671a39603B08259b39911B72105b54543F9482a9901N723C9270a91887l3465J06373
9660a18979D3792H857a40166d0832n5502I997f7313j96118H0293M37192a28990
9648H6557a2298A33923d30209C6081h7891F8943a65528C7533R559a45214j11236
9637b56450B70616n8870a05900c4752j85182C871J06546C3152a55184B24866c4154
9625i1763A7295b17626e4170i606j84801j49963J63229A13712l9716c41656i9024
$$ plain form
9613 -109575 -55064 298005 -72983 -222221 -8664 126050 -178161 58817 -12610 -326229 -274340
9602 -274340 -22619 217723 -205385 -29889 34363 79062 -218561 16440 -190153 -28828 9505
9590 37429 -273134 -127433 76566 -74451 144485 -19581 -20273 -327474 2087 -122290 111496
9578 -131278 229281 -75220 -97206 67716 -263990 -13387 -157365 225747 44467 -1876 -199908
9567 -199908 390954 -156743 -107219 -226066 -81513 -111881 82281 7356 243467 -226294 -105973
9555 55653 -1838 -173363 -54128 144523 421348 -20682 39021 471860 -182895 47511 -249387
9543 -38633 -7014 -222604 -414516 -198816 -373023 -462471 -102770 88152 256183 23408 104967
9532 104967 -111814 15156 -50422 -160464 -70348 -153185 36972 74725 -243724 -439598 -106296
$$ packed form
9613a09575N4511B98005g2983j49238h664A26050a78161E8817a2610l13619N1889
9602b74340b2619B17723b05385b9889C4363M4699b18561A6440a90153b8828I505
9590C7429b73134a27433G6566g4451A44485a9581o92l07201B087a22290A11496
9578a31278B29281g5220k1986F7716b63990a3387j43978B25747D4467a876j98032
9567a99908C90954a56743M9524j18847h1513l0368H2281G356K36111b26294a05973
9555E5653a838j71525e4128A44523K76825b0682C9021M32839a82895D7511b49387
9543c8633g014k15590j91912a98816j74207q9448a02770H8152J68031B3408Q1559
9532A04967a11814A5156e0422j10042g0348q2837C6972L7753b43724j95874a06296
$$ plain form
9520 -312503 26189 -119326 -282277 114096 71009 -152066 7235 -79181 141447 -255246 96667
9508 14546 -226764 -3216 -264813 -358376 -248871 -220150 -257962 -4922 -237768 45255 110996
9497 110996 -262133 255731 -158299 135588 140003 9534 59908 -189282 204313 -119055 -26047
9485 -65245 53976 255488 -279058 273422 -72728 -98406 -35160 65028 -177313 -333238 -170065
9474 -170065 104193 -527734 -23017 -437011 -22384 139899 -99926 -30098 276356 -115647
9463 -46076 177609 312516 -382686 -16645 -347259 234400 -29167 171033 -410068 -67695
9452 -313327 190055 -32348 152848 -81105 -545517 -136025 44990 126818 -247622 34869 -161859
9440 72577 97846 -301852 81155 33409 -190899 -138976 635 -131438 31697 51524 -287671
$$ packed form
9520c12503B6189a19326j62951A14096m3087a52066G235g9181A41447b55246I6667
9508A4546b26764c216k61597r3563J09505K8721l7812d922k32846D5255O5741
9497A10996b62133B55731a58299A35588M415I534N0374a89282B04313a19055b6047
9485f5245E3976K01512b79058B73422g2728k5678c5160F5028a77313j55925J63173
9474a70065A04193e27734b3017m13994b2384A39899i9926c0098B76356a15647
9463d6076A77609J34907c82686a6645l30614B34400b9167A71033d10068f7695
9452c13327A90055c2348A52848h1105m64412a36025D4990Q1828b47622C4869a61859
9440G2577K5269c01852H1155C3409a90899N1923F35a31438C1697J9827b87671
$$ plain form
9428 38412 -198838 -147020 -2238 -342123 34103 -234807 48487 -71136 143388 -196836 112912
9416 -141928 182291 -91968 -67522 71362 -262138 -260738 68745 -360588 -170714 -172783 117448
9404 -267254 -83772 -352992 -120443 -452264 157594 177340 30026 30738 5570 -130654 -207615
9393 -207615 -279051 12103 -183830 -14132 -55934 171617 141649 -127002 152225 -123873 5871
9381 -119970 216688 -52046 26157 -110805 35583 -77443 -38725 -260068 -199754 -61532 -137054
9370 -137054 6463 -259650 -127736 308886 5733 109886 -210929 -132037 63987 -309344 7104
9358 -259 230017 -109976 -90003 -270984 -274811 77623 387446 -16900 56715 -345856 -134711
9346 -147933 65608 330131 -58590 -201077 193344 -48937 280669 39886 -325830 -241494 60342
$$ packed form
9428C8412a98838N1818b238l39885C4103b34807D8487g1136A43388a96836A12912
9416a41928A82291i1968K4446G1362b62138J400F8745c60588a70714k069A17448
9404b67254h3772k69220a20443l31821A57594J9746C0026P12E570a30654p6961
9393b07615p1436A2103a83830a4132m1802A71617k9968a27002A52225a23873E871
9381a19970B16688e2046B6157a10805C5583g7443L8718k21343O0314f1532p5522
9370a37054F463b59650a27736C08886E733J04153b10929P8892F3987c09344G104
9358b59B30017a09976J9973j80981l827G7623L09823a6900E6715c45856a34711
9346a47933F5608K64523e8590j42487A93344d8937B80669C9886c25830Q4336F0342
$$ plain form
9334 120299 50660 716 -115152 343831 -198070 -11168 -238025 -368903 -182511 -275493 29170
9322 -223700 -213052 -147829 -74780 -17455 74520 -114072 948 567207 37997 -149759 -4094 185606
9309 73768 -190031 -251762 371433 -47608 -82770 -63999 -103578 86627 30048 220083 88902
9297 55197 -167507 176360 -223636 225640 -129605 -119961 -347599 10337 -101023 250859
9286 -48948 97131 -217752 -277640 -59816 472417 -97226 -214213 85526 -307528 -59611 -339019
9275 -339019 -129945 -158002 54586 114114 -846 81543 23641 -432658 4025 -39968 -154850 -49172
9262 -173931 -49448 -43466 17261 -10401 10479 -217891 -334561 -203639 -260743 -299903 241631
9250 77118 -13643 -33196 -265829 -80975 15317 -153159 -184508 208135 -170623 -2921 -181911
$$ packed form
9334A20299E0660G16a15152C43831a98070a1168k26857j30878a82511r2982B9170
9322b23700J0648O5223P3049a7455G4520a14072I48N66259C7997a49759d094A85606
9309G3768a90031o1731C71433d7608l5162J8771l9579H6627C0048J90035H8902
9297E5197a67507A76360b23636B25640a29605R644k27638A0337a01023B50859
9286d8948I7131b17752n9888e9816D72417i7226j16987H5526c07528e9611k79408
9275c39019a29945k8057E4586N9528h46H1543B3641d32658D025c9968j14882d9172
9262a73931d9448N982A7261a0401A0479b17891j16670J30922n7104l9160B41631
9250G7118a3643j9553k32633h0975A5317a53159l1349B08135a70623b921j78990
$$ plain form
9239 -181911 -308079 -138055 -174107 -85931 103868 -346859 23144 -206825 63946 30895 -72952
9227 -154865 -26434 126901 -411502 209437 -73265 51846 226898 -249399 -7679 133713 -56399
9215 -289318 169639 30793 -136086 60886 -305797 116982 -72885 -344152 -221517 -258201
9205 -258201 35799 -192041 -165949 -190698 169645 136056 -253602 -162338 -74806 335041 69077
9193 -134629 -183682 -422196 -314450 158360 -148483 -88546 -173981 147702 -75272 -549469
9183 -549469 44948 90016 -175431 -92607 -210516 142883 107426 -196206 -58548 -178795 -316076
9172 -316076 -165452 177413 92698 -37764 80855 -119786 154732 -184400 -368255 -249295
9162 -249295 47406 -247967 -249504 -171631 -166614 93730 9269 -55631 -157233 -73080 -169359 -277665
$$ packed form
9239a81911j26168a38055l6052h5931A03868c46859B3144b06825F3946C0895g2952
9227a54865b6434A26901d11502B09437g3265E1846J75052b49399g679A33713e6399
9215b89318A69639C0793a36086F0886c05797A16982g2885k71267J22635l6684
9205b58201C5799a92041K6092k4749A69645l3589b53602R1264g4806C35041F9077
9193a34629m9053k38514J07746A58360a48483N9937q5435A47702g5272m74197
9183e49469D4948M5068a75431Q2824j17909A42883l5457a96206e8548j20247j37281
9172c16076J50624A77413q4715c7764H0855a19786A54732a84400j83855J18960
9162b49295D7406b47967j537P7873N017I3730I269e5631j01602g3080r6279j08306
$$ plain form
9150 -277665 190108 95333 -138479 -5143 94680 -268648 -112973 -204246 96768 -125299 132355
9138 -69427 65260 186748 209251 107261 -540968 64841 -282382 -29162 -370345 -60696 -23923
9126 -88098 -194398 -55562 -64794 -175737 -272358 65462 177302 314614 -349635 246919 11077
9114 -9752 -105911 123874 111418 -237484 188783 -124655 12288 -135131 -252057 -101568 152289
9102 145151 114153 104782 -40221 -89804 50669 -190629 64366 -105030 76118 133150 -58016
9090 -384797 140485 -73474 -67350 -83581 -150890 112434 -197319 -128119 236440 -260804 238104
9078 142292 -149775 347755 -61928 -182238 13569 72546 -97619 205447 -216847 -159028 -178732
9067 -178732 -131173 -195665 -66189 20451 -57569 -110179 -331031 -426763 -510886 211662 79339
$$ packed form
9150b77665A90108r4775a38479e143I4680b68648a12973r1273I6768a25299A32355
9138f9427F5260J21488K2503j01990e40968F4841b82382b9162l41183f0696b3923
9126h8098j06300e5562r232j10943r6621F5462J11840J37312c49635B46919A1077
9114i752r6159A23874j2456b37484A88783a24655A2288a35131j16926a01568A52289
9102A45151l0998r371d0221m9583E0669a90629F4366a05030G6118N7032e8016
9090c84797A40485g3474O124j6231o7309A12434a97319O9200B36440b60804B38104
9078A42292a49775C47755f1928j20310A3569N8977i7619B05447b16847N7819j9704
9067a78732M7559o4492f6189B0451e7569n2610k20852r5732q4123B11662G9339
$$ plain form
9055 -161959 81654 -156053 85877 -48045 -64994 -63516 -426314 5553 -148598 113689 111079
9044 111079 42645 -46291 -327841 111899 24197 -109798 -32571 -80774 118899 -83462 239885
9032 -361551 -311222 -18209 366214 -283742 194754 -55160 39936 -63560 -152686 -9704 369699
9020 -63076 -55822 -459277 -118054 187076 -64163 -22151 -140713 68848 -64389 -7872 -27645
9009 -27645 -133746 -45424 172642 123157 -200092 -84545 -195341 -74057 -189975 -182824 -100076
8998 -100076 211981 -368727 -64680 -183421 31486 -161541 131470 -198861 -102961 392624
8987 -222349 -243727 64032 62568 -31686 -203172 105663 -233669 207443 110380 -140999 136825
8975 222275 -48595 -228367 -376240 -132170 292510 -365946 99097 81368 -91941 -160137 -284015
$$ packed form
9055a61959H1654a56053H5877d8045j6949J478l62798E553a48598A13689k610
9044A11079D2645d6291k81550A11899B4197a09798c2571m8203A18899h3462B39885
9032c61551N0329a8209C66214b83742A94754e5160C9936f3560q9126i704C69699
9020f3076P254m03455a18054A87076f4163b2151j18562F8848f4389g872j9773
9009b7645j06101d5424A72642m9485b00092h4545j10796g4057j15918P151Q2748
8998a00076B11981c68727f4680j18741C1486a61541A31470a98861R5900C92624
8987b22349k1378F4032j464c1686j71486A05663b33669B07443r7063a40999A36825
8975B22275d8595j79772j47873a32170B92510c65946I9097j7729i1941o8196j23878
$$ plain form
8964 -284015 -335894 96830 -191768 -202438 -139361 -70537 120132 -320970 -29916 -88467 -74831
8953 -74831 10438 -115520 120075 -310921 -139437 -160892 -192040 206713 209054 -114936 -120761
8942 -120761 154222 -43244 -123011 166924 -66525 154210 -48447 123293 -296558 -49312 -136032
8931 -136032 -76642 28671 -31561 405465 49351 81329 285291 69935 -93146 -29124 143115
8919 114156 310976 426442 176117 424432 330545 328472 92771 65689 434496 735524 822644
8908 822644 1649644 3937124 8668657 7917571 3762880 2482206 1362443 1003668 748451
8899 748451 498696 249122 276660 -136750 125087 216866 239205 307376 310046 -243158 -51880
8887 -303320 -182840 -19740 48890 -968 117229 -66448 165912 125883 -64223 -120092 -1892 -180511
$$ packed form
8964b84015n1879I6830a91768j0670O3077O8824A20132c20970b9916n8551J3636
8953g4831A0438a15520A20075c10921a39437k1455l1148B06713K341a14936n825
8942a20761A54222d3244p9767A66924f6525A54210d8447A23293b96558d9312q6720
8931a36032N9390B8671c1561D05465D9351L1978K03962F9935i3146b9124A43115
8919A14156J96820J15466A76117K48315r3887k073I2771k7082L68807L01028Q7120
8908H22644Q27000K287480M731533p51086C762880j280674j119763l58775k55217
8899G48451k49755B49122K7538a36750A25087R1779K2339O8171K670b43158e1880
8887c03320J20480a9740D8890i68A17229f6448A65912m0029f4223n5869a892j78619
$$ plain form
8875 -180511 -71962 -306896 -20894 -209472 -196587 24422 42262 -259588 -112990 -18484 -178757
8864 -178757 -166226 -177779 94398 -408955 79980 -127289 -71729 163649 54603 -134614 -349824
8853 -349824 -77143 -103723 -115747 -86090 -94073 -57751 58961 -103237 -249608 94658 -56620
8841 221796 157742 31226 -161676 -55002 223253 -57301 -329416 74735 128558 -60375 -23200
$$ packed form
8875a80511g1962k34934b0894j88578J2885B4422J7840b59588a12990a8484j60273
8864a78757J2531j1553I4398d08955G9980a27289N5560A63649E4603a34614k15210
8853c49824g7143k6580j2024K9657p983L6322E8961a03237j46371I4658e6620
8841B21796o4054C1226a61676e5002B23253e7301k72115G4735N3823f0375b3200
$$ [...]
##END NTUPLES=NMR SPECTRUM
##END=
