
##TITLE=UV1042_TOSA01-ROVE100B_6099729_Sl3A74I5PF
##JCAMPDX= 6.0         $$ Bruker NMR JCAMP-DX V2.0
##DATA TYPE= NMR SPECTRUM
##DATA CLASS= NTUPLES
##ORIGIN= BRUKER
##OWNER= Administrator
$$ 1.72 TOPSPIN		Version 2.1
$$ 2012-05-12 22:34:29.953 -0500  Administrator@TOPSPIN
$$ Compression mode = diff/dup
##.OBSERVE FREQUENCY= 400.13188235
##.OBSERVE NUCLEUS= ^1H
##.ACQUISITION MODE= SIMULTANEOUS (DQD)
##.ACQUISITION SCHEME= undefined
##.AVERAGES= 64
##.DIGITISER RES= 22
##SPECTROMETER/DATA SYSTEM= spect
##.PULSE SEQUENCE= noesygpps1d.comp
##.SOLVENT NAME= COFFEE_meoh
##.SHIFT REFERENCE= INTERNAL, COFFEE_meoh, 1, 14.96678
##AUDIT TRAIL= $$ (NUMBER, WHEN, WHO, WHERE, PROCESS, VERSION, WHAT)
$$ ##TITLE= Audit trail, TOPSPIN		Version 2.1
$$ ##JCAMPDX= 5.01
$$ ##ORIGIN= Bruker BioSpin GmbH
$$ ##OWNER= Administrator
$$ $$ C:\Bruker\TOPSPIN/data/COFFEE/nmr/UV1042_TOSA01-ROVE100B_6099729_Sl3A74I5PF/12/pdata/1/auditp.txt
$$ ##AUDIT TRAIL=  $$ (NUMBER, WHEN, WHO, WHERE, PROCESS, VERSION, WHAT)
(   1,<2012-05-12 22:34:25.265 -0500>,<Administrator>,<TOPSPIN>,<go>,<TOPSPIN 2.1>,
      <created by zg
	started at 2012-05-12 22:22:55.015 -0500,
	POWCHK enabled, PULCHK disabled,
       configuration hash MD5:
       AF F2 23 6B 01 CD 40 DD E5 A1 38 A0 06 EA F7 77
       data hash MD5: 64K
       1E 30 34 9B 39 21 95 BC 4E AC C1 51 80 75 F8 4A>)
(   2,<2012-05-12 22:34:27.921 -0500>,<Administrator>,<TOPSPIN>,<proc1d>,<TOPSPIN 2.1>,
      <Start of raw data processing
       efp LB = 0.3 FT_mod = 6 PKNL = 1 PHC0 = 0 PHC1 = 0 SI = 128K 
       data hash MD5: 128K
       05 B6 7E 98 A8 49 64 2D A6 2D F0 AC 4E 37 02 C0>)
(   3,<2012-05-12 22:34:29.203 -0500>,<Administrator>,<TOPSPIN>,<proc1d>,<TOPSPIN 2.1>,
      <pk PHC0 = 34.92554 PHC1 = 0 
       data hash MD5: 128K
       36 46 91 19 F8 BB DA 53 BC BF CA E7 C6 70 BA 3A>)
(   4,<2012-05-12 22:34:29.437 -0500>,<Administrator>,<TOPSPIN>,<proc1d>,<TOPSPIN 2.1>,
      <abs ABSG = 1 
       data hash MD5: 128K
       7A D5 88 0A F8 89 22 D5 0D 3B 6C 1B EA B6 25 72>)
(   5,<2012-05-12 22:34:29.515 -0500>,<Administrator>,<TOPSPIN>,<proc1d>,<TOPSPIN 2.1>,
      <abs ABSG = 2 
       data hash MD5: 128K
       9C E6 BE AF 6E 89 75 B4 5D F8 46 B5 3A A0 C6 A8>)
(   6,<2012-05-12 22:34:29.593 -0500>,<Administrator>,<TOPSPIN>,<proc1d>,<TOPSPIN 2.1>,
      <abs ABSG = 3 
       data hash MD5: 128K
       46 45 BD F5 18 DB F5 E4 35 47 4A 41 CC C2 98 15>)
(   7,<2012-05-12 22:34:29.796 -0500>,<Administrator>,<TOPSPIN>,<proc1d>,<TOPSPIN 2.1>,
      <abs ABSG = 4 
       data hash MD5: 128K
       EF 4C F7 BA 14 CE DE E9 CE 13 C0 29 02 6D DD 5B>)
(   8,<2012-05-12 22:34:29.859 -0500>,<Administrator>,<TOPSPIN>,<proc1d>,<TOPSPIN 2.1>,
      <abs ABSG = 5 
       data hash MD5: 128K
       E3 3D 5F 56 E0 2F 7B D6 68 17 0F 71 D0 57 A9 E0>)
$$ ##END=
$$ 
$$ $$ hash MD5
$$ $$ A0 A6 58 28 26 F7 15 E5 56 87 00 12 4E FE 11 A2
##$RELAX= 
##$RELAX= 
##$RELAX= 
##$RELAX= 
##$RELAX= 
##$RELAX= 
##$RELAX= 
##$RELAX= 
$$ [...]
##$TP07= 0
##$TPNAME0= <>
##$TPNAME1= <>
##$TPNAME2= <>
##$TPNAME3= <>
##$TPNAME4= <>
##$TPNAME5= <>
##$TPNAME6= <>
##$TPNAME7= <>
##$TPOAL= (0..7)
0.5 0.5 0.5 0.5 0.5 0.5 0.5 0.5
##$TPOFFS= (0..7)
0 0 0 0 0 0 0 0
##$TUNHIN= 0
##$TUNHOUT= 0
##$TUNXOUT= 0
##$USERA1= <user>
##$USERA2= <user>
##$USERA3= <user>
##$USERA4= <user>
##$USERA5= <user>
##$V9= 5
##$VALIST= <valist>
##$VCLIST= <CCCCCCCCCCCCCCC>
##$VD= 0
##$VDLIST= <DDDDDDDDDDDDDDD>
##$VPLIST= <PPPPPPPPPPPPPPP>
##$VTLIST= <TTTTTTTTTTTTTTT>
##$WBST= 2048
##$WBSW= 25
##$XGAIN= (0..3)
0 0 0 0
##$XL= 0
##$YL= 0
##$YMAX_a= 10860590
##$YMIN_a= -5627061
##$ZGOPTNS= <>
##$ZL1= 120
##$ZL2= 120
##$ZL3= 120
##$ZL4= 120
##$ABSF1= 14.96678
##$ABSF2= -5.585751
##$ABSG= 5
##$ABSL= 3
##$ALPHA= 0
##$AQORDER= 0
##$ASSFAC= 0
##$ASSFACI= 0
##$ASSFACX= 0
##$ASSWID= 0
##$AUNMP= <proc_prof1d_extract.lims>
##$AXLEFT= 0
##$AXNAME= <>
##$AXNUC= <1H>
##$AXRIGHT= 0
##$AXTYPE= 0
##$AXUNIT= <>
##$AZFE= 0.1
##$AZFW= 0.1
##$BCFW= 0
##$BC_mod= 0
##$BYTORDP= 0
##$COROFFS= 0
##$CY= 15
##$DATMOD= 1
##$DC= 0
##$DFILT= <>
##$DTYPP= 0
##$F1P= 0
##$F2P= 0
##$FCOR= 0.5
##$FTSIZE= 131072
##$FT_mod= 6
##$GAMMA= 0
##$GB= 0
##$INTBC= 1
##$INTSCL= 1
##$ISEN= 128
##$LB= 0.3
##$LEV0= 0
##$LPBIN= 0
##$MAXI= 10000
##$MC2= 0
##$MEAN= 0
##$ME_mod= 0
##$MI= 0
##$NCOEF= 0
##$NC_proc= -3
##$NLEV= 6
##$NOISF1= 0
##$NOISF2= 0
##$NSP= 0
##$NTH_PI= 0
##$NZP= 0
##$OFFSET= 14.96678
##$PC= 1
##$PHC0= 34.92554
##$PHC1= 0
##$PH_mod= 1
##$PKNL= yes
##$PPARMOD= 0
##$PPDIAG= 0
##$PPIPTYP= 0
##$PPMPNUM= 2147483647
##$PPRESOL= 1
##$PSCAL= 4
##$PSIGN= 0
##$PYNMP= <proc.py>
##$REVERSE= no
##$SF= 400.130005534137
##$SI= 131072
##$SIGF1= 0
##$SIGF2= 0
##$SINO= 400
##$SIOLD= 131072
##$SPECTYP= <>
##$SREGLST= <1H.CDCl3>
##$SSB= 0
##$STSI= 131072
##$STSR= 0
##$SW_p= 8223.68421052632
##$SYMM= 0
##$S_DEV= 0
##$TDeff= 65536
##$TDoff= 0
##$TI= <>
##$TILT= no
##$TM1= 0
##$TM2= 0
##$TOPLEV= 0
##$USERP1= <user>
##$USERP2= <user>
##$USERP3= <user>
##$USERP4= <user>
##$USERP5= <user>
##$WDW= 1
##$XDIM= 131072
##$YMAX_p= 481134424
##$YMIN_p= -47572001
##$CURPLOT= <Network HP LaserJet P1505>
##$CURPRIN= <$Network HP LaserJet P1505>
##$DFORMAT= <normdp>
##$LAYOUT= <+/1D_H.xwp>
##$LFORMAT= <normlp>
##$PFORMAT= <normpl>
##$SURQMSG= 1
$$ End of Bruker specific parameters
$$ ---------------------------------
##NTUPLES= NMR SPECTRUM
##VAR_NAME=  FREQUENCY,     SPECTRUM/REAL,   SPECTRUM/IMAG
##SYMBOL=    X,             R,               I
##VAR_TYPE=  INDEPENDENT,   DEPENDENT,       DEPENDENT
##VAR_FORM=  AFFN,          ASDF,            ASDF
##VAR_DIM=   131072,        131072,          131072
##UNITS=     HZ,            ARBITRARY UNITS, ARBITRARY UNITS
##FACTOR=    0.0627417313425165, 1,          1
##FIRST=     8223.62146879498, 8928,         -99663
##LAST=      0,             9701,            -99081
##MIN=       0,             -47572001,       0
##MAX=       8223.62146879498, 481134424,    0
$$ Real data points
##PAGE= N=1
##DATA TABLE= (X++(R..R)), XYDATA
$$ [...]
$$ plain form
63694 361889 363370 364100 364120 364016 364027 363952 363700 363492 363598 364205 365585 368235 372685 378941 385941 391758 394917
63677 394917 395811 396548 399067 403507 408420 412263 414461 415422 416115 417597 420483 424645 429572 434926 440514
63662 440514 445825 450193 453644 457085 461154 465225 468201 470098 472046 474510 476281 475826 473121 469552
63648 469552 466394 464034 462333 460848 458791 455757 452647 451091 451713 453681 456048 458550 460819 462038
63634 462038 462241 463031 466024 471045 476607 481572 485615 488845 491949 496040 501186 505610 507591 507683 507720 508119
63618 508119 507818 506674 505974 506250 506402 505668 504979 505538 507315 509796 513041 517072 521177 524619 527106 527955
63602 527955 526035 521556 516737 513448 511103 508122 504511 501545 499679 498430 497823 498231 498984 498809 497786
63587 497786 497408 498625 501144 504794 509941 516158 521913 526357 530311 534878 540197 546343 554288 564876
$$ packed form
63694C61889J481P30K0j04J1p5k52k08J06O07J380K650M450O256P000N817L159
63677C94917Q94P37K519M440M913L843K198R61O93J482K886M162M927N354N588
63662D40514N311M368L451L441M069M071K976J897J948K464J771m55k705l569
63648D69552l158k360j701j485k057l034l110j556O22J968K367K502K269J219
63634D62038K03P90K993N021N562M965M043L230L104M091N146M424J981R2L7L99
63618E08119l01j144p00K76J52p34o89N59J777K481L245M031M105L442K487Q49
63602E27955j920m479m819l289k345k981l611k966j866j249o07M08P53j75j023
63587D97786l78J217K519L650N147O217N755M444L954M567N319O146P945J0588
$$ plain form
63573 564876 577479 590734 604103 617844 631961 646311 661590 679149 699533 721853 744784
63562 744784 767766 791149 815720 842383 871905 904518 939736 976863 1015896 1057881 1104100
63551 1104100 1154663 1208033 1262260 1316584 1371378 1426447 1479873 1528793 1570943 1605120 1630569
63540 1630569 1646688 1653596 1652708 1646476 1637348 1626796 1615171 1602312 1588026 1571777 1552273 1528027
63528 1528027 1498591 1464928 1428453 1390110 1350522 1310471 1270750 1231858 1194274 1158816 1126260
63517 1126260 1096815 1070447 1047554 1028775 1014167 1003147 995279 990576 988965 990109 994022 1001078
63505 1001078 1010874 1021788 1032622 1044398 1059441 1078478 1099692 1121165 1143416 1168600 1197689
63494 1197689 1229717 1263918 1301370 1343682 1390742 1440906 1493392 1549404 1610208 1674345 1737078
$$ packed form
63573E64876J2603J3255J3369J3741J4117J4350J5279J7559K0384K2320K2931
63562G44784K2982K3383K4571K6663K9522L2613L5218L7127L9033M1985M6219
63551A104100N0563N3370N4227N4324N4794N5069N3426M8920M2150L4177K5449
63540A630569J6119O908q88o232r128j0552j1625j2859j4286j6249j9504k4246
63528A528027k9436l3663l6475l8343l9588m0051l9721l8892l7584l5458l2556
63517A126260k9445k6368k2893j8779j4608j1020p868m703j611J144L913P056
63505A001078R796J0914J0834J1776J5043J9037K1214K1473K2251K5184K9089
63494A197689L2028L4201L7452M2312M7060N0164N2486N6012O0804O4137O2733
$$ plain form
63483 1737078 1792414 1835619 1864576 1879891 1883997 1879508 1867898 1849979 1827702 1804676 1784059 1766119
63471 1766119 1748604 1729326 1707325 1681405 1649071 1608253 1559684 1506504 1451669 1396614 1342129
63460 1342129 1289109 1237920 1188094 1139459 1092965 1049704 1009666 972252 937599 906422 878564
63449 878564 852586 827061 801812 777831 756484 738773 724617 712478 700311 687407 675068
63438 675068 665142 658171 653220 649052 644881 640349 635518 630905 626934 623328 619619 616271 614516 614770
63424 614770 615916 616676 617069 617887 619343 621171 623664 627436 632149 636610 640402 644317 648565 651555 651431
63409 651431 648341 644311 641072 638711 636278 633114 629696 627575 628147 631021 634088 635886 637417 640693
63395 640693 645948 651592 656812 662789 670885 680847 691535 702550 714369 727509 742341 759262 778387
$$ packed form
63483A737078N5336M3205K8957J5315M106m489j1610j7919k2277k3026k0617j7940
63471A766119j7515j9278k2001k5920l2334m0818m8569n3180n4835n5055n4485
63460A342129n3020n1189m9826m8635m6494m3261m0038l7414l4653l1177k7858
63449H78564k5978k5525k5249k3981k1347j7711j4156j2139j2167j2904j2339
63438F75068r926o971m951m168m171m532m831m613l971l606l709l348j755K54
63424F14770J146P60L93Q18J456J828K493L772M713M461L792L915M248K990j24
63409F51431l090m030l239k361k433l164l418k121N72K874L067J798J531L276
63395F40693N255N644N220N977Q096R962J0688J1015J1819J3140J4832J6921J9125
$$ plain form
63382 778387 799382 822183 847485 875896 906981 939921 974998 1013613 1056624 1102968 1149984
63371 1149984 1194732 1235122 1270459 1301444 1329759 1357453 1386474 1418437 1454551 1495639 1542138
63360 1542138 1594000 1650694 1711404 1775137 1840563 1905972 1969622 2029778 2084027 2129006 2161692
63349 2161692 2181174 2188736 2186334 2175655 2158566 2137504 2114793 2091737 2068284 2043066 2013853 1978731
63337 1978731 1937100 1889242 1835523 1777049 1716726 1657957 1601854 1547143 1493245 1441865 1394692
63326 1394692 1351160 1309961 1271623 1237981 1209828 1186546 1167497 1152273 1140092 1130546 1124724 1124015
63314 1124015 1127834 1134051 1141782 1152330 1167078 1185941 1208397 1234666 1265009 1298882 1335754 1376149
63302 1376149 1421030 1470483 1523675 1579915 1639200 1701760 1767255 1834244 1900268 1962571 2018781
$$ packed form
63382G78387K0995K2801K5302K8411L1085L2940L5077L8615M3011M6344M7016
63371A149984M4748M0390L5337L0985K8315K7694K9021L1963L6114M1088M6499
63360A542138N1862N6694O0710O3733O5426O5409O3650O0156N4249M4979L2686
63349B161692J9482P562k402j0679j7089k1062k2711k3056k3453k5218k9213l5122
63337A978731m1631m7858n3719n8474o0323n8769n6103n4711n3898n1380m7173
63326A394692m3532m1199l8338l3642k8153k3282j9049j5224j2181r546n822p09
63314A124015L819O217P731J0548J4748J8863K2456K6269L0343L3873L6872M0395
63302A376149M4881M9453N3192N6240N9285O2560O5495O6989O6024O2303N6210
$$ plain form
63291 2018781 2066721 2103882 2127989 2138591 2137817 2129093 2115057 2096752 2074599 2049714 2023918 1998247
63279 1998247 1971711 1941926 1906942 1866074 1819174 1766218 1708127 1647133 1585494 1524302 1464132
63268 1464132 1406208 1352059 1302462 1257531 1217446 1182343 1151991 1126286 1105290 1087619 1069522
63257 1069522 1047211 1020084 990530 960863 931805 903640 876924 851704 827532 804739 784341
63246 784341 766222 748766 730988 713881 699008 686808 676830 668508 660945 653002 644483 636449 629634
63233 629634 623280 616143 607821 598532 588642 579217 571991 567602 564457 560397 555066 549913 546381 544876
63219 544876 544885 545199 544443 542291 539894 538451 537808 537165 536586 536923 538530 540833 542938 544126 544287 544495 546514
63202 546514 550905 556136 560486 564168 568526 573798 579151 584663 591610 600568 610542 620410 630152 640215
$$ packed form
63291B018781M7940L7161K4107J0602p74q724j4036j8305k2153k4885k5796k5671
63279A998247k6536k9785l4984m0868m6900n2956n8091o0994o1639o1192o0170
63268A464132n7924n4149m9597m4931m0085l5103l0352k5705k0996j7671j8097
63257A069522k2311k7127k9554k9667k9058k8165k6716k5220k4172k2793k0398
63246G84341j8119j7456j7778j7107j4873j2200r978q322p563p943q519q034o815
63233F29634o354p137q322r289r890r425p226m389l145m060n331n153l532j505
63219E44876RL14p56k152k397j443o43o43n79L37J607K303K105J188J61K08K019
63202E46514M391N231M350L682M358N272N353N512O947Q958R974R868R742J0063
$$ plain form
63188 640215 650719 661877 674488 689346 706671 726423 748507 772157 795790 818283 840214
63177 840214 863335 888896 916835 946365 976850 1008037 1039812 1071902 1103799 1134958 1165078
63166 1165078 1194127 1222122 1249055 1275194 1301314 1328429 1357112 1387023 1417001 1445559 1471329
63155 1471329 1493249 1510652 1523292 1531028 1533288 1529069 1517799 1500067 1477224 1450412 1420316 1387669
63143 1387669 1353445 1318659 1284505 1252576 1224188 1199341 1177035 1156758 1139032 1124331 1112349
63132 1112349 1102776 1096108 1093089 1093764 1097425 1103017 1109419 1116113 1123956 1134476 1147778 1161921 1175096
63119 1175096 1187732 1201604 1217440 1234230 1250288 1264144 1275033 1283646 1291972 1301182 1309914 1315670
63107 1315670 1317536 1316198 1311537 1301985 1286758 1267335 1245934 1223377 1199164 1172862 1144697 1115349
$$ packed form
63188F40215J0504J1158J2611J4858J7325J9752K2084K3650K3633K2493K1931
63177H40214K3121K5561K7939K9530L0485L1187L1775L2090L1897L1159L0120
63166A165078K9049K7995K6933K6139K6120K7115K8683K9911K9978K8558K5770
63155A471329K1920J7403J2640P736K260m219j1270j7732k2843k6812l0096l2647
63143A387669l4224l4786l4154l1929k8388k4847k2306k0277j7726j4701j1982
63132A112349r573o668l019O75L661N592O402O694P843J0520J3302J4143J3175
63119A175096J2636J3872J5836J6790J6058J3856J0889Q613Q326R210Q732N756
63107A315670J866j338m661r552j5227j9423k1401k2557k4213k6302k8165k9348
$$ plain form
63095 1115349 1085874 1057489 1030845 1005638 981267 957588 934802 913020 892411 873489 856806
63084 856806 842450 830100 819475 810474 802991 796811 791660 787231 783306 780014 777913 777582 779012 781382
63070 781382 783522 784724 785126 785262 785457 785907 787160 789879 794047 799021 804575 811180 818815 826350 832864
63055 832864 838964 845828 853369 860437 866650 872827 879629 886874 894443 902637 911041 917954 921944 923653
63041 923653 925412 929175 935148 942171 948972 955016 960359 964933 968361 970721 973031 976237 979838 982378
63027 982378 983353 983893 985271 987605 990455 993972 998750 1004923 1012096 1019986 1028742 1038754 1050422 1063818
63013 1063818 1078256 1092575 1106250 1120014 1135090 1152197 1171692 1194144 1220017 1248915 1279860
63002 1279860 1312432 1347117 1384508 1424637 1467334 1512846 1561855 1615072 1672899 1735190 1801167
$$ packed form
63095A115349k9475k8385k6644k5207k4371k3679k2786k1782k0609j8922j6683
63084H56806j4356j2350j0625r001p483o180n151m429l925l292k101l31J430K370
63070G81382K140J202M02J36J95M50J253K719M168M974N554O605P635P535O514
63055H32864O100O864P541P068O213O177O802P245P569Q194Q404O913L990J709
63041I23653J759L763N973P023O801O044N343M574L428K360K310L206L601K540
63027I82378R75N40J378K334K850L517M778O173P173P890Q756J0012J1668J3396
63013A063818J4438J4319J3675J3764J5076J7107J9495K2452K5873K8898L0945
63002A279860L2572L4685L7391M0129M2697M5512M9009N3217N7827O2291O5977
$$ plain form
62991 1801167 1869805 1940469 2012996 2087035 2161639 2235858 2309573 2383250 2456777 2529066 2599249
62980 2599249 2668099 2737617 2808947 2880941 2951099 3017690 3080473 3139313 3192580 3237316 3270773
62969 3270773 3291346 3298116 3290179 3267071 3229686 3180106 3120249 3051149 2973996 2891450 2807196 2724084
62957 2724084 2643223 2564957 2490176 2420373 2356899 2300566 2251702 2210177 2175561 2147542 2126041
62946 2126041 2110705 2100689 2095360 2095003 2100322 2111301 2126913 2145807 2166750 2188464 2209757 2230225
62934 2230225 2250498 2271391 2292937 2314485 2335531 2355909 2374973 2391018 2402056 2407120 2406266 2399189
62922 2399189 2384523 2361059 2329229 2290668 2246574 2197251 2143185 2085617 2025925 1965185 1904569
62911 1904569 1845354 1788252 1733419 1681393 1633145 1588898 1547842 1509465 1474110 1441536 1410105
$$ packed form
62991A801167O8638P0664P2527P4039P4604P4219P3715P3677P3527P2289P0183
62980B599249O8850O9518P1330P1994P0158O6591O2783N8840N3267M4736L3457
62969C270773K0573O770p937k3108l7385m9580n9857o9100p7153q2546q4254q3112
62957B724084q0861p8266p4781o9803o3474n6333m8864m1525l4616k8019k1501
62946B126041j5336j0016n329l57N319J0979J5612J8894K0943K1714K1293K0468
62934B230225K0273K0893K1546K1548K1046K0378J9064J6045J1038N064q54p077
62922B399189j4666k3464l1830l8561m4094m9323n4066n7568n9692o0740o0616
62911A904569n9215n7102n4833n2026m8248m4247m1056l8377l5355l2574l1431
$$ plain form
62900 1410105 1378471 1347221 1317661 1289789 1262782 1236783 1212578 1189820 1167161 1144181 1121767
62889 1121767 1100481 1080009 1060498 1043019 1027935 1013796 998522 981177 962378 943792 927456
62878 927456 914589 904496 895202 885486 875811 867281 860512 855462 851247 845889 837564 826762 816320
62865 816320 808771 804428 802203 800980 799489 796354 791558 786983 784268 782787 780870 778199 775651 773379
62851 773379 770690 767636 765164 763472 761585 758896 756035 753751 752038 750862 750747 751785 752779 752286 750228
62836 750228 747814 746105 745368 745634 747017 749288 751715 753671 755048 755789 755488 753964 752042 751034 751235
62821 751235 751325 749599 745599 740434 735811 733015 732352 732997 733455 732669 730777 728587 726483 724216 721656 719347
62805 719347 718305 719452 722868 727080 729511 728615 725737 724019 725222 728223 730764 731798 731720 731257 731040
$$ packed form
62900A410105l1634l1250k9560k7872k7007k5999k4205k2758k2659k2980k2414
62889A121767k1286k0472j9511j7479j5084j4139j5274j7345j8799j8586j6336
62878I27456j2867j0093r294r716r675q530o769n050m215n358q325j0802j0442
62865H16320p549m343k225j223j491l135m796m575k715j481j917k671k548k272
62851G73379k689l054k472j692j887k689k861k284j713j176j15J038R94m93k058
62836G50228k414j709p37K66J383K271K427J956J377P41l01j524j922j008K01
62821G51235R0j726m000n165m623k796o63O45M58p86j892k190k104k267k560k309
62805G19347j042J147L416M212K431q96k878j718J203L001K541J034p8m63k17
$$ plain form
62790 731040 731799 733954 736962 739634 741335 742533 744097 746063 747141 745614 741168 735832 732529 732409 734025
62775 734025 735394 736265 737911 741201 745593 749836 753028 755059 756576 758599 761718 765494 768839 771011
62761 771011 772168 773223 775529 780436 788481 798766 809577 819916 830154 840933 851774 861445 869790
62748 869790 878463 889234 901860 914454 926059 938079 952704 970598 990782 1012305 1035095 1059320
62736 1059320 1084831 1111524 1139656 1169602 1201744 1236680 1275114 1317482 1364126 1415759 1473204
62725 1473204 1536700 1606056 1681518 1763652 1852260 1946277 2045148 2149416 2259115 2371970 2483886
62714 2483886 2591183 2691936 2785264 2869701 2942399 2999927 3039930 3061905 3066280 3053166 3022607
62703 3022607 2975780 2915129 2843297 2762630 2675574 2584439 2490463 2393976 2295912 2198354 2103184
$$ packed form
62790G31040P59K155L008K672J701J198J564J966J078j527m446n336l303j20J616
62775G34025J369Q71J646L290M392M243L192K031J517K023L119L776L345K172
62761G71011J157J055K306M907Q045J0285J0811J0339J0238J0779J0841R671Q345
62748H69790Q673J0771J2626J2594J1605J2020J4625J7894K0184K1523K2790K4225
62736A059320K5511K6693K8132K9946L2142L4936L8434M2368M6644N1633N7445
62725A473204O3496O9356P5462Q2134Q8608R4017R8871J04268J09699J12855J11916
62714B483886J07297J00753R3328Q4437P2698N7528M0003K1975M375j3114l0559
62703C022607m6827o0651p1832q0667q7056r1135r3976r6487r8064r7558r5170
$$ plain form
62692 2103184 2011030 1922119 1837304 1757465 1682411 1611117 1542769 1477239 1415095 1357604 1306057
62681 1306057 1260391 1218890 1179857 1143276 1110346 1081878 1057601 1036533 1017512 999895 984272
62670 984272 971897 962843 955300 947382 939049 931604 926066 922960 922897 925897 930377 934290 937572 942456
62656 942456 950979 962898 976434 990448 1005526 1023271 1044900 1070496 1099507 1131723 1167315 1205892
62644 1205892 1246353 1288225 1332666 1381521 1435733 1495142 1559128 1626562 1695585 1764407 1832211
62633 1832211 1898436 1961408 2018682 2068690 2111128 2145598 2170735 2184926 2187194 2177239 2155439 2123217
62621 2123217 2082781 2035926 1983204 1924547 1860556 1793014 1724229 1655937 1588860 1523434 1460789
62610 1460789 1402445 1348751 1298227 1249090 1201225 1156133 1115117 1077978 1043453 1010624 980000
$$ packed form
62692B103184r2154q8911q4815p9839p5054p1294o8348o5530o2144n7491n1547
62681A306057m5666m1501l9033l6581l2930k8468k4277k1068j9021j7617j5623
62670I84272j2375r054p543p918q333p445n538l106o3L000M480L913L282M884
62656I42456Q523J1919J3536J4014J5078J7745K1629K5596K9011L2216L5592L8577
62644A205892M0461M1872M4441M8855N4212N9409O3986O7434O9023O8822O7804
62633A832211O6225O2972N7274N0008M2438L4470K5137J4191K268r955k1800l2222
62621B123217m0436m6855n2722n8657o3991o7542o8785o8292o7077o5426o2645
62610A460789n8344n3694n0524m9137m7865m5092m1016l7139l4525l2829l0624
$$ plain form
62599 980000 953257 931513 913649 896948 879639 862169 845683 830371 816051 803212 792198
62588 792198 782059 771671 761543 753007 745808 738149 729361 721130 715531 712900 712048 711667 711076 710432
62574 710432 710599 712121 714049 714627 713482 712286 712729 714577 716348 717267 717807 718645 719826 721009 722155 723898
62558 723898 727345 733457 742464 753715 765902 777594 788133 798293 809515 822105 834840 846944
62546 846944 859752 875505 895090 918043 944257 974186 1007379 1042359 1078396 1116415 1157807
62535 1157807 1203234 1252739 1305807 1360768 1415123 1467069 1515988 1561094 1600600 1632818 1657146
62524 1657146 1673156 1679448 1674503 1658466 1633355 1601629 1565018 1524566 1481205 1436030 1390201 1344579
62512 1344579 1299567 1255354 1212163 1170113 1129271 1090253 1054287 1021934 992062 963036 934754
$$ packed form
62599I80000k6743k1744j7864j6701j7309j7470j6486j5312j4320j2839j1014
62588G92198j0139j0388j0128q536p199p659q788q231n599k631q52l81n91o44
62574G10432J67J522J928N78j145j196M43J848J771R19N40Q38J181J183J146J743
62558G23898L447O112R007J1251J2187J1692J0539J0160J1222J2590J2735J2104
62546H46944J2808J5753J9585K2953K6214K9929L3193L4980L6037L8019M1392
62535A157807M5427M9505N3068N4961N4355N1946M8919M5106L9506L2218K4328
62524A657146J6010O292m945j6037k5111l1726l6611m0452m3361m5175m5829m5622
62512A344579m5012m4213m3191m2050m0842l9018l5966l2353k9872k9026k8282
$$ plain form
62501 934754 908612 885623 865693 848612 834318 821899 809744 797421 786246 777176 769151 760516
62489 760516 751352 743315 737590 733937 731539 729975 729283 729532 730479 731561 732398 733251 734624 736521 738626
62474 738626 741091 744320 748047 751673 755704 761702 770212 779735 788503 796625 805915 818316 835023 856201
62460 856201 880613 906134 931624 958103 987485 1020542 1056609 1094781 1134622 1175909 1218129
62449 1218129 1260082 1299812 1335556 1367063 1395243 1420181 1440287 1453964 1461178 1462717 1458867 1449896
62437 1449896 1437077 1422036 1405520 1387935 1370726 1355969 1344628 1336172 1329903 1325848 1324459 1326438
62425 1326438 1332984 1345274 1363152 1384712 1407580 1430620 1454461 1480460 1508951 1538422 1566648
62414 1566648 1592548 1616275 1637378 1653844 1663536 1665762 1660793 1648594 1628912 1602020 1568532 1529003
$$ packed form
62501I34754k6142k2989j9930j7081j4294j2419j2155j2323j1175r070q025q635
62489G60516r164q037n725l653k398j564o92K49R47J082Q37Q53J373J897K105
62474G38626K465L229L727L626M031N998Q510R523Q768Q122R290J2401J6707K1178
62460H56201K4412K5521K5490K6479K9382L3057L6067L8172L9841M1287M2220
62449A218129M1953L9730L5744L1507K8180K4938K0106J3677P214J539l850q971
62437A449896j2819j5041j6516j7585j7209j4757j1341q456o269m055j389J979
62425A326438O546J2290J7878K1560K2868K3040K3841K5999K8491K9471K8226
62414A566648K5900K3727K1103J6466R692K226m969j2199j9682k6892l3488l9529
$$ plain form
62402 1529003 1484636 1437839 1391064 1345309 1300469 1256607 1214028 1172712 1132815 1095225 1060554
62391 1060554 1028192 997741 970835 949753 934309 921965 911198 902904 897847 894615 891254 887608
62379 887608 884676 882641 880990 880027 880720 882982 885207 885820 884641 882436 879619 875785 870380 863561 856145
62364 856145 848576 840097 829462 816584 803137 791245 781756 773882 766156 757495 747749 737781 729041
62351 729041 722614 718388 715162 711635 707395 703038 699462 697000 695123 692905 689966 687247 686825 690389
62337 690389 697350 704769 709885 712736 715652 720223 725760 731060 736475 743183 751019 758381 764354 770052
62323 770052 777587 788239 801759 816956 832653 848292 863985 880203 897621 916998 938647 961981
62311 961981 986235 1011806 1040084 1071720 1106017 1142621 1182741 1227761 1277629 1331965 1391941
$$ packed form
62402A529003m4367m6797m6775m5755m4840m3862m2579m1316l9897l7590l4671
62391A060554l2362l0451k6906k1082j5444j2344j0767q294n057l232l361l646
62379H87608k932k035j651r63O93K262K225O13j179k205k817l834n405o819p416
62364H56145p569q479j0635j2878j3447j1892r489p874p726q661r746r968q740
62351G29041o427m226l226l527m240m357l576k462j877k218k939k719m22L564
62337F90389O961P419N116K851K916M571N537N300N415O708P836P362N973N698
62323G70052P535J0652J3520J5197J5697J5639J5693J6218J7418J9377K1649K3334
62311I61981K4254K5571K8278L1636L4297L6604M0120M5020M9868N4336N9976
$$ plain form
62300 1391941 1459378 1534172 1614320 1698663 1788013 1883003 1982075 2082205 2180568 2274667 2361637
62289 2361637 2438327 2501888 2550125 2582002 2598314 2601316 2593045 2574152 2544463 2504139 2453936 2394886
62277 2394886 2328280 2255828 2179614 2102068 2025808 1952779 1883272 1816393 1751946 1691442 1636860
62266 1636860 1588733 1545798 1506187 1468621 1432677 1398302 1365166 1332547 1300025 1268111 1237685
62255 1237685 1208768 1180327 1151436 1122250 1093742 1066924 1042423 1020316 1000139 981296 963577
62244 963577 947087 931890 918227 906864 898462 892543 887816 883674 880640 879178 878907 879299 880371 882141
62230 882141 884177 886331 889435 894586 901946 910691 919864 928960 938037 947662 958468 970396 982592
62217 982592 994278 1005474 1016792 1028990 1042915 1059297 1078181 1099040 1121750 1146941 1175073
$$ packed form
62300A391941O7437P4794Q0148Q4343Q9350R4990R9072J00130R8363R4099Q6970
62289B361637P6690O3561M8237L1877J6312L002q271j8893k9689m0324n0203n9050
62277B394886o6606p2452p6214p7546p6260p3029o9507o6879o4447o0504n4582
62266A636860m8127m2935l9611l7566l5944l4375l3136l2619l2522l1914l0426
62255A237685k8917k8441k8891k9186k8508k6818k4501k2107k0177j8843j7719
62244I63577j6490j5197j3663j1363q402n919m727m142l034j462k71L92J072J770
62230H82141K036K154L104N151P360Q745R173R096R077R625J0806J1928J2196
62217I82592J1686J1196J1318J2198J3925J6382J8884K0859K2710K5191K8132
$$ plain form
62206 1175073 1205846 1239146 1276029 1318042 1365812 1418938 1477129 1541031 1612153 1692281 1782432
62195 1782432 1881518 1986068 2091807 2195629 2295861 2390898 2478019 2553583 2614223 2658154
62185 2658154 2685602 2697942 2696440 2682113 2656425 2620890 2575525 2518794 2450179 2372273 2289442
62174 2289442 2204831 2119704 2035157 1953007 1874777 1801043 1732255 1669393 1613211 1563411 1519144
62163 1519144 1480026 1446142 1417149 1391722 1368063 1345009 1322627 1301630 1282219 1263754 1245538
62152 1245538 1227358 1209050 1190317 1171532 1154055 1138776 1124773 1110414 1095566 1081660 1069668
62141 1069668 1059177 1049563 1040950 1033634 1027617 1023233 1021318 1022235 1025517 1031010 1039453 1051197 1065157
62128 1065157 1079948 1095515 1112630 1131115 1149506 1166421 1181684 1196324 1211990 1229892 1249611
$$ packed form
62206A175073L0773L3300L6883M2013M7770N3126N8191O3902P1122Q0128R0151
62195A782432R9086J04550J05739J03822J00232R5037Q7121P5564O0640M3931
62185B658154K7448J2340j502j4327k5688l5535m5365n6731o8615p7906q2831
62174B289442q4611q5127q4547q2150p8230p3734o8788o2862n6182m9800m4267
62163A519144l9118l3884k8993k5427k3659k3054k2382k0997j9411j8465j8216
62152A245538j8180j8308j8733j8785j7477j5279j4003j4359j4848j3906j1992
62141A069668j0491r614q613p316o017m384j915R17L282N493Q443J1744J3960
62128A065157J4791J5567J7115J8485J8391J6915J5263J4640J5666J7902J9719
$$ plain form
62117 1249611 1269324 1288030 1307182 1329225 1354916 1383334 1414342 1449627 1490929 1538434 1591429
62106 1591429 1649555 1712786 1780895 1853409 1929295 2006200 2080698 2149754 2211161 2262269 2299880
62095 2299880 2322716 2333111 2334739 2329064 2315258 2292937 2263137 2226548 2182639 2131320 2074379 2014642
62083 2014642 1954501 1895511 1838298 1782407 1727334 1674429 1626699 1585938 1551104 1520447 1494101
62072 1494101 1473084 1456590 1442270 1429136 1418429 1411112 1405998 1401261 1396814 1394152 1394284 1396578 1399288
62059 1399288 1400522 1398934 1394432 1388526 1383500 1380738 1379802 1379216 1377983 1376058 1373292 1368423 1359814 1347412
62045 1347412 1333504 1321019 1311156 1303012 1295325 1288095 1282482 1279619 1279721 1282058 1285500 1289226 1293215 1298202
62031 1298202 1305115 1314415 1325763 1338195 1350685 1362668 1374074 1385062 1395980 1407548 1420656 1435812
$$ packed form
62117A249611J9713J8706J9152K2043K5691K8418L1008L5285M1302M7505N2995
62106A591429N8126O3231O8109P2514P5886P6905P4498O9056O1407N1108L7611
62095B299880K2836J0395J628n675j3806k2321k9800l6589m3909n1319n6941n9737
62083B014642o0141n8990n7213n5891n5073n2905m7730m0761l4834l0657k6346
62072A494101k1017j6494j4320j3134j0707p317n114m737m447k662J32K294K710
62059A399288J234j588m502n906n026k762r36n86j233j925k766m869q609j2402
62045A347412j3908j2485r863q144p687p230n613k863J02K337L442L726L989M987
62031A298202O913R300J1348J2432J2490J1983J1406J0988J0918J1568J3108J5156
$$ plain form
62019 1435812 1453048 1472462 1494557 1519897 1548722 1580933 1615951 1652471 1689120 1725897 1764452
62008 1764452 1806480 1852331 1901643 1954534 2011092 2070111 2129436 2187496 2243526 2296298 2343635
61997 2343635 2383295 2413500 2432601 2439492 2434866 2421111 2400106 2371608 2334353 2288196 2234513 2174929
61985 2174929 2110508 2042240 1971706 1900784 1830708 1761541 1692898 1625401 1561113 1502000 1448117
61974 1448117 1397871 1350133 1305456 1265136 1229702 1198567 1170543 1144421 1119577 1096376 1075575
61963 1075575 1057163 1040322 1024728 1011091 999886 990284 981132 972516 965479 960316 955954 951097 945433
61950 945433 939609 934504 930670 928093 926265 924722 923605 923571 925013 927563 930529 933785 937958 943446 949240
61935 949240 953167 953670 951141 947136 942511 936915 929948 921965 913485 904509 894868 884742 874348 863559
$$ packed form
62019A435812J7236J9414K2095K5340K8825L2211L5018L6520L6649L6777L8555
62008A764452M2028M5851M9312N2891N6558N9019N9325N8060N6030N2772M7337
61997B343635L9660L0205J9101O891m626j3755k1005k8498l7255m6157n3683n9584
61985B174929o4421o8268p0534p0922p0076o9167o8643o7497o4288n9113n3883
61974A448117n0246m7738m4677m0320l5434l1135k8024k6122k4844k3201k0801
61963A075575j8412j6841j5594j3637j1205r602r152q616p037n163m362m857n664
61950I45433n824n105l834k577j828j543j117l4J442K550K966L256M173N488N794
61935I49240L927N03k529m005m625n596o967p983q480q976r641j0126j0394j0789
$$ plain form
61921 863559 852422 841682 832124 823445 814399 804207 793513 783854 776363 770936 766387 761385 755542
61908 755542 749786 745584 743625 743164 742646 741081 738900 737417 737381 738198 738718 738568 738434 739159 741008 743793
61892 743793 747217 750980 754909 759359 765247 773340 783351 793853 803365 811866 821167 833288 848246
61879 848246 864014 879015 893966 910548 928876 947368 964812 981377 997433 1012601 1026398
61868 1026398 1039054 1051178 1063126 1074854 1085816 1094858 1100951 1104101 1104826 1102872 1097643 1090061 1082523
61855 1082523 1076401 1070981 1065819 1062751 1064097 1069779 1077881 1087579 1099787 1114907 1131430 1147303 1161628
61842 1161628 1174524 1186092 1196026 1203807 1208927 1211211 1211029 1208826 1204380 1196938 1186248 1173162 1159067
61829 1159067 1145020 1131412 1118124 1104766 1091001 1076872 1062821 1049397 1036913 1025364 1014601
$$ packed form
61921H63559j1137j0740r558q679r046j0192j0694r659p491n427m549n002n843
61908G55542n756m202j959m61n18j565k181j483l6Q17N20j50j34P25J849K785
61892G43793L424L763L929M450N888Q093J0011J0502R512Q501R301J2121J4958
61879H48246J5768J5001J4951J6582J8328J8492J7444J6565J6056J5168J3797
61868A026398J2656J2124J1948J1728J0962R042O093L150P25j954n229p582p538
61855A082523o122n420n162l068J346N682Q102R698J2208J5120J6523J5873J4325
61842A161628J2896J1568R934P781N120K284j82k203m446p442j0690j3086j4095
61829A159067j4047j3608j3288j3358j3765j4129j4051j3424j2484j1549j0763
$$ plain form
61818 1014601 1004608 995503 987155 979030 970759 962795 956010 950624 945969 941339 936624 932091 928226 925891
61804 925891 925914 928178 931775 936389 942844 951884 963125 975888 990451 1007671 1027620 1049311 1071749
61791 1071749 1094887 1119682 1147263 1177690 1209426 1240627 1270919 1301015 1330384 1356594 1377729
61780 1377729 1394283 1407540 1417059 1421233 1419800 1414360 1406585 1397304 1387362 1378000 1369887 1362665 1356029
61767 1356029 1350788 1348562 1350619 1356881 1365845 1375756 1386178 1397859 1410355 1420540 1424613 1421270 1411742
61754 1411742 1396934 1376113 1348943 1317449 1284911 1253253 1222247 1191033 1159686 1129234 1100628
61743 1100628 1074138 1049808 1028063 1009278 992818 977200 961493 945999 931352 917655 904976
61732 904976 893893 884840 877383 870758 864599 858638 852477 846435 841836 839435 838105 835988 832425 827953
$$ packed form
61818A014601r993r105q348q125q271p964o785n386m655m630m715m533l865k335
61804I25891K3K264L597M614O455R040J1241J2763J4563J7220J9949K1691K2438
61791A071749K3138K4795K7581L0427L1736L1201L0292L0096K9369K6210K1135
61780A377729J6554J3257R519M174j433n440p775r281r942r362q113p222o636
61767A356029n241k226K057O262Q964R911J0422J1681J2496J0185M073l343r528
61754A411742j4808k0821k7170l1494l2538l1658l1006l1214l1347l0452k8606
61743A100628k6490k4330k1745j8785j6460j5618j5707j5494j4647j3697j2679
61732I04976j1083r053p457o625o159n961o161o042m599k401j330k117l563m472
$$ plain form
61718 827953 823296 819476 817913 818718 819459 817419 812895 808667 806458 805660 805378 805618 806048 805541 803839 802230
61702 802230 801771 802009 802094 802021 802161 802654 803809 806015 808690 810421 810749 810700 810994 810936 809811 808225 807155 806630
61684 806630 806139 805367 803693 800069 794533 789051 785645 784174 782950 781055 779122 778131 778340 779245 779967 779851
61668 779851 779036 778163 777425 776641 776397 777971 781481 785121 787096 787544 787765 788498 789941 792496 796093 799249
61652 799249 800243 799213 798088 798518 800657 803708 806582 807999 806923 803289 797871 791467 784665 778275 773311
61637 773311 770229 768424 766548 763430 759011 754454 750927 748159 744712 739670 733384 726528 719449 712744
61623 712744 707298 703146 699388 695937 694150 694709 695970 695681 693532 690822 688451 686621 685703 685715 685442 683734
61607 683734 681408 680183 679938 678762 675863 672725 671038 670971 671889 673316 674606 674952 674450 674161 674571 674987
$$ packed form
61718H27953m657l820j563Q05P41k040m524m228k209p98k82K40M30n07j702j609
61702H02230m59K38Q5p3J40M93J155K206K675J731L28m9K94n8j125j586j070n25
61684H06630m91p72j674l624n536n482l406j471j224j895j933r91K09R05P22j16
61668G79851q15q73p38p84k44J574L510L640J975M48K21P33J443K555L597L156
61652G99249R94j030j125M30K139L051K874J417j076l634n418o404o802o390m964
61637G73311l082j805j876l118m419m557l527k768l447n042o286o856p079o705
61623G12744n446m152l758l451j787N59J261k89k149k710k371j830r18J2k73j708
61607F83734k326j225k45j176k899l138j687o7R18J427J290L46n02k89M10M16
$$ plain form
61591 674987 674887 674748 674967 675164 675343 676745 680508 686087 691743 696054 698362 698647 697837 697590 698735 700371
61575 700371 701217 701328 701439 701169 699173 695110 690347 686379 683355 680482 677216 673568 669631 665369 660866
61560 660866 656472 652578 649180 645705 641444 636312 631123 626988 624371 622609 620152 615520 608505 600598
61546 600598 593784 588704 584409 579941 575450 571303 566859 561054 553827 546112 538567 531261 524534 519044
61532 519044 514616 510058 504765 499864 497003 496443 496913 496911 495505 492384 488137 484328 482264 481522 480494 478500
61516 478500 476516 475622 475718 476233 477141 478480 479594 479786 479309 478837 478314 477208 475683 474555 474118 473880 473559
61499 473559 473544 474232 475527 477133 478721 479734 479705 478950 478471 479143 481361 485140 489660 492995 493590 492183
61483 492183 491180 491853 493268 494233 494902 495752 496314 496030 495427 495334 495640 495871 496354 497736 499824 501872 503616
$$ packed form
61591F74987j00j39K19J97J79J402L763N579N656M311K308K85q10k47J145J636
61575G00371Q46J11J11k70j996m063m763l968l024k873l266l648l937m262m503
61560F60866m394l894l398l475m261n132n189m135k617j762k457m632p015p907
61546F00598o814n080m295m468m491m147m444n805p227p715p545p306o727n490
61532E19044m428m558n293m901k861n60M70kj406l121m247l809k064p42j028j994
61516D78500j984q94R6N15R08J339J114J92m77m72n23j106j525j128m37k38l21
61499D73559j5O88J295J606J588J013k9p55m79O72K218L779M520L335N95j407
61483D92183j003O73J415R65O69Q50N62k84o03r3L06K31M83J382K088K048J744
$$ plain form
61466 503616 505137 506143 506273 505645 504330 501981 498994 497248 498265 501066 503246 503819 503567 502952 501609
61451 501609 500069 500054 502217 504864 505791 504493 502018 499590 498052 497787 498379 498859 498769 498524 498392 497891 496679
61434 496679 495346 494765 495144 496219 497883 500114 502564 504578 505457 504902 503675 503603 505914 509508 511941 512342
61418 512342 512144 512633 513208 512863 512019 511675 511719 511405 510819 510618 510868 511429 513029 516541 521306 525440 527771
61401 527771 528419 527603 525243 521867 518737 516637 515470 515278 516584 519255 522006 523660 524263 524475 524592 524735
61385 524735 525306 526575 528248 530062 532402 535738 539801 543884 547693 551341 554855 558272 561991 566321
61371 566321 570817 574701 577953 581365 585442 589873 594193 598365 602360 605680 607823 609037 610126 611526
61357 611526 612891 613635 613610 613161 612761 612834 613753 615623 617854 619292 619242 618304 617723 617710 616944 614125 609681 605411
$$ packed form
61466E03616J521J006J30o28j315k349k987j746J017K801K180N73k52o15j343
61451E01609j540j5K163K647R27j298k475k428j538k65N92M80r0k45j32n01j212
61434D96679j333n81L79J075J664K231K450K014Q79n55j227p2K311L594K433M01
61418E12342j98M89N75l45q44l44M4l14n86k01K50N61J600L512M765M134K331
61401E27771O48q16k360l376l130k100j167j92J306K671K751J654O03K12J17J43
61385E24735N71J269J673J814K340L336M063M083L809L648L514L417L719M330
61371E66321M496L884L252L412M077M431M320M172L995L320K143J214J089J400
61357F11526J365P44k5m49m00P3R19J870K231J438n0r38n81j3p66k819m444m270
$$ plain form
61339 605411 602637 601206 600086 598246 595031 590595 586345 584164 584546 585873 586135 584989 583558 582640 582111
61324 582111 582024 583154 585779 588643 589981 589567 589145 590653 594316 598617 601923 603916 605614 608323 612637
61309 612637 618073 623291 626838 628206 628407 629234 631724 635461 639372 642790 645641 648231 651331 655986 662519
61294 662519 669883 676675 682659 688748 695629 703200 711385 720547 730664 740694 749280 755765 760371 763889
61280 763889 767441 771863 776793 780805 783109 784841 788153 794042 801476 808397 813198 815414 815629 814861 813847
61265 813847 812815 811976 811868 812772 813987 814212 812845 810688 809298 809786 812222 815927 820186 824763 829889
61250 829889 835943 843211 851852 861868 873072 885255 898271 911708 924535 935493 943965 950220
61238 950220 954893 958566 961771 964648 966414 965826 962665 958270 954162 950466 946138 940306 932861 924039
$$ packed form
61339F05411k774j431j120j840l215m436m250k181L82J327K62j146j431r18n29
61324E82111q7J130K625K864J338m14m22J508L663M301L306J993J698K709M314
61309F12637N436N218L547J368K01Q27K490L737L911L418K851K590L100M655O533
61294F62519P364O792N984O089O881P571Q185R162J0117J0030Q586O485M606L518
61280G63889L552M422M930M012K304J732L312N889P434O921M801K216K15p68j014
61265H13847j032q39j08R04J215K25j367k157j390M88K436L705M259M577N126
61250H29889O054P268Q641J0016J1204J2183J3016J3437J2827J0958Q472O255
61238I50220M673L673L205K877J766n88l161m395m108l696m328n832p445q822
$$ plain form
61224 924039 914204 904088 894663 886603 880033 874861 871064 868632 867321 866556 865736 864937 865248 867916 872978
61209 872978 879138 885143 890787 896264 901221 905085 908092 911461 916615 924491 935192 947814 960787
61196 960787 972857 983686 993363 1001706 1008465 1013924 1018788 1023490 1027822 1031008 1032135 1031034 1028941 1027620
61182 1027620 1027367 1026594 1023963 1020238 1017112 1014910 1012628 1009835 1007194 1005024 1002662 999778 997343 996643 997901
61167 997901 1000409 1003602 1007519 1012441 1018543 1025766 1033673 1041423 1048168 1053690 1058616 1063838 1069620 1075431
61153 1075431 1080825 1086160 1091959 1097776 1102502 1105925 1109224 1113568 1118937 1124617 1130130 1135180 1139523 1143576
61139 1143576 1148594 1155650 1164959 1176625 1191124 1208221 1226274 1243570 1259715 1274771 1288026 1298931
61127 1298931 1308525 1318305 1328021 1336133 1342248 1347497 1352502 1356498 1358728 1359345 1358706 1357024 1354955 1353153
$$ packed form
61224I24039r835j0116r425q060o570n172l797k432j311p65q20p99L11K668N062
61209H72978O160O005N644N477M957L864L007L369N154P876J0701J2622J2973
61196I60787J2070J0829R677Q343O759N459M864M702M332L186J127j101k093j321
61182A027620k53p73k631l725l126k202k282k793k641k170k362k884k435p00J258
61167I97901K508L193L917M922O102P223P907P750O745N522M926N222N782N811
61153A075431N394N335N799N817M726L423L299M344N369N680N513N050M343M053
61139A143576N018P056R309J1666J4499J7097J8053J7296J6145J5056J3255J0905
61127A298931R594R780R716Q112O115N249N005L996K230O17o39j682k069j802
$$ plain form
61113 1353153 1350897 1346473 1339452 1331387 1323770 1316486 1308882 1301059 1293176 1284426 1273823 1261475 1248292
61100 1248292 1234856 1221278 1207757 1194613 1181954 1169819 1158557 1148729 1140649 1133999 1127788 1121048
61088 1121048 1114021 1108225 1104537 1101544 1096710 1089037 1079586 1069608 1059502 1049738 1041381 1035015 1030024 1025348
61074 1025348 1020308 1014710 1009141 1005182 1004108 1005340 1007473 1010845 1017312 1027167 1038370 1049773 1063143
61061 1063143 1080512 1101134 1122872 1145424 1170185 1197570 1226361 1255526 1285138 1315486 1346569
61050 1346569 1378594 1411985 1446664 1481833 1516259 1548423 1577091 1602551 1626628 1650436 1672580
61039 1672580 1690609 1703712 1712704 1717770 1717768 1711974 1701247 1687056 1670353 1651739 1631811 1610738 1588049
61026 1588049 1563421 1537416 1511104 1485132 1459419 1433654 1407994 1383285 1360487 1339803 1320570
$$ packed form
61113A353153k256m424p021q065p617p284p604p823p883q750j0603j2348j3183
61100A248292j3436j3578j3521j3144j2659j2135j1262r828q080o650o211o740
61088A121048p027n796l688k993m834p673r451r978j0106r764q357o366m991m676
61074A025348n040n598n569l959j074J232K133L372O467R855J1203J1403J3370
61061A063143J7369K0622K1738K2552K4761K7385K8791K9165K9612L0348L1083
61050A346569L2025L3391L4679L5169L4426L2164K8668K5460K4077K3808K2144
61039A672580J8029J3103Q992N066kn794j0727j4191j6703j8614j9928k1073k2689
61026A588049k4628k6005k6312k5972k5713k5765k5660k4709k2798k0684j9233
$$ plain form
61015 1320570 1302173 1284759 1268904 1254887 1242775 1232999 1226360 1223237 1222936 1223997 1225382 1227496 1231786
61002 1231786 1239088 1248773 1259966 1273015 1288865 1307457 1328131 1351562 1379681 1413135 1450178 1488844
60990 1488844 1529055 1571648 1616497 1662981 1711723 1764544 1822813 1886841 1956849 2033620 2117860
60979 2117860 2209255 2306466 2408291 2515099 2628864 2751188 2881380 3017195 3157282 3302101
60969 3302101 3452728 3610090 3775504 3950705 4137087 4335993 4549562 4779735 5026366
60960 5026366 5288176 5565858 5862661 6182392 6529980 6914765 7350532 7851640 8432434
60951 8432434 9111306 9910721 10850938 11947997 13220302 14691243 16381384 18305494 20480088
60942 20480088 22908525 25515738 28081308 30271883 31799097 32587096 32800799 32721125 32599691
$$ packed form
61015A320570j8397j7414j5855j4017j2112r776o639l123l01J061J385K114M290
61002A231786P302R685J1193J3049J5850J8592K0674K3431K8119L3454L7043L8666
60990A488844M0211M2593M4849M6484M8742N2821N8269O4028P0008P6771Q4240
60979B117860R1395R7211J01825J06808J13765J22324J30192J35815J40087J44819
60969C302101J50627J57362J65414J75201J86382J98906K13569K30173K46631
60960E026366K61810K77682K96803L19731L47588L84785M35767N01108N80794
60951H432434O78872P99415R40217J097059J272305J470941J690141J924110K174594
60942B0480088K428437K607213K565570K190575J527214P87999K13703p9674j21434
$$ plain form
60933 32599691 32607419 32847040 33328707 33900872 34245420 34011536 33007864 31293572 29106017
60924 29106017 26714365 24322516 22054514 19975005 18105028 16435418 14945647 13617397
60916 13617397 12434876 11381884 10444799 9615063 8884323 8239371 7665255 7151331 6691257
60907 6691257 6278951 5907935 5573541 5272734 5002186 4758759 4541207 4349111 4180463
60898 4180463 4032040 3901513 3787152 3685844 3593455 3507209 3426220 3349914 3277677 3210142
60888 3210142 3148985 3094686 3045430 2998655 2952866 2907663 2862778 2817572 2771044 2722020 2669687
60877 2669687 2614184 2556605 2498204 2439424 2379618 2318020 2255290 2193600 2134470 2076945 2019070
60866 2019070 1960935 1904665 1851195 1798895 1746344 1694960 1647436 1604478 1564470 1525746 1487941
$$ packed form
60933C2599691P728K39621M81667N72165L44548k33884j003672j714292k187555
60924B9106017k391652k391849k268002k079509j869977j669610j489771j328250
60916A3617397j182521j052992r37085q29736p30740o44952n74116n13924m60074
60907F691257m12306l71016l34394l00807k70548k43427k17552j92096j68648
60898D180463j48423j30527j14361j01308r2389q6246q0989p6306p2237o7535
60888C210142o1157n4299m9256m6775m5789m5203m4885m5206m6528m9024n2333
60877B669687n5503n7579n8401n8780n9806o1598o2730o1690n9130n7525n7875
60866B019070n8135n6270n3470n2300n2551n1384m7524m2958m0008l8724l7805
$$ plain form
60855 1487941 1451442 1416790 1384638 1355474 1329159 1305075 1282618 1261532 1242243 1225854 1212913
60844 1212913 1201999 1190695 1178378 1166810 1157355 1149088 1140714 1132869 1126920 1122556 1118302 1113753 1109519
60831 1109519 1105323 1099902 1092725 1084346 1075014 1064342 1052485 1040429 1028791 1017297 1005445 992834
60819 992834 979080 964582 951216 940863 933067 925453 916701 907782 899920 892781 885485 878146 871335
60806 871335 864886 858333 851991 846484 841438 835714 828912 821900 815679 810437 806038 802822 801319 801269 801413
60791 801413 800390 797534 792764 786253 778729 771729 766658 763422 760634 757412 754289 752006 750062 747154
60777 747154 742574 736577 729783 722974 717208 713271 710926 709245 707695 706448 705756 705668 706407 708340 711285
60762 711285 714218 716022 716513 716598 717403 719120 720711 721009 720181 719703 720613 722142 722408 720082 715104 708356
$$ packed form
60855A487941l6499l4652l2152k9164k6315k4084k2457k1086j9289j6389j2941
60844A212913j0914j1304j2317j1568r455q267q374p845n949m364m254m549m234
60831A109519m196n421p177q379r332j0672j1857j2056j1638j1494j1852j2611
60819I92834j3754j4498j3366j0353p796p614q752q919p862p139p296p339o811
60806H71335o449o553o342n507n046n724o802p012o221n242m399l216j503n0J44
60791H01413j023k856m770o511p524p000n071l236k788l222l123k283j944k908
60777G47154m580n997o794o809n766l937k345j681j550j247o92q8P39J933K945
60762G11285K933J804M91Q5Q05J717J591K98q28m78R10J529K66k326m978o748
$$ plain form
60746 708356 701334 695820 692948 692412 693011 693958 695135 696108 695635 692671 687710 682758 679626 678161 676265
60731 676265 671987 665436 658213 651105 643209 633671 623453 614664 608612 605039 602836 600820 598171 594862
60717 594862 591588 588884 586597 584622 583605 584156 585709 587005 587556 587953 588895 590579 592938 595815 598948
60702 598948 602349 606488 611489 616421 620093 622356 623934 625205 626119 627112 629089 632329 636247 640286 644214
60687 644214 647572 649956 652051 655189 659293 662305 662397 659933 656403 652164 646328 638545 629728 620862 611966
60672 611966 602626 593068 584256 577063 571639 567484 563937 560460 556652 552395 548130 544675 542325 540262
60658 540262 537352 533599 530358 528907 529193 530292 531656 533218 534304 533322 529337 523852 520177 520489 523855
60643 523855 527612 530269 532233 534025 535132 535210 535351 537080 540445 543973 546312 547326 547830 549028 552003
$$ packed form
60746G08356p022n514k872n36N99R47J177R73m73k964m961m952l132j465j896
60731F76265m278o551p223p108p896r538j0218q789o052l573k203k016k649l309
60717E94862l274k704k287j975j017N51J553J296N51L97R42J684K359K877L133
60702E98948L401M139N001M932L672K263J578J271R14R93J977L240L918M039L928
60687F44214L358K384K095L138M104L012R2k464l530m239n836p783q817q866q896
60672F11966r340r558q812p193n424m155l547l477l808m257m265l455k350k063
60658E40262k910l753l241j451K86J099J364J562J086r82l985n485l675L12L366
60643E23855L757K657J964J792J107P8J41J729L365L528K339J014N04J198K975
$$ plain form
60628 552003 556922 562626 567553 571174 574165 577397 581378 586506 593015 600436 607623 613630 618370 622560
60614 622560 627237 632964 639004 643607 645813 646662 647837 649496 650426 650053 648955 647358 644575 640372 635499
60599 635499 630301 624182 617428 612206 610252 610438 610213 609099 609023 611154 614059 615561 615277 614532 614532 615488 617021
60582 617021 618577 619465 619025 616814 612571 606313 598822 591711 586405 583033 580623 578338 576138 574266 572630
60567 572630 570986 569465 568616 568931 570369 572272 573822 574853 576163 578683 582264 585676 587954 589208 589832
60552 589832 589546 587902 585403 583376 582720 583308 584533 585820 586642 586699 586362 586578 588128 591168 595209 599152
60536 599152 601656 602297 602297 603377 605853 608607 610805 612587 614016 614612 614489 614859 616702 619633 622706 625603
60520 625603 628520 631743 635941 642037 650046 658875 668034 678612 691614 706205 720777 735095 750177
$$ packed form
60628E52003M919N704M927L621K991L232L981N128O509P421P187O007M740M190
60614F22560M677N727O040M603K206Q49J175J659R30l73j098j597k783m203m873
60599F35499n198o119o754n222j954J86k25j114p6K131K905J502k84p45%R56J533
60582F17021J556Q88m40k211m243o258p491p111n306l372k410k285k200j872j636
60567E72630j644j521q49L15J438J903J550J031J310K520L581L412K278J254O24
60552E89832k86j644k499k027o56N88J225J287Q22N7l37K16J550L040M041L943
60536E99152K504O41%J080K476K754K198J782J429N96j23L70J843K931L073K897
60520F25603K917L223M198O096Q009Q829R159J0578J3002J4591J4572J4318J5082
$$ plain form
60507 750177 766590 784050 802109 819859 835283 846420 853202 857028 858604 857413 853306 847395 841191
60494 841191 835815 832035 829982 828793 827554 826788 828071 832226 838934 847972 859571 873475 889142 907187
60480 907187 929140 954968 981997 1007139 1029412 1049583 1068102 1084199 1096473 1103749 1105766 1103543
60468 1103543 1098807 1092829 1086162 1079381 1073211 1067762 1062469 1057125 1052273 1048300 1044933 1041931 1039636 1038626
60454 1038626 1039499 1042948 1049155 1057113 1065748 1075749 1088794 1104743 1121466 1138417 1158699 1186127
60442 1186127 1221505 1263261 1310608 1364039 1423175 1486017 1550567 1615839 1681044 1744738 1804939
60431 1804939 1859292 1905070 1939761 1961769 1970058 1963497 1941538 1905527 1858436 1803055 1741024 1673613
60419 1673613 1602740 1530914 1460609 1393730 1331173 1272764 1217892 1166274 1118077 1073745 1034140
$$ packed form
60507G50177J6413J7460J8059J7750J5424J1137O782L826J576j191m107n911o204
60494H41191n376l780k053j189j239p66J283M155O708R038J1599J3904J5667J8045
60480I07187K1953K5828K7029K5142K2273K0171J8519J6097J2274P276K017k223
60468A103543m736n978o667o781o170n449n293n344m852l973l367l002k295j010
60454A038626Q73L449O207P958Q635J0001J3045J5949J6723J6951K0282K7428
60442A186127L5378M1756M7347N3431N9136O2842O4550O5272O5205O3694O0201
60431A804939N4353M5778L4691K2008Q289o561k1959l6011m7091n5381o2031o7411
60419A673613p0873p1826p0305o6879o2557n8409n4872n1618m8197m4332l9605
$$ plain form
60408 1034140 1000320 972302 948143 925120 901954 879364 858422 839190 821269 804924 790908
60397 790908 779300 769081 759015 748772 738962 730160 722222 714768 707968 702296 697610 693141 688556
60384 688556 684358 680908 677631 673642 668770 663598 658952 655681 654291 654132 653435 650880 646980 643395 641254
60369 641254 640631 641090 641866 641816 640158 637361 634681 632920 632194 632588 634050 635669 636081 634981 633543 633083
60353 633083 633887 635556 637755 640105 641953 642903 643377 644082 645054 645652 645536 645279 645842 647621 650182 652822
60337 652822 655146 657067 658615 660116 662330 665811 670042 673712 676124 677853 679776 682018 684354 687189
60323 687189 691337 696852 702585 707013 709390 710377 711830 715588 721873 729002 735008 739239 742061 743660
60309 743660 744089 744195 745310 747754 750526 752886 755418 758910 762790 765515 766492 766974 768876 773069 779077
$$ packed form
60408A034140l3820k8018k4159k3023k3166k2590k0942j9232j7921j6345j4016
60397G90908j1608j0219j0066j0243r810q802p938p454o800n672m686m469m585
60384F88556m198l450l277l989m872n172m646l271j390j59o97k555l900l585k141
60369F41254o23M59P76n0j658k797k680j761p26L94J462J619M12j100j438m60
60353F33083Q04J669K199K350J848R50M74P05R72N98j16k57N63J779K561K640
60337F52822K324J921J548J501K214L481M231L670K412J729J923K242K336K835
60323F87189M148N515N733M428K377R87J453L758O285P129O006M231K822J599
60309G43660M29J06J115K444K772K360K532L492L880K725R77M82J902M193O008
$$ plain form
60294 779077 786098 793821 802183 810897 819655 828479 837128 844260 848096 848285 846477 844550 842872 840768
60280 840768 838009 834990 831960 829121 827222 827016 828049 828887 828784 828388 828566 829151 829060 827168 822996 817188
60264 817188 811527 807812 806362 806022 805804 805987 807372 810120 813802 818060 822713 827542 832564 838449 846331
60249 846331 857247 871812 890010 910974 933227 955511 977180 997574 1015374 1028992 1037368 1040040
60237 1040040 1036778 1027769 1014055 997143 978174 958028 938190 920559 905829 892791 880124 868580
60225 868580 860365 856212 854106 851464 847824 844531 842285 840200 837293 833786 830448 827449 824574 821950
60211 821950 819755 817441 814065 809522 804960 801761 800351 800053 799865 799278 798438 797503 795963 792862 787856
60196 787856 781772 775988 771560 769024 768358 768639 768308 766599 764553 763982 765558 768536 772095 775983 779790
$$ packed form
60294G79077P021P723Q362Q714Q758Q824Q649P132L836J89j808j927j678k104
60280H40768k759l019l030k839j899k06J033Q38j03l96J78N85r1j892m172n808
60264H17188n661l715j450l40k18J83J385K748L682M258M653M829N022N885P882
60249H46331J0916J4565J8198K0964K2253K2284K1669K0394J7800J3618Q376K672
60237A040040l262r009j3714j6912j8969k0146j9838j7631j4730j3038j2667j1544
60225H68580q215m153k106k642l640l293k246k085k907l507l338k999k875k624
60211H21950k195k314l376m543m562l199j410k98j88n87q40r35j540l101n006
60196G87856o084n784m428k536o66K81l31j709k046n71J576K978L559L888L807
$$ plain form
60181 779790 782718 784614 786421 788814 790906 791299 790313 790193 792614 796604 799624 800539 800684 801853 804140
60166 804140 806502 808753 811565 814518 815746 814425 812516 812879 816319 821679 828155 835964 844797 853370
60152 853370 861078 868834 877535 886592 894769 901835 908688 916387 925612 936458 948021 958607 967033
60139 967033 973495 978764 983179 987188 992197 999567 1008734 1017389 1023845 1028447 1032388 1035916 1038205 1038369
60125 1038369 1035914 1030521 1022174 1011690 1000685 990693 982264 974967 968189 961864 956284 951275 946027
60112 946027 940132 934551 930834 929128 927590 924216 918927 913353 908921 905866 903947 903159 903347 903707 903305
60097 903305 901943 900257 899197 899592 901713 904846 907605 909241 910372 911944 913841 915237 916019 916894 918236
60082 918236 919985 922917 928629 937414 947110 955236 961766 968746 977461 987098 996091 1003638 1009617 1014051
$$ packed form
60181G79790K928J896J807K393K092L93r86j20K421L990L020R15J45J169K287
60166H04140K362K251K812K953J228j321j909L63L440N360O476P809Q833Q573
60152H53370P708P756Q701R057Q177P066O853P699R225J0846J1563J0586Q426
60139I67033O462N269M415M009N009P370R167Q655O456M602L941L528K289J64
60125A038369k455n393q347j0484j1005r992q429p297o778o325n580n009n248
60112I46027n895n581l717j706j538l374n289n574m432l055j919p88J88L60m02
60097I03305j362j686j060L95K121L133K759J636J131J572J897J396P82Q75J342
60082I18236J749K932N712Q785R696Q126O530O980Q715R637Q993P547N979M434
$$ plain form
60068 1014051 1017308 1020210 1023336 1026481 1029182 1031502 1033920 1036709 1039843 1043330 1047179 1050951 1053754 1054967
60054 1054967 1054992 1055127 1056579 1059545 1063316 1067143 1070696 1073627 1075135 1074521 1072079 1068916 1065839 1062829 1059724
60039 1059724 1056810 1054264 1051468 1047631 1043104 1039366 1037298 1035980 1033785 1030454 1027383 1025768 1025179 1024309
60025 1024309 1022537 1020193 1017747 1015567 1014247 1014160 1014496 1013599 1010722 1006837 1003266 1000060 996288 991433 985691
60010 985691 979038 970761 960163 947422 933669 920449 909033 899903 892640 886286 879832 872554 864300
59997 864300 855636 847545 840788 835624 832019 829710 828063 826385 824613 823322 822969 823576 825211 828093 831924
59982 831924 835819 839350 843111 847812 853399 859435 865509 870711 873651 874051 873737 874840 877366 879554 880359
59967 880359 880362 880297 879840 878135 874643 869241 862203 854325 846527 839170 832137 825371 818739 811730 804125 796783
$$ packed form
60068A014051L257K902L126L145K701K320K418K789L134L487L849L772K803J213
60054A054967K5J35J452K966L771L827L553K931J508o14k442l163l077l010l105
60039A059724k914k546k796l837m527l738k068j318k195l331l071j615n89q70
60025A024309j772k344k446k180j320q7L36q97k877l885l571l206l772m855n742
60010I85691o653q277j0598j2741j3753j3220j1416r130p263o354o454p278q254
59997H64300q664q091o757n164l605k309j647j678j772j291l53O07J635K882L831
59982H31924L895L531L761M701N587O036O074N202K940M00l14J103K526K188Q05
59967H80359Lo5m57j705l492n402p038p878p798p357p033o766o632p009p605p342
$$ plain form
59951 796783 790801 785961 781026 775433 769563 763344 756006 747686 739982 734185 729888 726050 722493 719535
59937 719535 716976 714480 712472 711663 711904 712339 712606 713210 714738 717247 720537 724589 729516 735154 740778
59922 740778 745416 748683 751160 753585 755817 757152 757585 757953 758604 758776 757757 756022 754581 753621 752513
59907 752513 751010 749784 749619 750307 750569 749192 746409 743957 743488 745065 747499 749824 751827 753435 754505
59892 754505 755261 756012 756288 755162 752681 750074 748200 746727 745259 744279 744330 745142 746344 748242 750992 753662
59876 753662 755124 755500 755914 757129 759146 761735 764481 766634 767807 768691 770421 773446 777672 783379 791000
59861 791000 800031 809038 817004 824189 831632 840233 850210 860951 871349 880583 888402 894482 898143 899364
59847 899364 899555 900368 901973 903379 904193 904998 906081 906943 907263 907289 906911 905375 902586 899922 899053 900343 902921
$$ packed form
59951G96783n982m840m935n593n870o219p338q320p704n797m297l838l557k958
59937G19535k559k496k008q09K41M35K67O04J528K509L290M052M927N638N624
59922G40778M638L267K477K425K232J335M33L68O51J72j019j735j441r60j108
59907G52513j503j226j65O88K62j377k783k452m69J577K434K325K003J608J070
59892G54505P56P51K76j126k481k607j874j473j468r80N1Q12J202J898K750K670
59876G53662J462L76M14J215K017K589K746K153J173Q84J730L025M226N707P621
59861G91000R031R007P966P185P443Q601R977J0741J0398R234P819O080L661J221
59847H99364J91Q13J605J406Q14Q05J083Q62L20K6l78j536k789k664q69J290K578
$$ plain form
59830 902921 905793 908346 910278 911790 913754 917041 921644 926788 931827 936730 941834 947499 953946 961105
59816 961105 968549 975770 982489 988531 993528 997087 999263 1000536 1001176 1000797 998745 994846 989732 984605 980821
59801 980821 979508 981118 985105 990238 995478 1000587 1005841 1011422 1017384 1024006 1031498 1039125 1045058 1047558
59787 1047558 1046342 1042697 1038505 1035306 1033808 1033654 1033523 1031864 1027755 1021065 1012001 1000924 988588 976060
59773 976060 964105 952962 942969 935046 929934 926972 924252 920396 915835 911942 909159 906570 903269 899454
59759 899454 895936 893160 891189 890216 890371 891094 891240 889995 887506 884721 882833 882542 883326 883539 881712 877786
59743 877786 872809 867787 863432 860663 860114 860859 860597 857851 853474 849423 846493 843862 840554 836637 832879
59728 832879 829742 826997 824212 821358 818706 816137 813096 809659 807196 807010 808313 808516 805958 801625 797820
$$ packed form
59830I02921K872K553J932J512J964L287M603N144N039M903N104N665O447P159
59816I61105P444P221O719O042M997L559K176J273O40l79k052l899n114n127l784
59801I80821j313J610L987N133N240N109N254N581N962O622P492P627N933K500
59787A047558j216l645m192l199j498j54j31j659m109o690r064j1077j2336j2528
59773I76060j1955j1143r993p923n112k962k720l856m561l893k783k589l301l815
59759H99454l518k776j971r73J55P23J46j245k489k785j888k91P84K13j827l926
59743H77786m977n022m355k769n49P45k62k746m377m051k930k631l308l917l758
59728H32879l137k745k785k854k652k569l041l437k463j86J303K03k558m333l805
$$ plain form
59713 797820 795831 795419 795866 796615 797260 797741 798566 800341 803090 806370 809945 813953 818593 823975 830175 837173
59697 837173 844755 852623 860410 867749 874755 882450 891840 902283 911558 918153 922887 927673 933406 939765
59683 939765 946320 952670 957921 961391 963870 967074 971638 976447 980057 981941 982236 981300 979895 978856 977991
59668 977991 976019 972234 967692 964135 962195 961258 960573 959640 957835 954784 951376 949455 949870 951256 951355 949369
59652 949369 946470 944132 942648 941435 940148 938958 938080 937609 937717 938501 939683 941022 943017 946501 951264
59637 951264 955707 958447 959883 961553 964204 967193 969804 972325 975366 978598 980917 981860 982230 982973 983806
59622 983806 983493 981421 978371 975647 973935 973121 972613 971404 968418 963468 957593 951889 946389 940720 935298
59607 935298 930839 926881 922063 916057 910221 906062 903956 903607 904669 906374 907630 908316 909696 912737 916651
$$ packed form
59713G97820j989m12M47P49O45M81Q25J775K749L280L575M008M640N382O200O998
59697H37173P582P868P787P339P006P695R390J0443R275O595M734M786N733O359
59683I39765O555O350N251L470K479L204M564M809L610J884K95r36j405j039q65
59668I77991j972l785m542l557j940r37o85r33j805l051l408j921M15J386R9j986
59652I49369k899k338j484j213j287j190q78m71J08P84J182J339J995L484M763
59637I51264M443K740J436J670K651K989K611K521L041L232K319R43L70P43Q33
59622I83806l13k072l050k724j712q14n08j209k986m950n875n704n500n669n422
59607I35298m459l958m818o006n836m159k106l49J062J705J256O86J380L041L914
$$ plain form
59592 916651 920003 922766 926224 931045 936299 940388 942308 941983 939974 936962 933235 928655 923320 918016
59578 918016 913617 910132 906756 902988 899506 897739 898361 900175 900831 898929 895029 890378 885447 880573 877029
59563 877029 875675 874831 871535 865361 859090 854771 850968 845270 837909 831113 825931 821696 818175 816329
59549 816329 816768 818748 820913 822253 822455 822100 822310 823407 824231 823571 821850 820447 819852 819600 819690 820733 822753
59532 822753 824913 826557 827596 827879 827062 825217 822916 820790 819539 819885 821569 822784 821766 818827 815797
59517 815797 813649 811866 810015 808528 807639 806720 805235 803513 802143 801279 800852 800900 801403 802167 802939 803319 802826
59500 802826 801626 800922 801924 804596 807983 811285 813829 814739 814037 813757 816404 822060 828317 833332 837820
59485 837820 843711 851997 862299 873543 884549 894909 905990 920565 940820 966474 994352 1019237
$$ packed form
59592I16651L352K763L458M821N254M089J920l25k009l012l727m580n335n304
59578I18016m399l485l376l768l482j767O22J814O56j902l900m651m931m874l544
59563H77029j354q44l296o174o271m319l803n698p361o796n182m235l521j846
59549H16329M39J980K165J340K02l55K10J097Q24o60j721j403n95k52R0J043K020
59532H22753K160J644J039K83q17j845k301k126j251L46J684J215j018k939l030
59517H15797k148j783j851j487q89r19j485j722j370q64m27M8N03P64P72L80m93
59500H02826j200p04J002K672L387L302K544R10p02k80K647N656O257N015M488
59485H37820N891Q286J0302J1244J1006J0360J1081J4575K0255K5654K7878K4885
$$ plain form
59473 1019237 1035886 1041877 1039048 1031559 1022533 1013059 1003782 995854 990075 986346 984333 983779 984079 984580
59459 984580 985406 986987 988751 989494 989113 988648 988324 986873 983249 977826 971464 964550 957394 950391 943257
59444 943257 935204 926391 918070 910794 903662 895996 888775 883603 880968 879977 879089 876946 873518 870620 870120
59429 870120 871452 872282 871791 871595 873046 875572 878589 882909 888878 894900 899632 904249 910649 918474 925751
59414 925751 931715 937150 942520 947534 952227 956844 960828 963318 964541 965452 966288 966644 966570 966348 965675 964595
59398 964595 964913 968865 976309 984800 992800 1001277 1011604 1023321 1034913 1045823 1056657 1067902 1079269
59385 1079269 1090052 1099431 1106353 1109665 1108824 1104568 1098594 1092161 1085066 1076541 1067110 1058594 1051915 1045955
59371 1045955 1039464 1033198 1028920 1026776 1025108 1022900 1021168 1021581 1024715 1030236 1038022 1048366 1061350 1076765
$$ packed form
59473A019237J6649N991k829p489r026r474r277p928n779l729k013n54L00N01
59459I84580Q26J581J764P43l81m65l24j451l624n423o362o914p156p003p134
59444I43257q053q813q321p276p132p666p221n172k635r91q88k143l428k898n00
59429H70120J332Q30m91j96J451K526L017M320N969O022M732M617O400P825P277
59414I25751N964N435N370N014M693M617L984K490J223R11Q36L56p4k22o73j080
59398I64595L18L952P444Q491Q000Q477J0327J1717J1592J0910J0834J1245J1367
59385A079269J0783R379O922L312q41m256n974o433p095q525r431q516o679n960
59371A045955o491o266m278k144j668k208j732M13L134N521P786J0344J2984J5415
$$ plain form
59357 1076765 1094825 1116502 1142608 1172591 1205031 1239790 1278613 1321847 1364448 1397135 1412843
59346 1412843 1411669 1399323 1382271 1365205 1351233 1341841 1336736 1335513 1339373 1349205 1361516 1368188 1361817
59333 1361817 1341038 1310303 1275511 1240712 1208035 1178911 1154320 1134207 1117386 1102447 1088807
59322 1088807 1076828 1067094 1059901 1055286 1052960 1052076 1051643 1051467 1052102 1053547 1054791 1055299 1056268 1059421 1064845
59307 1064845 1070928 1076315 1080995 1085445 1089696 1093729 1098190 1104060 1111612 1120023 1128130 1135538 1142835 1150671
59293 1150671 1158885 1167021 1175460 1185320 1197115 1210212 1223943 1238541 1254458 1271254 1287738 1303081
59281 1303081 1317574 1332530 1349296 1367626 1384983 1398327 1406968 1412820 1417662 1421248 1422468 1420915
59269 1420915 1416384 1408178 1396322 1382548 1368640 1354405 1338659 1321686 1305228 1290376 1276942 1264845
$$ packed form
59357A076765J8060K1677K6106K9983L2440L4759L8823M3234M2601L2687J5708
59346A412843j174j2346j7052j7066j3972r392n105j223L860R832J2311O672o371
59333A361817k0779l0735l4792l4799l2677k9124k4591k0113j6821j4939j3640
59322A088807j1979r734p193m615k326q84m33j76O35J445J244N08R69L153N424
59307A064845O083N387M680M450M251M033M461N870P552Q411Q107P408P297P836
59293A150671Q214Q136Q439R860J1795J3097J3731J4598J5917J6796J6484J5343
59281A303081J4493J4956J6766J8330J7357J3344Q641N852M842L586J220j553
59269A420915m531q206j1856j3774j3908j4235j5746j6973j6458j4852j3434j2097
$$ plain form
59257 1264845 1254658 1246608 1240108 1234533 1229615 1225238 1221850 1220904 1223653 1229364 1235840 1241902 1248323 1256050
59243 1256050 1264589 1272415 1277774 1278480 1272127 1257802 1237453 1214820 1192900 1172541 1153118 1134115
59231 1134115 1116015 1099914 1086373 1074811 1064210 1054309 1045825 1039498 1035217 1032160 1029643 1027626 1026310
59218 1026310 1025393 1024299 1023453 1024670 1029415 1037012 1045703 1055293 1067250 1081979 1097687 1112688 1127272
59205 1127272 1142127 1156322 1168395 1178479 1187697 1196032 1202264 1205590 1205926 1203082 1197112 1189274 1181318
59192 1181318 1173927 1166878 1160304 1154398 1148269 1140760 1132464 1125488 1121012 1118380 1116748 1116324 1117546 1120172
59178 1120172 1123656 1127740 1132397 1137776 1144186 1151460 1158547 1164506 1169701 1175159 1181057 1186697 1191496 1194945
59164 1194945 1196171 1194887 1192352 1189890 1186869 1181792 1175055 1168630 1163089 1157061 1150011 1143412 1138351 1133854
$$ packed form
59257A264845j0187q050o500n575m918m377l388r46K749N711O476O062O421P727
59243A256050Q539P826N359P06o353j4325k0349k2633k1920k0359j9423j9003
59231A134115j8100j6101j3541j1562j0601r901q484o327m281l057k517k017j316
59218A026310r17j094q46J217M745P597Q691R590J1957J4729J5708J5001J4584
59205A127272J4855J4195J2073J0084R218Q335O232L326L36k844n970p838p956
59192A181318p391p049o574n906o129p509q296o976m476k632j632m24J222K626
59178A120172L484M084M657N379O410P274P087N959N195N458N898N640M799L449
59164A194945J226j284k535k462l021n077o737o425n541o028p050o599n061m497
$$ plain form
59150 1133854 1128620 1122970 1118013 1114147 1111246 1109151 1107131 1104129 1100424 1097852 1097341 1097306 1095523 1091585 1086544
59135 1086544 1081328 1076817 1074507 1075298 1077843 1079437 1078641 1076241 1073886 1072744 1073393 1076015 1080273 1085360 1090412
59120 1090412 1094958 1099224 1104075 1110269 1117561 1124887 1131521 1137638 1143723 1149985 1156474 1163208 1170007 1176792
59106 1176792 1184037 1192262 1201085 1209662 1218083 1227205 1236759 1244799 1249788 1252418 1254606 1257201 1259203 1258722
59092 1258722 1254309 1246020 1235708 1225727 1216801 1207544 1196341 1183137 1169146 1155552 1142911 1131170
59080 1131170 1119755 1108147 1096646 1086043 1076364 1066803 1057143 1048330 1041147 1035194 1029699 1024415 1019142
59067 1019142 1013365 1007316 1002674 1001226 1003154 1007385 1013184 1020537 1029239 1038421 1047118 1054964 1062430 1070529
59053 1070529 1079986 1090570 1101535 1112619 1123906 1134639 1143208 1148890 1152884 1157038 1162082 1167652 1173391
$$ packed form
59150A133854n234n650m957l866k901k095k020l002l705k572n11l5j783l938n041
59135A086544n216m511k310P91K545J594p96k400k355j142O49K622M258N087N052
59120A090412M546M266M851O194P292P326O634O117O085O262O489O734O799O785
59106A176792P245Q225Q823Q577Q421R122R554Q040M989K630K188K595K002m81
59092A258722m413q289j0312r981q926r257j1203j3204j3991j3594j2641j1741
59080A131170j1415j1608j1501j0603r679r561r660q813p183n953n495n284n273
59067A019142n777o049m642j448J928M231N799P353Q702R182Q697P846P466Q099
59053A070529R457J0584J0965J1084J1287J0733Q569N682L994M154N044N570N739
$$ plain form
59040 1173391 1179203 1184599 1188429 1189538 1187761 1184470 1181871 1181182 1181535 1181140 1179249 1176332 1172854 1169133 1166082
59025 1166082 1164496 1163423 1160834 1156315 1151502 1147275 1142186 1134620 1124966 1114512 1103578 1092213 1081553
59012 1081553 1072812 1065569 1058497 1051335 1044825 1039230 1034267 1030101 1026991 1024066 1019880 1014391 1009298 1006088
58998 1006088 1004555 1003496 1002247 1001149 1000787 1001078 1001269 1000969 1000948 1002299 1004828 1007148 1008512 1009584 1011013
58983 1011013 1012345 1013027 1013520 1014519 1015863 1017164 1018859 1021699 1025765 1030763 1036646 1043052 1048815 1053124 1056783
58968 1056783 1061401 1067762 1075758 1085261 1096057 1107453 1119068 1131607 1145812 1161156 1176656 1192452
58956 1192452 1209146 1225903 1240760 1252821 1262707 1270719 1276140 1278921 1280606 1282597 1284445 1284949 1284412
58943 1284412 1284652 1286865 1290416 1294120 1298044 1303390 1310689 1318839 1326355 1333242 1341080 1351298 1363741 1376744
$$ packed form
59040A173391N812N396L830J109j777l291k599o89L53l95j891k917l478l721l051
59025A166082j586j073k589m519m813m227n089p566r654j0454j0934j1365j0660
59012A081553q741p243p072p162o510n595m963m166l110k925m186n489n093l210
58998A006088j533j059j249j098l62K91J91l00k1J351K529K320J364J072J429
58983A011013J332O82M93R99J344J301J695K840M066M998N883O406N763M309L659
58968A056783M618O361P996R503J0796J1396J1615J2539J4205J5344J5500J5796
58956A192452J6694J6757J4857J2061R886Q012N421K781J685J991J848N04n37
58943A284412K40K213L551L704L924N346P299Q150P516O887P838J0218J2443J3003
$$ plain form
58929 1376744 1388133 1396467 1402282 1408145 1416519 1427171 1437449 1445369 1451583 1457946 1465206 1472912 1480863
58916 1480863 1489683 1500311 1513502 1529435 1547288 1565550 1583282 1600915 1619635 1640286 1662744
58905 1662744 1685635 1706776 1725042 1741975 1760380 1780968 1801658 1820562 1837966 1854484 1868965
58894 1868965 1879721 1886726 1891080 1893305 1893691 1893445 1893658 1893514 1891163 1886201 1879928 1873294 1865973 1857490 1848069
58879 1848069 1838204 1828308 1818855 1810083 1801547 1792498 1782512 1771307 1758515 1744415 1730254 1716981 1704189
58866 1704189 1691236 1678701 1667602 1657760 1648231 1638928 1630478 1622720 1614742 1606387 1598509 1591752 1586170
58853 1586170 1582048 1579983 1579972 1581392 1583979 1587984 1593349 1599697 1607253 1616988 1629611 1644976 1662560 1681917
58839 1681917 1702642 1724203 1745748 1765886 1783186 1797382 1809650 1821220 1832198 1842153 1851104 1859413
$$ packed form
58929A376744J1389Q334N815N863Q374J0652J0278P920O214O363P260P706P951
58916A480863Q820J0628J3191J5933J7853J8262J7732J7633J8720K0651K2458
58905A662744K2891K1141J8266J6933J8405K0588K0690J8904J7404J6518J4481
58894A868965J0756P005M354K225L86k46K13j44k351m962o273o634p321q483r421
58879A848069r865r896r453q772q536r049r986j1205j2792j4100j4161j3273j2792
58866A704189j2953j2535j1099r842r529r303q450p758p978q355p878o757n582
58853A586170m122k065j1J420K587M005N365O348P556R735J2623J5365J7584J9357
58839A681917K0725K1561K1545K0138J7300J4196J2268J1570J0978R955Q951Q309
$$ plain form
58827 1859413 1867570 1876711 1888207 1901624 1914055 1922778 1927908 1931357 1934081 1935720 1935935 1934303 1929396
58814 1929396 1919814 1906004 1889571 1871114 1850360 1828224 1806847 1787305 1768648 1749535 1729713
58803 1729713 1709818 1690789 1673476 1657738 1642075 1625189 1607603 1590546 1573676 1555501 1535884
58792 1535884 1516527 1498868 1482864 1467876 1453342 1438579 1423367 1408775 1396044 1384653 1372947
58781 1372947 1360575 1348621 1337368 1325836 1313883 1302769 1292963 1283160 1272350 1261347 1251234 1241687
58769 1241687 1232016 1222879 1215778 1211376 1209027 1207494 1205605 1202886 1200015 1198118 1197302 1196536 1195179 1193901
58755 1193901 1193799 1195330 1198286 1202078 1205816 1208802 1211056 1212766 1213361 1212086 1209343 1206324 1203265 1199315
58741 1199315 1194345 1189626 1186096 1182934 1178445 1171712 1163015 1153274 1143455 1134110 1125275 1116969 1109439 1102499
$$ packed form
58827A859413Q157R141J1496J3417J2431Q723N130L449K724J639K15j632m907
58814A929396r582j3810j6433j8457k0754k2136k1377j9542j8657j9113j9822
58803A729713j9895j9029j7313j5738j5663j6886j7586j7057j6870j8175j9617
58792A535884j9357j7659j6004j4988j4534j4763j5212j4592j2731j1391j1706
58781A372947j2372j1954j1253j1532j1953j1114r806r803j0810j1003j0113r547
58769A241687r671r137p101m402k349j533j889k719k871j897q16p66j357j278
58755A193901j02J531K956L792L738K986K254J710N95j275k743l019l059l950
58741A199315m970m719l530l162m489o733q697r741r819r345q835q306p530o940
$$ plain form
58727 1102499 1095312 1087684 1080970 1076650 1074615 1074028 1075086 1078274 1082379 1085168 1085978 1085977 1086056 1086282 1087320 1090065
58711 1090065 1093398 1094345 1091408 1086134 1080779 1075927 1070986 1065421 1058624 1050016 1040223 1031148 1024247 1019791
58697 1019791 1018023 1019477 1023477 1027811 1030779 1032492 1033650 1034441 1035265 1037004 1039604 1041678 1042472 1043140 1045159
58682 1045159 1048561 1052611 1057306 1063227 1070673 1079561 1089426 1099026 1106896 1112844 1118051 1123370 1128592 1133736
58668 1133736 1139664 1146752 1154176 1161331 1168934 1177862 1187683 1196990 1204582 1210048 1214091 1218543 1225014 1233347
58654 1233347 1242254 1251377 1261278 1271496 1280439 1287545 1293752 1299403 1303485 1305477 1305980 1304738 1300032 1291082
58640 1291082 1279247 1265756 1250106 1232036 1213206 1195206 1177257 1157632 1136424 1115454 1096278
58629 1096278 1079453 1064836 1051463 1037962 1024049 1010720 998362 986041 973526 962419 954058
$$ packed form
58727A102499p187p628o714m320k035n87J058L188M105K789Q10jP9K26J038K745
58711A090065L333R47k937n274n355m852m941n565o797q608r793r075o901m456
58697A019791j768J454M000M334K968J713J158P91Q24J739K600K074P94O68K019
58682A045159L402M050M695N921P446Q888R865R600P870N948N207N319N222N144
58668A133736N928P088P424P155P603Q928R821R307P592N466M043M452O471Q333
58654A233347Q907R123R901J0218Q943P106O207N651M082J992N03j242m706q950
58640A291082j1835j3491j5650j8070j8830j8000j7949j9625k1208k0970j9176
58629A096278j6825j4617j3373j3501j3913j3329j2358j2321j2515j1107q361
$$ plain form
58618 954058 947727 942237 937815 934928 932605 929702 926872 925509 925432 925234 924580 924878 928004 935082 945736
58603 945736 957771 968555 977583 986569 996181 1004154 1007940 1007841 1005922 1002962 998339 992234 986192 981592
58589 981592 978665 976647 974087 969705 963804 958149 953767 949824 945382 940993 937642 935316 933615 932498
58575 932498 931399 929116 925832 923758 924320 926147 927371 928388 930475 933072 934591 934864 934765 934341 933378 933005
58559 933005 934509 937182 939452 941689 945721 951862 958523 964721 970953 977332 982694 986118 988072 989581
58545 989581 991043 992028 991724 989878 987820 987809 990565 994246 996761 998108 999317 1000200 999813 998499 997725 998199
58529 998199 999513 1001475 1004644 1009694 1017059 1026784 1038088 1049765 1061580 1074273 1087492 1099207 1108265
58516 1108265 1116092 1124578 1133731 1143004 1153457 1166610 1182162 1198681 1215687 1233433 1251702 1270649
$$ packed form
58618I54058o331n490m422k887k323k903k830j363p7j98o54K98L126P078J0654
58603I45736J2035J0784R028Q986R612P973L786r9j919k960m623o105o042m600
58589I81592k927k018k560m382n901n655m382l943m442m389l351k326j701j117
58575I32498j099k283l284k074N62J827J224J017K087K597J519K73r9m24r63l73
58559I33005J504K673K270K237M032O141O661O198O232O379N362L424J954J509
58545I89581J462R85l04j846k058j1K756L681K515J347J209Q83l87j314p74M74
58529I98199J314J962L169N050P365R725J1304J1677J1815J2693J3219J1715R058
58516A108265P827Q486R153R273J0453J3153J5552J6519J7006J7746J8269J8947
$$ plain form
58504 1270649 1291719 1315850 1341748 1367891 1395140 1425175 1457355 1489506 1520981 1552387 1582745
58493 1582745 1609492 1631269 1648437 1660991 1668207 1670537 1669836 1667410 1663382 1657958 1651642 1644109 1634345
58480 1634345 1621898 1606916 1589297 1569020 1546664 1522413 1495454 1465880 1436103 1408575 1383176
58469 1383176 1358862 1336715 1318822 1304943 1292979 1282264 1273718 1267022 1260355 1253085 1246230 1240091
58457 1240091 1233739 1227042 1220983 1215683 1210242 1204822 1200800 1198502 1196640 1194236 1191264 1187291 1181571 1174897
58443 1174897 1169549 1166929 1166653 1168001 1170511 1173045 1174066 1173277 1171729 1170277 1169235 1169236 1170838 1173430 1176008
58428 1176008 1178708 1182189 1186157 1190235 1195566 1203610 1214020 1225735 1239390 1256209 1275131 1293630
58416 1293630 1311047 1328531 1345989 1361894 1376038 1389703 1402804 1413462 1420762 1425491 1427791 1426514
$$ packed form
58504A270649K1070K4131K5898K6143K7249L0035L2180L2151L1475L1406L0358
58493A582745K6747K1777J7168J2554P216K330p01k426m028n424o316p533r764
58480A634345j2447j4982j7619k0277k2356k4251k6959k9574k9777k7528k5399
58469A383176k4314k2147j7893j3879j1964j0715q546o696o667p270o855o139
58457A240091o352o697o059n300n441n420m022k298j862k404k972l973n720o674
58443A174897n348k620k76J348K510K534J021p89j548j452j042JJ602K592K578
58428A176008K700L481L968M078N331Q044J0410J1715J3655J6819J8922J8499
58416A293630J7417J7484J7458J5905J4144J3665J3101J0658P300M729K300j277
$$ plain form
58404 1426514 1421408 1413848 1405078 1395819 1387759 1383097 1382121 1383112 1384865 1387558 1391456 1396864 1405004 1416473
58390 1416473 1429098 1439691 1447506 1453322 1455887 1452934 1445691 1438520 1433289 1427573 1419426 1410492 1402865
58377 1402865 1395850 1387764 1378779 1370332 1363361 1358315 1355507 1354778 1356098 1360325 1367541 1375245 1380935 1386199
58363 1386199 1395042 1407945 1420914 1430950 1438907 1445920 1450676 1452114 1451967 1452439 1453303 1452835 1449956 1444316
58349 1444316 1436008 1426240 1416912 1409010 1402681 1398425 1396109 1393440 1388297 1382341 1379270 1379720 1381221 1382969
58335 1382969 1386580 1391837 1396142 1399179 1403903 1411367 1418527 1422964 1426043 1429538 1432810 1435542 1439862 1447205
58321 1447205 1455781 1463350 1470075 1476786 1482982 1488362 1493957 1500234 1506400 1512714 1520765 1530444 1539657 1548084
58307 1548084 1557962 1569996 1582042 1593142 1605092 1618523 1631418 1643415 1657448 1674826 1692642
$$ packed form
58404A426514n106p560q770r259q060m662r76R91J753K693L898N408Q140J1469
58390A416473J2625J0593P815N816K565k953p243p171n231n716q147q934p627
58377A402865p015q086q985q447o971n046k808p29J320M227P216P704N690N264
58363A386199Q843J2903J2969J0036P957P013M756J438j47M72Q64m68k879n640
58349A444316q308r768r328p902o329m256k316k669n143n956l071M50J501J748
58335A382969L611N257M305L037M724P464P160M437L079L495L272K732M320P343
58321A447205Q576P569O725O711O196N380N595O277O166O314Q051R679R213Q427
58307A548084R878J2034J2046J1100J1950J3431J2895J1997J4033J7378J7816
$$ plain form
58296 1692642 1708601 1724616 1742859 1761869 1779412 1795586 1810127 1820351 1825335 1829090 1836005 1845729
58284 1845729 1855645 1865578 1876698 1888371 1899624 1911698 1926062 1941917 1958434 1977314 2000308 2026153
58272 2026153 2052559 2079258 2106807 2134558 2161999 2189910 2218203 2245014 2269633 2293523 2316783
58261 2316783 2336993 2353618 2369990 2388607 2407985 2426613 2446143 2467837 2489589 2509603 2529570
58250 2529570 2551290 2573809 2596821 2622950 2653248 2684360 2713711 2743756 2777414 2813134 2848365
58239 2848365 2884137 2922111 2960674 2998083 3035987 3075834 3115437 3153289 3192478 3235814 3280749
58228 3280749 3323877 3367091 3414514 3466435 3520986 3578697 3640734 3705521 3771412 3839680 3911004
58217 3911004 3982748 4053836 4128112 4208226 4290558 4371277 4453066 4540372 4632364 4726479 4824793
$$ packed form
58296A692642J5959J6015J8243J9010J7543J6174J4541J0224M984L755O915R724
58284A845729R916R933J1120J1673J1253J2074J4364J5855J6517J8880K2994K5845
58272B026153K6406K6699K7549K7751K7441K7911K8293K6811K4619K3890K3260
58261B316783K0210J6625J6372J8617J9378J8628J9530K1694K1752K0014J9967
58250B529570K1720K2519K3012K6129L0298L1112K9351L0045L3658L5720L5231
58239B848365L5772L7974L8563L7409L7904L9847L9603L7852L9189M3336M4935
58228C280749M3128M3214M7423N1921N4551N7711O2037O4787O5891O8268P1324
58217C911004P1744P1088P4276Q0114Q2332Q0719Q1789Q7306R1992R4115R8314
$$ plain form
58206 4824793 4930640 5042655 5158476 5280825 5413610 5555209 5701659 5853185 6011745
58197 6011745 6175821 6343742 6518516 6703312 6895903 7093692 7300258 7520913 7756206
58188 7756206 8006006 8274871 8566396 8877345 9204868 9554524 9933607 10341915 10777297
58179 10777297 11244704 11750572 12293338 12868910 13480734 14135075 14831144 15565484 16341238
58170 16341238 17163346 18029655 18936603 19888520 20891701 21945780 23051814 24222285 25471462
58161 25471462 26802373 28214880 29718935 31327247 33043527 34872785 36835218 38954294
58153 38954294 41238590 43690416 46322849 49151562 52181284 55421183 58904712 62674284
58145 62674284 66757788 71183855 76011164 81322777 87210579 93797944 101266999 109836451
$$ packed form
58206D824793J05847J12015J15821J22349J32785J41599J46450J51526J58560
58197F011745J64076J67921J74774J84796J92591J97789K06566K20655K35293
58188G756206K49800K68865K91525L10949L27523L49656L79083M08308M35382
58179A0777297M67407N05868N42766N75572O11824O54341O96069P34340P75754
58170A6341238Q22108Q66309R06948R51917J003181J054079J106034J170471J249177
58161B5471462J330911J412507J504055J608312J716280J829258J962433K119076
58153C8954294K284296K451826K632433K828713L029722L239899L483529L769572
58145F2674284M083504M426067M827309N311613N887802O587365P469055Q569452
$$ plain form
58137 109836451 119733300 131223589 144648329 160377493 178730301 199954444 224219086
58130 224219086 251566378 281950794 315402011 351874936 390337603 427623604 458457226
58123 458457226 477342102 481134424 470294989 448073340 418683355 385904473 352557779
58116 352557779 320481451 290664886 263483298 238968805 216986761 197307498 179667372
58109 179667372 163832036 149603941 136792755 125221028 114756087 105303199 96767712
58102 96767712 89048297 82060566 75738727 70015155 64821422 60106950 55834525 51958599
58094 51958599 48426982 45201186 42256253 39562947 37088590 34813863 32730977 30825340
58086 30825340 29074286 27462422 25982121 24618744 23350255 22162458 21051712 20012215
$$ packed form
58137A09836451R896849J1490289J3424740J5729164J8352808K1224143K4264642
58130B24219086K7347292L0384416L3451217L6472925L8462667L7286001L0833622
58123D58457226J8884876L792322j0839435k2221649k9389985l2778882l3346694
58116C52557779l2076328k9816565k7181588k4514493k1982044j9679263j7640126
58109A79667372j5835336j4228095j2811186j1571727j0464941r452888q535487
58102I6767712p719415o987731o321839n723572n193733m714472m272425l875926
58094E1958599l531617l225796k944933k693306k474357k274727k082886j905637
58086C0825340j751054j611864j480301j363377j268489j187797j110746j039497
$$ plain form
58078 20012215 19033202 18109463 17242814 16431767 15669703 14953574 14284526 13659609 13072013
58069 13072013 12519348 12002689 11517826 11056567 10616522 10200960 9809240 9435833 9078523
58060 9078523 8739171 8416482 8106126 7807945 7525110 7256150 6995419 6741494 6497770
58051 6497770 6264952 6040489 5825494 5624658 5438562 5262676 5094310 4934189 4781178
58042 4781178 4632114 4487105 4348684 4215652 4084042 3954106 3829857 3711594 3595510
58033 3595510 3481094 3372282 3270434 3172404 3076545 2984700 2897322 2812391 2730039 2652521 2578560
58022 2578560 2503378 2425610 2348902 2275495 2203525 2131962 2062917 1997309 1933046 1869340 1808521
58011 1808521 1752021 1698536 1647380 1599671 1555109 1511645 1469463 1431300 1397725 1365960 1334445
$$ packed form
58078B0012215r79013r23739q66649q11047p62064p16129o69048o24917n87596
58069A3072013n52665n16659m84863m61259m40045m15562l91720l73407l57310
58060I078523l39352l22689l10356k98181k82835k68960k60731k53925k43724
58051F497770k32818k24463k14995k00836j86096j75886j68366j60121j53011
58042D781178j49064j45009j38421j33032j31610j29936j24249j18263j16084
58033C595510j14416j08812j01848r8030r5859r1845q7378q4931q2352p7518p3961
58022B578560p5182p7768p6708p3407p1970p1563o9045o5608o4263o3706o0819
58011A808521n6500n3485n1156m7709m4562m3464m2182l8163l3575l1765l1515
$$ plain form
58000 1334445 1304733 1277803 1252296 1227404 1203817 1180842 1156445 1131293 1109106 1091617 1076429
57989 1076429 1060951 1045278 1030230 1015683 1001883 989545 977982 965786 953529 942814 932864
57978 932864 921526 909520 899809 892745 885812 878221 871298 864035 853233 839111 825975 815756 805388
57965 805388 792377 778494 765787 753254 740079 728396 719920 712922 705197 697242 690053 682604 674124
57952 674124 666401 661096 656777 651068 644177 638193 634301 632259 631139 629306 625476 620978 619004 620431
57938 620431 622418 622272 620474 618586 616569 613848 610921 608064 604129 598289 591500 585009 578896 573159
57924 573159 568485 564850 561017 556356 551489 546479 540470 534020 529454 527708 526845 524792 521461 517238
57910 517238 511857 506161 502631 502439 503779 504455 504261 503626 502151 500017 498836 499506 500924 502014 503089
$$ packed form
58000A334445k9712k6930k5507k4892k3587k2975k4397k5152k2187j7489j5188
57989A076429j5478j5673j5048j4547j3800j2338j1563j2196j2257j0715r950
57978I32864j1338j2006r711p064o933p591o923p263j0802j4122j3136j0219j0368
57965H05388j3011j3883j2707j2533j3175j1683q476o998p725p955p189p449q480
57952F74124p723n305m319n709o891n984l892k042j120j833l830m498j974J427
57938F20431J987j46j798j888k017k721k927k857l935n840o789o491o113n737
57924E73159m674l635l833m661m867n010o009o450m566j746q63k053l331m223
57910E17238n381n696l530j92J340O76j94o35j475k134j181O70J418J090J075
$$ plain form
57895 503089 504083 503775 502127 500972 500811 499464 495768 492061 490743 490740 489907 488705 488578 488486 486298 482606 480262
57878 480262 480813 483806 488794 495425 502085 507024 510794 515517 521857 528503 534304 539031 542227 543241
57864 543241 542527 541386 540204 538247 535222 531852 528766 525745 522222 517975 513380 509334 506475 504160
57850 504160 500954 496536 492273 489411 487752 486742 486557 487096 487072 485432 482976 481390 481141 481220 480464 478397
57834 478397 475324 472148 469567 467246 464640 462577 462436 463493 463005 459871 456415 455369 456680 458490 459649
57819 459649 459848 458790 456869 455394 454738 453570 451315 449701 450013 450495 448812 445876 444555 445262 445376 442981
57803 442981 438938 435130 432569 431548 432100 433850 436342 439468 442887 445709 447883 450996 456183 461937
57789 461937 465835 467894 470169 473167 474872 473726 470621 467189 463688 459556 454925 450417 445992 440881
$$ packed form
57895E03089R94l08j648j155j61j347l696l707j318lq33j202j27r2k188l692k344
57878D80262N51K993M988O631O660M939L770M723O340O646N801M727L196J014
57864E43241p14j141j182j957l025l370l086l021l523m247m595m046k859k315
57850E04160l206m418m263k862j659j010j85N39k4j640k456j586k49P9p56k067
57834D78397l073l176k581k321k606k063j41J057m88l134l456j046J311J810J159
57819D59649J99j058j921j475o56j168k255j614L12M82j683k936j321P07J14k395
57803D42981m043l808k561j021N52J750K492L126L419K822K174L113N187N754
57789D61937L898K059K275K998J705j146l105l432l501m132m631m508m425n111
$$ plain form
57775 440881 434559 427389 420334 414146 408853 404125 399991 396691 393884 390992 388653 388605 391183 393895 393779
57760 393779 390755 387565 386712 388347 390753 391815 390244 386383 381956 378414 375550 372103 367286 361337
57746 361337 355123 349857 346568 345165 344365 343066 341270 339378 337502 336049 335919 337202 338609 339190 339758
57731 339758 341589 344557 347659 350594 353559 356101 357520 358105 358965 361031 364974 371290 379377 387192 393083
57716 393083 397541 402222 407776 413613 419057 423609 426649 427969 428053 427025 424238 419895 415919 413780 412449
57701 412449 409982 406172 402069 397922 393565 389975 388303 387764 386563 384573 383152 382607 381933 380901 380254
57686 380254 379833 378653 377157 377252 379570 382457 384235 384872 384987 384884 385141 386567 388840 390573 391348 392411
57670 392411 394731 397576 399612 400350 400099 399652 400329 403021 406665 408867 408565 406942 405292 403342 400350
$$ packed form
57775D40881o322p170p055o188n293m728m134l300k807k892k339m8K578K712j16
57760C93779l024l190q53J635K406J062j571l861m427l542k864l447m817n949
57746C61337o214n266l289j403q00j299j796j892j876j453j30J283J407N81N68
57731C39758J831K968L102K935K965K542J419N85Q60K066L943O316Q087P815N891
57716C93083M458M681N554N837N444M552L040J320Q4j028k787m343l976k139j331
57701D12449k467l810m103m147m357l590j672n39j201j990j421n45o74j032o47
57686C80254m21j180j496R5K318K887J778O37J15j03K57J426K273J733P75J063
57670C92411K320K845K036P38k51m47O77K692L644K202l02j623j650j950k992
$$ plain form
57655 400350 396602 392892 389439 386155 383254 380822 378308 374982 370516 364934 358514 351789 345066 338100
57641 338100 331133 325944 324515 326572 329779 332568 335384 338812 342031 343911 344375 343794 342037 339026 335482
57626 335482 332291 329677 327570 326329 326595 328765 332768 337973 343437 348898 355376 364065 375051 388200
57612 388200 404753 426319 452438 481091 511991 547333 588261 631810 671976 702430 717989
57601 717989 715938 697942 669723 637378 604418 572692 544185 520005 498663 477433 455414 434102
57589 434102 415340 399993 388265 379839 373497 367692 361848 356474 351836 347202 341747 335863 331171
57576 331171 329003 328834 328565 326648 323630 321056 319321 317559 315380 313414 311975 310488 308651 307033 305882
57561 305882 304331 301536 297846 294275 291457 289573 288619 288235 287876 287447 287236 287212 287216 287733 289283 290959 291015
$$ packed form
57655D00350l748l710l453l284k901k432k514l326m466n582o420o725o723o966
57641C38100o967n189j429K057L207K789K816L428L219J880M64n81j757l011l544
57626C35482l191k614k107j241K66K170M003N205N464N461O478Q689J0986J3149
57612C88200J6553K1566K6119K8653L0900L5342M0928M3549M0166L0454J5559
57601G17989k051j7996k8219l2345l2960l1726k8507k4180k1342k1230k2019k1312
57589D34102j8762j5347j1728q426o342n805n844n374m638m634n455n884m692
57576C31171k168j69k69j917l018k574j735j762k179j966j439j487j837j618j151
57561C05882j551k795l690l571k818j884r54l84l59m29k11k4MN17J550J676N6
$$ plain form
57544 291015 289196 287094 285842 285014 284212 283875 283743 282381 279503 277040 276428 276291 274398 270673 266656 263161
57528 263161 260196 258197 257410 256709 254806 252156 250143 248943 247801 246866 246951 247806 248300 248214 248306 248749 248966
57511 248966 248907 249136 249752 250525 251809 253913 255856 256297 255500 254785 254271 253021 251340 250753 251269 250751 247995
57494 247995 244709 243298 244029 245619 247509 250185 253857 258007 261930 264906 266151 265360 263197 260799 259080
57479 259080 258754 260481 264323 269355 274350 278702 282433 285616 288292 290760 293436 296319 298997 301319
57465 301319 303870 307496 312378 317895 323587 329776 336745 343760 349985 356310 364983 376934 390528 403679
57451 403679 415950 427576 437616 444675 448724 450519 449724 445544 439119 433211 428949 424667 418839 412634
57437 412634 408275 405812 402969 397895 391056 384436 379617 376644 374300 371321 367517 363785 361150 359906
$$ packed form
57544B91015j819k102j252q28q02l37j32j362k878k463o12j37j893l725m017l495
57528B63161k965j999p87p01j903k650k013j200j142r35Q5Q55M94q6R2M43K17
57511B48966n9K29O16P73J284K104J943M41p97p15n14j250j681n87N16n18k756
57494B47995l286j411P31J590J890K676L672M150L923K976J245p91k163k398j719
57479B59080l26J727L842N032M995M352L731L183K676K468K676K883K678K322
57465C01319K551L626M882N517N692O189O969P015O225O325Q673J1951J3594J3151
57451D03679J2271J1626J0040P059M049J795p95m180o425n908m262m282n828o205
57437D12634m359k463k843n074o839o620m819k973k344k979l804l732k635j244
$$ plain form
57423 359906 359521 359077 357985 356657 356353 357934 360937 364269 367468 370513 372784 373298 372182 371004 371343
57408 371343 373709 377894 383345 388723 392073 392491 391348 391196 393449 397479 401867 406038 410451 415313 419594
57393 419594 421850 422135 422348 424082 426707 428494 429321 431056 435022 440168 444345 446685 448114 449969 452812
57378 452812 456431 460363 464232 467852 471327 475166 480075 486238 492756 498146 501578 503334 504128 504760 506636
57363 506636 511536 519861 529651 538237 544551 549166 552695 555331 557618 560419 564049 568338 573540 580211
57349 580211 588135 596273 603917 611167 618225 624969 631290 637204 642728 648135 653977 660124 665419 669399
57335 669399 673799 680840 690230 699404 706719 712851 718991 725401 732249 740134 749011 757934 766681 776382
57321 776382 787760 799888 811649 823379 836095 849927 864166 878221 891770 904685 917419
$$ packed form
57423C59906l85m44j092j328l04J581L003L332L199L045K271N14j116j178L39
57408C71343K366M185N451N378L350M18j143j52K253M030M388M171M413M862M281
57393D19594K256K85K13J734K625J787Q27J735L966N146M177K340J429J855K843
57378D52812L619L932L869L620L475L839M909O163O518N390L432J756P94O32J876
57363E06636M900Q325R790Q586O314M615L529K636K287K801L630M289N202O671
57349E80211P924Q138P644P250P058O744O321N914N524N407N842O147N295L980
57335F69399M400P041R390R174P315O132O140O410O848P885Q877Q923Q747R701
57321G76382J1378J2128J1761J1730J2716J3832J4239J4055J3549J2915J2734
$$ plain form
57310 917419 930745 944513 957468 968950 979932 991623 1003876 1015804 1027246 1038620 1049782
57299 1049782 1059951 1068654 1076265 1083755 1092122 1101678 1111882 1122430 1134251 1148366 1163860 1178489
57287 1178489 1191598 1204839 1219375 1234044 1247391 1259959 1273168 1287103 1300962 1314912 1329988
57276 1329988 1346640 1364500 1383065 1401514 1418455 1433113 1446480 1460451 1476195 1493879 1512975
57265 1512975 1531931 1548620 1562490 1575622 1590489 1607422 1625371 1644038 1663526 1682712 1700010
57254 1700010 1715609 1731260 1747989 1765543 1783968 1804017 1825850 1848791 1872500 1896989 1921272
57243 1921272 1943450 1962676 1980131 1997773 2016890 2037761 2059633 2080964 2100752 2119779 2139559
57232 2139559 2160161 2180188 2198941 2217348 2236516 2256471 2276603 2296341 2315180 2332984 2350568
$$ packed form
57310I17419J3326J3768J2955J1482J0982J1691J2253J1928J1442J1374J1162
57299A049782J0169Q703P611P490Q367R556J0204J0548J1821J4115J5494J4629
57287A178489J3109J3241J4536J4669J3347J2568J3209J3935J3859J3950J5076
57276A329988J6652J7860J8565J8449J6941J4658J3367J3971J5744J7684J9096
57265A512975J8956J6689J3870J3132J4867J6933J7949J8667J9488J9186J7298
57254A700010J5599J5651J6729J7554J8425K0049K1833K2941K3709K4489K4283
57243A921272K2178J9226J7455J7642J9117K0871K1872K1331J9788J9027J9780
57232B139559K0602K0027J8753J8407J9168J9955K0132J9738J8839J7804J7584
$$ plain form
57221 2350568 2369109 2388963 2409912 2432497 2457855 2486117 2516160 2547210 2579550 2613412 2648335
57210 2648335 2683876 2719726 2754809 2787695 2818544 2849304 2881127 2912656 2941930 2969063 2995865
57199 2995865 3023350 3050838 3077418 3103395 3129898 3157441 3185069 3211114 3234926 3257630 3280727
57188 3280727 3304204 3326651 3347153 3366318 3385493 3405721 3427508 3450823 3475085 3499770 3525103
57177 3525103 3551692 3579666 3608883 3639718 3672760 3707928 3744796 3783469 3824054 3865681 3907461
57166 3907461 3950175 3995233 4041877 4087181 4129148 4167946 4203595 4234641 4260350 4282493 4303450
57155 4303450 4323856 4343465 4363137 4384298 4407285 4431689 4457586 4485102 4513477 4542149 4572320
57144 4572320 4605932 4643324 4683278 4725183 4769764 4817645 4868504 4921848 4977521 5035049 5093381
$$ packed form
57221B350568J8541J9854K0949K2585K5358K8262L0043L1050L2340L3862L4923
57210B648335L5541L5850L5083L2886L0849L0760L1823L1529K9274K7133K6802
57199B995865K7485K7488K6580K5977K6503K7543K7628K6045K3812K2704K3097
57188C280727K3477K2447K0502J9165J9175K0228K1787K3315K4262K4685K5333
57177C525103K6589K7974K9217L0835L3042L5168L6868L8673M0585M1627M1780
57166C907461M2714M5058M6644M5304M1967L8798L5649L1046K5709K2143K0957
57155D303450K0406J9609J9672K1161K2987K4404K5897K7516K8375K8672L0171
57144D572320L3612L7392L9954M1905M4581M7881N0859N3344N5673N7528N8332
$$ plain form
57133 5093381 5151724 5210067 5268533 5326660 5383646 5438978 5492591 5544448 5594061 5640446 5682688
57122 5682688 5720446 5753590 5781441 5802993 5818019 5827317 5831582 5830660 5824355 5813499 5799781 5784876
57110 5784876 5769918 5755366 5741192 5727764 5716756 5710608 5710824 5717232 5728684 5743510 5759338 5773885
57098 5773885 5786421 5797387 5806253 5811094 5810895 5806856 5800621 5792592 5783086 5773770 5766509 5761687 5758941 5758667
57084 5758667 5761521 5767320 5775827 5787988 5805137 5827629 5855483 5889469 5929997 5975490 6023370 6072332
57072 6072332 6122256 6172167 6219494 6260939 6292938 6311770 6314572 6300002 6266916 6213039 6136078
57061 6136078 6035464 5911687 5764374 5591961 5392181 5161560 4895641 4591571 4249680
57052 4249680 3870867 3453249 2992894 2486605 1932068 1326672 668833 -40206 -797916 -1602517
$$ packed form
57133E093381N8343N8343N8466N8127N6986N5332N3613N1857M9613M6385M2242
57122E682688L7758L3144K7851K1552J5026R298M265r22o305j0856j3718j4905
57110E784876j4958j4552j4174j3428j1008o148K16O408J1452J4826J5828J4547
57098E773885J2536J0966Q866M841j99m039o235q029r506r316p261m822k746k74
57084E758667K854N799Q507J2161J7149K2492K7854L3986M0528M5493M7880M8962
57072F072332M9924M9911M7327M1445L1999J8832K802j4570l3086n3877p6961
57061F136078j00614j23777j47313j72413j99780k30621k65919l04070l41891
57052D249680l78813m17618m60355n06289n54537o05396o57839d0206p57710q04601
$$ plain form
57042 -1602517 -2451421 -3339279 -4260334 -5210634 -6184177 -7168447 -8147748 -9109936 -10047079
57033 -10047079 -10953698 -11831387 -12693818 -13561558 -14455189 -15399064 -16420161 -17524014 -18684468
57024 -18684468 -19910153 -21361507 -23376416 -26302063 -30226796 -34833151 -39490786 -43498133
57016 -43498133 -46297093 -47572001 -47254313 -45480219 -42526152 -38740152 -34486977 -30108453
57008 -30108453 -25888352 -22023761 -18618284 -15699896 -13246352 -11202881 -9493227 -8030849
57000 -8030849 -6731100 -5522160 -4353852 -3201967 -2064712 -953413 115627 1125169
56992 1125169 2059939 2909818 3670382 4340302 4919788 5412091 5824833 6168448 6453828
56983 6453828 6691688 6892664 7066410 7220422 7359945 7488633 7609088 7723212 7832413
$$ packed form
57042a602517q48904q87858r21055r50300r73543r84270r79301r62188r37143
57033a0047079r06619q77689q62431q67740q93631r43875j021097j103853j160454
57024a8684468j225685j451354k014909k925647l924733m606355m657635m007347
57016d3498133k798960j274908L17688J774094K954067L786000M253175M378524
57008c0108453M220101L864591L405477K918388K453544K043471J709654J462378
57000h030849J299749J208940J168308J151885J137255i53413A15627J009542
56992A125169R34770Q49879P60564O69920N79486M92303M12742L43615K85380
56983F453828K37860K00976J73746J54012J39523J28688J20455J14124J09201
$$ plain form
56974 7832413 7937829 8041445 8147637 8261994 8385672 8509794 8616928 8689902 8720468 8711514
56964 8711514 8673521 8619319 8559496 8499778 8441532 8384358 8327659 8270104 8209381 8143565 8072014
56953 8072014 7994270 7909056 7815409 7714259 7607851 7497724 7383880 7265769 7143590 7018913
56943 7018913 6894358 6772342 6653853 6538874 6428042 6322830 6223417 6127522 6032708 5939361
56933 5939361 5849986 5765575 5683968 5602210 5519500 5437098 5355841 5274494 5190527 5102108 5009090
56922 5009090 4912106 4810874 4703652 4588411 4464282 4331758 4191847 4045383 3892928 3734859
56912 3734859 3571529 3403565 3232252 3059751 2889070 2723490 2565498 2416138 2275678
56903 2275678 2144661 2023601 1911888 1808149 1712099 1624957 1547284 1477316 1412277 1350551
$$ packed form
56974G832413J05416J03616J06192J14357J23678J24122J07134P2974L0566q954
56964H711514l7993n4202n9823n9718n8246n7174n6699n7555o0723o5816p1551
56953H072014p7744q5214r3647j01150j06408j10127j13844j18111j22179j24677
56943G018913j24555j22016j18489j14979j10832j05212r9413r5895r4814r3347
56933E939361q9375q4411q1607q1758q2710q2402q1257q1347q3967q8419r3018
56922E009090r6984j01232j07222j15241j24129j32524j39911j46464j52455j58069
56912C734859j63330j67964j71313j72501j70681j65580j57992j49360j40460
56903B275678j31017j21060j11713j03739r6050q7142p7673o9968o5039o1726
$$ plain form
56893 1350551 1291555 1234214 1177152 1120395 1065719 1014996 968847 926872 888433 853144 821311
56882 821311 793961 771809 754216 739754 727713 718430 712396 709919 711463 717215 726099 736141 745991
56869 745991 755149 762428 765282 761405 750522 734161 714180 691900 668218 644080 620845 600068
56857 600068 582494 567465 553896 541554 530621 520495 510480 501555 495601 492320 488767 483114
56845 483114 477282 474159 473323 471572 467301 462367 459399 458993 460151 462054 464341 466528 468316 470275 473354
56830 473354 477658 482378 487198 493194 501755 512623 523513 531858 536570 537907 536354 532457 527577 523728
56816 523728 522244 522982 524963 527398 530136 533800 539628 548465 559756 572178 585439 600615 618443
56803 618443 638282 659344 682187 708137 737600 769262 800199 826224 842975 847838 841017 824820
$$ packed form
56893A350551n8996n7341n7062n6757n4676n0723m6149m1975l8439l5289l1833
56882H21311k7350k2152j7593j4462j2041r283o034k477J544N752Q884J0042R850
56869G45991R158P279K854l877j0883j6361j9981k2280k3682k4138k3235k0777
56857F00068j7574j5029j3569j2342j0933j0126j0015q925n954l281l553n653
56845D83114n832l123q36j751m271m934k968m06J158J903K287K187J788J959L079
56830D73354M304M720M820N996Q561J0868J0890Q345M712J337j553l897m880l849
56816E23728j484P38J981K435K738L664N828Q837J1291J2422J3261J5176J7828
56803F18443J9839K1062K2843K5950K9463L1662L0937K6025J6751M863o821j6197
$$ plain form
56791 824820 802597 778372 755950 737010 720693 705957 693749 685976 683218 684835 690913 702740
56779 702740 721370 746719 777978 814016 853590 895977 940998 987255 1030457 1064523 1084452
56768 1084452 1087719 1074034 1045686 1008041 967640 928674 891956 857344 825839 798846 776715
56757 776715 759060 745880 737611 734473 736273 742602 753066 767783 787614 813044 842481 872185
56745 872185 898054 916973 926629 925432 913502 893129 867527 839276 810099 781412 754449 730102
56733 730102 708948 691151 676201 663232 651876 642533 635827 632255 632224 635706 641760 649174 657626
56720 657626 667254 676772 683123 683738 678478 668708 655137 637417 615546 590816 565336 540984 518772
56707 518772 498889 481246 465849 452520 440651 429808 420328 412504 405347 397225 387951 379127 372043
$$ packed form
56791H24820k2223k4225k2422j8940j6317j4736j2208p773k758J617O078J1827
56779G02740J8630K5349L1259L6038L9574M2387M5021M6257M3202L4066J9929
56768A084452L267j3685k8348l7645m0401l8966l6718l4612l1505k6993k2131
56757G76715j7655j3180q269l138J800O329J0464J4717J9831K5430K9437K9704
56745H72185K5869J8919R656j197j1930k0373k5602k8251k9177k8687k6963k4347
56733G30102k1154j7797j4950j2969j1356r343o706l572l1L482O054P414Q452
56720F57626R628R518O351O15n260r770j3571j7720k1871k4730k5480k4352k2212
56707E18772j9883j7643j5397j3329j1869j0843r480p824p157q122r274q824p084
$$ plain form
56694 372043 366227 360700 355671 352112 350193 348935 347107 343995 339760 335425 332004 329316 326312 322860
56680 322860 320138 318648 316960 313545 309039 305401 303312 301702 299650 297415 295454 293526 291237 288882
56666 288882 287443 287972 290800 294850 297976 298651 297356 295885 295516 296327 297832 299377 300055 299235 297414 295874
56650 295874 295377 295775 296833 298550 300493 301684 301639 300906 300108 299008 296994 294084 290916 288108 286218 286054
56634 286054 288109 291479 293959 293835 291447 288611 286655 285511 284781 284927 286700 289672 292194 293033 292463
56619 292463 291410 290155 288522 286922 286322 286992 287915 287916 287137 286964 288513 291527 294886 297857 300479 302973
56603 302973 305476 308460 312665 318083 323459 327425 329785 331187 332095 332964 334902 338816 343824 347716 349319
56588 349319 349353 348708 347110 344134 340480 337392 335455 334597 334545 334662 334081 332740 331517 330690 329217 326479
$$ packed form
56694C72043n816n527n029l559j919j258j828l112m235m335l421k688l004l452
56680C22860k722j490j688l415m506l638k089j610k052k235j961j928k289k355
56666B88882j439N29K828M050L126O75j295j471l69Q11J505J545O78q20j821j540
56650B95874m97L98J058J717J943J191m5p33p98j100k014k910l168k808j890j64
56634B86054K055L370K480j24k388k836j956j144p30J46J773K972K522Q39n70
56619B92463j053j255j633j600o00O70R23Jp79j73J549L014L359K971K622K494
56603C02973K503K984M205N418N376L966K360J402R08Q69J938L914N008L892J603
56588C49319L4o45j598k976l654l088j937q58n2J17n81j341j223q27j473k738
$$ plain form
56572 326479 323709 322394 321943 320414 317163 313376 310247 308105 307163 307526 308247 307850 306300 305136 305161 305246
56556 305246 304104 302078 300254 298756 296996 294993 293363 292294 291403 290390 289155 287571 285898 285125 285978
56541 285978 287706 288773 288818 289002 290168 291630 292366 292611 293425 295192 297419 299787 302362 304783 306301 306992
56525 306992 308064 310322 312995 314754 315369 315643 316237 317466 319913 323953 328600 331871 332722 331880 330490
56510 330490 328778 326549 324274 322996 323535 326220 330929 336813 342396 346625 349824 353288 358032 364132
56496 364132 371006 377990 384685 390856 395943 398995 399570 398601 397604 397001 396049 394602 393887 394943 397139 399028
56480 399028 400055 400642 401005 400646 398947 395839 392080 388990 387275 385961 383285 379004 374911 372476 371139
56465 371139 369792 368833 369340 370966 372204 372415 372142 371573 370116 367683 365138 363244 362097 361682 361934 362069
$$ packed form
56572C26479k770j315m51j529l251l787l129k142r42L63P21l97j550j164K5Q5
56556C05246j142k026j824j498j760k003j630j069q91j013j235j584j673p73Q53
56541B85978J728J067M5J84J166J462P36K45Q14J767K227K368K575K421J518O91
56525C06992J072K258K673J759O15K74N94J229K447M040M647L271Q51q42j390
56510C30490j712k229k275j278N39K685M709N884N583M229L199L464M744O100
56496C64132O874O984O695O171N087L052N75r69r97o03r52j447p15J056K196J889
56480C99028J027N87L63l59j699l108l759l090j715j314k676m281m093k435j337
56465C71139j347r59N07J626J238K11k73n69j457k433k545j894j147m15K52J35
$$ plain form
56449 362069 361026 359020 357710 358242 359868 360964 360761 359523 357596 355059 352191 349741 348469 348440 348834
56434 348834 348655 347713 346636 345746 344497 342440 340252 339034 338869 338791 338079 336892 335756 335078 335085 335691 336560
56417 336560 337827 340320 344222 347925 349384 348576 347510 347709 348808 349861 350685 351264 350936 349261 347197
56402 347197 346464 347780 350289 352669 354456 356269 358904 362201 364975 366374 367094 368579 370986 372726 372447
56387 372447 370870 369995 370742 371931 371641 369253 366036 363914 363767 364900 365977 366156 365338 363803 362117 361227
56371 361227 362062 364725 368209 370994 372025 371351 369978 368990 368612 368201 367173 365771 364927 365610 368163 371785
56355 371785 374761 375869 375718 376066 377656 379418 379955 379022 377237 375264 373757 373215 373435 373878 374903 377487
56339 377487 381189 383811 384023 383141 383182 384352 385641 386667 387444 387426 386569 386347 387855 389592 389102 386305 383224
$$ packed form
56449C62069j043k006j310N32J626J096k03j238j927k537k868k450j272k9L94
56434C48834j79r42j077q90j249k057k188j218j65p8p12j187j136o78PO06Q69
56417C36560J267K493L902L703J459q08j066J99J099J053Q24N79l28j675k064
56402C47197p33J316K509K380J787J813K635L297K774J399P20J485K407J740k79
56387C72447j577q75P47J189k90k388l217k122j47J133J077J79q18j535j686q90
56371C61227Q35K663L484K785J031o74j373r88l78m11j028j402q44O83K553L622
56355C71785K976J108j51L48J590J762N37r33j785j973j507n42K20M43J025K584
56339C77487L702K622K12q82M1J170J289J026P77j8q57k22J508J737m90k797l081
$$ plain form
56322 383224 380975 379137 377823 378021 379800 382266 385459 390206 395898 400664 404172 408054 412874 416936
56308 416936 419057 420399 422308 424236 425302 426251 428139 430362 431712 432489 433914 436018 437653 438416 439288
56293 439288 441388 444825 448714 451828 453457 454012 454527 455471 456609 458028 460317 463372 466041 467524 468310
56278 468310 469188 470102 470631 471049 472310 475318 480278 486210 491268 494467 497041 501019 506516 511764 515821
56263 515821 519511 523307 526201 527557 528425 529889 531589 533087 535347 539355 544261 548290 550710 551794
56249 551794 551824 551556 552753 556550 561679 565790 568269 570476 573628 577967 583851 591917 601602 610810 617939
56234 617939 623542 629225 635328 640602 644284 647719 653240 661652 671707 682198 693504 706297 719684
56221 719684 731924 742620 753033 764572 778126 794370 813047 832249 850200 867874 888023
$$ packed form
56322C83224k249j838j314J98J779K466L193M747N692M766L508L882M820M062
56308D16936K121J342J909J928J066R49J888K223J350P77J425K104J635P63Q72
56293D39288K100L437L889L114J629N55N15R44J138J419K289L055K669J483P86
56278D68310Q78R14N29M18J261L008M960N932N058L199K574L978N497N248M057
56263E15821L690L796K894J356Q68J464J700J498K260M008M906M029K420J084
56249E51794L0k68J197L797N129M111K479K207L152M339N884Q066R685R208P129
56234F17939N603N683O103N274L682L435N521Q412J0055J0491J1306J2793J3387
56221G19684J2240J0696J0413J1539J3554J6244J8677J9202J7951J7674K0149
$$ plain form
56210 888023 911489 936364 961113 986269 1012393 1038758 1065484 1094948 1129238 1167476 1207257
56199 1207257 1247771 1290257 1336538 1388399 1447247 1512830 1583061 1656442 1734029 1818143 1910231
56188 1910231 2011055 2121595 2242033 2370644 2505275 2645323 2790796 2939924 3088970
56179 3088970 3234040 3371926 3499759 3615161 3716467 3801821 3868417 3913580 3936253 3936762 3915751
56168 3915751 3874170 3813833 3737292 3647531 3547909 3441253 3328557 3209880 3087133 2964505
56158 2964505 2845341 2730121 2618383 2510694 2407363 2307232 2209827 2117223 2031599 1952070
56148 1952070 1876103 1803077 1734216 1669836 1609131 1552281 1500480 1453806 1411065 1371765 1336509
56137 1336509 1305282 1277011 1251008 1227517 1206581 1187460 1169222 1151146 1132963 1115567 1100879
$$ packed form
56210H88023K3466K4875K4749K5156K6124K6365K6726K9464L4290L8238L9781
56199A207257M0514M2486M6281N1861N8848O5583P0231P3381P7587Q4114R2088
56188A910231J00824J10540J20438J28611J34631J40048J45473J49128J49046
56179C088970J45070J37886J27833J15402J01306Q5354O6596M5163K2673N09k1011
56168C915751m1581o0337p6541q9761r9622j06656j12696j18677j22747j22628
56158B964505j19164j15220j11738j07689j03331j00131r7405r2604q5624p9529
56148A952070p5967p3026o8861o4380o0705n6850n1801m6674m2741l9300l5256
56137A336509l1227k8271k6003k3491k0936j9121j8238j8076j8183j7396j4688
$$ plain form
56126 1100879 1089848 1081127 1072824 1064772 1057852 1052002 1046514 1041624 1038028 1035330 1032772 1031164 1032275 1036161
56112 1036161 1040614 1043421 1044222 1044422 1046295 1051680 1060255 1069482 1077353 1084626 1093205 1103259 1113567 1124008
56098 1124008 1135832 1149757 1165410 1182428 1200598 1219275 1238262 1259035 1283501 1311644 1341804
56087 1341804 1373120 1406396 1442831 1483400 1529388 1582237 1642785 1711449 1788689 1874208 1966071
56076 1966071 2061363 2157041 2249498 2334718 2410382 2476905 2535455 2586589 2632273 2677020 2723966
56065 2723966 2770665 2811266 2842228 2863648 2876187 2880020 2876744 2869120 2857952 2841079 2815720 2780043
56053 2780043 2732458 2671815 2599425 2519677 2438037 2358798 2284153 2214161 2147930 2085858 2030089
56042 2030089 1981976 1940444 1904230 1874148 1851172 1833677 1818936 1806390 1797186 1791475 1788514 1788481
$$ packed form
56126A100879j1031q721q303q052o920n850n488m890l596k698k558j608J111L886
56112A036161M453K807Q01K00J873N385Q575R227P871P273Q579J0054J0308J0441
56098A124008J1824J3925J5653J7018J8170J8677J8987K0773K4466K8143L0160
56087A341804L1316L3276L6435M0569M5988N2849O0548O8664P7240Q5519R1863
56076A966071R5292R5678R2457Q5220P5664O6523N8550N1134M5684M4747M6946
56065B723966M6699M0601L0962K1420J2539L833l276p624j1168j6873k5359l5677
56053B780043m7585o0643p2390p9748q1640p9239p4645o9992o6231o2072n5769
56042B030089m8113m1532l6214l0082k2976j7495j4741j2546r204n711k961l3
$$ plain form
56030 1788481 1791729 1797086 1803285 1811123 1821704 1833473 1843793 1852718 1862553 1874409 1887854 1903028
56018 1903028 1920129 1937557 1953581 1969263 1986895 2006378 2026131 2046611 2069477 2094023 2118104
56007 2118104 2142117 2168392 2197000 2225870 2254865 2285955 2319299 2352873 2386130 2420494 2456141
55996 2456141 2491871 2528262 2567267 2608460 2649272 2689105 2729597 2770760 2810803 2850051 2891115
55985 2891115 2934749 2979358 3025028 3074159 3127532 3183485 3241427 3302346 3365582 3429031 3492921
55974 3492921 3559405 3628223 3697042 3766387 3839746 3918336 4000322 4085704 4177151 4275187 4377354
55963 4377354 4482995 4594182 4711102 4831557 4955931 5087427 5226194 5368527 5513464
55954 5513464 5665132 5827126 5999709 6184043 6383771 6600394 6831866 7077497 7339574
$$ packed form
56030A788481L248N357O199P838J0581J1769J0320Q925R835J1856J3445J5174
56018A903028J7101J7428J6024J5682J7632J9483J9753K0480K2866K4546K4081
56007B118104K4013K6275K8608K8870K8995L1090L3344L3574L3257L4364L5647
55996B456141L5730L6391L9005M1193M0812L9833M0492M1163M0043L9248M1064
55985B891115M3634M4609M5670M9131N3373N5953N7942O0919O3236O3449O3890
55974C492921O6484O8818O8819O9345P3359P8590Q1986Q5382R1447R8036J02167
55963D377354J05641J11187J16920J20455J24374J31496J38767J42333J44937
55954E513464J51668J61994J72583J84334J99728K16623K31472K45631K62077
$$ plain form
55945 7339574 7619075 7915154 8230178 8569765 8936380 9328282 9745817 10192805 10670672
55936 10670672 11177767 11715673 12289251 12898920 13540294 14213327 14924115 15675411 16463343
55927 16463343 17286449 18150319 19060448 20018531 21029099 22101877 23244017 24457433 25746642
55918 25746642 27121520 28590253 30158580 31838327 33646876 35595370 37687380 39931320
55910 39931320 42343161 44935544 47718231 50713100 53955418 57477950 61310302 65498980
55902 65498980 70113520 75233202 80952479 87408629 94784621 103281050 113112696 124540826
55894 124540826 137878640 153453674 171592734 192636547 216893943 244519826 275407944
55887 275407944 309046611 344114267 377906661 406288680 424796573 430476573 423143188
$$ packed form
55945G339574K79501K96079L15024L39587L66615L91902M17535M46988M77867
55936A0670672N07095N37906N73578O09669O41374O73033P10788P51296P87932
55927A6463343Q23106Q63870R10129R58083J010568J072778J142140J213416J289209
55918B5746642J374878J468733J568327J679747J808549J948494K092010K243940
55910C9931320K411841K592383K782687K994869L242318L522532L832352M188678
55902F5498980M614540N119682N719277O456150P375992Q496429R831646J1428130
55894A24540826J3337814J5575034J8139060K1043813K4257396K7625883L0888118
55887B75407944L3638667L5067656L3792394K8382019J8507893N680000p333385
$$ plain form
55880 423143188 405147137 380043426 351269709 321494746 292517250 265371948 240510181
55873 240510181 218027163 197847218 179808104 163697634 149298152 136414490 124863910
55866 124863910 114468767 105078252 96582417 88892912 81923732 75598620 69859522 64654599
55858 64654599 59928600 55632801 51731730 48190851 44967825 42023258 39330011 36865029
55850 36865029 34601869 32518270 30602007 28842165 27222185 25726893 24348069 23077021
55842 23077021 21899023 20800710 19776041 18819917 17922900 17077522 16283355 15540713 14845060
55833 14845060 14191978 13581460 13012587 12479667 11978165 11508916 11072037 10661931 10272611
55824 10272611 9902922 9552375 9217018 8893954 8585251 8292892 8013910 7744416 7484156
$$ packed form
55880D23143188j7996051k5103711k8773717k9774963k8977496k7145302k4861767
55873B40510181k2483018k0179945j8039114j6110470j4399482j2883662j1550580
55866A24863910j0395143r390515q495835p689505o969180o325112n739098n204923
55858F4654599m725999m295799l901071l540879l223026k944567k693247k464982
55850C6865029k263160k083599j916263j759842j619980j495292j378824j271048
55842B3077021j177998j098313j024669r56124q97017q45378p94167p42642o95653
55833A4845060o53082o10518n68873n32920n01502m69249m36879m10106l89320
55824A0272611l69689l50547l35357l23064l08703k92359k78982k69494k60260
$$ plain form
55815 7484156 7233091 6987564 6744038 6503146 6266639 6034170 5806689 5589058 5385227
55806 5385227 5193898 5012174 4840019 4677817 4523273 4374465 4232637 4098391 3968427
55797 3968427 3839716 3713764 3593106 3476778 3363240 3254691 3153927 3059067 2965699 2872658
55787 2872658 2781897 2694098 2608197 2524170 2442885 2363843 2285785 2208815 2133679 2059957 1987044
55776 1987044 1915779 1847318 1781803 1719753 1662926 1611788 1564034 1517638 1473574 1433404 1396186
55765 1396186 1360176 1325834 1294507 1265504 1236941 1208375 1180440 1152993 1125698 1099420 1075173
55754 1075173 1052733 1031834 1013387 997843 983818 970081 957458 946955 937527 927572 917264 907569
55742 907569 898489 890295 884944 883897 885552 886997 887447 888038 889265 890680 892434 895106 898432 901683 904714
$$ packed form
55815G484156k51065k45527k43526k40892k36507k32469k27481k17631k03831
55806E385227j91329j81724j72155j62202j54544j48808j41828j34246j29964
55797C968427j28711j25952j20658j16328j13538j08549j00764r4860r3368r3041
55787B872658r0761q7799q5901q4027q1285p9042p8058p6970p5136p3722p2913
55776A987044p1265o8461o5515o2050n6827n1138m7754m6396m4064m0170l7218
55765A396186l6010l4342l1327k9003k8563k8566k7935k7447k7295k6278k4247
55754A075173k2440k0899j8447j5544j4025j3737j2623j0503r428r955j0308r695
55742I07569r080q194n351j047J655J445M50N91J227J415J754K672L326L251L031
$$ plain form
55727 904714 907400 908920 908886 908077 906618 902508 893546 879855 863265 845317 827226 810475 795696
55714 795696 781904 768427 756624 748160 742626 738407 734831 731685 727550 720541 710271 697721 683963
55701 683963 670365 659007 650996 644888 638287 630501 622360 614198 605592 596560 587519 578381 568857 559211
55687 559211 549759 540316 531082 523152 517011 511497 505542 499942 495948 493001 489399 484616 479552 475129
55673 475129 471903 470303 469809 468519 464990 460000 455164 450458 444589 437324 429900 423324 417501 411941
55659 411941 406349 400784 396048 393462 393448 394881 396598 398757 401935 405820 409796 413817 417564 419749 419615
55644 419615 418243 416969 415264 411617 405868 399220 392458 385491 378250 370815 363094 355350 348472 342823
55630 342823 337716 333004 329961 329130 328465 325406 320082 314840 311470 310628 312973 318466 324804 328799 329533
$$ packed form
55727I04714K686J520l4q09j459m110q962j3691j6590j7948j8091j6751j4779
55714G95696j3792j3477j1803q464n534m219l576l146m135p009j0270j2550j3758
55701F83963j3598j1358q011o108o601p786q141q162q606r032r041r138r524r646
55687E59211r452r443r234p930o141n514n955n600l994k947l602m783n064m423
55673D75129l226j600m94j290l529m990m836m706n869p265p424o576n823n560
55659D11941n592n565m736k586j4J433J717K159L178L885L976M021L747K185j34
55644D19615j372j274j705l647n749o648o762o967p241p435p721p744o878n649
55630C42823n107m712l043q31o65l059n324n242l370q42K345N493O338L995P34
$$ plain form
55615 329533 328458 326702 324315 322078 321657 323154 324328 323154 319930 316282 313364 311707 311583 312601 313684
55600 313684 314151 314275 314429 314359 313771 313004 312590 312457 311927 310474 308400 306873 307014 308669 310420 311192 311492
55583 311492 312656 315245 318728 322265 325135 326695 326605 324935 321721 316822 310629 304352 299011 294479 289954
55568 289954 284834 278737 271464 263680 256987 252557 250156 249051 249129 250379 251953 252667 252056 250355 247992
55553 247992 245542 243410 241103 237701 233529 230138 227993 225646 222152 218766 216833 215526 213467 211318
55539 211318 210629 210909 210078 207543 204829 203254 202756 203048 204212 205816 206819 206707 205828 204623 203360 202435
55523 202435 202028 201782 201633 202355 204395 206960 209421 212669 217612 223201 227682 231189 235226 240063 244476
55508 244476 247786 250275 251930 252636 253340 254987 256407 255396 251977 248459 245999 243257 239019 234112 229967
$$ packed form
55615C29533j075j756k387k237m21J497J174j174l224l648k918j657j24J018J083
55600C13684M67J24J54p0n88p67m14j33n30j453k074j527J41J655J751P72L00
55583C11492J164K589L483L537K870J560r0j670l214m899o193o277n341m532m525
55568B89954n120o097p273p784o693m430k401j105P8J250J574P14o11j701k363
55553B47992k450k132k307l402m172l391k145k347l494l386j933j307k059k149
55539B11318o89K80q31k535k714j575m98K92J164J604J003j12q79j205j263r25
55523B02435m07k46j49P22K040K565K461L248M943N589M481L507M037M837M413
55508B44476L310K489J655P06P04J647J420j011l419l518k460k742m238m907m145
$$ plain form
55493 229967 226965 224944 223701 222290 219327 214782 210157 206356 202842 199327 196571 194616 191958 187756
55479 187756 183606 181814 182691 184581 185866 186214 186499 188099 191558 195423 197285 196391 194375 192955 191979
55464 191979 190295 187533 184300 181403 179497 178759 178407 177258 175113 172787 170608 168051 165184 163161 162620
55449 162620 162740 162656 162703 163453 164571 165528 166498 167673 168546 168804 169101 169957 170601 169972 168218 166204 163999 161015
55431 161015 157383 154278 152785 153002 154093 154810 154211 152319 149944 147783 146118 145438 146544 149571 153595
55416 153595 157611 161223 163993 164982 163814 161597 160011 159758 160437 161399 162137 162176 161273 159580 157371 155008
55400 155008 153410 153817 156472 160010 162740 164143 164688 164769 164485 164018 163481 162615 161233 159789 159005 159098 159730
55383 159730 160473 160924 160667 159579 158072 156763 156092 156364 157734 159831 161749 162748 162774 162159 161254 160519 160381
$$ packed form
55493B29967l002k021j243j411k963m545m625l801l514l515k756j955k658m202
55479A87756m150j792Q77J890J285L48K85J600L459L865J862q94k016j420r76
55464A91979j684k762l233k897j906p38l52j149k145k326k179k557k867k023n41
55449A62620J20q4M7P50J118R57R70J175Q73K58K97Q56O44o29j754k014k205k984
55431A61015l632l105j493K17J091P17n99j892k375k161j665o80J106L027M024
55416A53595M016L612K770R89j168k217j586k53O79R62P38L9r03j693k209k363
55400A55008j598M07K655L538K730J403N45Q1k84m67n37q66j382j444p84R3O32
55383A59730P43M51k57j088j507j309o71K72J370K097J918R99K6o15r05p35j38
$$ plain form
55366 160381 160593 160250 158930 157476 157116 158045 159382 160397 161322 162841 165079 167297 168689 169386 170300 171813
55350 171813 173060 173007 171778 170189 168341 165682 162418 159838 158884 159154 159489 158924 157010 154104 151579 150829
55334 150829 151704 152633 152559 151941 151653 151913 152788 154719 157707 160636 162256 162502 162282 162267 162291 161622 159664 156822
55316 156822 154717 154796 156505 157664 156920 154945 152912 150865 148257 145206 142363 140150 138850 138876 140235
55301 140235 142142 143734 144735 145057 144538 143598 143381 144465 146027 147034 147644 148678 150210 151500 151979 151633
55285 151633 150790 150065 150120 150950 151869 152569 153447 154337 153933 151426 147976 145446 144291 143825 143988 145379 147624
55268 147624 149122 148777 147133 145527 144806 145055 145945 147106 148554 150747 153766 156584 157839 157422 156748 157188
55252 157188 158617 159771 159718 158651 157194 155337 152526 148961 146140 145476 146779 148868 151272 154112 156572
$$ packed form
55366A60381K12l43j320j454l60R29J337J015R25J519K238K218J392O97R14J513
55350A71813J247n3j229j589j848k659l264k580r54K70L35n65j914k906k525p50
55334A50829Q75R29p4o18k88K60Q75J931K988K929J620K46k20j5K4o69j958k842
55316A56822k105P9J709J159p44j975k033k047k608l051k843k213j300K6J359
55301A40235J907J592J001L22n19r40k17J084J562J007O10J034J532J290M79l46
55285A51633q43p25N5Q30R19P00Q78Q90m04k507l450k530j155m66J63J391K245
55268A47624J498l45j644j606p21K49Q90J161J448K193L019K818J255m17o74M40
55252A57188J429J154n3j067j457j857k811l565k821o64J303K089K404K840K460
$$ plain form
55237 156572 157232 156304 155900 157181 158733 158807 157831 157323 157546 157968 159102 161883 165456 167455 166622 163855 160607
55220 160607 157627 155392 154445 154854 156169 158028 160013 161082 160341 158414 156838 155941 154552 152054 149469
55205 149469 147979 147532 147575 148133 149348 150779 152032 153554 155886 158497 160165 160396 159774 158949 157807 155880
55189 155880 153282 151013 150257 151349 153503 155620 157134 157937 157963 157410 157097 157778 158995 159334 158158 156569
55173 156569 156237 157555 159256 159639 157970 154891 151713 149273 147458 145836 144553 144270 145290 147154 149192
55158 149192 151141 152965 154269 154230 152335 149236 146612 145796 146572 147786 149152 151665 155757 159753 161091
55143 161091 158922 154820 151081 148999 148763 150088 152454 155121 157330 158616 158974 158937 159331 160661 162791
55128 162791 165345 168164 170982 172963 173135 171377 168618 166057 164437 163881 164077 164598 165250 165952 166196 165128
$$ packed form
55237A56572O60r28m04J281J552P4r76n08K23M22J134K781L573J999q33k767l248
55220A60607k980k235r47M09J315J859J985J069p41j927j576q97j389k498k585
55205A49469j490m47M3N58J215J431J253J522K332K611J668K31o22q25j142j927
55189A55880k598k269p56J092K154K117J514Q03K6n53l13O81J217L39j176j589
55173A56569l32J318J701L83j669l079l178k440j815j622j283k83J020J864K038
55158A49192J949J824J304l9j895l099k624q16P76J214J366K513M092L996J338
55143A61091k169m102l739k082k36J325K366K667K209J286L58l7L94J330K130
55128A62791K554K819K818J981J72j758k759k561j620n56J96N21O52P02K44j068
$$ plain form
55112 165128 162597 159689 157636 156582 156081 156428 158465 162058 165728 168147 169281 169673 169192 167123 163350
55097 163350 158997 155821 154953 156100 157920 159255 160067 161141 162987 165094 166217 165443 163244 161418 161552
55082 161552 163409 165237 165714 165076 164265 163830 164058 165259 167113 168339 167913 166168 164058 161934 160003 159407
55066 159407 161481 165962 170962 174784 176972 177744 177448 176749 176383 176350 175948 174746 172945 170879 168877 167599
55050 167599 167615 168495 169052 168686 167816 166910 165912 164869 164427 165271 167473 170478 173356 175206 176007 176991 179381
55033 179381 182765 185511 186784 187228 187532 187385 186216 184129 181665 179393 178010 178043 179080 180021 180451 180905
55017 180905 181485 181244 179657 177811 177182 177817 178580 178818 178893 179272 179877 180362 180616 180970 182059 184189 186639
55000 186639 188034 187841 187076 187098 188000 188726 188466 187322 185722 183837 181807 180175 179642 180247 180984 180592 178922
$$ packed form
55112A65128k531k908k053j054n01L47K037L593L670K419J134L92m81k069l773
55097A63350m353l176q68J147J820J335Q12J074J846K107J123p74k199j826J34
55082A61552J857J828M77o38q11m35K28J201J854J226m26j745k110k124j931n96
55066A59407K074M481N000L822K188P72k96o99l66l3m02j202j801k066k002j278
55050A67599J6Q80N57l66q70r06r98j043m42Q44K202L005K878J850Q01R84K390
55033A79381L384K746J273M44L04j47j169k087k464k272j383L3J037R41M30M54
55017A80905N80k41j587j846o29O35P63K38P5L79O05M85K54L54J089K130K450
55000A86639J395j93p65K2R02P26k60j144j600j885k030j632n33O05P37l92j670
$$ plain form
54983 178922 177196 176636 177128 177680 177795 177652 177272 176425 175374 174740 174432 173657 172277 171305 171642 173087 174971
54966 174971 176914 178438 178711 177473 175634 174232 173304 172490 172227 173456 176277 179587 182068 183140 183128 182911
54950 182911 183310 184498 185997 187229 187819 187569 186770 186517 187767 189849 190882 190097 188761 188218 188131 187642 187273
54933 187273 188273 190648 193258 195645 198335 201185 202720 201713 198728 195654 194005 193849 194020 193330 191814
54918 191814 190686 190865 191923 192933 193895 195587 198296 201518 204694 207337 208540 207388 204099 200028 196309
54903 196309 193091 190208 187843 186307 185780 186438 188152 189941 190700 190874 192513 196798 202093 205281 204841
54888 204841 201888 198429 195550 193504 192701 193711 196313 199178 200939 201410 201402 201384 200868 199385 197571 196662
54872 196662 197070 198046 198718 198933 199094 199803 201806 205603 210627 215186 217711 218014 217263 217082 218753 222727
$$ packed form
54983A78922j726n60M92N52J15j43l80q47j051o34l08p75j380r72L37J445J884
54966A74971J943J524K73j238j839j402r28q14k63J229K821L310K481J072j2k17
54950A82911L99J188J499J232N90k50p99k53J250K082J033p85j336n43q7m89l69
54933A87273J000K375K610K387K690K850J535j007k985l074j649j56J71o90j516
54918A91814j128J79J058J010R62J692K709L222L176K643J203j152l289m071l719
54903A96309l218k883k365j536n27O58J714J789P59J74J639M285N295L188m40
54888B04841k953l459k879k046q03J010K602K865J761M71qj8n16j483j814r09
54872A96662M08R76O72K15J61P09K003L797N024M559K525L03p51j81J671L974
$$ plain form
54856 222727 228372 234477 240406 246545 253267 259844 264950 268045 269625 270182 269662 268037 265727 263046 259761
54841 259761 255680 251331 247522 244377 241338 238113 235152 233011 231556 230079 228127 226078 224853 224992
54827 224992 225961 226444 225467 223230 220878 219600 219979 221689 223421 223529 221595 219358 219380 222585 227705 233254
54811 233254 239080 245471 251751 256864 260852 264492 267578 268809 267707 265622 264226 263727 263175 261897 259823
54796 259823 256836 252772 248136 243975 240661 237339 233052 228074 223588 220110 216929 213344 209835 207386
54782 207386 205905 204158 201390 198253 195762 193957 192168 190186 188539 187820 188303 189961 192302 194377 195596
54767 195596 196413 197578 198872 199352 198856 198415 198946 200181 201225 201584 201406 201241 201893 203999 207284 210499
54751 210499 212394 212603 211556 209923 208280 206838 205316 203467 201805 201286 202054 203107 203583 203805 204613 206104
$$ packed form
54856B22727N645O105N929O139O722O577N106L095J580N57n20j625k310k681l285
54841B59761m081m349l809l145l039l225k961k141j455j477j952k049j225J39
54827B24992R69M83r77k237k352j278L79J710J732J08j934k237K2L205N120N549
54811B33254N826O391O280N113L988L640L086J231j102k085j396m99n52j278k074
54796B59823k987m064m636m161l314l322m287m978m486l478l181l585l509k449
54782B07386j481j747k768l137k491j805j789j982j647p19M83J658K341K075J219
54767A95596Q17J165J294M80m96m41N31J235J044L59j78j65O52K106L285L215
54751B10499J895K09j047j633j643j442j522j849j662n19P68J053M76K22Q08J491
$$ plain form
54735 206104 207568 208497 209159 210187 211815 213430 213900 212660 210478 208761 208046 207766 207516 207703 208573 209447
54719 209447 209725 209995 211242 213246 214659 214675 213903 213575 214497 216820 220178 223827 227217 230764 235658 242506
54703 242506 250332 257282 262311 266004 269800 274708 280760 287279 293247 297533 299337 298699 296335 292836
54689 292836 288312 282997 277749 273482 270345 267806 265268 262255 258368 253648 248660 243715 238406 232626
54675 232626 227544 224518 223255 222184 220633 219508 219644 220651 221768 222841 223927 224799 225409 226193 227524
54660 227524 229479 232381 236737 242317 248143 253766 259703 266246 272720 278295 282579 285009 284814 282153
54646 282153 278253 273781 268288 261945 256378 252606 249315 244626 238729 233511 230389 229751 231465 234258
54632 234258 235362 232791 227820 223504 220966 218838 216308 214674 215390 218124 221485 224307 225540 224111
$$ packed form
54735B06104J464R29O62J028J628J615M70j240k182j717p15k80k50J87Q70Q74
54719B09447K78K70J247K004J413J6p72l28R22K323L358L649L390L547M894O848
54703B42506P826O950N029L693L796M908O052O519N968M286J804o38k364l499
54689B92836m524n315n248m267l137k539k538l013l887m720m988m945n309n780
54675B32626n082l026j263j071j551j125J36J007J117J073J086Q72O10P84J331
54660B27524J955K902M356N580N826N623N937O543O474N575M284K430j95k661
54646B82153l900m472n493o343n567l772l291m689n897n218l122o38J714K793
54632B34258J104k571m971m316k538k128k530j634P16K734L361K822J233j429
$$ plain form
54618 224111 220003 214863 210752 208566 208014 208494 209487 210495 211192 211537 211599 211401 210979 210349 209483 208499 207676
54601 207676 206923 205691 203948 202925 204028 207070 210282 212078 212257 211574 210862 210669 211069 211575 211556 210791 209450
54584 209450 207759 206018 204594 203534 202572 201899 202305 203969 205747 206492 206421 206251 205665 203946 201739 200727
54568 200727 201527 203147 204590 205847 207155 208346 209241 209843 209933 209215 207945 206705 205637 204642 204189 204973
54552 204973 206803 208680 209909 210412 210242 209732 209686 210282 210168 207995 204588 202094 201208 200845 200419 200552 201336
54535 201336 201827 201796 202160 202983 202791 200758 198070 196250 195608 196117 198078 200687 201559 199435 196356 195520 197644
54518 197644 200807 203319 205260 207405 209881 212102 213433 213917 214494 216059 218205 219581 219567 218536 216381
54503 216381 212394 207229 203361 202361 202962 203158 203120 204568 208033 212165 215223 216087 214494 211585 209679
$$ packed form
54618B24111m108n140m111k186n52M80R93J008O97L45O2j98m22o30q66r84q23
54601B07676p53j232j743j023J103L042L212J796J79o83p12j93M00N06j9p65j341
54584B09450j691j741j424j060r62o73M06J664J778P45p1j70n86j719k207j012
54568B00727Q00J620J443J257J308J191Q95O02R0p18j270j240j068r95m53P84
54552B04973J830J877J229N03j70n10m6N96j14k173l407k494q86l63m26J33P84
54535B01336M91l1L64Q23j92k033k688j820o42N09J961K609Q72k124l079q36K124
54518A97644L163K512J941K145K476K221J331M84N77J565K146J376j4j031k155
54503B16381l987n165l868j000O01J96l8J448L465M132L058Q64j593k909j906
$$ plain form
54488 209679 210173 212029 213369 213955 214867 216395 217836 219117 221061 223907 226704 228387 228669 227976 227210 227319
54472 227319 228290 228939 228439 227524 227250 227313 226759 225776 225287 225181 224602 223877 224429 226489 228307 228093 225715 222248
54454 222248 219043 217451 218200 220442 222362 223217 223869 224906 225374 224194 222031 220693 220895 221390 220487 218049
54438 218049 215765 215445 217140 219229 220298 220354 219988 219233 217983 216770 216018 214961 212575 209497 207813 208781
54422 208781 211695 215150 218421 221408 224148 226863 229877 233219 236771 240710 245117 249175 251703 252638
54408 252638 253132 253894 254278 253373 251237 248680 246506 245385 245797 247515 249520 250860 251408 251612 251905 252521
54392 252521 253428 254148 254004 252840 251287 250109 249409 248498 246558 243589 240767 239413 239336 238812 236711 233963
54376 233963 232145 231310 230382 229227 228922 230012 231896 234123 236981 240397 243483 245725 247688 249892 251891
$$ packed form
54488B09679M94J856J340N86R12J528J441J281J944K846K797J683K82o93p66J09
54472B27319R71O49n00r15k74O3n54r83m89j06n79p25N52K060J818k14k378l467
54454B22248l205j592P49K242J920Q55O52J037M68j180k163j338K02M95r03k438
54438B18049k284l20J695K089J069N6l66p55j250j213p52j057k386l078j684R68
54422B08781K914L455L271K987K740K715L014L342L552L939M407M058K528R35
54408B52638M94P62L84r05k136k557k174j121M12J718K005J340N48K04K93O16
54392B52521R07P20j44j164j553j178p00r11j940k969k822j354p7n24k101k748
54376B33963j818q35r28j155l05J090J884K227K858L416L086K242J963K204J999
$$ plain form
54361 251891 253105 253856 254956 256721 258827 260616 261197 259892 257038 253948 251774 250819 250936 251767 252448 251967
54345 251967 250328 248653 247813 247729 248250 249658 251677 253072 253171 253095 254408 257072 259694 261496 263054 265199
54329 265199 268044 271181 274104 276197 276822 275821 273848 272018 271060 270737 270175 268930 267479 266440 265757
54314 265757 265324 265927 268403 271820 273817 273383 272257 272744 274878 276652 276675 275634 275194 276132 277807 279189
54298 279189 280209 281814 284557 287595 289731 291132 293005 295654 297950 299007 299195 299035 298130 295865 292297
54283 292297 287745 282415 277074 273103 270916 269117 266181 262421 259455 258347 258998 260632 261921 261408 259005
54268 259005 256587 256010 257009 258138 259186 261109 263803 265520 264896 262437 259649 257561 256447 256104 255957
54253 255957 255334 254027 252361 250731 249394 248554 248306 248632 249658 251434 253163 253416 251862 250074 249684 250367
$$ packed form
54361B51891J214P51J100J765K106J789N81j305k854l090k174r55J17Q31O81m81
54345B51967j639j675q40q4N21J408K019J395R9p6J313K664K622J802J558K145
54329B65199K845L137K923K093O25j001j973j830r58l23n62j245j451j039o83
54314B65757m33O03K476L417J997m34j126M87K134J774K3j041m40R38J675J382
54298B79189J020J605K743L038K136J401J873K649K296J057J88j60r05k265l568
54283B92297m552n330n341l971k187j799k936l760k966j108O51J634J289n13k403
54268B59005k418n77R99J129J048J923K694J717o24k459k788k088j114l43j47
54253B55957o23j307j666j630j337q40k48L26J026J776J729K53j554j788l90O83
$$ plain form
54237 250367 250689 250283 249849 249439 248437 247208 247218 249197 252268 255052 256456 255572 252456 249390 249599 253780
54221 253780 259149 262684 264163 265184 266513 267649 268122 267874 266814 265039 263191 261810 260734 259798 259406
54206 259406 259553 259009 256763 253927 252970 254986 258655 261826 263246 262873 261641 261168 262647 265502 267746
54191 267746 268030 266830 265324 263785 261647 258767 256007 254592 255075 256827 258439 258823 258099 257222 256750 256340
54175 256340 255591 254845 254614 254555 253746 252047 250476 249854 249635 248798 247690 247955 250353 253446 255197 255448 255902
54158 255902 257768 260379 262350 263150 263029 262139 260560 258712 256910 254716 251604 248238 246276 246690 248966
54143 248966 252179 256010 260192 263682 265411 265707 266115 267500 268965 268968 267098 264309 261710 259717 258326
54128 258326 257555 257273 256941 256101 255047 254660 255424 256880 258260 259394 260686 262203 263207 262860 261294 259694
$$ packed form
54237B50367L22m06m34m10j002j229J0J979L071K784J404q84l116l066K09M181
54221B53780N369L535J479J021J329J136M73k48j060j775j848j381j076r36l92
54206B59406J47n44k246k836r57K016L669L171J420l73j232m73J479K855K244
54191B67746K84j200j506j539k138k880k760j415M83J752J612L84p24q77m72m10
54175B56340p49p46k31n9q09j699j571o22k19q37j108K65K398L093J751K51M54
54158B55902J866K611J971Q00j21q90j579j848j802k194l112l366j962M14K276
54143B48966L213L831M182L490J729K96M08J385J465Lj870k789k599j993j391
54128B58326p71k82l32q40j054l87P64J456J380J134J292J517J004l47j566j600
$$ plain form
54112 259694 259181 259801 260752 261492 262229 263193 263789 262994 260725 258436 257936 259520 261527 261910 260187 257626 255612
54095 255612 254203 252484 250012 247422 245692 245289 246221 248323 251031 253122 253320 251365 248318 245787 244929
54080 244929 245932 248003 249811 250426 250215 250692 253177 257443 261734 264141 264161 263090 262918 264702 267878 271046
54064 271046 273216 274207 274146 273055 271057 268728 266966 266439 267009 267631 267100 265217 263240 262864 264728 268181
54048 268181 272309 276620 280583 283223 283745 282318 279832 277106 274749 273401 273358 273960 274149 273868 274235 275949
54032 275949 278140 279483 280096 281479 284556 288482 291688 293544 294646 295743 296816 297191 296439 295200 294967
54017 294967 296726 299874 303066 306119 310172 315633 321034 324949 328289 333302 340499 347894 353330 356133
54003 356133 356225 353312 348071 342879 339793 338207 335838 331828 327729 325342 324741 324751 324564 324377 324916 326743
$$ packed form
54112B59694n13O20R51P40P37R64N96p95k269k289n00J584K007L83j723k561k014
54095B55612j409j719k472k590j730m03R32K102K708K091J98j955l047k531q58
54080B44929J003K071J808O15k11M77K485M266M291K407K0j071j72J784L176L168
54064B71046K170R91o1j091j998k329j762n27N70O22n31j883j977l76J864L453
54048B68181M128M311L963K640N22j427k486k726k357j348m3O02J89k81L67J714
54032B75949K191J343O13J383L077L926L206J856J102J097J073L75p52j239k33
54017B94967J759L148L192L053M053N461N401L915L340N013P197P395N436K803
54003C56133R2k913n241n192l086j586k369m010m099k387o01J0j87j87N39J827
$$ plain form
53987 326743 329719 332914 335244 336374 336899 337798 339925 343814 349394 355847 362163 367953 373546 379448 386018
53972 386018 393473 401668 409896 417282 423278 427507 429601 429884 429787 430561 431775 432227 432310 433977 437858 441777
53956 441777 443126 441664 438949 435966 432754 429710 427470 425334 421410 415049 408119 403078 400447 398897
53942 398897 397402 396347 396486 397491 397934 396518 393130 388692 384154 379790 375437 371123 367063 363127 358810
53927 358810 353958 349240 345561 343065 341047 338799 336226 333592 331013 328430 325852 323276 320517 317558
53913 317558 315178 314819 317496 322848 329301 335042 338908 340792 341512 342134 343111 344141 344836 345195 345297 345069
53897 345069 344801 345476 347922 351856 356393 361303 367037 373498 379566 384120 387011 388872 390497 392532 395216
53882 395216 398162 400967 404283 409652 417802 427534 436835 444819 452205 460203 469352 479352 489696 500470
$$ packed form
53987C26743K976L195K330J130N25Q99K127L889N580O453O316N790N593N902O570
53972C86018P455Q195Q228P386N996M229K094K83r7P74J214M52Q3J667L881L919
53956D41777J349j462k715k983l212l044k240k136l924o361o930n041k631j550
53942C98897j495j055J39J005M43j416l388m438m538m364m353m314m060l936m317
53927C58810m852m718l679k496k018k248k573k634k579k583k578k576k759k959
53913C17558k380l59K677N352O453N741L866J884P20O22R77J030O95L59J02k28
53897C45069k68O75K446L934M537M910N734O461O068M554K891J861J625K035K684
53882C95216K946K805L316N369Q150R732R301P984P386P998R149J0000J0344J0774
$$ plain form
53868 500470 512429 525855 539267 549912 555982 558035 557945 556933 555054 552207 549041 546834 546712 548784
53854 548784 551926 554780 557119 559788 563254 566904 570028 572617 574617 575265 574038 571670 569318 567156
53840 567156 564656 561718 558570 555013 550867 546795 543378 539472 532940 523348 512856 504131 498216 494502
53826 494502 491483 487189 480199 471160 462539 456133 451307 446112 439403 431379 422927 415170 409050 404593
53812 404593 401033 398136 396609 396528 396274 394148 390476 386949 384189 381189 377051 372112 367231 362979 359775
53797 359775 357861 356783 355582 353853 352046 350526 349009 347185 345261 343486 341701 339756 337939 336612
53783 336612 335903 336038 337404 339681 341380 341031 338845 336716 336508 338492 341286 342947 342363 340026 337561
53768 337561 336251 336066 336199 336259 336591 337614 339328 341424 343486 345092 346090 346878 348162 350354 353395 357065
$$ packed form
53868E00470J1959J3426J3412J0645O070K053r0j012j879k847l166k207j22K072
53854E48784L142K854K339K669L466L650L124K589K000O48j227k368k352k162
53840E67156k500k938l148l557m146m072l417l906o532r592j0492q725n915l714
53826D94502l019m294o990r039q621o406m826n195o709q024q452p757o120m457
53812D04593l560k897j527q1k54k126l672l527k760l000m138m939m881m252l204
53797C59775j914j078j201j729j807j520j517j824j924j775j785j945j817j327
53783C36612p09J35J366K277J699l49k186k129k08J984K794J661n84k337k465
53768C37561j310j85J33O0L32J023J714K096K062J606R98P88J284K192L041L670
$$ plain form
53752 357065 361092 365064 368646 371974 375401 378783 381455 383211 384955 388035 393078 399634 406732 413634
53738 413634 420296 427209 434496 441105 445433 447100 447628 448881 451171 453481 455108 456252 457154 457586 457496
53723 457496 457354 457386 456956 455248 452382 449427 447299 445729 443340 438871 432572 426216 421278 417275 412562
53708 412562 406751 401406 397961 395834 393401 390287 387668 386364 385517 383495 379677 375007 370890 367756
53694 367756 364896 361782 359240 358748 360622 363579 366269 368399 369973 370430 369486 368130 367628 367969 368368 368948
53678 368948 370480 372496 373219 371919 370137 369834 371279 373472 375819 378430 381326 384269 387133 389687 391307
53663 391307 391611 391231 391409 392833 395295 398232 401139 403627 405669 407737 410345 413513 416880 420100 422834
53648 422834 424757 426076 427694 430299 433538 436641 439549 442755 446358 450062 453904 458069 462056 465110
$$ packed form
53752C57065M027L972L582L328L427L382K672J756J744L080N043O556P098O902
53738D13634O662O913P287O609M328J667N28J253K290K310J627J144R02M32r0
53723D57496j42L2m30j708k866k955k128j570k389m469o299o356m938m003m713
53708D12562n811n345l445k127k433l114k619j304q47k022l818m670m117l134
53694C67756k860l114k542m92J874K957K690K130J574M57r44j356n02L41L99N80
53678C68948J532K016P23j300j782l03J445K193K347K611K896K943K864K554J620
53663C91307L04l80J78J424K462K937K907K488K042K068K608L168L367L220K734
53648D22834J923J319J618K605L239L103K908L206L603L704L842M165L987L054
$$ plain form
53634 465110 467621 470901 475129 478563 479578 478682 477667 477431 477710 478462 480152 482556 484436 484923 484478 484016
53618 484016 483621 482662 480745 477962 474538 470926 468107 467033 467496 468109 467806 466987 466697 466938 466485 464540
53602 464540 461980 460566 461164 463163 465424 467245 468264 468102 466686 464888 464243 465663 468478 470941 471738
53587 471738 470994 469938 469798 471049 473486 476633 480020 483366 486808 490855 495789 501029 505388 508217 510091
53572 510091 512021 514173 515889 517061 518757 521937 526069 529877 533318 537826 544339 552036 559552 566647
53558 566647 573866 581204 588214 595075 602449 610313 618059 625801 634407 643873 652795 660013 665785 670653
53544 670653 674269 676298 677602 679202 680671 680881 680021 679475 679874 680683 681721 683430 685172 684876 681456 676468
53528 676468 672210 669011 665643 661767 658456 656354 654716 652679 650448 648593 646878 644541 641452 638327
$$ packed form
53634D65110K511L280M228L434J015q96j015k36K79P52J690K404J880M87m45m62
53618D84016l95r59j917k783l424l612k819j074M63O13l03q19k90K41m53j945
53602D64540k560j414N98J999K261J821J019j62j416j798o45J420K815K463P97
53587D71738p44j056j40J251K437L147L387L346L442M047M934N240M359K829J874
53572E10091J930K152J716J172J696L180M132L808L441M508O513P697P516P095
53558E66647P219P338P010O861P374P864P746P742Q606R466Q922P218N772M868
53544F70653L616K029J304J600J469K10q60n46L99Q09J038J709J742k96l420m988
53528F76468m258l199l368l876l311k102j638k037k231j855j715k337l089l125
$$ plain form
53514 638327 635712 633241 630183 626722 624361 624683 627567 631003 633034 633670 634368 635819 637028 636881 635877
53499 635877 635569 636633 638310 639811 641416 643738 646531 648997 651006 653219 655936 658701 661518 665796
53485 665796 673223 683740 695227 705321 713234 719956 727310 736919 749458 764344 780302 796399
53473 796399 812398 828209 843633 859036 875760 895235 917624 941641 965579 988399 1010249
53462 1010249 1032405 1056514 1083304 1112019 1141443 1171327 1202375 1235050 1269074 1304145 1340345
53451 1340345 1377568 1415158 1452536 1489691 1526688 1563322 1599858 1637588 1677705 1719656 1761342
53440 1761342 1800954 1837965 1872405 1904189 1933722 1962384 1991550 2021349 2050967 2079964 2108640
53429 2108640 2137228 2165381 2192669 2219140 2245151 2270886 2296107 2320115 2342016 2361395 2378792
$$ packed form
53514F38327k615k471l058l461k361L22K884L436K031O36O98J451J209j47j004
53499F35877l08J064J677J501J605K322K793K466K009K213K717K765K817M278
53485F65796P427J0517J1487J0094P913O722P354R609J2539J4886J5958J6097
53473G96399J5999J5811J5424J5403J6724J9475K2389K4017K3938K2820K1850
53462A010249K2156K4109K6790K8715K9424K9884L1048L2675L4024L5071L6200
53451A340345L7223L7590L7378L7155L6997L6634L6536L7730M0117M1951M1686
53440A761342L9612L7011L4440L1784K9533K8662K9166K9799K9618K8997K8676
53429B108640K8588K8153K7288K6471K6011K5735K5221K4008K1901J9379J7397
$$ plain form
53418 2378792 2395105 2410422 2423744 2433889 2440176 2442252 2440035 2434223 2426160 2416538 2404635 2389464
53406 2389464 2371211 2350842 2328630 2304122 2277546 2250209 2223146 2196089 2168276 2139716 2111102
53395 2111102 2082709 2053902 2023737 1991869 1958873 1925832 1893714 1863317 1835693 1811898 1791768
53384 1791768 1773542 1755692 1738985 1725620 1716288 1709297 1703043 1698132 1696204 1697595 1701252 1706413 1713251
53371 1713251 1722092 1732954 1745775 1760317 1775925 1792175 1809692 1829644 1852514 1878079 1906476
53360 1906476 1938297 1973452 2010800 2049385 2089515 2132315 2178569 2228192 2280463 2334622 2390494
53349 2390494 2448519 2508874 2570820 2633546 2697485 2764080 2834277 2908028 2985053 3064967 3146521
53338 3146521 3228183 3310129 3394427 3482174 3571409 3659126 3744720 3829969 3915793 4000454 4081266
$$ packed form
53418B378792J6313J5317J3322J0145O287K076k217n812q063r622j1903j5171
53406B389464j8253k0369k2212k4508k6576k7337k7063k7057k7813k8560k8614
53395B111102k8393k8807l0165l1868l2996l3041l2118l0397k7624k3795k0130
53384A791768j8226j7850j6707j3365r332o991o254m911j928J391L657N161O838
53371A713251Q841J0862J2821J4542J5608J6250J7517J9952K2870K5565K8397
53360A906476L1821L5155L7348L8585M0130M2800M6254M9623N2271N4159N5872
53349B390494N8025O0355O1946O2726O3939O6595P0197P3751P7025P9914Q1554
53338C146521Q1662Q1946Q4298Q7747Q9235Q7717Q5594Q5249Q5824Q4661Q0812
$$ plain form
53327 4081266 4157042 4228290 4295843 4359934 4420277 4476439 4528041 4574666 4615563 4649619 4675902
53316 4675902 4694122 4704261 4705967 4698802 4683016 4659476 4628671 4590287 4543900 4489702 4428274 4360033
53304 4360033 4285301 4204882 4120396 4034005 3947573 3861769 3776071 3689970 3604140 3519980 3438113
53293 3438113 3357935 3278838 3201287 3126337 3054564 2985903 2920031 2856268 2793314 2729938 2666190
53282 2666190 2603601 2544032 2488558 2437427 2390523 2347609 2308471 2273262 2242545 2216562 2194436
53271 2194436 2174475 2155319 2136515 2117948 2099335 2080707 2062875 2046605 2031415 2016130 2000813
53260 2000813 1987226 1976822 1969092 1962764 1957996 1956126 1957488 1960820 1965122 1970988 1979498 1990667 2003646
53247 2003646 2017776 2032783 2048566 2065560 2084819 2106904 2131120 2156713 2184411 2215626 2250312
$$ packed form
53327D081266P5776P1248O7553O4091O0343N6162N1602M6625M0897L4056K6283
53316D675902J8220J0139J706p165j5786k3540l0805l8384m6387n4198o1428o8241
53304D360033p4732q0419q4486q6391q6432q5804q5698q6101q5830q4160q1867
53293C438113q0178p9097p7551p4950p1773o8661o5872o3763o2954o3376o3748
53282B666190o2589n9569n5474n1131m6904m2914l9138l5209l0717k5983k2126
53271B194436j9961j9156j8804j8567j8613j8628j7832j6270j5190j5285j5317
53260B000813j3587j0404p730o328m768j870J362L332M302N866Q510J1169J2979
53247B003646J4130J5007J5783J6994J9259K2085K4216K5593K7698L1215L4686
$$ plain form
53236 2250312 2286766 2323741 2361623 2401052 2441426 2481465 2520577 2558842 2596003 2631123 2663127
53225 2663127 2691209 2714982 2734609 2750612 2763175 2771732 2775504 2774085 2767376 2755411 2738729 2718457
53213 2718457 2695457 2669747 2641274 2610812 2579211 2545961 2509407 2468519 2423907 2377132 2329650
53202 2329650 2282366 2235387 2188060 2139882 2091392 2043384 1995270 1945387 1893333 1840980 1790494
53191 1790494 1742195 1695152 1649111 1604861 1563110 1523855 1486539 1450040 1412917 1374597 1336183
53180 1336183 1299341 1264638 1231729 1200842 1172985 1148707 1127632 1109160 1092667 1077015 1061105
53169 1061105 1045217 1030611 1017290 1003247 986817 968913 951991 937220 923497 908907 892414
53158 892414 874321 855827 838121 821474 805284 789145 773490 758791 744633 730249 715744
$$ packed form
53236B250312L6454L6975L7882L9429M0374M0039L9112L8265L7161L5120L2004
53225B663127K8082K3773J9627J6003J2563Q557L772j419o709j1965j6682k0272
53213B718457k3000k5710k8473l0462l1601l3250l6554m0888m4612m6775m7482
53202B329650m7284m6979m7327m8178m8490m8008m8114m9883n2054n2353n0486
53191A790494m8299m7043m6041m4250m1751l9255l7316l6499l7123l8320l8414
53180A336183l6842l4703l2909l0887k7857k4278k1075j8472j6493j5652j5910
53169A061105j5888j4606j3321j4043j6430j7904j6922j4771j3723j4590j6493
53158H92414j8093j8494j7706j6647j6190j6139j5655j4699j4158j4384j4505
$$ plain form
53147 715744 702122 690107 679419 669215 658889 648381 637952 627640 616997 605634 594007
53136 594007 583127 573323 563905 554351 545131 536916 529718 523392 518224 514182 510280 505694 500956 497002
53122 497002 493590 489828 485756 481942 477867 472501 466557 462376 460922 460392 458527 455033 450950 446980
53108 446980 443464 440911 439298 437619 435294 433367 433120 434058 434547 434160 434055 435029 436295 436477 435026 432461
53092 432461 429728 427388 425035 421592 416658 411350 407377 405496 405327 406184 407330 407900 407616 407459 408687
53077 408687 411213 413704 415067 415029 413678 411800 411444 414428 419745 423865 424362 422100 419275 416732 414384
53062 414384 412922 413272 414834 415840 415534 414757 414355 414243 414261 414809 416067 417345 417745 417027 415548 413859 412652
53045 412652 412464 412964 412961 411602 409309 407137 405559 404369 403402 402691 401967 400769 399260 398401 398896 400216 401023
$$ packed form
53147G15744j3622j2015j0688j0204j0326j0508j0429j0312j0643j1363j1627
53136E94007j0880r804r418r554r220q215p198o326n168m042l902m586m738l954
53122D97002l412l762m072l814m075n366n944m181j454n30j865l494m083l970
53108D46980l516k553j613j679k325j927k47R38M89l87j05R74J266J82j451k565
53092D32461k733k340k353l443m934n308l973j881j69Q57J146N70k84j57J228
53077D08687K526K491J363l8j351j878l56K984N317M120M97k262k825k543k348
53062D14384j462L50J562J006l06p77m02j12J8N48J258J278M00p18j479j689j207
53045D12652j88N00lj359k293k172j578j190r67p11p24j198j509q59M95J320Q07
$$ plain form
53028 401023 400383 398328 395476 392564 390330 389374 389804 391113 392462 393086 392650 391685 391598 393568 397012 399686
53012 399686 399869 398088 396092 394514 392444 389219 385570 382635 380735 379649 379315 379400 378693 376067 372123
52997 372123 369062 368505 369803 370840 370312 368942 368483 369725 371686 372854 372959 373075 374015 375251 375755 375360
52981 375360 374710 374184 373528 372589 371827 371947 373200 374969 375930 374944 372272 369603 368379 368336 368310 368160 368834 370586
52963 370586 372298 373099 373713 375335 377819 379863 380671 380656 380644 381128 382234 383708 384782 384638 383310 381777
52947 381777 380916 380640 380252 379420 378576 378458 379490 381585 384411 387699 391171 394169 395640 394825 392046 388636
52931 388636 386006 384753 384602 385056 385970 387449 389292 390824 391547 391792 392288 393122 393704 394018 395142 397840
52915 397840 401014 402500 401510 399565 398823 400143 403066 406949 411373 415771 419412 421862 423057 423039 422150
$$ packed form
53028D01023o40k055k852k912k234r56M30J309J349O24m36r65q7J970L444K674
53012C99686J83j781j996j578k070l225l649k935j900j086l34Q5p07k626l944
52997C72123l061n57J298J037n28j370m59J242J961J168J05J16R40J236N04l95
52981C75360o50n26o56r39p62J20J253J769R61r86k672k669j224m3k6j50O74J752
52963C70586J712Q01O14J622K484K044Q08j5j2M84J106J474J074j44j328j533
52947C81777q61k76l88q32q44j18J032K095K826L288L472K998J471q15k779l410
52931C88636k630j253j51M54R14J479J843J532P23K45M96Q34N82L14J124K698
52915C97840L174J486r90j945p42J320K923L883M424M398L641K450J195j8q89
$$ plain form
52900 422150 421419 422009 423807 424995 423679 419908 415637 412607 410693 408600 405808 403288 402279 402800 403617
52885 403617 403484 402175 400432 399334 399727 401800 404717 406790 406623 404416 401863 400441 399938 398980 396814
52870 396814 394057 391798 390650 390777 391960 393125 392653 390134 387361 386521 387623 388798 388994 388980 389464 389774
52854 389774 389216 388458 388375 388549 388234 388039 389034 390555 390705 389134 387726 387995 389236 389921 389704 389081 388084 386549
52836 386549 385139 385011 386508 388923 391343 393124 393801 393300 392157 391002 389874 388630 387839 388516 390840
52821 390840 393724 395916 397103 397751 398263 398616 398721 398834 399446 400784 402522 404214 405946 408196 410930 413304
52805 413304 414542 414789 414768 414887 415134 415494 415963 416323 416326 415975 415181 413529 410984 408604 407683 408070 408089 406421
52787 406421 403552 401067 399930 399708 399132 397161 393728 389651 385722 381983 378230 374986 373217 372914 372714
$$ packed form
52900D22150p31N90J798J188j316l771m271l030j914k093k792k520j009N21Q17
52885D03617j33j309j743j098L93K073K917K073j67k207k553j422n03r58k166
52870C96814k757k259j148J27J183J165m72k519k773q40J102J175J96j4M84L10
52854C89774n58p58q3J74l15j95R95J521J50j571j408K69J241O85k17o23r97j535
52836C86549j410j28J497K415K420J781O77n01j143j155j128j244p91O77K324
52821C90840K884K192J187O48N12L53J05J13O12J338J738J692J732K250K734K374
52805D13304J238K47k1J19K47L60M69L60Ll51p94j652k545k380r21L87J9j668
52787D06421k869k485j137k22n76j971l433m077l929l739l753l244j769l03k00
$$ plain form
52772 372714 371433 369510 368322 368384 368818 368591 367684 366888 366701 366730 366177 364795 363219 362330 362487 363587 365624
52755 365624 368689 372328 375371 376692 376054 374107 371810 369909 368736 368282 368477 369323 370562 371432 371189 369978
52739 369978 368717 367932 367075 365163 361854 357777 354110 351969 351811 353119 354778 355819 355724 354259 351633
52724 351633 348875 347403 347869 349770 352284 354913 357162 358329 358174 357373 356857 357041 357947 359437 360860 361133
52708 361133 359883 358100 356969 356524 356173 356097 357098 359206 361470 363266 365002 367218 369552 370931 370544
52693 370544 368578 366246 364920 364917 365358 365606 366322 368354 371065 372907 373516 374094 375547 377427 379115 380949
52677 380949 383434 386256 388912 391646 394835 397870 399548 399482 398435 397360 396723 396683 397256 398094 398558 398266
52661 398266 397383 396302 395163 393756 391823 389503 387404 386007 384982 383434 381046 378610 377081 376360 375461
$$ packed form
52772C72714j281j923j188O2M34k27r07p96j87K9n53j382j576q89J57J100K037
52755C65624L065L639L043J321o38j947k297j901j173m54J95Q46J239Q70k43j211
52739C69978j261p85q57j912l309m077l667k141j58J308J659J041r5j465k626
52724C51633k758j472M66J901K514K629K249J167j55q01n16J84R06J490J423K73
52708C61133j250j783j131m45l51p6J001K108K264J796J736K216K334J379l87
52693C70544j966k332j326lM41K48P16K032K711J842O09N78J453J880J688J834
52677C80949K485K822K656K734L189L035J678o6j047j075o37m0N73Q38M64k92
52661C98266q83j081j139j407j933k320k099j397j025j548k388k436j529p21q99
$$ plain form
52646 375461 373808 372044 371477 372864 375621 378020 378375 376482 374041 373379 375419 378787 381039 380919 379489
52631 379489 378914 380155 382110 383145 383016 382868 383704 385501 387718 389866 391417 391780 390746 388661 386181
52616 386181 384238 383978 385777 388163 388774 386922 384433 383467 384322 385945 387604 389082 390101 390761 391996
52601 391996 394292 396344 396407 394883 394110 395382 397541 398972 399787 401259 404015 407514 410631 412091 411013
52586 411013 407870 404572 402893 403003 403808 404302 404045 402888 400986 398925 397267 396135 395636 396265 398156 400267
52570 400267 401235 401179 401827 404547 408821 413031 416225 418615 420640 422230 423072 423155 422751 422071 421271 420706 420703 420888
52552 420888 420148 417802 414700 412589 412281 412949 413393 413438 413722 414630 416017 417572 418832 419053 417903 416329
52536 416329 416001 417532 419714 420848 420443 419286 418223 417394 416591 415897 415725 416377 417635 418835 419405 419421 419570
$$ packed form
52646C75461j653j764n67J387K757K399L55j893k441o62K040L368K252j20j430
52631C79489n75J241J955J035j29j48Q36J797K217K148J551L63j034k085k480
52616C86181j943k60J799K386O11j852k489r66Q55J623J659J478J019O60J235
52601C91996K296K052O3j524p73J272K159J431Q15J472K756L499L117J460j078
52586D11013l143l298j679J10Q05M94k57j157j902k061j658j132m99O29J891K111
52570D00267R68n6O48K720M274M210L194K390K025J590Q42Q3m04o80q00n65lJ85
52552D20888p40k346l102k111l08O68M44M5K84R08J387J555J260K21j150j574
52536D16329l28J531K182J134m05j157j063q29q03o94j72O52J258J200N70J6J49
$$ plain form
52519 419570 420425 421841 423203 424198 425014 425725 425877 425123 424088 423912 424624 424587 422228 418116 414467 412439 410808
52502 410808 407809 403582 399964 398205 397901 398194 399074 401012 403877 406850 409242 410990 412379 413526 414185
52487 414185 413982 412903 411507 410508 410184 410407 411130 412301 413238 412765 410501 407710 406298 407044 409088 411024
52471 411024 412096 412549 413252 414889 417102 418550 418391 417548 417843 419834 422346 424359 426327 428857 430960
52456 430960 430891 428542 425735 423943 422883 421940 421899 424123 428471 433254 437292 441007 445142 449304 452453
52441 452453 454343 455668 456876 457466 456586 453968 450182 446222 442936 440575 438768 437012 435148 433240 431220
52426 431220 429059 427215 426356 426429 426512 425907 425003 424564 424509 424055 423072 422626 423800 426311 428657 429605 429248 428632
52408 428632 428679 429691 431744 435016 439384 443974 447723 450522 453319 456832 460564 463410 464820 464930 463963
$$ packed form
52519D19570Q55J416J362R95Q16P11J52p54j035j76P12l7k359m112l649k028j631
52502D10808k999m227l618j759l04K93Q80J938K865K973K392J748J389J147O59
52487D14185k03j079j396r99l24K23P23J171R37m73k264k791j412P46K044J936
52471D11024J072M53P03J637K213J448j59q43K95J991K512K013J968K530K103
52456D30960o9k349k807j792j060r43m1K224M348M783M038L715M135M162L149
52441D52453J890J325J208N90q80k618l786l960l286k361j807j756j864j908k020
52426D31220k161j844q59P3Q3o05r04m39n5m54r83m46J174K511K346R48l57o16
52408D28632M7J012K053L272M368M590L749K799K797L513L732K846J410J10r67
$$ plain form
52393 463963 462167 460105 458287 456611 454812 453290 452524 451626 448643 442858 435901 429953 425606 422297 420075
52378 420075 419694 421196 423524 425676 427327 428238 428009 426881 426076 426743 428840 431344 433330 434592 435458 436179
52362 436179 436493 435868 434418 433318 433734 435441 437166 438343 439763 442173 445039 447227 448459 449621 452018
52347 452018 456715 464067 473316 482984 492121 500708 508282 512831 512238 506780 499280 492507 487141 482504
52333 482504 478478 475900 475211 475270 473960 470236 465582 462980 464036 467356 470153 471167 471438 472546 474979
$$ packed form
52393D63963j796k062j818j676j799j522p66q98k983n785o957n948m347l309k222
52378D20075l81J502K328K152J651R11k29j128q05O67K097K504J986J262Q66P21
52362D36179L14o25j450j100M16J707J725J177J420K410K866K188J232J162K397
52347D52018M697P352R249R668R137Q587P574M549n93n458p500o773n366m637
52333D82504m026k578o89N9j310l724m654k602J056L320K797J014K71J108K433
$$ [...]
##END NTUPLES=NMR SPECTRUM
##END=
