
##TITLE=UV1043_TOSA01-ROVE100B_6099774_k9BijCuRNE
##JCAMPDX= 6.0         $$ Bruker NMR JCAMP-DX V2.0
##DATA TYPE= NMR SPECTRUM
##DATA CLASS= NTUPLES
##ORIGIN= BRUKER
##OWNER= Administrator
$$ 1.72 TOPSPIN		Version 2.1
$$ 2012-05-13 00:01:28.000 -0500  Administrator@TOPSPIN
$$ Compression mode = diff/dup
##.OBSERVE FREQUENCY= 400.13188235
##.OBSERVE NUCLEUS= ^1H
##.ACQUISITION MODE= SIMULTANEOUS (DQD)
##.ACQUISITION SCHEME= undefined
##.AVERAGES= 8
##.DIGITISER RES= 22
##SPECTROMETER/DATA SYSTEM= spect
##.PULSE SEQUENCE= zg30
##.SOLVENT NAME= COFFEE_meoh
##.SHIFT REFERENCE= INTERNAL, COFFEE_meoh, 1, 14.98061
##AUDIT TRAIL= $$ (NUMBER, WHEN, WHO, WHERE, PROCESS, VERSION, WHAT)
$$ ##TITLE= Audit trail, TOPSPIN		Version 2.1
$$ ##JCAMPDX= 5.01
$$ ##ORIGIN= Bruker BioSpin GmbH
$$ ##OWNER= Administrator
$$ $$ C:\Bruker\TOPSPIN/data/COFFEE/nmr/UV1043_TOSA01-ROVE100B_6099774_k9BijCuRNE/10/pdata/1/auditp.txt
$$ ##AUDIT TRAIL=  $$ (NUMBER, WHEN, WHO, WHERE, PROCESS, VERSION, WHAT)
(   1,<2012-05-13 00:01:20.218 -0500>,<Administrator>,<TOPSPIN>,<go>,<TOPSPIN 2.1>,
      <created by zg
	started at 2012-05-13 00:00:13.687 -0500,
	POWCHK enabled, PULCHK disabled,
       configuration hash MD5:
       AF F2 23 6B 01 CD 40 DD E5 A1 38 A0 06 EA F7 77
       data hash MD5: 64K
       C2 7B B1 0C 16 F7 1D F2 9E 53 A2 01 8B 14 5F 23>)
(   2,<2012-05-13 00:01:23.578 -0500>,<Administrator>,<TOPSPIN>,<proc1d>,<TOPSPIN 2.1>,
      <Start of raw data processing
       efp LB = 0 FT_mod = 6 PKNL = 1 PHC0 = 0 PHC1 = 0 SI = 32K 
       data hash MD5: 32K
       D3 92 4F 75 4A DC 3D 85 36 AD 60 0A 64 62 79 40>)
(   3,<2012-05-13 00:01:23.968 -0500>,<Administrator>,<TOPSPIN>,<proc1d>,<TOPSPIN 2.1>,
      <pk PHC0 = 214.7772 PHC1 = 0 
       data hash MD5: 32K
       F4 9B EB BB 50 33 D9 08 BA DB F3 7B 35 15 F9 6B>)
(   4,<2012-05-13 00:01:24.046 -0500>,<Administrator>,<TOPSPIN>,<proc1d>,<TOPSPIN 2.1>,
      <abs ABSG = 1 
       data hash MD5: 32K
       33 BE 4E 00 63 F9 18 F5 B3 CB 08 79 1E A0 05 E4>)
(   5,<2012-05-13 00:01:24.078 -0500>,<Administrator>,<TOPSPIN>,<proc1d>,<TOPSPIN 2.1>,
      <abs ABSG = 2 
       data hash MD5: 32K
       DB B5 C5 52 77 48 BD E4 B2 5D 9B 40 B0 DF 2B 2A>)
(   6,<2012-05-13 00:01:24.109 -0500>,<Administrator>,<TOPSPIN>,<proc1d>,<TOPSPIN 2.1>,
      <abs ABSG = 3 
       data hash MD5: 32K
       AB 84 93 4C 90 4F 1D 44 15 C5 D9 CF 41 60 95 BF>)
(   7,<2012-05-13 00:01:24.140 -0500>,<Administrator>,<TOPSPIN>,<proc1d>,<TOPSPIN 2.1>,
      <abs ABSG = 4 
       data hash MD5: 32K
       51 A5 D6 A4 7A D4 AA 01 8A 78 72 79 C1 CD A2 94>)
(   8,<2012-05-13 00:01:24.171 -0500>,<Administrator>,<TOPSPIN>,<proc1d>,<TOPSPIN 2.1>,
      <abs ABSG = 5 
       data hash MD5: 32K
       0E D1 28 A7 04 E3 1F B7 E9 8E 74 95 8A 7D FA FA>)
$$ ##END=
$$ 
$$ $$ hash MD5
$$ $$ D4 49 92 AF 41 7A A4 24 67 76 FC EF 73 D7 4E 1D
##$RELAX= 
##$RELAX= 
##$RELAX= 
##$RELAX= 
##$RELAX= 
##$RELAX= 
##$RELAX= 
$$ Bruker specific parameters
$$ --------------------------
$$ [...]
150 150 150 150 150 150 150 150
##$TP07= 0
##$TPNAME0= <>
##$TPNAME1= <>
##$TPNAME2= <>
##$TPNAME3= <>
##$TPNAME4= <>
##$TPNAME5= <>
##$TPNAME6= <>
##$TPNAME7= <>
##$TPOAL= (0..7)
0.5 0.5 0.5 0.5 0.5 0.5 0.5 0.5
##$TPOFFS= (0..7)
0 0 0 0 0 0 0 0
##$TUNHIN= 0
##$TUNHOUT= 0
##$TUNXOUT= 0
##$USERA1= <user>
##$USERA2= <user>
##$USERA3= <user>
##$USERA4= <user>
##$USERA5= <user>
##$V9= 5
##$VALIST= <valist>
##$VCLIST= <CCCCCCCCCCCCCCC>
##$VD= 0
##$VDLIST= <DDDDDDDDDDDDDDD>
##$VPLIST= <PPPPPPPPPPPPPPP>
##$VTLIST= <TTTTTTTTTTTTTTT>
##$WBST= 2048
##$WBSW= 25
##$XGAIN= (0..3)
0 0 0 0
##$XL= 0
##$YL= 0
##$YMAX_a= 537207
##$YMIN_a= -634696
##$ZGOPTNS= <>
##$ZL1= 120
##$ZL2= 120
##$ZL3= 120
##$ZL4= 120
##$ABSF1= 14.98061
##$ABSF2= -5.57192
##$ABSG= 5
##$ABSL= 3
##$ALPHA= 0
##$AQORDER= 0
##$ASSFAC= 0
##$ASSFACI= 0
##$ASSFACX= 0
##$ASSWID= 0
##$AUNMP= <proc_prof1d_extract_pilot.lims>
##$AXLEFT= 0
##$AXNAME= <>
##$AXNUC= <1H>
##$AXRIGHT= 0
##$AXTYPE= 0
##$AXUNIT= <>
##$AZFE= 0.1
##$AZFW= 0.1
##$BCFW= 0
##$BC_mod= 0
##$BYTORDP= 0
##$COROFFS= 0
##$CY= 15
##$DATMOD= 1
##$DC= 0
##$DFILT= <>
##$DTYPP= 0
##$F1P= 0
##$F2P= 0
##$FCOR= 0.5
##$FTSIZE= 32768
##$FT_mod= 6
##$GAMMA= 0
##$GB= 0
##$INTBC= 1
##$INTSCL= 1
##$ISEN= 128
##$LB= 0
##$LEV0= 0
##$LPBIN= 0
##$MAXI= 10000
##$MC2= 0
##$MEAN= 0
##$ME_mod= 0
##$MI= 0
##$NCOEF= 0
##$NC_proc= -8
##$NLEV= 6
##$NOISF1= 0
##$NOISF2= 0
##$NSP= 0
##$NTH_PI= 0
##$NZP= 0
##$OFFSET= 14.98061
##$PC= 1
##$PHC0= 214.7772
##$PHC1= 0
##$PH_mod= 1
##$PKNL= yes
##$PPARMOD= 0
##$PPDIAG= 0
##$PPIPTYP= 0
##$PPMPNUM= 2147483647
##$PPRESOL= 1
##$PSCAL= 4
##$PSIGN= 0
##$PYNMP= <proc.py>
##$REVERSE= no
##$SF= 400.13
##$SI= 32768
##$SIGF1= 0
##$SIGF2= 0
##$SINO= 400
##$SIOLD= 32768
##$SPECTYP= <>
##$SREGLST= <1H.CDCl3>
##$SSB= 0
##$STSI= 32768
##$STSR= 0
##$SW_p= 8223.68421052632
##$SYMM= 0
##$S_DEV= 0
##$TDeff= 65536
##$TDoff= 0
##$TI= <>
##$TILT= no
##$TM1= 0
##$TM2= 0
##$TOPLEV= 0
##$USERP1= <user>
##$USERP2= <user>
##$USERP3= <user>
##$USERP4= <user>
##$USERP5= <user>
##$WDW= 1
##$XDIM= 32768
##$YMAX_p= 453949487
##$YMIN_p= -674304
##$CURPLOT= <Network HP LaserJet P1505>
##$CURPRIN= <$Network HP LaserJet P1505>
##$DFORMAT= <normdp>
##$LAYOUT= <+/1D_H.xwp>
##$LFORMAT= <normlp>
##$PFORMAT= <normpl>
##$SURQMSG= 1
$$ End of Bruker specific parameters
$$ ---------------------------------
##NTUPLES= NMR SPECTRUM
##VAR_NAME=  FREQUENCY,     SPECTRUM/REAL,   SPECTRUM/IMAG
##SYMBOL=    X,             R,               I
##VAR_TYPE=  INDEPENDENT,   DEPENDENT,       DEPENDENT
##VAR_FORM=  AFFN,          ASDF,            ASDF
##VAR_DIM=   32768,         32768,           32768
##UNITS=     HZ,            ARBITRARY UNITS, ARBITRARY UNITS
##FACTOR=    0.250966925370066, 1,           1
##FIRST=     8223.43324360095, -35172,       108173
##LAST=      0,             3744,            -222088
##MIN=       0,             -674304,         0
##MAX=       8223.43324360095, 453949487,    0
$$ Real data points
##PAGE= N=1
##DATA TABLE= (X++(R..R)), XYDATA
$$ [...]
19543h3827m6892j51582C89127b57758I1721j2752n395b8249r5673D0492b23024
$$ -83827 -130719 -282301 389127 -257758 91721 78969 73574 -28249 -123922 40492 -223024
19531I8405J92224e1147j33523Q911n6672H4921b40467J3448d086F3212a98829
$$ 98405 290629 -51147 -184670 -175759 -232431 84921 -240467 -227019 -4086 63212 -198829
19519e2967B2318f1895a845E7954e8066A06759b76645b5897I8765a14944f671
$$ -52967 22318 -61895 -1845 57954 -58066 106759 -276645 -25897 98765 -114944 -6671
19507G379a98070j10863i394B6169b07070R5528H4949a56620d9118H288b6169
$$ 7379 -198070 -308933 -9394 26169 -207070 -111542 84949 -156620 -49118 8288 -26169
19495B08867f1447P370O495A17427a42465k1726B5563e5343E4882P3175j0517
$$ 208867 -61447 -54077 -47582 117427 -142465 -164191 25563 -55343 54882 128057 117540
19484A17540b41966g6235B05559J9235a20096K8024j69823M3410A285J93985h0827
$$ 117540 -241966 -76235 205559 224794 -120096 -92072 -261895 -218485 1285 195270 -80827
19472D7728d90991g3044K238l1978A40906B8473a3719G7850b8746A71583b1924
$$ 47728 -490991 -73044 -70806 -102784 140906 28473 -13719 77850 -28746 171583 -21924
19460c00535e8260J3986k57829P7633g2874A62605L3779a28883E4995b25594H424
$$ -300535 -58260 -44274 -302103 -224470 -72874 162605 196384 -128883 54995 -225594 8424
19448g8115j14285A0785e5295A15313a16101e6484j83364j2848A11895C2721R9583
$$ -78115 -192400 10785 -55295 115313 -116101 -56484 -239848 -252696 111895 32721 132304
19437A32304a11440B98453b0304k69916f9871A95774e71610a38965B38580a95257
$$ 132304 -111440 298453 -20304 -290220 -69871 195774 -571610 -138965 238580 -195257
19426A82440b82199B72611E009a41879j55071A60242A5288a35336j24094H194
$$ 182440 -282199 272611 5009 -141879 -296950 160242 15288 -135336 -259430 8194
19415a10525E4138J18586p9123K92670A06676a9414j53405E4829a4438j49138
$$ -110525 54138 172724 93601 386271 106676 -19414 -172819 54829 -14438 -163576
19405a63576J6183L6721B64272p7794c34572a26954F6296e4975j20809n063d8482
$$ -163576 -147393 -110672 264272 186478 -334572 -126954 66296 -54975 -175784 -180847 -48482
19393F4581d1629B19798M8608b95504B0887L7365c05187h985k80850e5079H3337
$$ 64581 -41629 219798 268406 -295504 20887 58252 -305187 -8985 -289835 -55079 83337
19381B59485j18329J05986a28139j50788R2967J7124l5327k81473J25040A8705
$$ 259485 141156 247142 -128139 -278927 -185960 -168836 -204163 -485636 -360596 18705
19370C3833a02172A13746e0669k64854J45369A58239a21264d4759n6937m8779
$$ 33833 -102172 113746 -50669 -315523 -170154 158239 -121264 -44759 -101696 -150475
19360a50475m129D3680K9924c22463d1303D401e5254j01930r4468d8191A08466
$$ -150475 -154604 43680 73604 -322463 -41303 4401 -55254 -157184 -251652 -48191 108466
19348A53169L0396A227c15623O2679A12550b41570B53373c50713b2756C9362a9760
$$ 153169 183565 1227 -315623 -252944 112550 -241570 253373 -350713 -22756 39362 -19760
19336A92985a34280A11152c00064D3725a18471c9071A74822L30416k27440a11751
$$ 192985 -134280 111152 -300064 43725 -118471 -39071 174822 505238 277798 -111751
19325H9693b97585G8152b90965h9569m5642F445J27548g3015C4379b54218B4214
$$ 89693 -297585 78152 -290965 -89569 -135211 6445 133993 -73015 34379 -254218 24214
19313A3162a26709k87664a30339j42960j46729G583g5833l21967O9472k5000A02606
$$ 13162 -126709 -414373 -130339 -273299 -420028 7583 -75833 -397800 -328328 -353328 102606
19301a70611j09188A14288a39505j16803O5365B61023P9762A16571d9069E1841
$$ -170611 -279799 114288 -139505 -256308 -190943 261023 340785 116571 -49069 51841
19290A91764i6998l26790A78638a43863N9536k7164J6482I0131a92455j11355
$$ 191764 -96998 -423788 178638 -143863 -84327 -111491 -95009 90131 -192455 -303810
19280c03810f3926j08051G941J13631K3218D9405J23070c2015l8313m7641K3945
$$ -303810 -63926 -171977 7941 121572 144790 49405 172475 -32015 -70328 -117969 -94024
19269i4024n5955j2685F1475a431j63774j8659m5631j00904c1848H0102b75884
$$ -94024 -149979 -162664 61475 -1431 -165205 -183864 -229495 -330399 -31848 80102 -275884
19257E5490Q2710g2700j23348K369b2076A9037a18982G590b85568R0485g7217
$$ 55490 138200 -72700 -196048 -193679 -22076 19037 -118982 7590 -285568 -195083 -77217
19245a37045B93265a56890f0411j56917g2678j72823B37616a88343B08118b10000
$$ -137045 293265 -156890 -60411 -217328 -72678 -245501 237616 -188343 208118 -210000
19234c86887A51999a13009h440k74817L5262b9616F0141O3781R663b2634q5445
$$ -386887 151999 -113009 -8440 -283257 -247995 -29616 60141 123922 133585 -22634 -108079
19223a08079B73965A1157a89384E3333a90826k4353B51488b8717r8953B9029J57278
$$ -108079 273965 11157 -189384 53333 -190826 -215179 251488 -28717 -127670 29029 186307
19212A86307a08108k38377J08596F9085J57152J20814b85165A66596B5926d0253
$$ 186307 -108108 -346485 -237889 69085 226237 347051 -285165 166596 25926 -40253
19201i9113B49330a28976E1956d52819a95343k1050D686f9985j72397r4571B3658
$$ -99113 249330 -128976 51956 -452819 -195343 -216393 4686 -69985 -242382 -336953 23658
19189a05318B2947h0551j14800c4193H5787P545b30660f4967J1194I216a16603
$$ -105318 22947 -80551 -195351 -34193 85787 93332 -230660 -64967 -53773 9216 -116603
19177f035o0865o122l83973e0516b2690C72594B6528K9397j741f9766b8684k77997
$$ -6035 -66900 -73022 -456995 -50516 -22690 372594 26528 55925 54184 -69766 -28684 -306681
19165c06681F3732J99727l854a56931N8364K0402e778k03501k14988A82485b39610
$$ -306681 63732 263459 259605 -156931 -98567 -78165 -5778 -209279 -424267 182485 -239610
19153a28138f3036l41954J65053A4184J49855L783b36952J9598B28059c74598
$$ -128138 -63036 -404990 -239937 14184 164039 167822 -236952 -217354 228059 -374598
19142a40933k0879g8014n6645B784J69256l9744K7917a1007j78851j69506B47724
$$ -140933 -161812 -78014 -134659 2784 172040 132296 160213 -11007 -189858 -359364 247724
19130a9934r6829M0224a7613A7792i0899h115A6990L62011f379j55001A16995
$$ -19934 -116763 -76539 -17613 17792 -90899 -8115 16990 379001 -6379 -161380 116995
19118B79239c05765J31323G3772c95384a32174A05103a69213G3682C3601a58961
$$ 279239 -305765 -174442 73772 -395384 -132174 105103 -169213 73682 33601 -158961
19107A78929b41254B14720a3706m90499A75496k2266f802A82243b40910A11567
$$ 178929 -241254 214720 -13706 -504205 175496 153230 -6802 182243 -240910 111567
19096a82307O3187j9294A15668a18836A07429J47679I39a42583j6018A51922D1601
$$ -182307 -119120 -138414 115668 -118836 107429 255108 939 -142583 -158601 151922 41601
19084a06985l39220a16227L4179j72569k2412Q4852Q1251N4632n4754K1196J9156
$$ -106985 -446205 -116227 -82048 -254617 -277029 -192177 -110926 -56294 -111048 -89852 -70696
19073g0696j23752q5783J35683C52493j18973q9901l012d31115a88029Q442A20242
$$ -70696 -194448 -280231 -144548 352493 233520 143619 140607 -431115 -188029 -179587 120242
19061A33684a52038C23627a43829l9828A60833b13141e3278k45338B84710i9238
$$ 133684 -152038 323627 -143829 -183657 160833 -213141 -53278 -298616 284710 -99238
19050i7498o2741F1602B3219d1514e854A71254o3988a54437A70459E4242a78552
$$ -97498 -160239 61602 23219 -41514 -5854 171254 107266 -154437 170459 54242 -178552
19038b4186E2459d00576g7064H0355a59249A90906P3489b41351C5228J74537a50878
$$ -24186 52459 -400576 -77064 80355 -159249 190906 264395 -241351 35228 209765 -150878
19026E2340f9262B89118a10063B01367a1892j43879A77900J62170a02852C3254
$$ 52340 -69262 289118 -110063 201367 -11892 -155771 177900 340070 -102852 33254
19015A14779M0309A2970c3258A65501a9636p5255D5370L2199B2786P7633a96403
$$ 114779 155088 12970 -33258 165501 -19636 -94891 45370 77569 22786 100419 -196403
19003c26856k0342B09514a17627p1959d4187j78760p2169A19714c4821j13041
$$ -326856 -347198 209514 -117627 -189586 -44187 -222947 -295116 119714 -34821 -147862
18993a47862A438b66163B66238g1866j55482H338J27422b63557C56076j64633
$$ -147862 1438 -266163 266238 -71866 -227348 8338 135760 -263557 356076 191443
18983A91443i3689C18714A22456e2913A53297c68451A94486a57558g6572j50650
$$ 191443 -93689 318714 122456 -52913 153297 -368451 194486 -157558 -76572 -227222
18973b27222M4063g8829j51681G2384J16852b01641G0108L7468a80841H957a46069
$$ -227222 -183159 -78829 -230510 72384 189236 -201641 70108 107576 -180841 8957 -146069
18961b36567h1885c6072o3431E3000b20422P2882I7659g8428k16321a45929M0383
$$ -236567 -81885 -36072 -99503 53000 -220422 -147540 97659 -78428 -294749 -145929 -105546
18950a05546C05363b25577A09987b01267b1177A17902e9972A82863b00770K4263
$$ -105546 305363 -225577 109987 -201267 -21177 117902 -59972 182863 -200770 -176507
18940a76507L4410h304m1867p0276k06439R8317p1083J49055J8592p4910A00085
$$ -176507 -142097 -8304 -50171 -120447 -326886 -228569 -299652 -150597 -132005 -206915 100085
18928E591J94997o4927n7761A4176O8832l2157a78270B5030b32838B6632R6973
$$ 5591 200588 135661 77900 14176 83008 50851 -178270 25030 -232838 26632 123605
18917A23605D0841a24080j18806D2394L0140d2894l30501b2293Q559o8798b7252
$$ 123605 40841 -124080 -242886 42394 72534 -42894 -373395 -22293 -13734 -82532 -27252
18905e020j92205B52110b91142j22860e3496a2953A72991b22048A3848b36829
$$ -5020 -197225 252110 -291142 -414002 -53496 -12953 172991 -222048 13848 -236829
18894a22216A24413a71514O1057q6617D4532C685b38876a6335A74069a848j29645
$$ -122216 124413 -171514 -110457 -197074 44532 3685 -238876 -16335 174069 -1848 -131493
18883a31493k85144K08294B00166a04543n3978A20904c0740A54618g3499q4018
$$ -131493 -416637 -208343 200166 -104543 -158521 120904 -30740 154618 -73499 -157517
18873a57517P8742j53318J3915N6245l3994L0282N5361q7578g1044F4105k1720
$$ -157517 -78775 -232093 -218178 -161933 -195927 -165645 -110284 -197862 -71044 64105 42385
18862D2385b6614C2470a26670F7572R2691g1910B0561J07021d50806b3367j39208
$$ 42385 -26614 32470 -126670 67572 160263 -71910 20561 127582 -450806 -23367 -162575
18851a62575P4873j86361J20946M4423j82228c8090F1534f4604l1203c3972k48729
$$ -162575 -87702 -274063 -153117 -108694 -290922 -38090 61534 -64604 -95807 -33972 -282701
18840b82701G4221c03554f5948B53841a45008a2604A15188k185a25637B22578
$$ -282701 74221 -303554 -65948 253841 -145008 -12604 115188 113003 -125637 222578
18829A38005g8157C8724J68878l0099B5842J77012Q4842i2544k23114a12655e4634
$$ 138005 -78157 38724 207602 177503 25842 202854 287696 -92544 -315658 -112655 -54634
18817a18927k05943b2128c501j34780j01p7067F98K02192A1034a69531C1202P3467
$$ -118927 -324870 -22128 -3501 -138281 -138382 -215449 698 202890 11034 -169531 31202 104669
18805A04669a99841G9732N8655F8868C0949i4698L2411j75617B31764e3184a833
$$ 104669 -199841 79732 138387 68868 30949 -94698 -62287 -237904 231764 -53184 -1833
18793D10794b9627B05472c29403A03268K07844j08862G174l091b34490G3727L09248
$$ 410794 -29627 205472 -329403 103268 311112 202250 7174 4083 -234490 73727 382975
18782C82975C1582c1069G3429b53106J08772B06331B2486f1265A04368d7630j520
$$ 382975 31582 -31069 73429 -253106 -144334 206331 22486 -61265 104368 -47630 -49150
18771d9150A46820P5045c91014h3088H1941b3257o0091j417l46613a80302j41099
$$ -49150 146820 221865 -391014 -83088 81941 -23257 -83348 -84765 -431378 -180302 -321401
18760c21401h7555A28448f0178A75436l717c46817g6947K937l6111o9763K6310
$$ -321401 -87555 128448 -60178 175436 171719 -346817 -76947 -74010 -110121 -179884 -153574
18749a53574p5792A83817e5123r9089q8576B20986g9611B3170R6033c74091G6207
$$ -153574 -229366 183817 -55123 -154212 -242788 220986 -79611 23170 119203 -374091 76207
18737A12709g1801M247R945J2331p5008B89128j44116b87583b7112o9225A77907
$$ 112709 -71801 -67554 -57609 -45278 -120286 289128 145012 -287583 -27112 -96337 177907
18725A85870n3953J23809a80450c7755G7004c72725a34872F0826K6334J03942
$$ 185870 131917 255726 -180450 -37755 77004 -372725 -134872 60826 87160 191102
18715A91102f1397j8708o145A51487a7719m9842q5222M8618A03101D0329a77387
$$ 191102 -61397 -80105 -86250 151487 -17719 -67561 -152783 -104165 103101 40329 -177387
18703A09381b15360j71341B19631d28559J97951h8543j8707l06842A61427E6738
$$ 109381 -215360 -386701 219631 -428559 -230608 -88543 -107250 -414092 161427 56738
18692C7385c38717L6121a23727j26931A48468D6424b85290J15851j73564b2394
$$ 37385 -338717 -302596 -123727 -250658 148468 46424 -285290 -169439 -343003 -22394
18681G2693b4401j01176B7023a61327f0304j34229N2315A27575L0753b3683E6324
$$ 72693 -24401 -125577 27023 -161327 -60304 -194533 -142218 127575 158328 -23683 56324
18669A41149B954h354j22201A28411K9165L7542o3716c31422I191b09807i5042
$$ 141149 2954 -8354 -130555 128411 157576 195118 131402 -331422 9191 -209807 -95042
18657I2796L8573a05294K3477l5131j14185L8587G8853a33550J0676C782a01229
$$ 92796 131369 -105294 -81817 -116948 -231133 -192546 78853 -133550 -122874 3782 -101229
18645d1398M232j51045L8882j16232b2020A80964L8369D9542A4341J04506n0926
$$ -41398 -37166 -188211 -149329 -265561 -22020 180964 219333 49542 14341 118847 67921
18634F7921L25013d24162J91563b5271a2071B22475f8396a6060k21983a5964D3633
$$ 67921 392934 -424162 -232599 -25271 -12071 222475 -68396 -16060 -238043 -15964 43633
18622c2296j82943r2277j26768A08531d75099a89172j55114G8255d5521k30809
$$ -32296 -215239 -307516 -434284 108531 -475099 -189172 -344286 78255 -45521 -276330
18612b76330M4599H982a33484b2631B32562c76155J14475O5451J7147f9373k4352
$$ -276330 -231731 8982 -133484 -22631 232562 -376155 -261680 -196229 -179082 -69373 -93725
18601i3725A68072D2218d9584p7638C5870M21977b89161a17157d34A53832a47817
$$ -93725 168072 42218 -49584 -127222 35870 457847 -289161 -117157 -434 153832 -147817
18589a0930j01359C01254A02346i6084l3166L2855L33j44022D4724j9872c89302
$$ -10930 -112289 301254 102346 -96084 -129250 -96395 -96062 -240084 44724 24852 -389302
18577E9178i8114d5930l6260A62054f1585r9932A01760c7869n2622A47839d22220
$$ 59178 -98114 -45930 -82190 162054 -61585 -161517 101760 -37869 -90491 147839 -422220
18565a05378A64008k1685b6116P212D075b79672a34890o4030e7744q2190N4302
$$ -105378 164008 142323 -26116 -18904 4075 -279672 -134890 -198920 -57744 -139934 -85632
18554h5632l23700a71350B1851K9802c34164B07620A7981a11222B8605a41107
$$ -85632 -409332 -171350 21851 51653 -334164 207620 17981 -111222 28605 -141107
18543A6679a89709A482a15591E9571a72072A78573a27699A94025f9996j27491
$$ 16679 -189709 1482 -115591 59571 -172072 178573 -127699 194025 -69996 -197487
18533a97487B1675N9277b29484M2312d2333r5985q0027K0751A24272l0821b05860
$$ -197487 21675 80952 -229484 -187172 -42333 -138318 -218345 -197594 124272 93451 -205860
18521d0515K0019B16201d22688E3749a59511f2671C33623A29685i3707n9641O3985
$$ -40515 -20496 216201 -422688 53749 -159511 -62671 333623 129685 -93707 -153348 -89363
18510h9363m6015c7281n8791D8956a73423B43630J42569a30781O2622H3754j0493
$$ -89363 -135378 -37281 -96072 48956 -173423 243630 386199 -130781 -68159 83754 73261
18499G3261J01520c46399I2305a99825A5519b91588A00152K3377C277J75499a66999
$$ 73261 174781 -346399 92305 -199825 15519 -291588 100152 123529 3277 178776 -166999
18487A12113J96086i076C13256g4482l4422m1591i892B6960a69601N2122c653
$$ 112113 308199 -9076 313256 -74482 -108904 -150495 -9892 26960 -169601 -117479 -3653
18475b43372D0400M145a25641B0673a68199A11530h6669m6617p6037R5212j54732
$$ -243372 40400 44545 -125641 20673 -168199 111530 -86669 -133286 -209323 -114111 -268843
18464b68843A96060b7871B43083H1884O9529D2105e292j19212B02140a43271c8549
$$ -268843 196060 -27871 243083 81884 151413 42105 -5292 -124504 202140 -143271 -38549
18452C75457j59843a6836D1575K08600b70462R4554P2496A23987o081b09151R8271
$$ 375457 215614 -16836 41575 250175 -270462 -175908 -103412 123987 117906 -209151 -110880
18441a10880D4088a31706o3299B09533N0334K0053a8548A81631j535E1718j5184
$$ -110880 44088 -131706 -195005 209533 259867 279920 -18548 181631 180096 51718 36534
18430C6534P3134A0952J5781K07302I4938c44870L7597L6625Q817D48875c63066
$$ 36534 109668 10952 26733 234035 94938 -344870 -307273 -270648 -261831 448875 -363066
18418e2573k60530e3459A79905m817c68073F9236J36759a6885k66644P3214L1076
$$ -52573 -313103 -53459 179905 175088 -368073 69236 205995 -16885 -283529 -210315 -179239
18407a79239A7641M6001k9463a81340F7115O5040R3845a49101j50356a04760H9406
$$ -179239 17641 63642 34179 -181340 67115 132155 226000 -149101 -299457 -104760 89406
18395c77955A30561b15333d9435j60337A12339i2090j59875J14417j98899E3963
$$ -377955 130561 -215333 -49435 -209772 112339 -92090 -251965 -137548 -336447 53963
18384a48258A83065E4926c71316a09100A24749a26877K7453o8532L9989m7164
$$ -148258 183065 54926 -371316 -109100 124749 -126877 -99424 -167956 -127967 -175131
18374a75131L5157B887P209a25028p1366k5998E1805c33298a47910m4746B69404
$$ -175131 -139974 2887 10096 -125028 -196394 -222392 51805 -333298 -147910 -192656 269404
18362c443A26968a01014B0488J66305c13953J21823A0335c60528B38106b34134
$$ -3443 126968 -101014 20488 186793 -313953 -192130 10335 -360528 238106 -234134
18351C68963F7280c37182G872N3219a12539D407a6359G0195a7945j4654j72216
$$ 368963 67280 -337182 7872 61091 -112539 4407 -16359 70195 -17945 -32599 -204815
18340b04815A36082h9640L3295A10288i9572C12618e9457k42653C48857A35199
$$ -204815 136082 -89640 -56345 110288 -99572 312618 -59457 -302110 348857 135199
18329C08393a04117k78557a08333F3345J7480a59025N2730F6005K51172e14590
$$ 308393 -104117 -382674 -108333 63345 80825 -159025 -106295 66005 317177 -514590
18318A11707C0580a75950m9188b1625n3454C81313A8977P2688a39849A19156a67150
$$ 111707 30580 -175950 -225138 -21625 -75079 381313 18977 91665 -139849 119156 -167150
18306a08932j18935a11499A01234k5478d1973E0149d1900a6246f34j90224O2947
$$ -108932 -227867 -111499 101234 75756 -41973 50149 -41900 -16246 -634 -190858 -127911
18295a27911D09146c03516a35731A22790a17847d2923j02714O752C8738a30464
$$ -127911 409146 -303516 -135731 122790 -117847 -42923 -145637 -138885 38738 -130464
18284B7705J08733a25601j77122B82194E4005b15028d8130k03397J00813C0063
$$ 27705 136438 -125601 -302723 282194 54005 -215028 -48130 -251527 -150714 30063
18273F9146b64459Q8864I3211J08278a49635E6978a52317H1902J35124m2322e2186
$$ 69146 -264459 -175595 93211 201489 -149635 56978 -152317 81902 217026 174704 -52186
18261A38076f4393R021n8903a0071D8778f2636b6441C0427c06284a8894D5801
$$ 138076 -64393 -55372 -114275 -10071 48778 -62636 -26441 30427 -306284 -18894 45801
18249B08425c4335j39218P3636j567D9964b9875A9533K4112K0497d0621r1221
$$ 208425 -34335 -173553 -99917 -101484 49964 -29875 19533 43645 64142 -40621 -131842
18238a31842A0887h6950D2810b92681B7584b08998r5727a51740c044q1586K6804
$$ -131842 10887 -86950 42810 -292681 27584 -208998 -304725 -151740 -3044 -84630 -57826
18227e7826j95002J21817n0804h0382q6391B06101G05a84665E18015b59414c8900
$$ -57826 -252828 -131011 -181815 -80382 -166773 206101 705 -184665 518015 -259414 -38900
18215b8841j66808l151p111p4011E3298a45116I6003i1862o7422A44983c3171
$$ -28841 -195649 -198800 -205911 -279922 53298 -145116 96003 -91862 -159284 144983 -33171
18203g2065j71223A05916h1206q5659C83259H7746a33208E3981A6763K16189q8565
$$ -72065 -243288 105916 -81206 -166865 383259 87746 -133208 53981 16763 232952 144387
18192A44387J20746c23914a46668B7026a2047k59542A89191o0562c34433J13845
$$ 144387 265133 -323914 -146668 27026 -12047 -271589 189191 128629 -334433 -220588
18182b20588N5837N4157e4j15250A17361b09857Q2562H9885L76803e6625h318
$$ -220588 -164751 -110594 -54 -115304 117361 -209857 -127295 89885 466688 -56625 -8318
18170b8107k4651B22733k7275G8538G196a42127N6728B7122b4245P379j42015
$$ -28107 -52758 222733 195458 78538 7196 -142127 -85399 27122 -24245 -16866 -158881
18159a58881p672P1302n9077r5999A17448A3775R3378g6907b1256K395k22956
$$ -158881 -166553 -95251 -154328 -250327 117448 13775 107153 -76907 -21256 -18861 -241817
18148b41817P3518I2956h90A72255a9754A06033b53515J15821N883K9490p4584
$$ -241817 -168299 92956 -890 172255 -19754 106033 -253515 -137694 -131811 -102321 -176905
18137a76905e7342A62918C9707b31488L5659a6519k286k669F8710J93177a14717
$$ -176905 -57342 162918 39707 -231488 -195829 -16519 -18805 -21474 68710 261887 -114717
18125A73493J88011F7115O0320b4460j08137J9302j84752g8683G5001L7040a46164
$$ 173493 361504 67115 127435 -24460 -132597 -113295 -298047 -78683 75001 112041 -146164
18113C4195g3736C54946B9045c94421C2428b78281B226J7610h7674k3577A31012
$$ 34195 -73736 354946 29045 -394421 32428 -278281 2226 19836 -87674 -111251 131012
18101A99973a59737b2561j77521Q875O8320F2070k3399g4926A67435b08401Q0083
$$ 199973 -159737 -22561 -200082 -191207 -122887 62070 38671 -74926 167435 -208401 -128318
18090a28318c8916j09565C5938b24q7216D30737c35300m2905A20909f3437j28990
$$ -128318 -38916 -148481 35938 -224 -87440 430737 -335300 -378205 120909 -63437 -192427
18079a92427A65910a11697B1044b14146m7732o7814h856r5046B69555a30641D8000
$$ -192427 165910 -111697 21044 -214146 -261878 -329692 -8856 -103902 269555 -130641 48000
18067a52184A79666G345K25221b80649J07869D9289e4729A51614c9868E0181O710
$$ -152184 179666 7345 232566 -280649 -172780 49289 -54729 151614 -39868 50181 56891
18056E6891a56138b0191B17627d0504l59780E8580M31651c43563g1521B5934N1981
$$ 56891 -156138 -20191 217627 -40504 -400284 58580 490231 -343563 -71521 25934 77915
18045G7915a95357A65855k1426c696B78411C424M9147a21534e296A54720F5631
$$ 77915 -195357 165855 144429 -3696 278411 3424 52571 -121534 -5296 154720 65631
18033b5434j32323P2134A67702c16806A46463f8111l1684k06583F3956g3627K7732
$$ -25434 -157757 -85623 167702 -316806 146463 -68111 -99795 -306378 63956 -73627 -45895
18022d5895j98591d0572F1309O6999a76286n9093J16537C88269a37287A32956
$$ -45895 -244486 -40572 61309 128308 -176286 -235379 -118842 388269 -137287 132956
18011a84492h1287B07472a31902j79688A9770c02802G6750O8960b34800o056m639
$$ -184492 -81287 207472 -131902 -311590 19770 -302802 76750 145710 -234800 -240856 -245495
18000b45495K5029A83982a9212p2438G8607k7159M29721b9715r4426E2553c87429
$$ -245495 -220466 183982 -19212 -91650 78607 51448 481169 -29715 -124141 52553 -387429
17988c54139H6291a40241k5372c8504j55183A2991c5302k3445l94002B38843e323
$$ -354139 86291 -140241 -165613 -38504 -193687 12991 -35302 -58747 -452749 238843 -5323
17976b94885H2785J5429N89695e9431k23504I4038H687O563J34802K80310j20368
$$ -294885 82785 98214 687909 -59431 -282935 94038 8687 15250 150052 430362 309994
17965C09994I3727b68673i5350m5514d9087j84943K0811g8303A89826b9234j20319
$$ 309994 93727 -268673 -95350 -140864 -49087 -234030 -213219 -78303 189826 -29234 -149553
17954a49553a289F797P138b0707q420j18578c2402A62099c34240A43984i3361
$$ -149553 -1289 6797 13935 -20707 -29127 -147705 -32402 162099 -334240 143984 -93361
17942D7358a8535j01437A9712b4313A55444b5391m72810C26639B1106P0873a2167
$$ 47358 -18535 -119972 19712 -24313 155444 -25391 -498201 326639 21106 91979 -12167
17930e8849k10534g0909j31259A8286K09485J8847a24085a0784A2591g6017A03290
$$ -58849 -269383 -70909 -202168 18286 227771 246618 -124085 -10784 12591 -76017 103290
17918a57051A42178k527k469d5398j82434E8499b0543k053j30866L0680e8321
$$ -157051 142178 139651 137182 -45398 -227832 58499 -20543 -22596 -153462 -122782 -58321
17906e8467j89000K1844M0844A10582A0878C053d5357j48649A0838b04883A37930
$$ -58467 -247467 -225623 -184779 110582 10878 3053 -45357 -194006 10838 -204883 137930
17894B09941C6186b7113k8318o2094A0567R412K44927H5976a32930B17291i5981
$$ 209941 36186 -27113 -55431 -117525 10567 19979 264906 85976 -132930 217291 -95981
17882E51628B10006b24400G613g6934A11672b8299l3913K3004A46471m2102C5585
$$ 551628 210006 -224400 7613 -76934 111672 -28299 -62212 -39208 146471 104369 35585
17870E0636b26454A40128E8186i3449j40049f9429I8199D2736a36325h944A18781
$$ 50636 -226454 140128 58186 -93449 -233498 -69429 98199 42736 -136325 -8944 118781
17858D11323n1195b611r2436b2714p4623j95811j7985a32176J0756G255b83903
$$ 411323 360128 -2611 -95047 -22714 -97337 -293148 -311133 -132176 -121420 7255 -283903
17846c22932a45018C3303L17719D5164A8422a21331A30878h5570j75211b3819
$$ -322932 -145018 33303 351022 45164 18422 -121331 130878 -85570 -260781 -23819
17835a50047C1308b80461d779A01007i6783A03315k7022a87508d0297A12910h1465
$$ -150047 31308 -280461 -4779 101007 -96783 103315 76293 -187508 -40297 112910 -81465
17823D0774b45C3584J9736J3358b03562F7209h8236C54998b17536I6056a32229
$$ 40774 -245 33584 53320 66678 -203562 67209 -88236 354998 -217536 96056 -132229
17811a70045P6421A48549i6142A32211A2132K06359H7889L70180b4312C52049
$$ -170045 -93624 148549 -96142 132211 12132 218491 87889 458069 -24312 352049
17800A80285P1381a87196B12899a1919I8314l2337i1343K0781b9858l5826r4960
$$ 180285 251666 -187196 212899 -11919 98314 65977 -91343 -70562 -29858 -65684 -160644
17789a60644m1681Q3273A4130b60025B38008p2088A8168J11439l5255j5213K96434
$$ -160644 -202325 -119052 14130 -260025 238008 165920 18168 129607 94352 79139 375573
17778C75573A32582R3394A0860b18833H3410N27b21378F5640d9477C53343d2506
$$ 375573 132582 225976 10860 -218833 83410 83937 -221378 65640 -49477 353343 -42506
17766H9411l7169J6842c91623a40842F6009P9684a20648d028k40442a5860p5916
$$ 89411 52242 69084 -391623 -140842 66009 145693 -120648 -4028 -244470 -15860 -91776
17755i1776K4110E1210J81217e7276H0399h815B4601e9646A20056a03954A14828
$$ -91776 -67666 51210 232427 -57276 80399 -8815 24601 -59646 120056 -103954 114828
17743f8658A62221d9584E2561e23602F5522M7279a31915o8592A99324d99927A33067
$$ -68658 162221 -49584 52561 -523602 65522 112801 -131915 -200507 199324 -499927 133067
17731b1747I8512a66811A9806a89605a0671H1936A0980J44503a83639D7170a66502
$$ -21747 98512 -166811 19806 -189605 -10671 81936 10980 155483 -183639 47170 -166502
17719D37615a20087G1093I966K9545L7278j3136c923A02349O2813c21262a8047
$$ 437615 -120087 71093 9966 39511 76789 63653 -3923 102349 165162 -321262 -18047
17707a14233D49180b28070O6259C6675h4442m7760G0223a06072k0189G6635A7355
$$ -114233 449180 -228070 -161811 36675 -84442 -132202 70223 -106072 -126261 76635 17355
17695A18441e3669F9356B8818J7269J78263a11588C334J6297K2399E752i0526
$$ 118441 -53669 69356 28818 46087 224350 -111588 3334 19631 42030 5752 -90526
17683A13233n1316b56094C1278j4134Q4859d2277C7739L562a24882C3600J12616
$$ 113233 61917 -256094 31278 17144 102003 -42277 37739 41301 -124882 33600 146216
17672A46216L2992q5768h4882p1886a3291r5423A62848b16817C2667a64963j09664
$$ 146216 179208 93440 -84882 -156768 -13291 -108714 162848 -216817 32667 -164963 -274627
17661b74627R8909o7530D1357d1422P896A58267D1280a38181A56949b6689l7312
$$ -274627 -175718 -243248 41357 -41422 -33526 158267 41280 -138181 156949 -26689 -64001
17650f4001B66418B4235a37662I9584p986B707g1654j32815C05590j07600r8950
$$ -64001 266418 24235 -137662 99584 91598 2707 -71654 -204469 305590 197990 99040
17639I9040j5671k9826J01992m4663a1107G5269i5778j81786g1876B67070b94455
$$ 99040 83369 53543 155535 110872 -11107 75269 -95778 -277564 -71876 267070 -294455
17627B65184j1941c9200J3126C46771F860K10505f517k50774M0088C34282D1515
$$ 265184 253243 -39200 -26074 346771 6860 217365 -6517 -257291 -217203 334282 41515
17615a60076O5030B82441e7605D9238f9221m5314C3245h5064G3367J91571K65393
$$ -160076 -95046 282441 -57605 49238 -69221 -114535 33245 -85064 73367 264938 530331
17604E30331H5302a33788C1613a15005A13894K5115g5260b3389l72539B0325L10410
$$ 530331 85302 -133788 31613 -115005 113894 139009 -75260 -23389 -395928 20325 330735
17593C30735H0258b1699F1558m051f8557p5266l4538j3299A25823b05066a01138
$$ 330735 80258 -21699 61558 57507 -68557 -143823 -178361 -191660 125823 -205066 -101138
17581A98515f2705A00340K6017i035j03372j09214f3216H8946K81249A43728m883
$$ 198515 -62705 100340 126357 -9035 -112407 -221621 -63216 88946 370195 143728 138845
17570A38845d7159E2384e7568E0749N3813Q3050b52586a05016A44382N685B7506
$$ 138845 -47159 52384 -57568 50749 104562 187612 -252586 -105016 144382 150067 27506
17558C4219a1522I740J30296n0688J39927b47060P6979N8836J0552C38033A42174
$$ 34219 -11522 9740 140036 89348 229275 -247060 -170081 -111245 -100693 338033 142174
17546i8175G4695L16292a1235A00375K6537l7271a9731C2670O4519i6302b3947
$$ -98175 74695 390987 -11235 100375 126912 89641 -19731 32670 97189 -96302 -23947
17534B8748J3820J62596a09873B62494J50405A34691i8182B10830M9171n7287
$$ 28748 42568 205164 -109873 262494 412899 134691 -98182 210830 260001 202714
17524B02714b0875q6246j9801A01401g4833o4956e8435j92768A25779j3426J23592
$$ 202714 -20875 -107121 -126922 101401 -74833 -139789 -58435 -251203 125779 112353 235945
17513B35945C6071J5196N8862j2572J67003J6505b56613C08855j18616J3550J89157
$$ 235945 36071 51267 110129 97557 264560 281065 -256613 308855 190239 203789 392946
17502C92946j47388m3300J7576i1109A74175c8299a1099A42948c0135C71450C279
$$ 392946 245558 202258 219834 -91109 174175 -38299 -11099 142948 -30135 371450 3279
17490B67540A7662J54179a86803g4609G3072K6358a93549o2946H6408J52635I4290
$$ 267540 17662 171841 -186803 -74609 73072 99430 -193549 -256495 86408 239043 94290
17478A8411J93870B9914J06075j7138m9207a65562C56290E7628M4286K37136A29362
$$ 18411 212281 29914 135989 118851 69644 -165562 356290 57628 101914 339050 129362
17466B12142p2134h9130A08029E2561L52961a13264A51692O2866o8129b01620
$$ 212142 140008 -89130 108029 52561 405522 -113264 151692 214558 146429 -201620
17455I4758J72774a86088B11218a24318C25601D5616g39l9283E5006L2459h043
$$ 94758 267532 -186088 211218 -124318 325601 45616 -739 -40022 55006 87465 -8043
17443C5280J28654J34150j27725R980a0160E16477a88881B38489n2958N9671O3022
$$ 35280 163934 298084 170359 180339 -10160 516477 -188881 238489 185531 245202 308224
17432C08224K35226A42044L7121J04810A25315L54969e7271B47613R8613A3805
$$ 308224 543450 142044 179165 283975 125315 480284 -57271 247613 346226 13805
17421a28744A65324G0502J69357E907a29844D29509a53466C02174J2337a08893
$$ -128744 165324 70502 239859 5907 -129844 429509 -153466 302174 314511 -108893
17410B63821a01066b9368D66077j92151N069E5224J86889j8856q8937p86f4658
$$ 263821 -101066 -29368 466077 273926 278995 55224 242113 223257 134320 133534 -64658
17398A2535N53653I7624Q7528J85205j73928a8371A89499a7941n5632B74740A23790
$$ 12535 566188 97624 185152 370357 196429 -18371 189499 -17941 -73573 274740 123790
17386G2323a87136J6569A33313F5874a7477B42124a27095A63598p8876H999M0048
$$ 72323 -187136 -170567 133313 65874 -17477 242124 -127095 163598 84722 8999 49047
17375D9047M72129A60793K1278F2221K69339N364M909A45994B7481a18381B46647
$$ 49047 521176 160793 182071 62221 331560 336924 341833 145994 27481 -118381 246647
17363e8800A39903f9938D7468J15484J99549G7791P8232K61927E015J58582p8781
$$ -58800 139903 -69938 47468 162952 362501 77791 156023 417950 5015 163597 84816
17352H4816L35137H1283J45727J13308j66611O997a6988C47361F6632Q0550O6914
$$ 84816 419953 81283 227010 340318 173707 180704 -16988 347361 66632 147182 214096
17341B14096Q7970c8138A99496k9276C6140L14724f2700l6445H8823C9375e754
$$ 214096 302066 -38138 199496 170220 36140 350864 -62700 -99145 88823 39375 -5754
17329I7445J18840L2985f1518A3137K40584n8919i6705D1745K02666A6122L70605
$$ 97445 216285 249270 -61518 13137 253721 194802 -96705 41745 244411 16122 386727
17318C86727A04795K62713i8445C13765J1849h5960D4476K05595D0407M79581
$$ 386727 104795 367508 -98445 313765 325614 -85960 44476 250071 40407 519988
17308E19988B0599J10939L981A9779L0050J27219J17425F610K01032F7201M7366
$$ 519988 20599 131538 135519 19779 49829 177048 294473 6610 207642 67201 114567
17297A14567R7619G8046J35145d123B6854J55059L08695A6536K41332n2647J29077
$$ 114567 212186 78046 213191 -4123 26854 181913 490608 16536 257868 205221 334298
17286C34298J30510k03412j27557l1773K95532E7282i4165B16046P7837L8578
$$ 334298 464808 261396 133839 102066 397598 57282 -94165 216046 293883 332461
17276C32461a09259A67548O1607K85021j74563j34037c5675d044l9780A33931
$$ 332461 -109259 167548 229155 514176 339613 205576 -35675 -4044 -43824 133931
17265a79212a3113B95528I9760M6031Q7398K62233A96584J12990d9768l242D26280
$$ -179212 -13113 295528 99760 145791 233189 495422 196584 309574 -49768 -53010 426280
17253D55471c9082E12398A35205l7280P0145P257J72280j08288H5616L39899H1246
$$ 455471 -39082 512398 135205 97925 168070 175327 347607 239319 85616 425515 81246
17241A82607b3880m3600A99221r8243J76171c25420h66o565C12608A29359Q7084
$$ 182607 -23880 -67480 199221 100978 277149 -325420 -866 -7431 312608 129359 216443
17230B16443j03496L3750p2251K19603K892Q2356A73326l4792O229L18818o8540
$$ 216443 112947 146697 74446 294049 296941 379297 173326 138534 144763 463581 395041
17219C95041A75799K90420a8683A6857J98871K03894o3066e5569A82351G4352
$$ 395041 175799 466219 -18683 16857 215728 419622 356556 -55569 182351 74352
17208C99564J08230j2789j20145A17076M12130j74479b5935B37549P2225j08125
$$ 399564 507794 495005 374860 117076 529206 354727 -25935 237549 309774 201649
17198B01649c1708C09898a04832I3831K09908A50722a8573A32519b11198A31873
$$ 201649 -31708 309898 -104832 93831 303739 150722 -18573 132519 -211198 131873
17187B44209p715m6818B4970L6130J634k3225J04909a69095B39153p6480R08i6962
$$ 244209 236494 189676 24970 61100 62734 39509 144418 -169095 239153 162673 163581 -96962
17174C51670M0160j40257L28281G7342K36797j6221j45810L66829B36630C1705
$$ 351670 391830 251573 579854 77342 314139 297918 152108 518937 236630 31705
17163F85443k37148H4581K15810J75829A59682L90336A83331a60552A55756K41895
$$ 685443 448295 84581 300391 476220 159682 550018 183331 -160552 155756 397651
17153C97651J03176k19698K33901j64546L14388I7695L51370A38236K50902I7442
$$ 397651 500827 281129 515030 350484 664872 97695 449065 138236 389138 97442
17142B86508n6517L55139A74818D6718N29629B32665H0130K66799j1117j46492
$$ 286508 229991 585130 174818 46718 576347 232665 80130 346929 335812 189320
17132A89320K45489p7266k6822j06614L26564k37405a53795e8664G1919K69023
$$ 189320 434809 357543 330721 224107 550671 313266 -153795 -58664 71919 340942
17122C40942l0586a12159D02487j91499l9393M6905K54623j23029k118O2740C8011
$$ 340942 310356 -112159 402487 210988 171595 218500 473123 350094 347976 410716 38011
17110D39848p8464k9886M9426C4713R7385L64028k35839L9706J37715A27554d0926
$$ 439848 361384 331498 380924 34713 132098 496126 260287 299993 437708 127554 -40926
17098A45788J7207J57045R330J28359J13949B10876j6914L33897m1352k34355
$$ 145788 162995 320040 329370 457729 571678 210876 193962 527859 486507 252152
17088B52152M83517E7694K90609J04172m642G216K22523M2594j9937H8889N67588
$$ 252152 735669 57694 348303 452475 447833 7216 229739 272333 252396 88889 656477
17077F56477B72551m6586J93515r2491K09329A84377J43774K3491j65335Q7M27191
$$ 656477 272551 225965 419480 326989 536318 184377 328151 351642 186307 186394 613585
17066F13585H2178J85682J21646L33218j42224j05234L91085k67899J51347C38773
$$ 613585 82178 267860 389506 722724 580500 475266 866351 598452 749799 338773
17055C68399K62146A68642J22925L27072j65035J60072l7850N5770j28651K1572
$$ 368399 630545 168642 291567 618639 453604 613676 575826 631596 502945 524517
17045E24517j97100K89294K77483C55024j56716K75325o1742L78040m1424B98486
$$ 524517 327417 616711 894194 355024 198308 473633 411891 789931 748507 298486
17034E07562J11541k73250N36511k31148J61747C33749r25L61149j83922J15348
$$ 507562 619103 345853 882364 651216 812963 333749 332824 693973 510051 625399
17024F25399k45665J41038j00784J25782k1831k0700p6222M16288k68293m8627
$$ 625399 379734 520772 419988 545770 523939 503239 427017 843305 575012 526385
17014E26385j34922K81743j32780J5154j39681L92781k62265l4560L57204D26295
$$ 526385 391463 673206 540426 555580 415899 808680 546415 511855 869059 426295
17003E60843K2010K2447K04241C97505K93845o6155j02531j70568L28812k1810
$$ 560843 582853 605300 809541 397505 691350 625195 522664 352096 680908 659098
16993F59098k66958K95298J83000k11862j41051J9164q0602J18790K98710O5365
$$ 659098 392140 687438 870438 658576 517525 536689 456087 574877 873587 938952
16983I38952j46577j10817J38041L591l32417J83706j82866J49886L251j41072
$$ 938952 792375 681558 819599 823190 490773 674479 491613 641499 644750 503678
16973E03678Q0978J08020J92187j2272k64489l7012L29395l5398j0409m6540N9311
$$ 503678 584656 692676 884863 872591 608102 571090 900485 865087 854678 808138 867449
16962H67449p092o5549J4243j02908P3777L00390J27103m14713n6984J96034L6813
$$ 867449 860357 794808 809051 706143 779920 1080310 1207413 792700 735716 931750 968563
16951I68563k6239L8041l27348M48200k05119L96168l98779J4792N8135J70846
$$ 968563 942324 980365 653017 1101217 896098 1292266 893487 908279 966414 1137260
16941A137260j47483p2481q2112M96487k94824M13487j47547o0709N1270j85370
$$ 1137260 989777 917296 835184 1331671 1036847 1450334 1302787 1242078 1293348 1107978
16931A107978n4386O9527J01369k98737L341Q5285K28330k2913m2450j57886K90554
$$ 1107978 1053592 1123119 1224488 925751 929092 1014377 1242707 1219794 1177344 1019458 1310012
16920A310012j63387k33764M93435k47390n6634M38155k47647N3150J01283m15947
$$ 1310012 1146625 912861 1406296 1158906 1102272 1540427 1292780 1345930 1447213 1031266
16910A031266K34127j8435L61712k14632J76220p4176M1513j79940J73687p3484
$$ 1031266 1265393 1246958 1608670 1394038 1570258 1496082 1537595 1357655 1531342 1457858
16900A457858J45965L8027j90674L37125k94909J26009L9216J1524k32368J27050
$$ 1457858 1603823 1641850 1451176 1788301 1493392 1619401 1658617 1670141 1437773 1564823
16890A564823N50606o25637K38365j38873J83184J10283l36988L63320j11290
$$ 1564823 2115429 1489792 1728157 1589284 1772468 1882751 1545763 1909083 1797793
16881A797793N8112l51191K66666R4755j9026J85568j3644n8860Q1662M55805
$$ 1797793 1855905 1504714 1771380 1866135 1847109 2032677 2019033 1960173 2041835 2497640
16871B497640n06758k41786K34252N83470p52742N72341k56411p9095K96360j16167
$$ 2497640 1990882 1749096 1983348 2566818 1814076 2386417 2130006 2050911 2347271 2231104
16861B231104O6246P719K6091K54880J3698j95603J08196n3851K22687n2143J69627
$$ 2231104 2297350 2305069 2331160 2586040 2599738 2404135 2512331 2458480 2681167 2629024 2798651
16850B798651j76395J7038K09202J6118J26373l88793L48031k42483L70080N5387
$$ 2798651 2622256 2639294 2848496 2864614 2990987 2602194 2950225 2707742 3077822 3133209
16840C133209k86502K49341q4596K31313j61089K95812m65783N56905K61307k37683
$$ 3133209 2846707 3096048 3011452 3242765 3081676 3377488 2911705 3468610 3729917 3492234
16830C492234P2783O6532L17778j80204R9339J82250Q4377k68333O8550K94457
$$ 3492234 3565017 3631549 3949327 3769123 3868462 4050712 4135089 3866756 3935306 4229763
16820D229763J38773K3626l09971N11780K455j47081r2638M43807L23803J5551
$$ 4229763 4368536 4392162 4082191 4593971 4596426 4449345 4356707 4800514 5124317 5139868
16810E139868K03239k52104K34065J63863n49819N46687l8051L17270k5379J80085
$$ 5139868 5343107 5091003 5325068 5488931 4939112 5485799 5447748 5765018 5739639 5919724
16800E919724L89784m09900J70361N59424j13031L02993l92161N83786O9638K79335
$$ 5919724 6309508 5899608 6069969 6629393 6516362 6819355 6427194 7010980 7080618 7359953
16790G359953k7003M58850k117J56264L31340J5089M16423q6607J39277L78757
$$ 7359953 7332950 7791800 7789683 7945947 8277287 8292376 8708799 8622192 8761469 9140226
16780I140226K48430L94972J31843L13679N63792j43728N72535o4928N39793L39831
$$ 9140226 9388656 9783628 9915471 10229150 10792942 10649214 11221749 11156821 11696614 12036445
16770A2036445N98725J55856M61122K98948N09930K67361P25180J94798Q97213
$$ 12036445 12635170 12791026 13252148 13551096 14061026 14328387 15053567 15248365 16145578
16761A6145578J79929N56191N15785N26505J237663L0660P48440Q21506Q45212
$$ 16145578 16325507 16881698 17397483 17923988 19161651 19192311 19940751 20762257 21607469
16752B1607469O69365R35936J124849Q02133P54670J231930Q84433J095524J432422
$$ 21607469 22276834 23212770 24337619 25139752 25894422 27126352 28010785 29106309 30538731
16743C0538731J474690J170938J512507J485812J869021J931522J547319K426124
$$ 30538731 32013421 33184359 34696866 36182678 38051699 39983221 41530540 43956664
16735D3956664K276473K218208K387824K874131K510275K849803L897458L168561
$$ 43956664 46233137 48451345 50839169 53713300 56223575 59073378 62970836 66139397
16727F6139397L412637M298911M023502M683380M566465N037814N972025N623468
$$ 66139397 69552034 73850945 77874447 82557827 87124292 92162106 98134131 103757599
16719A03757599O218522O187182O452216P024327O858408P024514P040325O821354
$$ 103757599 109976121 116163303 122615519 129639846 136498254 143522768 150563093 157384447
16711A57384447O597451O673808N971860M933691M678995L314789K751775P83292
$$ 157384447 163981898 170655706 176627566 181561257 186240252 189555041 192306816 193090108
16703A93090108J49856r63654k181827l295619m066821n100246n868472o323894
$$ 193090108 193239964 192276310 190094483 186798864 182732043 177631797 171763325 165439431
16695A65439431o722161o719489p108127p164841o869248p035568o429141o469937
$$ 165439431 158717270 151997781 144889654 137724813 130855565 123819997 117390856 110920919
16687A10920919o350522n361702n736207n389297m974399m694252m211650m395719
$$ 110920919 104570397 99208695 93472488 88083191 83108792 78414540 74202890 69807171
16679F9807171l343970l887268l745881k554506l076289k935254k407765k503222
$$ 69807171 66463201 62575933 58830052 56275546 53199257 50264003 47856238 45353016
16671D5353016k264980j854320k021162k165727j636256j633163j686055q60855
$$ 45353016 43088036 41233716 39212554 37046827 35410571 33777408 32091353 31230498
16663C1230498j535031j206761j320163j104090p12578j555714j046796n88630
$$ 31230498 29695467 28488706 27168543 26064453 25351875 23796161 22749365 22160735
16655B2160735j009260p02478p32529o39846p09164o31467n72963p04404k61031
$$ 22160735 21151475 20448997 19716468 19076622 18367458 17735991 17163028 16458624 16197593
16646A6197593q28491m09898l26025o93341j91763o40616m41367k57264l07861
$$ 16197593 15369102 14959204 14633179 13939838 13748075 13107459 12666092 12408828 12100967
16637A2100967m04908n16009j53377l96254l57352j03223j28187o84701j21584
$$ 12100967 11696059 11180050 11026673 10630419 10273067 10169844 10041657 9356956 9235372
16628I235372m6607l99556O8026n18073l25308k75752J29357J6618j43907o34316
$$ 9235372 9188765 8789209 8857235 8339162 8013854 7738102 7867459 7884077 7740170 7105854
16618G105854L5346j07919j58889n88681J45085l52657J01933J08494n00041K2342
$$ 7105854 7141200 7033281 6874392 6285711 6430796 6078139 6180072 6288566 5788525 5810867
16608E810867q1471J0510l57725L5523l47616K5269m4416l08650J28978j12894
$$ 5810867 5729396 5739906 5382181 5417704 5070088 5095357 5050941 4742291 4871269 4758375
16598D758375k19648k6421l08983K0666n0232k64519L3909j18057q2003j82330
$$ 4758375 4538727 4512306 4203323 4223989 4173757 3909238 3943147 3825090 3743087 3560757
16588C560757J04979k68145J4354J98973j89584K25581O8703n13838J1481P9704
$$ 3560757 3665736 3397591 3411945 3610918 3421334 3646915 3715618 3201780 3213261 3292965
16578C292965r1322J55953m03166J2202l516j84322J99238j97745j05264J04965
$$ 3292965 3201643 3357596 2954430 2966632 2963116 2778794 2978032 2780287 2675023 2779988
16568B779988L7814j26266Q4226l35439K08799Q4206m51762J80883r586r9096
$$ 2779988 2817802 2691536 2775762 2440323 2649122 2733328 2281566 2462449 2452863 2353767
16558B353767K02481n71627K56472p1900J62514k94242K45254l1070j61797j14510
$$ 2353767 2556248 1984621 2241093 2169193 2331707 2037465 2282719 2251649 2089852 1975342
16548A975342Q6109j77054j23656K12896j67077K718o356j24076l200M35606k44242
$$ 1975342 2061451 1884397 1760741 1973637 1806560 1809278 1802922 1678846 1675646 2111252 1867010
16537A867010j79799k29860L21963m43738L88158J41264k81094m6513j67235N41842
$$ 1867010 1687211 1457351 1779314 1335576 1723734 1864998 1583904 1537391 1370156 1911998
16527A911998k43225m79240J82296J86148K0742j25866j53873j25667K38134J21691
$$ 1911998 1668773 1189533 1371829 1557977 1578719 1452853 1298980 1173313 1411447 1533138
16517A533138r4684k50106J77258J01789l49064n114L77164n48379N00054k99232
$$ 1533138 1438454 1188348 1365606 1467395 1118331 1113217 1490381 942002 1442056 1142824
16507A142824j31115J38737j5285L1760J40158j53557P2442m5779j33040J73983
$$ 1142824 1011709 1150446 1135161 1166921 1307079 1153522 1225964 1180185 1047145 1221128
16497A221128Q109Q6151l56098J47355o0253L79041l2797l44180k11901K11767
$$ 1221128 1229237 1315388 959290 1106645 1046392 1425433 1392636 1048456 836555 1048322
16487A048322J17169l86051J82894P37J75080k40275M9407J52253o3476O1239
$$ 1048322 1165491 779440 962334 963071 1138151 897876 947283 1099536 1036060 1097299
16477A097299j57062j62951L58824m17924Q4186P136J03334j32291M12658k74677
$$ 1097299 940237 777286 1136110 718186 802372 809508 912842 780551 1193209 918532
16467I18532M0995j30346J20897k12602l1490J51104k69503j8630J87649j21478
$$ 918532 959527 829181 950078 737476 705986 857090 587587 568957 756606 635128
16457F35128K5755J81115n6316q6929k8053k40960K07851J65998p552J47090J07238
$$ 635128 660883 841998 785682 698753 670700 429740 637591 803589 796037 943127 1050365
16446A050365l61397l0657j18582M31367l21580K63410l48328K33751k59843R769
$$ 1050365 688968 658311 539729 971096 649516 912926 564598 798349 538506 548275
16436E48275L04998j05588A93340M13598J16581l27330M29732j63471H9000M27477
$$ 548275 853273 747685 193340 606938 723519 396189 825921 662450 89000 516477
16426E16477M23069l54607Q2497j82717K55697l45169J42522O7787K17970k32097
$$ 516477 939546 584939 667436 484719 740416 395247 537769 605556 823526 591429
16416E91429j9042j1201B36223A13307M93044J8400j03789j15704K40648j69138
$$ 591429 572387 561186 236223 113307 606351 624751 520962 405258 645906 476768
16406D76768k32316N0317R1329n1125A55965M57947o7566r6231n4500J14997J50771
$$ 476768 244452 294769 386098 334973 155965 613912 546346 450115 395615 510612 661383
16395F61383j07410k63885J91893J18887k60329K76021B49891L59645H8806J27156
$$ 661383 553973 290088 481981 600868 340539 616560 249891 609536 88806 215962
16385B15962K82851J80538B93017P198p0816L82303k30992A08881R4010K51446
$$ 215962 498813 679351 293017 300215 229399 611702 380710 108881 202891 454337
16375D54337A85101L0261J18389R8078l9132j59748K78560j06211n0389j33442
$$ 454337 185101 215362 333751 431829 392697 232949 511509 405298 354909 221467
16365B21467J4529R2578K82249j16530k31256K28935A89394K24389j97560J90324
$$ 221467 235996 328574 610823 494293 263037 491972 189394 413783 216223 406547
16355D06547Q8112A21752K99338j94492A03536K11199N9008J66562p0584H546
$$ 406547 494659 121752 421090 226598 103536 314735 373743 540305 469721 8546
16344C94229J42841j62170A83369L13203g5066B07601L62842k05763I4660L76543
$$ 394229 537070 374900 183369 496572 -75066 207601 570443 364680 94660 471203
16334D71203A80755K33906L43684C62622j26785M2432J78384j35151K25941A11828
$$ 471203 180755 414661 758345 362622 235837 278269 456653 321502 547443 111828
16323A27946k9474L63602j18402m1828l0224K2474H6436J95650b9301C16286A00183
$$ 127946 98472 462074 343672 301844 271620 294094 86436 282086 -29301 316286 100183
16311b28720C77931I956L86380A80344E8390M12407l6854A86485K36030m5349
$$ -228720 377931 9956 396336 180344 58390 470797 433943 186485 422515 377166
16301C77166j29114J83781D0964R8400O0214P3080o9716N0348H8346K26614r8481
$$ 377166 248052 431833 40964 139364 199578 272658 202942 253290 88346 314960 216479
16290B16479J77900i3725j28876E01276j72372A34185J45868j6061D4024J90709
$$ 216479 394379 -93725 -222601 501276 328904 134185 280053 263992 44024 234733
16280B34733n647Q7645M2597L3442M321K9058A52416P4669G2326J45955p5259
$$ 234733 229086 316731 359328 392770 397091 426149 152416 227085 72326 218281 143022
16269A43022h5014A54851C2574M55171B26094J602c4844H8863K43813E8920Q3552
$$ 143022 -85014 154851 32574 487745 226094 227696 -34844 88863 332676 58920 142472
16258A42472P960C0064K07394P0331n6013r2227P0254I3822C4764a47779F2693
$$ 142472 150432 30064 237458 307789 251776 159549 229803 93822 34764 -147779 62693
16246E2815J74444K30931A21604L0653a14815B48420J35472A1887c0602A26178
$$ 52815 227259 458190 121604 152257 -114815 248420 383892 11887 -30602 126178
16235F9909M7545J60184J55996D2418J91483a29198A7834K09594G0190J50400
$$ 69909 117454 277638 433634 42418 233901 -129198 17834 227428 70190 220590
16225B20590L156G7649K02847A08682R6623b9640B40754A08503E4220N8307l1217
$$ 220590 223746 77649 280496 108682 205305 -29640 240754 108503 54220 112527 81310
16214H1310J65499c00682e9313i214A97784I6179Q4815Q1002k5311b61211B40614
$$ 81310 246809 -300682 -59313 -9214 197784 96179 180994 261996 236685 -261211 240614
16202B9186L4722J75150A07524K73364A12402l8225A4032K62518j31702R2031
$$ 29186 63908 239058 107524 380888 112402 74177 14032 276550 144848 236879
16192B36879h3454a7999j11161A58645h9993A64139o7520a74169D89509j82270
$$ 236879 -83454 -17999 -129160 158645 -89993 164139 96619 -174169 489509 307239
16182C07239I1306a27283A53081i3514A17219J01698m647j04319h2191B58363
$$ 307239 91306 -127283 153081 -93514 117219 218917 214270 109951 -82191 258363
16171D2463c583B88724e2257C6926R7553k6396E1449J08686o1012a60022A15257
$$ 42463 -3583 288724 -52257 36926 134479 108083 51449 160135 99123 -160022 115257
16159a04035B43331A5191b11680A68640K85480i6168b7832j53918A59327k1872
$$ -104035 243331 15191 -211680 168640 454120 -96168 -27832 -181750 159327 137455
16149A37455J647a03215A39853O3469D1361L10040k2399f4996a7861A9947O8145
$$ 137455 139102 -103215 139853 203322 41361 351401 329002 -64996 -17861 19947 88092
16138H8092L8903K3493a04685B2257J06655B3183R7241D8108h4193L3169a1212
$$ 88092 126995 150488 -104685 22257 128912 23183 120424 48108 -84193 -51024 -11212
16126a66945B505a55913A24119G803J3353a61613A30961R4055D9078J3519a75530
$$ -166945 2505 -155913 124119 7803 21156 -161613 130961 225016 49078 62597 -175530
16114A05170A4998N61850F9004h4571K3630B25215I2876D3288o808c12085H9483
$$ 105170 14998 576848 69004 -84571 -60941 225215 92876 43288 36480 -312085 89483
16102a68528g5533q1152C24317a79711E3932a67986E0514j4886J48699L546j2654
$$ -168528 -75533 -156685 324317 -179711 53932 -167986 50514 35628 184327 187873 175219
16091A75219j6994b1341o405F3311P0810K23501j02162b99709E4179J23494B9936
$$ 175219 158225 -21341 -27746 63311 134121 357622 255460 -299709 54179 177673 29936
16079a8845C04893A26175j6149a21451B08199c64474J59227A14773a29366A24426
$$ -18845 304893 126175 110026 -121451 208199 -364474 -205247 114773 -129366 124426
16068a85621L8677B28881B2912J31640k2344l4496l3459L0918c10146a00192i052
$$ -185621 -146944 228881 22912 154552 132208 97712 64253 95171 -310146 -100192 -9052
16056b78759A144a32421B86887c0908B7351L90408j7429a23064B54543b44591
$$ -278759 1144 -132421 286887 -30908 27351 417759 400330 -123064 254543 -244591
16045b02183O2021K0473C4108j6659J69307k0498P6667O7316C3959L3408g3643
$$ -202183 -140162 -119689 34108 17449 186756 166258 242925 310241 33959 67367 -73643
16033A94154a84099Q1895j85282b9872B7052L8377B1414a82672B18484c68683
$$ 194154 -184099 -102204 -287486 -29872 27052 65429 21414 -182672 218484 -368683
16022D9660a00808A06682K7104c58960c1671C18088a54621Q41A05928b65483f6519
$$ 49660 -100808 106682 133786 -358960 -31671 318088 -154621 -153780 105928 -265483 -66519
16010a22463B57767c21137I9941m1984J1723a00516L8454j47662B63255i7326
$$ -122463 257767 -321137 99941 57957 69680 -100516 -62062 -209724 263255 -97326
15999A5523f380B8905d4569d166k85520h4846l8551m9417F0139a38656A81378
$$ 15523 -6380 28905 -44569 -4166 -289686 -84846 -123397 -172814 60139 -138656 181378
15987i5572B86555b87494c5707i417j99126h5636A27752j228i701k87397G1663
$$ -95572 286555 -287494 -35707 -9417 -208543 -85636 127752 126524 -9701 -297098 71663
15975a03640c8488H4498a66673D84202A24376J9136c2308H0514O3621K14373A77327
$$ -103640 -38488 84498 -166673 484202 124376 143512 -32308 80514 144135 358508 177327
15963C77559A5578a09978C13409a7843B35126a28624C243b40174D2208A4947g4610
$$ 377559 15578 -109978 313409 -17843 235126 -128624 3243 -240174 42208 14947 -74610
15951b946A89725g4468o3657A20421g5138G6350b17690M5117A11524g8127j40264
$$ -2946 189725 -74468 -138125 120421 -75138 76350 -217690 -172573 111524 -78127 -218391
15940b18391D6444e36024a66875B08405c00075c0347C9841H814g1653j82356F5337
$$ -218391 46444 -536024 -166875 208405 -300075 -30347 39841 8814 -71653 -254009 65337
15928b77629D01242b82172d8878P248p4937A24161A5519K18880a54515n9247o4306
$$ -277629 401242 -282172 -48878 -41630 -116567 124161 15519 234399 -154515 -213762 -278068
15917b78068A7230e37172a72771A65836b941l14724A79327m5673J0764f8115E5763
$$ -278068 17230 -537172 -172771 165836 -2941 -317665 179327 133654 144418 -68115 55763
15905f7159R196j17486L7213C8278J88544L4365d2482J1952E9448a07331H879
$$ -67159 -57963 -175449 -138236 38278 226822 261187 -42482 -30530 59448 -107331 8879
15893c0688r715A33560A6069b2524B91960a00475M8946j74493A36017n2993a10381
$$ -30688 -40403 133560 16069 -22524 291960 -100475 -51529 -226022 136017 83024 -110381
15881A98593b54248a0552A22919e4337l198o9811M4559E6719L881b58641B29316
$$ 198593 -254248 -10552 122919 -54337 -57535 -127346 -82787 56719 60600 -258641 229316
15869B3401h4945j17229G0907g3946l06971F7966c96887B08954q6504d6186j5662
$$ 23401 -84945 -202174 70907 -73946 -380917 67966 -396887 208954 122450 -46186 -61848
15858f1848B48137a17354E1638e3643B6859L7789d5139b0634A23600c7410B58894
$$ -61848 248137 -117354 51638 -53643 26859 64648 -45139 -20634 123600 -37410 258894
15846a99753j2651j70423J13322G0858c00424J20814A7328a92647f3712B8280
$$ -199753 -212404 -382827 -269505 70858 -300424 -179610 17328 -192647 -63712 28280
15835B32624a04812c0355F7794a82288m8010Q5441M7019n2117j32363j1128A73956
$$ 232624 -104812 -30355 67794 -182288 -230298 -144857 -97838 -149955 -282318 -293446 173956
15823E9539c52561G4638B3321a44696o8537B1462m877b04448b7784A3311c56368
$$ 59539 -352561 74638 23321 -144696 -213233 21462 16585 -204448 -27784 13311 -356368
15811C8970d42913c8271p2870e2113j05262e1953E9742J52892h407q4940A33353
$$ 38970 -442913 -38271 -111141 -52113 -157375 -51953 59742 212634 -8407 -93347 133353
15799a90073M4280A84887c34628G427L8074J09441Q1539b38323d97j23959M8945
$$ -190073 -145793 184887 -334628 7427 45501 154942 236481 -238323 -497 -124456 -75511
15788g5511j8414K9036k13145d0393A7461F72b0225r7438c5114k25960H7122K28618
$$ -75511 -93925 -64889 -278034 -40393 17461 672 -20225 -117663 -35114 -261074 87122 315740
15776C15740m972E0947K2463a78340j67146b338j82001l1126J02920G3115j9973
$$ 315740 310768 50947 73410 -178340 -345486 -2338 -184339 -215465 -112545 73115 53142
15765E3142c09471d8799C0601a90987E1864a77154N3N9570d7798j94135O6547
$$ 53142 -309471 -48799 30601 -190987 51864 -177154 -177101 -117531 -47798 -241933 -175386
15754a75386h3805j32228B10706a43065I4700A195Q0011b4548m06516B71298A0866
$$ -175386 -83805 -216033 210706 -143065 94700 1195 81206 -24548 -431064 271298 10866
15742G182O4945C773a67909A04632a8709H271b73347e3557F9304C1963b20179
$$ 7182 72127 3773 -167909 104632 -18709 8271 -273347 -53557 69304 31963 -220179
15730a81036I8429i738l50886Q1401c1917I1773O3498a27126c9823A09514L6711
$$ -181036 98429 -9738 -360624 -279223 -31917 91773 155271 -127126 -39823 109514 146225
15719A46225g2240k11498J37712A79181e2351I9035m5191b06821C54740A6637
$$ 146225 -72240 -283738 -146026 179181 -52351 99035 53844 -206821 354740 16637
15708c53320C296Q4790d0417j791k40223a31903B0901O0044J19764a40675J5914
$$ -353320 3296 88086 -40417 -42208 -282431 -131903 20901 80945 200709 -140675 -124761
15697a24761o6540B14975L285J9796d7744A8581e9436m04813B24839k4835k909
$$ -124761 -191301 214975 218260 238056 -47744 18581 -59436 -464249 224839 200004 197095
15686A97095D4117d4409F4880a61375C28940H7503i8466j3295A88723q5834D0407
$$ 197095 44117 -44409 64880 -161375 328940 87503 -98466 -111761 188723 102889 40407
15674H3448N4463J96222h6892j18376A24575n7098a40514k50302E6680A3649K16114
$$ 83448 137911 334133 -86892 -205268 124575 67477 -140514 -390816 56680 13649 229763
15663B29763a8239l32038I2617g3449q6633H24a48344d0323j16817a2887l05559
$$ 229763 -18239 -350277 92617 -73449 -160082 824 -148344 -40323 -157140 -12887 -318446
15652c18446C87782a21072B48840b99150h7140C846a16944J5377A33851P652B3790
$$ -318446 387782 -121072 248840 -299150 -87140 3846 -116944 -101567 133851 141503 23790
15640A27122A2740K15219a23969M7209A0169a87565b2432B73309I9465a56332
$$ 127122 12740 227959 -123969 -76760 10169 -187565 -22432 273309 99465 -156332
15629A42551f1637C46958b79902d6421j24318B11248a84007N4001H2680c06373
$$ 142551 -61637 346958 -279902 -46421 -170739 211248 -184007 -130006 82680 -306373
15618a18859j79049J28815B50738o439c38143c4147j14051B28830g3836d728G5619
$$ -118859 -297908 -169093 250738 244299 -338143 -34147 -148198 228830 -73836 -4728 75619
15606A85900b03143A85769b95641a13128C14251j47746o9107b71777A07639a19803
$$ 185900 -203143 185769 -295641 -113128 314251 166505 97398 -271777 107639 -119803
15595a43972K6775m4151L2291A17051a48959d5663B40465c10601a11670Q753d8444
$$ -143972 -117197 -161348 -129057 117051 -148959 -45663 240465 -310601 -111670 -102917 -48444
15583F1502M5439j6838e1693A04158C0044c26249N7390M4802J3233A41403P6082
$$ 61502 106941 90103 -51693 104158 30044 -326249 -268859 -224057 -210824 141403 217485
15572B17485m9595E3358a67432A81618b30355G7987L2716P6847g7580p2076o0477
$$ 217485 167890 53358 -167432 181618 -230355 77987 110703 187550 -77580 -149656 -210133
15561b10133J1674H0982a29529q7308A78579a46169j93962A09949b26785d5602
$$ -210133 -198459 80982 -129529 -216837 178579 -146169 -340131 109949 -226785 -45602
15550A32906B7101e2822K4778A83369B2007h4009E5370c04271c8177a4130j16934
$$ 132906 27101 -52822 -28044 183369 22007 -84009 55370 -304271 -38177 -14130 -131064
15539a31064G5069c6020A82572b38682A09098f3585K0989E1333b0577k0097A1524
$$ -131064 75069 -36020 182572 -238682 109098 -63585 -42596 51333 -20577 -40674 11524
15527d5319A1896K17529J47834b2435E2477j6262c28980I4067c58720A57762F0429
$$ -45319 11896 229425 377259 -22435 52477 36215 -328980 94067 -358720 157762 60429
15515h5524m8993A45439E5853J09817b00167B74834m7375c7572A49032j7073b32556
$$ -85524 -134517 145439 55853 165670 -200167 274834 227459 -37572 149032 131959 -232556
15503a21236n7258F8786B4068J11100e592D1339f2863A81061G263J43103J26956
$$ -121236 -178494 68786 24068 135168 -5592 41339 -62863 181061 7263 150366 277322
15492B77322g6100q7781A38415b83875C07616p2470a05216A56210E550a59214
$$ 277322 -76100 -163881 138415 -283875 307616 235146 -105216 156210 5550 -159214
15481b444k07389b4188A48809f0363n9588j7937j32563j05037B90609b75179P1083
$$ -2444 -209833 -24188 148809 -60363 -119951 -137888 -270451 -375488 290609 -275179 -204096
15470b04096F241N3124p199A6081a01581C67274a34548A72204d0946o806E3172
$$ -204096 6241 59365 52166 16081 -101581 367274 -134548 172204 -40946 -47752 53172
15458A61280a35549e695l32006B08391i4387A41629a76658J1421d5639k49310
$$ 161280 -135549 -5695 -337701 208391 -94387 141629 -176658 -165237 -45639 -294949
15448b94949A09480c68975H5281a47500C36957B9031J54894a08610A99881c18617
$$ -294949 109480 -368975 85281 -147500 336957 29031 183925 -108610 199881 -318617
15437B70978c33577a6182l54555B15739b3831A19877A0437K01346A7229J05443
$$ 270978 -333577 -16182 -370737 215739 -23831 119877 10437 211783 17229 122672
15427A22672d52839b25257N5600n7176c3026n624B16776D8821K1534m942K00004
$$ 122672 -452839 -225257 -169657 -226833 -33026 -38650 216776 48821 70355 65413 265417
15416B65417D2857J6912a7622E1658a24652G5793L9782J9358h7165E6522B0061
$$ 265417 42857 59769 -17622 51658 -124652 75793 115575 134933 -87165 56522 20061
15404a6237A30794K7123b34333c4682A9825L36695a50865B43603a35245A51579
$$ -16237 130794 157917 -234333 -34682 19825 356520 -150865 243603 -135245 151579
15393A30088a06545d5640j57724A63828H0428k4956a95242i886D6729b43498n8242
$$ 130088 -106545 -45640 -203364 163828 80428 55472 -195242 -9886 46729 -243498 -301740
15382c01740a35064R151F2681b57393A51241B0692c24330c2242E8307H608J41008
$$ -301740 -135064 -125913 62681 -257393 151241 20692 -324330 -32242 58307 8608 149616
15371A49616A4512R9556J06721a03710c8250A05783R0755b28929n8051a37497
$$ 149616 14512 114068 220789 -103710 -38250 105783 196538 -228929 -286980 -137497
15360C9469j9318J29101a51022a1170k56631i4181G4499l6773a90463c9819r5982
$$ 39469 20151 149252 -151022 -11170 -267801 -94181 74499 37726 -190463 -39819 -135801
15349a35801a7729j48752f6828l769B01922M933g9499A2786f2610i505n3951a584
$$ -135801 -17729 -166481 -66828 -70597 201922 206855 -79499 12786 -62610 -9505 -63456 -1584
15336b27894C8379K2969L3877b2878A59046J4284H310K84698b29058F9926a12182
$$ -227894 38379 61348 95225 -22878 159046 173330 8310 293008 -229058 69926 -112182
15324b77124f8430B75011A01391b09241i2369A72Q2343i8457A66022a71901B59833
$$ -277124 -68430 275011 101391 -209241 -92369 172 82515 -98457 166022 -171901 259833
15312B20260D680b53253I6059i5565C64093A69752f0909k6048A68421K31475A78600
$$ 220260 4680 -253253 96059 -95565 364093 169752 -60909 -86957 168421 399896 178600
15300D5171N5657K11005j3953a93082k6433C38035e196F5067h8944A45812a71204
$$ 45171 100828 311833 297880 -193082 -219515 338035 -5196 65067 -88944 145812 -171204
15288E2435l883K32015H5710K3385P733c70106A93330k3631k6406a75719A35410
$$ 52435 48552 280567 85710 109095 116828 -370106 193330 169699 143293 -175719 135410
15276a2320C7457d9363k1382D8932h97j19253q0402c8044k41307Q4543G2232B1398
$$ -12320 37457 -49363 -70745 48932 -897 -120150 -200552 -38044 -279351 -194808 72232 21398
15263A26853b22582B37146q4414C8475c3206B51a79641D02525b40818A89118I3333
$$ 126853 -222582 237146 152732 38475 -33206 251 -179641 402525 -240818 189118 93333
15251c48071a11754j05234F2307J7393l4979K69711i7953C94849A0816J84751
$$ -348071 -111754 -216988 62307 79700 44721 314432 -97953 394849 10816 195567
15241A95567O0603O8363p3853j4604L7356M67314P8832K83725j24548J23563j67015
$$ 195567 256170 324533 250680 236076 273432 740746 819578 1103303 978755 1102318 935303
15230I35303k81422j63746l2906B13486a67440B6988L96118a76436B16694G8089
$$ 935303 653881 490135 457229 213486 -167440 26988 423106 -176436 216694 78089
15219f4698A98543b19090E2045J80739m7243D373J82258C6825J93983j9306m7965
$$ -64698 198543 -219090 52045 232784 185541 4373 186631 36825 230808 211502 163537
15208A63537o4635L12178A43529Q5543K1725m6484J66528A24105E0364M9600L2988
$$ 163537 98902 411080 143529 229072 250797 204313 370841 124105 50364 99964 132952
15197A32952g309l1624j05464B58362D2126f4917G2345b1980A23305K6294a96455
$$ 132952 -7309 -38933 -144397 258362 42126 -64917 72345 -21980 123305 149599 -196455
15185A87741c93026C22399A25759a3570I0565j961d9838C6334J35957B8367a26283
$$ 187741 -393026 322399 125759 -13570 90565 88604 -49838 36334 172291 28367 -126283
15173g9370A72379f4695j30686A26385Q503a39982B69176d3722B30621H141b0982
$$ -79370 172379 -64695 -195381 126385 134888 -139982 269176 -43722 230621 8141 -20982
15161e8506B45327b86100B61768a2406G4184d2175D276a12000B37455a03153O00
$$ -58506 245327 -286100 261768 -12406 74184 -42175 4276 -112000 237455 -103153 -102553
15150a02553A20814N1656J03588a91673A38427f3531E8925I267e5355C71373B6016
$$ -102553 120814 172470 276058 -191673 138427 -63531 58925 9267 -55355 371373 26016
15138A2891L7778f6222C82842p5211J46179c7406I3207K83978A12865m6117h392
$$ 12891 50669 -66222 382842 307631 453810 -37406 93207 377185 112865 66748 -8392
15126B00893N5529o9282b3716B23994G2449P5628J89947A07182a1589B83079B5190
$$ 200893 256422 187140 -23716 223994 72449 148077 338024 107182 -11589 283079 25190
15114I4928J28377k5632f4335A80354M1264J64832A89084D4619K47745A11075
$$ 94928 223305 197673 -64335 180354 221618 386450 189084 44619 292364 111075
15103h0797D39876a33545A8594L094J59687G3680J26285J66209f7861B63656D2845
$$ -80797 439876 -133545 18594 21688 181375 73680 199965 366174 -67861 263656 42845
15091A84442D3427J30344K14369r0632k5562A0411O1820K1897a33864D08192a9732
$$ 184442 43427 173771 388140 297508 271946 10411 72231 94128 -133864 408192 -19732
15079a6677B08097H9049i7534A6526O3833K38985P5599j18510b13356B4268R1983
$$ -16677 208097 89049 -97534 16526 80359 319344 394943 276433 -213356 24268 116251
15068A16251n1917J54576L74116B04545b26166B89111o7561c6147D04000B01156
$$ 116251 64334 218910 593026 204545 -226166 289111 221550 -36147 404000 201156
15057g863A65972J20481j2038A8804L28158A6826M11038j14609A45702a23130
$$ -7863 165972 286453 274415 18804 346962 16826 427864 313255 145702 -123130
15046D19662B08620H7297r812l8721O3471C0328L07760K65287k46448j75008b85271
$$ 419662 208620 87297 77485 38764 102235 30328 338088 603375 356927 181919 -285271
15034B61799a29642B97916r8743G8264L00740R4088k36090L963p4814L22113C2773
$$ 261799 -129642 297916 199173 78264 379004 473092 237002 240965 166151 488264 32773
15022B94692D7875J08449M1453F5335L15589M5729A91708A5073K07747O4740q8502
$$ 294692 47875 156324 197777 65335 380924 426653 191708 15073 222820 287560 199058
15011A99058G5688M3700J20980J08862i2676C30664A45352K9839M8673k5413J28069
$$ 199058 75688 119388 240368 349230 -92676 330664 145352 175191 223864 198451 326520
15000C26520a3279F1868J04955K24101b1891C53254A65905l1715B7371K14719
$$ 326520 -13279 61868 166823 390924 -21891 353254 165905 134190 27371 242090
14990B42090j10397o425J23322l7161b54185A15943J13619K36007h2776B00724
$$ 242090 131693 125268 248590 211429 -254185 115943 229562 465569 -82776 200724
14979I8771J09650j4709g6026D21070B9219a17429B22381d8649G03066C18171
$$ 98771 208421 193712 -76026 421070 29219 -117429 222381 -48649 703066 318171
14968B69688G7879K86566J45925A64394M40566B96761L76257k20077k5884B04088
$$ 269688 77879 364445 510370 164394 604960 296761 673018 452941 427057 204088
14957F0143L85336j17091L4492j64125F8232J64756J24916o4733L14511l03146
$$ 60143 445479 328388 362880 198755 68232 232988 357904 293171 607682 304536
14947C04536A41624o1090J93019m0231k3561l0580M1096D6855J74278M01739o9846
$$ 304536 141624 80534 273553 233322 209761 179181 220277 46855 221133 622872 553026
14936E53026I4732P3840E176J62322N24722H4896K29523j10372P045J49019J28662
$$ 553026 94732 168572 5176 167498 692220 84896 314419 204047 211092 360111 488773
14925D88773B23811L4691m7713e0447C13893j44860N4020O1783r9266K42674o27
$$ 488773 223811 258502 210789 -50447 313893 169033 223053 284836 185570 428244 427617
14914D27617j05022d8001C59301l872k0547J28772o3057j43825O9421j07077J88803
$$ 427617 322595 -48001 359301 355429 334882 463654 400597 256772 326193 219116 407919
14903D07919k3151j5380M39165C76536o0755j11445N9582q5402J31091j53661
$$ 407919 384768 369388 808553 376536 315781 204336 263918 178516 309607 155946
14893A55946J5493J49561l7972k5950l7865L26343j40927j50925o3825P4312N0606
$$ 155946 171439 321000 283028 257078 219213 545556 404629 253704 189879 264191 314797
14882C14797J19702C9831K69890J77180k17451K47416j75775p4340K37577j88010
$$ 314797 434499 39831 309721 486901 269450 516866 341091 266751 504328 316318
14872C16318l9351K28710P4042k12954q1722O8747I0283K63174J6771j14359A17982
$$ 316318 276967 505677 579719 366765 285043 353790 90283 353457 370228 255869 117982
14860B77883J99794K43180l31981j06777A37004M37828K854p6959J19666j70265
$$ 277883 477677 720857 388876 282099 137004 574832 577686 500727 620393 450128
14850D50128J70650B42992K43209j82337L25210M4752m0898k8937B81058A35521
$$ 450128 620778 242992 486201 303864 629074 673826 632928 603991 281058 135521
14839C52252K46827j42305I6010K60434K00594k76774O21537m48043Q5671j51606
$$ 352252 599079 456774 96010 356444 557038 280264 901801 453758 539429 387823
14829C87823N113P9658j73757j7845M8467j06684K73849M0361j85451k493o5096
$$ 387823 392936 472594 298837 280992 329459 222775 496624 536985 351534 349041 283945
14818B83945o010J85857q3874J21387q3185N458J84173l5909A24586J39311K61302
$$ 283945 277935 463792 379918 501305 418120 423578 607751 571842 124586 263897 525199
14807E25199n5428Q1527j64333K65473j77697j33192J44550J15096J2684B16916
$$ 525199 469771 551298 386965 652438 474741 341549 486099 601195 613879 216916
14796B37247K68546B41847K8803K6171J95296j06969K31773D4108M65980l4827
$$ 237247 505793 241847 270650 296821 492117 385148 616921 44108 510088 475261
14786D75261A35052L39992o161j06005K67676M8790M0630k79294J70886k10525
$$ 475261 135052 475044 468883 362878 630554 679344 719974 440680 611566 401041
14776D01041M2550P0737N3639n7643m2671k22878K39929J40996L9622k50319M12479
$$ 401041 443591 514328 567967 510324 467653 244775 484704 625700 665322 415003 827482
14765H27482l44226l032j29507J87593N7225j24598P0147k67631L37739k38654
$$ 827482 483256 480224 350717 538310 595535 470937 541084 273453 611192 372538
14755C72538L42005p6855k39868M05845l54482K27279R0029k78909Q2245J42415
$$ 372538 714543 637688 397820 803665 449183 676462 766491 487582 569827 712242
14745G12242r0527B80353L03413N48064B23491M25640r8173o046M81502l73684
$$ 712242 621715 280353 583766 1131830 223491 649131 550958 544912 1026414 652730
14735F52730C05437L24636K08647l82448Q5415O1680m0283q669l685Q8159L63187
$$ 652730 305437 630073 838720 456272 541687 603367 563084 554415 550730 638889 1002076
14724A002076k24099J57930r5293L5331p9728J7093K3475J39275l10149q4433
$$ 1002076 777977 935907 840614 875945 796217 813310 836785 976060 665911 581478
14714E81478o0199M70837K75075m36540l44164R8600L5325M00086K79786o09907
$$ 581478 521279 992116 1267191 830651 486487 585087 620412 1020498 1300284 690377
14704F90377J17543l19163L45185J5976J30340R2474J05729j12501P2112l97161
$$ 690377 807920 488757 833942 849918 980258 1072732 1178461 1065960 1138072 740911
14694G40911j62988O70481l20184k9845q7636l2542R4219O95875p24316K52449
$$ 740911 577923 1248404 928220 898375 810739 778197 872416 1568291 843975 1096424
14684A096424j39955q0039j15783J68379k82998L0366M24531L1347j54052k76391
$$ 1096424 956469 876430 760647 929026 646028 676394 1100925 1132272 978220 701829
14674G01829K84652p781K6777l22446O47130M0604k98704L7205j54822J57240
$$ 701829 986481 978700 1005477 683031 1330161 1370765 1072061 1109266 954444 1111684
14664A111684j20999j64615M72287k2703j63744M1192j17216p088n272J45355
$$ 1111684 990685 826070 1298357 1275654 1111910 1153102 1035886 1028798 1023526 1168881
14654A168881k30085R5158k32259N75276k26795l4636n51352L56065O2560L79299
$$ 1168881 938796 1033954 801695 1376971 1150176 1115540 564188 920253 982813 1362112
14644A362112L9265n01161Q9708k29898N41081n4635j58671N0934L49874m21216
$$ 1362112 1401377 900216 989924 760026 1301107 1246472 1087801 1138735 1488609 1067393
14634A067393J39512K61K7561q2013K90899M2260k36231j09615k4070K54371P5431
$$ 1067393 1206905 1207166 1234727 1152714 1443613 1485873 1249642 1140027 1115957 1370328 1445759
14623A445759j84937j02185O5803p6737J44074L2621J19612k23087R8939M32842
$$ 1445759 1260822 1158637 1224440 1147703 1291777 1324398 1444010 1220923 1319862 1752704
14613A752704n79625j66181L03362K05867J54126r2989k49310R5747l9896J79353
$$ 1752704 1173079 1006898 1310260 1516127 1670253 1577264 1327954 1423701 1383805 1563158
14603A563158q417j62771K29715J71198k68564M0727K09437J41389o33161N53649
$$ 1563158 1554741 1391970 1621685 1792883 1524319 1565046 1774483 1915872 1282711 1836360
14593A836360k85161q9101J23232j5702M7365J43841r3639O3533r4642J61304
$$ 1836360 1551199 1462098 1585330 1569628 1616993 1760834 1667195 1730728 1636086 1797390
14583A797390j17600K15810k43175L08385l4910k17372L80288k12668P1843k38801
$$ 1797390 1679790 1895600 1652425 1960810 1925900 1708528 2088816 1876148 1947991 1709190
14573A709190K63047j5763j89853K64942K8239j94618m6809K82440L13558l79001
$$ 1709190 1972237 1956474 1766621 2031563 2059802 1865184 1818375 2100815 2414373 2035372
14563B035372p20K24186j06249l21879L70223P9061J55076J96537k27923Q9938
$$ 2035372 2034652 2258838 2152589 1830710 2200933 2279994 2435070 2631607 2403684 2493622
14553B493622J03473k88299K91960j15419K79422j14843P6943J34945M38431l070
$$ 2493622 2597095 2308796 2600756 2485337 2764759 2649916 2726859 2861804 3300235 3297165
14543C297165p027Q9941N35714Q0650L22071N64202P59313Q56495J413845K120124
$$ 3297165 3290138 3380079 3915793 3996443 4318514 4882716 5642029 6498524 7912369 10032493
14533A0032493M151515P078981R500102q08174j1757378o252892l758525k390894
$$ 10032493 14184008 21262989 30763091 29954917 18197539 11944647 8186122 5795228
14525E795228j402793r35233o4510l39970k87137m44450J16191L10331k29331
$$ 5795228 4392435 3457202 3392692 3052722 2765585 2321135 2437326 2747657 2518326
14516B518326K4975j46681j11001m9815L72690P5077k4968L3255J52996J8200
$$ 2518326 2543301 2396620 2285619 2235804 2608494 2683571 2658603 2691858 2844854 2863054
14506B863054l987k91190L29147j16605O6057j842j14687k20708N16727J2674
$$ 2863054 2859067 2567877 2897024 2780419 2846476 2844634 2729947 2509239 3025966 3038640
14496C038640O124J92256l12428J15709q1449N518k7333J47822K54601k31236
$$ 3038640 3044764 3237020 2924592 3040301 2958852 2964370 2937037 3084859 3339460 3108224
14486C108224j9431J35425K25101O3308j67134k46370L34844K32170k988l2186
$$ 3108224 3088793 3224218 3449319 3512627 3345493 3099123 3433967 3666137 3663149 3630963
14476C630963j03763K05100k15663L80571j8577M6286k19600P5828J36241m1238
$$ 3630963 3527200 3732300 3516637 3897208 3878631 3924917 3705317 3781145 3917386 3876148
14466C876148N385O7610J21646m78928P34599o7023K21664J13314j23883K60952
$$ 3876148 3881533 3949143 4070789 3591861 4326460 4259437 4481101 4594415 4470532 4731484
14456D731484m23390L84583K07913l25522J06729p4967K65784P1249J53970j99619
$$ 4731484 4308094 4692677 4900590 4575068 4681797 4606830 4872614 4943863 5097833 4898214
14446D898214L42244k02231j0917J02363K90309J8319j68175j46917M15221k614
$$ 4898214 5240458 5038227 5027310 5129673 5419982 5438301 5270126 5123209 5538430 5535816
14436E535816O9576J67236P6693n0162k4370J73976J75249P1497K17484k75031
$$ 5535816 5605392 5772628 5849321 5799159 5774789 5948765 6124014 6195511 6412995 6137964
14426F137964K40662M0487M3207J8887L19693l41516J97793K27011k3974N34946
$$ 6137964 6378626 6419113 6462320 6481207 6800900 6459384 6657177 6884188 6860214 7395160
14416G395160j83788L72355J87049k09679J4900N62M84583q8087J15256M58264
$$ 7395160 7211372 7583727 7770776 7561097 7575997 7576559 8061142 7973055 8088311 8546575
14406H546575J74968k69878K07508L0664J74178J91831j43928L41487K18003j52490
$$ 8546575 8721543 8451665 8659173 8689837 8864015 9055846 8911918 9253405 9471408 9318918
14396I318918L02670J31924J35274J9873K97221N5054K77910L49740k3478R9082
$$ 9318918 9621588 9753512 9888786 9908659 10205880 10260934 10538844 10888584 10865106 10964188
14386A0964188n2688O40158L8973K13405J69378J96230O875K46790M68315Q4762
$$ 10964188 10911500 11551658 11590631 11804036 11973414 12169644 12176519 12423309 12891624 12976386
14376A2976386K72409J47186L32818J53281K7602L02359N97244k11879K77853
$$ 12976386 13248795 13395981 13728799 13882080 13909682 14212041 14809285 14597406 14875259
14367A4875259J88297N58822O8769L52019L65282R9014M11040K33664N86469L61341
$$ 14875259 15063556 15622378 15691147 16043166 16408448 16507462 16918502 17152166 17738635 18099976
14357A8099976l5499L74461O70419O9699Q07878K44957L39752M47516M04462Q55776
$$ 18099976 18064477 18438938 19109357 19179056 19986934 20231891 20571643 21019159 21423621 22279397
14347B2279397N10540O7264P43013N66008K04557O35214N07233N00025Q62026
$$ 22279397 22789937 22857201 23600214 24166222 24370779 25005993 25513226 26013251 26875277
14338B6875277P45524O23050P36502O94449M58855J244445M90754P40590J152382
$$ 26875277 27620801 28243851 28980353 29674802 30133657 31378102 31868856 32609446 33761828
14329C3761828M71629R35412J147556J040045J021584P69912J245711J172758
$$ 33761828 34233457 35168869 36316425 37356470 38378054 39147966 40393677 41566435
14321D1566435J153164J517044J004283J385214J599676J472242J378392J557100
$$ 41566435 42719599 44236643 45240926 46626140 48225816 49698058 51076450 52633550
14313E2633550J630143J570420K005934J877869K288757J529571K423924K347860
$$ 52633550 54263693 55834113 57840047 59717916 62006673 63536244 65960168 68308028
14305F8308028K120118K915223K479776L135521K709134L151789K965547L672346
$$ 68308028 70428146 73343369 75823145 78958666 81667800 84819589 87785136 91457482
14297I1457482L849251L511713L877069M399969M487746M878489N048334N114122
$$ 91457482 95306733 98818446 102695515 107095484 111583230 116461719 121510053 126624175
14289A26624175N715970N683759N872838O956182O798126P311221P908317Q191737
$$ 126624175 132340145 138023904 143896742 150852924 157651050 164962271 172870588 181062325
14281A81062325Q447688R330340R756022R930863J0722585J1090589J1632040
$$ 181062325 189510013 198840353 208596375 218527238 229249823 240340412 251972452
14274B51972452J2075482J2888645J2941140J3664303J3942226J3683926J3946764
$$ 251972452 264047934 276936579 289877719 303542022 317484248 331168174 345114938
14267C45114938J3731226J3030091J2164375J1408926J0798559R748124R123189
$$ 345114938 358846164 371876255 384040630 395449556 406248115 415996239 425119428
14260D25119428P784173O902406O099188M210836K098323J735133j843216p159225
$$ 425119428 432903601 439806007 445905195 450116031 452214354 453949487 452106271 444947046
14252D44947046o533045o180214p010546r977538j0243906j0377200j1319899
$$ 444947046 438414001 432233787 425223241 415245703 405001797 394624597 383304698
14245C83304698j2250840j3540657j3441202j2498866j2752592j2661937j3019548
$$ 383304698 371053858 357513201 344071999 331573133 318820541 306158604 293139056
14238B93139056j2584002j2567383j2700453j1610188j0871689j0740389j0428730
$$ 293139056 280555054 267987671 255287218 243677030 232805341 222064952 211636222
14231B11636222r559857q993294q675779q811080q291924p862995p770763p331580
$$ 211636222 202076365 193083071 184407292 175596212 167304288 159441293 151670530 144338950
14223A44338950o277839o187364n959566n344654n246094m860773m165391m381475
$$ 144338950 138061111 131873747 125914181 120569527 115323433 110462660 106297269 101915794
14215A01915794m230264l494911l873445l701749l213897l098473l028095k719579
$$ 101915794 97685530 94190619 90317174 86615425 83401528 80303055 77274960 74555381
14207G4555381k461243k387989k427907k121796k332510k353925j669390k027357
$$ 74555381 72094138 69706149 67278242 65156446 62823936 60470011 58800621 56773264
14199E6773264j764331j327045j843919j569198j228990j593786j306635q80648
$$ 56773264 55008933 53681888 51837969 50268771 49039781 47445995 46139360 45258712
14191D5258712j126627j450002j248618j401416r55003p57692j128958j034151
$$ 45258712 44132085 42682083 41433465 40032049 39077046 38319354 37190396 36156245
14183C6156245q15997r43742p22654j178295q30030p10638p42594p09642n06817
$$ 36156245 35340248 34396506 33673852 32495557 31665527 30954889 30212295 29502653 28995836
14174B8995836q26168p76655q27608p06997m15073l87189p58541l08166m87648
$$ 28995836 28169668 27393013 26565405 25858408 25443335 25056146 24297605 23989439 23501791
14165B3501791l47597q71055k13803q38473J85347q32829l40587l35436l48847
$$ 23501791 23154194 22283139 22069336 21230863 21416210 20583381 20242794 19907358 19558511
14156A9558511n56602l45002j26285p31035k89631j71668l03829j21182o15996
$$ 19558511 19001909 18656907 18530622 17799587 17509956 17338288 17034459 16913277 16297281
14147A6297281l34419l50205j76402l09143L5467o32593k49344j06932n67761
$$ 16297281 15962862 15612657 15436255 15127112 15162579 14529986 14280642 14173710 13605949
14138A3605949J8183k00293k45164J2396n13310j65426k59548k27935m0378j03322
$$ 13605949 13624132 13423839 13178675 13191071 12677761 12512335 12252787 12024852 11984474 11881152
14128A1881152m45763j40549J31231l57410o2090l37050j37474k30822l59289
$$ 11881152 11435389 11294840 11426071 11068661 11006571 10669521 10532047 10301225 9941936
14119I941936L23370k72605k80961j80812k7671k8519l86290n4225k53537L23660
$$ 9941936 10265306 9992701 9711740 9530928 9503257 9474738 9088448 9034223 8780686 9104346
14109I104346l475j35664n69826R1190n4768k2705k19944j60072o6774l79013
$$ 9104346 9100871 8965207 8395381 8486571 8431803 8409098 8189154 8029082 7962308 7583295
14099G583295J65689k39251J13822p1055k23582r0717l06845r0208m5603J50286
$$ 7583295 7748984 7509733 7623555 7552500 7328918 7238201 6931356 6841148 6795545 6945831
14089F945831K05739l97216M1498l46107L36927o22197K38875n42555L09426K00630
$$ 6945831 7151570 6754354 6795852 6449745 6786672 6164475 6403350 5860795 6170221 6370851
14079F370851j71909n5832k77019K0229j87637N0232O1206m69831j28395L89419
$$ 6370851 6198942 6143110 5866091 5886320 5698683 5748915 5810121 5340290 5211895 5601314
14069E601314r6216j45271K3851j59662o0038j79578K56439k40086j16089Q8172
$$ 5601314 5505098 5359827 5383678 5224016 5163978 4984400 5240839 5000753 4884664 4972836
14059D972836j55302N0604J5664j26798j16956j51269J54268l05433J59153K21350
$$ 4972836 4817534 4868138 4883802 4757004 4640048 4488779 4643047 4337614 4496767 4718117
14049D718117l60076j18078K97493j98349J70388l13165Q8041r8321j2391Q3291
$$ 4718117 4358041 4239963 4537456 4339107 4509495 4196330 4284371 4186050 4173659 4256950
14039D256950l23740J22588J11412k55059J98184j88065j10066O067J03350m02407
$$ 4256950 3933210 4055798 4167210 3912151 4110335 3922270 3812204 3818271 3921621 3519214
14029C519214j99662M78439m74396M74115O8888k00107j28380n19139O12963l44194
$$ 3519214 3319552 3797991 3323595 3797710 3866598 3666491 3538111 3018972 3631935 3287741
14019C287741o0117o9295k9960K10529j48815J25633J45013n65553M16249j99416
$$ 3287741 3227624 3158329 3128369 3338898 3190083 3315716 3460729 2895176 3311425 3112009
14009C112009m703j67011l2767L77293m22541M6153J52696r6124k63477N1593
$$ 3112009 3107306 2940295 2907528 3284821 2862280 2908433 3061129 2965005 2701528 2753121
13999B753121k08696M51283k47566P8221l17085N25818j18478o62250j126K53978
$$ 2753121 2544425 2995708 2748142 2826363 2509278 3035096 2916618 2254368 2253242 2507220
13989B507220k44942M30066m54874N34456m15245J22673K01125R0820R4252k35689
$$ 2507220 2262278 2692344 2237470 2771926 2356681 2479354 2680479 2771299 2865551 2629862
13979B629862K39985K96595O19194L01156R28548J576194K939926O280018J0468052
$$ 2629862 2869847 3166442 3785636 4086792 5015340 6591534 9531460 15811478 26279530
13970B6279530L889146r332031o167453l722137k334245k056841q26922r06261
$$ 26279530 30168676 20836645 14669192 10947055 8612810 6555969 5729047 4822786
13962D822786n33993j75201n14497q6106K48935p34545R2957n98660J44738q9748
$$ 4822786 4288793 4113592 3599095 3512989 3761924 3027379 3120336 2521676 2666414 2576666
13952B576666r1773K58371m97667L73466l79084J20292Q8246j70113k09292R9117
$$ 2576666 2484893 2743264 2245597 2619063 2239979 2360271 2448517 2278404 2069112 2168229
13942B168229N0514j73008N60876p26104R7061L24933N5901m33135j8948R4909
$$ 2168229 2218743 2045735 2606611 1880507 1977568 2302501 2358402 1925267 1906319 2001228
13932B001228J08168M405K8379k13713K1079M4670l761J35983n00171K86372M82205
$$ 2001228 2109396 2113801 2142180 1928467 1949546 1994216 1990455 2126438 1626267 1912639 2394844
13921B394844k61581m22496M33938l38485K57251k92704k37333J71773J53019
$$ 2394844 2133263 1710767 2144705 1806220 2063471 1770767 1533434 1705207 1858226
13912A858226r7588n3415o184j82278K95799M1382j27283K0223j5001J44414k08484
$$ 1858226 1760638 1707223 1701039 1518761 1814560 1855942 1728659 1748882 1733881 1878295 1669811
13901A669811j89579L2298j52855L30596p8301M1725J92602Q3978k55014j79046
$$ 1669811 1480232 1512530 1359675 1690271 1611970 1653695 1846297 1930275 1675261 1496215
13891A496215k60329N09914k34254k2218L2803J18021N50149o00841J82099M1231
$$ 1496215 1235886 1745800 1511546 1489328 1522131 1640152 2190301 1589460 1771559 1812790
13881A812790m24837K54944k95239j78654K60059J71718p3045o5148N9377j72131
$$ 1812790 1387953 1642897 1347658 1169004 1429063 1600781 1527736 1462588 1521965 1349834
13871A349834J36195j60007j03914n2770n3352R6382L52750o321m06937K04319
$$ 1349834 1486029 1326022 1222108 1169338 1115986 1212368 1565118 1558797 1151860 1356179
13861A356179k33937o799M1841q0141M29602l33492K87262n54819N51115r7704
$$ 1356179 1122242 1115443 1157284 1077143 1506745 1173253 1460515 905696 1456811 1359107
13851A359107M8416l04493K78723k99950J32811r9997o9347Q0584j1284J77563
$$ 1359107 1407523 1103030 1381753 1081803 1214614 1114617 1045270 1125854 1114570 1292133
13841A292133m20672K68880J7309r9580l0686K42879l83424L69010k8156J9553
$$ 1292133 871461 1140341 1157650 1058070 1027384 1270263 886839 1255849 1227693 1247246
13831A247246j16644j41342K94479l55642Q6985J76867j77809K22140l6487l3217
$$ 1247246 1130602 989260 1283739 928097 1015082 1191949 1014140 1236280 1199793 1166576
13821A166576k23091k97818L89578l078K7888J24203j42564k04147K26070j97795
$$ 1166576 943485 645667 1035245 1032167 1060055 1184258 1041694 837547 1063617 865822
13811H65822m9426J09069L09162l64335K6513j26277L39142j65641M8155k71586
$$ 865822 816396 925465 1234627 870292 896805 770528 1109670 944029 992184 720598
13801G20598j17173K31808j9695r7920J3929M22309k93042l0502p8414L24961
$$ 720598 603425 835233 815538 717618 731547 1153856 860814 830312 751898 1076859
13791A076859M3497R261p1376j69823K3801l68771N30981k60650r6788M55013
$$ 1076859 1120356 1129617 1058241 888418 912219 543448 1074429 813779 716991 1172004
13781A172004j56646l94674K16888J2959q944M7862P0185J04067L6461E02994
$$ 1172004 1015358 620684 837572 850531 841587 889449 959634 1063701 1100162 502994
13770A076050k86613M6667K86490m94210L08119L0160j86044J62838J03839J67527
$$ 1076050 789437 836104 1122594 628384 936503 966663 780619 943457 1047296 1214823
13760A214823n28839K04228Q9907m06083K13717L0841k1268R6613J02493D64855
$$ 1214823 685984 890212 980119 574036 787753 818594 797326 893939 996432 464855
13749G70477k6494j08161j20441j4781j7929J90255J96089j75746K8737j99420
$$ 770477 743983 635822 515381 500600 482671 672926 869015 693269 722006 522586
13739E22586K64086P6340m09541j5153K66585K76390m66291K74652O8669j93853
$$ 522586 786672 863012 453471 438318 704903 981293 515002 789654 858323 664470
13729F64470k49637K22997k75584M37819k37711k9880K37312J31844m7521p6834
$$ 664470 414833 637830 362246 800065 562354 532474 769786 901630 854109 777275
13719G77275O9899k80424M3179m7056q3945K70405M4790J04561D14165K96203
$$ 777275 847174 566750 609929 562873 478928 749333 794123 898684 414165 710368
13709G10368q1944K65887l43702J55488j86529J62610j75261M7444j615J65902
$$ 710368 628424 894311 550609 706097 519568 682178 506917 554361 552746 718648
13699G18648B30663M44179k33827L31936k06892l6655J8091K1215R1949l06955
$$ 718648 230663 674842 441015 772951 566059 529404 547495 568710 660659 353704
13689C53704R5605K86582j17126r2924k44495N83586k25591J84901m2948C89373
$$ 353704 449309 735891 618765 525841 281346 864932 639341 824242 781294 389373
13678E48509j27227M71824k35474j40555N3910j19015J3928J93378n5236R498
$$ 548509 421282 893106 657632 517077 570987 451972 465900 659278 604042 613540
13668F13540K02365C70416L90291k39753J53085k92776N5249J83610K30986C13213
$$ 613540 815905 370416 760707 520954 674039 381263 436512 620122 851108 313213
13657F44735j51121N0560j29127J9722j11516k2469L14404B67874O1246M5638
$$ 644735 493614 544174 415047 434769 323253 300784 615188 267874 329120 374758
13647C74758J65400j91738J43245o7046J19576p4629j64894L09495B54926J07538
$$ 374758 540158 348420 491665 424619 544195 469566 304672 614167 254926 362464
13637C62464L4865O7084j17525K99759k7338J9854j25681j28380J01008k3584
$$ 362464 397329 464413 346888 646647 619309 639163 513482 385102 486110 462526
13627D62526M3355L4912B25271J59941n6052M53248C82023j16402K86916k31699
$$ 462526 505881 540793 225271 385212 329160 782408 382023 265621 552537 320838
13617C20838K79188L7471M9868j24912k29436L51130k81993K6258N6321A51175
$$ 320838 600026 637497 687365 562453 333017 684147 402154 428412 484733 151175
13606C94458J47986B42979J72536j10796M03465k37618j29488N9420j39468J64671
$$ 394458 542444 242979 415515 304719 708184 470566 341078 400498 261030 425701
13596D25701n4211K2911M44065C43916Q842K30422P3417A95902N4412J49844j92079
$$ 425701 371490 394401 838466 343916 352758 583180 656597 195902 250314 400158 208079
13585B08079J55465J35189j35029K01425k22931j29126R3637K3322o7245K6091
$$ 208079 363544 498733 363704 565129 342198 213072 306709 330031 262786 288877
13575B88877J73825Q5091A87390K73391a57879E65740k36740N3572O5604B06668
$$ 288877 462702 547793 187390 460781 -157879 565740 329000 382572 448176 206668
13564D85895j29026O4610k09448L0126J79565j91945O5856Q3350J50622B15965
$$ 485895 356869 421479 212031 242157 421722 229777 295633 378983 529605 215965
13553A72268J52962K32081B17463r630J51324A76710J00458k7248L36403B36499
$$ 172268 325230 557311 217463 207833 359157 176710 277168 249920 586323 236499
13542D94662L6274k09147M4950R1998A91194M8272P5483j27787J61811L2030n8456
$$ 494662 530936 321789 366739 458737 191194 239466 314949 187162 348973 381003 322547
13531C22547J97343h416C19975j00199J53368n8060j30975J79960J36331j36708
$$ 322547 519890 -8416 319975 219776 373144 315084 184109 364069 500400 363692
13521C63692r8271N65576A75433K78969P9646j89638p6950R6098O2989J24187
$$ 363692 265421 830997 175433 454402 534048 344410 267460 363558 426547 550734
13511E50734j66786A24434J13596a06977A29008J49236A11499L20185j05605K8106
$$ 550734 383948 124434 238030 -106977 129008 278244 111499 431684 326079 354185
13501C54185H7832B8076R5833K8584k3160O1678J80422M0890K24113A95466Q6131
$$ 354185 87832 28076 123909 152493 129333 191011 371433 412323 636436 195466 281597
13490B81597H7867L46907A40561J91951O3152j42275l1751A04141L65568j05502
$$ 281597 87867 434774 140561 332512 395664 253389 221638 104141 469709 364207
13480C64207j54543J9795K07384A03435C4532P9700m1835J93137A24243J97921
$$ 364207 209664 229459 436843 103435 34532 114232 72397 265534 124243 322164
13470C22164j46267K4561e956E75820A34870L9280l5534J68741m9095L9861K96623
$$ 322164 175897 200458 -5956 575820 134870 174150 138616 307357 258262 298123 594746
13459E94746k49952m1432L4976A38158J90141B4705M43266J04012j69921A71455
$$ 594746 344794 303362 338338 138158 328299 24705 467971 571983 402062 171455
13448C86730q2977J0758k1578p4522q1081K90130A9266K13897m1026H9705J75901
$$ 386730 303753 314511 292933 218411 137330 427460 19266 233163 192137 89705 265606
13437B65606A19297Q4019L94597k98306J2435K0898r5340I6499O766J36503H5514
$$ 265606 119297 203316 597913 299607 312042 332940 237600 96499 103265 239768 85514
13425E23554B20310G3489J34341L10048B15136K37833j35096C3083L23553l7868
$$ 523554 220310 73489 207830 517878 215136 452969 317873 33083 356636 318768
13415C18768j2660H4228C0182L83539l1274j28584L28459j51180A85073M561J56959
$$ 318768 306108 84228 30182 413721 382447 253863 582322 431142 185073 189634 346593
13404C46593j68385M8591K40385j26475D7948a3394B80783J08462j27192L6235
$$ 346593 178208 226799 467184 340709 47948 -13394 280783 389245 262053 298288
13394B98288J91300c3404E04204A35547M72963A84995a1926A96897K2413K13376
$$ 298288 489588 -33404 504204 135547 608510 184995 -11926 196897 219310 432686
13384D32686k1617H5047Q3101J44140j9073j4934J02418J52108j98442D1865Q3766
$$ 432686 411069 85047 168148 312288 293215 278281 380699 532807 334365 41865 125631
13373A25631i7632I9354N3975K30975j40495a58586E0338J84139p1048E8754J30895
$$ 125631 -97632 99354 153329 384304 243809 -158586 50338 234477 163429 58754 189649
13362A89649Q2337E3127J43525K05408p0735k1628n6619p7996K4675K3105R1400
$$ 189649 271986 53127 196652 402060 331325 309697 253078 175082 199757 222862 314262
13351C14262P0105o5625A52355J2992M9912o6245J62609E5642M00431j95397K98324
$$ 314262 384367 318742 152355 165347 215259 149014 311623 55642 456073 260676 559000
13340E59000k68115N64890B72442K6762A04798J13526J34243O4750A66033K35881
$$ 559000 290885 855775 272442 299204 104798 218324 352567 417317 166033 401914
13330D01914A30562L11732B16285D187K53689J1759g0772D05938A11057K47022
$$ 401914 130562 442294 216285 4187 257876 269635 -70772 405938 111057 358079
13320C58079j48865F410K41712a8457C24882R6004m9224k7524J35950j52380F9033
$$ 358079 209214 6410 248122 -18457 324882 420886 371662 344138 480088 327708 69033
13308A21529N6162H7258B1901K26281P2061A52363J83373A54829a6727F1539J93489
$$ 121529 177691 87258 21901 248182 320243 152363 335736 154829 -16727 61539 255028
13297B55028J29645A10112c451B37609A5775Q2336a62318k8532g5260o5918B4758
$$ 255028 384673 110112 -3451 237609 15775 98111 -162318 -190850 -75260 -141178 24758
13285B36818L9361J20934j26620c4326A06886C7348R1368c9092G0684J83816a49019
$$ 236818 276179 397113 270493 -34326 106886 37348 128716 -39092 70684 254500 -149019
13273a52618A98436i0603C36526j61415J61028r4077B3569K76583G7279i8691
$$ -152618 198436 -90603 336526 175111 336139 242062 23569 300152 77279 -98691
13262A51996J03374l3157a48359D23666A05553K83053a61098f3710A67629a28438
$$ 151996 255370 222213 -148359 423666 105553 388606 -161098 -63710 167629 -128438
13251b6481j38640A59718f5696A50612m7006g3890B79761r1555J64539I8536K57564
$$ -26481 -165121 159718 -65696 150612 103606 -73890 279761 188206 352745 98536 356100
13240C56100j10395p4682f558o2215D56844D2910J85871A7215g5656C88585j15196
$$ 356100 245705 171023 -6558 -68773 456844 42910 228781 17215 -75656 388585 273389
13229B73389a33327A64234l5363A9800L02608j45145K11500F3027J11383J58689
$$ 273389 -133327 164234 128871 19800 322408 177263 388763 63027 174410 333099
13219C33099n9504F464K96188O1087A50530M0659f5843B25468F8549B3449J12054
$$ 333099 273595 6464 302652 363739 150530 191189 -65843 225468 68549 23449 135503
13208A35503F3989a19478K4930A38637N2444D1077J28526J97480r4594F6092J90360
$$ 135503 63989 -119478 -94548 138637 191081 41077 169603 367083 272489 66092 256452
13197B56452H5454c734k2690H0134J17779G3181B2893i7931B39364o3011n5659
$$ 256452 85454 -3734 -26424 80134 197913 73181 22893 -97931 239364 176353 120694
13186A20694e05670H320c4727B29440n3418c01264A28019M1845O643P6869d0897
$$ 120694 -505670 8320 -34727 229440 176022 -301264 128019 169864 176507 253376 -40897
13174B72533A627Q2611h2809B8887K8348J11903J20049J42333k01770A9208O1841
$$ 272533 1627 84238 -82809 28887 57235 169138 289187 431520 229750 19208 81049
13163H1049K07729M0631b1609B41644c825j95668B93440f6916B73157H2132L90627
$$ 81049 288778 329409 -21609 241644 -3825 -199493 293440 -66916 273157 82132 472759
13152D72759j98331q8773K3385b2130B34725h4655C54401A39619B0697J05338
$$ 472759 274428 185655 209040 -22130 234725 -84655 354401 139619 20697 126035
13142A26035o0128Q088J13383J31962C709R3442J42677n1634B2027J6704R423
$$ 126035 65907 73995 187378 319340 3709 97151 239828 188194 22027 38731 48154
13131D8154Q3554a86709O3212A37561P1143A9971c14237D480J73272q466G2137
$$ 48154 131708 -186709 -123497 137561 208704 19971 -314237 4480 177752 169286 72137
13119B27319l0972A6558J42453n7938J38377B8627J26400L2237h0872r6874A9539
$$ 227319 196347 16558 159011 101073 239450 28627 155027 187264 -80872 -177746 19539
13107f3088G0371J10888a94388D0903m950K21456h5919b3244B22688g626I8880
$$ -63088 70371 181259 -194388 40903 35953 257409 -85919 -23244 222688 -7626 98880
13095B30994a2306l549p6681D04136d7262f825k31349H661e5667B51600D138M06978
$$ 230994 -12306 -15855 -92536 404136 -47262 -6825 -238174 8661 -55667 251600 4138 411116
13083D11116c5959B15480j4066K87180E6492L39341b82771F8888M2739a30559
$$ 411116 -35959 215480 201414 488594 56492 395833 -282771 68888 111627 -130559
13072A24943b2553E2770A5023J88504M3542G1132l502h8638c4809F6260a22513
$$ 124943 -22553 52770 15023 203527 247069 71132 67630 -88638 -34809 66260 -122513
13060d4492l48555B72340l9548i2717H6316J87664q3647c21491A67985J42392
$$ -44492 -393047 272340 232792 -92717 86316 273980 190333 -321491 167985 310377
13050C10377B3199J23673j8304o2054c2287a2225A73172a88276I8168B0122J63431
$$ 310377 23199 146872 128568 66514 -32287 -12225 173172 -188276 98168 20122 183553
13039A83553F4352i4624j47190A7425J56709R61c301B73000A11267a07976B48981
$$ 183553 64352 -94624 -241814 17425 174134 175095 -3301 273000 111267 -107976 248981
13027C99857A42514A7748c3297C5157L24868A00982a91405I8680N1856J1103b1846
$$ 399857 142514 17748 -33297 35157 360025 100982 -191405 98680 150536 161639 -21846
13015B17566q5067a04514H2339a7339A04443L84295r3219A85517H9842l3510K6675
$$ 217566 132499 -104514 82339 -17339 104443 488738 395519 185517 89842 56332 83007
13004H3007B8814J24973c27A58111b661A36865l9942Q3258d9082k76528J28214
$$ 83007 28814 153787 -327 158111 -2661 136865 96923 180181 -49082 -325610 -197396
12993a97396A32930i6748C21632j59444L7395b9439A12901K26112p2781a42193
$$ -197396 132930 -96748 321632 162188 199583 -29439 112901 339013 266232 -142193
12982g88k26305A18690c2024A6553d3909C1152L5083g4554C08499J5915E0297
$$ -788 -227093 118690 -32024 16553 -43909 31152 66235 -74554 308499 324414 50297
12970C3330J36325n7450J67412b4274A62663b6266A03027a1458q9118b6272k26954
$$ 33330 169655 112205 279617 -24274 162663 -26266 103027 -11458 -100576 -26272 -253226
12959b53226A65169b09402A87905K1371a49761H8716K15547A18282J92431K0865
$$ -253226 165169 -209402 187905 209276 -149761 88716 304263 118282 310713 331578
12949C31578g1634E0255K25497A02094J10086a47193f3542I9954j9123N7860g2297
$$ 331578 -71634 50255 275752 102094 212180 -147193 -63542 99954 80831 138691 -72297
12937a56597l4582j33782A39735O3821a32429j3749O7919b9071A64475G9894R322
$$ -156597 -191179 -324961 139735 203556 -132429 -146178 -78259 -29071 164475 79894 89216
12926H9216D2635a83881B31952h1044B84201i6873C85145A29592J90700i1937
$$ 89216 42635 -183881 231952 -81044 284201 -96873 385145 129592 320292 -91937
12915B35309D0502c20902i4057A54092Q0081a03794B63994E8845a67691E1392
$$ 235309 40502 -320902 -94057 154092 234173 -103794 263994 58845 -167691 51392
12904a3511j5723j13573A38126K72754j99047A02157a4443j5164B66285O0574
$$ -13511 -29234 -142807 138126 410880 211833 102157 -14443 -29607 266285 326859
12894C26859g3483E6794c0342C85708a78454F1672k9316J26339e7695k1936D45675
$$ 326859 -73483 56794 -30342 385708 -178454 61672 32356 158695 -57695 -79631 445675
12882A94338o6130a90718n4373A32901M3626c85167B26567j09280M9139a25353
$$ 194338 128208 -190718 -245091 132901 176527 -385167 226567 117287 166426 -125353
12871D9049J57517P5685c22663J33652e8320B74857D4285e3793A82631K90220
$$ 49049 206566 282251 -322663 -189011 -58320 274857 44285 -53793 182631 472851
12861D72851a75662K6164e2388j1317B61103c44822D9357a34354A53718E7012
$$ 472851 -175662 -149498 -52388 -63705 261103 -344822 49357 -134354 153718 57012
12850G1980a58847C869e3703A90651J25407F8374K52884a77576A56011J4027M5307
$$ 71980 -158847 3869 -53703 190651 316058 68374 321258 -177576 156011 170038 215345
12839B15345a08140A10872J6244F0590N5765A9381g2761l8958i695A57521J9927
$$ 215345 -108140 110872 127116 60590 116355 19381 -72761 -111719 -9695 157521 177448
12828A77448a9598j78474F2279K5483a16589A36189b4674I8276k6822K73575G4172
$$ 177448 -19598 -198072 62279 87762 -116589 136189 -24674 98276 71454 345029 74172
12816A10048c5131j13275C82768j81308a07783A85087a81853d3060A30558b24535
$$ 110048 -35131 -148406 382768 201460 -107783 185087 -181853 -43060 130558 -224535
12805A72291e683C10344j07062a83382A76817d3368H8523J33064J36683a76510
$$ 172291 -5683 310344 203282 -183382 176817 -43368 88523 221587 358270 -176510
12794A96435f1675A4830K23281B6948J24501D9416b44637E6628a39020C97777
$$ 196435 -61675 14830 238111 26948 151449 49416 -244637 56628 -139020 397777
12783b7306m7883j64165A13832D94M0485K10395h0750I0778M9583g2213k18451
$$ -27306 -75189 -239354 113832 494 40979 251374 -80750 90778 140361 -72213 -290664
12772b90664i3964C0781M6266R342g0902d323B82721a64851A91234g2079F1732
$$ -290664 -93964 30781 77047 86389 -70902 -4323 282721 -164851 191234 -72079 61732
12760B4278e1835k43020A24810g6933C667P3641c5086D1706K33391B906M1380
$$ 24278 -51835 -294855 124810 -76933 3667 77308 -35086 41706 275097 2906 44286
12749D4286i039B26726e0489b4834j39995I0645J08959a56536c4378A06225K77753
$$ 44286 -9039 226726 -50489 -24834 -164829 90645 199604 -156536 -34378 106225 383978
12738C83978j55373a49000f542j24027A28751P3031F6119r223d7630p959I4952
$$ 383978 228605 -149000 -6542 -130569 128751 201782 66119 56896 -47630 -55589 94952
12726a31405C10207K2549r1906n9651L18170A75866a07474A37665b3330A61176
$$ -131405 310207 332756 240850 181199 499369 175866 -107474 137665 -23330 161176
12715C44719a31576A46279f1309b2731M073A27684a9692E0788b05223A12001b81995
$$ 344719 -131576 146279 -61309 -22731 -18658 127684 -19692 50788 -205223 112001 -281995
12703A33111a34022A37170A7692e37000a36598A19857f7124A3140b46103A962
$$ 133111 -134022 137170 17692 -537000 -136598 119857 -67124 13140 -246103 1962
12692h8989D35943a73121C21216G6357K14677i2365D56385b7798A72835G4784
$$ -88989 435943 -173121 321216 76357 291034 -92365 456385 -27798 172835 74784
12681d2268B3898R2733l6145K54892a09201J6517M0694A65040m0730N0826m0719
$$ -42268 23898 116631 80486 335378 -109201 -92684 -51990 165040 124310 175136 134417
12670A34417B3276b03279o7987B12898a4042j15908C48184j40276n3194C4160
$$ 134417 23276 -203279 -271266 212898 -14042 -129950 348184 207908 154714 34160
12659b45439D79508a10037m0232A43600j4303l4535K69465b3189j61708k0747
$$ -245439 479508 -110037 -150269 143600 129297 94762 364227 -23189 -184897 -205644
12649b05644C63901b9074A85185M0597J58911l6057p4174h2145A65613F2000K19282
$$ -205644 363901 -29074 185185 225782 384693 348636 274462 -82145 165613 62000 281282
12638B81282L21261a62497C83083E5900J28743k9067R0780b0782p8131I2747g2077
$$ 281282 602543 -162497 383083 55900 184643 155576 246356 -20782 -98913 92747 -72077
12626c8984A27699f1323A03237J0253n4450J8883h2042J7155F025K43239J1150
$$ -38984 127699 -61323 103237 113490 59040 77923 -82042 -64887 6025 249264 260414
12615B60414J25072p5071A40971L92792P2920h9644j39845C84252j39176D7364
$$ 260414 385486 310415 140971 533763 606683 -89644 -229489 384252 245076 47364
12604C00841j02980F785M66055A1673L11797D5493a74632D03236g3741A89110
$$ 300841 197861 6785 472840 11673 323470 45493 -174632 403236 -73741 189110
12593a35096B24958L7457b57429O4606a4124I8350a1097A99552K14045a58354
$$ -135096 224958 262415 -257429 -192823 -14124 98350 -11097 199552 413597 -158354
12582H7884J74245l6236k554G2432k4347h5182D99909A71925a88204m4747j38325
$$ 87884 262129 225893 223339 72432 48085 -85182 499909 171925 -188204 -232951 -371276
12571c71276a76865k02851J86158F5473N3577a66536D5247b00582j3397B6026
$$ -371276 -176865 -379716 -193558 65473 119050 -166536 45247 -200582 -213979 26026
12560a00430D9499J03840b73167A00417e2505A4576J9014R8312m9185M35a70645
$$ -100430 49499 153339 -273167 100417 -52505 14576 33590 131902 82717 83152 -170645
12548A4350K47125b5564A48156b40628a04669m7498j2329H3178d5154G6948a21342
$$ 14350 261475 -25564 148156 -240628 -104669 -152167 -164496 83178 -45154 76948 -121342
12536B22920a77607G3921c827B44903A08523B2717d04222H4585J45774g0852o3561
$$ 222920 -177607 73921 -3827 244903 108523 22717 -404222 84585 230359 -70852 -134413
12525a34413K2661B30148H1846b74455a22502e5175B00473L1941q3150L9846c40671
$$ -134413 -111752 230148 81846 -274455 -122502 -55175 200473 232414 149264 189110 -340671
12513C38708a30221e0353A57873G3364a93129I8398a45596K5680A10681a68906
$$ 338708 -130221 -50353 157873 73364 -193129 98398 -145596 -119916 110681 -168906
12502B6379b97354c1054j21192N5829d5704C78544a45058C13536a39065O7018
$$ 26379 -297354 -31054 -152246 -96417 -45704 378544 -145058 313536 -139065 -72047
12492g2047K5603j8600b2721k8240C72380A37084a91004F4785N1172a79006A95801
$$ -72047 -46444 -65044 -22721 -50961 372380 137084 -191004 64785 115957 -179006 195801
12480f5682C5263L968b24757a01765K4976B02567h9261A9707K0846a37256r5851
$$ -65682 35263 39231 -224757 -101765 -76789 202567 -89261 19707 40553 -137256 -233107
12469b33107c3913n7808m8479M3018D64666A52408B5242K5634K21968h3523B46807
$$ -233107 -33913 -91721 -140200 -97182 464666 152408 25242 50876 272844 -83523 246807
12457D8270a39691D6272b0807j12074k92745B51668q8282p4962j8118a68892B22463
$$ 48270 -139691 46272 -20807 -132881 -425626 251668 163386 88424 70306 -168892 222463
12445D9607J22874K389i666k43497E5078d606A44600J59367M9179B6558a1634
$$ 49607 172481 174870 -9666 -253163 55078 -4606 144600 303967 353146 26558 -11634
12433d6416D5733g720B06445a93521c0144A62063a64290B47510a79236J838I4823
$$ -46416 45733 -7720 206445 -193521 -30144 162063 -164290 247510 -179236 -177398 94823
12421a01354C32391c94541a0362C86043c3016j69956I6299a52856C38372A4439
$$ -101354 332391 -394541 -10362 386043 -33016 -202972 96299 -152856 338372 14439
12410C204M4225a65199A89949G8373j580J16553b48560A4711a17613A14229K51015
$$ 3204 47429 -165199 189949 78373 76793 193346 -248560 14711 -117613 114229 365244
12399C65244d0570A30242e4026g1p4362B25088p5649L7869b85773A68803e9948
$$ 365244 -40570 130242 -54026 -71 -74433 225088 149439 187308 -285773 168803 -59948
12387a6412o2324j19974A5720J31922J27968H4706e0115k21920a1862A26809a15948
$$ -16412 -78736 -198710 15720 147642 275610 84706 -50115 -272035 -11862 126809 -115948
12375A35828A4147J0000O5621a36184B5510i3101A7161g7867K1669G4388J34958
$$ 135828 14147 24147 89768 -136184 25510 -93101 17161 -77867 -56198 74388 209346
12364B09346m9977J60419A17264j4563a71264d694l6823k27151B24253b07988
$$ 209346 159369 319788 117264 102701 -171264 -4694 -41517 -268668 224253 -207988
12353B08643E8826A4584P859K19856I4862B5019d4682G627a57693A61678K2989
$$ 208643 58826 14584 22443 242299 94862 25019 -44682 7627 -157693 161678 184667
12342A84667n5705D6044a45947D4187g4998B18885a38684G3419a2611B09194a38876
$$ 184667 128962 46044 -145947 44187 -74998 218885 -138684 73419 -12611 209194 -138876
12330A65468a78791A65255b65690J3349A81485D9378J33223J46413c1780o2406
$$ 165468 -178791 165255 -265690 -252341 181485 49378 182601 329014 -31780 -94186
12320i4186j94241p6681B58307a34165k03048C40655b04198A66118b84322i1386
$$ -94186 -288427 -365108 258307 -134165 -337213 340655 -204198 166118 -284322 -91386
12309d6717j19201O7781C9427K67343A21633H715a0880A61244a68935A65166C5974
$$ -46717 -165918 -98137 39427 306770 121633 8715 -10880 161244 -168935 165166 35974
12297A17154P6318J54210F0613g1480B2796a20030j21028B6239g8591l8956c169
$$ 117154 193472 347682 60613 -71480 22796 -120030 -241058 26239 -78591 -117547 -3169
12285b68381B12340F101R6249l4329a45736o288f0496C62752C647a34875B34549
$$ -268381 212340 6101 102350 68021 -145736 -152024 -60496 362752 3647 -134875 234549
12273A92848a14193j22789A95749D8061a57412b9137P357k1571h167q338j6512
$$ 192848 -114193 -236982 195749 48061 -157412 -29137 -21780 -43351 -8167 -16505 -33017
12262c3017o9781B75416E1656J08070B3055e4746G6786a51448B43781O1736j00095
$$ -33017 -102798 275416 51656 159726 23055 -54746 76786 -151448 243781 305517 205422
12251B05422c82853B3717O1906J88221j30542o7379J6117b15236A30561m8779
$$ 205422 -382853 23717 85623 273844 143302 75923 92040 -215236 130561 81782
12241H1782k6979a5978A96990C6999f1615B96253c9849D87316a23079B86590a47296
$$ 81782 54803 -15978 196990 36999 -61615 296253 -39849 487316 -123079 286590 -147296
12229A32385a38800A58895n8482b01241E7827J14983B344J40687l2872J25970
$$ 132385 -138800 158895 100413 -201241 57827 172810 2344 143031 110159 236129
12219B36129e5593A62316J14215K3605c57548C71980A13911J95461D2729L17700
$$ 236129 -55593 162316 276531 300136 -357548 371980 113911 309372 42729 360429
12209C60429e4330C02541j3723f9495C7840j6861K85771H8483K3987K45193A11318
$$ 360429 -54330 302541 288818 -69495 37840 20979 306750 88483 112470 357663 111318
12197A18674C5245P1685i5485D8089J30741n6050a68549C05728p9141n3780i5286
$$ 118674 35245 106930 -95485 48089 178830 122780 -168549 305728 226587 172807 -95286
12185a23860j31625A85380Q5277G8736K6649K72372A69854b81065A36281q508
$$ -123860 -255485 185380 270657 78736 105385 377757 169854 -281065 136281 127773
12175A27773L37439H3251J49796M8238a4474B21272O8954d4135p5916A96473H6909
$$ 127773 465212 83251 233047 281285 -14474 221272 290226 -44135 -120051 196473 86909
12163D3990J7954K08806q1069d0047k11798C84190j41434L4013K12961A57976
$$ 43990 61944 270750 189681 -40047 -251845 384190 242756 276769 489730 157976
12152F3728B6933K67261c4820F2281g2500J7853A30412g202B56870g2C37542a91889
$$ 63728 26933 294194 -34820 62281 -72500 -54647 130412 -7202 256870 -72 337542 -191889
12139a08137q2776l9025J12835k15661d3541j7333A10469b9196j02603D5347J70251
$$ -108137 -190913 -229938 -117103 -332764 -43541 -60874 110469 -29196 -131799 45347 215598
12128B15598L4542p6379e8071B93353o9841A5478h9754j14092K4915I9392k2969
$$ 215598 250140 173761 -58071 293353 223512 15478 -89754 -203846 -178931 99392 76423
12117G6423L74134B00635b7456B77952j6296N4648q0300F4474K40956h1488b2580
$$ 76423 450557 200635 -27456 277952 261656 316304 236004 64474 305430 -81488 -22580
12105A27407E5168a79341B39652a78557A4729J93921f7518j52648H4931J90877
$$ 127407 55168 -179341 239652 -178557 14729 208650 -67518 -220166 84931 275808
12095B75808q5753i7285A94028a35186n422C838i2768A42376j3128o0773g6367
$$ 275808 190055 -97285 194028 -135186 -140608 3838 -92768 142376 129248 68475 -76367
12083g1006k3917B98339H4539i0254B06320r8362L5668J80794A0125M598c3003
$$ -71006 -94923 298339 84539 -90254 206320 107958 143626 324420 10125 14723 -33003
12071B1943a46816M0296o7977J067b4289E66649d022B62979a68554B77659j07662
$$ 21943 -146816 -106520 -174497 -173430 -24289 566649 -4022 262979 -168554 277659 169997
12060A69997B716K30637E3203M34728k4269O34684C31515K31201A10356h083A7646
$$ 169997 2716 233353 53203 487931 463662 1098346 331515 562716 110356 -8083 17646
12048F2231B3158R3259j1034K2956k4191c4665k7001m9289A9119J54386E3267
$$ 62231 23158 116417 105383 128339 104148 -34665 -61666 -110955 19119 173505 53267
12036A05730d12361J73075g3635m4071D6534b64817I2607c06357E8605c35126
$$ 105730 -412361 -239286 -73635 -117706 46534 -264817 92607 -306357 58605 -335126
12025b85316B32329a33039A02451B2208J50432b68435a06389m361N3445l28385
$$ -285316 232329 -133039 102451 22208 172640 -268435 -106389 -110750 -57305 -385690
12015c85690B42802q2930b23334B19507A0833N550b0465r0991A03176L1299b95044
$$ -385690 242802 159872 -223334 219507 10833 16383 -20465 -111456 103176 134475 -295044
12003B5300K62549P1634q6432a65940I8559d9774C5491h1507A18653d17801h6472
$$ 25300 287849 359483 273051 -165940 98559 -49774 35491 -81507 118653 -417801 -86472
11991b56463F8503B9486b11766B8928L26063L8517A13511C9786i7740A04512A0784
$$ -256463 68503 29486 -211766 28928 354991 393508 113511 39786 -97740 104512 10784
11979C6965K16439c48968a33571L1294l11030e2262C7428b08061c7659B09157
$$ 36965 253404 -348968 -133571 -102277 -413307 -52262 37428 -208061 -37659 209157
11968A32922J7708l63J50295b1542k31144f0811J82k07694A9254N3028e4924A21763
$$ 132922 150630 150267 300562 -21542 -252686 -60811 -60629 -268323 19254 72282 -54924 121763
11955b60198g6360m1856r7839E5945b4155A23588a40948A27193l9591a36201A62887
$$ -260198 -76360 -118216 -216055 55945 -24155 123588 -140948 127193 87602 -136201 162887
11943B12358C3736a43279b0530j63310b5332A08668a11839E6553J00739n8626
$$ 212358 33736 -143279 -20530 -183840 -25332 108668 -111839 56553 157292 98666
11933I8666a36077D01946a50452A2755P4723J63939B0125a52469B16205j4947
$$ 98666 -136077 401946 -150452 12755 87478 251417 20125 -152469 216205 201258
11923B01258a08678C5648D199J05417b30396f9557E7207J10912b12389j07060
$$ 201258 -108678 35648 4199 109616 -230396 -69557 57207 168119 -212389 -319449
11913c19449A19641m6641A9239b40770I331b58135B48214p3190b46501J05218
$$ -319449 119641 73000 19239 -240770 9331 -258135 248214 175024 -246501 -141283
11903a41283A04732a30170f0700m25782A83142c87355I4366L7945J25550F9368
$$ -141283 104732 -130170 -60700 -486482 183142 -387355 94366 132311 257861 69368
11892E0037a39962k88459B05764j4397H5907N5564b60363j7057H6662i6757I3676
$$ 50037 -139962 -428421 205764 191367 85907 141471 -260363 -277420 86662 -96757 93676
11880a89858A05815a81546f7449C15656b64792r3338B53242d2444B83896d991
$$ -189858 105815 -181546 -67449 315656 -264792 -358130 253242 -42444 283896 -4991
11869A32452a1954j0963j66512N0018A14297b2041D7042J96798I6455l3246a63289
$$ 132452 -11954 -22917 -189429 -139411 114297 -22041 47042 243840 96455 63209 -163289
11857E1289b5574k0316B80089b82754A07223j0431a19734C29475a3063j65411
$$ 51289 -25574 -45890 280089 -282754 107223 96792 -119734 329475 -13063 -178474
11847a78474P8319a16j49921j29417o8363G8319J06529o101F696B770f8026r9584
$$ -178474 -100155 -116 -150037 -279454 -347817 78319 184848 178747 6696 2770 -68026 -167610
11835a67610M5720M5706o795E3994M16c8416A08469b66933k45800b18366j69303
$$ -167610 -121890 -76184 -82979 53994 54410 -38416 108469 -266933 -512733 -218366 -387669
11824c87669a18866d512k34083B5343J27722a31574A29016l2448J4483D6019b15586
$$ -387669 -118866 -4512 -238595 25343 153065 -131574 129016 96568 111051 46019 -215586
11812a56908a0033m7893A95994a8627p4143B9380a85597D2219K55961a50598A8473
$$ -156908 -10033 -57926 195994 -18627 -92770 29380 -185597 42219 298180 -150598 18473
11800a32j11483D2202J69382f572F4310O0438J8602a19946q859B22240b9827C0619
$$ -132 -111615 42202 211584 -6572 64310 124748 143350 -119946 -128805 222240 -29827 30619
11787b04032A59443J53460c1026l59546a1751k1616F8236b42522A37022B5150
$$ -204032 159443 312903 -31026 -390572 -11751 -33367 68236 -242522 137022 25150
11776A67222E8312a30660A65574b59514B38020a38855A00040M9694f1997J0617
$$ 167222 58312 -130660 165574 -259514 238020 -138855 100040 149734 -61997 -51380
11766e1380B21113a640C01718A0841a2435k27480a3550C27958h8937c7810a7538
$$ -51380 221113 -1640 301718 10841 -12435 -239915 -13550 327958 -88937 -37810 -17538
11754h3380B7911b43728A6363o119a47456b2212D681L8315J02164E7564N6341
$$ -83380 27911 -243728 16363 10244 -147456 -22212 4681 42996 145160 57564 113905
11743A13905J08978a40079K8537C44h2400l03160c5153D1885K4684c3031C28674
$$ 113905 222883 -140079 -111542 344 -82400 -385560 -35153 41885 66569 -33031 328674
11731G6193K59848A18003N0851G7323j6573l0097h7681B75452A36898d3111C5370
$$ 76193 336041 118003 168854 77323 60750 30653 -87681 275452 136898 -43111 35370
11719a37970D64070j79809h3944A43237F4500L70614c82549J74501j3959C2666
$$ -137970 464070 284261 -83944 143237 64500 435114 -382549 -208048 -222007 32666
11708a27347A8941J20299b86795M2043J10979a0964m11752B6724k645J09072f8240
$$ -127347 18941 139240 -286795 -244752 -133773 -10964 -422716 26724 24079 133151 -68240
11696A34120b08160F5447a38514A08380A536h3582j4249L0454j86881P3074H0911
$$ 134120 -208160 65447 -138514 108380 1536 -83582 -97831 -67377 -254258 -181184 80911
11684A04318L5192A9693c1088J1216n6845j35520A70563J01307D7563j3461l95
$$ 104318 139510 19693 -31088 -19872 -76717 -212237 170563 271870 47563 34102 33707
11673C3707b37098A45004F5970M1698f1453p462l01606a847j33145A31136E8208
$$ 33707 -237098 145004 65970 107668 -61453 -68915 -370521 -1847 -134992 131136 58208
11661i3017B16768H1996L4394a98958H628J61723K7723a20186q1307A323J07866
$$ -93017 216768 81996 116390 -198958 8628 170351 198074 -120186 -201493 1323 109189
11650A09189d3205A9391J02176C9888N362a87570B97310a1191k37465a13241A69243
$$ 109189 -43205 19391 121567 39888 45250 -187570 297310 -11191 -248656 -113241 169243
11638C00257D4754j9616i3185p8123e2883k08934A86625h4466A36038M5504b24492
$$ 300257 44754 25138 -93185 -171308 -52883 -261817 186625 -84466 136038 181542 -224492
11626A01146b14629E4103j4159f0931j9235j51882j46052g2883a396I5345M0822
$$ 101146 -214629 54103 39944 -60931 -80166 -232048 -378100 -72883 -1396 95345 136167
11615A36167B3883b52812a23209j2395E6797R4426b51889C1084b21619D627J1028
$$ 136167 23883 -252812 -123209 -135604 56797 151223 -251889 31084 -221619 4627 15655
11604A5655h894I9519B3492J8156J11353J95915e0231Q780E3236K03643a91002
$$ 15655 -8894 99519 23492 41648 153001 348916 -50231 -41451 53236 256879 -191002
11592D1721e355C5818c1201l12895C01520b45038G4089K05997a37249A19038M6344
$$ 41721 -5355 35818 -31201 -344096 301520 -245038 74089 280086 -137249 119038 165382
11581A65382h0262A47556a40374L0026I2864J43861D0062J00522F0135K11988
$$ 165382 -80262 147556 -140374 -110348 92864 236725 40062 140584 60135 272123
11571B72123A31384C6950K90696b6575C01150f8462n2734A51816L3567Q5969A17669
$$ 272123 131384 36950 327646 -26575 301150 -68462 -121196 151816 185383 271352 117669
11559b80299A75720a23330H5197d0913B26700h061E409K83377F1989a5688A15275
$$ -280299 175720 -123330 85197 -40913 226700 -8061 5409 288786 61989 -15688 115275
11547a88728n1563i179j24035A03239b48416A46298a23506H4821b1159B2808h9142
$$ -188728 -240291 -9179 -133214 103239 -248416 146298 -123506 84821 -21159 22808 -89142
11535G9025O7830J20438A12493B8468J98245c6817A73599p4263a41156M9117B37518
$$ 79025 146855 267293 112493 28468 226713 -36817 173599 99336 -141156 -92039 237518
11523A3924b5732C4254J58406p2723J38290d926k8202A49884L51450k06307p3003
$$ 13924 -25732 34254 192660 119937 258227 -4926 -33128 149884 501334 295027 222024
11512B22024A08626P97K22317A02465C4984a93579A16024O8456k8557D3900a05155
$$ 222024 108626 109423 331740 102465 34984 -193579 116024 184480 155923 43900 -105155
11500B7533J93196B0324a12872A61978J4273b11300c2082J517C14054b3152A75
$$ 27533 220729 20324 -112872 161978 176251 -211300 -32082 -30565 314054 -23152 175
11488F8107L28668b74419D1791a39569I3094m4802b57257A37188J35671E6231
$$ 68107 396775 -274419 41791 -139569 93094 48292 -257257 137188 272859 56231
11477d9991B28071a14887B0288M6475J81480q0966h6672C01945h9791A67096J99469
$$ -49991 228071 -114887 20288 66763 248243 167277 -86672 301945 -89791 167096 366565
11466C66565k7642d9395I243L70963L9163d2619B86500c67880D4704b27356E7820
$$ 366565 338923 -49395 9243 380206 419369 -42619 286500 -367880 44704 -227356 57820
11454C5115K25780m3576b17q9201A69772J1703b6698B53149b1419k2901C95322
$$ 35115 260895 217319 -217 -89418 169772 181475 -26698 253149 -21419 -44320 395322
11442C9128K44278D5147c9152p0998A88509b4886A26820k2914d6723C44256I7305
$$ 39128 283406 45147 -39152 -110150 188509 -24886 126820 103906 -46723 344256 97305
11430F1420N8435a26057M2978A71200l5931c8686A43379F9622e6396N046B22521
$$ 61420 119855 -126057 -83079 171200 135269 -38686 143379 69622 -56396 -51350 222521
11418A88438K19966A0530N432a17758B1908a21686K1250l7235h284r151k2362
$$ 188438 408404 10530 15962 -117758 21908 -121686 -100436 -137671 -8284 -17435 -39797
11407c9797D4375a45914B29390d75683e1042E3181b86013L0954c1180I654J53922
$$ -39797 44375 -145914 229390 -475683 -51042 53181 -286013 -255059 -31180 9654 163576
11396A63576k1490J22996a14115D80631D8965b445A49024F5210a4982j10039A9042
$$ 163576 142086 265082 -114115 480631 48965 -2445 149024 65210 -14982 -125021 19042
11384A33841a47220A83056a29159o986I2698J20550b54959d243l19229A0606a05708
$$ 133841 -147220 183056 -129159 -136145 92698 213248 -254959 -4243 -323472 10606 -105708
11372a33114B77080b81458a12680j46174N6927B70178B9461f1752G5641C0126
$$ -133114 277080 -281458 -112680 -258854 -201927 270178 29461 -61752 75641 30126
11361a9421F7048b50716A22207K7000O7766r0410D2189g9162b7812B77129c28473
$$ -19421 67048 -250716 122207 149207 216973 126563 42189 -79162 -27812 277129 -328473
11349B13302b34650i5819E19551f134A59093o0282m6261g4576j36727A27239B3380
$$ 213302 -234650 -95819 519551 -6134 159093 98811 52550 -74576 -211303 127239 23380
11337A6781f5562B13a24477A54812J32017c23960D0479a55619J5504j5627A0254
$$ 16781 -65562 213 -124477 154812 286829 -323960 40479 -155619 -140115 -155742 10254
11325b58407h1805j73077C10613A07527k9107a8699I3760a57928M3918B69901
$$ -258407 -81805 -254882 310613 107527 78420 -18699 93760 -157928 -114010 269901
11314a73052a5672j81033j04774K5386h932k3060A11077E986c8592I8844A9731
$$ -173052 -15672 -196705 -301479 -276093 -8932 -31992 111077 5986 -38592 98844 19731
11302c5829M464j17663H0466c9943m22776K26208A45064n1811A373J08547a64753
$$ -35829 -31365 -149028 80466 -39943 -462719 -236511 145064 93253 1373 109920 -164753
11290H3864b49323N9498f5958A89661f0288n364q0045G5488d24952A87315a26843
$$ 83864 -249323 -189825 -65958 189661 -60288 -65652 -145697 75488 -424952 187315 -126843
11278b40001l3973a30651I2801b20786b0740F0339h1151A102i0639a3040l6423
$$ -240001 -273974 -130651 92801 -220786 -20740 60339 -81151 1102 -90639 -13040 -49463
11267d9463k5730a905j19003n6129A15439a95850f7899B41910b02099C8973J88569
$$ -49463 -75193 -1905 -120908 -177037 115439 -195850 -67899 241910 -202099 38973 227542
11256B27542J06088p1485c12072b5092j01301A06832D519J78403c22288j77036
$$ 227542 333630 262145 -312072 -25092 -126393 106832 4519 182922 -322288 -499324
11246d99324D6794f2290G4312B9497a3548A07758b51120A13361b34673f7805j5532
$$ -499324 46794 -62290 74312 29497 -13548 107758 -251120 113361 -234673 -67805 -83337
11235h3337J0885b4855B19764a66332A9036M6797f6534p4647O4129j1253k55992
$$ -83337 -72452 -24855 219764 -166332 19036 65833 -66534 -141181 -77052 -88305 -344297
11224c44297K4444a31416C2369l646a25625j44496J29452G6101a53465j4040m0475
$$ -344297 -319853 -131416 32369 28723 -125625 -270121 -140669 76101 -153465 -167505 -207980
11213b07980f200E2189J67288c7118j75695e9092A0873Q3591b07786j90583C2189
$$ -207980 -6200 52189 219477 -37118 -212813 -59092 10873 94464 -207786 -398369 32189
11201b4668B9466M9873b2977A82303C4590a6351A37973a08192j6931j75817h1889
$$ -24668 29466 79339 -22977 182303 34590 -16351 137973 -108192 -125123 -300940 -81889
11189A74499a21413N7702l6122B04526E9209j4421e9990j26231A80573J25943
$$ 174499 -121413 -63711 -99833 204526 59209 44788 -59990 -186221 180573 306516
11179C06516F2682c23693Q3028j8594B7256b6831j90727A22936d1185j95340M8319
$$ 306516 62682 -323693 -240665 -259259 27256 -26831 -217558 122936 -41185 -236525 -188206
11168a88206a3540a897l10138h4670B811b50284B0720f4355G4427a48097o0555
$$ -188206 -13540 -1897 -312035 -84670 2811 -250284 20720 -64355 74427 -148097 -208652
11157b08652A19975a46669A9801c2043A01145a8251L407B40044c6055p1999C0738
$$ -208652 119975 -146669 19801 -32043 101145 -18251 -14844 240044 -36055 -108054 30738
11145A75278K83475F4404N5040J38895a1612k52519D5287R1956a30720I2676a979
$$ 175278 458753 64404 119444 258339 -11612 -264131 45287 137243 -130720 92676 -1979
11133f5783A15363b3064A2491P0940a02344q3194B23706n4628J43700f8264A83824
$$ -65783 115363 -23064 12491 83431 -102344 -185538 223706 169078 312778 -68264 183824
11121a55932O7286A32573l6019J07746N14958D797f844p8195A2661O018b29012
$$ -155932 -88646 132573 96554 204300 719258 4797 -6844 -85039 12661 18679 -229012
11109a20929n9302A06944e0267l75917E1092J5763L5736B1647b26576E8888a36492
$$ -120929 -180231 106944 -50267 -426184 51092 66855 102591 21647 -226576 58888 -136492
11097a69553G561a14155F6409K1454B2177M80648A51882a69364A61218C1193J44456
$$ -169553 7561 -114155 66409 87863 22177 502825 151882 -169364 161218 31193 175649
11086A75649K39330J33435g4977B84730J04217h3672a0164A40003J71602h4093
$$ 175649 414979 548414 -74977 284730 388947 -83672 -10164 140003 311605 -84093
11075B00234P5213L541F4446b6364D17946j19671K02585j73419j53415P8588P4709
$$ 200234 275447 278988 64446 -26364 417946 298275 500860 327441 174026 252614 327323
11064C27323e3169A47763j2257J73202A44731F7342R4189O6359K29750j56235
$$ 327323 -53169 147763 135506 308708 144731 67342 161531 227890 457640 301405
11054C01405n3270J45657j60910j9026A4023M65346j02598A41566J58527A30882
$$ 301405 248135 393792 232882 213856 14023 479369 376771 141566 300093 130882
11043D87360L2932L0204N2061N9097B50780L22306n1825J76826k41580L67727
$$ 487360 520292 550496 602557 661654 250780 573086 521261 698087 456507 824234
11033H24234J32275D72619k9833J73989J40099k73972K89844m8314k49100O297
$$ 824234 956509 472619 442786 616775 756874 482902 772746 724432 475332 481629
11023D81629K24961q7142J61691k0273k65036j78134O41287j32050k57869L99614
$$ 481629 706590 619448 781139 760866 495830 317696 958983 826933 569064 968678
11013I68678j75603l14538J11279P370j41705L11190n2373N0191k23082J00185
$$ 968678 793075 478537 589816 597186 455481 766671 714298 764489 541407 641592
11003F41592J45403l04364Q2379A89454M71643j40553J81327K19444l68135P0108
$$ 641592 786995 482631 565010 189454 661097 520544 701871 921315 553180 623288
10993F23288j24682N39411m40377O2186N7414J35295k80727K38424k93184j12185
$$ 623288 498606 1038017 597640 659826 717240 852535 571808 810232 517048 404863
10983D04863J3789K54636O7188J4355j64126k42803O02387D33665K79962j60047
$$ 404863 418652 673288 740476 754831 590705 347902 950289 433665 713627 553580
10973E53580N04283l93854L81580l22629J0014K12269J45108J30427q5362L81087
$$ 553580 1057863 664009 1045589 722960 732974 945243 1090351 1220778 1135416 1516503
10963A516503m6725J12311J58900J36919M86477j08707O1626J38190k5693k15127
$$ 1516503 1469778 1582089 1740989 1877908 2364385 2255678 2317304 2455494 2429801 2214674
10953B214674q4444m2051m89702K67117n96885r0732J74029M06632l50558k22900
$$ 2214674 2130230 2088179 1598477 1865594 1268709 1177977 1352006 1758638 1408080 1185180
10943A185180j00955J70659j825j06037k14947K00325l38289k48216P2867K27524
$$ 1185180 1084225 1254884 1253059 1147022 932075 1132400 794111 545895 618762 846286
10933H46286l24890j1696j42005M9458E4439O41828B97975P9282b41125C10405
$$ 846286 521396 509700 367695 417153 54439 696267 297975 377257 -241125 310405
10922B66859a45538b1275k5147C12164j5615a33609d6304A31275K40207b73865
$$ 266859 -145538 -21275 -46422 312164 296549 -133609 -46304 131275 371482 -273865
10911a28884B65703a41026A73910h9277D0217M8318a54250j89288C1701N5151
$$ -128884 265703 -141026 173910 -89277 40217 88535 -154250 -343538 31701 86852
10901H6852l4202K69248c5166j18066H9382e2862L478B08978c0717J522j82452
$$ 86852 52650 321898 -35166 -153232 89382 -52862 -49384 208978 -30717 -29195 -211647
10890b11647f6220J963a0839j65805K198h2104k12505i9648M4917d891A44745
$$ -211647 -66220 -64257 -10839 -176644 -174446 -82104 -294609 -99648 -54731 -4891 144745
10878B71005a22353M5828L5250F7339Q2748j0157D9946O8233J06654A09058J45566
$$ 271005 -122353 -76525 -41275 67339 150087 139930 49946 118179 224833 109058 254624
10867B54624a63412b6496A28869h5046B8131i0944B04253k6232c681C16858i4440
$$ 254624 -163412 -26496 128869 -85046 28131 -90944 204253 178021 -3681 316858 -94440
10855B05585A8567h3532a6559B537d4822j92318h6568k5403A58642F6614b40037
$$ 205585 18567 -83532 -16559 2537 -44822 -237140 -86568 -111971 158642 66614 -240037
10843B2208b58545c0636j34687A57602c87715H0593h136A22815e445j44146q9951
$$ 22208 -258545 -30636 -165323 157602 -387715 80593 -8136 122815 -5445 -149591 -239542
10832b39542a2317k23099R8690L9337K1000F0424b51329b8476r5818l1204k5470
$$ -239542 -12317 -235416 -136726 -97389 -76389 60424 -251329 -28476 -124294 -155498 -180968
10821a80968R0160A67795c86038C4767c9362k54653b5868j16100E0416c22125
$$ -180968 -90808 167795 -386038 34767 -39362 -294015 -25868 -141968 50416 -322125
10810f9753D3961R0042b19846A72031f9186k19315g3995B0094a95875i6905q287
$$ -69753 43961 134003 -219846 172031 -69186 -288501 -73995 20094 -195875 -96905 -105192
10799a05192A81839Q6402a68165H7053m471g4833l53669H597K16851G1792h9868
$$ -105192 181839 268241 -168165 87053 82582 -74833 -428502 8597 225448 71792 -89868
10787A96052h6647l08682b2423A1280J18348a47253D65095b14575B51139B5740
$$ 196052 -86647 -395329 -22423 11280 129628 -147253 465095 -214575 251139 25740
10776a7732N475G1397J28364h2377a258o6619I7437a13731c7965k3193j5061F686
$$ -17732 -12257 71397 199761 -82377 -1258 -67877 97437 -113731 -37965 -61158 -76219 6686
10763c33408A11487C0429Q609Q7906a29308b1577K704j23708A26484a17359M6150
$$ -333408 111487 30429 39038 126944 -129308 -21577 -18873 -142581 126484 -117359 -71209
10752g1209A86301b90811A67879C9553Q5894g2307E1727h4917k13499C1719J08292
$$ -71209 186301 -290811 167879 39553 125447 -72307 51727 -84917 -298416 31719 140011
10741A40011R2945D9213N0391a04642a193j8285I5804b02037E2715J2766i759
$$ 140011 232956 49213 99604 -104642 -1193 -19478 95804 -202037 52715 65481 -9759
10729b39717L2527C5424h1300j01467j8641A1237e26460a93866E8418a05744p8175
$$ -239717 -207190 35424 -81300 -182767 -201408 11237 -526460 -193866 58418 -105744 -183919
10718a83919A10826b89560G4179K27283j36436K74939C2982p732d7648R267j36879
$$ -183919 110826 -289560 74179 301462 165026 439965 32982 25250 -47648 -38381 -175260
10707a75260M5757m3505Q2740A81069c62606A17972d8245p2267B12176h1488q8919
$$ -175260 -129503 -173008 -90268 181069 -362606 117972 -48245 -120512 212176 -81488 -170407
10696a70407B50668A20610l4403c28426J26163h5949D2779c18166D8584L18047
$$ -170407 250668 120610 86207 -328426 -202263 -85949 42779 -318166 48584 366631
10686C66631a5872C44919F6750c16833i5512C8274a94382O2365B7830a99066j67904
$$ 366631 -15872 344919 66750 -316833 -95512 38274 -194382 -132017 27830 -199066 -366970
10675c66970I7612G194d3652m7574c7380j70717g9754K028F6865D692d6763A85268
$$ -366970 97612 7194 -43652 -91226 -37380 -208097 -79754 -77726 66865 4692 -46763 185268
10662a39617l6683E9751A8477J0313e05327a11794B93504d5015k03027J15633
$$ -139617 -176300 59751 18477 28790 -505327 -111794 293504 -45015 -248042 -132409
10652a32409k14617b1665R043l70396B21114c25629A62511E843J42256D8671b05899
$$ -132409 -347026 -21665 -12622 -383018 221114 -325629 162511 5843 148099 48671 -205899
10640H2164C7109b7960A1426a55155p9077A2410M9506R24j9844J12934a03915
$$ 82164 37109 -27960 11426 -155155 -234232 12410 61916 62840 42996 155930 -103915
10628a26295j16238M6644f404D6332e2843A55065d5127k58024b6009A0806c82402
$$ -126295 -242533 -195889 -6404 46332 -52843 155065 -45127 -303151 -26009 10806 -382402
10616b46249B98157O4991I4645f4689j57797J07528m5453F1011a94355L4019P8471
$$ -246249 298157 363148 94645 -64689 -222486 -114958 -160411 61011 -194355 -160336 -81865
10605h1865H596c19376B30935f8243h893C9684b8674E3031c69047h8548M809A74699
$$ -81865 8596 -319376 230935 -68243 -8893 39684 -28674 53031 -369047 -88548 -83739 174699
10592A47520E9612J62880c56370d233k374l14368J32471B60402b33052Q6538A1625
$$ 147520 59612 222492 -356370 -4233 -6607 -320975 -188504 260402 -233052 -146514 11625
10580E9986L9838m1036J43035b17812j6736C27398g1855d02C4100d0022j42350
$$ 59986 99824 58788 201823 -217812 -234548 327398 -71855 -402 34100 -40022 -182372
10569a82372d1100j15683A2375a5578l78751A65107f2273j99276f0034b0167k81798
$$ -182372 -41100 -156783 12375 -15578 -394329 165107 -62273 -261549 -60034 -20167 -301965
10558c01965a2436B6473h5434F8523O8306n7401B8701I010d14045c3559j92735
$$ -301965 -12436 26473 -85434 68523 136829 79428 28701 9010 -414045 -33559 -226294
10547b26294e1008k18298J7291H3572p525l1691b48732d3111r6224B0887J50732
$$ -226294 -51008 -269306 -252015 83572 76047 44356 -248732 -43111 -139335 20887 171619
10536A71619k435a83943d1930k50793A40993b50784A69313n1685e0927C32808
$$ 171619 169184 -183943 -41930 -292723 140993 -250784 169313 117628 -50927 332808
10525a16657M7380A28019b74219B30780A988d419j85879R0875n9310h126B2338
$$ -116657 -69277 128019 -274219 230780 1988 -4419 -190298 -99423 -158733 -8126 22338
10513b29934B15458a97646f0323r4053B18629C2762b7221l1834j57465D56685
$$ -229934 215458 -197646 -60323 -154376 218629 32762 -27221 -59055 -216520 456685
10502a02514B4765c6718h547A68934e5809B19111E499f0345p897J0321A70792
$$ -102514 24765 -36718 -8547 168934 -55809 219111 5499 -60345 -68242 -57921 170792
10490F8246g5373k7062J5263B09299H3707a69570P4370A64919a82035h9224c452
$$ 68246 -75373 -102435 -87172 209299 83707 -169570 -95200 164919 -182035 -89224 -3452
10478a99104j77779j49098a45752C78110a66262c1973j91828d6041A16987K40458
$$ -199104 -376883 -525981 -145752 378110 -166262 -31973 -223801 -46041 116987 357445
10468C57445F1674b37286D02331j1594M3685j40480c45280B47689A625b93824
$$ 357445 61674 -237286 402331 390737 434422 293942 -345280 247689 1625 -293824
10457F3776J40320a28861M0423p226E2827n193b8209A51096b02355b2436j10082
$$ 63776 204096 -128861 -88438 -95664 52827 47634 -28209 151096 -202355 -22436 -132518
10446a32518j3911d8056A331J18792b27154m2168j2101B9149J53124G5119K93176
$$ -132518 -146429 -48056 1331 120123 -227154 -269322 -281423 29149 182273 75119 368295
10435C68295I7545a12610B58908b02369K9820M8322B09285O2485A05687D5764
$$ 368295 97545 -112610 258908 -202369 -172549 -124227 209285 271770 105687 45764
10424b23743B6864K84399a20121A54984p6786J08580f29943c6192D5639j1457
$$ -223743 26864 311263 -120121 154984 78198 186778 -629943 -36192 45639 34182
10414C4182a92805D94831g6423m3041C7687P7324J76312A7897M4902P7950R4056
$$ 34182 -192805 494831 -76423 -119464 37687 115011 291323 17897 62799 140749 234805
10403B34805b40467a09621p5338o338B37132b8748r8985c3230D29795c7737H7870
$$ 234805 -240467 -109621 -184959 -191297 237132 -28748 -127733 -33230 429795 -37737 87870
10391E8491j941b88610A03226j8362L9757k3207a6394r7240A62612b761B0817
$$ 58491 56550 -288610 103226 84864 124621 101414 -16394 -113634 162612 -2761 20817
10379B80614M8033E0316e0535p001A12998J16835A5374K44104C9023g378D9131
$$ 280614 328647 50316 -50535 -57536 112998 229833 15374 259478 39023 -7378 49131
10367C85445c5569D921J65885K4003L8785j02499Q3037j2290m1068k3287J03959
$$ 385445 -35569 4921 170806 194809 233594 131095 214132 201842 160774 137487 241446
10356B41446q4808J23954A33227J14236M4478L36595j74713q9257A17270O6211
$$ 241446 156638 280592 133227 247463 291941 628536 453823 364566 117270 183481
10346A83481J08227n3723J24145A68476L15139A85755n9513O0764J44871h0839
$$ 183481 291708 237985 362130 168476 483615 185755 126242 187006 331877 -80839
10335D97921j15566L46248B38691Q919K10771e2013B44300J70346A89187R0817
$$ 497921 382355 728603 238691 247610 458381 -52013 244300 414646 189187 280004
10325B80004O8819i0119B40074P6271A01138a2951m0453A95369q1730R6322m1444
$$ 280004 348823 -90119 240074 316345 101138 -12951 -53404 195369 113639 209961 168517
10314A68517p4493h2005m3104e6024L0I620L8777J41900f3610j18307d0969B3538
$$ 168517 94024 -82005 -125109 -56024 -55994 9620 48397 190297 -63610 -181917 -40969 23538
10301D3264J46751q142b1829B84022b0522A09631a76797H8210g3243A53985b4476
$$ 43264 190015 181873 -21829 284022 -20522 109631 -176797 88210 -73243 153985 -24476
10289e17889B9190a03548K8320H0127d20391a18173c5588j11240k40576a1252
$$ -517889 29190 -103548 -75228 80127 -420391 -118173 -35588 -146828 -387404 -11252
10278B166J46331d10744g031p1073L6704o9866A8836c07936a39900N2472C04125
$$ 2166 148497 -410744 -7031 -78104 -41400 -111266 18836 -307936 -139900 -87428 304125
10266b43266D225f3500j82117i895k368p7597K5385j2219j07844k2766D2282D860
$$ -243266 4225 -63500 -245617 -9895 -12263 -89860 -64475 -76694 -184538 -207304 42282 4860
10253i6218c2967G4895B588f5943o575A73790p3320n46J33346C9500K21972A23156
$$ -96218 -32967 74895 2588 -65943 -72518 173790 100470 99924 233270 39500 261472 123156
10240A48493J18906j31406l4614J19804b85076A45690a52569g2126B50182o2668
$$ 148493 267399 135993 101379 221183 -285076 145690 -152569 -72126 250182 187514
10230A87514b7496B6613K5453g5219j02106F1685c18747J16207A52781n3069R5586
$$ 187514 -27496 26613 52066 -75219 -177325 61685 -318747 -202540 152781 99712 195298
10219A95298c25200J41884o4068L4329L6295c0461A83355b26536q7637a6953H4396
$$ 195298 -325200 -183316 -247384 -213055 -176760 -30461 183355 -226536 -314173 -16953 84396
10207E8011b3831A35173h7801l3218k31852B8977K30989a89825M2027b6631B65443
$$ 58011 -23831 135173 -87801 -121019 -352871 28977 259966 -189825 -147798 -26631 265443
10195a87215F8886M35485B49599c5438A04182Q0758a88963e1650q4716N2704m3421
$$ -187215 68886 504371 249599 -35438 104182 184940 -188963 -51650 -136366 -83662 -127083
10184a27083A14409h7696B27688C0432a95510A8324K2999a14398F2883d510q4674
$$ -127083 114409 -87696 227688 30432 -195510 18324 41323 -114398 62883 -4510 -89184
10173h9184a3979j09600G6421e023p6652j65173e4808k17959b1618E0382b55881
$$ -89184 -13979 -123579 76421 -5023 -81675 -246848 -54808 -272767 -21618 50382 -255881
10161a28132a4328A10238J15654J17704C3929L15350D215g1844A28680g3710j16443
$$ -128132 -14328 110238 225892 343596 33929 349279 4215 -71844 128680 -73710 -190153
10150a90153c0210j43558c9682l4183c3676j51583j2124O0290e893k55383A99223
$$ -190153 -30210 -173768 -39682 -73865 -33676 -185259 -197383 -137093 -5893 -261276 199223
10138A93026H9998c7799H9287J48814G5852k1441a27162G3451b40080P9319E1345
$$ 193026 89998 -37799 89287 238101 75852 54411 -127162 73451 -240080 -160761 51345
10126A8840a25769r3976o0056G7467C2969i4090B8031g3313b6096k60898g3739
$$ 18840 -125769 -219745 -279801 77467 32969 -94090 28031 -73313 -26096 -286994 -73739
10114d20995j25658K10523A13701h9839H8584k9190g8963G1188c84178A24199
$$ -420995 -546653 -336130 113701 -89839 88584 59394 -78963 71188 -384178 124199
10103b9116k93311A01520J63405A10716e15651a37422d2165J6136q5199a5655
$$ -29116 -322427 101520 264925 110716 -515651 -137422 -42165 -26029 -111228 -15655
10092A96912b14274n8813p569d7466E0338O5608a32815j33686i1662b177r3205
$$ 196912 -214274 -273087 -280656 -47466 50338 115946 -132815 -266501 -91662 -2177 -95382
10081i5382o2023C13375a20131H9471b10003H7833d8917e312l50890o119A52790
$$ -95382 -157405 313375 -120131 89471 -210003 87833 -48917 -5312 -356202 -362321 152790
10069h2222I4714a85178L2335B79988A25589b30442l4882E5423a10321Q631E0776
$$ -82222 94714 -185178 -152843 279988 125589 -230442 -265324 55423 -110321 -101690 50776
10057g9196J5562J1134B42039c86264A62808E1935j1732a7900j50687C0628b1524
$$ -79196 -63634 -52500 242039 -386264 162808 51935 40203 -17900 -168587 30628 -21524
10045e0013G483a34435k79509Q7310a2048A09013J9753K9058e9450B26482h0876
$$ -50013 7483 -134435 -413944 -326634 -12048 109013 128766 157824 -59450 226482 -80876
10033A21319k1455m0838J84780d3807j64970N5919J7720N7484h096C8450K0289
$$ 121319 99864 59026 243806 -43807 -208777 -152858 -135138 -77654 -8096 38450 58739
10022E8739b62783k5993j34474B30609a84768A7257C64L5398b09966R3143a1281
$$ 58739 -262783 -288776 -423250 230609 -184768 17257 364 35762 -209966 -116823 -11281
10010e9049j31318b9138j22244C61999c29l72119A24551m9469a93575Q18J405
$$ -59049 -190367 -29138 -151382 361999 -329 -372448 124551 75082 -193575 -192757 -191352
9999a91352N4351A04162b03408j9136j13191k5336c5833j64518B42955h0723B77503
$$ -191352 -137001 104162 -203408 -222544 -335735 -361071 -35833 -200351 242955 -80723 277503
9987B38379b67816I7773i6695C7162a63879H1648J07535b05995D2316f7365k75991
$$ 238379 -267816 97773 -96695 37162 -163879 81648 189183 -205995 42316 -67365 -343356
9976c43356L2542c2268q7268k1983D7159d40338F3425b53335r5832F2432a3948
$$ -343356 -310814 -32268 -119536 -141519 47159 -440338 63425 -253335 -349167 62432 -13948
9964C1649J78248a38072c6046A78016h4791H0690a40315A57531n176a95136b1226
$$ 31649 209897 -138072 -36046 178016 -84791 80690 -140315 157531 152355 -195136 -21226
9952b01160F1012b75840D5562A2872h9665j24173f2835k97550a05049C3146a34530
$$ -201160 61012 -275840 45562 12872 -89665 -213838 -62835 -360385 -105049 33146 -134530
9940c20602a51847f6299J314a0418H2162a79624D3993a56021A0946b29475e9017
$$ -320602 -151847 -66299 -64985 -10418 82162 -179624 43993 -156021 10946 -229475 -59017
9928b22805l6390L3454E2223b43298E129b02392P1154k43296D129a38127q6308
$$ -222805 -259195 -225741 52223 -243298 5129 -202392 -131238 -374534 4129 -138127 -224435
9917b24435A16930a7070j96589A41359a49490A93004E2398b79017B9226f5907
$$ -224435 116930 -17070 -213659 141359 -149490 193004 52398 -279017 29226 -65907
9906a9090E8434J62210f8324k51171g9880A3876K1849a63766A87990C4856i380
$$ -19090 58434 220644 -68324 -319495 -79880 13876 35725 -163766 187990 34856 -9380
9894A24384O8471a9396B8511A991J22855d42079e2582N072m36A49252j0973c171
$$ 124384 192855 -19396 28511 1991 124846 -442079 -52582 -47510 -47946 149252 138279 -3171
9881f2175m9153F1391J22302D5136h1259j1891k5583K0250B2960e6996k98655
$$ -62175 -111328 61391 183693 45136 -81259 -93150 -118733 -98483 22960 -56996 -355651
9870c55651A09253c8386A20315a55555M6863b0727j25488A06293C9872N4377i2631
$$ -355651 109253 -38386 120315 -155555 -108692 -20727 -146215 106293 39872 94249 -92631
9858A72308a94240R4930K3282j87728a17141A65713n0649e5925j12776A29004
$$ 172308 -194240 -99310 -76028 -263756 -117141 165713 115064 -55925 -168701 129004
9847a3908j16407c1634A33957b32019J4605a03800J1994A63199a34144K8143j01747
$$ -13908 -130315 -31634 133957 -232019 -217414 -103800 -91806 163199 -134144 -106001 -207748
9836b07748i9340k07337J6228i7684E2865b29316a2748r4404L4259j48279k0331
$$ -207748 -99340 -306677 -290449 -97684 52865 -229316 -12748 -107152 -72893 -221172 -241503
9825b41503A78918a2759d806k03059e9965E33290a00858B02933h0210m7484A54157
$$ -241503 178918 -12759 -4806 -207865 -59965 533290 -100858 202933 -80210 -127694 154157
9813i3282p6749D2883b43945J04411A67145a88820A2167h8771j17779b2103A45299
$$ -93282 -170031 42883 -243945 -139534 167145 -188820 12167 -88771 -206550 -22103 145299
9801d6846B62611b90890A34485c6555o6676A91429L3553k4126e1253B83332b03686
$$ -46846 262611 -290890 134485 -36555 -103231 191429 224982 200856 -51253 283332 -203686
9789b70432O1181I9305b48378J22096m914A37169P4911l8400a70484k00710h6871
$$ -270432 -209251 99305 -248378 -126282 -131196 137169 212080 173680 -170484 -371194 -86871
9777a90879E0555b09638B9083b95656E1138a5521n3605p0566r8936q4803A78025
$$ -190879 50555 -209638 29083 -295656 51138 -15521 -69126 -139692 -238628 -323431 178025
9765B02421E0081c2181I9962o461O547Q9460c54433a74717e7790j87316r9301
$$ 202421 50081 -32181 99962 93501 100048 189508 -354433 -174717 -57790 -245106 -344407
9754c44407G381J26O1381d52443a41435N8574l1100l6280A9562K8667A6831b43282
$$ -344407 7381 7507 68888 -452443 -141435 -82861 -113961 -150241 19562 48229 16831 -243282
9741g9582A45298h0448I3279a69144g4771j05372A9723K7711A964d0479k49019
$$ -79582 145298 -80448 93279 -169144 -74771 -180143 19723 47434 1964 -40479 -289498
9730b89498g5494A61843b47285k05913J89987c8507A22699b75955a13213M798
$$ -289498 -75494 161843 -247285 -453198 -263211 -38507 122699 -275955 -113213 -108415
9720a08415A64698b13608n7255J34916k9259Q355r3424C53571b80821E9103a5604
$$ -108415 164698 -213608 -270863 -135947 -165206 -156851 -250275 353571 -280821 59103 -15604
9708H6415c1563r912k07767A89539E2658i7947M1596m7307l39005e6488l33901
$$ 86415 -31563 -41475 -249242 189539 52658 -97947 -56351 -103658 -442663 -56488 -390389
9697c90389A6757a22885r4747I1876l2714b0010k13613D3467a21711j05357K1975
$$ -390389 16757 -122885 -217632 91876 59162 -20010 -233623 43467 -121711 -227068 -205093
9686b05093J5102H7574e5079B87910q9137E5647K67377H612b09929a00301k54982
$$ -205093 -189991 87574 -55079 287910 198773 55647 323024 8612 -209929 -100301 -355283
9675c55283c907k32373J07350B21343A1896b81806A18085b15847N2619n0708Q5210
$$ -355283 -3907 -236280 -128930 221343 11896 -281806 118085 -215847 -163228 -213936 -128726
9664a28726o1193m2214K4025A76491f1461o5089N03b8254n2184B44585c77600
$$ -128726 -189919 -232133 -208108 176491 -61461 -126550 -126047 -28254 -80438 244585 -377600
9652A09770i006j0063l96497h2478A08663b15710f2274a6281m959A76524i2895
$$ 109770 -9006 -19069 -415566 -82478 108663 -215710 -62274 -16281 -21240 176524 -92895
9640b5654J2550j16486o6717I4519a36571B7333b55639n6695a39964B89733G9790
$$ -25654 -13104 -129590 -196307 94519 -136571 27333 -255639 -312334 -139964 289733 79790
9628D24932d1785A12445J3905a60088L2075f661A29319C1146b3420A82219J61194
$$ 424932 -41785 112445 126350 -160088 -128013 -6661 129319 31146 -23420 182219 343413
9617C43413a590j06272g142B33925I5560b32317M2355q2119E9726a63406N0824
$$ 343413 -1590 -107862 -7142 233925 95560 -232317 -189962 -272081 59726 -163406 -112582
9606a12582p3634g2740B853a64505a1326A2133C606J70939a22902j80700R5422
$$ -112582 -186216 -72740 2853 -164505 -11326 12133 3606 174545 -122902 -303602 -208180
9595b08180f3371m00718a42070n8566M9539e5203k22282j07920F1417Q3681b96381
$$ -208180 -63371 -464089 -142070 -200636 -151097 -55203 -277485 -385405 61417 145098 -296381
9583d53720J71923i9037j01641j39808I271a4016k64551Q316A4602j812h2816
$$ -453720 -281797 -99037 -200678 -340486 9271 -14016 -278567 -270251 14602 12790 -82816
9571A50632d9851l47858J26890B82886B9495a81592E2555J81235d7063B11793
$$ 150632 -49851 -397709 -270819 282886 29495 -181592 52555 233790 -47063 211793
9560B31907D208e8487m3663B10351a20355p4662c5410r3870d3678I3285a07359
$$ 231907 4208 -58487 -102150 210351 -120355 -195017 -35410 -129280 -43678 93285 -107359
9548A87438E7721b66585d0564M792j04989D0776N5194K82586a86108K8204B4576
$$ 187438 57721 -266585 -40564 -35772 -140761 40776 95970 378556 -186108 -157904 24576
9536a4075B7910b14849j17254a09317j43305d8795A19436b51500a05259n5577
$$ -14075 27910 -214849 -332103 -109317 -252622 -48795 119436 -251500 -105259 -160836
9526a60836A7893e640p3051M672o2586e514D05373e6105I1724J38244j05050b30504
$$ -160836 17893 -5640 -78691 -74019 -136605 -5514 405373 -56105 91724 229968 124918 -230504
9513A67505m5770i1087I4174b8101j50468j11264g1802n1739p5409n2520a03319
$$ 167505 121735 -91087 94174 -28101 -178569 -289833 -71802 -123541 -198950 -251470 -103319
9501A49523c05957d4339A15293j7162K0637d04500J47420a03575K913B22913a65820
$$ 149523 -305957 -44339 115293 98131 118768 -404500 -257080 -103575 -100662 222913 -165820
9489b08085A88632h4708c2271j06666o832C1853b45881A31957P386J63963g612
$$ -208085 188632 -84708 -32271 -138937 -145769 31853 -245881 131957 139343 303306 -7612
9477b16103K7687j06134N7229c407l28833R9210K6754c1072j02545E5779a68421
$$ -216103 -188416 -294550 -237321 -3407 -332240 -233030 -206276 -31072 -133617 55779 -168421
9465a33108H4878b19138H8293d031C30850D8485J26067A0256c98000a59755c196
$$ -133108 84878 -219138 88293 -4031 330850 48485 174552 10256 -398000 -159755 -3196
9453a27354E1708b20844Q4468o882G75a91764A84842a51000B0332N7691J1872
$$ -127354 51708 -220844 -136376 -143258 775 -191764 184842 -151000 20332 78023 89895
9442H9895J4013C2426b51381f0060D9601O5329a7741A42776d5184k21735A0345
$$ 89895 103908 32426 -251381 -60060 49601 114930 -17741 142776 -45184 -266919 10345
9430b70129a7889p8812A47365J5069c10715a39541m7922A25871K01234g4980C07911
$$ -270129 -17889 -96701 147365 162434 -310715 -139541 -187463 125871 327105 -74980 307911
9418B7900P3806a61702h399B2249a88248l5602m6482B88612d50988B2756d0511
$$ 27900 101706 -161702 -8399 22249 -188248 -223850 -270332 288612 -450988 22756 -40511
9406a05087j89244D9087e19433i3324A45498F5669b6339k01955M1485A14002C0104
$$ -105087 -294331 49087 -519433 -93324 145498 65669 -26339 -228294 -186809 114002 30104
9394E2244d24315d8266K3041j38933k06508a28458d7792j30364A50102D8325a47091
$$ 52244 -424315 -48266 -25225 -164158 -370666 -128458 -47792 -178156 150102 48325 -147091
9382c39755A65750g5555q2090E5569f8022k04760l0392b7620l0694j16827O5784
$$ -339755 165750 -75555 -157645 55569 -68022 -272782 -303174 -27620 -58314 -175141 -109357
9371a09357L6142F8997d7752A2982J16967D0059Q0781C2836A913L2790O8113a29217
$$ -109357 -73215 68997 -47752 12982 129949 40059 120840 32836 1913 34703 102816 -129217
9358h9166c9374I4305a62212O995K7377B4535N1030a59425c9558Q796C8313K7228
$$ -89166 -39374 94305 -162212 -155217 -127840 24535 75565 -159425 -39558 -30762 38313 65541
9346F5541i2896C1853a43344c638k40914k8685E0179j7878P0685i3823L5815n2031
$$ 65541 -92896 31853 -143344 -3638 -244552 -273237 50179 32301 102986 -93823 -58008 -110039
9334a10039p3963j87983A15519b49568g9870B0705Q6285K1212C798e1706G9562
$$ -110039 -184002 -371985 115519 -249568 -79870 20705 106990 128202 3798 -51706 79562
9322A93273a52575F2769a47684C0382a01383B43009a93360I9193c8576A14013
$$ 193273 -152575 62769 -147684 30382 -101383 243009 -193360 99193 -38576 114013
9311b8303k08571j88913d7105l7471l75290C4508a8546j29214D6856a00989j76953
$$ -28303 -236874 -425787 -47105 -84576 -459866 34508 -18546 -147760 46856 -100989 -277942
9300b77942a30929L3107j69513g3504a9943j94704A31725b0537n2781J2056L797
$$ -277942 -130929 -97822 -267335 -73504 -19943 -214647 131725 -20537 -73318 -61262 -57465
9289e7465j14837e9075j47047A03454a56331A23189J93742b19437Q1590q8930
$$ -57465 -172302 -59075 -206122 103454 -156331 123189 316931 -219437 -137847 -226777
9279b26777a03840p3699A12960b45442H8559A8536b28353D0576J65669c6576j77840
$$ -226777 -103840 -177539 112960 -245442 88559 18536 -228353 40576 206245 -36576 -214416
9268b14416A49660a57086r0361D4994j4371f6535L3213r152J3759k79535a1425
$$ -214416 149660 -157086 -247447 44994 30623 -66535 -33322 -42474 -28715 -308250 -11425
9256b36471J07334b0290k77561i5859n2984f2282l3651p7175A13627a56531m1646
$$ -236471 -129137 -20290 -297851 -95859 -148843 -62282 -95933 -173108 113627 -156531 -198177
9245a98177a3988A67624f8396E3385b70610B17322f906G3298b87851h5842l5937
$$ -198177 -13988 167624 -68396 53385 -270610 217322 -6906 73298 -287851 -85842 -121779
9234a21779A07561c24375i5560n6936j83060I2213a62978A20876j8467D4376d5633
$$ -121779 107561 -324375 -95560 -152496 -335556 92213 -162978 120876 102409 44376 -45633
9222c49837a25170j26749G6878a51296e4114o862o2067A01118K19059a32719A46394
$$ -349837 -125170 -251919 76878 -151296 -54114 -60976 -123043 101118 320177 -132719 146394
9210A25176Q3777K08889G8934b57283k22604J00267a45913C3683a98287H2208
$$ 125176 208953 417842 78934 -257283 -479887 -379620 -145913 33683 -198287 82208
9199B27492B364c5120o1074j61908C197d5236G8662L1775d4925j70771N8356r7295
$$ 227492 2364 -35120 -96194 -258102 3197 -45236 78662 110437 -44925 -215696 -157340 -254635
9187b54635a17805H7453b62840B58252C7867j1479b8562A1892h0754h995p2845
$$ -254635 -117805 87453 -262840 258252 37867 26388 -28562 11892 -80754 -8995 -81840
9176h1840C8250c44355A59129d4840A08638a66224J5319l7510D6147K03316J29761
$$ -81840 38250 -344355 159129 -44840 108638 -166224 -150905 -188415 46147 249463 379224
9165C79224b5156n7662B6226J67376b58325M8997j81359c2395B0455a32535L3935
$$ 379224 -25156 -82818 26226 193602 -258325 -209328 -390687 -32395 20455 -132535 -98600
9154i8600B2391J15740b77950N0387j13430A55092d0769A91828n4522b87571Q4836
$$ -98600 22391 138131 -277950 -227563 -340993 155092 -40769 191828 137306 -287571 -202735
9143b02735B61364b38000c6122n6429E901K69442O8017g366E7974a35968F8076
$$ -202735 261364 -238000 -36122 -92551 5901 275343 343360 -7366 57974 -135968 68076
9131a65411l4453f3120k97756a32216o7745d4439C1002a55742n653j89944B10675
$$ -165411 -199864 -63120 -360876 -132216 -199961 -44439 31002 -155742 -161395 -351339 210675
9119C23858E2087c30974l9119a23162H6316a64970P7681A87695d0136j3993A10812
$$ 323858 52087 -330974 -370093 -123162 86316 -164970 -87289 187695 -40136 -54129 110812
9107A57459a19895n1022G9201l332h5255A74697a37914M1838e345B06492H4195
$$ 157459 -119895 -170917 79201 75869 -85255 174697 -137914 -96076 -5345 206492 84195
9095i8819A68845a29332J6301Q948B8372d5574m132F4359d3457k45644h3501K2032
$$ -98819 168845 -129332 -113031 -104083 28372 -45574 -49706 64359 -43457 -289101 -83501 -61469
9083f1469j14143B10009a28671b212j53372c1428k04658j25609J57074e903k56052
$$ -61469 -175612 210009 -128671 -2212 -155584 -31428 -236086 -361695 -204621 -5903 -261955
9072b61955p2967a27176f887m5459j50848B18M74387A34897n04b44423A73865
$$ -261955 -334922 -127176 -6887 -52346 -203194 218 474605 134897 134393 -244423 173865
9060a28951F3227c10660j4484D23270a23114j99810A4855c89829a55020d5764
$$ -128951 63227 -310660 -325144 423270 -123114 -322924 14855 -389829 -155020 -45764
9049b18957A06941c64275A11760a15224j24508A77840A9250d04083d7042k93435
$$ -218957 106941 -364275 111760 -115224 -239732 177840 19250 -404083 -47042 -340477
9039c40477B7265c04971J48228J6349l0340j42265N7064J23248j5472r0949B6645
$$ -340477 27265 -304971 -156743 -140394 -170734 -312999 -255935 -132687 -148159 -239108 26645
9027A878J65164n5104c98326A24707b25398R4654C38391j66220M6020c4216P103
$$ 1878 167042 111938 -398326 124707 -225398 -130744 338391 172171 218191 -34216 -27113
9016b7113k09186B06734a43823l5244A17748l4792i7926l7330B39797D2940a84601
$$ -27113 -236299 206734 -143823 -179067 117748 82956 -97926 -135256 239797 42940 -184601
9004C4648J05109g697B70837a80355j05555h5572j14225L7740j16540A19617L0781
$$ 34648 139757 -7697 270837 -180355 -285910 -85572 -199797 -162057 -278597 119617 150398
8993A50398D9071b12546c6240j73473j2932A10967c4943G5404c88037G8007c20038
$$ 150398 49071 -212546 -36240 -209713 -222645 110967 -34943 75404 -388037 78007 -320038
8981E0415h3472o1324j9144D6766c33538a47266a8120j43707J0278j5697o8152
$$ 50415 -83472 -144796 -163940 46766 -333538 -147266 -18120 -161827 -151549 -167246 -235398
8970b35398c6498M077L316B1994J87011a33515B40632A15795a84714g2869j92805
$$ -235398 -36498 -32421 -29105 21994 209005 -133515 240632 115795 -184714 -72869 -265674
8959b65674O3770j96032c6943A96504g1136j58749k3900P8657a0218j03906A05804
$$ -265674 -201904 -397936 -36943 196504 -71136 -229885 -253785 -175128 -10218 -114124 105804
8947A51644d0824r4918B0730d9493l14868d0072B9756M8919J1954a63493d5358
$$ 151644 -40824 -135742 20730 -49493 -364361 -40072 29756 78675 90629 -163493 -45358
8935c07061C6942c34048b6769n3976A28874g6720E8119J07447k0237e0566B01174
$$ -307061 36942 -334048 -26769 -80745 128874 -76720 58119 165566 145329 -50566 201174
8923C2440a13188l4808A21389B1494N95278j99658j66076N5423L7981j70154n3882
$$ 32440 -113188 -147996 121389 21494 616772 417114 251038 306461 344442 174288 120406
8912A20406K11624M05579P1633M52575O82355J711600M669694k17711C821969
$$ 120406 332030 737609 809242 1261817 1944172 3655772 8325466 8107755 3821969
8902B270490o74085F01172j8631L9378k14343N2338N133f3913G695R1351M02756
$$ 2270490 1596405 601172 582541 621919 407576 459914 465047 -63913 7695 99046 501802
8891E01802I5190K8681D6441P6803h1768H5180a2159p611j45885H5545b39928
$$ 501802 95190 123871 46441 123244 -81768 85180 -12159 -19770 -165655 85545 -239928
8879A95875q9006D3332a80620e5753r2215q552M2611e510r1289o0748q8544k30014
$$ 195875 106869 43332 -180620 -55753 -147968 -156520 -113909 -5510 -96799 -157547 -246091 -476105
8867d76105g1519A974K30141D4984J23441d15624g0580j08176F4717b3009C5238
$$ -476105 -71519 1974 232115 44984 168425 -415624 -70580 -178756 64717 -23009 35238
$$ [...]
##END NTUPLES=NMR SPECTRUM
##END=
