
##TITLE=UV1043_TOSA01-ROVE100B_6099774_k9BijCuRNE
##JCAMPDX= 6.0         $$ Bruker NMR JCAMP-DX V2.0
##DATA TYPE= NMR SPECTRUM
##DATA CLASS= NTUPLES
##ORIGIN= BRUKER
##OWNER= Administrator
$$ 1.72 TOPSPIN		Version 2.1
$$ 2012-05-13 00:14:30.937 -0500  Administrator@TOPSPIN
$$ Compression mode = diff/dup
##.OBSERVE FREQUENCY= 400.13188235
##.OBSERVE NUCLEUS= ^1H
##.ACQUISITION MODE= SIMULTANEOUS (DQD)
##.ACQUISITION SCHEME= undefined
##.AVERAGES= 64
##.DIGITISER RES= 22
##SPECTROMETER/DATA SYSTEM= spect
##.PULSE SEQUENCE= noesygpps1d.comp
##.SOLVENT NAME= COFFEE_meoh
##.SHIFT REFERENCE= INTERNAL, COFFEE_meoh, 1, 14.96678
##AUDIT TRAIL= $$ (NUMBER, WHEN, WHO, WHERE, PROCESS, VERSION, WHAT)
$$ ##TITLE= Audit trail, TOPSPIN		Version 2.1
$$ ##JCAMPDX= 5.01
$$ ##ORIGIN= Bruker BioSpin GmbH
$$ ##OWNER= Administrator
$$ $$ C:\Bruker\TOPSPIN/data/COFFEE/nmr/UV1043_TOSA01-ROVE100B_6099774_k9BijCuRNE/12/pdata/1/auditp.txt
$$ ##AUDIT TRAIL=  $$ (NUMBER, WHEN, WHO, WHERE, PROCESS, VERSION, WHAT)
(   1,<2012-05-13 00:14:25.875 -0500>,<Administrator>,<TOPSPIN>,<go>,<TOPSPIN 2.1>,
      <created by zg
	started at 2012-05-13 00:02:55.687 -0500,
	POWCHK enabled, PULCHK disabled,
       configuration hash MD5:
       AF F2 23 6B 01 CD 40 DD E5 A1 38 A0 06 EA F7 77
       data hash MD5: 64K
       59 5C 2F 72 BE 43 4B 20 36 E3 35 6B 8B E8 EA 57>)
(   2,<2012-05-13 00:14:28.718 -0500>,<Administrator>,<TOPSPIN>,<proc1d>,<TOPSPIN 2.1>,
      <Start of raw data processing
       efp LB = 0.3 FT_mod = 6 PKNL = 1 PHC0 = 0 PHC1 = 0 SI = 128K 
       data hash MD5: 128K
       0D C7 E9 BB A1 9E 59 38 84 39 80 0B 3C F2 B9 41>)
(   3,<2012-05-13 00:14:29.921 -0500>,<Administrator>,<TOPSPIN>,<proc1d>,<TOPSPIN 2.1>,
      <pk PHC0 = 36.60095 PHC1 = 0 
       data hash MD5: 128K
       EC DC 61 9D 92 AF 39 5F 81 A6 C7 E3 B0 E3 93 4C>)
(   4,<2012-05-13 00:14:30.609 -0500>,<Administrator>,<TOPSPIN>,<proc1d>,<TOPSPIN 2.1>,
      <abs ABSG = 1 
       data hash MD5: 128K
       EE A0 2C 90 F4 EC 74 82 FD 57 60 38 0E 5D E4 98>)
(   5,<2012-05-13 00:14:30.703 -0500>,<Administrator>,<TOPSPIN>,<proc1d>,<TOPSPIN 2.1>,
      <abs ABSG = 2 
       data hash MD5: 128K
       F2 F5 93 E1 93 38 CA 26 11 E0 96 3A 40 66 89 35>)
(   6,<2012-05-13 00:14:30.765 -0500>,<Administrator>,<TOPSPIN>,<proc1d>,<TOPSPIN 2.1>,
      <abs ABSG = 3 
       data hash MD5: 128K
       BF D6 B8 7E E4 65 49 4C 3B EC 38 1A 91 50 FD 38>)
(   7,<2012-05-13 00:14:30.812 -0500>,<Administrator>,<TOPSPIN>,<proc1d>,<TOPSPIN 2.1>,
      <abs ABSG = 4 
       data hash MD5: 128K
       08 92 5E 63 08 95 28 90 36 29 76 2C 5B 88 DC 57>)
(   8,<2012-05-13 00:14:30.859 -0500>,<Administrator>,<TOPSPIN>,<proc1d>,<TOPSPIN 2.1>,
      <abs ABSG = 5 
       data hash MD5: 128K
       83 3A B7 98 F2 C8 14 42 7B 85 25 60 2A 33 CD 9A>)
$$ ##END=
$$ 
$$ $$ hash MD5
$$ $$ BA F2 81 54 56 4B 65 F7 0F 38 9A 71 30 59 0A A8
##$RELAX= 
##$RELAX= 
##$RELAX= 
##$RELAX= 
##$RELAX= 
##$RELAX= 
##$RELAX= 
##$RELAX= 
$$ [...]
##$TP07= 0
##$TPNAME0= <>
##$TPNAME1= <>
##$TPNAME2= <>
##$TPNAME3= <>
##$TPNAME4= <>
##$TPNAME5= <>
##$TPNAME6= <>
##$TPNAME7= <>
##$TPOAL= (0..7)
0.5 0.5 0.5 0.5 0.5 0.5 0.5 0.5
##$TPOFFS= (0..7)
0 0 0 0 0 0 0 0
##$TUNHIN= 0
##$TUNHOUT= 0
##$TUNXOUT= 0
##$USERA1= <user>
##$USERA2= <user>
##$USERA3= <user>
##$USERA4= <user>
##$USERA5= <user>
##$V9= 5
##$VALIST= <valist>
##$VCLIST= <CCCCCCCCCCCCCCC>
##$VD= 0
##$VDLIST= <DDDDDDDDDDDDDDD>
##$VPLIST= <PPPPPPPPPPPPPPP>
##$VTLIST= <TTTTTTTTTTTTTTT>
##$WBST= 2048
##$WBSW= 25
##$XGAIN= (0..3)
0 0 0 0
##$XL= 0
##$YL= 0
##$YMAX_a= 11010936
##$YMIN_a= -5577827
##$ZGOPTNS= <>
##$ZL1= 120
##$ZL2= 120
##$ZL3= 120
##$ZL4= 120
##$ABSF1= 14.96678
##$ABSF2= -5.585751
##$ABSG= 5
##$ABSL= 3
##$ALPHA= 0
##$AQORDER= 0
##$ASSFAC= 0
##$ASSFACI= 0
##$ASSFACX= 0
##$ASSWID= 0
##$AUNMP= <proc_prof1d_extract.lims>
##$AXLEFT= 0
##$AXNAME= <>
##$AXNUC= <1H>
##$AXRIGHT= 0
##$AXTYPE= 0
##$AXUNIT= <>
##$AZFE= 0.1
##$AZFW= 0.1
##$BCFW= 0
##$BC_mod= 0
##$BYTORDP= 0
##$COROFFS= 0
##$CY= 15
##$DATMOD= 1
##$DC= 0
##$DFILT= <>
##$DTYPP= 0
##$F1P= 0
##$F2P= 0
##$FCOR= 0.5
##$FTSIZE= 131072
##$FT_mod= 6
##$GAMMA= 0
##$GB= 0
##$INTBC= 1
##$INTSCL= 1
##$ISEN= 128
##$LB= 0.3
##$LEV0= 0
##$LPBIN= 0
##$MAXI= 10000
##$MC2= 0
##$MEAN= 0
##$ME_mod= 0
##$MI= 0
##$NCOEF= 0
##$NC_proc= -3
##$NLEV= 6
##$NOISF1= 0
##$NOISF2= 0
##$NSP= 0
##$NTH_PI= 0
##$NZP= 0
##$OFFSET= 14.96678
##$PC= 1
##$PHC0= 36.60095
##$PHC1= 0
##$PH_mod= 1
##$PKNL= yes
##$PPARMOD= 0
##$PPDIAG= 0
##$PPIPTYP= 0
##$PPMPNUM= 2147483647
##$PPRESOL= 1
##$PSCAL= 4
##$PSIGN= 0
##$PYNMP= <proc.py>
##$REVERSE= no
##$SF= 400.130005535118
##$SI= 131072
##$SIGF1= 0
##$SIGF2= 0
##$SINO= 400
##$SIOLD= 131072
##$SPECTYP= <>
##$SREGLST= <1H.CDCl3>
##$SSB= 0
##$STSI= 131072
##$STSR= 0
##$SW_p= 8223.68421052632
##$SYMM= 0
##$S_DEV= 0
##$TDeff= 65536
##$TDoff= 0
##$TI= <>
##$TILT= no
##$TM1= 0
##$TM2= 0
##$TOPLEV= 0
##$USERP1= <user>
##$USERP2= <user>
##$USERP3= <user>
##$USERP4= <user>
##$USERP5= <user>
##$WDW= 1
##$XDIM= 131072
##$YMAX_p= 435802593
##$YMIN_p= -48652414
##$CURPLOT= <Network HP LaserJet P1505>
##$CURPRIN= <$Network HP LaserJet P1505>
##$DFORMAT= <normdp>
##$LAYOUT= <+/1D_H.xwp>
##$LFORMAT= <normlp>
##$PFORMAT= <normpl>
##$SURQMSG= 1
$$ End of Bruker specific parameters
$$ ---------------------------------
##NTUPLES= NMR SPECTRUM
##VAR_NAME=  FREQUENCY,     SPECTRUM/REAL,   SPECTRUM/IMAG
##SYMBOL=    X,             R,               I
##VAR_TYPE=  INDEPENDENT,   DEPENDENT,       DEPENDENT
##VAR_FORM=  AFFN,          ASDF,            ASDF
##VAR_DIM=   131072,        131072,          131072
##UNITS=     HZ,            ARBITRARY UNITS, ARBITRARY UNITS
##FACTOR=    0.0627417313425165, 1,          1
##FIRST=     8223.62146879498, 5622,         -104015
##LAST=      0,             8020,            -103403
##MIN=       0,             -48652414,       0
##MAX=       8223.62146879498, 435802593,    0
$$ Real data points
##PAGE= N=1
##DATA TABLE= (X++(R..R)), XYDATA
$$ [...]
$$ plain form
63662 446260 450152 455267 460113 463698 466123 467898 469505 471243 472917 474108 474971 475893 476019 473436 467719
63647 467719 461260 456893 455074 454577 455064 457311 461217 465254 468017 469161 468884 467719 466953 467970 470766
63632 470766 474050 477034 480189 483997 488027 491697 495017 498052 500561 502839 506089 511030 516599 520882
63618 520882 523163 524320 525347 526313 526962 527677 529225 531598 533620 534110 533393 533190 534807 537782 540639 542452
63602 542452 542972 541692 538037 532702 527692 524380 522136 519469 515979 512552 510049 508560 507755 507398 507511
63587 507511 508371 510285 513210 516943 521800 528433 536491 544220 550377 556178 564223 575481 588301 600545
63573 600545 611860 623615 637526 654671 674963 696909 718437 738631 758339 778794 800317
63562 800317 822925 847492 875198 906143 939487 975006 1013515 1055412 1099579 1144312 1189079
$$ packed form
63662D46260L892N115M846L585K425J775J607J738J674J191Q63R22J26k583n717
63647D67719o459m367j819m97M87K247L906M037K763J144k77j165p66J017K796
63632D70766L284K984L155L808M030L670L320L035K509K278L250M941N569M283
63618E20882K281J157J027R66O49P15J548K373K022M90p17k03J617K975K857J813
63602E42452N20j280l655n335n010l312k244k667l490l427k503j489q05l57J13
63587E07511Q60J914K925L733M857O633Q058P729O157N801Q045J1258J2820J2244
63573F00545J1315J1755J3911J7145K0292K1946K1528K0194J9708K0455K1523
63562H00317K2608K4567K7706L0945L3344L5519L8509M1897M4167M4733M4767
$$ plain form
63551 1189079 1235059 1284090 1337173 1393528 1450667 1505390 1554918 1597270 1631061 1655592 1671263
63540 1671263 1679325 1680942 1676801 1667829 1655730 1642306 1628412 1613864 1598022 1579880 1557878 1530504
63528 1530504 1497550 1460370 1420684 1379492 1337485 1296056 1257041 1221245 1187814 1155578 1124886
63517 1124886 1097674 1075675 1058900 1045956 1035505 1027220 1021594 1019269 1020475 1024849 1031646 1040215 1050301
63504 1050301 1061950 1075366 1090975 1109272 1130294 1153384 1177903 1204081 1232856 1264911 1300217
63493 1300217 1338456 1379539 1423700 1471395 1523002 1578155 1635375 1692734 1748629 1801173 1846947
63482 1846947 1881591 1902492 1910472 1908360 1898513 1882401 1861966 1840030 1818858 1798745 1778227 1755392
63470 1755392 1728972 1698595 1664319 1625994 1583153 1535676 1484413 1430994 1377104 1324085 1272945
$$ packed form
63551A189079M5980M9031N3083N6355N7139N4723M9528M2352L3791K4531J5671
63540A671263Q062J617m141q972j2099j3424j3894j4548j5842j8142k2002k7374
63528A530504l2954l7180l9686m1192m2007m1429l9015l5796l3431l2236l0692
63517A124886k7212k1999j6775j2944j0451q285n626k325J206M374O797Q569J0086
63504A050301J1649J3416J5609J8297K1022K3090K4519K6178K8775L2055L5306
63493A300217L8239M1083M4161M7695N1607N5153N7220N7359N5895N2544M5774
63482A846947L4644K0901P980k112r847j6112k0435k1936k1172k0113k0518k2835
63470A755392k6420l0377l4276l8325m2841m7477n1263n3419n3890n3019n1140
$$ plain form
63459 1272945 1224352 1178556 1135411 1094414 1054770 1015848 977942 942243 909707 880243 853439
63448 853439 829706 809839 793315 777884 761411 743932 727445 713745 702782 693220 684275 676510
63436 676510 670736 666623 662966 659120 655385 651830 647653 642317 636742 632551 630440 629915 630384 631754 634024
63421 634024 636957 640165 643050 644839 645288 645192 645512 646154 646407 646457 647367 649356 651118 651352 650153 648385 646478
63404 646478 644497 642780 641733 641403 641899 643866 647935 653943 661187 669039 676845 683863 690189 697346 706918
63389 706918 718815 731862 745918 762060 780505 799746 818555 837813 859511 884772 913845
63378 913845 947206 985244 1027094 1071180 1116880 1164198 1211531 1255391 1293417 1326712 1358249
63367 1358249 1389905 1422282 1456478 1494111 1535537 1579736 1626475 1677252 1733479 1794725 1859284
$$ packed form
63459A272945m8593m5796m3145m0997l9644l8922l7906l5699l2536k9464k6804
63448H53439k3733j9867j6524j5431j6473j7479j6487j3700j0963r562q945p765
63436F76510n774m113l657l846l735l555m177n336n575m191k111n25M69J370K270
63421F34024K933L208K885J789M49r6L20O42K53N0R10J989J762K34j199j768j907
63404F46478j981j717j047l30M96J967M069O008P244P852P806P018O326P157R572
63389G06918J1897J3047J4056J6142J8445J9241J8809J9258K1698K5261K9073
63378I13845L3361L8038M1850M4086M5700M7318M7333M3860L8026L3295L1537
63367A358249L1656L2377L4196L7633M1426M4199M6739N0777N6227O1246O4559
$$ plain form
63356 1859284 1925166 1989618 2048869 2099896 2141940 2175150 2198367 2209826 2209864 2201288 2186847 2167787
63344 2167787 2145269 2121427 2097631 2072553 2043245 2007894 1966633 1920131 1868767 1813445 1756086
63333 1756086 1698599 1641800 1585935 1531936 1481413 1435278 1392974 1353433 1316425 1282449 1251635
63322 1251635 1223668 1198982 1179148 1165376 1157091 1152769 1151867 1155149 1163158 1175204 1190127 1207457
63310 1207457 1227527 1250825 1277427 1306819 1338249 1371592 1407792 1448005 1492389 1540349 1591954
63299 1591954 1648183 1709376 1774026 1839480 1903300 1963553 2018416 2066181 2105477 2135088 2153868
63288 2153868 2161372 2158488 2147194 2129814 2108508 2084860 2059469 2032060 2002140 1969172 1932113 1889706
63276 1889706 1841882 1790316 1736930 1682387 1626756 1570934 1516198 1462764 1410287 1359871 1314021
$$ packed form
63356A859284O5882O4452N9251N1027M2044L3210K3217J1459L8q576j4441j9060
63344B167787k2518k3842k3796k5078k9308l5351m1261m6502n1364n5322n7359
63333A756086n7487n6799n5865n3999n0523m6135m2304l9541l7008l3976l0814
63322A251635k7967k4686j9834j3772q285m322r02L282Q009J2046J4923J7330
63310A207457K0070K3298K6602K9392L1430L3343L6200M0213M4384M7960N1605
63299A591954N6229O1193O4650O5454O3820O0253N4863M7765L9296K9611J8780
63288B153868P504k884j1294j7380k1306k3648k5391k7409k9920l2968l7059m2407
63276A889706m7824n1566n3386n4543n5631n5822n4736n3434n2477n0416m5850
$$ plain form
63265 1314021 1273953 1238265 1205324 1175912 1151962 1132983 1115249 1094769 1069989 1041313 1009437
63254 1009437 975330 941097 909273 880911 855117 830654 807370 785803 766189 748356 732090
63243 732090 717007 702416 687936 674154 662211 652751 645511 639685 634366 628902 623205 617510 611586
63230 611586 604721 596939 589595 583925 579487 575050 570596 567177 564953 562896 560577 558746 557531 555523
63216 555523 551718 547310 544405 543642 544193 545479 547558 549969 551471 551345 550354 550092 551571 554416 557310
63201 557310 559411 561373 564574 569378 574887 580578 587111 595031 603794 612969 623247 634967 646557
63188 646557 656139 664369 673879 685871 698937 711745 725447 742485 763820 788126 813208 837678
63176 837678 861654 886236 912134 938792 965237 991575 1018825 1047230 1075664 1103046 1129547
$$ packed form
63265A314021m0068l5688l2941k9412k3950j8979j7734k0480k4780k8676l1876
63254A009437l4107l4233l1824k8362k5794k4463k3284k1567j9614j7833j6266
63243G32090j5083j4591j4480j3782j1943r460p240n826n319n464n697n695n924
63230F11586o865p782p344n670m438m437m454l419k224k057k319j831j215k008
63216E55523l805m408k905p63N51J286K079K411J502j26r91k62J479K845K894
63201E57310K101J962L201M804N509N691O533P920Q763R175J0278J1720J1590
63188F46557R582Q230R510J1992J3066J2808J3702J7038K1335K4306K5082K4470
63176H37678K3976K4582K5898K6658K6445K6338K7250K8405K8434K7382K6501
$$ plain form
63165 1129547 1155907 1182238 1208074 1233229 1258134 1283528 1309986 1337411 1364808 1390784 1414129
63154 1414129 1433498 1446958 1452945 1451802 1445360 1434782 1419804 1400384 1377819 1353495 1327611 1300094
63142 1300094 1271920 1244454 1218031 1192219 1167142 1143741 1123148 1106543 1094957 1088140 1084078 1080793
63130 1080793 1078336 1077874 1079223 1080858 1082471 1085899 1092871 1103030 1114946 1128025 1142430 1157854 1173530
63117 1173530 1189277 1205477 1221852 1236946 1249288 1258863 1267076 1275042 1282048 1286036 1285759 1281973 1276025
63104 1276025 1267725 1255491 1238462 1217473 1193758 1167787 1139986 1111774 1084900 1059973 1036255
63093 1036255 1012795 989292 966059 943590 922148 901624 881997 863965 848507 835589 823963
63082 823963 812716 802372 793866 787104 781378 776592 773009 770177 767283 764493 762818 762660 763612 765682
$$ packed form
63165A129547K6360K6331K5836K5155K4905K5394K6458K7425K7397K5976K3345
63154A414129J9369J3460N987j143o442j0578j4978j9420k2565k4324k5884k7517
63142A300094k8174k7466k6423k5812k5077k3401k0593j6605j1586o817m062l285
63130A080793k457m62J349J635J613L428O972J0159J1916J3079J4405J5424J5676
63117A173530J5747J6200J6375J5094J2342R575Q213P966P006L988k77l786n948
63104A276025q300j2234j7029k0989k3715k5971k7801k8212k6874k4927k3718
63093A036255k3460k3503k3233k2469k1442k0524j9627j8032j5458j2918j1626
63082H23963j1247j0344q506o762n726m786l583k832k894k790j675j58R52K070
$$ plain form
63068 765682 769472 774712 779858 783761 786907 790438 794825 800031 806048 812423 818012 822152 825518 829118
63054 829118 833048 837086 841804 847983 855324 862875 870531 879025 888520 898149 906911 914107 919082 921803
63040 921803 923904 927970 935125 943934 952000 957959 961738 963838 965098 966615 969169 972781 977043 981491
63026 981491 985432 987955 988663 988324 988466 990317 994099 999207 1005076 1011972 1020614 1030914 1041820 1053075
63012 1053075 1066262 1082806 1101430 1119304 1135716 1152861 1172637 1194603 1218025 1244071 1274383
63001 1274383 1308726 1345744 1385172 1427643 1472974 1520497 1570786 1625213 1683700 1744525 1806676
62990 1806676 1870879 1937766 2006255 2074550 2141840 2208385 2274651 2341024 2407837 2475025 2541971
62979 2541971 2607993 2672695 2735763 2796910 2856083 2912945 2965782 3011554 3047572 3072809 3087357
$$ packed form
63068G65682L790N240N146L903L146L531M387N206O017O375N589M140L366L600
63054H29118L930M038M718O179P341P551P656Q494R495R629Q762P196M975K721
63040I21803K101M066P155Q809Q066N959L779K100J260J517K554L612M262M448
63026I81491L941K523P08l39J42J851L782N108N869O896Q642J0300J0906J1255
63012A053075J3187J6544J8624J7874J6412J7145J9776K1966K3422K6046L0312
63001A274383L4343L7018L9428M2471M5331M7523N0289N4427N8487O0825O2151
62990A806676O4203O6887O8489O8295O7290O6545O6266O6373O6813O7188O6946
62979B541971O6022O4702O3068O1147N9173N6862N2837M5772L6018K5237J4548
$$ plain form
62968 3087357 3091183 3083925 3065429 3035876 2995495 2944661 2884323 2816240 2743028 2667968 2594159 2523274
62956 2523274 2455293 2389841 2327612 2270113 2218308 2172201 2131915 2098560 2073461 2056554 2045976
62945 2045976 2039449 2035939 2035916 2040312 2049515 2063028 2079508 2097133 2114689 2132542 2152017 2173440 2195374
62932 2195374 2216117 2235283 2253303 2269993 2284508 2296254 2304801 2309134 2308018 2301046 2288411 2269662
62920 2269662 2243735 2210315 2170239 2124478 2073868 2020111 1965654 1911836 1858157 1804121 1750811
62909 1750811 1699704 1650852 1603512 1558033 1515715 1476878 1440317 1404911 1370853 1338985 1309548
62898 1309548 1282007 1255638 1230038 1205316 1181913 1160003 1139083 1118466 1098099 1078460 1059655
62887 1059655 1041086 1022262 1003605 986179 970646 956503 942368 927270 911827 897839 886273
$$ packed form
62968C087357L826p258j8496k9553m0381n0834o0338o8083p3212p5060p3809p0885
62956B523274o7981o5452o2229n7499n1805m6107m0286l3355k5099j6907j0578
62945B045976o527l510k3M396R203J3513J6480J7625J7556J7853J9475K1423K1934
62932B195374K0743J9166J8020J6690J4515J1746Q547M333j116o972j2635j8749
62920B269662k5927l3420m0076m5761n0610n3757n4457n3818n3679n4036n3310
62909A750811n1107m8852m7340m5479m2318l8837l6561l5406l4058l1868k9437
62898A309548k7541k6369k5600k4722k3403k1910k0920k0617k0367j9639j8805
62887A059655j8569j8824j8657j7426j5533j4143j4135j5098j5443j3988j1566
$$ plain form
62876 886273 875989 865017 852968 841481 832343 825950 821770 819210 817367 814747 810437 805428 801820
62863 801820 800514 800334 799549 797564 794851 791961 789184 786704 784393 781599 777711 772924 768000 763404 759156
62848 759156 755506 753046 751919 751407 750695 749670 748727 748091 747688 747424 747248 747109 747105 747522 748471 749669 750800
62831 750800 751860 752897 753701 754100 754295 754419 753898 751749 747574 742018 736322 731647 728614 726946 725551
62816 725551 723374 720340 717365 715564 715639 717711 721147 724528 726291 725708 723214 719911 716962 715192 714721
62801 714721 714872 714763 714122 713398 713211 713894 715323 716812 717375 716607 715302 714778 715621 717398 719357 720886 721445
62784 721445 720808 719568 718894 719521 721189 723107 724697 725985 727558 729997 733012 735383 736272 736331 736904 738374
62768 738374 740039 741461 743096 745562 749096 753748 759286 764854 769610 773876 778816 784784 790934 796701
$$ packed form
62876H86273j0284j0972j2049j1487r138o393m180k560j843k620m310n009l608
62863H01820j306j80p85j985k713k890k777k480k311k794l888m787m924m596m248
62848G59156l650k460j127n12p12j025r43o36m03k64j76j39mM17R49J198J131
62831G50800J060J037Q04L99J95J24n21k149m175n556n696m675l033j668j395
62816G25551k177l034k975j801P5K072L436L381J763n83k494l303k949j770m71
62801G14721J51j09o41p24j87O83J429J489N63p68j305n24Q43J777J959J529N59
62784G21445o37j240o74O27J668J918J590J288J573K439L015K371Q89N9N73J470
62768G38374J665J422J635K466L534M652N538N568M756M266M940N968O150N767
$$ plain form
62754 796701 802686 809586 817107 824596 832108 840407 850477 863287 879131 896752 914095 930606 947933
62741 947933 967591 988833 1009800 1030037 1050717 1072929 1097019 1123386 1152639 1184739 1218956
62730 1218956 1255048 1293992 1337395 1386596 1442256 1504189 1571437 1642995 1718722 1799319 1885254
62719 1885254 1975839 2069395 2164267 2259671 2355344 2450122 2541095 2624662 2698210 2760057 2808091
62708 2808091 2839956 2855109 2855364 2842470 2816197 2775932 2723258 2661444 2592724 2517384 2435400 2347772
62696 2347772 2256312 2163332 2071662 1983796 1900438 1820480 1742723 1667205 1594944 1527035 1464065
62685 1464065 1405783 1351369 1300586 1254486 1214177 1179018 1146912 1116445 1087798 1061553 1037784
62674 1037784 1016684 998915 984485 972018 959987 948330 938249 930767 926001 923461 922377 921883
$$ packed form
62754G96701N985O900P521P489P512Q299J0070J2810J5844J7621J7343J6511J7327
62741I47933J9658K1242K0967K0237K0680K2212K4090K6367K9253L2100L4217
62730A218956L6092L8944M3403M9201N5660O1933O7248P1558P5727Q0597Q5935
62719A885254R0585R3556R4872R5404R5673R4778R0973Q3567P3548O1847M8034
62708B808091L1865J5153K55j2894k6273m0265n2674o1814o8720p5340q1984q7628
62696B347772r1460r2980r1670q7866q3358p9958p7757p5518p2261o7909o2970
62685A464065n8282n4414n0783m6100m0309l5159l2106l0467k8647k6245k3769
62674A037784k1100j7769j4430j2467j2031j1657j0081p482m766k540j084m94
$$ plain form
62662 921883 921461 921301 922004 924074 927919 934081 942970 954468 968199 984249 1003169 1025058 1048942
62649 1048942 1073477 1098446 1125438 1156815 1193855 1235853 1280986 1328066 1377517 1430694 1488143
62638 1488143 1548442 1609093 1668749 1728200 1788566 1848769 1905691 1956877 2001993 2041167 2072946
62627 2072946 2094917 2105799 2105906 2095838 2075804 2046193 2007859 1961564 1907875 1848057 1784595 1720409
62615 1720409 1657491 1596268 1536058 1476255 1417328 1360717 1307693 1258500 1212706 1170004 1130409
62604 1130409 1094013 1060810 1030390 1001652 973492 946215 921454 900010 880435 860716 840763
62593 840763 822182 806011 791974 779800 769848 762028 755157 747909 739860 731479 723743 717856 714508
62580 714508 713129 712339 711254 709829 708130 706129 704232 703100 702765 702662 702674 703227 704173 704570 704098 703830 704869
$$ packed form
62662I21883m22j60P03K070L845O162Q889J1498J3731J6050J8920K1889K3884
62649A048942K4535K4969K6992L1377L7040M1998M5133M7080M9451N3177N7449
62638A488143O0299O0651N9656N9451O0366O0203N6922N1186M5116L9174L1779
62627B072946K1971J0882J07j0068k0034k9611l8334m6295n3689n9818o3462o4186
62615A720409o2918o1223o0210n9803n8927n6611n3024m9193m5794m2702l9595
62604A130409l6396l3203l0420k8738k8160k7277k4761k1444j9575j9719j9953
62593H40763j8581j6171j4037j2174r952p820o871p248q049q381p736n887l348
62580G14508j379p90j085j425j699k001j897j132l35j03J2N53R46L97m72k68J039
$$ plain form
62563 704869 706783 708057 707967 707628 709204 714133 721937 730774 739301 747680 756566 765927 775654 786639 799945
62548 799945 815211 831209 847870 866323 886943 908969 932374 958506 988242 1020944 1055975
62537 1055975 1093822 1134753 1177632 1221210 1265545 1310954 1356382 1400013 1440842 1478452 1511694
62526 1511694 1538677 1557860 1568512 1570525 1564412 1550991 1530555 1503183 1470366 1435094 1399133 1361299
62514 1361299 1319866 1275876 1232429 1191269 1151816 1113370 1076416 1041585 1008940 978769 951762
62503 951762 927877 906063 885544 866377 848455 831174 814732 800655 790019 781749 773588 764430
62491 764430 755030 746739 740292 735735 732840 731234 730372 729604 728367 726477 724360 722991 723445 726305 731166
62476 731166 736633 741070 743747 745303 747004 749724 753732 759123 765971 774110 783185 793129 804435 817805
$$ packed form
62563G04869J914J274r0l39J576M929P804Q837Q527Q379Q886R361R727J0985J3306
62548G99945J5266J5998J6661J8453K0620K2026K3405K6132K9736L2702L5031
62537A055975L7847M0931M2879M3578M4335M5409M5428M3631M0829L7610L3242
62526A511694K6983J9183J0652K013o113j3421k0436k7372l2817l5272l5961l7834
62514A361299m1433m3990m3447m1160l9453l8446l6954l4831l2645l0171k7007
62503I51762k3885k1814k0519j9167j7922j7281j6442j4077j0636q270q161r158
62491G64430r400q291o447m557k895j606q62p68j237j890k117j369M54K860M861
62476G31166N467M437K677J556J701K720M008N391O848Q139R075R944J1306J3370
$$ plain form
62462 817805 833515 851230 870659 892440 917964 947950 981502 1016977 1053354 1090149 1126685
62451 1126685 1162726 1199424 1237923 1276802 1312608 1343425 1370007 1392625 1409072 1417643 1420279 1420390
62439 1420390 1418672 1413568 1405089 1395328 1385264 1373815 1360620 1347364 1335557 1325246 1317018 1313171
62427 1313171 1315222 1321728 1330208 1340261 1353378 1370566 1391579 1415778 1442256 1469466 1495982 1521444
62415 1521444 1545706 1567277 1583610 1592947 1595238 1591575 1583312 1571289 1555080 1533362 1505754 1473771
62403 1473771 1439012 1401071 1358636 1312397 1265384 1220285 1177834 1138120 1101875 1069489 1039845
62392 1039845 1011469 984448 960284 940001 923205 908926 896630 886196 877411 869834 863083 857175
62380 857175 852617 849983 849206 849382 849534 849528 850049 851674 854042 855854 855529 852117 845965 838441 830677 822581
$$ packed form
62462H17805J5710J7715J9429K1781K5524K9986L3552L5475L6377L6795L6536
62451A126685L6041L6698L8499L8879L5806L0817K6582K2618J6447Q571K636J11
62439A420390j718n104q479r761j0064j1449j3195j3256j1807j0311q228l847
62427A313171K051O506Q480J0053J3117J7188K1013K4199K6478K7210K6516K5462
62415A521444K4262K1571J6333R337K291l663q263j2023j6209k1718k7608l1983
62403A473771l4759l7941m2435m6239m7013m5099m2451l9714l6245l2386k9644
62392A039845k8376k7021k4164k0283j6796j4279j2296j0434q785p577o751n908
62380H57175m558k634p77J76J52oN21J625K368J812l25l412o152p524p764q096
$$ plain form
62364 822581 813388 803151 793129 784470 776972 769546 761546 753231 745257 738262 732679 728227 723627 717674
62350 717674 710832 705060 701666 699907 698156 695853 693658 692152 691319 691260 692558 695564 699819 704513 709281
62335 709281 714241 719355 724114 728053 731466 735347 740438 746523 752916 759451 766590 774724 784061 795209
62321 795209 809036 825476 843059 860241 876994 894774 915221 938995 965369 992815 1020662
62310 1020662 1050331 1083957 1121487 1160499 1199822 1241949 1290311 1345141 1403940 1465574 1531822
62299 1531822 1604680 1684006 1768438 1857216 1950199 2046796 2145215 2242040 2332560 2412656 2480565
62288 2480565 2535972 2577747 2604233 2615751 2614708 2602535 2578359 2541707 2494737 2440367 2379577
62277 2379577 2312213 2239477 2164032 2088311 2013989 1942410 1874117 1808565 1745563 1686404 1632386
$$ packed form
62364H22581r193j0237j0022q659p498p426q000q315p974o995n583m452m600n953
62350G17674o842n772l394j759j751k303k195j506q33n9J298L006M255M694M768
62335G09281M960N114M759L939L413L881N091O085O393O535P139Q134R337J1148
62321G95209J3827J6440J7583J7182J6753J7780K0447K3774K6374K7446K7847
62310A020662K9669L3626L7530L9012L9323M2127M8362N4830N8799O1634O6248
62299A531822P2858P9326Q4432Q8778R2983R6597R8419R6825R0520Q0096O7909
62288B480565N5407M1775K6486J1518j043j2173k4176l6652m6970n4370o0790
62277B379577o7364p2736p5445p5721p4322p1579o8293o5552o3002n9159n4018
$$ plain form
62266 1632386 1582913 1536552 1493265 1453865 1417748 1383081 1349174 1316867 1286333 1256243 1225580
62255 1225580 1194885 1165171 1136758 1109720 1084415 1061060 1039643 1020448 1003682 988429 973245
62244 973245 958219 945198 935339 927612 920461 913913 909068 906262 904611 902840 899916 895617 891312 889576
62230 889576 892075 898070 905594 913500 921710 930132 938475 946920 955926 965314 974461 983561 993900 1006430
62216 1006430 1020652 1035464 1050948 1068674 1089939 1114102 1139302 1164882 1192343 1223452 1258181
62205 1258181 1295500 1335686 1380500 1431146 1487387 1548952 1616475 1690435 1770345 1855628 1946131
62194 1946131 2040895 2137443 2233196 2326482 2414966 2494234 2559806 2610216 2646666 2669980 2679502
62183 2679502 2674835 2656904 2626827 2585041 2532108 2469403 2398521 2320850 2238108 2152481 2065785
$$ packed form
62266A632386m9473m6361m3287l9400l6117l4667l3907l2307l0534l0090l0663
62255A225580l0695k9714k8413k7038k5305k3355k1417j9195j6766j5253j5184
62244I73245j5026j3021r859p727p151o548m845k806j651j771k924m299m305j736
62230H89576K499N995P524P906Q210Q422Q343Q445R006R388R147R100J0339J2530
62216A006430J4222J4812J5484J7726K1265K4163K5200K5580K7461L1109L4729
62205A258181L7319M0186M4814N0646N6241O1565O7523P3960P9910Q5283R0503
62194A946131R4764R6548R5753R3286Q8484P9268O5572N0410L6450K3314R522
62183B679502m667j7931l0077m1786n2933o2705p0882p7671q2742q5627q6696
$$ plain form
62172 2065785 1979192 1894026 1812100 1734967 1663609 1599015 1542017 1491988 1446614 1403815 1363485
62161 1363485 1326874 1294929 1267776 1245131 1226307 1210128 1195637 1182846 1172368 1164545 1159260 1156176
62149 1156176 1154539 1153038 1150558 1147128 1143686 1141032 1139334 1138416 1137928 1137188 1135452 1132679 1129891 1128461 1128926
62134 1128926 1130534 1132133 1133518 1135596 1139074 1143557 1148551 1154904 1164146 1176421 1190233 1204503 1219776
62121 1219776 1236861 1255437 1274955 1295908 1318980 1343517 1368206 1393124 1419946 1450103 1483745
62110 1483745 1520718 1561630 1607600 1659507 1717682 1781735 1850416 1921951 1994567 2066381 2134907
62099 2134907 2197258 2250916 2294099 2325738 2345750 2355098 2354745 2344568 2324068 2294136 2257208 2215364
62087 2215364 2168959 2117388 2060593 1999647 1936629 1874273 1815068 1760262 1710007 1664449 1623938
$$ packed form
62172B065785q6593q5166q1926p7133p1358o4594n6998n0029m5374m2799m0330
62161A363485l6611l1945k7153k2645j8824j6179j4491j2791j0478p823n285l084
62149A156176j637j501k480l430l442k654j698r18m88p40j736k773k788j430M65
62134A128926J608J599J385K078L478M483M994O353R242J2275J3812J4270J5273
62121A219776J7085J8576J9518K0953K3072K4537K4689K4918K6822L0157L3642
62110A483745L6973M0912M5970N1907N8175O4053O8681P1535P2616P1814O8526
62099B134907O2351N3658M3183L1639K0012R348l53j0177k0500k9932l6928m1844
62087B215364m6405n1571n6795o0946o3018o2356n9205n4806n0255m5558m0511
$$ plain form
62076 1623938 1588144 1556044 1527303 1502674 1482322 1464631 1447723 1431555 1417460 1406038 1396738
62065 1396738 1389363 1384634 1382728 1382244 1381365 1379573 1377573 1375759 1373412 1369516 1363990 1357869 1352372 1347969
62051 1347969 1344354 1341021 1337638 1333814 1328850 1321972 1312875 1302065 1290759 1280399 1271949 1265491 1260516
62038 1260516 1256686 1254286 1254016 1256500 1261864 1269480 1278090 1286568 1294779 1303661 1314458 1327980 1344351
62025 1344351 1362946 1382542 1402152 1422063 1443733 1468348 1495613 1524177 1553011 1582221 1612753
62014 1612753 1645618 1681300 1719758 1760888 1804773 1851199 1899180 1947575 1996313 2046490 2099058
62003 2099058 2153858 2210059 2266783 2322591 2374608 2418912 2452184 2473207 2483068 2483894 2476986 2461931
61991 2461931 2437646 2404114 2362600 2314209 2259067 2197295 2130229 2060111 1988921 1917751 1846999
$$ packed form
62076A623938l5794l2100k8741k4629k0352j7691j6908j6168j4095j1422r300
62065A396738p375m729j906m84q79j792k000j814k347l896n526o121n497m403
62051A347969l615l333l383l824m964o878r097j0810j1306j0360q450o458m975
62038A260516l830k400k70K484N364P616Q610Q478Q211Q882J0797J3522J6371
62025A344351J8595J9596J9610J9911K1670K4615K7265K8564K8834K9210L0532
62014A612753L2865L5682L8458M1130M3885M6426M7981M8395M8738N0177N2568
62003B099058N4800N6201N6724N5808N2017M4304L3272K1023R861Q26o908j5055
61991B461931k4285l3532m1514m8391n5142o1772o7066p0118p1190p1170p0752
$$ plain form
61980 1846999 1776902 1708268 1642730 1581706 1524900 1470646 1418100 1368352 1322923 1282101 1245379
61969 1245379 1212486 1182870 1154967 1127406 1100728 1076727 1056186 1038217 1021620 1005731 989996
61958 989996 974065 958598 944945 933529 923293 913158 903356 894942 888537 883980 880775 878512 877082
61945 877082 876636 877190 878433 880296 883428 888418 894607 900471 905165 909036 912599 915874 918846 921542 923321
61930 923321 923058 920638 917434 914537 911181 905825 898394 890393 882849 875007 865456 854050 842240 831687
61916 831687 822952 815675 809759 805734 803654 802102 799079 794085 788794 785343 784135 783529 781539 777609
61902 777609 772748 768185 764259 760840 758459 758115 759740 761757 762862 763692 765944 770405 776655 784192 792740
61887 792740 801796 811154 821752 834807 850143 866614 884025 902976 922654 940745 956404 971611
$$ packed form
61980A846999p0097o8634o5538o1024n6806n4254n2546m9748m5429m0822l6722
61969A245379l2893k9616k7903k7561k6678k4001k0541j7969j6597j5889j5735
61958I89996j5931j5467j3653j1416j0236j0135r802q414o405m557l205k263j430
61945H77082m46N54J243J863L132M990O189N864M694L871L563L275K972K696J779
61930I23321k63k420l204k897l356n356p431q001p544p842r551j1406j1810j0553
61916H31687q735p277n916m025k080j552l023m994n291l451j208o06j990l930
61902G77609m861m563l926l419k381l44J625K017J105Q30K252M461O250P537Q548
61887G92740R056R358J0598J3055J5336J6471J7411J8951J9678J8091J5659J5207
$$ plain form
61875 971611 988417 1006255 1023409 1039792 1056489 1073422 1089444 1104310 1118536 1131192 1139783 1143019
61863 1143019 1142446 1140590 1138496 1135764 1132079 1127724 1123044 1118271 1113803 1110236 1108193 1108318 1111179 1116861
61849 1116861 1124924 1134964 1146892 1160271 1173705 1185513 1194998 1202601 1208791 1213338 1215838 1216258 1214371
61836 1214371 1209089 1199388 1185994 1171345 1157480 1144478 1131287 1117315 1102610 1087216 1071406 1056240
61824 1056240 1042877 1031343 1020746 1010481 1000367 989958 979076 968983 961511 956601 952160 946938
61812 946938 942087 938909 936546 933438 930086 928621 930066 933654 938760 945938 955707 967590 980855 995355
61798 995355 1011172 1028137 1046205 1065838 1087599 1111627 1137673 1165415 1194650 1225390 1257644
61787 1257644 1290822 1323497 1354257 1382755 1409508 1434666 1457312 1475870 1488884 1495658 1496637 1493148
$$ packed form
61875I71611J6806J7838J7154J6383J6697J6933J6022J4866J4226J2656Q591L236
61863A143019n73j856k094k732l685m355m680m773m468l567k043J25K861N682
61849A116861Q063J0040J1928J3379J3434J1808R485P603O190M547K500M20j887
61836A214371n282r701j3394j4649j3865j3002j3191j3972j4705j5394j5810j5166
61824A056240j3363j1534j0597j0265j0114j0409j0882j0093p472m910m441n222
61812I46938m851l178k363l108l352j465J445L588N106P178R769J1883J3265J4500
61798I95355J5817J6965J8068J9633K1761K4028K6046K7742K9235L0740L2254
61787A257644L3178L2675L0760K8498K6753K5158K2646J8558J3014O774R79l489
$$ plain form
61775 1493148 1486437 1477215 1466410 1455648 1446109 1437324 1428301 1419859 1414661 1414598 1418996 1425778 1433428 1441180
61761 1441180 1448110 1453000 1454947 1453509 1448390 1439403 1426533 1409623 1388184 1362057 1332295 1301010
61749 1301010 1270190 1240675 1212202 1184208 1156565 1129657 1103847 1079025 1054813 1031184 1008729
61738 1008729 988291 970371 954800 940860 927773 915268 903680 893389 884288 875927 868024 860627
61726 860627 853913 848074 843164 838740 833825 827775 821235 815798 812514 810889 809438 807151 804458 802755
61712 802755 802825 803675 803346 801052 798008 795838 794839 794521 795133 797369 800778 803765 805495 806674 808035 809161
61696 809161 809565 810021 811755 814667 817181 817741 816035 813141 811061 811500 814088 816045 814682 810377 806179
61681 806179 804266 803689 802003 798184 793142 788130 783805 780759 779819 781298 784419 787886 790784 792776 793856
$$ packed form
61775A493148o711r222j0805j0762r539q785r023q442n198o3M398O782P650P752
61761A441180O930M890J947j438n119q987j2870j6910k1439k6127k9762l1285
61749A301010l0820k9515k8473k7994k7643k6908k5810k4822k4212k3629k2455
61738A008729k0438j7920j5571j3940j3087j2505j1588j0291r101q361p903p397
61726H60627o714n839m910m424m915o050o540n437l284j625j451k287k693j703
61712H02755P0Q50l29k294l044k170r99l18O12K236L409K987J730J179J361J126
61696H09161M04M56J734K912K514N60j706k894k080M39K588J957j363m305m198
61681H06179j913n77j686l819n042n012m325l046r40J479L121L467K898J992J080
$$ plain form
61666 793856 794229 794205 793954 793509 793084 793084 793622 794429 795415 796805 798369 799138 798509 797093 795731 794195 791977 789973
61648 789973 789838 791402 792177 790211 786379 782963 780786 778741 775614 771362 766776 762748 759832 757869 755986
61633 755986 753286 749391 744234 737869 730876 724422 719382 715770 713280 711637 710058 707440 703935 701290
61619 701290 700380 699367 695924 690718 686762 685385 684726 682572 678950 675135 671635 668268 665231 662954 661349
61604 661349 660005 658806 657822 657025 656530 656650 657262 657603 657183 656539 656633 657785 659504 661099 662236 663166 664443
61587 664443 666198 667866 669129 670809 673900 677899 681279 683711 686494 690385 694375 697311 699354 700704
61573 700704 700103 696241 690140 684591 681187 679033 676432 672838 668940 665574 662878 660113 656240 651029
61559 651029 645463 640757 637124 633958 630898 628118 625613 622791 618959 613992 608580 603826 600181 596574
$$ packed form
61666G93856L73k4k51m45m25%N38Q07R86J390J564P69o29j416j362j536k218k004
61648G89973j35J564P75j966l832l416k177k045l127m252m586m028k916j963j883
61633G55986k700l895n157o365o993o454n040l612k490j643j579k618l505k645
61619G01290r10j013l443n206l956j377o59k154l622l815l500l367l037k277j605
61604F61349j344j199r84p97m95J20O12L41m20o44R4J152J719J595J137R30J277
61587F64443J755J668J263J680L091L999L380K432K783L891L990K936K043J350
61573G00704o01l862o101n549l404k154k601l594l898l366k696k765l873n211
61559F51029n566m706l633l166l060k780k505k822l832m967n412m754l645l607
$$ plain form
61545 596574 591227 583790 576079 570109 565929 562167 558101 554101 550368 546485 542349 538414 534624 530012
61531 530012 523912 516944 510314 504480 498940 493055 486777 480780 476063 473314 472543 473298 474958 476541 476699
61516 476699 474710 471527 469107 468414 468536 468030 466650 465475 465632 467237 469303 470447 469862 467856 465494
61501 465494 463768 463164 463778 465342 467151 468388 468663 468068 466833 465431 464854 466060 468901 472149 474840
61486 474840 477123 479563 482193 484706 487035 489211 490974 492060 492604 492787 492385 491264 490090 489840 490618
61471 490618 491594 492201 492696 493369 493822 493546 492808 492411 492626 492799 492038 490137 487858 486459 486741 488248 489437
61454 489437 489010 487163 485299 484419 484140 483521 482613 482665 484686 488070 490997 492101 491527 490312 489102 487835
61438 487835 486490 485612 485836 487224 489448 492360 495852 499077 500413 498741 494741 490647 488552 488906 490545
$$ packed form
61545E96574n347p437p711n970m180l762m066m000l733l883m136l935l790m612
61531E30012o100o968o630n834n540n885o278n997m717k749p71P55J660J583J58
61516D76699j989l183k420o93J22n06j380j175J57J605K066J144n85k006k362
61501D65494j726o04O14J564J809J237K75n95j235j402n77J206K841L248K691
61486D74840K283K440K630K513K329K176J763J086N44J83m02j121j174k50P78
61471D90618R76O07M95O73M53k76p38l97K15J73p61j901k279j399K82J507J189
61454D89437m27j847j864q80k79o19r08N2K021L384K927J104n74j215j210j267
61438D87835j345q78K24J388K224K912L492L225J336j672m000m094k095L54J639
$$ plain form
61423 490545 492081 493331 495378 499174 504162 508478 510660 510966 510894 511544 512658 513171 512535 511358 510736 511094
61407 511094 511960 512962 514494 516932 519501 520777 520282 518790 517004 514921 512846 511841 512350 513330 513838
61392 513838 514645 516849 519455 520203 518886 518014 519510 522241 523916 524236 524830 526755 529474 532155 534706
61377 534706 537356 540156 543262 546969 551079 554755 557534 560143 563818 568866 574257 578603 581181 581966
61363 581966 581174 579262 577181 576120 576835 579485 583952 589727 595397 599138 600394 600538 601225 602526 603473
61348 603473 603931 604723 605984 606610 605729 603760 601613 599621 597762 596144 594704 593010 590912 588826 586843
61333 586843 584182 580325 576282 573870 573840 575362 577354 579604 582366 585226 586882 586282 584044 582328 582830
61318 582830 585086 587310 588733 590169 592253 594413 596244 598721 602881 607969 612162 614777 616617 618285
$$ packed form
61423D90545J536J250K047L796M988M316K182L06p2O50J114N13o36j177o22L58
61407E11094Q66J002J532K438K569J276m95j492j786k083k075j005N09R80N08
61392E13838Q07K204K606P48j317q72J496K731J675L20N94J925K719K681K551
61377E34706K650K800L106L707M110L676K779K609L675N048N391M346K578P85
61363E81966p92j912k081j061P15K650M467N775N670L741J256J44O87J301R47
61348F03473M58P92J261O26q81j969k147j992j859j618j440j694k098k086j983
61333E86843k661l857m043k412l0J522J992K250K762K860J656o00k238j716N02
61318E82830K256K224J423J436K084K160J831K477M160N088M193K615J840J668
$$ plain form
61304 618285 619529 620534 622658 627054 633065 638639 642254 644260 646628 651572 659981 670723 681461 690426
61290 690426 697662 704740 713323 723791 734905 744756 752172 757342 761257 764829 768624 772894 777351 781028
61276 781028 782976 783324 783448 784842 787867 791722 795532 799133 802539 804959 805139 802980 800207 798807 799225
61261 799225 800725 802962 806060 809429 811996 813966 817025 822188 828586 835065 841894 849888 858848 868093
61247 868093 877816 888603 900052 911247 922316 934149 946485 957518 965641 970571 972563 971720 968562
61234 968562 964353 960123 955791 950679 944434 937150 929185 921278 914288 908221 901924 894401 886283 879355
61220 879355 874595 871226 867910 864420 861658 860285 859989 860335 861675 864581 868686 872894 876798 881172 886808
61205 886808 893543 900809 908466 916549 924703 932643 940964 950840 962771 975879 988449 999150 1008044
$$ packed form
61304F18285J244J005K124M396O011N574L615K006K368M944Q409J0742J0738Q965
61290F90426P236P078Q583J0468J1114R851P416N170L915L572L795M270M457L677
61276G81028J948L48J24J394L025L855L810L601L406K420J80k159k773j400M18
61261G99225J500K237L098L369K567J970L059N163O398O479O829P994Q960R245
61247H68093R723J0787J1449J1195J1069J1833J2336J1033Q123M930J992q43l158
61234I68562m209m230m332n112o245p284p965p907o990o067o297p523q118o928
61220H79355m760l369l316l490k762j373k96L46J340K906M105M208L904M374N636
61205H86808O735P266P657Q083Q154P940Q321R876J1931J3108J2570J0701Q894
$$ plain form
61192 1008044 1016361 1024815 1032169 1036336 1037154 1037074 1038410 1040792 1042164 1041508 1039430 1036700 1033576 1030498 1028116
61177 1028116 1026450 1024861 1023056 1021301 1019579 1017381 1014637 1012168 1010876 1010796 1011192 1011402 1011713 1013532 1018198
61162 1018198 1025187 1032001 1036559 1039309 1042339 1046975 1053188 1060671 1069021 1077095 1083893 1090295 1098342 1108177
61148 1108177 1117084 1122548 1125206 1127728 1131572 1136059 1140296 1144734 1150643 1158783 1168998 1180677 1193314
61135 1193314 1206769 1221239 1237013 1254114 1272071 1290077 1307388 1323415 1337248 1347607 1354064
61124 1354064 1358270 1362912 1368952 1374724 1378234 1379413 1379331 1378281 1375938 1372664 1369097 1364748 1358477 1350327
61110 1350327 1341543 1332822 1323853 1314606 1305502 1296049 1284894 1271904 1258814 1247026 1235884 1224005
61098 1224005 1211255 1198314 1185142 1171103 1156296 1141719 1128251 1116272 1106198 1098627 1093770 1091050
$$ packed form
61192A008044Q317Q454P354M167Q18q0J336K382J372o56k078k730l124l078k382
61177A028116j666j589j805j755j722k198k744k469j292q0L96K10L11J819M666
61162A018198O989O814M558K750L030M636O213P483Q350Q074O798O402Q047R835
61148A108177Q907N464K658K522L844M487M237M438N909Q140J0215J1679J2637
61135A193314J3455J4470J5774J7101J7957J8006J7311J6027J3833J0359O457
61124A354064M206M642O040N772L510J179q2j050k343l274l567m349o271q150
61110A350327q784q721q969r247r104r453j1155j2990j3090j1788j1142j1879
61098A224005j2750j2941j3172j4039j4807j4577j3468j1979j0074p571m857k720
$$ plain form
61086 1091050 1089369 1087612 1085020 1081225 1075920 1068623 1059185 1048639 1039083 1032304 1028508 1026476 1024919 1023672
61072 1023672 1023597 1025284 1028011 1030513 1032868 1036919 1044394 1055210 1068134 1082398 1097993 1115034 1133755
61059 1133755 1154590 1177332 1200874 1224823 1250679 1280023 1312046 1344410 1376217 1408501 1441869
61048 1441869 1475383 1507915 1539067 1568478 1595665 1620755 1643936 1664085 1679576 1690704 1699543
61037 1699543 1706857 1710911 1709992 1704416 1695177 1682374 1666221 1648264 1630129 1611710 1591552 1568485
61025 1568485 1542500 1514964 1488317 1464382 1442517 1420652 1398344 1377175 1357870 1339236 1320876
61014 1320876 1304693 1292152 1282007 1272571 1264574 1259756 1257940 1257582 1258249 1260579 1264713 1270758 1280022 1293600
61000 1293600 1310094 1326754 1342812 1360099 1380713 1405683 1435498 1469926 1507234 1545389 1584493
$$ packed form
61086A091050j681j757k592l795n305p297r438j0546r556o779l796k032j557j247
61072A023672p5J687K727K502K355M051P475J0816J2924J4264J5595J7041J8721
61059A133755K0835K2742K3542K3949K5856K9344L2023L2364L1807L2284L3368
61048A441869L3514L2532L1152K9411K7187K5090K3181K0149J5491J1128Q839
61037A699543P314M054r19n576r239j2803j6153j7957j8135j8419k0158k3067
61025A568485k5985k7536k6647k3935k1865k1865k2308k1169j9305j8634j8360
61014A320876j6183j2541j0145r436p997m818j816l58O67K330M134O045R264J3578
61000A293600J6494J6660J6058J7287K0614K4970K9815L4428L7308L8155L9104
$$ plain form
60989 1584493 1626749 1673828 1725498 1780924 1839998 1903058 1970367 2042276 2119251 2201616 2289885
60978 2289885 2385083 2487951 2597970 2713943 2835454 2963093 3097569 3239318 3388702 3545894
60968 3545894 3710888 3884300 4067829 4263477 4472886 4697796 4940192 5201282 5481264
60959 5481264 5780840 6102223 6448681 6825228 7240883 7708337 8240305 8848609 9548394
60950 9548394 10359997 11303571 12394212 13644781 15068721 16674426 18461365 20429052
60942 20429052 22578535 24873547 27178925 29253637 30847794 31842940 32312128 32450339
60934 32450339 32455424 32468227 32580793 32833037 33159440 33354727 33143583 32329596 30901056 29010585
60924 29010585 26869643 24658583 22499879 20468246 18601796 16910221 15387322 14022169
$$ packed form
60989A584493M2256M7079N1670N5426N9074O3060O7309P1909P6975Q2365Q8269
60978B289885R5198J02868J10019J15973J21511J27639J34476J41749J49384J57192
60968C545894J64994J73412J83529J95648K09409K24910K42396K61090K79982
60959E481264K99576L21383L46458L76547M15655M67454N31968O08304O99785
60950I548394Q11603R43574J090641J250569J423940J605705J786939J967687
60942B0429052K149483K295012K305378K074712J594157R95146M69188J38211
60934C2450339N085J2803J12566K52244L26403J95287k11144q13987j428540j890471
60924B9010585k140942k211060k158704k031633j866450j691575j522899j365153
$$ plain form
60916 14022169 12801712 11710297 10732956 9858572 9077904 8380894 7758171 7202859 6708272
60907 6708272 6265711 5867015 5507649 5184811 4893996 4629938 4389679 4172074 3974999
60898 3974999 3795448 3631928 3484599 3353107 3235830 3130755 3035499 2947083 2863614 2786141
60888 2786141 2717266 2657860 2606227 2560144 2518373 2480447 2446316 2416284 2390217 2366890 2344989
60877 2344989 2324464 2305952 2289168 2272889 2256340 2239712 2223519 2208251 2194296 2181266 2167630
60866 2167630 2151880 2133868 2114346 2093634 2071497 2047826 2022439 1994636 1964029 1931661 1899326
60855 1899326 1867796 1836387 1804106 1770618 1736354 1702265 1669217 1637183 1605537 1574576 1545846
60844 1545846 1520249 1496654 1473412 1450445 1428758 1408646 1389663 1371768 1355035 1338675 1321765
$$ packed form
60916A4022169j220457j091415r77341q74384p80668o97010o22723n55312m94587
60907F708272m42561l98696l59366l22838k90815k64058k40259k17605j97075
60898C974999j79551j63520j47329j31492j17277j05075r5256q8416q3469p7473
60888B786141o8875n9406n1633m6083m1771l7926l4131l0032k6067k3327k1901
60877B344989k0525j8512j6784j6279j6549j6628j6193j5268j3955j3030j3636
60866B167630j5750j8012j9522k0712k2137k3671k5387k7803l0607l2368l2335
60855A899326l1530l1409l2281l3488l4264l4089l3048l2034l1646l0961k8730
60844A545846k5597k3595k3242k2967k1687k0112j8983j7895j6733j6360j6910
$$ plain form
60833 1321765 1304678 1288442 1272984 1257468 1242081 1227729 1213920 1198790 1181708 1164307 1148179
60822 1148179 1132777 1116403 1098340 1079348 1060962 1044899 1032226 1022193 1012505 1001516 989837
60811 989837 979223 970332 962255 953939 945369 937372 930698 925374 920696 915613 909141 900709 890662 880516
60797 880516 872013 865373 859003 851586 843838 837261 831753 825948 819729 814649 811286 807699 801586 792981
60783 792981 783767 775336 767910 761558 756426 751971 747193 741910 736917 732600 728238 723151 717775 712978
60769 712978 708890 705164 702022 700056 699090 698180 697029 696548 697481 699222 700750 702188 704394 707099 708588
60754 708588 707569 704723 701992 700829 701389 702832 703873 703353 700894 697162 693447 690908 690022 690350 690905
60739 690905 691063 691040 691152 690964 689858 688196 687011 686505 685779 684137 681641 678191 673237 666885 660217 653919
$$ packed form
60833A321765j7087j6236j5458j5516j5387j4352j3809j5130j7082j7401j6128
60822A148179j5402j6374j8063j8992j8386j6063j2673j0033r688j0989j1679
60811I89837j0614q891q077q316q570p997o674n324m678n083o472q432j0047j0146
60797H80516q503o640o370p417p748o577n508n805o219n080l363l587o113q605
60783G92981r214q431p426o352n132m455m778n283m993m317m362n087n376m797
60769G12978m088l726l142j966r66r10j151m81R33J741J528J438K206K705J489
60754G08588j019k846k731j163N60J443J041n20k459l732l715k539q86L28N55
60739F90905J58k3J12j88j106j662j185n06p26j642k496l450m954o352o668o298
$$ plain form
60723 653919 647596 641117 635558 631844 629312 626597 623181 619139 614200 608262 602251 597341 593809 591657
60709 591657 591569 593899 597202 599275 599432 598522 597137 595291 593679 593491 594794 596587 598684 602065 606988
60694 606988 612279 617022 621581 626184 629855 631739 632537 633731 636131 639884 644934 650468 654728 656537
60680 656537 656553 655976 654448 650382 643201 634167 624988 616605 609502 604150 600416 597072 592562 586242 578644
60665 578644 570710 563119 556220 550192 545125 541078 538112 536040 534196 531910 529507 528334 529139 530700
60651 530700 530898 529154 526880 525369 524360 523294 522866 524208 527104 530170 532480 534035 534959 535347 535776
60636 535776 536821 538051 538561 538570 539321 541193 543065 544048 544892 547020 550918 556015 561554 566985 572046 577022
60620 577022 582545 588762 595114 601257 607691 615057 623248 631530 639112 645334 649828 652904 655250 656853
$$ packed form
60723F53919o323o479n559l714k532k715l416m042m939n938o011m910l532k152
60709E91657q8K330L303K073J57r10j385j846j612j88J303J793K097L381M923
60694F06988N291M743M559M603L671J884P98J194K400L753N050N534M260J809
60680F56537J6n77j528m066p181r034r179q383p103n352l734l344m510o320p598
60665E78644p934p591o899o028n067m047k966k072j844k286k403j173Q05J561
60651E30700J98j744k274j511j009j066m28J342K896L066K310J555R24L88M29
60636E35776J045J230N10RP51J872J872R83Q44K128L898N097N539N431N061M976
60620E77022N523O217O352O143O434P366Q191Q282P582O222M494L076K346J603
$$ plain form
60606 656853 656767 654470 651001 648145 646780 646444 646179 645290 643516 641015 638090 634727 630696 626399 623064
60591 623064 621602 621582 621923 622200 622598 622783 621829 619518 617063 615954 616237 616221 613930 608755 601689 594113 586641
60574 586641 579331 572742 568156 566488 567236 568758 569467 568673 566661 564273 562387 561563 562071 563912 566455
60559 566455 568270 568063 566109 564264 564255 566246 569227 572189 574530 575973 576898 578495 581677 585784 588974
60544 588974 590168 590196 590779 592732 595475 597997 599833 601075 601900 602566 603748 606302 610341 614830 618495
60529 618495 620990 622821 624410 625955 628106 631792 636913 641831 644888 646164 647258 649589 653453 658626
60515 658626 665235 673763 684498 697185 711241 726370 742989 761870 783055 805079 825427 841887
60503 841887 853649 861390 866455 869804 871502 871067 868176 862967 855959 848099 840824 835590 833107 833273
$$ packed form
60606F56853q6k297l469k856j365l36k65q89j774k501k925l363m031m297l335
60591F23064j462k0L41K77L98J85r54k311k455j109K83j6k291n175p066p576p472
60574E86641p310o589m586j668P48J522P09p94k012k388j886q24N08J841K543
60559E66455J815k07j954j845rJ991K981K962K341J443R25J597L182M107L190
60544E88974J194K8N83J953K743K522J836J242Q25O66J182K554M039M489L665
60529F18495K495J831J589J545K151L686N121M918L057J276J094K331L864N173
60515F58626O609Q528J0735J2687J4056J5129J6619J8881K1185K2024K0348J6460
60503H41887J1762P741N065L349J698m35k891n209p008p860p275n234k483J66
$$ plain form
60489 833273 835896 841120 849070 859486 871887 885700 900141 914640 929952 948315 971601 999057
60477 999057 1027241 1052398 1072838 1089223 1102928 1114291 1122333 1126029 1125700 1122962 1119319 1115112 1109914
60464 1109914 1103607 1096767 1090259 1084813 1080860 1078453 1077334 1077283 1078381 1080784 1084339 1088647 1093584 1099648
60450 1099648 1107767 1118715 1132608 1148916 1167047 1187041 1209845 1237132 1270779 1311896 1359745
60439 1359745 1411930 1466419 1523366 1584189 1648733 1714184 1777027 1835106 1887093 1930881 1963757
60428 1963757 1983951 1990991 1984610 1964393 1930913 1886428 1833820 1775122 1711481 1644291 1575740 1508039
60416 1508039 1442299 1378525 1316871 1258647 1205585 1157964 1114027 1071849 1031566 995197 964184
60405 964184 937714 913661 890782 869591 851304 836292 823549 811354 798352 784236 769720
$$ packed form
60489H33273K623N224P950J0416J2401J3813J4441J4499J5312J8363K3286K7456
60477I99057K8184K5157K0440J6385J3705J1363Q042L696l29k738l643m207n198
60464A109914o307o840o508n446l953k407j119n1J098K403L555M308M937O064
60450A099648Q119J0948J3893J6308J8131J9994K2804K7287L3647M1117M7849
60439A359745N2185N4489N6947O0823O4544O5451O2843N8079N1987M3788L2876
60428A963757K0194P040o381k0217l3480m4485n2608n8698o3641o7190o8551o7701
60416A508039o5740o3774o1654n8224n3062m7621m3937m2178m0283l6369l1013
60405I64184k6470k4053k2879k1191j8287j5012j2743j2195j3002j4116j4516
$$ plain form
60394 769720 755949 743764 733345 724436 716853 710534 705075 699534 693112 685950 678967 672987 668339
60381 668339 665104 663143 661845 660467 658929 657722 656818 655324 652568 648939 645173 641486 638025 635460
60367 635460 634131 633062 631024 628514 627395 628246 629172 627892 624334 620604 618886 619869 622678 625651 627501
60352 627501 628395 629722 632435 635893 638850 641187 643851 647148 650054 651542 651976 652672 654429 656947 659499
60337 659499 661674 663402 664583 665059 665010 665188 666434 668823 671535 673858 676017 678615 681526 684104 686445
60322 686445 689454 693253 696441 697819 698373 700528 705552 712480 719463 725268 729428 731988 733651 735568
60308 735568 738454 742217 746538 751210 755727 759365 762097 764658 767202 768747 768817 768876 770980 775326 780267
60293 780267 784521 788243 791951 795676 799553 804185 809710 815109 819059 821137 821865 821960 821846 821569 820907 819846
$$ packed form
60394G69720j3771j2185j0419q909p583o319n459n541o422p162o983n980m648
60381F68339l235j961j298j378j538j207r04j494k756l629l766l687l461k565
60367F35460j329j069k038k510j119Q51R26j280l558l730j718R83K809K973J850
60352F27501Q94J327K713L458K957K337K664L297K906J488M34O96J757K518K552
60337F59499K175J728J181M76m9J78J246K389K712K323K159K598K911K578K341
60322F86445L009L799L188J378N54K155N024O928O983N805M160K560J663J917
60308G35568K886L763M321M672M517L638K732K561K544J545P0N9K104M346M941
60293G80267M254L722L708L725L877M632N525N399L950K078P28R5j14k77o62j061
$$ plain form
60277 819846 818988 819027 819640 819545 817982 815684 813982 813381 813446 813701 814127 814954 816342 818125 819643 820118 819430 818272
60259 818272 817326 816732 816749 818418 822804 829663 837450 844866 852192 861082 873098 888219 904722 920930
60245 920930 937339 956414 979516 1004292 1025877 1040720 1048585 1050927 1048466 1040975 1028622 1012444
60233 1012444 993659 973392 953187 934973 919935 907706 897125 887628 879527 873161 868318 864597
60221 864597 861817 859734 857671 854817 850938 846574 842522 839122 836013 832609 828916 825655 823255 820876
60207 820876 817095 811665 805963 801391 798010 795203 792962 791651 790969 790094 788783 787553 786817 786584 786982
60192 786982 788289 790325 792445 794254 795750 796716 796669 795616 794318 793573 793634 794303 795083 795280 794645 793936 794195
60175 794195 795478 797094 799069 802267 806756 811078 813821 815213 816557 818716 821704 825208 828829 832195
$$ packed form
60277H19846q58L9O13r5j563k298j702o01O5K55M26Q27J388J783J518M75o88j158
60259H18272r46n94J7J669M386O859P787P416P326Q890J2016J5121J6503J6208
60245I20930J6409J9075K3102K4776K1585J4843P865K342k461p491j2353j6178
60233A012444j8785k0267k0205j8214j5038j2229j0581r497q101o366m843l721
60221H64597k780k083k063k854l879m364m052l400l109l404l693l261k400k379
60207H20876l781n430n702m572l381k807k241j311o82q75j311j230p36k33L98
60192G86982J307K036K120J809J496R66m7j053j298p45O1O69P80J97o35p09K59
60175G94195J283J616J975L198M489M322K743J392J344K159K988L504L621L366
$$ plain form
60161 832195 835348 838753 842650 846828 851225 856160 861678 867396 873381 880319 888250 895935 902266 907686
60147 907686 913533 920655 929465 940498 953585 966850 977845 985795 991865 997257 1002034 1005960 1009568
60134 1009568 1013885 1019450 1025739 1031234 1034285 1034484 1033165 1031895 1030499 1027335 1021682 1015021 1009434 1005324
60120 1005324 1001367 996425 990716 985008 979463 973895 968830 965282 963054 959982 953724 944301 934255 926380
60106 926380 921717 919484 918086 916154 913416 910885 909595 909169 908309 906637 905067 904364 904560 905957 909189
60091 909189 913640 917252 918890 919740 921401 923853 926523 930022 935081 940582 944478 946345 947541 949346
60077 949346 952456 957792 965833 975171 983520 990358 996960 1003718 1009276 1012859 1015677 1019108 1022833 1025792
60063 1025792 1027972 1030294 1033486 1037764 1042821 1047487 1050290 1051274 1052569 1056165 1061469 1065857 1067345 1066181
$$ packed form
60161H32195L153L405L897M178M397M935N518N718N985O938P931P685O331N420
60147I07686N847P122Q810J1033J3087J3265J0995P950O070N392M777L926L608
60134A009568M317N565O289N495L051J99j319j270j396l164n653o661n587m110
60120A005324l957m942n709n708n545n568n065l548k228l072o258r423j0046p875
60106I26380m663k233j398j932k738k531j290m26q60j672j570p03J96J397L232
60091I09189M451L612J638Q50J661K452K670L499N059N501L896J867J196J805
60077I49346L110N336Q041R338Q349O838O602O758N558L583K818L431L725K959
60063A025792K180K322L192M278N057M666K803R84J295L596N304M388J488j164
$$ plain form
60049 1066181 1064149 1062966 1063192 1064136 1064732 1064588 1063970 1062788 1060209 1055579 1049275 1042394 1036001 1030861 1027324
60034 1027324 1025078 1023370 1021793 1020436 1019177 1017533 1015614 1014538 1015190 1016909 1017989 1017265 1014723 1010887
60020 1010887 1006282 1001549 997472 994525 992369 989924 986064 980429 973581 966278 958793 951129 943523 936160
60006 936160 928540 919912 910419 901164 892840 884925 876589 867912 859694 852366 845546 838662 831794 825870
59992 825870 821921 819949 818748 817244 815776 815456 816458 817872 819402 822169 827105 833217 838373 841695
59978 841695 844516 848748 854710 860830 865419 868335 870595 872512 873038 871318 868157 865160 862898 860806
59964 860806 858381 855280 850558 843368 834693 826955 821243 816047 809375 801139 792726 785248 779054 774050
59950 774050 769384 763462 755463 746616 739171 734396 732184 731892 732429 731883 728594 722938 717276 713810 712967
$$ packed form
60049A066181k032j183K26R44N96j44o18j182k579m630o304o881o393n140l537
60034A027324k246j708j577j357j259j644j919j076O52J719J080p24k542l836
60020A010887m605m733m077k947k156k445l860n635o848p303p485p664p606p363
60006I36160p620q628r493r255q324p915q336q677q218p328o820o884o868n924
59992H25870l949j972j201j504j468l20J002J414J530K767M936O112N156L322
59978H41695K821M232N962O120M589K916K260J917N26j720l161k997k262k092
59964H60806k425l101m722p190q675p738n712n196o672q236q413p478o194n004
59950G74050m666n922p999q847p445m775k212k92N37n46l289n656n662l466q43
$$ plain form
59935 712967 713829 715295 716618 717512 718263 719500 721519 723914 725939 727151 727802 728748 730778 733827 737063
59920 737063 739959 742852 746016 748591 749201 747499 744472 741294 738614 736936 736654 737228 737150 735571 733586
59905 733586 733140 734794 737313 739455 741300 743485 745922 748024 749764 751636 753653 755187 755938 756267 756283
59890 756283 755345 753043 750174 748206 748087 749865 752810 755366 755798 753960 751954 751957 753611 754683 754142 753320
59874 753320 753923 756153 759175 762357 765453 768472 771904 776373 781690 786977 791983 797263 802679 807029
59860 807029 810047 813608 819692 827949 836591 845135 854730 865906 877480 888004 897089 904659 909802
59847 909802 911365 909545 906248 903542 901892 900182 897535 894764 893514 894170 895401 895939 896003 896418 897116 897352
59831 897352 897052 897120 898470 901277 905123 909390 913665 918163 923678 930667 938500 945877 951882 956564 960907
$$ packed form
59935G12967Q62J466J323Q94P51J237K019K395K025J212O51R46K030L049L236
59920G37063K896K893L164K575O10j702l027l178k680j678k82N74p8j579j985
59905G33586m46J654K519K142J845K185K437K102J740J872K017J534P51L29J6
59890G56283r38k302k869j968j19J778K945K556M32j838k006LJ654J072n41q22
59874G53320O03K230L022L182L096L019L432M469N317N287N006N280N416M350
59860H07029L018L561O084Q257Q642Q544R595J1176J1574J0524R085P570N143
59847I09802J563j820l297k706j650j710k647k771j250O56J231N38O4M15O98K36
59831H97352l00O8J350K807L846M267M275M498N515O989P833P377O005M682M343
$$ plain form
59816 960907 966396 973885 982309 989075 992429 993042 992686 992000 990576 988686 987461 987174 986599 984604 981570
59801 981570 978763 976977 976365 977082 979396 983248 988162 993618 999326 1005148 1010866 1015997 1019900 1022132 1022671
59786 1022671 1021725 1019590 1016874 1014543 1013258 1012706 1011898 1009971 1006272 999941 990280 977901 965004 953997
59772 953997 945836 939831 934746 929820 924956 920414 916508 913458 911256 909627 908184 906687 905082 903290
59758 903290 901179 898919 897138 896341 896224 895960 895136 893936 892406 890108 886756 882659 878216 873407 868237
59743 868237 863272 859190 855941 852731 848805 844023 838870 834055 829793 825295 819423 812205 805275 800402
59729 800402 797959 797300 797959 799585 800967 800427 797620 794263 792534 793022 794578 795845 796518 797192 798366 799886
59713 799886 801321 802681 804442 806787 809169 810933 812183 813662 815780 818151 820234 822133 824460 827465
$$ packed form
59816I60907N489P489Q424O766L354O13l56o86j424j890j225k87n75j995l034
59801I81570k807j786o12P17K314L852M914N456N708N822N718N131L903K232N39
59786A022671r46k135k716k331j285n52q08j927l699o331r661j2379j2897j1007
59772I53997q161o005n085m926m864m542l906l050k202j629j443j497j605j792
59758I03290k111k260j781p97j17k64q24j200j530k298l352m097m443m809n170
59743H68237m965m082l249l210l926m782n153m815m262m498n872p218o930m873
59729H00402k443o59O59J626J382n40k807l357j729M88J556J267O73O74J174J520
59713G99886J435J360J761K345K382J764J250J479K118K371K083J899K327L005
$$ plain form
59699 827465 830702 833643 836327 839029 841571 843616 845720 849345 855304 862720 870086 876846 883201 888810
59685 888810 892772 894921 896333 898468 902338 908177 914975 920592 923627 925200 927645 931318 934190 934997
59671 934997 935110 936354 938437 939834 940095 939838 939233 937980 936421 935333 934773 934193 933544 933282 933378 933118 931761
59654 931761 928847 924376 919546 916708 917377 920468 923567 925712 927764 930210 932078 932455 931978 932160 933825
59639 933825 936659 939905 943134 946599 950883 955975 960869 964477 966765 968500 970097 971304 971881 971899 971392
59624 971392 970300 968855 967575 966802 966464 966109 964947 962194 957837 952793 947906 943121 937996 932536 927051
59609 927051 921740 916975 913375 910947 908825 906596 905120 905036 905223 904040 901546 899063 896960 894531 892016
59594 892016 891084 892820 896515 900961 905853 911366 917126 922142 925325 926011 924558 922387 920764 919599 918123
$$ packed form
59699H27465L237K941K684K702K542K045K104L625N959P416P366O760O355N609
59685H88810L962K149J412K135L870N839O798N617L035J573K445L673K872Q07
59671I34997J13J244K083J397K61k57o05j253j559j088n60n80o49k62R6k60j357
59654I31761k914m471m830k838O69L091L099K145K052K446J868L77m77J82J665
59639I33825K834L246L229L465M284N092M894L608K288J735J597J207N77J8n07
59624I71392j092j445j280p73l38l55j162k753m357n044m887m785n125n460n485
59609I27051n311m765l600k428k122k229j476q4J87j183k494k483k103k429k515
59594H92016r32J736L695M446M892N513N760N016L183O86j453k171j623j165j476
$$ plain form
59579 918123 916322 914610 912395 908505 903198 898292 894769 891500 887030 881680 877137 874594 873902 873987 873578
59564 873578 871954 869358 866488 863675 860947 858514 856308 853329 848606 842830 837891 834693 832524 830588
59550 830588 828729 826433 822765 818031 814113 812255 811662 811210 811316 812857 815197 816730 816952 816665 816255 814995
59534 814995 812433 809736 809092 811615 815872 818764 818395 815969 814248 814335 814957 814969 815245 817276 820796 823715
59518 823715 824111 821757 818043 814729 812408 810016 806338 801951 798779 797644 797359 796615 795574 794954 794765
59503 794765 794932 796185 799089 802687 805145 805476 803960 801410 798853 797446 797742 799278 801538 804922 810104
59488 810104 816885 824482 832562 841221 850314 859642 869488 880250 891959 905131 921633 943166 968397
59475 968397 992480 1010085 1018771 1019593 1015310 1008528 1001089 994257 988816 984869 981929 979689 978636 979421
$$ packed form
59579I18123j801j712k215l890n307m906l523l269m470n350m543k543o92Q5m09
59564H73578j624k596k870k813k728k433k206k979m723n776m939l198k169j936
59550H30588j859k296l668m734l918j858n93m52J06J541K340J533K22k87m10j260
59534H14995k562k697o44K523M257K892l69k426j721Q7O22J2K76K031L520K919
59518H23715L96k354l714l314k321k392l678m387l172j135k85p44j041o20j89
59503G94765J67J253K904L598K458L31j516k550k557j407K96J536K260L384N182
59488H10104O781P597Q080Q659R093R328R846J0762J1709J3172J6502K1533K5231
59475I68397K4083J7605Q686Q22m283o782p439o832n441l947k940k240j053P85
$$ plain form
59461 979421 981637 983900 985344 986312 987198 987348 985800 982606 978688 974684 970641 966583 962637 958566 953759
59446 953759 947754 940526 932331 923691 915445 908354 902447 896945 891047 884868 879604 876546 875701 875607 874833
59431 874833 873444 872550 872750 873797 875622 878654 882874 887432 891609 895446 899150 902631 906045 910099 915384
59416 915384 921972 929894 939084 948475 956173 961280 964784 967956 970731 972515 973643 974848 975878 976010
59402 976010 975710 976537 979359 983726 989143 995922 1004327 1013664 1022810 1031311 1039571 1048247 1057871 1068909
59388 1068909 1081653 1095678 1109516 1121318 1130035 1135748 1138717 1138657 1135456 1130162 1124327 1118390 1111448
59375 1111448 1102791 1093076 1083879 1076529 1071318 1067292 1062962 1057831 1053141 1050579 1050638 1052895 1057237 1063709
59361 1063709 1071741 1081042 1092857 1108573 1127273 1146587 1166027 1187607 1213107 1242774 1276470 1312874
$$ packed form
59461I79421K216K263J444R68Q86J50j548l194l918m004m043m058l946m071m807
59446I53759o005p228q195q640q246p091n907n502n898o179n264l058q45r4p74
59431H74833j389q94K00J047J825L032M220M558M177L837L704L481L414M054N285
59416I15384O588P922R190R391P698N107L504L172K775J784J128J205J030J32
59402I76010l00Q27K822M367N417O779Q405R337R146Q501Q260Q676R624J1038
59388A068909J2744J4025J3838J1802Q717N713K969o0l201n294n835n937o942
59375A111448q657r715r197p350n211m026m330n131m690k562N9K257M342O472
59361A063709Q032R301J1815J5716J8700J9314J9440K1580K5500K9667L3696L6404
$$ plain form
59349 1312874 1346605 1369502 1377167 1372484 1361243 1346738 1330554 1315643 1305095 1299430 1298313 1303412
59337 1303412 1315543 1329321 1334789 1325651 1303731 1274995 1244025 1213193 1184218 1158155 1134868 1113982
59325 1113982 1095874 1081101 1069567 1060676 1053578 1047130 1040637 1034884 1031496 1031045 1032624 1035248 1038593
59312 1038593 1042365 1046167 1050175 1054775 1059378 1062810 1065040 1067333 1070522 1074412 1079137 1085584 1093883 1102789
59298 1102789 1111320 1119890 1129077 1138390 1147178 1155861 1165211 1175015 1184433 1193404 1202905 1214035 1227352
59285 1227352 1242888 1260182 1278265 1295995 1312578 1327845 1342101 1355600 1367987 1378452 1386590
59274 1386590 1392770 1397307 1399719 1399258 1395718 1389153 1379393 1366777 1352961 1339928 1328274 1317239 1306169
59261 1306169 1295008 1283616 1271691 1259466 1247717 1237173 1228617 1223005 1220336 1218732 1216005 1212083
$$ packed form
59349A312874L3731K2897P665m683j1241j4505j6184j4911j0548n665j117N099
59337A303412J2131J3778N468r138k1920k8736l0970l0832k8975k6063k3287k0886
59325A113982j8108j4773j1534q891p098o448o493n753l388m51J579K624L345
59312A038593L772L802M008M600M603L432K230K293L189L890M725O447Q299Q906
59298A102789Q531Q570R187R313Q788Q683R350R804R418Q971R501J1130J3317
59285A227352J5536J7294J8083J7730J6583J5267J4256J3499J2387J0465Q138
59274A386590O180M537K412m61l540o565r760j2616j3816j3033j1654j1035j1070
59261A306169j1161j1392j1925j2225j1749j0544q556n612k669j604k727l922
$$ plain form
59249 1212083 1208716 1207008 1206791 1208406 1213224 1221679 1232138 1242433 1251296 1257538 1259041 1253863 1241965
59236 1241965 1225210 1205952 1186014 1166428 1147555 1129620 1113255 1099147 1087212 1076685 1067078
59225 1067078 1058511 1051156 1044966 1039803 1035223 1030537 1026122 1024283 1027379 1034945 1043903 1051876 1059097 1066932
59211 1066932 1076018 1086446 1098448 1111837 1125452 1138015 1149175 1159443 1169490 1179555 1188833 1195522
59199 1195522 1198383 1198317 1197359 1196089 1193200 1187797 1180802 1173717 1167212 1161407 1156319 1151490 1146275 1141093 1137318
59184 1137318 1135483 1134674 1134154 1134315 1135408 1136799 1138365 1141319 1146417 1152407 1157509 1161647 1165981 1170759 1174819
59169 1174819 1177017 1177307 1176692 1176660 1178235 1180979 1183239 1183671 1182069 1178691 1173866 1168576 1164096 1160310 1155622
59154 1155622 1149472 1143770 1140581 1139358 1137866 1135141 1132069 1129465 1127098 1124570 1121940 1119250 1116323 1113168
$$ packed form
59249A212083l367j708k17J615M818Q455J0459J0295Q863O242J503n178j1898
59236A241965j6755j9258j9938j9586j8873j7935j6365j4108j1935j0527r607
59225A067078q567p355o190n163m580m686m415j839L096P566Q958P973P221P835
59211A066932R086J0428J2002J3389J3615J2563J1160J0268J0047J0065R278O689
59199A195522K861o6r58j270k889n403o995p085o505n805n088m829n215n182l775
59184A137318j835q09n20J61J093J391J566K954N098N990N102M138M334M778M060
59169A174819K198K90o15l2J575K744K260M32j602l378m825n290m480l786m688
59154A155622o150n702l189j223j492k725l072k604k367k528k630k690k927l155
$$ plain form
59140 1113168 1109976 1106766 1103571 1100842 1099063 1098071 1097318 1096651 1096390 1096742 1097541 1098434 1099114 1099628 1100625 1102851
59124 1102851 1106184 1109687 1112826 1115968 1119462 1123089 1126855 1131342 1136557 1141228 1144213 1146135 1148832 1153575
59110 1153575 1160485 1169069 1178419 1187235 1194685 1201219 1207985 1215515 1223392 1230960 1237897 1244224 1250090 1255337
59096 1255337 1259156 1260603 1259578 1256728 1252280 1245776 1237269 1227884 1218639 1209430 1199652 1189120 1177871
59083 1177871 1165869 1153498 1141559 1130197 1118669 1106812 1095831 1086816 1079332 1072426 1066249 1061616
59071 1061616 1058461 1055732 1052538 1048736 1044865 1042049 1041281 1042117 1042888 1042916 1043673 1046911 1052525 1059326 1066960
59056 1066960 1075753 1085385 1095201 1105358 1116246 1127146 1136853 1145429 1154035 1163100 1171920 1179972 1187345
59043 1187345 1193825 1198864 1202754 1206742 1211485 1216044 1218720 1218478 1215568 1211377 1207716 1205673 1205036 1204936 1204697
$$ packed form
59140A113168l192l210l195k729j779r92p53o67k61L52P99Q93O80N14R97K226
59124A102851L333L503L139L142L494L627L766M487N215M671K985J922K697M743
59110A153575O910Q584R350Q816P450O534O766P530P877P568O937O327N866N247
59096A255337L819J447j025k850m448o504q507r385r245r209r778j0532j1249
59083A177871j2002j2371j1939j1362j1528j1857j0981r015p484o906o177m633
59071A061616l155k729l194l802l871k816p68Q36P71K8P57L238N614O801P634
59056A066960Q793R632R816J0157J0888J0900R707Q576Q606R065Q820Q052P373
59043A187345O480N039L890L988M743M559K676k42k910m191l661k043o37j00k39
$$ plain form
59028 1204697 1203751 1201394 1197446 1192740 1188166 1183580 1178281 1172119 1165333 1157816 1149510 1141084 1133173 1125227
59014 1125227 1116192 1106201 1096630 1088558 1082039 1076675 1071924 1066907 1060871 1054045 1047421 1041741 1037153 1033573
59000 1033573 1030783 1028638 1027815 1029673 1034250 1038961 1040648 1038882 1036110 1034685 1034848 1035506 1035668 1034967 1033891
58985 1033891 1033712 1035285 1037828 1039845 1041281 1043579 1047433 1051649 1054739 1056689 1058589 1061227 1064689 1068839
58971 1068839 1073583 1078788 1084288 1090064 1096490 1104402 1114484 1126347 1138743 1151049 1163913 1177959
58959 1177959 1192725 1207707 1223475 1240446 1257240 1271908 1284483 1296589 1308394 1317661 1322365 1323024
58947 1323024 1321817 1320559 1320264 1321659 1325021 1329739 1334729 1339387 1343970 1349175 1355404 1362404 1369849 1378301
58933 1378301 1388862 1401444 1414145 1425161 1434739 1444319 1454380 1464326 1473980 1483865 1494090 1504233
$$ packed form
59028A204697r46k357l948m706m574m586n299o162o786p517q306q426p911p946
59014A125227r035r991r571q072o519n364m751n017o036o826o624n680m588l580
59000A033573k790k145q23J858M577M711J687j766k772j425J63O58J62p01j076
58985A033891j79J573K543K017J436K298L854M216L090J950J900K638L462M150
58971A068839M744N205N500N776O426P912J0082J1863J2396J2306J2864J4046
58959A177959J4766J4982J5768J6971J6794J4668J2575J2106J1805R267M704O59
58947A323024j207j258k95J395L362M718M990M658M583N205O229P000P445Q452
58933A378301J0561J2582J2701J1016R578R580J0061R946R654R885J0225J0143
$$ plain form
58921 1504233 1514339 1524992 1536413 1548478 1561338 1574973 1588490 1601337 1614950 1631556 1651209
58910 1651209 1671657 1691427 1711394 1732776 1755234 1777864 1800770 1824515 1848743 1872237 1893888
58899 1893888 1913250 1930763 1947675 1964925 1981781 1996299 2007354 2015300 2020585 2022915 2022201 2019259
58887 2019259 2015139 2010738 2007313 2005981 2006021 2004942 2001139 1995499 1989690 1983971 1977675 1970652 1962898 1953391
58873 1953391 1940786 1925103 1907791 1890272 1873225 1857064 1842114 1828223 1814835 1801689 1789127
58862 1789127 1777643 1767297 1757615 1748133 1739171 1731823 1726789 1723421 1720489 1717675 1715582 1714547 1714566 1716385
58848 1716385 1721273 1729253 1738688 1748392 1759229 1772880 1789776 1808915 1829000 1848897 1867568 1884490
58836 1884490 1899985 1914587 1928267 1940538 1950970 1959348 1965974 1972122 1979511 1988727 1998687 2008064 2016583
$$ packed form
58921A504233J0106J0653J1421J2065J2860J3635J3517J2847J3613J6606J9653
58910A651209K0448J9770J9967K1382K2458K2630K2906K3745K4228K3494K1651
58899A893888J9362J7513J6912J7250J6856J4518J1055P946N285K330p14k942
58887B019259m120m401l425j332M0j079l803n640n809n719o296p023p754r507
58873A953391j2605j5683j7312j7519j7047j6161j4950j3891j3388j3146j2562
58862A789127j1484j0346r682r482q962p348n034l368k932k814k093j035J9J819
58848A716385M888P980R435R704J0837J3651J6896J9139K0085J9897J8671J6922
58836A884490J5495J4602J3680J2271J0432Q378O626O148P389R216R960R377Q519
$$ plain form
58823 2016583 2024441 2031207 2036119 2038949 2039746 2037999 2032783 2023611 2010745 1994931 1977160 1958245 1938213
58810 1938213 1916515 1893249 1869659 1846896 1824810 1802532 1779776 1756924 1734325 1712348 1691759
58799 1691759 1673127 1655895 1638797 1621189 1603325 1585363 1566911 1547805 1528745 1510793 1494538
58788 1494538 1479933 1466522 1453485 1439846 1425252 1410544 1397131 1385599 1375238 1365119 1355133
58777 1355133 1345457 1335334 1323384 1309396 1295138 1282909 1273666 1266803 1261127 1255559 1249522 1243391 1238214
58764 1238214 1234443 1231323 1228022 1224804 1222506 1221499 1221970 1224405 1228689 1233361 1237101 1240478 1244806 1249581
58750 1249581 1252673 1253021 1251480 1248929 1245324 1241056 1237406 1234658 1231162 1225395 1217949 1210408 1203119 1195174
58736 1195174 1186080 1176369 1166763 1157473 1148251 1138801 1129395 1121188 1115381 1111758 1108650 1104654 1099933 1095669
$$ packed form
58823B016583P858O766M912K830P97j747n216r172j2866j5814j7771j8915k0032
58810A938213k1698k3266k3590k2763k2086k2278k2756k2852k2599k1977k0589
58799A691759j8632j7232j7098j7608j7864j7962j8452j9106j9060j7952j6255
58788A494538j4605j3411j3037j3639j4594j4708j3413j1532j0361j0119r986
58777A355133r676j0123j1950j3988j4258j2229r243o863n676n568o037o131n177
58764A238214l771l120l301l218k298j007M71K435M284M672L740L377M328M775
58750A249581L092L48j541k551l605m268l650k748l496n767p446p541p289p945
58736A195174r094r711r606r290r222r450r406q207n807l623l108l996m721m264
$$ plain form
58722 1095669 1092944 1092425 1094351 1098184 1102710 1106865 1110215 1112501 1113319 1112526 1110513 1107929 1105433 1103485 1101749
58707 1101749 1098951 1094340 1089112 1085159 1082387 1078731 1073267 1067793 1064367 1062506 1060061 1056226 1052374 1050099
58693 1050099 1049468 1049468 1049596 1050587 1053419 1057706 1061583 1063530 1063848 1063816 1064115 1065070 1067811 1073580 1081836 1090445 1097943
58676 1097943 1104502 1110661 1116616 1123023 1130940 1140325 1149829 1158518 1166594 1174056 1180264 1185470 1191199 1198073
58662 1198073 1204694 1209877 1214682 1220752 1227590 1233159 1236692 1239466 1242907 1247140 1251613 1256259 1261666 1268382
58648 1268382 1276136 1283635 1289223 1291781 1290976 1286991 1280406 1271875 1261382 1248247 1232548 1215785 1199102
58635 1199102 1181716 1162570 1142757 1124339 1107295 1090017 1072703 1057670 1045786 1035065 1023643
58624 1023643 1011934 1000865 990223 980038 971541 965249 959695 953500 947196 941797 937201 933366 931409
$$ packed form
58722A095669k725n19J926L833M526M155L350K286Q18p93k013k584k496j948j736
58707A101749k798m611n228l953k772l656n464n474l426j861k445l835l852k275
58693A050099o31%J28R91K832M287L877J947L18l2K99R55K741N769Q256Q609P498
58676A097943O559O159N955O407P917R385R504Q689Q076P462O208N206N729O874
58662A198073O621N183M805O070O838N569L533K774L441M233M473M646N407O716
58648A268382P754P499N588K558q05l985o585q531j0493j3135j5699j6763j6683
58635A199102j7386j9146j9813j8418j7044j7278j7314j5033j1884j0721j1422
58624A023643j1709j1069j0642j0185q497o292n554o195o304n399m596l835j957
$$ plain form
58611 931409 931866 933250 933920 934268 935654 938354 941992 946898 953676 962207 971944 981991 990255 994333 994371
58596 994371 993311 993123 992691 990741 988379 986724 984250 979061 972184 966008 960882 955770 950915 947135 943656
58581 943656 939510 936163 935683 936935 936609 933791 930627 928521 926659 924640 923704 924474 925795 926769 928082
58566 928082 930392 932981 934918 936331 937812 939581 941814 945118 950255 957697 967129 976928 984893 990415
58552 990415 995182 1000730 1006322 1010561 1013985 1018175 1023033 1026891 1028994 1030041 1030630 1030882 1031314 1032312 1032930
58537 1032930 1031799 1029012 1025680 1022213 1018759 1016676 1017426 1020219 1022855 1024886 1027983 1033091 1039129 1044754
58523 1044754 1049780 1054652 1060021 1066966 1076276 1087450 1099473 1112185 1125631 1138926 1151426 1164315
58511 1164315 1179042 1194855 1209985 1224566 1240059 1256479 1273028 1291041 1313104 1339007 1365655
$$ packed form
58611I31409M57J384O70L48J386K700L638M906O778Q531R737J0047Q264M078L8
58596I94371j060j88m32j950k362j655k474n189o877o176n126n112m855l780l479
58581I43656m146l347m80J252l26k818l164k106j862k019r36P70J321R74J313
58566I28082K310K589J937J413J481J769K233L304N137P442R432R799P965N522
58552I90415M767N548N592M239L424M190M858L858K103J047N89K52M32R98O18
58537A032930j131k787l332l467l454k083P50K793K636K031L097N108O038N625
58523A044754N026M872N369O945R310J1174J2023J2712J3446J3295J2500J2889
58511A164315J4727J5813J5130J4581J5493J6420J6549J8013K2063K5903K6648
$$ plain form
58500 1365655 1391576 1418456 1447222 1475603 1501116 1524006 1545498 1565140 1581551 1594199 1602875
58489 1602875 1606980 1606903 1604829 1602576 1599547 1594149 1586267 1576987 1566602 1554315 1539603 1522746 1504067
58476 1504067 1483498 1461139 1437891 1415211 1393917 1373357 1352512 1332191 1314962 1301991 1291165
58465 1291165 1279760 1267952 1257906 1250181 1243182 1235709 1227886 1219731 1211074 1203065 1197569 1194576 1192056
58452 1192056 1188731 1185156 1181695 1177436 1171964 1166570 1162819 1161059 1160868 1161680 1162492 1162109 1160295 1157973 1156203
58437 1156203 1155643 1156482 1157795 1157621 1155165 1152322 1151421 1152252 1153318 1155167 1159828 1167345 1175711 1184391 1195078
58422 1195078 1208385 1222411 1235441 1247927 1261048 1275317 1291246 1309311 1328502 1346618 1362537
58411 1362537 1376592 1388622 1397649 1403574 1407031 1407531 1404172 1398291 1392626 1387568 1381169 1373397 1367065 1363511
$$ packed form
58500A365655K5921K6880K8766K8381K5513K2890K1492J9642J6411J2648Q676
58489A602875M105p7k074k253l029n398p882r280j0385j2287j4712j6857j8679
58476A504067k0569k2359k3248k2680k1294k0560k0845k0321j7229j2971j0826
58465A291165j1405j1808j0046p725o999p473p823q155q657q009n496k993k520
58452A192056l325l575l461m259n472n394l751j760j91Q12Q12l83j814k322j770
58437A156203n60Q39J313j74k456k843r01Q31J066J849M661P517Q366Q680J0687
58422A195078J3307J4026J3030J2486J3121J4269J5929J8065J9191J8116J5919
58411A362537J4055J2030R027N925L457N00l359n881n665n058o399p772o332l554
$$ plain form
58397 1363511 1360763 1357695 1356878 1360978 1368685 1376667 1383808 1391263 1399625 1408000 1415002 1419253 1419772 1416973
58383 1416973 1412355 1406593 1399137 1390151 1381162 1373168 1365829 1359182 1354301 1351502 1349710 1348388 1348217 1349190
58369 1349190 1350146 1351064 1353680 1358772 1364823 1370446 1376221 1383131 1391055 1399686 1408889 1417262 1422515 1424362
58355 1424362 1424911 1425255 1423986 1420234 1415634 1411745 1407744 1402337 1395984 1389595 1382811 1375212 1367683 1361284
58341 1361284 1356185 1352650 1351305 1351565 1351687 1351319 1352151 1355256 1359835 1365123 1371163 1377120 1381616 1385671 1392409
58326 1392409 1402599 1413251 1421778 1428696 1435048 1440420 1445155 1451407 1460012 1469040 1477106 1485226 1493853
58313 1493853 1501397 1507618 1515035 1524600 1533470 1539823 1546539 1556824 1569057 1579586 1588374 1598397 1611070
58300 1611070 1625357 1640058 1654396 1667637 1680225 1693874 1708922 1723574 1737111 1751080 1765536
$$ packed form
58397A363511k748l068q17M100P707P982P141P455Q362Q375P002M251N19k799
58383A416973m618n762p456q986q989p994p339o647m881k799j792j322j71R73
58369A349190R56R18K616N092O051N623N775O910P924Q631R203Q373N253J847
58355A424362N49L44j269l752m600l889m001n407o353o389o784p599p529o399
58341A361284n099l535j345K60J22l68Q32L105M579N288O040N957M496M055O738
58326A392409J0190J0652Q527O918O352N372M735O252Q605R028Q066Q120Q627
58313A493853P544O221P417R565Q870O353O716J0285J2233J0529Q788J0023J2673
58300A611070J4287J4701J4338J3241J2588J3649J5048J4652J3537J3969J4456
$$ plain form
58289 1765536 1777313 1784602 1790397 1798651 1809564 1821209 1833109 1845381 1856957 1867598 1879386 1893660
58277 1893660 1909012 1924764 1943374 1966416 1991090 2013923 2035311 2057369 2080104 2102965 2127319
58266 2127319 2153948 2180627 2205408 2229515 2253748 2275269 2291760 2305838 2321340 2338018 2353899
58255 2353899 2370123 2389158 2410694 2433402 2458211 2485707 2512943 2537202 2560484 2586124 2613737
58244 2613737 2641922 2672954 2709604 2749830 2789804 2829899 2872440 2915771 2956229 2994401 3033973
58233 3033973 3075700 3117732 3160571 3206543 3255309 3304727 3355233 3409056 3466295 3525963 3589253
58222 3589253 3657424 3728121 3798091 3867678 3938651 4010120 4081175 4154839 4234373 4318254 4403848
58211 4403848 4493279 4590251 4693801 4800815 4912015 5029748 5152739 5279013 5411097 5552058
$$ packed form
58289A765536J1777P289N795Q254J0913J1645J1900J2272J1576J0641J1788J4274
58277A893660J5352J5752J8610K3042K4674K2833K1388K2058K2735K2861K4354
58266B127319K6629K6679K4781K4107K4233K1521J6491J4078J5502J6678J5881
58255B353899J6224J9035K1536K2708K4809K7496K7236K4259K3282K5640K7613
58244B613737K8185L1032L6650M0226L9974M0095M2541M3331M0458L8172L9572
58233C033973M1727M2032M2839M5972M8766M9418N0506N3823N7239N9668O3290
58222C589253O8171P0697O9970O9587P0973P1469P1055P3664P9534Q3881Q5594
58211D403848Q9431R6972J03550J07014J11200J17733J22991J26274J32084J40961
$$ plain form
58201 5552058 5699410 5849462 6004675 6169850 6344137 6524062 6711464 6910748 7120988
58192 7120988 7338726 7566066 7807952 8063770 8329814 8607772 8902657 9214752 9541839
58183 9541839 9886690 10253771 10641507 11047017 11475648 11936371 12430741 12956397 13518105
58174 13518105 14124164 14774587 15464464 16196844 16980515 17817020 18701796 19636208 20626112
58165 20626112 21670450 22764367 23912504 25126961 26414344 27777933 29229833 30786480
58157 30786480 32454403 34235364 36142981 38198716 40414658 42797407 45365881 48147217
58149 48147217 51158504 54411906 57933639 61756563 65899594 70380732 75249459 80584083
58141 80584083 86466499 92993414 100310563 108604124 118064979 128900282 141371237 155762459
$$ packed form
58201E552058J47352J50052J55213J65175J74287J79925J87402J99284K10240
58192G120988K17738K27340K41886K55818K66044K77958K94885L12095L27087
58183I541839L44851L67081L87736M05510M28631M60723M94370N25656N61708
58174A3518105O06059O50423O89877P32380P83671Q36505Q84776R34412R89904
58165B0626112J044338J093917J148137J214457J287383J363589J451900J556647
58157C0786480J667923J780961J907617K055735K215942K382749K568474K781336
58149D8147217L011287L253402L521733L822924M143031M481138M868727N334624
58141H0584083N882416O526915P317149Q293561R460855J0835303J2470955J4391222
$$ plain form
58133 155762459 172296201 191098453 212219377 235628959 261239729 289026578 318971584
58126 318971584 350421616 381122449 407031588 423660443 428184574 420647599 403448061
58119 403448061 379875824 352943565 324959094 297509915 271541918 247506407 225556941
58112 225556941 205678612 187727739 171481658 156726012 143300811 131082532 119969281
58105 119969281 109892265 100805789 92649815 85338755 78786077 72914737 67640839 62872211
58097 62872211 58531427 54564376 50924586 47567670 44464069 41599570 38958621 36520630
58089 36520630 34273470 32214450 30334354 28613449 27034953 25588995 24261340 23031543
58081 23031543 21885408 20817957 19822077 18885605 18001685 17170890 16390636 15652591 14952558
$$ packed form
58133A55762459J6533742J8802252K1120924K3409582K5610770K7786849K9945006
58126C18971584L1450032L0700833K5909139J6628855M524131p536975j7199538
58119D03448061k3572237k6932259k7984471k7449179k5967997k4035511k1949466
58112B25556941j9878329j7950873j6246081j4755646j3425201j2218279j1113251
58105A19969281j0077016r086476q155974p311060o552678n871340n273898m768628
58097F2872211m340784l967051l639790l356916l103601k864499k640949k437991
58089C6520630k247160k059020j880096j720905j578496j445958j327655j229797
58081B3031543j146135j067451r95880r36472q83920q30795p80254p38045p00033
$$ plain form
58072 14952558 14292823 13672512 13084958 12526582 11999286 11502036 11028745 10576195 10145553
58063 10145553 9734694 9337815 8954629 8591434 8250882 7928544 7621476 7332089 7061284
58054 7061284 6805578 6563636 6338267 6129144 5930290 5737549 5552352 5375765 5205080
58045 5205080 5038932 4880045 4730306 4588197 4452892 4325497 4204400 4084884 3965457
58036 3965457 3849559 3739185 3631871 3525729 3422352 3322679 3224831 3128172 3035253 2947883
58026 2947883 2865167 2786608 2712950 2642888 2573271 2503550 2435848 2369969 2303075 2234980 2168751
58015 2168751 2105146 2041677 1978358 1919046 1865368 1814538 1765016 1719258 1678651 1640618 1603207
58004 1603207 1568098 1536634 1507095 1478386 1452389 1430081 1408985 1386844 1364379 1342317 1319287
$$ packed form
58072A4952558o59735o20311n87554n58376n27296m97250m73291m52550m30642
58063A0145553m10859l96879l83186l63195l40552l22338l07068k89387k70805
58054G061284k55706k41942k25369k09123j98854j92741j85197j76587j70685
58045E205080j66148j58887j49739j42109j35305j27395j21097j19516j19427
58036C965457j15898j10374j07314j06142j03377r9673r7848r6659r2919q7370
58026B947883q2716p8559p3658p0062o9617o9721o7702o5879o6894o8095o6229
58015B168751o3605o3469o3319n9312n3678n0830m9522m5758m0607l8033l7411
58004A603207l5109l1464k9539k8709k5997k2308k1096k2141k2465k2062k3030
$$ plain form
57993 1319287 1294858 1271148 1249261 1227440 1204736 1183146 1164085 1146128 1128235 1111822 1097508
57982 1097508 1083243 1067954 1053839 1042715 1033051 1022775 1012055 1001257 989281 976129 964000
57971 964000 953469 941511 925872 908627 892798 878031 862326 845803 830096 815790 802760
57960 802760 791398 781615 772250 762942 754627 747024 738135 727707 718474 712250 707539 702825 699320 698034
57946 698034 696926 693702 689256 685683 682848 679576 676434 674636 673583 672006 670386 670014 670696 671268 671371
57931 671371 671073 669907 667757 665440 663130 659707 654948 650689 648444 647500 646601 645593 644150 641076 636472
57916 636472 632432 629863 626747 621426 615434 610994 607818 604662 602053 601010 600711 599906 599170 599491 600108
57901 600108 600035 600268 601994 603883 603576 600842 597109 593084 589121 586662 586736 587775 587295 585018 582301 579511
$$ packed form
57993A319287k4429k3710k1887k1821k2704k1590j9061j7957j7893j6413j4314
57982A097508j4265j5289j4115j1124r664j0276j0720j0798j1976j3152j2129
57971I64000j0531j1958j5639j7245j5829j4767j5705j6523j5707j4306j3030
57960H02760j1362r783r365r308q315p603q889j0428r233o224m711m714l505j286
57946F98034j108l224m446l573k835l272l142j798j053j577j620l72O82N72J03
57931F71371k98j166k150k317k310l423m759m259k245r44q99j008j443l074m604
57916F36472m040k569l116n321n992m440l176l156k609j043k99q05p36L21O17
57901F00108p3K33J726J889l07k734l733m025l963k459P4J039m80k277k717k790
$$ plain form
57885 579511 576319 573723 573275 574651 576180 577381 578951 580749 582001 583225 585899 590249 595034 599420
57871 599420 603571 607693 611921 616779 622318 627258 630317 631835 632787 633018 631973 630363 629337 628591 626977
57856 626977 624409 621499 617868 612627 606214 600090 594913 590480 586976 584592 582285 578603 573676 568955
57842 568955 565197 562053 559280 556896 554336 550791 546292 541435 536445 531562 527734 525680 524807 524193 523962
57827 523962 524503 525277 525821 527004 529585 532353 533546 533459 533701 534394 534085 532091 529044 525428 521554 518770
57811 518770 518647 520870 523656 526115 528406 529815 529035 526697 525481 527016 530330 533956 537727 541659 544710
57796 544710 545927 545854 545755 546015 546103 545686 545179 545304 546258 547301 547439 546662 545748 544551 541708 537011 532676 530590
57778 530590 529307 525935 520306 514980 511245 507709 503250 498928 495864 493160 489433 485266 482747 483137
$$ packed form
57885E79511l192k596m48J376J529J201J570J798J252J224K674M350M785M386
57871E99420M151M122M228M858N539M940L059J518R52K31j045j610j026p46j614
57856F26977k568k910l631n241o413o124n177m433l504k384k307l682m927m721
57842E68955l758l144k773k384k560l545m499m857m990m883l828k054q73o14k31
57827E23962N41P74N44J183K581K768J193q7K42O93l09j994l047l616l874k784
57811E18770j23K223K786K459K291J409p80k338j216J535L314L626L771L932L051
57796E44710J217p3r9K60Q8m17n07J25R54J043J38p77r14j197k843m697m335k086
57778E30590j283l372n629n326l735l536m459m322l064k704l727m167k519L90
$$ plain form
57764 483137 485795 488993 491279 492517 493875 496323 499171 500746 500386 498784 496450 493038 488374 483009
57750 483009 477424 471754 466585 462939 460953 459538 457845 456263 455535 455616 455870 455800 455211 454236 453437 453404 454130
57733 454130 455290 456972 459394 462021 463885 464835 465626 466774 468285 470507 474087 478766 483139 486054 487527
57718 487527 488123 488340 488938 490948 494621 498729 501304 501151 498878 496819 497352 500490 503362 502907 498892 493588
57702 493588 489017 485549 482649 479598 475604 470643 466197 463943 463837 464804 466981 471470 477842 483861 488206
57687 488206 491626 494805 496906 497227 496650 496208 495602 494380 493369 493491 494022 493528 492059 491185 492051 494316
57671 494316 496763 498242 498321 497634 497362 497980 498837 499176 498943 498364 497526 496687 496135 495349 493334 490245 487610
57654 487610 486275 485273 483479 481168 478902 476134 472311 468395 465667 463626 460730 456827 453168 450143
$$ packed form
57764D83137K658L198K286J238J358K448K848J575l60j602k334l412m664n365
57750D83009n585n670n169l646j986j415j693j582p28Q1K54p0n89r75p99l3P26
57733D54130J160J682K422K627J864R50P91J148J511K222L580M679M373K915J473
57718D87527N96K17N98K010L673M108K575j53k273k059N33L138K872m55m015n304
57702D93588m571l468k900l051l994m961m446k254j06R67K177M489O372O019M345
57687D88206L420L179K101L21n77m42o06j222j011J22N31m94j469q74Q66K265
57671D94316K447J479P9o87k72O18Q57L39k33n79q38q39n52p86k015l089k635
57654D87610j335j002j794k311k266k768l823l916k728k041k896l903l659l025
$$ plain form
57640 450143 446811 443033 440480 440615 442587 443992 443333 441183 439263 438808 439695 440788 440950 439755 437511
57625 437511 435137 434071 435588 439718 445320 451546 458604 466699 475232 484059 494683 508832 526256
57612 526256 545446 566387 590934 620068 652306 685561 719189 752811 783799 807296 818883
57601 818883 816837 802420 779041 751042 722054 693764 666252 639516 614239 591150 570315 551403
57589 551403 534304 519188 506295 495884 488003 481886 475923 468911 461463 455744 453584 454968 458206
57576 458206 461172 462379 461506 459374 457293 456118 455840 455916 455672 454477 452170 449504 447663 446929 446257 444595
57560 444595 442229 440321 439380 438776 437664 435941 434327 433853 435134 437767 440479 442109 442373 441556 439903
57545 439903 437637 435249 433280 432043 431820 432853 434712 436182 436417 435840 435301 434791 433784 432341 430986
$$ packed form
57640D50143l332l778k553J35J972J405o59k150j920m55Q87J093J62j195k244
57625D37511k374j066J517M130N602O226P058Q095Q533Q827J0624J4149J7424
57612E26256J9190K0941K4547K9134L2238L3255L3628L3622L0988K3497J1587
57601H18883k046j4417k3379k7999k8988k8290k7512k6736k5277k3089k0835j8912
57589E51403j7099j5116j2893j0411p881o117n963p012p448n719k160J384L238
57576D58206K966J207q73k132k081j175k78P6k44j195k307k666j841p34o72j662
57560D44595k366j908r41o04j112j723j614m74J281K633K712J630K64q17j653
57545D39903k266k388j969j237k23J033J859J470K35n77n39n10j007j443j355
$$ plain form
57530 430986 429754 428416 427434 427628 428866 430076 430607 430655 430340 429409 428037 426933 426379 426044 425852 425974 425718
57513 425718 423698 419798 415985 414423 415476 418100 421272 424100 425379 424441 422369 421278 422069 423543 424084
57498 424084 423793 424464 427440 431980 436157 439161 441975 445622 449773 453769 458075 463461 469201 473573 476112
57483 476112 478053 480472 483283 486291 489878 494136 498503 502778 507455 512567 517397 521898 527154 533652
57469 533652 540272 545948 551294 557481 564345 570820 576671 582698 589550 597135 604879 611960 617825 622974
57455 622974 628528 634412 638980 641268 642502 644076 645019 643175 638497 633388 629669 626662 622649 617100
57441 617100 611060 606051 602932 601285 599784 597560 595124 593525 592979 592998 593454 594519 595646 595666 594240 592586
57425 592586 592501 594926 599354 604121 607441 608668 608582 608259 608106 608434 610256 614487 620585 626896 632292 636759
$$ packed form
57530D30986j232j338r82J94J238J210N31M8l15r31j372j104n54l35j92J22k56
57513D25718k020l900l813j562J053K624L172K828J279r38k072j091P91J474N41
57498D24084k91O71K976M540M177L004K814L647M151L996M306N386N740M372K539
57483D76112J941K419K811L008L587M258M367M275M677N112M830M501N256O498
57469E33652O620N676N346O187O864O475N851O027O852P585P744P081N865N149
57455F22974N554N884M568K288J234J574R43j844m678n109l719l007m013n549
57441F17100o040n009l119j647j501k224k436j599n46J9M56J065J127K0j426j654
57425E92586q5K425M428M767L320J227q6l23j53L28J822M231O098O311N396M467
$$ plain form
57409 636759 640585 643908 647065 650599 654816 659822 665875 673038 680631 687714 693988 699627 704538 708599
57395 708599 712354 716572 721308 726279 731798 738215 744758 750365 755790 763302 773761 785219 795123 802946
57381 802946 809971 817436 825715 834587 843415 851426 858584 865912 874392 883777 892959 901286 909120 917295
57367 917295 926319 935993 945607 954723 963840 974046 985880 998774 1011592 1023445 1034149 1044358
57355 1044358 1055213 1067328 1080272 1093583 1107937 1124319 1142110 1159282 1174881 1190162 1206567
57344 1206567 1223553 1239272 1252702 1264151 1274204 1283243 1291890 1301038 1311261 1322544 1334598 1347144
57332 1347144 1360066 1373530 1387712 1402233 1416343 1430040 1444476 1460694 1478390 1496623 1515383
57321 1515383 1535510 1557090 1578756 1598849 1616690 1632566 1647161 1661559 1677279 1695478 1715861
$$ packed form
57409F36759L826L323L157L534M217N006O053P163P593P083O274N639M911M061
57395G08599L755M218M736M971N519O417O543N607N425P512J0459J1458R904P823
57381H02946P025P465Q279Q872Q828Q011P158P328Q480R385R182Q327P834Q175
57367I17295R024R674R614R116R117J0206J1834J2894J2818J1853J0704J0209
57355A044358J0855J2115J2944J3311J4354J6382J7791J7172J5599J5281J6405
57344A206567J6986J5719J3430J1449J0053R039Q647R148J0223J1283J2054J2546
57332A347144J2922J3464J4182J4521J4110J3697J4436J6218J7696J8233J8760
57321A515383K0127K1580K1666K0093J7841J5876J4595J4398J5720J8199K0383
$$ plain form
57310 1715861 1736806 1756846 1775884 1794734 1813625 1831651 1847922 1862893 1878143 1894899 1913122
57299 1913122 1931955 1950680 1969152 1987605 2006225 2024825 2043114 2061469 2081105 2102909 2126106
57288 2126106 2148656 2169159 2187977 2206446 2225502 2245229 2265128 2284463 2302746 2320242 2337803
57277 2337803 2356060 2375099 2394987 2415991 2437900 2459721 2480627 2500930 2521593 2542999 2564722
57266 2564722 2586371 2608130 2630366 2653098 2675978 2698625 2720945 2743293 2766315 2790473 2815687
57255 2815687 2841472 2867381 2893265 2919169 2945129 2971201 2997769 3025584 3055007 3085088 3113998
57244 3113998 3140848 3166635 3192805 3219340 3245145 3269941 3294610 3319662 3344581 3369052 3393709
57233 3393709 3419122 3445030 3471228 3498289 3526607 3555520 3584237 3612986 3642414 3672476 3702840
$$ packed form
57310A715861K0945K0040J9038J8850J8891J8026J6271J4971J5250J6756J8223
57299A913122J8833J8725J8472J8453J8620J8600J8289J8355J9636K1804K3197
57288B126106K2550K0503J8818J8469J9056J9727J9899J9335J8283J7496J7561
57277B337803J8257J9039J9888K1004K1909K1821K0906K0303K0663K1406K1723
57266B564722K1649K1759K2236K2732K2880K2647K2320K2348K3022K4158K5214
57255B815687K5785K5909K5884K5904K5960K6072K6568K7815K9423L0081K8910
57244C113998K6850K5787K6170K6535K5805K4796K4669K5052K4919K4471K4657
57233C393709K5413K5908K6198K7061K8318K8913K8717K8749K9428L0062L0364
$$ plain form
57222 3702840 3733776 3765521 3797278 3828107 3858666 3890911 3925993 3963331 4001621 4039683 4076401
57211 4076401 4111063 4144153 4176862 4209537 4241393 4271940 4301686 4331115 4360005 4388330 4416916
57200 4416916 4446430 4476453 4506197 4535490 4564320 4592141 4618790 4645756 4675367 4708497 4743866
57189 4743866 4779766 4815898 4853291 4892977 4934966 4978160 5021024 5062607 5103078 5143118 5182842
57178 5182842 5221602 5258787 5294465 5329187 5363556 5398049 5432691 5466643 5498572 5527891 5555399
57167 5555399 5582236 5608485 5633466 5657388 5681999 5709162 5739134 5770644 5802514 5834939 5869436
57156 5869436 5907872 5951378 5999730 6051683 6106071 6162463 6220620 6279690 6338601 6397148 6455961
57145 6455961 6515197 6573862 6630689 6685051 6736713 6785449 6831660 6876863 6922597 6968921 7014722
$$ packed form
57222C702840L0936L1745L1757L0829L0559L2245L5082L7338L8290L8062L6718
57211D076401L4662L3090L2709L2675L1856L0547K9746K9429K8890K8325K8586
57200D416916K9514L0023K9744K9293K8830K7821K6649K6966K9611L3130L5369
57189D743866L5900L6132L7393L9686M1989M3194M2864M1583M0471M0040L9724
57178E182842L8760L7185L5678L4722L4369L4493L4642L3952L1929K9319K7508
57167E555399K6837K6249K4981K3922K4611K7163K9972L1510L1870L2425L4497
57156E869436L8436M3506M8352N1953N4388N6392N8157N9070N8911N8547N8813
57145F455961N9236N8665N6827N4362N1662M8736M6211M5203M5734M6324M5801
$$ plain form
57134 7014722 7059465 7103838 7148543 7193310 7237583 7281683 7326652 7372988 7419975 7466372 7511618
57123 7511618 7556149 7600407 7643691 7684407 7721518 7755285 7786240 7813968 7837311 7855115 7865991
57112 7865991 7867953 7859612 7841755 7816623 7785536 7748282 7704977 7657145 7606407 7553368 7498626 7443764
57100 7443764 7390255 7338194 7287282 7238412 7193061 7151474 7112544 7075187 7038781 7002716 6966870
57089 6966870 6932507 6901433 6874219 6850449 6830773 6817126 6810147 6807334 6804546 6798659 6788096 6771466
57077 6771466 6746722 6711869 6666157 6610566 6547085 6477340 6401921 6321053 6235368 6145468 6051128
57066 6051128 5951559 5845881 5732429 5608004 5469055 5313521 5140645 4949583 4739719 4512027
57056 4512027 4268262 4008470 3730763 3433441 3115304 2773594 2403795 2002214 1566702
$$ packed form
57134G014722M4743M4373M4705M4767M4273M4100M4969M6336M6987M6397M5246
57123G511618M4531M4258M3284M0716L7111L3767L0955K7728K3343J7804J0876
57112G865991J962q341j7857k5132l1087l7254m3305m7832n0738n3039n4742n4862
57100G443764n3509n2061n0912m8870m5351m1587l8930l7357l6406l6065l5846
57089F966870l4363l1074k7214k3770j9676j3647o979k813k788n887j0563j6630
57077F771466k4744l4853m5712n5591o3481o9745p5419q0868q5685q9900r4340
57066F051128r9569j05678j13452j24425j38949j55534j72876j91062k09864k27692
57056D512027k43765k59792k77707k97322l18137l41710l69799m01581m35512
$$ plain form
57047 1566702 1093966 578136 12974 -606397 -1284579 -2025682 -2829975 -3692246 -4604645 -5559033
57037 -5559033 -6545954 -7555567 -8583099 -9631309 -10705115 -11805912 -12932148 -14080199
57029 -14080199 -15242334 -16415945 -17635167 -19006065 -20710732 -22966432 -25951298 -29713291
57021 -29713291 -34088225 -38676734 -42921390 -46256733 -48246527 -48652414 -47455133 -44864331
57013 -44864331 -41297364 -37285951 -33330958 -29786046 -26825560 -24478912 -22682151 -21320024
57005 -21320024 -20255632 -19347934 -18460444 -17472197 -16295833 -14891934 -13268393 -11468545
56997 -11468545 -9557955 -7611724 -5700824 -3881935 -2195348 -667202 689786 1875805
56989 1875805 2899917 3775123 4516667 5141943 5668282 6110321 6480535 6791449 7055696
$$ packed form
57047A566702m72736n15830A2974f06397o78182p41103q04293q62271r12399r54388
57037e559033r86921j009613j027532j048210j073806j100797j126236j148051
57029a4080199j162135j173611j219222j370898j704667k255700k984866l761993
57021b9713291m374934m588509m244656l335343j989794m05887J197281K590802
57013d4864331L566967M011413L954993L544912K960486K346648J796761J362127
57005b1320024J064392R07698Q87490R88247J176364J403899J623541J799848
56997a1468545J910590J946231J910900J818889J686587f67202F89786J186019
56989A875805J024112Q75206P41544O25276N26339M42039L70214L10914K64247
$$ plain form
56980 7055696 7284444 7486982 7671178 7843092 8006570 8164147 8317694 8467747 8613513
56971 8613513 8754309 8889026 9012254 9112092 9174351 9189871 9158335 9087161 8988315 8874349
56961 8874349 8754130 8631099 8505739 8378667 8250242 8118784 7981869 7839670 7695575
56952 7695575 7553652 7416838 7287236 7166252 7053885 6949004 6850595 6757846 6669073 6581809
56942 6581809 6494492 6407248 6320734 6234845 6148908 6062748 5977317 5894318 5814903 5738366 5662324
56931 5662324 5584439 5503689 5419959 5333258 5243801 5151974 5057457 4959138 4856666 4751369 4644595
56920 4644595 4535656 4422234 4302298 4174741 4038828 3894264 3741605 3581667 3414845
56911 3414845 3241900 3065143 2887895 2712976 2542393 2378027 2221622 2074311 1937018
$$ packed form
56980G055696K28748K02538J84196J71914J63478J57577J53547J50053J45766
56971H613513J40796J34717J23228R9838O2259J5520l1536p1174r8846j13966
56961H874349j20219j23031j25360j27072j28425j31458j36915j42199j44095
56952G695575j41923j36814j29602j20984j12367j04881r8409r2749q8773q7264
56942F581809q7317q7244q6514q5889q5937q6160q5431q2999p9415p6537p6042
56931E662324p7885q0750q3730q6701q9457r1827r4517r8319j02472j05297j06774
56920D644595j08939j13422j19936j27557j35913j44564j52659j59938j66822
56911C414845j72945j76757j77248j74919j70583j64366j56405j47311j37293
$$ plain form
56902 1937018 1811135 1698001 1597836 1509659 1431916 1362760 1300397 1243854 1192827 1146257 1101985
56891 1101985 1058533 1016172 975360 935435 896222 859677 828064 801153 776953 754640 734937
56880 734937 718064 703302 690597 680869 674599 671460 671286 673995 678689 684274 690717 698144 704811 707502
56866 707502 703840 692878 674145 648252 618318 588432 560326 533273 507202 483560 462784 443375
56854 443375 424379 406692 391105 377143 364758 355051 348117 342203 336365 332070 330678 331078 331523
56841 331523 332213 334245 337321 340455 343864 348314 353441 358566 364444 372449 382594 394033 406956 422207
56827 422207 439380 457064 474764 492867 510646 525909 536927 543520 546131 545060 540998 535359
56815 535359 529733 525514 523865 525162 528560 533003 538674 546654 557335 570155 584853 601976 622057
$$ packed form
56902A937018j25883j13134j00165q8177p7743o9156o2363n6543n1027m6570m4272
56891A101985m3452m2361m0812l9925l9213l6545l1613k6911k4200k2313j9703
56880G34937j6873j4762j2705r728o270l139j74K709M694N585O443P427O667K691
56866G07502l662j0962j8733k5893k9934k9886k8106k7053k6071k3642k0776j9409
56854D43375j8996j7687j5587j3962j2385r707o934n914n838m295j392M00M45
56841C31523O90K032L076L134L409M450N127N125N878Q005J0145J1439J2923J5251
56827D22207J7173J7684J7700J8103J7779J5263J1018O593K611j071m062n639
56815E35359n626m219j649J297L398M443N671P980J0681J2820J4698J7123K0081
$$ plain form
56802 622057 645291 672101 702797 736108 768842 797579 820180 835386 841950 839267 828801 814027
56790 814027 798561 784371 771763 760720 751859 746169 744332 746719 753694 765354 781194 800735
56778 800735 824504 853475 887395 924492 963217 1003193 1043532 1080892 1110263 1127611 1131337 1121820
56766 1121820 1100730 1070877 1035865 999256 963844 931337 902328 876740 854631 836496 822820
56755 822820 813786 809543 810185 815220 823716 835380 850879 870627 893788 918810 943951 966412 981686
56742 981686 985169 974811 952063 920762 885531 850434 817870 788443 762104 739086 719464 702622
56730 702622 687943 675630 666192 659630 655783 654840 656716 660597 666134 674359 686003 699149 709805
56717 709805 714821 713257 705255 691138 671933 649463 625377 600759 576819 554877 535244 516998
$$ packed form
56802F22057K3234K6810L0696L3311L2734K8737K2601J5206O564k683j0466j4774
56790H14027j5466j4190j2608j1043q861n690j837K387O975J1660J5840J9541
56778H00735K3769K8971L3920L7097L8725L9976M0339L7360K9371J7348L726r517
56766A121820k1090k9853l5012l6609l5412l2507k9009k5588k2109j8135j3676
56755H22820r034m243O42N035Q496J1664J5499J9748K3161K5022K5141K2461J5274
56742I81686L483j0358k2748l1301l5231l5097l2564k9427k6339k3018j9622j6842
56730G02622j4679j2313r438o562l847r43J876L881N537Q225J1644J3146J0656
56717G09805N016j564q002j4117j9205k2470k4086k4618k3940k1942j9633j8246
$$ plain form
56705 516998 499395 482754 467529 453240 438966 424434 410101 396459 383744 372186 362274 354684
56693 354684 349757 346723 343729 339253 333558 328174 323961 320342 316523 312634 309316 306868 305335 304900
56679 304900 305525 306456 306729 306218 305689 305686 305706 304727 302487 299982 298542 298438 298564 297547 295118 292394 290880
56662 290880 291144 292407 293466 294120 295453 298574 303327 308496 312834 315410 315610 313833 311947 311823 313328
56647 313328 314837 315703 316761 318116 318175 315871 312443 309777 308088 306492 304860 303612 302452 300849 299283
56632 299283 298550 298195 297086 295223 293533 292070 290012 287511 286038 286500 288113 289398 289416 287954 285518
56617 285518 283278 282124 281670 280978 280016 279368 278831 277745 276657 277061 279175 281449 282746 283724 285547 288515
56601 288515 292566 297817 303735 308954 312876 316516 320910 325687 330308 335767 343529 353061 361869 368184
$$ packed form
56705E16998j7603j6641j5225j4289j4274j4532j4333j3642j2715j1558r912p590
56693C54684m927l034k994m476n695n384m213l619l819l889l318k448j533m35
56679C04900O25R31K73n11n29lK0r79k240k505j440j04J26j017k429k724j514
56662B90880K64J263J059O54J333L121M753N169M338K576K00j777j886j24J505
56647C13328J509Q66J058J355N9k304l428k666j689j596j632j248j160j603j566
56632B99283p33l55j109j863j690j463k058k501j473M62J613J285J8j462k436
56617B85518k240j154m54o92r62o48n37j086j088M04K114K274J297R78J823K968
56601B88515M051N251N918N219L922L640M394M777M621N459P762R532Q808O315
$$ plain form
56587 368184 372674 377176 382446 387598 391392 393617 395190 397077 399246 400651 400157 397460 393308 388946
56573 388946 385205 381984 378830 375830 373359 370851 366862 360992 354947 350895 349380 349703 351380 353903
56559 353903 355782 355607 353939 352514 351544 349473 345677 341744 339382 338423 337592 336055 333504 329871 325924
56544 325924 323266 322846 323997 325533 327102 328851 330515 331585 331955 331886 331784 332296 333867 335762 336347 334972
56528 334972 332904 331750 331640 331716 331792 332518 334067 335557 336045 335700 335629 336482 337445 337071 335326 334143 335297
56511 335297 338231 340845 342001 342316 342877 344424 347523 352073 356670 359992 363005 368247 376518 385842 394205
56496 394205 401713 409193 416219 421759 425772 428917 431336 432604 432324 430226 426493 422460 420005 419597 419859
56481 419859 419586 419081 418854 418360 416961 415007 412867 410019 406273 402874 401098 400516 399880 398954 398142 397019
$$ packed form
56587C68184M490M502N270N152L794K225J573J887K169J405m94k697m152m362
56573C88946l741l221l154l000k471k508l989n870o045m052j515L23J677K523
56559C53903J879j75j668j425r70k071l796l933k362r59q31j537k551l633l947
56544C25924k658m20J151J536J569J749J664J070L70o9j02N12J571J895N85j375
56528C34972k068j154j10P6P6P26J549J490M88l45p1Q53R63l74j745j183J154
56511C35297K934K614J156L15N61J547L099M550M597L322L013N242Q271R324Q363
56496C94205P508P480P026N540M013L145K419J268k80k098l733m033k455m08K62
56481D19859k73n05k27m94j399j954k140k848l746l399j776n82o36r26q12j123
$$ plain form
56465 397019 394782 391899 389925 389635 390217 390275 388912 386083 382592 379614 377717 376563 375701 375006 374055 372077
56449 372077 369037 365909 363341 361082 359240 358789 359904 361070 361033 360500 360646 360999 360254 358343 356235 354370
56433 354370 352641 351256 350262 348841 346471 344173 343259 343452 343653 343830 344539 345175 344591 343153 342444 342945 343621
56416 343621 343802 343896 343967 343104 340717 337610 335410 335397 337680 340985 343741 346008 349459 354608 359179 360713
56400 360713 359794 358883 358814 358587 358164 358945 361205 363233 363734 363465 363852 365283 367220 368871 369491 369163 369397
56383 369397 371716 375552 378834 380627 381712 382533 382386 381102 379890 379776 380391 380808 380438 378758 375513 371708
56367 371708 369172 368643 369381 370824 373102 375461 375972 373930 371240 370266 371212 372590 373427 373823 373907 373387 372151
56350 372151 370710 369910 370219 371176 371703 371373 370948 371053 370993 370037 369256 370437 373340 375868 377155 378670 381675
$$ packed form
56465C97019k237k883j974k90N82N8j363k829l491k978j897j154q62o95r51j978
56449C72077l040l128k568k259j842m51J115J166l7n33J46L53p45j911k108j865
56433C54370j729j385r94j421k370k298r14J93K01J77P09O36n84j438p09N01O76
56416C43621J81R4P1q63k387l107k200j3K283L305K756K267L451N149M571J534
56400C60713r19r11o9k27m23P81K260K028N01k69L87J431J937J651O20l28K34
56383C69397K319L836L282J793J085Q21j47j284j212j14O15M17l70j680l245l805
56367C71708k536n29P38J443K278K359N11k042k690r74R46J378Q37L96Q4n20j236
56350C72151j441q00L09R57N27l30m25J05o0r56p81J181K903K528J287J515L005
$$ plain form
56333 381675 385312 388005 389284 389334 388112 386016 384301 383766 383842 383794 383899 384665 385974 387957 391643 397481
56317 397481 403982 409176 413013 417133 422558 428741 434882 441100 447854 454785 460685 464683 467252 469737
56303 469737 472811 475841 478096 479926 482050 484273 485953 487387 489444 491899 493384 493195 492116 491417 492008
56288 492008 494382 498047 501004 501321 499449 497637 496928 496332 495278 495015 496810 500284 504432 508922 513581
56273 513581 517919 522028 526697 531790 535843 538188 540099 542808 545727 547903 549998 553352 558016 563032
56259 563032 567851 572157 575095 576169 576445 577616 580134 583216 586256 589300 592553 596277 600714 605400
56245 605400 609235 611955 614859 619208 624662 630225 635983 642844 651171 660721 671296 682344 692488
56232 692488 700770 708077 716192 725571 735038 743548 751311 759186 767729 776925 786478 796472 807824 821470
$$ packed form
56333C81675L637K693J279N0j222k096j715n35P6m8J05P66J309J983L686N838
56317C97481O501N194L837M120N425O183O141O218O754O931N900L998K569K485
56303D69737L074L030K255J830K124K223J680J434K057K455J485j89j079o99N91
56288D92008K374L665K957L17j872j812p09n96j054k63J795L474M148M490M659
56273E13581M338M109M669N093M053K345J911K709K919K176K095L354M664N016
56259E63032M819M306K938J074K76J171K518L082L040L044L253L724M437M686
56245F05400L835K720K904M349N454N563N758O861Q327R550J0575J1048J0144
56232F92488Q282P307Q115R379R467Q510P763P875Q543R196R553R994J1352J3646
$$ plain form
56218 821470 836798 851821 865560 879381 895168 913045 932055 952323 975025 1000359 1026794
56207 1026794 1052627 1077594 1102983 1130710 1162173 1197382 1235257 1275181 1318079 1365539 1418165
56196 1418165 1475187 1535557 1599163 1667270 1741953 1824710 1915498 2013588 2119187 2233241 2355409
56185 2355409 2483406 2614977 2749587 2887349 3027003 3165741 3300491 3428693 3548164
56176 3548164 3656692 3751489 3828956 3885730 3920274 3933028 3925106 3897719 3852640 3791815 3716295
56165 3716295 3626967 3526635 3419796 3309638 3196592 3080432 2962423 2844713 2729106 2617291
56155 2617291 2510844 2410053 2314018 2222592 2136692 2056143 1979258 1905636 1837187 1774839 1716361
56144 1716361 1659505 1605435 1556636 1512862 1471860 1433101 1398008 1366899 1338376 1311843 1288374
$$ packed form
56218H21470J5328J5023J3739J3821J5787J7877J9010K0268K2702K5334K6435
56207A026794K5833K4967K5389K7727L1463L5209L7875L9924M2898M7460N2626
56196A418165N7022O0370O3606O8107P4683Q2757R0788R8090J05599J14054J22168
56185B355409J27997J31571J34610J37762J39654J38738J34750J28202J19471
56176C548164J08528R4797P7467N6774L4544J2754p922k7387m5079o0825p5520
56165C716295q9328j00332j06839j10158j13046j16160j18009j17710j15607j11815
56155B617291j06447j00791r6035r1426q5900q0549p6885p3622o8449o2348n8478
56144A716361n6856n4070m8799m3774m1002l8759l5093l1109k8523k6533k3469
$$ plain form
56133 1288374 1268604 1251443 1235381 1219861 1205111 1191602 1179824 1169925 1161697 1155289 1151112 1148429
56121 1148429 1145192 1140434 1135817 1133486 1133237 1133125 1132050 1130407 1129074 1129197 1132049 1137486 1143197 1147042 1149556
56106 1149556 1152855 1157961 1164751 1173561 1184947 1198407 1213049 1228990 1246633 1265223 1283747 1302545
56094 1302545 1322422 1342963 1363583 1385517 1410793 1439771 1471674 1507046 1547567 1593660 1644306
56083 1644306 1699266 1759775 1827084 1901872 1984907 2076557 2175460 2278741 2383183 2485137 2580143
56072 2580143 2664518 2737361 2800084 2854726 2903729 2949941 2994765 3036781 3073573 3103903 3126844
56061 3126844 3140584 3144571 3141598 3135064 3124774 3107658 3081575 3045848 2999017 2939324 2867573 2787263
56049 2787263 2702247 2616342 2534132 2459015 2390657 2327064 2268825 2218480 2176192 2139371 2106694
$$ packed form
56133A288374j9770j7161j6062j5520j4750j3509j1778r899q228o408m177k683
56121A148429l237m758m617k331k49j12j075j643j333J23K852N437N711L845K514
56106A149556L299N106O790Q810J1386J3460J4642J5941J7643J8590J8524J8798
56094A302545J9877K0541K0620K1934K5276K8978L1903L5372M0521M6093N0646
56083A644306N4960O0509O7309P4788Q3035R1650R8903J03281J04442J01954R5006
56072B580143Q4375P2843O2723N4642M9003M6212M4824M2016L6792L0330K2941
56061C126844J3740L987k973o534j0290j7116k6083l5727m6831n9693p1751q0310
56049B787263q5016q5905q2210p5117o8358o3593n8239n0345m2288l6821l2677
$$ plain form
56038 2106694 2079220 2057167 2038781 2023180 2011447 2003837 1998433 1993719 1990583 1990833 1995252 2003452 2013984
56025 2013984 2024500 2033651 2042926 2054918 2069998 2086514 2103729 2122209 2141713 2161210 2180884 2201881
56013 2201881 2224384 2248143 2274229 2303577 2334480 2364553 2394611 2427345 2462544 2497135 2530049
56002 2530049 2563656 2600064 2639112 2680188 2722887 2765769 2807589 2849859 2895095 2942826 2990672
55991 2990672 3038884 3089787 3142951 3195388 3246874 3300654 3358186 3417599 3478142 3541693 3608685
55980 3608685 3676911 3745687 3816908 3890662 3964160 4036724 4111611 4191087 4273806 4358987 4449089
55969 4449089 4546095 4648724 4755480 4867147 4984483 5106754 5234099 5367896 5507528 5650602
55959 5650602 5797729 5953090 6118859 6293206 6475269 6667634 6872125 7087629 7314094
$$ packed form
56038B106694k7474k2053j8386j5601j1733p610n404m714l136K50M419Q200J0532
56025B013984J0516R151R275J1992J5080J6516J7215J8480J9504J9497J9674K0997
56013B201881K2503K3759K6086K9348L0903L0073L0058L2734L5199L4591L2914
56002B530049L3607L6408L9048M1076M2699M2882M1820M2270M5236M7731M7846
55991B990672M8212N0903N3164N2437N1486N3780N7532N9413O0543O3551O6992
55980C608685O8226O8776P1221P3754P3498P2564P4887P9476Q2719Q5181R0102
55969D449089R7006J02629J06756J11667J17336J22271J27345J33797J39632J43074
55959E650602J47127J55361J65769J74347J82063J92365K04491K15504K26465
$$ plain form
55950 7314094 7554282 7809564 8078325 8360434 8658714 8974049 9303763 9647082 10007610
55941 10007610 10388408 10789681 11213588 11666158 12151773 12670449 13222925 13813511 14445739
55932 14445739 15120434 15840081 16609431 17429536 18297042 19211470 20176972 21195136 22263573
55923 22263573 23384602 24568196 25823589 27155655 28572372 30087164 31710085 33445294
55915 33445294 35301379 37295618 39444421 41759345 44257002 46962874 49900800 53089331
55907 53089331 56552807 60323998 64431832 68902437 73781518 79144482 85081261 91690945
55899 91690945 99101845 107479877 117008922 127884824 140340135 154648498 171083309
55892 171083309 189883300 211249955 235317189 262074110 291307281 322519771 354625675
$$ packed form
55950G314094K40188K55282K68761K82109K98280L15335L29714L43319L60528
55941A0007610L80798M01273M23907M52570M85615N18676N52476N90586O32228
55932A4445739O74695P19647P69350Q20105Q67506R14428R65502J018164J068437
55923B2263573J121029J183594J255393J332066J416717J514792J622921J735209
55915C3445294J856085J994239K148803K314924K497657K705872K937926L188531
55907E3089331L463476L771191M107834M470605M879081N362964N936779O609684
55899I1690945P410900Q378032R529045J0875902J2455311J4308363J6434811
55892A71083309J8799991K1366655K4067234K6756921K9233171L1212490L2105904
$$ plain form
55885 354625675 385452493 411608160 429292265 435802593 430669330 415589194 393397942
55878 393397942 366984024 338723404 310359881 283047321 257448718 233884244 212462454
55871 212462454 193143220 175776866 160167184 146127295 133491468 122109695 111856730
55864 111856730 102636332 94361778 86939232 80276192 74291799 68907892 64040923 59613664
55856 59613664 55567475 51856174 48437369 45277850 42358682 39665981 37182148 34891415
55848 34891415 32785817 30857977 29093338 27474948 25989888 24625674 23366499 22198862
55840 22198862 21115853 20110900 19172388 18289262 17457152 16674513 15937240 15241164 14585110
55831 14585110 13967360 13383425 12830979 12312356 11828212 11372759 10938741 10522931 10123718
$$ packed form
55885C54625675L0826818K6155667J7684105O510328n133263j5080136k2191252
55878C93397942k6413918k8260620k8363523k7312560k5598603k3564474k1421790
55871B12462454j9319234j7366354j5609682j4039889j2635827j1381773j0252965
55864A11856730r220398q274554p422546o663040n984393n383907m866969m427259
55856E9613664m046189l711301l418805l159519k919168k692701k483833k290733
55848C4891415k105598j927840j764639j618390j485060j364214j259175j167637
55840B2198862j083009j004953r38512q83126q32110p82639p37273o96076o56054
55831A4585110o17750n83935n52446n18623m84144m55453m34018m15810l99213
$$ plain form
55822 10123718 9738222 9365820 9010365 8674985 8358093 8057363 7773215 7505087 7248664
55813 7248664 7000488 6761232 6530999 6305785 6082584 5864035 5653952 5452042 5256968
55804 5256968 5070676 4895093 4727980 4566698 4413095 4270062 4135902 4006634 3881404
55795 3881404 3761103 3643953 3527351 3412508 3302587 3197309 3093541 2990392 2889896
55786 2889896 2793353 2700616 2612296 2529224 2450029 2372271 2295669 2221612 2150024 2079318 2009037
55775 2009037 1940178 1873378 1808869 1747633 1690558 1637085 1586555 1540028 1498822 1462048 1427496
55764 1427496 1394299 1362957 1333512 1305435 1278612 1252937 1227700 1202601 1178355 1155172 1132037
55753 1132037 1108810 1087403 1069289 1053390 1038065 1023517 1010422 997829 984542 971280 959536
$$ packed form
55822A0123718l85496l72402l55455l35380l16892l00730k84148k68128k56423
55813G248664k48176k39256k30233k25214k23201k18549k10083k01910j95074
55804E256968j86292j75583j67113j61282j53603j43033j34160j29268j25230
55795C881404j20301j17150j16602j14843j09921j05278j03768j03149j00496
55786B889896r6543r2737q8320q3072p9195p7758p6602p4057p1588p0706p0281
55775B009037o8859o6800o4509o1236n7075n3473n0530m6527m1206l6774l4552
55764A427496l3197l1342k9445k8077k6823k5675k5237k5099k4246k3183k3135
55753A132037k3227k1407j8114j5899j5325j4548j3095j2593j3287j3262j1744
$$ plain form
55742 959536 949625 941605 936498 934474 933329 931076 928617 927579 926990 924830 921672 919879 919887 919951 919095 917622
55726 917622 915068 910252 903425 895979 887856 877350 863834 848853 834177 820249 806921 794386
55714 794386 783001 773073 765013 759073 755032 752385 750242 746762 739940 729724 718126 706416 693680
55701 693680 679196 664429 651084 638727 626194 613919 602834 592213 580826 569267 558893
55690 558893 549327 539299 529301 520936 514047 506904 499231 492788 488708 486099 483605 480876 478229 476010
55676 476010 474335 472575 469485 464828 460055 456165 451953 446036 439531 434643 431315 427546 422561 417378
55662 417378 412389 406700 400092 393572 387668 381925 376397 371986 369123 367594 367714 370079 374070 378186
55648 378186 381826 385156 387467 387648 386275 385061 383931 380856 375094 368423 362243 355579 347292 338477
$$ packed form
55742I59536r911q020n107k024j145k253k459j038n89k160l158j793QO4q56j473
55726I17622k554m816o827p446q123j0506j3516j4981j4676j3928j3328j2535
55714G94386j1385r928q060n940m041k647k143l480o822j0216j1598j1710j2736
55701F93680j4484j4767j3345j2357j2533j2275j1085j0621j1387j1559j0374
55690E58893r566j0028r998q365o889p143p673o443m080k609k494k729k647k219
55676D76010j675j760l090m657m773l890m212n917o505m888l328l769m985n183
55662D17378m989n689o608o520n904n743n528m411k863j529J20K365L991M116
55648C78186L640L330K311J81j373j214j130l075n762o671o180o664q287q815
$$ plain form
55634 338477 331091 325404 320370 315659 311846 308996 306301 303011 299055 295008 292061 291653 294340 298957
55620 298957 303276 305582 305663 304579 303624 303349 303457 303445 302965 301567 298834 295196 291924 289673 287621 284728
55604 284728 281284 278489 277159 277596 279915 283464 286643 288518 290090 292774 296264 299216 301413 303696
55590 303696 306166 308103 309504 311091 312871 314143 314904 315764 316487 316124 314614 312760 310487 306659 300885
55575 300885 294153 287508 281353 276086 271897 267828 262647 256912 252528 249928 247394 243641 239392 235790
55561 235790 233017 231310 231593 233787 235785 235527 233363 231353 230926 232001 233572 234273 233011 229890 226005
55546 226005 221971 217434 212436 208181 205665 204483 203707 203067 202473 201287 199131 196845 195635 195651 196133 196586
55530 196586 197092 197792 198675 199606 200149 199746 198518 197487 197614 198886 200570 201900 202341 201832 201100 201238 202824
$$ packed form
55634C38477p386n687n034m711l813k850k695l290l956m047k947m08K687M617
55620B98957M319K306Q1j084r55k75J08j2m80j398k733l638l272k251k052k893
55604B84728l444k795j330M37K319L549L179J875J572K684L490K952K197K283
55590C03696K470J937J401J587J780J272P61Q60P23l63j510j854k273l828n774
55575C00885o732o645o155n267m189m069n181n735m384k600k534l753m249l602
55561B35790k773j707K83K194J998k58k164k010m27J075J571P01j262l121l885
55546B26005m034m537m998m255k516j182p76o40n94j186k156k286j210J6M82M53
55530A96586N06P00Q83R31N43m03j228j031J27J272J684J330M41n09p32J38J586
$$ plain form
55513 202824 205919 210729 217221 224055 229239 232414 235333 239414 243812 246740 247645 247069 245154 241548 236558
55498 236558 231446 227561 225417 224215 222041 217291 210374 203443 198075 194093 190936 188890 188084 187530 186479
55483 186479 185782 186482 187651 187144 184271 180366 176926 174481 173202 173125 173474 172986 171451 170020 169530 169369
55467 169369 168494 166926 165628 165172 164903 163309 159354 153814 149193 147652 148994 151322 153543 156111 159092
55452 159092 160986 160704 159784 161012 164868 168772 170202 169237 167262 164470 160133 154825 150646 148910 148860
55437 148860 149176 149494 149607 148262 144355 139074 135444 135356 137911 140968 143409 145323 146691 146905 145686 143907
55421 143907 143081 144020 146105 147940 148620 148269 147562 147226 147983 150306 153835 157481 160467 162811 164469 164718
55405 164718 163053 160192 157342 154855 152465 150513 149891 150752 152144 153084 153354 153192 152767 152067 150929 149196
$$ packed form
55513B02824L095M810O492O834N184L175K919M081M398K928R05n76j915l606m990
55498B36558n112l885k144j202k174m750o917o931n368l982l157k046q06n54j051
55483A86479o97P00J169n07k873l905l440k445j279p7L49m88j535j431m90j61
55467A69369q75j568j298m56k69j594l955n540m621j541J342K328K221K568K981
55452A59092J894k82r20J228L856L904J430r65j975k792m337n308m179j736n0
55437A48860L16L18J13j345l907n281l630q8K555L057K441J914J368K14j219j779
55421A43907q26R39K085J835O80l51p07l36P57K323L529L646K986K344J658K49
55405A64718j665k861k850k487k390j952o22Q61J392R40K70j62m25p00j138j733
$$ plain form
55389 149196 147049 144841 142332 138834 134714 131826 131447 132489 133024 132869 133194 134126 134573 134271 134152 134557
55373 134557 134902 135373 137028 139615 141165 140736 139911 140354 141256 140641 138377 136563 137338 141150 146607 151286
55357 151286 153281 152727 151482 151017 151177 151203 150911 150335 149109 146841 143483 139140 134461 131263 131213 133320
55341 133320 134289 132333 129294 128021 129086 131230 133529 135543 136502 136147 135630 136013 136461 135448 133154 131150
55325 131150 130278 130372 131555 134077 137067 139036 139646 139666 139356 138331 136911 136038 135668 134678 132677 130696 129735
55308 129735 129686 130039 130677 131506 132091 132121 131751 131261 130750 130135 129037 126978 124207 122038 121683 123105 125527
55291 125527 128340 130657 130901 128427 125189 124103 125623 127359 127288 126068 125902 128226 132807 137997 141580
55276 141580 142396 141549 141155 141784 142071 140918 138864 136965 135552 134651 134489 134900 135125 134899 134973 135917 137093
$$ packed form
55389A49196k147k208k509l498m120k888l79J042N35j55L25R32M47l02j19M05
55373A34557L45M71J655K587J550m29q25M43R02o15k264j814P75L812N457M679
55357A51286J995n54j245m65J60K6k92n76j226k268l358m343m679l198n0K107
55341A33320R69j956l039j273J065K144K299K014R59l55n17L83M48j013k294k004
55325A31150q72R4J183K522K990J969O10K0l10j025j420q73l70r90k001j981r61
55308A29735m9L53O38Q29N85L0l70m90n11o15j098k059k771k169l55J422K422
55291A25527K813K317K44k474l238j086J520J736p1j220j66K324M581N190L583
55276A41580Q16q47l94O29K87j153k054j899j413r01j62M11K25k26P4R44J176
$$ plain form
55259 137093 137556 137366 137304 137654 137936 137720 137248 137295 138466 140513 142438 143530 144052 144540 144936 145099 145544 146544
55241 146544 146912 145143 141652 138298 135658 132584 128938 126756 127475 129599 130696 130647 131290 133482 136135
55226 136135 137899 138446 138107 137468 137463 138913 141633 144512 146560 147513 147590 147182 146653 145978 144851 143606 143553 145527
55208 145527 148374 149913 149424 148248 147711 147447 146342 144333 142379 140998 139704 137956 135901 133906 131989
55193 131989 130302 129773 131359 134562 137508 139002 139929 141928 145051 147617 148240 147064 144855 141925 138625
55178 138625 136176 135911 137620 139354 139241 137314 135256 134563 135280 136550 137788 138793 139031 137870 135778
55163 135778 134488 135280 137562 139727 140867 141065 140629 139945 139593 139591 138812 136262 132679 129763 128124 127349 127927
55146 127927 131201 136881 142265 145097 146108 147645 150568 153588 155092 154603 152695 150345 148421 147358
$$ packed form
55259A37093M63j90o2L50K82k16m72M7J171K047J925J092N22M88L96J63M45J000
55241A46544L68j769l491l354k640l074l646k182P19K124J097m9O43K192K653
55226A36135J764N47l39o39nJ450K720K879K048R53P7m08n29o75j127j245n3J974
55208A45527K847J539m89j176n37k64j105k009j954j381j294j748k055j995j917
55193A31989j687n29J586L203K946J494R27J999L123K566O23j176k209k930l300
55178A38625k449k65J709J734j13j927k058o93P17J270J238J005K38j161k092
55163A35778j290P92K282K165J140J98m36o84l52kp79k550l583k916j639p75N78
55146A27927L274N680N384K832J011J537K923L020J504m89j908k350j924j063
$$ plain form
55132 147358 147241 148058 149349 149880 148685 146665 145988 147469 149660 151131 152320 154061 155488 154891 152132
55117 152132 148841 146514 145484 145495 146175 147068 147940 148801 149018 147215 143166 139133 137938 139949 143307 146721
55101 146721 150384 154122 156501 156517 154935 153238 152215 152080 152916 154229 154925 154550 153963 154089 154587 154494 153751
55084 153751 153326 153988 155597 157522 159310 160880 162337 163614 164341 164274 163832 163751 164116 164194 163433 162219 161357
55067 161357 161157 161316 161454 161469 161520 161819 162342 162792 162998 163093 162966 161913 159675 157567 157403 159106 160484 159902
55049 159902 158089 156575 155509 154252 153336 154234 157322 161381 165225 168657 171586 173334 173446 172462 171359
55034 171359 170728 170799 171601 172596 172723 171465 169631 168665 169339 171354 173788 175543 175897 175245 175028 176283 178382
55017 178382 179694 179344 177753 175716 173761 172463 172527 174109 176487 178679 180050 180213 178960 176685 174434
$$ packed form
55132A47358j17Q17J291N31j195k020o77J481K191J471J189J741J427n97k759
55117A52132l291k327j030J1O80Q93Q72Q61K17j803m049m033j195K011L358L414
55101A46721L663L738K379J6j582j697j023j35Q36J313O96l75n87J26M98r3p43
55084A53751m25O62J609J925J788J570J457J277P27o7m42q1L65P8p61j214q62
55067A61357k00J59J38J5N1K99N23M50K06R5j27j053k238k108j64J703J378n82
55049A59902j813j514j066j257r16Q98L088M059L844L432K929J748J12r84j103
55034A71359o31P1Q02R95J27j258j834r66O74K015K434J755L54o52k17J255K099
55017A78382J312l50j591k037j955j298O4J582K378K192J371J63j253k275k251
$$ plain form
55002 174434 173017 172264 171432 170100 168383 166618 165248 164725 165083 165703 165862 165448 164974 165096 166316 168688
54986 168688 171369 172847 172282 170446 168853 168088 167599 166907 166252 166008 166193 166757 167681 168564 168696 167848 166603
54969 166603 165692 165431 165945 167333 169235 170721 171088 170501 169552 168521 167458 166667 166662 167712 169681 172102 174185
54952 174185 174986 174064 171964 169847 168567 168185 168277 168637 169623 171659 174280 176078 176084 175024 174504 175022 175596
54935 175596 175533 175597 176824 178906 180584 181284 181652 182656 184807 188086 191920 195164 196706 196365 194987 193590
54919 193590 192569 191730 190897 190283 190208 190475 190372 189593 188854 188970 189493 189104 187501 186003 185882 186885 187921
54902 187921 188481 188756 189000 189501 190628 192193 193311 193549 193575 193863 193548 191735 189401 188595 189922 192167 194273
54885 194273 196147 197381 196864 194576 192456 192328 193561 193825 191863 188741 186568 186672 188945 192283 195379
$$ packed form
55002A74434j417p53q32j332j717j765j370n23L58O20J59m14m74J22J220K372
54986A68688K681J478n65j836j593p65m89o92o55k44J85N64R24Q83J32q48j245
54969A66603r11k61N14J388J902J486L67n87r49j031j063p91nJ050J969K421K083
54952A74185Q01r22k100k117j280l82R2L60R86K036K621J798Oj060n20N18N74
54935A75596o3O4J227K082J678P00L68J004K151L279L834L244J542l41j378j397
54919A93590j021q39q33o14p5K67j03p79p39J16N23l89j603j498j21J003J036
54902A87921N60K75K44N01J127J565J118K38K6K88l15j813k334q06J327K245K106
54885A94273J874J234n17k288k120j28J233K64j962l122k173J04K273L338L096
$$ plain form
54870 195379 197370 198068 197782 197030 196220 195359 194177 192858 192445 194049 197666 202249 206947 211871 217644 224687
54854 224687 232876 241344 248686 254035 258043 262015 265892 267901 266646 262853 258427 254360 250379 246366
54840 246366 243186 241749 241706 241426 239291 234967 229490 224293 220266 217489 215398 213113 210165 207270 205899
54825 205899 206559 207961 208519 208223 208314 209581 212053 215971 221634 228048 233036 235313 235711 236082 237839 241721
54809 241721 247773 254820 260824 264539 266300 266840 266217 264422 261987 259145 255225 249844 244086 239501 236413
54794 236413 234012 231599 228838 225279 220738 215947 212035 209468 207911 206602 204238 199383 192164 185084
54780 185084 180916 180008 180606 181379 182310 183471 184460 185150 185592 184997 182276 177989 174418 173041 173069 173109 173102 173729
54762 173729 174807 175467 175439 175267 175538 176620 178847 182168 185655 188071 189076 189584 190825 193167 195782 197429
$$ packed form
54870A95379J991O98k86p52q10q61j182j319m13J604L617M583M698M924N773P043
54854B24687Q189Q468P342N349M008L972L877K009j255l793m426m067l981m013
54840B46366l180j437m3k80k135m324n477n197m027k777k091k285k948k895j371
54825B05899O60J402N58k96R1J267K472L918N663O414M988K277L98L71J757L882
54809B41721O052P047O004L715J761N40o23j795k435k842l920n381n758m585l088
54794B36413k401k413k761l559m541m791l912k567j557j309k364m855p219p080
54780A85084m168r08N98P73R31J161R89O90M42n95k721m287l571j377K8M0pO27
54762A73729J078O60k8j72K71J082K227L321L487K416J005N08J241K342K615J647
$$ plain form
54746 197429 197649 197059 196331 195263 193455 191502 190504 190383 189894 188640 187869 188615 190079 190872 191127 192199 194709
54729 194709 197915 200880 203301 205262 206997 208925 211272 213705 215870 218001 220219 221558 220807 218463
54715 218463 216758 217309 219570 222078 224370 226947 229941 232805 235213 237528 240289 243733 247996 253333
54701 253333 259821 266887 273389 278387 281970 285196 288989 292985 295659 295652 292806 287840 281405 273848 265754
54686 265754 258200 252191 247936 244795 241886 238672 235154 231696 228733 226458 224663 222850 220572 217698
54672 217698 214435 211312 209183 208948 210870 214130 217360 219787 221752 224090 227279 231290 235919 240910
54658 240910 245812 250100 253706 257327 261939 267676 273154 276334 276490 275183 274690 275425 275439 272608 266744
54643 266744 259260 251503 244140 237763 233139 230614 229644 228939 226964 222748 216794 210978 206970 204844 203679
$$ packed form
54746A97429K20n90p28j068j808j953r98j21m89j254p71P46J464P93K55J072K510
54729A94709L206K965K421J961J735J928K347K433K165K131K218J339p51k344
54715B18463j705N51K261K508K292K577K994K864K408K315K761L444M263N337
54701B53333O488P066O502M998L583L226L793L996K674pk846m966o435p557q094
54686B65754p554o009m255l141k909l214l518l458k963k275j795j813k278k874
54672B17698l263l123k129k35J922L260L230K427J965K338L189M011M629M991
54658B40910M902M288L606L621M612N737N478L180J56j307m93P35J4k831n864
54643B66744p484p757p363o377m624k525r70p05j975m216n954n816m008k126j165
$$ plain form
54628 203679 203141 203575 204706 205406 205060 204260 203721 203338 202821 202383 202110 201336 199601 197730 196961 197123 196726 194983
54610 194983 192808 191454 190873 190089 188876 188317 189436 191642 193116 192864 191909 191924 193062 194068 194484 195456
54594 195456 197745 200122 200920 200387 200031 200098 199407 197759 196759 197517 198976 199471 198805 197724 196373 194759
54578 194759 194094 195963 200040 203929 205552 204723 202313 199173 196347 194978 194984 194607 192455 189540 188170 189031
54562 189031 190471 190818 190289 190126 190648 191009 190597 190000 190472 192727 196210 199464 201376 202257 203411 205419
54546 205419 207243 207402 205754 203497 201667 200304 199170 198461 198534 199471 201220 203668 206231 207944 208462 208503
54530 208503 208764 208825 207881 206221 205116 205164 205613 205562 205165 205256 206240 207739 209079 209828 210067 210366 211278 212680
54512 212680 213795 214030 213619 213351 213833 215008 216194 216529 215644 213927 212024 210318 209205 209438 211353 213919
$$ packed form
54628B03679n38M34J131P00l46q00n39l83n17m38k73p74j735j871p69J62l97j743
54610A94983k175j354n81p84j213n59J119K206J474k52r55J5J138J006M16R72
54594A95456K289K377P98n33l56O7o91j648j000P58J459M95o66j081j351j614
54578A94759o65J869M077L889J623q29k410l140k826j369Ol77k152k915j370Q61
54562A89031J440L47n29j63N22L61m12n97M72K255L483L254J912Q81J154K008
54546B05419J824J59j648k257j830j363j134p09P3R37J749K448K563J713N18M1
54530B08503K61O1r44j660j105M8M49n1l97R1R84J499J340P49K39K99R12J402
54512B12680J115K35m11k68M82J175J186L35q85j717j903j706j113K33J915K566
$$ plain form
54496 213919 215649 216585 218230 220954 222721 221444 217784 214289 212257 210893 209445 208608 209260 210974 212605
54481 212605 213739 214820 216212 217722 218898 219428 219391 219410 220273 222085 223921 224619 223774 221760 219061 215990
54465 215990 212996 210716 209466 208888 208390 207933 208135 209430 211338 212847 213470 213520 213348 212887 212270 212269 213406
54448 213406 214927 215509 214997 214636 215375 216669 217419 217471 217626 218438 219633 220646 221238 221499 221537 221378 221083 220830
54430 220830 220736 220517 219593 217955 216874 218123 222062 226818 229869 230387 229710 229557 230273 231056 231462 232103 233710
54413 233710 235999 237980 239253 240384 241871 243338 244200 244598 245006 245231 244591 243015 241234 239874 239093 239148
54397 239148 240380 242222 243064 241772 238939 236181 234626 234466 235412 236833 237754 237436 236001 234141 232327
54382 232327 230614 228973 227491 226442 226393 227847 230403 232743 233938 234344 234712 234969 234641 234029 233926 234329
$$ packed form
54496B13919J730R36J645K724J767j277l660l495k032j364j448q37O52J714J631
54481B12605J134J081J392J510J176N30l7J9Q63J812J836O98q45k014k699l071
54465B15990k994k280j250n78m98m57K02J295J908J509O23N0j72m61o17jJ137
54448B13406J521N82n12l61P39J294P50N2J55Q12J195J013N92K61L8j59k95k53
54430B20830r4k19r24j638j081J249L939M756L051N18o77j53P16P83M06O41J607
54413B33710K289J981J273J131J487J467Q62L98M08K25o40j576j781j360p81N5
54397B39148J232J842Q42j292k833k758j555j60R46J421R21l18j435j860j814
54382B32327j713j641j482j049m9J454K556K340J195M06L68K57l28o12j03M03
$$ plain form
54366 234329 234445 234022 233684 233829 234118 234358 235011 236400 238200 240207 242838 246168 249103 250327 249810 248633
54350 248633 247555 246494 245396 244816 245220 246114 246250 244747 241974 239448 238829 240755 244373 247972 250240
54335 250240 251175 251971 253869 256862 259579 260634 259977 258708 257758 257323 257546 258991 261920 265579 268791 271118
54319 271118 272943 274461 275131 274342 272377 270405 269428 269375 269442 269324 269739 271364 273604 275115 275479 275510 275752
54302 275752 275671 274927 274487 275381 276938 277612 277391 278099 280967 285032 288379 290040 290110 289044 287804 287937 290242
54285 290242 293425 295021 293674 289865 284642 278720 272999 268821 266910 266522 266242 265359 264124 263005 262128
54270 262128 261176 259477 256474 252532 249059 247409 247793 249483 251673 253689 254810 254634 253433 251526 248649
54255 248649 244859 241767 241535 244256 247447 248728 248030 246536 244595 241963 239384 238316 239010 240061 240215
$$ packed form
54366B34329J16m23l38J45K89K40O53J389J800K007K631L330K935J224n17j177
54350B48633j078j061j098n80M04Q94J36j503k773k526o19J926L618L599K268
54335B50240R35P96J898K993K717J055o57j269r50m35K23J445K929L659L212K327
54319B71118J825J518O70p89j965j972r77n3O7j18M15J625K240J511L64L1K42
54302B75752q1p44m40Q94J557O74k21P08K868M065L347J661P0j066j240J33K305
54285B90242L183J596j347l809n223n922n721m178j911l88k80q83j235j119q77
54270B62128r52j699l003l942l473j650L84J690K190K016J121j76j201j907k877
54255B48649l790l092k32K721L191J281o98j494j941k632k579j068O94J051J54
$$ plain form
54240 240215 239678 239200 238723 237631 235965 234717 234961 236964 240056 243117 245234 246089 245930 245355 245079 245447
54224 245447 245935 245556 244206 243295 244379 247369 250765 253375 255027 255737 255357 254357 253918 254611 255637 255850
54208 255850 254865 252774 249750 246754 245759 248037 252564 257144 260785 263917 266630 268250 268883 269978 272560
54193 272560 275820 278159 278957 278644 277749 276695 276086 276274 276831 277246 277836 279118 280469 280593 279446 278482 278424
54176 278424 277950 275519 271738 268649 267088 266133 265097 264538 264820 264973 263928 261873 259420 256310 252346
54161 252346 249008 248451 250830 254030 256297 257700 258613 258313 256222 253355 251239 250073 249131 248335 248068 247806
54145 247806 246443 244024 241902 241036 241288 242543 245158 248844 252358 255033 257519 260170 261733 260870 258409
54130 258409 256721 257033 258369 259097 258518 256886 254848 253185 252362 251917 250854 248972 247375 247310 248771 250514
$$ packed form
54240B40215n37m78m77j092j666j248K44K003L092L061K117Q55j59n75k76L68
54224B45447M88l79j350r11J084K990L396K610J652P10l80j000m39O93J026K13
54208B55850r85k091l024k996r95K278M527M580L641L132K713J620O33J095K582
54193B72560L260K339P98l13q95j054o09J88N57M15N90J282J351J24j147r64n8
54176B78424m74k431l781l089j561r55j036n59K82J53j045k055k453l110l964
54161B52346l338n57K379L200K267J403R13l00k091k867k116j166r42p96k67k62
54145B47806j363k419k122q66K52J255K615L686L514K675K486K651J563q63k461
54130B58409j688L12J336P28n79j632k038j663q23m45j063j882j597o5J461J743
$$ plain form
54114 250514 251167 250239 248402 247013 246996 247936 248533 248056 247034 246335 246094 245921 245747 245863 246272 246562 246415 245923
54096 245923 245367 244996 244959 245160 245209 244846 244313 244002 243762 242920 241018 238253 235316 233151 232685 234117 236428
54079 236428 238217 239226 240406 242253 243892 244410 244397 245273 247357 249443 250206 249380 247672 246191 245961 247232
54063 247232 249228 251087 252890 255056 256991 257607 257282 257803 259625 260636 258993 256191 255594 258193 261517
54048 261517 262964 262686 262577 263685 265580 267474 268828 269119 267998 265874 263957 263521 265123 268258 271601
54033 271601 273940 275263 276760 279518 283445 287641 291330 293995 295090 294463 292988 292054 292250 292997 293561
54018 293561 293910 294385 295071 295917 297233 299691 303862 309818 317055 324699 332025 338923 345766 352786 359808
54003 359808 366516 372629 377668 381005 382402 382172 380603 377622 373426 368927 364949 361297 357398 353677
$$ packed form
54114B50514O53r28j837j389j7R40N97m77j022o99k41j73j74J16M09K90j47m92
54096B45923n56l71l7K01M9l63n33l11k40q42j902k765k937k165m66J432K311
54079B36428J789J009J180J847J639N18j3Q76K084K086P63q26j708j481k30J271
54063B47232J996J859J803K166J935O16l25N21J822J011j643k802n97K599L324
54048B61517J447k78j09J108J895J894J354K91j121k124j917m36J602L135L343
54033B71601K339J323J497K758L927M196L689K665J095o27j475r34J96P47N64
54018B93561L49M75O86Q46J316K458M171N956P237P644P326O898O843P020P022
54003C59808O708O113N039L337J397k30j569k981m196m499l978l652l899l721
$$ plain form
53989 353677 351287 350254 348934 346037 342573 340971 342496 346241 350430 353874 356131 357206 357742 359054
53975 359054 362328 367713 374417 381509 388337 394352 399055 402366 404853 407355 410454 414354 419075 424388
53961 424388 429512 433268 434964 435128 435028 435299 435310 434033 431271 427717 424032 420323 416509 412770 409414
53946 409414 406428 403246 398909 392716 385117 377807 372353 368636 365134 360892 356551 353101 350395 347608
53932 347608 344682 342382 341128 340719 341292 343514 347388 351607 354789 356956 359140 361789 364217 365632 366119
53917 366119 366396 366993 367938 369022 370051 370791 370875 369886 367595 364114 359834 355283 351099 348029 346712 347257
53901 347257 349088 351235 352785 353115 351988 349733 347364 346298 347621 351347 356259 360654 363605 365582
53887 365582 367665 370184 372520 374412 376889 381293 387541 394024 399376 403716 407899 412200 416412 420883
$$ packed form
53989C53677k390j033j320k897l464j602J525L745M189L444K257J075N36J312
53975C59054L274N385O704P092O828O015M703L311K487K502L099L900M721N313
53961D24388N124L756J696J64j00K71J1j277k762l554l685l709l814l739l356
53946D09414k986l182m337o193p599p310n454l717l502m242m341l450k706k787
53932C47608k926k300j254m09N73K222L874M219L182K167K184K649K428J415M87
53917C66119K77N97R45J084J029P40Q4r89k291l481m280m551m184l070j317N45
53901C47257J831K147J550L30j127k255k369j066J323L726M912M395K951J977
53887C65582K083K519K336J892K477M404O248O483N352M340M183M301M212M471
$$ plain form
53873 420883 426560 433759 441574 448940 455897 463364 471916 481304 491146 501575 512993 525519 538926
53860 538926 552969 567412 581644 594378 604066 609943 612782 614317 615651 616466 616137 615253 615264 616561
53846 616561 617745 617141 614397 610128 604717 598344 591837 586472 582804 580342 578371 576376 573554 568801
53832 568801 561699 553084 544184 535518 526889 518042 508931 499613 490271 481244 472881 465560 459773 455658
53818 455658 452205 447606 440906 432915 425131 418310 412671 408688 406526 404912 401817 396619 390811 386262
53804 386262 383428 381506 379572 377087 373908 370407 367311 364912 362688 359979 356815 353795 351529 350469
53790 350469 350786 351932 352779 352800 352754 353527 354609 354666 353510 352501 352670 353373 353316 352185 350543 348661 346338
53773 346338 343751 341563 340045 338740 337364 336564 337311 339741 342973 345946 348085 349222 349379 348959 348915 350144
$$ packed form
53873D20883N677P199P815P366O957P467Q552R388R842J0429J1418J2526J3407
53860E38926J4043J4443J4232J2734R688N877K839J535J334Q15l29q84J1J297
53846F16561J184o04k744m269n411o373o507n365l668k462j971j995k822m753
53832E68801p102q615q900q666q629q847r111r318r342r027q363p321n787m115
53818D55658l453m599o700p991p784o821n639l983k162j614l095n198n808m549
53804C86262k834j922j934k485l179l501l096k399k224k709l164l020k266j060
53790C50469L17J146Q47K1m6P73J082N7j156j009J69P03n7j131j642j882k323
53773C46338k587k188j518j305j376q00P47K430L232K973K139J137J57m20m4J229
$$ plain form
53757 350144 352540 354898 356083 356205 356373 357329 358810 360412 362568 366173 371474 377896 384823 391873 398386
53742 398386 403510 407353 411349 416737 423034 428740 433167 436618 439094 440243 440850 442775 446427 449463
53728 449463 449475 447259 445878 446809 448827 450725 453040 456068 457992 456760 452923 448818 445379 441496 436515
53713 436515 431505 427516 424103 420481 416906 413806 410463 405907 400630 396071 392540 388834 384025 378565
53699 378565 373410 368978 365382 362818 361189 359957 358873 358354 358643 359135 359140 358831 358723 358640 358042 357100 356519
53682 356519 356293 355682 354607 354157 355180 357155 359086 360926 363268 366031 368435 370299 372406 375175 377660
53667 377660 378552 377955 377543 378900 382040 385764 389143 392266 395556 398845 401615 404011 406961 410862 414649
53652 414649 416874 417645 418726 421451 425248 428861 432463 437548 444668 452196 457871 461001 462593 463786
$$ packed form
53757C50144K396K358J185J22J68R56J481J602K156L605N301O422O927P050O513
53742C98386N124L843L996N388O297N706M427L451K476J149O07J925L652L036
53728D49463J2k216j381R31K018J898K315L028J924j232l837m105l439l883m981
53713D36515n010l989l413l622l575l100l343m556n277m559l531l706m809n460
53699C78565n155m432l596k564j629j232j084n19K89M92Nl09j08q3n98r42n81
53682C56519k26o11j075m50J023J975J931J840K342K763K404J864K107K769K485
53667C77660Q92n97m12J357L140L724L379L123L290L289K770K396K950L901L787
53652D14649K225P71J081K725L797L613L602N085P120P528N675L130J592J193
$$ plain form
53638 463786 464978 466418 468691 472119 476164 479845 482572 484331 485418 486425 488187 491109 494564 497354
53624 497354 498823 499191 498907 498207 497267 496207 494733 492363 489208 485945 482666 478520 473230 468413 466326
53609 466326 467287 469171 469653 468277 466219 464801 464704 466005 468244 470571 472302 473326 473762 473433 471986 469445
53593 469445 466439 463879 462517 462528 463320 464048 464687 466343 470047 475276 480188 483415 485256 486944 489166
53578 489166 491582 493655 495488 497677 500524 503747 507147 511266 516842 523489 529495 533476 536002 539003
53564 539003 543646 549356 554987 560299 565987 572636 580073 587489 593938 599027 603480 608805 615962 624365
53550 624365 632521 639633 646276 653458 661279 668666 674353 678076 680828 683867 687452 690688 692650 693388
53536 693388 693619 693668 693118 691401 688433 684718 681069 678122 675827 673480 670637 667809 665749 664129 661715
$$ packed form
53638D63786J192J440K273L428M045L681K727J759J087J007J762K922L455K790
53624D97354J469L68k84p00r40j060j474k370l155l263l279m146n290m817k087
53609D66326R61J884M82j376k058j418r7J301K239K327J731J024M36l29j447k541
53593D69445l006k560j362J1P92P28O39J656L704N229M912L227J841J688K222
53578D89166K416K073J833K189K847L223L400M119N576O647O006L981K526L001
53564E39003M643N710N631N312N688O649P437P416O449N089M453N325P157Q403
53550F24365Q156P112O643P182P821P387N687L723K752L039L585L236J962P38
53536F93388K31M9n50j717k968l715l649k947k295k347k843k828k060j620k414
$$ plain form
53521 661715 658020 654037 650891 648534 646422 644833 644379 644469 643466 640712 637466 635322 634408 633769 632928 632279
53505 632279 632217 632742 633867 635630 637547 638812 639479 640871 644145 648694 652626 654836 656096 657968 661191
53490 661191 665542 670864 677506 685538 694097 701997 708910 715615 723092 731657 741077 751278 762738 776228
53476 776228 792209 810293 829156 847227 863816 879640 896118 914200 933989 955255 977915
53465 977915 1001937 1027104 1053050 1079380 1105687 1131699 1157621 1184169 1212126 1241955 1273887
53454 1273887 1308062 1344295 1381940 1420356 1459451 1499438 1540160 1581123 1622287 1664262 1707235
53443 1707235 1750004 1790706 1828595 1864646 1900093 1934778 1967458 1997665 2026613 2056020 2086465
53432 2086465 2117298 2147772 2177630 2206811 2235333 2263524 2291633 2319072 2344827 2368983 2392932
$$ packed form
53521F61715l695l983l146k357k112j589m54R0j003k754l246k144r14o39q41o49
53505F32279o2N25J125J763J917J265O67J392L274M549L932K210J260J872L223
53490F61191M351N322O642Q032Q559P900O913O705P477Q565R420J0201J1460J3490
53476G76228J5981J8084J8863J8071J6589J5824J6478J8082J9789K1266K2660
53465I77915K4022K5167K5946K6330K6307K6012K5922K6548K7957K9829L1932
53454A273887L4175L6233L7645L8416L9095L9987M0722M0963M1164M1975M2973
53443A707235M2769M0702L7889L6051L5447L4685L2680L0207K8948K9407L0445
53432B086465L0833L0474K9858K9181K8522K8191K8109K7439K5755K4156K3949
$$ plain form
53421 2392932 2417360 2440741 2460769 2476657 2488980 2497833 2502816 2504780 2505761 2506417 2504844 2498881 2488569
53408 2488569 2475323 2459661 2441034 2419360 2395441 2370155 2344334 2319102 2294985 2270734 2244240
53397 2244240 2214779 2183277 2150451 2116130 2080801 2046293 2014027 1983628 1954190 1925892 1899365
53386 1899365 1874354 1850364 1828081 1808688 1792038 1776995 1763735 1754269 1749987 1749682 1750824 1752260
53374 1752260 1754947 1760382 1769041 1780274 1793144 1807214 1822812 1840679 1861224 1884082 1908446 1933947
53362 1933947 1961201 1991401 2025230 2062185 2101180 2141745 2184276 2229018 2275384 2322862 2372241
53351 2372241 2425134 2482222 2542577 2604906 2668963 2735416 2804769 2876808 2951009 3027167 3105670
53340 3105670 3187215 3272174 3360070 3449590 3539048 3627025 3713103 3798382 3884793 3973116 4061616
$$ packed form
53421B392932K4428K3381K0028J5888J2323Q853M983J964R81O56j573n963j0312
53408B488569j3246j5662j8627k1674k3919k5286k5821k5232k4117k4251k6494
53397B244240k9461l1502l2826l4321l5329l4508l2266l0399k9438k8298k6527
53386A899365k5011k3990k2283j9393j6650j5043j3260r466m282l05J142J436
53374A752260K687N435Q659J1233J2870J4070J5598J7867K0545K2858K4364K5501
53362A933947K7254L0200L3829L6955L8995M0565M2531M4742M6366M7478M9379
53351B372241N2893N7088O0355O2329O4057O6453O9353P2039P4201P6158P8503
53340C105670Q1545Q4959Q7896Q9520Q9458Q7977Q6078Q5279Q6411Q8323Q8500
$$ plain form
53329 4061616 4147241 4228236 4304952 4378155 4447451 4511821 4570908 4625000 4674121 4717816 4755589
53318 4755589 4786933 4811084 4827387 4835884 4837027 4830706 4816003 4792035 4758793 4717079 4667851 4611676
53306 4611676 4548702 4479101 4403539 4323045 4238417 4150145 4059098 3966845 3874869 3783771 3693678
53295 3693678 3605089 3518754 3434993 3353743 3275074 3198885 3124216 3049867 2975934 2903928 2835004
53284 2835004 2768829 2704702 2643063 2585112 2531360 2481357 2434572 2390717 2349272 2309694 2272412
53273 2272412 2238969 2210514 2186379 2164586 2143650 2123558 2105150 2088960 2074756 2061784 2049120
53262 2049120 2036063 2022621 2009758 1998907 1991029 1986098 1983459 1982465 1982846 1984862 1989217 1996467 2006263
53249 2006263 2017551 2029870 2044020 2060822 2079548 2098555 2117617 2138734 2164111 2193980 2226994
$$ packed form
53329D061616Q5625Q0995P6716P3203O9296O4370N9087N4092M9121M3695L7773
53318D755589L1344K4151J6303Q497J143o321j4703k3968l3242m1714m9228n6175
53306D611676o2974o9601p5562q0494q4628q8272r1047r2253r1976r1098r0093
53295C693678q8589q6335q3761q1250p8669p6189p4669p4349p3933p2006o8924
53284B835004o6175o4127o1639n7951n3752n0003m6785m3855m1445l9578l7282
53273B272412l3443k8455k4135k1793k0936k0092j8408j6190j4204j2972j2664
53262B049120j3057j3442j2863j0851p878m931k639r94L81K016M355P250R796
53249B006263J1288J2319J4150J6802J8726J9007J9062K1117K5377K9869L3014
$$ plain form
53238 2226994 2262142 2299365 2338482 2378568 2418755 2458977 2499413 2539546 2578362 2615308 2650492
53227 2650492 2683822 2714501 2741823 2766099 2788144 2807784 2823502 2833805 2838349 2837280 2830176 2816615
53215 2816615 2797604 2775392 2751571 2726077 2698238 2667854 2634731 2598076 2557366 2513447 2467936
53204 2467936 2421641 2374362 2326124 2277724 2229785 2181758 2132216 2080051 2025528 1970427 1916921
53193 1916921 1865850 1816160 1766494 1717048 1669265 1623942 1580562 1538505 1497879 1458697 1420177
53182 1420177 1381611 1343458 1306991 1273242 1242812 1216126 1192943 1171805 1150924 1129851 1109666
53171 1109666 1091299 1074237 1057220 1039772 1022517 1006071 990205 974356 958533 943144 927830
53160 927830 911146 891958 870963 850205 831122 813652 797193 781538 766487 751479 736377
$$ packed form
53238B226994L5148L7223L9117M0086M0187M0222M0436M0133L8816L6946L5184
53227B650492L3330L0679K7322K4276K2045J9640J5718J0303M544j069p104j3561
53215B816615j9011k2212k3821k5494k7839l0384l3123l6655m0710m3919m5511
53204B467936m6295m7279m8238m8400m7939m8027m9542n2165n4523n5101n3506
53193A916921n1071m9690m9666m9446m7783m5323m3380m2057m0626l9182l8520
53182A420177l8566l8153l6467l3749l0430k6686k3183k1138k0881k1073k0185
53171A109666j8367j7062j7017j7448j7255j6446j5866j5849j5823j5389j5314
53160I27830j6684j9188k0995k0758j9083j7470j6459j5655j5051j5008j5102
$$ plain form
53149 736377 722108 709614 698486 687535 676523 666309 657164 647993 637713 626616 615693 605129
53137 605129 594287 583015 572141 562428 553547 544669 535969 528919 524646 522255 519379 514482 507972
53124 507972 500956 493827 486770 480815 477021 474786 472231 468402 464066 460104 456360 452662 449773 448304
53110 448304 447381 445535 442596 439820 438386 438493 439631 440916 441267 440057 437577 434375 430419 425668 421160
53095 421160 418449 417827 417933 417307 415607 413251 410793 408954 408393 408906 409460 409460 409486 410391 412212 414349 416290
53078 416290 417681 418245 418147 418023 418219 418441 418534 418981 420031 420832 420208 417980 414926 411801 409156 407678 407766
53061 407766 408960 410723 413574 418271 423781 427442 427823 426509 426171 427455 428689 428243 426065 422812 418662
53046 418662 413797 409514 407666 408600 410393 410847 409930 409321 409677 409581 407756 405207 403989 404481 405182 404925 403940
$$ packed form
53149G36377j4269j2494j1128j0951j1012j0214r145r171j0280j1097j0923j0564
53137F05129j0842j1272j0874r713q881q878q700p050m273k391k876m897o510
53124E07972p016p129p057n955l794k235k555l829m336l962l744l698k889j469
53110D48304r23j846k939k776j434J07J138J285L51j210k480l202l956m751m508
53095D21160k711o22J06o26j700k356k458j839n61N13N54%K6R05J821K137J941
53078D16290J391N64r8j24J96K22R3M47J050Q01o24k228l054l125k645j478Q8
53061D07766J194J763K851M697N510L661L81j314l38J284J234m46k178l253m150
53046D18662m865m283j848R34J793M54r17o09L56r6j825k549j218M92P01k57r85
$$ plain form
53029 403940 402743 401440 400548 401031 402632 403387 401933 399497 398292 398488 398166 396081 393029 390240 387691
53014 387691 384734 381534 379049 377935 378051 378832 379653 379975 379571 378670 377624 376434 374811 372691 370518 368991
52998 368991 368651 369740 372244 375780 379412 381849 382273 381022 379206 377500 375560 372806 369510 366739 365318
52983 365318 365112 365241 364707 362977 360439 358402 358275 360455 364029 367540 369927 370918 370977 371026 371822 373308 374662
52966 374662 375052 374140 371878 368419 364643 362352 363060 366396 370282 373117 375404 378696 383088 386521 386912
52951 386912 384531 381726 380494 380896 381784 382297 382201 381418 380001 378503 377667 377615 377798 377905 378333 379479 380974
52934 380974 382018 382262 381908 381129 379954 378854 378838 380530 383313 385851 387392 388215 388765 388920 388388 387373
52918 387373 386351 385478 384846 385189 387530 391892 397034 401736 405715 408905 410685 410734 410183 410838 413195 416038
$$ packed form
53029D03940j197j303q92M83J601P55j454k436j205J96l22k085l052k789k549
53014C87691k957l200k485j114J16P81Q21L22m04r01j046j190j623k120k173j527
52998C68991l40J089K504L536L632K437M24j251j816j706j940k754l296k771j421
52983C65318k06J29n34j730k538k037j27K180L574L511K387R91N9M9P96J486J354
52966C74662L90r12k262l459l776k291P08L336L886K835K287L292M392L433L91
52951C86912k381k805j232M02Q88N13r6p83j417j498q36n2J83J07M28J146J495
52934C80974J044K44l54p79j175j100j6J692K783K538J541Q23N50J55n32j015
52918C87373j022q73o32L43K341M362N142M702L979L190J780M9n51O55K357K843
$$ plain form
52902 416038 418023 418902 419005 418447 417311 416010 414896 413782 412288 410436 408570 406898 405332 403571 401125
52887 401125 397562 393059 388569 385291 384080 385287 388614 392848 396162 397117 395382 391562 386874 383022
52873 383022 381474 382202 383599 384285 384559 385449 386823 387359 386187 383677 380650 377714 375431 374289 374192 374517
52857 374517 374877 375363 376020 376752 377730 379010 379638 378265 375226 372973 373482 375823 377267 376353 373929 371517
52841 371517 369882 369260 369831 371398 373207 374575 375437 376148 377175 379040 381789 384209 384311 381419 377458
52826 377458 375390 376346 378880 380977 382116 383069 384356 385576 386141 386092 385948 386172 387027 388799 391745 395750
52810 395750 400214 404317 407337 408766 408537 407300 406147 405675 405471 404902 404244 404421 405509 406125 404743 401314
52794 401314 397205 393842 391908 391568 392641 394301 395212 394458 392302 389831 388019 387138 386722 385906 384118 381681
$$ packed form
52902D16038J985Q79J03n58j136j301j114j114j494j852j866j672j566j761k446
52887D01125l563m503m490l278j211J207L327M234L314R55j735l820m688l852
52873C83022j548P28J397O86K74Q90J374N36j172k510l027k936k283j142r7L25
52857C74517L60M86O57P32R78J280O28j373l039k253N09K341J444r14k424k412
52841C71517j635o22N71J567J809J368Q62P11J027J865K749K420J02k892l961
52826C77458k068R56K534K097J139R53J287J220N65m9j44K24Q55J772K946M005
52810C95750M464M103L020J429k29j237j153m72k04n69o58J77J088O16j382l429
52794D01314m109l363j934l40J073J660R11p54k156k471j812q81m16q16j788k437
$$ plain form
52778 381681 379459 377626 375216 371397 366940 363733 362821 363534 364672 365816 367094 368220 368475 367551 365896
52763 365896 364198 362806 361638 360428 359097 358046 357924 358834 359969 360422 360273 360471 361725 363957 366740
52748 366740 369619 371918 373049 373413 374381 376706 379436 381059 381369 381313 381258 380468 378469 375914 373630 371599
52732 371599 369480 367351 365179 362242 358193 354404 353045 354714 357892 360898 363332 365255 366108 365379 363687
52717 363687 362209 361312 360575 359925 359812 360186 360164 359027 357124 355495 354843 354919 354651 353005 350122 347573 346987
52700 346987 348453 350718 352795 354631 356182 356771 355921 354230 352883 352605 353382 354697 355719 355794 355285 355512
52684 355512 357337 360191 362951 365296 367601 369913 371919 373808 376336 379802 383361 385485 385041 382236
52670 382236 378796 376782 376794 377668 378345 379303 381419 384103 385791 385908 385201 384338 383490 383072 383314 383039 380597
$$ packed form
52778C81681k222j833k410l819m457l207r12P13J138J144J278J126K55r24j655
52763C65896j698j392j168j210j331j051j22R10J135M53j49J98J254K232K783
52748C66740K879K299J131L64R68K325K730J623L10n6n5p90j999k555k284k031
52732C71599k119k129k172k937m049l789j359J669L178L006K434J923Q53p29j692
52717C63687j478q97p37o50j13L74k2j137j903j629o52P6k68j646k883k549n86
52700C46987J466K265K077J836J551N89q50j691j347k78P77J315J022P5n09K27
52684C55512J825K854K760K345K305K312K006J889K528L466L559K124m44k805
52670C82236l440k014J2Q74O77R58K116K684J688J17p07q63q48m18K42k75k442
$$ plain form
52653 380597 376520 373467 372653 372049 369495 366058 364472 365283 366657 367492 368459 369762 369991 368133 365298 363396
52637 363396 362969 363264 363722 364411 365346 366257 367089 368150 369640 371235 372185 371891 370680 370034 371488 374960 378530
52620 378530 380388 380765 381406 383118 384455 383305 379493 375220 372789 372405 372675 372781 373245 374531 376037 377108
52604 377108 378227 380224 382761 384708 385895 387431 390044 393052 395369 396856 398119 399449 400505 400904
52590 400904 400789 400836 401634 402894 403460 402639 401297 400941 401668 401920 400592 398516 397380 397847 399252 400523 400730
52573 400730 399364 396941 395013 394821 396156 398171 400829 404528 408536 411191 412025 412600 414444 416812 417412
52558 417412 415094 410947 406683 402826 399043 395691 394042 394809 397167 399696 401760 403323 403891 402789 400568
52543 400568 399085 399604 401528 403469 404824 405628 405611 404562 403364 403564 405660 408481 410511 411382 411934 413174
$$ packed form
52653C80597m077l053q14o04k554l437j586Q11J374Q35R67J303K29j858k835j902
52637C63396m27K95M58O89R35R11Q32J061J490J595R50k94j211o46J454L472L570
52620C78530J858L77O41J712J337j150l812m273k431l84K70J06M64J286J506J071
52604C77108J119J997K537J947J187J536K613L008K317J487J263J330J056L99
52590D00904j15M7P98J260N66q21j342l56P27K52j328k076j136M67J405J271K07
52573D00730j366k423j928j92J335K015K658L699M008K655Q34N75J844K368O00
52558D17412k318m147m264l857l783l352j649P67K358K529K064J563N68j102k221
52543D00568j483N19J924J941J355Q04j7j049j198K00K096K821K030Q71N52J240
$$ plain form
52527 413174 415246 417189 417828 417136 416438 416863 417983 418514 418011 417076 416285 415884 416325 417842 419346 419031 416642
52510 416642 414107 413191 413333 412725 410919 409447 410038 413003 417261 421349 424353 426235 427355 427689 426927 425404
52494 425404 424286 424253 424467 423457 420821 417515 414736 413099 412652 412954 413059 412032 409706 406716 403855 401684
52478 401684 400630 400926 402319 404061 405237 405048 403094 399848 396759 395411 396345 398744 401184 402680 403287
52463 403287 403891 405136 406458 406638 405488 404339 404438 405593 407019 408756 411221 413959 416146 418087 420859
52448 420859 424477 427796 430529 433929 438767 443804 447248 448953 450183 451636 452616 452074 449858 446858 444149
52433 444149 441947 439518 436412 433423 431519 430108 427672 424228 421628 420881 420723 419784 418596 418122 417777
52418 417777 416762 416217 417757 420521 422127 422414 423695 426951 430284 432113 433532 436102 439217 441541 443623
$$ packed form
52527D13174K072J943O39o92o98M25J120N31n03r35p91m01M41J517J504l15k389
52510D16642k535r16J42o08j806j472N91K965M258M088L004J882J120L34p62j523
52494D25404j118l3K14j010k636l306k779j637m47L02J05j027k326k990k861k171
52478D01684j054K96J393J742J176j89j954l246l089j348R34K399K440J496O07
52463D03287O04J245J322J80j150j149R9J155J426J737K465K738K187J941K772
52448D20859L618L319K733L400M838N037L444J705J230J453R80n42k216l000k709
52433D44149k202k429l106k989j904j411k436l444k600p47j58r39j188m74l45
52418D17777j015n45J540K764J606K87J281L256L333J829J419K570L115K324K082
$$ plain form
52403 443623 446962 451226 454339 455129 454448 453928 454946 458404 463947 469412 472457 472823 471836 469890 466010
52388 466010 460068 453650 448024 442722 437007 431461 427052 423667 420828 419007 418898 419851 420419 420239 420141 420456
52372 420456 420437 419440 417649 415498 413501 412830 414681 418465 421860 423619 425291 428981 434246 438641 440860
52357 440860 441602 441479 440045 437670 436688 439252 444902 451486 457815 464137 470473 476200 481401 487130 493758
52342 493758 500113 504907 508075 510008 510300 508241 504140 499248 494532 490250 486633 484315 483933 485522 488086
52327 488086 489686 488631 485200 481651 479814 479238 478621 478306 479818 483122 486234 488100 490243 494433 499928
$$ packed form
52403D43623L339M264L113P90o81n20J018L458N543N465L045L66r87j946l880
52388D66010n942o418n626n302n715n546m409l385k839j821j09R53N68j80r8L15
52372D20456j9r97j791k151j997o71J851L784L395J759J672L690N265M395K219
52357D40860P42j23j434k375r82K564N650O584O329O322O336N727N201N729O628
52342D93758O355M794L168J933K92k059m101m892m716m282l617k318l82J589K564
52327D88086J600j055l431l549j837n76o17l15J512L304L112J866K143M190N495
$$ [...]
##END NTUPLES=NMR SPECTRUM
##END=
