
##TITLE=UV1044_TOSA01-ROVE100B_6099685_3XVFmsaORB
##JCAMPDX= 6.0         $$ Bruker NMR JCAMP-DX V2.0
##DATA TYPE= NMR SPECTRUM
##DATA CLASS= NTUPLES
##ORIGIN= BRUKER
##OWNER= Administrator
$$ 1.72 TOPSPIN		Version 2.1
$$ 2012-05-13 02:14:22.687 -0500  Administrator@TOPSPIN
$$ Compression mode = diff/dup
##.OBSERVE FREQUENCY= 400.13188235
##.OBSERVE NUCLEUS= ^1H
##.ACQUISITION MODE= SIMULTANEOUS (DQD)
##.ACQUISITION SCHEME= undefined
##.AVERAGES= 8
##.DIGITISER RES= 22
##SPECTROMETER/DATA SYSTEM= spect
##.PULSE SEQUENCE= zg30
##.SOLVENT NAME= COFFEE_meoh
##.SHIFT REFERENCE= INTERNAL, COFFEE_meoh, 1, 14.98061
##AUDIT TRAIL= $$ (NUMBER, WHEN, WHO, WHERE, PROCESS, VERSION, WHAT)
$$ ##TITLE= Audit trail, TOPSPIN		Version 2.1
$$ ##JCAMPDX= 5.01
$$ ##ORIGIN= Bruker BioSpin GmbH
$$ ##OWNER= Administrator
$$ $$ C:\Bruker\TOPSPIN/data/COFFEE/nmr/UV1044_TOSA01-ROVE100B_6099685_3XVFmsaORB/10/pdata/1/auditp.txt
$$ ##AUDIT TRAIL=  $$ (NUMBER, WHEN, WHO, WHERE, PROCESS, VERSION, WHAT)
(   1,<2012-05-13 02:14:15.375 -0500>,<Administrator>,<TOPSPIN>,<go>,<TOPSPIN 2.1>,
      <created by zg
	started at 2012-05-13 02:13:08.609 -0500,
	POWCHK enabled, PULCHK disabled,
       configuration hash MD5:
       AF F2 23 6B 01 CD 40 DD E5 A1 38 A0 06 EA F7 77
       data hash MD5: 64K
       02 70 24 43 89 69 0B 21 F7 72 84 92 AB F1 14 8F>)
(   2,<2012-05-13 02:14:18.468 -0500>,<Administrator>,<TOPSPIN>,<proc1d>,<TOPSPIN 2.1>,
      <Start of raw data processing
       efp LB = 0 FT_mod = 6 PKNL = 1 PHC0 = 0 PHC1 = 0 SI = 32K 
       data hash MD5: 32K
       AF 22 B2 2A 85 DB 66 13 8D 66 54 EC 6B 03 18 A8>)
(   3,<2012-05-13 02:14:18.843 -0500>,<Administrator>,<TOPSPIN>,<proc1d>,<TOPSPIN 2.1>,
      <pk PHC0 = 215.4309 PHC1 = 0 
       data hash MD5: 32K
       69 A6 8C 1E 02 4D 5E B9 03 65 5E DC 3A EF 13 A1>)
(   4,<2012-05-13 02:14:18.984 -0500>,<Administrator>,<TOPSPIN>,<proc1d>,<TOPSPIN 2.1>,
      <abs ABSG = 1 
       data hash MD5: 32K
       BE 4F B7 FC 02 63 C9 58 B1 3F 27 E9 88 D0 3B 8D>)
(   5,<2012-05-13 02:14:19.109 -0500>,<Administrator>,<TOPSPIN>,<proc1d>,<TOPSPIN 2.1>,
      <abs ABSG = 2 
       data hash MD5: 32K
       CD D8 A2 3C 7A 67 71 7A 3D C4 96 47 1B 33 06 B8>)
(   6,<2012-05-13 02:14:19.140 -0500>,<Administrator>,<TOPSPIN>,<proc1d>,<TOPSPIN 2.1>,
      <abs ABSG = 3 
       data hash MD5: 32K
       DD 5D BA AC E5 85 3E 68 8A FA 8A CE 2D 49 C1 05>)
(   7,<2012-05-13 02:14:19.171 -0500>,<Administrator>,<TOPSPIN>,<proc1d>,<TOPSPIN 2.1>,
      <abs ABSG = 4 
       data hash MD5: 32K
       5D BD 63 D8 33 4B 8E F4 F8 B9 27 79 0F 67 69 BE>)
(   8,<2012-05-13 02:14:19.203 -0500>,<Administrator>,<TOPSPIN>,<proc1d>,<TOPSPIN 2.1>,
      <abs ABSG = 5 
       data hash MD5: 32K
       67 DC 20 E9 8E C4 61 54 CE 9B C3 F2 9A F5 06 33>)
$$ ##END=
$$ 
$$ $$ hash MD5
$$ $$ 49 2B C0 0B C4 F7 C1 36 1F 63 63 AC E5 47 2B 19
##$RELAX= 
##$RELAX= 
##$RELAX= 
##$RELAX= 
##$RELAX= 
##$RELAX= 
##$RELAX= 
$$ Bruker specific parameters
$$ --------------------------
$$ [...]
150 150 150 150 150 150 150 150
##$TP07= 0
##$TPNAME0= <>
##$TPNAME1= <>
##$TPNAME2= <>
##$TPNAME3= <>
##$TPNAME4= <>
##$TPNAME5= <>
##$TPNAME6= <>
##$TPNAME7= <>
##$TPOAL= (0..7)
0.5 0.5 0.5 0.5 0.5 0.5 0.5 0.5
##$TPOFFS= (0..7)
0 0 0 0 0 0 0 0
##$TUNHIN= 0
##$TUNHOUT= 0
##$TUNXOUT= 0
##$USERA1= <user>
##$USERA2= <user>
##$USERA3= <user>
##$USERA4= <user>
##$USERA5= <user>
##$V9= 5
##$VALIST= <valist>
##$VCLIST= <CCCCCCCCCCCCCCC>
##$VD= 0
##$VDLIST= <DDDDDDDDDDDDDDD>
##$VPLIST= <PPPPPPPPPPPPPPP>
##$VTLIST= <TTTTTTTTTTTTTTT>
##$WBST= 2048
##$WBSW= 25
##$XGAIN= (0..3)
0 0 0 0
##$XL= 0
##$YL= 0
##$YMAX_a= 533942
##$YMIN_a= -629161
##$ZGOPTNS= <>
##$ZL1= 120
##$ZL2= 120
##$ZL3= 120
##$ZL4= 120
##$ABSF1= 14.98061
##$ABSF2= -5.57192
##$ABSG= 5
##$ABSL= 3
##$ALPHA= 0
##$AQORDER= 0
##$ASSFAC= 0
##$ASSFACI= 0
##$ASSFACX= 0
##$ASSWID= 0
##$AUNMP= <proc_prof1d_extract_pilot.lims>
##$AXLEFT= 0
##$AXNAME= <>
##$AXNUC= <1H>
##$AXRIGHT= 0
##$AXTYPE= 0
##$AXUNIT= <>
##$AZFE= 0.1
##$AZFW= 0.1
##$BCFW= 0
##$BC_mod= 0
##$BYTORDP= 0
##$COROFFS= 0
##$CY= 15
##$DATMOD= 1
##$DC= 0
##$DFILT= <>
##$DTYPP= 0
##$F1P= 0
##$F2P= 0
##$FCOR= 0.5
##$FTSIZE= 32768
##$FT_mod= 6
##$GAMMA= 0
##$GB= 0
##$INTBC= 1
##$INTSCL= 1
##$ISEN= 128
##$LB= 0
##$LEV0= 0
##$LPBIN= 0
##$MAXI= 10000
##$MC2= 0
##$MEAN= 0
##$ME_mod= 0
##$MI= 0
##$NCOEF= 0
##$NC_proc= -8
##$NLEV= 6
##$NOISF1= 0
##$NOISF2= 0
##$NSP= 0
##$NTH_PI= 0
##$NZP= 0
##$OFFSET= 14.98061
##$PC= 1
##$PHC0= 215.4309
##$PHC1= 0
##$PH_mod= 1
##$PKNL= yes
##$PPARMOD= 0
##$PPDIAG= 0
##$PPIPTYP= 0
##$PPMPNUM= 2147483647
##$PPRESOL= 1
##$PSCAL= 4
##$PSIGN= 0
##$PYNMP= <proc.py>
##$REVERSE= no
##$SF= 400.13
##$SI= 32768
##$SIGF1= 0
##$SIGF2= 0
##$SINO= 400
##$SIOLD= 32768
##$SPECTYP= <>
##$SREGLST= <1H.CDCl3>
##$SSB= 0
##$STSI= 32768
##$STSR= 0
##$SW_p= 8223.68421052632
##$SYMM= 0
##$S_DEV= 0
##$TDeff= 65536
##$TDoff= 0
##$TI= <>
##$TILT= no
##$TM1= 0
##$TM2= 0
##$TOPLEV= 0
##$USERP1= <user>
##$USERP2= <user>
##$USERP3= <user>
##$USERP4= <user>
##$USERP5= <user>
##$WDW= 1
##$XDIM= 32768
##$YMAX_p= 449855141
##$YMIN_p= -761094
##$CURPLOT= <Network HP LaserJet P1505>
##$CURPRIN= <$Network HP LaserJet P1505>
##$DFORMAT= <normdp>
##$LAYOUT= <+/1D_H.xwp>
##$LFORMAT= <normlp>
##$PFORMAT= <normpl>
##$SURQMSG= 1
$$ End of Bruker specific parameters
$$ ---------------------------------
##NTUPLES= NMR SPECTRUM
##VAR_NAME=  FREQUENCY,     SPECTRUM/REAL,   SPECTRUM/IMAG
##SYMBOL=    X,             R,               I
##VAR_TYPE=  INDEPENDENT,   DEPENDENT,       DEPENDENT
##VAR_FORM=  AFFN,          ASDF,            ASDF
##VAR_DIM=   32768,         32768,           32768
##UNITS=     HZ,            ARBITRARY UNITS, ARBITRARY UNITS
##FACTOR=    0.250966925370066, 1,           1
##FIRST=     8223.43324360095, -111470,      -186492
##LAST=      0,             -80665,          -87630
##MIN=       0,             -761094,         0
##MAX=       8223.43324360095, 449855141,    0
$$ Real data points
##PAGE= N=1
##DATA TABLE= (X++(R..R)), XYDATA
$$ [...]
19523c12702A63140c95907f6444B35793a83635A60164B150b87534a5943o6528
19513h2471j7366a3780l5682I3274a76951Q1763A62782G6948e5543j90210N1907
19502a93846q117N6063c7272F5768a5959B82358O175a11638J2252m807c0508G526
19489d2989B7343a91699G3430a35144b7831E151J09338b03091A10894g8330k11114
19478b89444a07269d4754j09278F2026h9156r086L2893A1292d42371J04352c5243
19466a5214A84885r1246d5301m37953h257j02280a524j75828G4622b0904G50a78715
19453b28545I5294a90823G6665g8049c5759O549B2846M8870J37476F3880b45843
19441B99006b56591A7925J80888J15001f2339j58511I335K36075D4033J69465
$$ y = [-312702, 163140, -395907, -66444, 235793, -183635, 160164, 2150, -287534, -15943, -82471, -99837, -13780, -49462, 93274, -176951, -95188, 162782, 76948, -55543, -245753, -193846, -201963, -145900, -37272, 65768, -15959, 282358, 288533, -111638, -99386, -104193, -30508, 7526, -42989, 27343, -191699, 73430, -135144, -27831, 5151, 114489, -203091, 110894, -78330, -289444, -107269, -44754, -154032, 62026, -89156, -98242, -65349, 11292, -442371, -338019, -35243, -15214, 184885, 93639, -45301, -483254, -8257, -110537, -1524, -177352, 74622, -20904, 750, -178715, -228545, 95294, -190823, 76665, -78049, -35759, -29210, 22846, 71716, 209192, 63880, -245843, 299006, -256591, 17925, 198813, 313814, -62339, -220850, 9335, 245410, 44033, 213498]
19431B13498K82222e36295b55099I6577L34524A64048h5198G4909b6046B5065
19420b87764i9264A85331D4113L7455J68706p4357i3481B53070e879k40470A51402
19408I0782b33390d9686B34342B7921a6844A43605k0232a16111j39927B19453
19397c16797f8506j5625l09748f1821A28759b67326f7991A63097C6655J42800
19387A79455c8362m2145A2284c9784k33524G5414l1958a82159j3914f2614B14173
19375C0432J97729q5251D4592b33914C2146J14695b89742J40974g0172j46682
19365b16854e9379m7780b4957j93236O6927E1493J61484b34117M9298d7992B66059
19353a25248n3573Q2562r1802A14888b28068I6875l0744a00331D5929j4730L49407
$$ y = [213498, 495720, -536295, -255099, 96577, 431101, 164048, -85198, 74909, -26046, 25065, -287764, -99264, 185331, 44113, 81568, 250274, 175917, -93481, 253070, -5879, -246349, 151402, 90782, -233390, -49686, 234342, 27921, -16844, 143605, 123373, -116111, -256038, 219453, -316797, -68506, -84131, -393879, -61821, 128759, -267326, -67991, 163097, 36655, 179455, -38362, -80507, 12284, -39784, -273308, 75414, 43456, -182159, -196073, -62614, 214173, 30432, 228161, 142910, 44592, -233914, 32146, 146841, -289742, -148768, -70172, -216854, -59379, -107159, -24957, -218193, -151266, 51493, 212977, -234117, -184819, -47992, 266059, -125248, -178821, -96259, -188061, 114888, -228068, 96875, 66131, -100331, 45929, 31199, 380606]
19342C80606a21384q7260i3757B40056E7608J35742c21690a03484F3352J3544
19332G6896a30883j97173j32478c7303D49254a07120L7099A28027c6897A499a16992
19320c17650f9856k1084d1245A59273h0945j48115I5498a64914A24139N1752b00196
19308d37307B43745D407f8385l03514L9587m202A2298a11978M2165A04638b12643
19296d2431j97076m2274e0039q8960A59173b05027O3578D1476Q8506M0632k3005
19285A47609a14495K2483b8900B41678l3034F5448c92614I1804b61113F4925c81510
19273B8232c47608B929K02605e379m8293l1617l23851E547a48019l3847G5126
19261a66295h0822A86254a23950B7740b70619f139j04184J9020l74147K07881
$$ y = [380606, -121384, -208644, -93757, 240056, 57608, 193350, -321690, -103484, 63352, 76896, -130883, -328056, -460534, -37303, 449254, -107120, -70021, 128027, -36897, 1499, -116992, -317650, -69856, -90940, -41245, 159273, -80945, -229060, 95498, -164914, 124139, 175891, -200196, -437307, 243745, 4407, -68385, -371899, -332312, -336514, 12298, -111978, -69813, 104638, -212643, -42431, -239507, -281781, -50039, -138999, 159173, -205027, -141449, 41476, 129982, 170614, 147609, -114495, -92012, -28900, 241678, 208644, 65448, -392614, 91804, -261113, 64925, -381510, 28232, -347608, 2929, 205534, -5379, -53672, -85289, -409140, 5547, -148019, -181866, 75126, -166295, -80822, 186254, -123950, 27740, -270619, -6139, -110323, -91303, -465450, -257569]
19251b57569L7047g2462C17994a01464G7333M3322i1951m09097H6355C696b10091
19239G3633i7030c1941A95295K149i975l4898C73705a20628A55438k071a63439
19227C21941a17215q2683h537j15646j15198N3505B50798D2577a99810f8574j66105
19216b34679j09090P8192B1148h7790G469J52721G6168b71980g2144l78521J39250
19205c11415B65505d25720E06567C9166j1649g7731k33149B20679b99267A30080
19194B35653M9179b01981A18607e992B50347b06525A42467d8290H7730K44442
19184C32172b37523F2278A510g132I6013b63194a22715a7798F2986a14657M8502
19173f6155H0392q237a11512B63795I6812b4434A68062G9805h5396j0059c3843
$$ y = [-257569, -220522, -72462, 317994, -101464, 77333, 120655, -91951, -501048, 86355, 3696, -210091, 73633, -97030, -31941, 195295, 197444, -9975, -44873, 373705, -120628, 155438, 153367, -163439, 321941, -117215, -199898, -8537, -124183, -239381, -185876, 250798, 42577, -199810, -68574, -234679, -343769, -265577, 21148, -87790, 7469, 160190, 76168, -271980, -72144, -450665, -311415, 265505, -425720, 506567, 39166, 27517, -77731, -310880, 220679, -299267, 130080, 235653, 284832, -201981, 118607, -5992, 250347, -206525, 142467, -48290, 87730, 332172, -237523, 62278, 1510, -7132, 96013, -263194, -122715, -17798, 62986, -114657, -66155, 80392, 72155, -111512, 263795, 96812, -24434, 168062, 79805, -85396, -95455, -33843]
19161h1245j4977A4520b60381I4777a04251c6631j79520B09507i4611C6460d67540
19149c76705A57905m549a8103k52731A6067e0577j98690N5367d2847l5316j01269
19138a79432l920A0902L10870j58779A7890i453k18916A4776k846h3898l0353
19127a14251H1964r860j6989O5983g5659j03039B60142A10122b8929j66359B1641
19115a90177k08760H4909A7632J78323a38288k58549J43584A6785N3318B1349
19104B57018H9726e13382A27826a49989l13418e8536j57508b0297m7993B31559
19093e6148j70837J07794c3948l2405A84273d8101H3753a5415j60790A17665N4870
19082A72535b5181B8061a08424k665A64910a45343q4276B46891a91274k9798A629
$$ y = [-81245, -96222, 14520, -260381, 94777, -104251, -36631, -216151, 209507, -94611, 36460, -467540, -376705, 157905, 153356, -18103, -270834, 16067, -50577, -249267, -193900, -42847, -78163, -179432, -183352, 10902, 321772, 162993, 17890, -9453, -228369, 14776, 11930, -83898, -114251, 81964, 72104, 55115, 121098, -75659, -178698, 260142, 110122, -28929, -195288, 21641, -190177, -398937, 84909, 17632, 195955, -138288, -396837, -253253, 16785, 70103, 21349, 257018, 89726, -513382, 127826, -149989, -463407, -58536, -216044, -20297, -68290, 231559, -56148, -226985, -119191, -33948, -66353, 184273, -48101, 83753, -15415, -176205, 117665, 172535, -25181, 28061, -108424, -111089, 164910, -145343, -229619, 246891, -191274, -221072, 1629]
19070b7850A32772h141p3558m4656j92207A66435a56465E9127j9514P2426e0221
19058H1309e8172A67016f8063K4346l381j01676a7674B05254c49862B2729a05960
19046a86757c7065A1425a17811A83786b3575C6850P012a60198M576B24709a13927
19034e08447f8581l16960A89422R1487C3918K32960G8658P402l4030a39430k04104
19023c43534G7682a52153A42364c17352h0852j06595i3339D20679h7651K405D1693
19011A85004l4338L1421a3555B77605f1245A07760a56652e3677j17562I2806J36974
19000B29780A08961l3286i2711A71577H075c11881f481A19367h2743H4922b52906
18988a96591O2445q0499f8110m8545k13016G8770D640a15265o3829k3558d815
$$ y = [-27850, 132772, -8141, -81699, -126355, -318562, 166435, -156465, 59127, 39613, 112039, -50221, 81309, -58172, 167016, -68063, -43717, -47098, -148774, -17674, 205254, -349862, 22729, -105960, -186757, -37065, 11425, -117811, 183786, -23575, 36850, 43862, -160198, -155622, 224709, -113927, -508447, -68581, -385541, 189422, 280909, 33918, 266878, 78658, 86060, 52030, -139430, -343534, 77682, -152153, 142364, -317352, -80852, -187447, -93339, 420679, -87651, -85246, 41693, 185004, 150666, 182087, -13555, 277605, -61245, 107760, -156652, -53677, -171239, 92806, 229780, 108961, 75675, -92711, 171577, 8075, -311881, -6481, 119367, -82743, 84922, -252906, -196591, -134146, -214645, -68110, -116655, -329671, 78770, 4640, -115265, -179094, -202652, -4815]
18976c07701A6232J978J36523a76045n8991a2548p197j29456f2670q7936k2380
18965a72986A53193O9826B0636c74984A26774a94145C35098D1517a19134I2615
18954a72590c7435E0968p271N8797d2973G9136c1230j80634J6268H4747A3619
18942B10375a82316C73274G2999b38270k3305i6803j31524D6462a26512c6290
18931I3992c46526A63806n2175R776a31999j00294A05764O937i9319A40050k2159
18920A17891g3261G201O4205a13077j1901j86728A16802a64193I7379A5564b05584
18908B48745g5922k2814A7573b15510G4054a78923B00729c15097p5238A29080
18897A20950b23972i0903l2656a0981r5474d8310k51343R6273A48679J5909a50658
$$ y = [-307701, 16232, 18210, 154733, -176045, -235036, -12548, -19745, -149201, -62670, -150606, -172986, 153193, 223019, 20636, -374984, 126774, -194145, 335098, 41517, -119134, 92615, -172590, -37435, 50968, 43697, 102494, -42973, 79136, -31230, -211864, -195596, 84747, 13619, 210375, -182316, 373274, 72999, -238270, -261575, -96803, -228327, 46462, -126512, -36290, 93992, -346526, 163806, 111631, 121407, -131999, -232293, 105764, 112701, -99319, 140050, 117891, -73261, 7201, 71406, -113077, -124978, -311706, 116802, -164193, 97379, 15564, -205584, 248745, -75922, -98736, 17573, -215510, 74054, -178923, 200729, -315097, -390335, 129080, 120950, -223972, -90903, -123559, -10981, -106455, -48310, -299653, -203380, 148679, 164588, -150658]
18885B36199a4270n6305E9259c9808q5615B02179b77459C1648b45813A12703i2745
18873c3326j06493L5028H316M4122A9011b87077A59215e2332k59327H695K6725
18862C5420a16689F837R7927K3553c91141a53700r9923C9231b55175A33517a41646
18850A06362g005m17515A2578a65815h1377B08232r4637A532K07693h6885m3624
18839a30509o8443f9229k07773A94418a04850j3358o1655M2688O6363C91956A12706
18827h0867k1960A46747b14710p9761A06167h6509H8973m3715a73904A72844b26995
18815d4213D9421K58829b5801k66163a36404C05359b5175m42051H4666a53871
18804a88799i0793j435B1990J1435d1813H1668J46068f0534B36513j1303c0511
$$ y = [236199, -14270, -70575, 59259, -39808, -125423, 202179, -277459, 31648, -245813, 112703, -92745, -33326, -139819, -104791, 8316, 52438, 19011, -287077, 159215, -52332, -311659, 8695, 35420, -116689, 6837, 104764, 128317, -391141, -153700, -253623, 39231, -255175, 133517, -141646, 106362, -7005, -424520, 12578, -165815, -81377, 208232, 113595, 1532, 209225, -86885, -130509, -198952, -69229, -277002, 194418, -104850, -118208, -179863, -137175, -70812, 391956, 112706, -80867, -102827, 146747, -214710, -294471, 106167, -86509, 88973, 45258, -173904, 172844, -226995, -44213, 49421, 308250, -25801, -291964, -136404, 305359, -25175, -467226, 84666, -153871, -188799, -90793, -92228, 21990, 33425, -41813, 81668, 227736, -60534, 236513, 225210, -30511]
18792C45479j00262C8461L1396B6355a30617a7247k02815d3347E2269J21206M3446
18781B16921F8161b46763a16409M0919C17J02180a79625I2754a31469f5260A43904
18769a55829N3634j12391J03315j14039B2802M556K00631b87429R8929c6059j42359
18758a78418A11027a87254n4187h7198f848C48176f1040k97748a41334j0925O0566
18747i1693B9879c89162J08510e4437c255E2199J66524d13382g0017l7946k080
18736a10043j20691d9100J1642B47839j21861e6853k6290k68229A7852a64195
18725b24112A50693a76149I2278b73679m1780e528p855A1803a46083J5141c8768
18713a66385k33045a23118i869k69048I7229E563Q4143J00150A346J02421a29033
$$ y = [345479, 245217, 38461, 69857, 26355, -130617, -17247, -220062, -43347, 52269, 173475, 216921, 68161, -246763, -116409, -75490, 317, 102497, -179625, 92754, -131469, -65260, 143904, -155829, -102195, -214586, -111271, -225310, 22802, 27358, 227989, -287429, -188500, -36059, -178418, 111027, -187254, -241441, -87198, -6848, 348176, -61040, -358788, -141334, -152259, -91693, 29879, -389162, -280652, -54437, -3255, 52199, 218723, -413382, -70017, -107963, -110043, -230734, -49100, -37458, 247839, 125978, -56853, -83143, -351372, 17852, -164195, -224112, 150693, -176149, 92278, -273679, -315459, -5528, -13383, 11803, -146083, -130942, -38768, -166385, -399430, -123118, -9869, -278917, 97229, 5563, 89706, 189856, 1346, 103767, -129033]
18701A06575N0923a15223p0538e2788H1656e9411A94782c60611J01503B57808
18690c78776A20624E0135h3453b3853j45650E00317H8573d0261m8034k11673g4566
18678a27392l21426G7527c35305a49418e1675A46478b4229k48297H1931C9847
18667D8649b36619B26071a9005A9507J29938a18690A51292b21428c1939A96211
18656E2578K29723J5782c39495a5515A04068b40676Q813i5045j47484M6225A47683
18644a54291B03679b05128n1615A85789b25633E0586c46063A59038a5553j61706
18634a77259B90100g2848j05215A58929l1552a24806q0224k03055e0522A6743
18623g5732m2283C6339O6805l0419a28564N3830J3352j2371n1864C0369b11739
$$ y = [106575, 157498, -115223, -185761, -52788, 81656, -59411, 194782, -360611, -259108, 257808, -378776, 120624, 50135, -83453, -23853, -169503, 500317, 88573, -40261, -88295, -299968, -74566, -127392, -448818, 77527, -335305, -149418, -51675, 146478, -24229, -272526, 81931, 39847, 48649, -236619, 226071, -19005, 19507, 149445, -118690, 151292, -221428, -31939, 196211, 52578, 282301, 298083, -339495, -15515, 104068, -240676, -231863, -95045, -242529, -196304, 147683, -154291, 203679, -205128, -256743, 185789, -225633, 50586, -346063, 159038, -15553, -177259, 290100, -72848, -178063, 158929, 127377, -124806, -205030, -408085, -50522, 16743, -75732, -118015, 36339, 103144, 72725, -128564, -74734, -61382, -73753, -125617, 30369, -211739]
18611a02062p1436B09754E3305L49299b57073l9348I33i1250A41147e55565a31274
18599a2225D55100b70412I3456e0657C500i4784B5544L5111b71782a3204o0643
18588g3847p7176j11165B7141c8622l33986D3138K46765f7387l49166C26444A39312
18576C22300j27227a07661j78613A37081a216l67765g1631J6211F4787b18421
18565e3784J075r966r004j05113K6493l4668A04286b91864Q8592P6444D9250J08933
18553A58183f2579F8948A9484J12622b71645P2609A39379c12943B14638D5119
18542c80457a04778A8569c68530E55718h1696q8303K779A30337b99856g8313n30
18531g8843A0132a25370F4508L5769B3669K02038b94314E8448d0739j44578e442
$$ y = [-102062, -173498, 209754, 53305, 402604, -257073, -296421, 933, -91250, 141147, -555565, -131274, -12225, 455100, -270412, 93456, -50657, 3500, -94784, 25544, 60655, -271782, -13204, -73847, -151023, -262188, 27141, -38622, -372608, 43138, 289903, -67387, -416553, 326444, 139312, 322300, 195073, -107661, -286274, 137081, -1216, -368981, -71631, -55420, 64787, -218421, -53784, -52709, -62675, -71679, -176792, -150299, -184967, 104286, -291864, -203272, -126828, 49250, 158183, -62579, 68948, 19484, 132106, -271645, -199036, 139379, -312943, 214638, 45119, -380457, -104778, 18569, -368530, 555718, -81696, -169999, -167220, 130337, -299856, -78313, -78843, 10132, -125370, 64508, 100277, 23669, 225707, -294314, 58448, -40739, -185317, -5442]
18519a51425r6567B7830J09283a25658a1950B55492o4138b40237E393J97456g666
18507i1169J8035D08005h6255F2374e3106q8290l7118A83045b38428B24891m4337
18496A80554h3289a7760r1794G6340a62304o6832J04318C4656O2621a0542I050
18484A18882E6430c34978A8716J8088a37751k69584A55427b6535l1387k9118d2749
18472e7706A40866c7330E38847d5752G3232h7807m44512B32483F7935B0292K37826
18461B58118c1818D1092a28262j00477O7386j38181J07821f0209a4644j40010
18451a54654C9209J82966a8132k29290L7297N6760E1825e5464D8344e5783j58618
18440b14401A60561L2354a35551e2466n6593A68961a54195k8147j0812j77414
$$ y = [-151425, -247992, 27830, 137113, -125658, -11950, 255492, 191354, -240237, 5393, 202849, -7666, -91169, -73134, 408005, -86255, 62374, -53106, -141396, -178514, 183045, -238428, 224891, 180554, -83289, -17760, -109554, 76340, -162304, -229136, -124818, 34656, 97277, -10542, 9050, 118882, 56430, -334978, 18716, 36804, -137751, -407335, 155427, -26535, -57922, -87040, -42749, -57706, 140866, -37330, 538847, -45752, 73232, -87807, -532319, 232483, 67935, 20292, 258118, -31818, 41092, -128262, -228739, -161353, -299534, -191713, -60209, -14644, -154654, 39209, 222175, -18132, -247422, -210125, -153365, 51825, -55464, 48344, -55783, -214401, 160561, 192915, -135551, -52466, -109059, 168961, -154195, -182342, -193154, -370568]
18430c70568D9395b23442B63616e5457O199I30b41004c847k90048A19471b4394
18418b70201i3645C0346J727d32338e8826A32182d25371J04994a38340J2235r2196
18407b18301D3285e3761B7932J19562d6723k05172A58947E2913K40195a9784p3392
18396i3176M1628k63423A71291a39562k8912g1011l4510r0837h3680c106A10347
18384F8401f0988A70538c1803l8957r3481j9412N1924M6824N587C46893a54378
18372B82873a61657j29282B2203M3489a99396N961G6580A5340J5273O1749k177
18361I0185k649a68113M3278d9465j01191f1637A24914j7262a24085l5356L2345
18350a27096j26962B3066L73664b10012B25787H5214J70398e9653A56451b8417
$$ y = [-370568, 49395, -223442, 263616, -55457, -49258, 930, -241004, -3847, -293895, 119471, -24394, -270201, -93645, 30346, 32073, -432338, -58826, 132182, -425371, -320377, -138340, -126105, -218301, 43285, -53761, 27932, 147494, -46723, -251895, 158947, 52913, 293108, -19784, -93176, -51548, -314971, 171291, -139562, -168474, -71011, -105521, -196358, -83680, -3106, 110347, 68401, -60988, 170538, -31803, -70760, -164241, -183653, -131729, -84905, -79318, 346893, -154378, 282873, -161657, -290939, 22203, 65692, -199396, -193435, 76580, 15340, 30613, 92362, 90185, 87536, -168113, -124835, -49465, -150656, -61637, 124914, 107652, -124085, -159441, -127096, -254058, 23066, 396730, -210012, 225787, 85214, 255612, -59653, 156451, -28417]
18339C30944d45697J35540A47949a54380B1154a70844A15894b5178C2950N31150
18329E64100b19910E4852b98170J00227J2807R968o6373A93773D5888J00998a45468
18317I4448J28142j00352c00793g8827j40467A18700i9761G184J75071h6806k21523
18306c08329B18549b79566C32144a99016k17442A4308J700J01453D3988J35540
18296A79528F1086g2425E7360N9078B3309P1625l280C3840g0116C33667j52704
18285A80963a01825n5764A5904c79277h0459r4484d023J735m377k45390H6358
18273D75836A60972D2231c5858m2396p7069L3861N7850A56673k511h5778H0488
18261A8494R5199L3840a70585B76291g2659E4261c5927k23688E232K06977b50591
$$ y = [330944, -445697, -310157, 147949, -154380, 21154, -170844, 115894, -25178, 32950, 564100, -219910, 54852, -298170, -197943, -185136, -175168, -241541, 193773, 45888, 146886, -145468, 94448, 222590, 122238, -300793, -78827, -219294, 118700, -99761, 7184, 182255, -86806, -308329, 218549, -279566, 332144, -199016, -416458, 14308, 16008, 117461, 43988, 179528, 61086, -72425, 57360, 116438, 23309, 94934, 91654, 33840, -70116, 333667, 180963, -101825, -157589, 15904, -379277, -80459, -174943, -4023, -2288, -6665, -252055, 86358, 475836, 160972, 42231, -35858, -78254, -155323, -121462, -63612, 156673, 154162, -85778, 80488, 18494, 113693, 147533, -170585, 276291, -72659, 54261, -35927, -259615, 5232, 212209, -250591]
18249a42692A59627c8466l74355B66922F8179e865A7779d0516j6128e635p5914
18238h1549K9407C1634A5457b27503e0377J4864k60807A86853i1334d0694l0244
18227g0938J1045b9192j56533m597p906a8064C7355K98276h1693D8025O3019K3831
18215A34875O9685b13805A49971b46171l05904C5345R5687g8785k10880A84558
18204b97799H485J28341N1771a82340j89816C37M4972d01977f6415j3320n8686
18193a38421A54898b03931F0643b9030o2453J1988j47208h1275k53760C9613b55768
18181A0234d9570B51512n1474a12993C00473c64840G0938a9122k10278H8961L5093
18170A24054P3799d81582e5668H8715i2214B7504d0047H761i4261P361c3508A5487
$$ y = [-142692, 159627, -38466, -412821, 266922, 68179, -5865, 17779, -40516, -56644, -5635, -81549, -52142, 31634, 15457, -227503, -50377, -35513, -296320, 186853, -91334, -40694, -70938, -59893, -29192, -185725, -190322, -198228, -18064, 37355, 335631, -81693, 48025, 111044, 134875, 204560, -213805, 149971, -246171, -552075, 35345, 131032, -78785, -289665, 184558, -297799, 8485, 136826, 188597, -182340, -372156, 337, 45309, -401977, -66415, -79735, -138421, 154898, -203931, 60643, -29030, -91483, -79495, -226703, -81275, -335035, 39613, -255768, 10234, -49570, 251512, 200038, -112993, 300473, -364840, 70938, -19122, -229400, 88961, 124054, 197853, -481582, -55668, 88715, -92214, 27504, -40047, 8761, -94261, -86900, -33508, 15487]
18157A15199a62253G8007b25328B5094J01066e3423d037B85323A21210b56908
18146b74788J29640b9937D9142N3791i9729B8905Q0992J22296h338j82865A00390
18134a3631O241l01917a20198N036D5316p529J93903f1951B29665a37656K0702
18123a16954D6633A9284N4248C569b36151K1856B74206g8728A78731D9587h5074
18111A96482F6881d9998j17136f6221o8030m1985D885e3789A70072o162A6019
18099C52664h6324E5988J61835b00672N3402A39786R7534f76197C6714a68349
18088A07598b01787A0072R5345J4391a81511A1700J26761g6034m4173B99491a52467
18076C55350A24274a0206B7785c5934o4850E6984b04047N0570N657f3623A7036
$$ y = [115199, -162253, 78007, -225328, 25094, 126160, -53423, -4037, 285323, 121210, -256908, -274788, -145148, -29937, 49142, 102933, -99729, 28905, 109897, 232193, -8338, -191203, 100390, -13631, -7390, -309307, -120198, -115162, 45316, 37787, 231690, -61951, 229665, -137656, -116954, 46633, 19284, 73532, 3569, -236151, -214295, 274206, -78728, 178731, 49587, -85074, 196482, 66881, -49998, -167134, -66221, -134251, -176236, 4885, -53789, 170072, 163910, 16019, 352664, -86324, 55988, 217823, -200672, -147270, 139786, 237320, -676197, 36714, -168349, 107598, -201787, 10072, 105417, 119808, -181511, 11700, 138461, -76034, -120207, 299491, -152467, 355350, 124274, -10206, 27785, -35934, -100784, 56984, -204047, -153477, -147820, -63623, 17036]
18064B46891c34482D9065a14840A2312c11844i3781j70076D4105a45852p1792
18054b17644P5433g0160B00668b22357A15043b29275I3101i5213l4095o4130R6189
18043i7249k97692a69290F5322a91399C7425c74430g623A49393P4015D888M0963
18032D5851b2635k43205I7798j1598a01005A3991a38204M3347n0797A02337b50188
18020i5727A28430J3456F0536a32646j2040A92332C0143J65479q0228k8588a96441
18008A06582a54822p3123M3014D0475b47620A18952c9458j7319r6739G9692b8459
17996b06703A36497D0158e300B72912b13811A94279a66275A38703A6501e0315
17985a18754M4644C6546a05213k1583A15456d9586n8926k4796A5374b992j95300
$$ y = [246891, -334482, 49065, -114840, 12312, -311844, -93781, -263857, 44105, -145852, -217644, -142211, -70160, 200668, -222357, 115043, -229275, 93101, -95213, -129308, -193438, -97249, -394941, -169290, 65322, -191399, 37425, -374430, -7623, 149393, 223408, 4888, 45851, -22635, -265840, 97798, 86200, -101005, 13991, -138204, -94857, -145654, 102337, -250188, -95727, 128430, 141886, 60536, -132646, -144686, 192332, 30143, 195622, 115394, 86806, -196441, 106582, -154822, -227945, -184931, 40475, -247620, 118952, -39458, -56777, -153516, 79692, -28459, -206703, 136497, 40158, -5300, 272912, -213811, 194279, -166275, 138703, 16501, -50315, -118754, -74110, 36546, -105213, -126796, 115456, -49586, -108512, -133308, 15374, -2992, -198292]
17974a98292K4511j9331A16865R4224A1876a34764j85158A00518b82714e7500
17963b0163j85201A23201J19496K6246o6001a15607H1090J2779O6241d8658a2282
17951h166k24725c0519l875j08889O7625A2957J03761a45347A80487b05349d7750
17939A33060a5644l81824Q8822h5948A05164J18486d0600j37186c6148k68334
17929c04482A43080m6906B1048a12029F4878P4014f0558G33g3207l6450C5167
17917A32305l2725k2654O2273d17488f7018o8384H6093J78839h8020D8077a81867
17905c5143A79227c1693k20705A20917k0543b29030A00895a1381n7312k36593
17895c05286H4326M9094j710e1378B86015M8020e57871B7440a22162A22846C5737
$$ y = [-198292, -173781, -193112, 116865, 211089, 11876, -134764, -319922, 100518, -282714, -57500, -20163, -205364, 123201, 242697, 268943, 202942, -115607, 81090, 93869, 160110, -48658, -12282, -8166, -232891, -30519, -34394, -143283, -75658, 12957, 116718, -145347, 180487, -205349, -47750, 133060, -15644, -397468, -308646, -85948, 105164, 223650, -40600, -177786, -36148, -304482, 143080, 96174, 21048, -112029, 64878, 138892, -60558, 733, -73207, -109657, 35167, 132305, 99580, 76926, 139199, -417488, -67018, -135402, 86093, 264932, -88020, 48077, -181867, -35143, 179227, -31693, -252398, 120917, 100374, -229030, 100895, -11381, -68693, -305286, 84326, 133420, 131710, -51378, 286015, 334035, -557871, 27440, -122162, 122846, 35737]
17883C17J31055J2518h2875C2747c29406a55636j49117e247F3543b9793n680B01496
17870A30684a34739B0163c7719j08206H2341a4381l86604B8830R6717M027j1577
17859A17997h5049A42752a00868j97416f5291k77215I1743J90314p7163F8961
17848e6223N381H2248a07668A8777L3264P4279L0782m423F3452b35914C29054
17836a19579k9087a4396F2562M7842a7386m1115k02289A10861J83029j44008O3621
17825B13503h390A48362A5801K10988b55469g15p1394H6011K50643f6322r2815
17814a59137B0359J46228p3106L02953C1875a1573A16216J09971K3370O4320A22053
17802A37536A3741c13779d9312j98059b9133O677K939I5366d1221B49124F9765
$$ y = [317, 131372, 143890, -82875, 32747, -329406, -155636, -304753, -5247, 63543, -29793, -35473, 201496, 130684, -134739, 20163, -37719, -145925, 82341, -14381, -400985, 28830, 125547, 129574, 117997, -85049, 142752, -100868, -298284, -65291, -342506, 91743, 282057, 204894, 68961, -56223, -50842, 82248, -107668, 18777, 52041, 126320, 157102, 152679, 63452, -235914, 329054, -119579, -148666, -14396, 62562, 110404, -17386, -58501, -260790, 110861, 293890, 149882, 213503, -8390, 148362, 15801, 226789, -255469, -715, -72109, 86011, 336654, -66322, -159137, 20359, 166587, 93481, 396434, 31875, -11573, 116216, 226187, 249557, 313877, 122053, 137536, 13741, -313779, -49312, -247371, -29133, -22456, -19517, 95366, -41221, 249124, 69765]
17790h88k10693g8260k4539p9873d5511C22116f7101F8000Q143a50305A02204
17778f4444C67304a9515A66517e60o3886l4389A01212a42745r765P5386c7334
17766e0332j15721N2196h1A80781Q5828b8360E913g6897B67793e4049A58012b02477
17753D3229l556a75608g6067o4733g64j14603N5512j14857B6823R8236b68257
17741A6102a21481q5570J5200D9904b91337A1680a38323j38804J07603n8601R5869
17730a32256A92810a68683f0088C2891R1363a9545l8991j3904k71583H192J72469
17719A80661I091a23396B7165g2138o3671f3698j79553D1882g5663J6957o0693
17708a19399A21205D5319J88944j680i4074B52265q9771A2825a22473K7587G6906
$$ y = [-888, -211581, -78260, -102799, -182672, -45511, 322116, -67101, 68000, 76143, -150305, 102204, -64444, 367304, -19515, 166517, -560, -64446, -98835, 101212, -142745, -152510, -77124, -37334, -50332, -166053, -113857, -81, 180781, 266609, -28360, 5913, -76897, 267793, -54049, 158012, -202477, 43229, 39673, -175608, -76067, -140800, -764, -115367, -59855, -174712, 26823, 125059, -268257, 16102, -121481, -207051, -191851, 49904, -291337, 11680, -138323, -277127, -169524, -228125, -132256, 192810, -168683, -60088, 32891, 124254, -19545, -58536, -72440, -344023, 8192, 180661, 9091, -123396, 27165, -72138, -135809, -63698, -243251, 41882, -75663, -58706, -119399, 121205, 45319, 234263, 232583, -94074, 252265, 162494, 12825, -122473, -94886, 76906]
17696A38057a8042j5951A37895a68107A87463b44603A3263h9410C18518A05301
17685h5727k18607a20903P85r7782O9224C87875e565A65385J12105J694j21044
17674A58140a37952C556J47804J90136j24h2303F4942K68025j30615r5400g8662
17662B9198O0175J44695b90767I7239d0135n8108A80363K26921I9809a77036A55147
17650C3070a0805k20804B4105C761J18717B0639e6109A09716J26515H6125J45655
17639B31780C0540a97314C53322h3174A70320m5300K22004e5181D1453a78841
17628a33538A09577L40542a44242c868k68892B4400b13523B77421i5283k668j86792
17617b84743D3397J4506Q4277N9610J22742A04866J36178F211Q2330L5347J24486
$$ y = [138057, -18042, -33993, 137895, -168107, 187463, -244603, 13263, -89410, 318518, 105301, -85727, -304334, -120903, -120118, -217900, -148676, 387875, -5565, 165385, 277490, 279184, 158140, -137952, 3556, 151360, 341496, 341372, -82303, 64942, 332967, 202352, 106952, -78662, 29198, 89373, 234068, -290767, 97239, -40135, -98243, 180363, 407284, 99809, -177036, 155147, 33070, -10805, -231609, 24105, 3761, 122478, 20639, -56109, 109716, 236231, 86125, 231780, 30540, -197314, 353322, -83174, 170320, 125020, 347024, -55181, 41453, -178841, -133538, 109577, 450119, -144242, -3868, -272760, 24400, -213523, 277421, -95283, -97951, -284743, 43397, 57903, 142180, 201790, 324532, 104866, 241044, 6211, 88541, 123888, 248374]
17606B48374p1960n8097b08893B87887b2084I9662a04897J9398A48310a41452
17595A17593m4317e3068L70D5300K3504a0178o9316L1885B8101Q4138D9131e2234
17582b4589D48460b63465e6240H2400C1425O6185a9226A68650C9256g2076l53504
17571d25580D4431B259L65444A42110h7768I1262e4354A44167a16054p722B22210
17559b0213o3100A94514a515C25570A62606J34008I2564j6917a12152A98687I7351
17547A84354M1288c7008m343j39116l5176C31239b87291C66934c48242d5285C65314
17535C25023A28342a41877f0506A36884B5151L7008Q7028c70673A6844a72039
17524h325C6116a07174a1976o6637r9238d2971m305a6515l37355B1596N0161a33287
$$ y = [248374, 176414, 118317, -208893, 287887, -22084, 99662, -104897, -85499, 148310, -141452, 117593, 73276, -53068, -52698, 45300, 68804, -10178, -79494, -47609, 28101, 112239, 49131, -52234, -24589, 448460, -263465, -56240, 82400, 31425, 97610, -19226, 168650, 39256, -72076, -425580, 44431, 2259, 367703, 142110, -87768, 91262, -54354, 144167, -116054, -123776, 222210, -20213, -83313, 194514, -1515, 325570, 162606, 296614, 92564, 75647, -112152, 198687, 97351, 184354, 225642, -37008, -41351, -180467, -215643, 331239, -287291, 366934, -348242, -45285, 365314, 325023, 128342, -141877, -60506, 136884, 25151, 62159, 149187, -370673, 16844, -172039, -8325, 36116, -107174, -11976, -78613, -177851, -42971, -47276, -16515, -353870, 21596, 71757, -133287]
17511B17268a46950M0032A10329D1957K70144b17854A80702O9881a7188p0025
17501h7213C8407j0023d63001h9473B40638G6453e5811A69193p5566K17271P817
17490C18715I7362J08550H5955J47307c019C43212A14243M0616o5383O7251Q8422
17479B45149a2423j22260B88031m9091r0026K84124o9717N8491A65805a3890B99657
17467A834P4152e8310j79679C88336c7996C66547I2183c9010A71020M9693R9841
17456C20554A8178K5296F975J12755K356a03904B98279C9468b422n4288A55848
17444B97147B1292P6222B3786L54163n1177B9892a032B19831K4151I8866K65228
17433C64094M0938q7358P1756p548F1847M23279j82141B9626M09242A01652R2425
$$ y = [217268, -146950, -106918, 110329, 41957, 312101, -217854, 180702, 250583, -17188, -87213, 38407, 28384, -463001, -89473, 240638, 76453, -55811, 169193, 93627, 310898, 318715, 97362, 205912, 85955, 233262, -3019, 343212, 114243, 154859, 89476, 156727, 245149, -12423, -134683, 288031, 238940, 148914, 433038, 363321, 421812, 165805, -13890, 299657, 1834, 75986, -58310, -237989, 388336, -37996, 366547, 92183, -39010, 171020, 220713, 320554, 18178, 43474, 6975, 119730, 122086, -103904, 298279, 39468, -2422, -56710, 155848, 297147, 21292, 97514, 23786, 377949, 326772, 29892, -1032, 219831, 243982, 98866, 364094, 405032, 317674, 389430, 381882, 61847, 485126, 302985, 29626, 438868, 101652, 194077]
17422A94077c0907F09458A79941K40675a12576C94189I5946K00563H0019A9978
17411C42284d6342n949I9100K80804D3220J61218l3963R5633J233L34K2472j32632
17399A57515n3982F248d0957D12907A43615J09859k7201m2153p1166c1604q3832
17388a15436C26642i4269G9843a469B12228M02077A90212G0911J75509j8686A00110
17376f5687B92759b03370B79442j22466p8352J2950F470J45074i6493B44947j4903
17365B30044L15384k19737A02142k336J81345A32472a06232B21134f0229A81931
17354A28268E5113J75534j8084j03803d9534c5j31858B51153d5663A75099B3578
17342B17900j06957a10456C6741J46404j1652o1620J6133A2111J31414D8625Q4799
$$ y = [194077, -30907, 609458, 179941, 420616, -112576, 394189, 95946, 296509, 80019, 19978, 342284, -46342, -52291, 99100, 379904, 43220, 204438, 170475, 266108, 267341, 267675, 290147, 157515, 103533, 6248, -40957, 412907, 143615, 253474, 226273, 184120, 112954, -31604, -115436, 326642, -94269, 79843, -1469, 212228, 614305, 190212, 70911, 246420, 227734, 100110, -65687, 292759, -203370, 279442, 156976, 78624, 91574, 6470, 151544, -96493, 244947, 230044, 545428, 325691, 102142, 99806, 281151, 132472, -106232, 221134, -60229, 181931, 128268, 55113, 230647, 212563, 108760, -49534, -35, -131893, 251153, -45663, 175099, 23578, 217900, 110943, -110456, 36741, 183145, 171493, 109873, 126006, 12111, 143525, 48625, 133424]
17331A33424J24267h1608G9200J28218o2824N20150B19900a73281A02294J47614
17321B49908l1081c02388F2262a16490C12666j34261g3609A07172J5039n0259
17311G1952K1095N7721J76476j15313Q0953H9964K70705a37802H5674a0676B57879
17299A85034p7963j551J86181a270p3088b4631B85492j16244M4170o4916J62915
17288C11417K06186A3142N9793M49965I680L9791O3700J57300c79471B99839j05320
17277A94519J00332r4692l5058l0218k0746r749O7943g6374D8587d6351B55716
17265A1331J48861C7527L54077g6908D9917J05998J38601G5149K39113c2428A83012
17253A12086D9805K67804a4788A97024K92037o5096A10967a93339d3690k0356
$$ y = [133424, 257691, -81608, 79200, 207418, 144594, 664744, 219900, -173281, 102294, 249908, 218827, -302388, 62262, -116490, 312666, 178405, -73609, 107172, 122211, 71952, 93047, 150768, 327244, 211931, 292884, 89964, 360669, -137802, 85674, -10676, 257879, 185034, 107071, 105520, 291701, -1270, -74358, -24631, 285492, 169248, 213418, 148502, 311417, 517603, 13142, 72935, 522900, 9680, 49471, 113171, 270471, -379471, 299839, 194519, 294851, 200159, 165101, 134883, 114137, 104388, 172331, -76374, 48587, -46351, 255716, 11331, 160192, 37527, 391604, -76908, 49917, 155915, 294516, 75149, 314262, -32428, 183012, 112086, 49805, 317609, -14788, 197024, 489061, 423965, 110967, -193339, -43690, -64046]
17243f4046F28795B00038J12210o0142N7025j45504Q4108M48979I5972J11759
17233B07731K84469E3875J74881J62898a58698A94759j5136a28376F81562k96518
17223C85044K4240d0354A19080Q4202n1825j1451L57310k25966K133j25323c3444
17211C60099A48979J18696o850p4341K9164J11899F0454P3717J32792K26419D4442
17199b4519C20362g0397B17689Q1500N1525n6042a77258k9332c2548D38497C7332
17187B77580F5402B813L6138J13579J9447K16468n4213p1007F1416L58446j82099
17176B37763K5756P4052j23065n778j0464j1806p023J36182K6757o7942J72478
17165D46910h997B56921J19625j29025K05884d3880C13574A55565a12957A54345
$$ y = [-64046, 628795, 200038, 312248, 252106, 309131, 163627, 247735, 696714, 95972, 207731, 492200, 53875, 228756, 391654, -158698, 194759, 179623, -128376, 681562, 385044, 409284, -40354, 119080, 203282, 151457, 140006, 497316, 271350, 273483, 148160, -33444, 360099, 148979, 267675, 260825, 186484, 215648, 327547, 60454, 134171, 266963, 493382, 44442, -24519, 320362, -70397, 217689, 299189, 350714, 294672, -177258, -206590, -32548, 438497, 37332, 277580, 65402, 2813, 38951, 152530, 171977, 388445, 334232, 263225, 61416, 419862, 237763, 263519, 337571, 214506, 208728, 198264, 186458, 179435, 315617, 342374, 274432, 446910, -8997, 256921, 376546, 247521, 453405, -43880, 313574, 155565, -112957, 154345]
17154A50941J45644A1781c8550E26262j70519j16378j2691K093F6812R8929P1598
17143B37339J8931Q4603K6290p431r9964R8446A34474o2435J04346o6840J59938
17132B69483N4464L6925j2488l216K37347B64786A26048a87953E42165k51614
17122B90551I3523L09958j85338J61459j08886P3374k8699J61939j82352J44266
17112D39244n8608A13060M53522k77840j02083K12446k429A2759O5303K77109
17102C55171m2028K80347B95736K41134B07584K79108B42525O2644R8276P4927
17092D78372j99208J82462A93384M02086j9605I8708K54276j15876b9624E14494
17081D50240A10544K95396m3527J80146m7173I2651K88870J03482k7250j0544
$$ y = [150941, 296585, 11781, -38550, 526262, 355743, 239365, 226674, 228767, 66812, 165741, 237339, 256270, 340873, 367163, 359732, 259768, 358214, 134474, 72039, 176385, 109545, 269483, 323947, 360872, 348384, 345168, 582515, 264786, 126048, -187953, 542165, 290551, 93523, 403481, 218143, 379602, 270716, 344090, 315391, 477330, 294978, 439244, 380636, 113060, 566582, 288742, 186659, 399105, 396676, 12759, 78062, 355171, 313143, 593490, 295736, 536870, 207584, 486692, 242525, 305169, 403445, 478372, 279164, 461626, 193384, 595470, 575865, 98708, 352984, 237108, -29624, 514494, 450240, 110544, 405940, 362413, 542559, 495386, 92651, 381521, 485003, 457753, 447209]
17071D47209K05962B97901J67652j36821J36929j75246K31834A53357K76782k7897
17061D02242K13029F1761N40097r5917j77289K85219B58657K16087J50321j66717
17051D58348k22927L21225j72124K41633j31810o5442j70976M71751J75008j99319
17041G05367B49805J40880J3201J00414r8200j27599n7584N7812J8640K6759Q3725
17030D07853J2735O9469o3589m0416N6326O0350B50075L24888k4000m495k25432
17019C21036N10803J11802k56827Q0953k23680A66966F9395O19279j53086J53755
17009F89343J2140k0482k19368J59587o2956J06757j26218j00121K03223Q0513
16999G22418l7658J38165j83704k06464J98048Q900j66470J34896L01029q4868
$$ y = [447209, 653171, 297901, 465553, 328732, 465661, 290415, 522249, 153357, 430139, 402242, 615271, 61761, 601858, 505941, 328652, 613871, 258657, 474744, 625065, 458348, 235421, 556646, 384522, 626155, 494345, 428903, 257927, 729678, 904686, 705367, 249805, 390685, 403886, 504300, 406100, 278501, 220917, 278729, 297369, 324128, 407853, 420588, 490057, 426468, 386052, 442378, 502728, 250075, 574963, 550963, 546468, 321036, 831839, 943641, 686814, 767767, 544087, 166966, 69395, 688674, 535588, 689343, 701483, 681001, 461633, 621220, 558264, 665021, 538803, 438682, 641905, 722418, 684760, 822925, 639221, 432757, 630805, 639705, 473235, 608131, 909160, 824292]
16989H24292k0000K71937j03287k96801k86206L54640p7451C27797L22070J02377
16979G52244p3843J0933o486J91681j92738k54488K86305N6875n499j13661K7193
16968F78516k5881K65671K0294l22701L25706j63221J7998j92544M1215L51853
16958I96906l19283K63574L7474n6270j95680K87755Q644l07805L88943k07172
16948H97086j13476J42786O99J12692p6961J91671j06016L4485q6296j77990j687
16937H16993M1595Q148P5826k29161L53454m4943j22187J79276N0144M0381q0457
16926A089069k28858J55106K45817k2970o1776L7521j80617L99109k10163M57760
16916A679998o97188J45897J57200m487j9380k1315J39107k18058K15859j08845
$$ y = [824292, 804292, 1076229, 972942, 676141, 389935, 744575, 667124, 327797, 649867, 752244, 678401, 689334, 682848, 874529, 681791, 427303, 713608, 770483, 764984, 651323, 678516, 652635, 918306, 938600, 615899, 941605, 778384, 796382, 603838, 645053, 996906, 677623, 941197, 978671, 922401, 726721, 1014476, 1023120, 715315, 1104258, 897086, 783610, 926396, 927095, 1039787, 962826, 1154497, 1048481, 1082966, 996670, 818680, 816993, 858588, 866736, 942562, 713401, 1066855, 1021912, 899725, 1079001, 1129145, 1169526, 1089069, 860211, 1015317, 1261134, 1238164, 1176388, 1213909, 1033292, 1432401, 1222238, 1679998, 982810, 1128707, 1285907, 1281420, 1262040, 1240725, 1379832, 1161774, 1377633, 1268788]
16906A268788M69729o13562J17336J78341j35349j58236K04194j0677K44249k30057
16896A334756M25929n02597L18648k32972P9191J12377L4764j88593K64298P7617
16886A723418J48599k15201K01203n7899k7838p2066K4967M1801j2729K03086
16876A957341J71886l23335N4985J70250k27019K44461L33080p7355k60007k19122
16866A825165M63612j60969K68846l95446m1668K25127J62484K9914k04313K67252
16856B440004k58936K19619j89387K31140J34610j4699l86145N72058J97831k45682
16846B700413j30172M35040L7186j09531L0628k48611O00620l1598m61450L04735
16836C127260J87278j42361K80305l34052N63616n97308K46043K20876K35388
$$ y = [1268788, 1738517, 1124955, 1242291, 1420632, 1285283, 1127047, 1331241, 1320564, 1564813, 1334756, 1760685, 1258088, 1576736, 1343764, 1422955, 1535332, 1570096, 1381503, 1645801, 1723418, 1872017, 1656816, 1858019, 1800120, 1772282, 1700216, 1725183, 1766984, 1754255, 1957341, 2129227, 1805892, 1860877, 2031127, 1804108, 2048569, 2381649, 2304294, 2044287, 1825165, 2288777, 2127808, 2396654, 2001208, 1959540, 2184667, 2347151, 2377065, 2172752, 2440004, 2181068, 2400687, 2211300, 2442440, 2577050, 2562351, 2176206, 2748264, 2946095, 2700413, 2570241, 3005281, 3042467, 2932936, 2963564, 2714953, 3315573, 3283975, 2822525, 3127260, 3314538, 3172177, 3452482, 3118430, 3682046, 3084738, 3330781, 3551657, 3787045]
16827C787045R0916k80045O2319j39837M09879K66934l6711K93701k45762K59021
16817D467460K34515n1723j99258O5555J89900J13299J85792J1634L67670k11114
16807E173730K27436O9550j33452M18149n8907M8778M47455L1848k10560K64466
16797F278493K62546q352O37478P2985j89031M91732K7986Q8599K17091J24143
16787H003670j39436N93148K26040J42147J24718M5308N33803J78836L28541J44432
16777A0181207L65483K8007O06077J61934L61740L62565K65139N60092L4897P81040
16767A3708181L08380J89979Q66832M03642N42043N18898K90417O65210O38926
16758A8132508N77127M23294P86018N52392Q15431Q95305J157754N20884J182293
$$ y = [3787045, 3877961, 3597916, 3660235, 3520398, 3930277, 4197211, 4160500, 4454201, 4208439, 4467460, 4701975, 4650252, 4450994, 4516549, 4706449, 4819748, 5005540, 5017174, 5384844, 5173730, 5401166, 5470716, 5337264, 5755413, 5696506, 5745284, 6192739, 6224587, 6014027, 6278493, 6541039, 6532687, 7170165, 7243150, 7054119, 7545851, 7573837, 7662436, 7879527, 8003670, 7864234, 8457382, 8683422, 8825569, 8950287, 8995595, 9529398, 9708234, 10036775, 10181207, 10546690, 10574697, 11180774, 11342708, 11704448, 12067013, 12332152, 12892244, 12927141, 13708181, 14016561, 14206540, 15073372, 15477014, 16019057, 16537955, 16828372, 17493582, 18132508, 18709635, 19132929, 19918947, 20471339, 21286770, 22182075, 23339829, 23860713, 25043006]
16749B5043006J047347J037766R83964J087143J527166J081226J723502J097317
16741C4628437J736924J470541J947915J717914K348340K333706K212823K291195
16733E0687795K773584K643628L095684L424256L238776L614726M318511L880290
16725G7677250M473338M937250M994681N275570N771348N810571O538748O527903
16717A22006659O483502P148355O898967O899257O921148O710683O716172N868969
16709A75653712N391705M417304L409466K680773J626982K71056j156944j955596
16701A90338458l422888l871721n414820n614053o488334o558328p074245p330033
16693A44564036p009117p186193p059773o644708o765932n770142o253117n824032
$$ y = [25043006, 26090353, 27128119, 28112083, 29199226, 30726392, 31807618, 33531120, 34628437, 36365361, 37835902, 39783817, 41501731, 43850071, 46183777, 48396600, 50687795, 53461379, 56105007, 59200691, 62624947, 65863723, 69478449, 73796960, 77677250, 82150588, 87087838, 92082519, 97358089, 103129437, 108940008, 115478756, 122006659, 128490161, 135638516, 142537483, 149436740, 156357888, 163068571, 169784743, 175653712, 181045417, 185462721, 188872187, 191552960, 193179942, 193450998, 192294054, 190338458, 186915570, 183043849, 177629029, 172014976, 165526642, 158968314, 151894069, 144564036, 137554919, 130368726, 123308953, 116664245, 109898313, 104128171, 97875054, 92051022]
16685I2051022n050428n082596m568643m838732l971152l560004l717294l441084
16677E7821089l207944k999052k836022j761358k899890k255211j890072j967517
16669C8004023j727702j759004j521311j352507j443422j174467j257123j262507
16661B6505980r08081j211294q47499r84439p49655r35442m86043q81677n17892
16652A8983958r05599p86071n83287q68843j37817k61023n65089o82735n33959
16643A3659535l23567m97537k40675m45906n50177j51030q5794n24038k16541
16634A0624270k39713m55417p7487l43168J47763q97362M1938k98155n8699k46361
16624H197609n39204L1722n75779J82069j23835l26768l02950K14809j73645l78328
$$ y = [92051022, 87000594, 81917998, 77349355, 72510623, 68539471, 64979467, 61262173, 57821089, 54613145, 51614093, 48778071, 47016713, 44116823, 41861612, 39971540, 38004023, 36276321, 34517317, 32996006, 31643499, 30200077, 29025610, 27768487, 26505980, 25597899, 24386605, 23539106, 22554667, 21805012, 20869570, 20383527, 19501850, 18983958, 18078359, 17292288, 16709001, 15840158, 15702341, 15441318, 14876229, 14193494, 13659535, 13335968, 12838431, 12597756, 12151850, 11601673, 11450643, 11364849, 10840811, 10624270, 10384557, 9929140, 9851653, 9508485, 9656248, 8758886, 8800824, 8502669, 8443970, 8197609, 7658405, 7690127, 7114348, 7296417, 7172582, 6845814, 6542864, 6757673, 6584028, 6205700]
16614F205700p5239j51538k80431p9745k31862L39907k95660j18080Q4303m23242
16604D974113J05819k56579O8998k68030k73894J77099M7603l20138q1612L5888
16594D209267l9837J30584l37034M4524o9312j14847k35361M5492R8771l95697
16584C336550j39134K85131p1044l01896j36228q8556k2496M23905l33797P4704
16574C027139L4726k08869O7232k03250O6404k66313J52439J60690n41650M34896
16564B723444j42977J59703k79967J45809n28790K31662q9187r5533L46747m91399
16554A979512m5001K31195k10627J7383J19124n21736J53316J76161J44965l14152
16544A730140K6892L27028j60097j75725K46727m54485M13053l16291j72167L80848
$$ y = [6205700, 6130461, 5978923, 5698492, 5618747, 5386885, 5726792, 5431132, 5313052, 5397355, 4974113, 5079932, 4823353, 4892351, 4624321, 4350427, 4527526, 4575129, 4254991, 4173379, 4209267, 4169430, 4300014, 3962980, 4007504, 3938192, 3823345, 3587984, 3633476, 3732247, 3336550, 3197416, 3482547, 3411503, 3109607, 2973379, 2884823, 2862327, 3286232, 2952435, 3027139, 3061865, 2852996, 2920228, 2716978, 2783382, 2517069, 2669508, 2830198, 2288548, 2723444, 2580467, 2740170, 2460203, 2606012, 2077222, 2308884, 2219697, 2124164, 2470911, 1979512, 1934511, 2165706, 1955079, 1972462, 2091586, 1569850, 1723166, 1899327, 2044292, 1730140, 1757032, 2084060, 1923963, 1748238, 1994965, 1540480, 1953533, 1637242, 1465075, 1845923]
16534A845923j23999j62250N0606p1749L1601j48235l39235O30152l98709J20355
16524A434460n7311K40329k56474L39029j81603j83639j2892J63465K7871J80243
16514A693478k23534j36359n99387N27431M7517l26756J90475K47774m29598Q9952
16504A080993L00046o48532K96017K43104n17520N24999r8799k56167j7764J68330
16494A074707L46210o96246M27790l21717K39844K68631j15294l22459m3345R5321
16484I53442l4842L09371m66454K79471j4462j90974q0477K45330J7699R9548
16474A117652j99522O1095j12963J41806j69957J0072j07406J75231k7724q2249
16464H06035K62240l78259Q1649j96530K6625K78211m01849P56526l45621Q2693
$$ y = [1845923, 1721924, 1559674, 1610280, 1538531, 1570132, 1421897, 1082662, 1712814, 1314105, 1434460, 1377149, 1617478, 1361004, 1700033, 1518430, 1334791, 1321899, 1485364, 1513235, 1693478, 1469944, 1333585, 734198, 1261629, 1309146, 982390, 1172865, 1420639, 991041, 1080993, 1381039, 732507, 1028524, 1271628, 754108, 1279107, 1180308, 924141, 906377, 1074707, 1420917, 724671, 1152461, 830744, 1070588, 1339219, 1223925, 901466, 858121, 953442, 918600, 1227971, 761517, 1040988, 1026526, 835552, 755075, 1000405, 1018104, 1117652, 918130, 979225, 866262, 1008068, 838111, 848183, 740777, 916008, 888284, 806035, 1068275, 690016, 771665, 575135, 601760, 879971, 478122, 1234648, 889027, 971720]
16454I71720k11058o4068j59910O0800L8197M42915E19286K98210l27484J56353
16444F46365R7278J15097l00221O533M06474m23470J50037r2112M995j5973K48549
16433H43552j95218J02303J30678B22833M51643k04455J36581r2751J02007o3167
16423E52691K87416m07608K99826j81823J6068k6855q9380L30151N1453j65553
16413F66386J693L5588K8796l07052j64363K25819J16732k48197L54938k58287
16403D52053N8710J54082j1679k02575K42576B45558J95049J48997k48524k5227
16393C15853J46844J73109K281k91975J19729A11770K67375K72742O0372r7444
16383F14815j00015A41289K58335m1049p1653K34698Q8615j34513B04902M12777
$$ y = [971720, 760662, 696594, 536684, 597484, 635681, 1078596, 519286, 817496, 490012, 646365, 743643, 858740, 558519, 565052, 971526, 548056, 698093, 605981, 610976, 595003, 843552, 648334, 750637, 881315, 222833, 674476, 470021, 606602, 513851, 615858, 552691, 840107, 432499, 732325, 550502, 566570, 539715, 450335, 780486, 831939, 666386, 668079, 703667, 732463, 425411, 261048, 486867, 603599, 355402, 710340, 452053, 510763, 664845, 653166, 450591, 693167, 245558, 440607, 589604, 341080, 315853, 462697, 635806, 638087, 346112, 465841, 111770, 379145, 651887, 712259, 614815, 514800, 141289, 399624, 358575, 286922, 521620, 610235, 475722, 204902, 617679]
16373F17679J20209C38209P7521J36206k63532J96470A35602L77622j80680Q5614
16363D18158J15610j1032o2311j59540K30188A19769K62362J26751M3271r6539
16353D55614j79420L28993k4816o1593l7204J18403k68530M5173J46353k14282
16343C08691L44884Q1217l743l03689K4497L0793F8532N65201k82910K5269j66083
16332B10009L91543B56233J68893j77430K76589A97171K54073j78976J03795K47180
16322F23243k04796M4403A60547K45892A72208K24457j81282N25135C58182J56024
16312E14206k16240j1020J6752J58362j93097j2262r2981J68444B9384L18906
16302C48290o7648p5615J53550o2681M625m0897L9341K35777i9090B42268J01673
$$ y = [617679, 737888, 338209, 415730, 551936, 288404, 484874, 135602, 513224, 332544, 418158, 533768, 522736, 460425, 300885, 531073, 119769, 382131, 508882, 552153, 455614, 276194, 605187, 580371, 518778, 481574, 599977, 331447, 376620, 522973, 308691, 653575, 734792, 731049, 427360, 451857, 482650, 68532, 633733, 350823, 376092, 210009, 601552, 256233, 425126, 247696, 524285, 197171, 451244, 272268, 376063, 623243, 418447, 462850, 160547, 406439, 172208, 396665, 215383, 740518, 358182, 514206, 297966, 286946, 303698, 462060, 268963, 256701, 163720, 332164, 29384, 348290, 280642, 205027, 358577, 295896, 300521, 259624, 298965, 534742, -99090, 242268, 343941]
16291C43941m7631Q2813N690r3359K05400A9815L34549k0912A30671N39155l05857
16280C63969r199K2160j21317K65757F1915N34071j87230A25530K42721j31553
16270B36698E8759B7027O60228A69564J45183K62559j88385j2361R457A04625
16259c5095A37030J9471m7585J25607J47072l1434m7858D2290L33715A63146K35529
16248C98675k4677A56040P8796K0156l4617r4355n088K42205A34444A9209O2066
16237H1275L17658l9532H8727J74511j22496L57571A78245Q4344e687B74416M8267
16226C22683j9530j15495l5628R8365M1379J97923A61521k502R9583k4269m3079
16215A91254k3396Q3480b2607C25409H7505J5912J4443k6043j760L79828F363
$$ y = [343941, 296310, 379123, 384813, 291454, 496854, 19815, 354364, 333452, 130671, 669826, 363969, 354770, 376930, 255613, 521370, 61915, 595986, 408756, 125530, 368251, 236698, 58759, 27027, 687255, 169564, 314747, 577306, 388921, 376560, 386017, 104625, -35095, 137030, 156501, 108916, 234523, 381595, 350161, 302303, 42290, 376005, 163146, 398675, 373998, 156040, 234836, 254992, 220375, 126020, 120932, 363137, 134444, 19209, 81275, 398933, 359401, 88727, 263238, 140742, 498313, 178245, 262589, -5687, 274416, 322683, 303153, 187658, 152030, 250395, 291774, 489697, 161521, 159019, 258602, 234333, 191254, 167858, 251338, -22607, 325409, 87505, 103417, 117860, 91817, 90057, 469885, 6363]
16203B99961A24694J0110J78264j0469C2283L01929L83508A0804K43349P789k3378
16192B38564J93380A75205K6333E0869M09942E6290P6624Q260P2278m0509l3359
16181A39584a70175A32513a5760B11736J55296j23819n4090I86d765k04894I5131
16169b4738B04003J10106m0075A27693J7905c4579j17368B67666e6047p4166B73929
16157B49978I7692L99406B19949k5242E0007i0436F8377N0999d6902b0442l1503
16146e1945B44540A18918j9767a93183F1998R713M9361J25551I1995J24602K39893
16135D56490A8762J55451g6733C64254F5673L7428a36973F1024J47941b46171
16124I0672J95044J15367b43532A48620J4777M614J43969A41852F8512a49162
$$ y = [299961, 124694, 134804, 313068, 302599, 32283, 334212, 717720, 10804, 254153, 261942, 238564, 431944, 175205, 201538, 50869, 460811, 56290, 132914, 141174, 213452, 172943, 139584, -170175, 132513, -15760, 211736, 367032, 243213, 189123, 986, -4765, -209659, 95131, -24738, 204003, 314109, 274034, 127693, 145598, -34579, -151947, 267666, -56047, -130213, 273929, 249978, 97692, 497098, 219949, 194707, 50007, -90436, 68377, 119376, -46902, -20442, -51945, 244540, 118918, 99151, -193183, 61998, 71711, 121072, 246623, 91995, 216597, 456490, 18762, 174213, -76733, 364254, 65673, 103101, -136973, 61024, 208965, -246171, 90672, 285716, 401083, -243532, 148620, 163397, 168011, 311980, 141852, 68512, -149162]
16113b03576A42633a03064A42170J34803a54198j7375C85917c60554I0313K2426
16103A12739M1294m0926a00187A15276b71247C3840A6296L6556b97663H8082a4732
16091B91528A07954M983M7863F7881f2771A69767J02303j00c2737A1524J81931
16080A93455a85564A26908o288h9441r6760C4598M42654i0156B33215b7877k249
16069c0126G5518J66904I0819O3821O6193E386J3121a3945B77143b20341A64006
16057a93892L2240j02337C06796A60L6330b33549E9656a23506L9357c7722A69088
16045G8558j1865J6370c71274J84618O7069k46462A79698n5444j625c9292A3800
16033A14330C2549N4827J08437I83b61429A52656b98807A73631F2179j1032J1839
$$ y = [-203576, 142633, -103064, 142170, 276973, -154198, -171573, 385917, -360554, 90313, 112739, 154033, 113107, -100187, 115276, -271247, 33840, 16296, 52852, -297663, 88082, -14732, 291528, 107954, 112937, 160800, 67881, -62771, 169767, 272070, 271970, -32737, 11524, 193455, -185564, 126908, 120620, -89441, -186201, 34598, 477252, -90156, 233215, -27877, -30126, 75518, 242422, 90819, 154640, 220833, 5386, 18507, -13945, 277143, -220341, 164006, -193892, -161652, -263989, 306796, 160, 36490, -233549, 59656, -123506, -84149, -37722, 169088, 78558, 66693, 83063, -371274, -186656, -119587, -366049, 179698, 124254, 122629, -39292, 13800, 114330, 32549, 87376, 195813, 983, -261429, 152656, -298807, 173631, 62179, 51147, 62986]
16022F2986H367K0508J55498F7459b36058A9908e760E0227R5972a0744G2919E878
16009f5413r7085B03195J1261b81613a9375j71479P4766A50105a99656A57452
15998a35463j12758g467r8528C8495J69288g4537q6022O6224b4120j54510F5871
15986a22708F4996c7508P149m71287c1960l7368j67577B70985i3645b71m49145
15975d49416i3538j51895A14251B7880P2343b73228A07230C9340b07705C34849
15964A30097L148A7613a92957g8484l8176D25696j61966o5911B0278J68392a21500
15952d10848B21585b98902C28417G8456b57359C628P970f8270o2560G138a22521
15940g8028A45016c76187a58642D3888b4027a014B43714o4164d70424J11651A53403
$$ y = [62986, 8367, 28875, 184373, 67459, -236058, 19908, -5760, 50227, 146199, -10744, 72919, 5878, -65413, -162498, 203195, 214456, -281613, -19375, -190854, -116088, 150105, -199656, 157452, -135463, -248221, -7467, -105995, 38495, 207783, -74537, -160559, -94335, -24120, -178630, 65871, -122708, 64996, -37508, -30359, -501646, -31960, -69328, -236905, 270985, -93645, -271, -449416, -93538, -245433, 114251, 27880, 100223, -273228, 107230, 39340, -207705, 334849, 130097, 133245, 17613, -192957, -78484, -116660, 425696, 263730, 197819, 20278, 188670, -121500, -410848, 221585, -298902, 328417, 78456, -257359, 3628, 11598, -68270, -130830, 7138, -122521, -78028, 145016, -376187, -158642, 43888, -24027, -1014, 243714, 179550, -470424, -358773, 153403]
15928H2353a93163r0611J35530J123m8216e3094o2836A73924A6833c2088k59189
15917b91277G3352e0154A88503i5079q6502a8533m5506k04942h8982n1075A5699
15905A33551J82942i3958j77333h4074Q718K8710F2988c38754A44255a43996o3300
15894b07296o6270a9427j17601A2017a1466k5562D2731g3182A2778J00138a72806
15882a60575F6463c7656k15114a06497j77419G810a6439n3681j57103f4472J2784
15871e1688o2160k45687J63987P2200A63716b21714M5234B3046P2315a19983e2584
15859b38958C1728j4452L7519b87559B95082A02857a08309B5940h8002j40054
15849b28056O7346f8821K6540B79362j32174a91122E9598a4199A00069a14083
$$ y = [82353, -193163, -283774, -148244, -147121, -195337, -53094, -115930, 173924, 16833, -32088, -291277, 73352, -50154, 188503, -95079, -181581, -18533, -64039, -268981, -88982, -140057, 15699, 133551, 316493, -93958, -271291, -84074, -75356, -46646, 62988, -338754, 144255, -143996, -207296, -273566, -19427, -137028, 12017, -11466, -37028, 42731, -73182, 12778, 112916, -172806, -160575, 66463, -37656, -252770, -106497, -283916, 7810, -16439, -70120, -227223, -64472, -51688, -113848, -359535, -195548, -123348, 163716, -221714, -176480, 23046, 95361, -119983, -52584, -238958, 31728, 17276, 54795, -287559, 295082, 102857, -108309, 25940, -88002, -228056, -160710, -68821, -42281, 279362, 147188, -191122, 59598, -14199, 100069, -114083]
15838b12529R8547q960A28187C1262a57756O9339F9614R9668q2594b75357C12321
15826A55626o8121C6349c11378i8984l3559B0698R0583k0381P9936a64814A50862
15814b33278j17848a26136c5672F5883b00580b5952k36034c115k08040I0150k2034
15803F8116k5294a75022D3271M18730A09651R0550a07570P481k07568L1055A6338
15791a41652M488a7920H0488b4185j38112i253A8200K8837j4470j0922Q3325a55053
15778i3548c5159j03544E5292c11855A9409a54287f2106j75751b1062p1199j14045
15767b06306A84919P6756a76024c0250E553e901A40950a24180d0529A09595b5838
15755e2977D1491b20343j61021h7845f02A93773a39226n7545C2115M3051l3866
$$ y = [-212529, -113982, -122942, 128187, 31262, -157756, -88417, 69614, 169282, 86688, -275357, 312321, 155626, 87505, 36349, -311378, -98984, -132543, 20698, 111281, 90900, 170836, -164814, 150862, -233278, -351126, -126136, -35672, 65883, -200580, -25952, -261986, -3115, -211155, 90150, 68116, 42822, -175022, 43271, 462001, 109651, 200201, -107570, -100089, -307657, -276602, 16338, -141652, -137164, -17920, 80488, -24185, -162297, -9253, 18200, 47037, 32567, 21645, 104970, -155053, -93548, -35159, -138703, 55292, -311855, 19409, -154287, -62106, -237857, -21062, -92261, -206306, 184919, 261675, -176024, -30250, 5553, -5901, 140950, -124180, -40529, 109595, -25838, -52977, 41491, -220343, -381364, -87845, -602, 193773, -139226, -196771, 32115, 75166, 41300]
15744D1300a28712a1853p1611k07292J31185A32132m9697i7144A78383a20633
15733A82515J5691e7663o0261A0409i1013j82051k0934d9945E56b60129J04354
15722a55775d9864m3449A527b42706A4316b35988a00879C26048j7135D764J5572
15711B0336J08454N874c3656j03471a6773j42091L3719N6469j58195N6961A16543
15699b27452B63343f5855A26115K251c3700l30616A29593d9321B14247g2143j60137
15688b32280D5473i154o2733p4189c0772l6327k13933p9437O1243F8333l2634
15677C5699J3002P0908L042a70952A51476g8988G3373h8049r2968k29770g2125
15665a28095l2041j06239B09960a31101i082j75905j2165h2653j44041A21368
$$ y = [41300, -128712, -11853, -83464, -290756, -159571, 132132, 82435, -97144, 178383, -120633, 182515, 198206, -57663, -117924, 10409, -91013, -273064, -293998, -49945, 556, -260129, -155775, -49864, -93313, 1527, -242706, 14316, -235988, -100879, 326048, 308913, 4764, 20336, 128790, 134664, -33656, -137127, -16773, -158864, -125145, -68676, -226871, -169910, 116543, -227452, 263343, -65855, 126115, 128366, -33700, -364316, 129593, -49321, 214247, -72143, -232280, 45473, -9154, -71887, -146076, -30772, -67099, -281032, -360469, -299226, 68333, 35699, 48701, 119609, 122651, -170952, 151476, -78988, 73373, -88049, -181017, -410787, -72125, -128095, -160136, -266375, 209960, -131101, -9082, -184987, -197152, -82653, -226694, 121368]
15654b42504B91198a7083A22644a39832j45348B60028a06453B08812B9280c00615
15643b26676f031m6883j88068P5443A146K82662A09279g7789A40032a38797E424
15631B81998a2466j14714c3307n4395B09429f875l5270A07500Q980Q7709g6359
15619c6978m18970B16528a09442K1525A58230b02094B37839b39900g6711G4420
15608a05946B46612b33645f8123l73128f3350k61560J47901G5042R9294Q1767
15598B56103F3706b84630A24256m0730a56146a6028A01468B5436b47058H5590
15587A46171c61344J73748f7343b0737C5600K59798d0579r9547A35719c7223d70
15575a69714A94467p6419k618d1977p3414L1958a61n234A11117a99719B5344J5489
$$ y = [-242504, 291198, -17083, 122644, -139832, -285180, 260028, -106453, 208812, 29280, -300615, -226676, -6031, -52914, -240982, -165539, 1146, 283808, 109279, -77789, 140032, -138797, 5424, 281998, -12466, -127180, -33307, -87702, 209429, -6875, -42145, 107500, 116480, 204189, -76359, -36978, -455948, 216528, -109442, -87917, 158230, -202094, 237839, -239900, -76711, 74420, -105946, 246612, -233645, -68123, -441251, -63350, -324910, -177009, 75042, 174336, 256103, 63706, -284630, 124256, 83526, -156146, -16028, 101468, 25436, -247058, 85590, 146171, -361344, -187596, -67343, -20737, 35600, 295398, -40579, -140126, 135719, -37223, -470, -169714, 194467, 118048, 115430, -41977, -115391, -83433, -161, -5395, 111117, -199719, 25344, 40833]
15563D0833K179M4728j6329i0332B7118c1219j31072C82140b08283f9688C3545
15551A82519e8723A20750M8577l5073a00021C5193c4823o9490L6016E3189f5246
15539C846J85765k6713d4504k5904k0148J8748G523a35152j8615A84820a36650
15527E15663G4017a09808E5928b83041f1075j05475C32003E6652a43039D8561
15516D0178A3407P72c06773B97622a72643N472L4149A63305G7801O6376b16773
15504C27201b98891i8021b440E965J70335c6831C30010c8695j91786R9389j42628
15493b73720a28475k90823g7853A28801J10835J19990d17253H8324J94075A0278
15482C4588J9985L69562b42198L6632i2236n5261l19999a63759A77254G7041a31463
$$ y = [40833, 43012, 87740, 71411, -90332, 27118, -31219, -162291, 382140, -208283, -69688, 33545, 182519, -58723, 120750, 169327, 134254, -100021, 35193, -34823, -104313, -68297, 53189, -65246, 3846, 189611, 162898, -44504, -70408, -90556, -71808, 7523, -135152, -153767, 184820, -136650, 515663, 74017, -109808, 55928, -283041, -61075, -166550, 332003, 56652, -143039, 48561, 40178, 13407, 14179, -306773, 297622, -172643, -167171, -133022, 163305, 77801, 144177, -216773, 327201, -298891, -98021, -2440, 5965, 176300, -36831, 330010, -38695, -230481, -131092, -273720, -128475, -419298, -77853, 128801, 239636, 359626, -417253, 88324, 282399, 10278, 34588, 54573, 424135, -242198, -205566, -92236, -147497, -467496, -163759, 177254, 77041, -131463]
15470a40294p6304Q0456f7880c3503n8523A54129b33096h1865A17350a59323A729
15458D9623j5695a94788q8321C5504b18442B21783J33860j8057b34791g4413k5223
15447i9636G920c02167A02144D9848a64595N9602f188A71186C2519a72116c0940
15435B37443a65938A13572i1894K2359I0521M4622a41156j20796r40A66639J8902
15424A85541b07792c8832A32907b62329q0559A99752D6771K81037E9518O5371
15414A24889J50150e8970a8881A2874d91254A07210L4464c7099D0358M0057h1683
15402A27666b08376A26330L6573K8018b57739A09073M02239a19110A29953D9847
15391A64133o6422a19841l04898a59398A13443b04452A15467m9885h9002B83517
$$ y = [-140294, -216598, -136142, -67880, -33503, -92026, 154129, -233096, -81865, 117350, -159323, 1729, 49623, 33928, -194788, -283109, 35504, -218442, 221783, 355643, 337586, -234791, -74413, -99636, 7920, -302167, 102144, 49848, -164595, -104993, -6188, 171186, 32519, -172116, -30940, 237443, -165938, 113572, -91894, -69535, 90521, 135143, -141156, -261952, -262892, 166639, 185541, -207792, -38832, 132907, -262329, -342888, 199752, 46771, 327808, 59518, 124889, 275039, -58970, -18881, 12874, -491254, 107210, 141674, -37099, 40358, 80415, -81683, 127666, -208376, 126330, 162903, 190921, -257739, 109073, 511312, -119110, 129953, 49847, 164133, 97711, -119841, -424739, -159398, 113443, -204452, 115467, 65582, -89002, 283517]
15380b89507H3623a17376H3403J8838a95077A76557M59776b50108A57358A644
15369D0194d8626l063B08241a8801E241L8425a50548B8312a99879B53486a43599
15357c72720A38296G496f3387l8452C8891L27741j82800j57g1622M420a6927B69275
15344A34781a27872A3297Q4636c39299E2593g7775c0675k17603B75850A32207
15333C32824a80121A43669J29299A12650e5633j14314k13809a87790d0506j14973
15323a55479B74157b460A75939h8813A2273a4115c354j28831K8984A04804d4725
15311D5034e2400H9906K9454C7657j0315J37794k5833o5706i3421G3687a57481
15299h9877c5611j65556j07455j1962A44980a34428C2503a06147A21818J27366
$$ y = [-289507, 83623, -117376, 83403, 102241, -195077, 176557, 636333, -250108, 157358, 1644, 40194, -48626, -51689, 208241, -18801, 5241, 43666, -150548, 28312, -199879, 253486, -143599, -372720, 138296, 7496, -63387, -101839, 38891, 366632, 183832, 183675, -71622, -67202, -16927, 269275, 134781, -127872, 13297, 97933, -339299, 52593, -77775, -30675, -248278, 275850, 132207, 332824, -180121, 143669, 272968, 112650, -55633, -169947, -383756, -187790, -40506, -155479, 274157, -2460, 175939, -88813, 12273, -14115, -3354, -132185, -103201, 104804, -44725, 45034, -52400, 89906, 119360, 37657, 27342, 165136, 139303, 73597, -93421, 73687, -157481, -89877, -35611, -201167, -308622, -320584, 144980, -134428, 32503, -106147, 121818, 249184]
15289B49184d240F850N746a69600F3953j2674i5527B03263a68843E0413K45901
15278B96314M1668g2887B9034M8208a0072I3537D1196b08926B47187n8080i7218
15266A08723K89766j77433A6770L8820k7489L39704N6657A6981J59770B7656O8873
15255I6529a61956f935j37065f348p3973j43465A21250N1614a09185B48953b42275
15243B41843I0427f8742E34609C1374K6348O9198g9724D61038P3172M61556N11653
15232A507419M028k24697J1966m76375l62145Q7405B12220i665H8970a31457m3056
15221a74513C22292j60471B7416K2031J51945f8247B6512b6645j39933A37662
15210A55910h9430M0364B45484D4160a9441C43886A33317a13145j5591B15484
$$ y = [249184, -4240, 6850, 12596, -169600, 63953, 51279, -95527, 203263, -168843, 50413, 296314, 337982, -72887, 29034, 77242, -10072, 93537, 41196, -208926, 247187, 189107, -97218, 108723, 398489, 221056, 16770, 55590, 28101, 367805, 424462, 16981, 176751, 27656, 96529, -161956, -6935, -144000, -6348, -80321, -223786, 121250, 172864, -109185, 248953, -242275, 241843, 90427, -68742, 534609, 31374, 57722, 126920, -79724, 461038, 534210, 995766, 1507419, 1511447, 1286750, 1298716, 822341, 460196, 547601, 212220, -9665, 88970, -131457, -174513, 322292, 161821, 27416, 49447, 201392, -68247, 26512, -26645, -166578, 137662, 155910, -89430, -49066, 245484, 44160, -19441, 343886, 133317, -113145, -128736, 215484]
15199c3340G6773i4420C36686g9761H7694B3611b0024b463j26344A44136j332
15188A42804A3670O9957J20679p664o1700f4355C25750E6799K9571F868e8881
15176A61019n0508m7215a48993A85858o8949J005e3292B14463g5472B66442E7619
15164C38942j34858q2625C4246K11487L2749L0692B1131i704B29750o6522a07040
15152B13415g1062l4488e0384A12393n3649f8090G8216Q8294o9482n374k4757
15141F6897J47208J93380A42833Q5232n3828n9412b01439A19350n6107f7853A91440
15129A24040K1392f6868B74311K37141F9943M60699E4316K63561i7596D36829
15118C33108Q301K20125C6427J78886F5617K68096A56233a93862A09907A1284
$$ y = [-33340, 76773, -94420, 336686, -79761, 87694, 23611, -20024, -2463, -128807, 144136, 142804, 13670, 83627, 204306, 196642, 134942, -64355, 325750, 56799, 86370, 6868, -58881, 161019, 110511, 63296, -148993, 185858, 116909, 117914, -53292, 214463, -75472, 266442, 57619, 338942, 204084, 121459, 34246, 245733, 278482, 309174, 21131, -9704, 229750, 163228, -107040, 213415, -71062, -105550, -50384, 112393, 58744, -68090, 78216, 166510, 97028, 91654, 66897, 214105, 407485, 142833, 228065, 174237, 114825, -201439, 119350, 63243, -67853, 191440, 124040, 145432, -66868, 274311, 511452, 69943, 530642, 54316, 317877, -97596, 436829, 333108, 341409, 561534, 36427, 215313, 65617, 333713, 156233, -193862, 109907, 11284]
15107a2924A85330L23407a90335I7526K0624A9478M0221j628o641O8832O5251
15096A85513M7398a05985A35123B4906m497M41485j10500B0682J90290A6457g0251
15084a23938f780k12026N7916E0148J23189O4278B6682K6977J66790G6035K43816
15073C19851A02792K16958j54014f7528B75412C1083a31909A0795b37983e4795
15062C04887a82702A78081J4245p6470a29156A93130m7347N6946I3690l7792J39035
15051A94933J2597g8827h11l81741G6906O152N04121B18969Q2385j20583P5642
15040B56413j5025p2614q514M26215A18726C9593M60923j76100A28330A4496L80481
15029C94977j95131M384n8562J0075b02076B99891G9299a49449B1991Q9918L05241
$$ y = [-12924, 185330, 508737, -190335, 97526, 118150, 19478, 59699, 58071, 51430, 120262, 185513, 232911, -105985, 135123, 24906, 20409, 461894, 351394, 20682, 210972, 16457, -70251, -123938, -6780, -218806, -160890, 50148, 173337, 237615, 26682, 53659, 220449, 76035, 319851, 102792, 319750, 165736, -67528, 275412, 31083, -131909, 10795, -237983, -54795, 304887, -182702, 178081, 192326, 115856, -129156, 193130, 145783, 202729, 93690, 55898, 194933, 207530, -78827, -811, -382552, 76906, 83058, 587179, 218969, 301354, 180771, 256413, 241388, 168774, 160260, 586475, 118726, 39593, 500516, 324416, 128330, 14496, 394977, 199846, 204230, 145668, 155743, -202076, 299891, 79299, -149449, 21991, 111909, 417150]
15018D17150j56011e3065C02476k9851A20531L05520B6923M30071A13739K12068
15008C25807N7595B6350d3791D34675B03942L6424C9785d6691D62282r3090j44231
14997B24961K09058j61415p0420o8049l297J20895J77654b93536A93234D0293
14986B14386L72813a57950C04628h9108B53806I7552J02291a05691G3051K5297
14976I8348K68269p7911b2709D59643r0136r7110N1509a5000D46806A12726b8385
14964C37874j51708M9724D7134K22032Q9480p709A74144q5781P4397p6000J65929
14953B52689m4849m313K01837j55055J12760J25345r8771A05284L27256j71453
14943B61087K49415I6736K59906q9217j00395o3638R7151Q6085L0721J44125A08342
$$ y = [417150, 261139, -53065, 302476, 272625, 120531, 426051, 26923, 456994, 113739, 325807, 383402, 26350, -43791, 434675, 203942, 240366, 39785, -46691, 462282, 369192, 224961, 434019, 272604, 202184, 134135, 130838, 251733, 429387, -293536, 193234, 40293, 214386, 587199, -157950, 304628, -89108, 253806, 97552, 199843, -105691, 73051, 98348, 366617, 288706, -22709, 459643, 369507, 272397, 323906, -15000, 446806, 112726, -28385, 337874, 186166, 235890, 47134, 269166, 358646, 350937, 174144, 88363, 162760, 86760, 252689, 207840, 203527, 405364, 250309, 363069, 488414, 389643, 105284, 432540, 261087, 510502, 96736, 356642, 267425, 167030, 103392, 200543, 286628, 317349, 461474, 108342]
14931B17411J32776b29131C70668O5154A61506K64669l7987G0119J44519E0377
14920C27021n6530K12317a2818C83480J8911k6640n438A61857L6692K28384J36858
14909E63791k71746K8956K32887j37789A83814J73729j14824l8220l4607J15383
14899B85275N6980G4028N74375k47240r0786M7999R8360q8233j34394a0563A20204
14887E49254p6092l6472J92831B00361J92582j46391i8378C79270J6823J60436
14877E56529J01883B67406K54720k53633J03112M06720A49797Q5660J69507A84511
14866H10331k54278j15911o7926j34396k5275L35766N667j68345J22208k21811
14856B86030J93984M6920k57493N8982r6212P740J12213K8460m1475J345N8181
$$ y = [217411, 350187, -229131, 370668, 435822, 161506, 426175, 388188, 70119, 214638, 50377, 327021, 270491, 482808, -12818, 383480, 402391, 375751, 370313, 161857, 198549, 426933, 563791, 292045, 321001, 553888, 416099, 183814, 357543, 242719, 204499, 169892, 285275, 342255, 74028, 648403, 401163, 310377, 358376, 456736, 368503, 234109, -10563, 120204, 549254, 473162, 436690, 629521, 200361, 392943, 246552, -98378, 379270, 396093, 556529, 658412, 267406, 522126, 268493, 371605, 778325, 149797, 235457, 404964, 184511, 810331, 556053, 440142, 372216, 237820, 212545, 548311, 553978, 385633, 507841, 286030, 480014, 526934, 269441, 328423, 232211, 239951, 352164, 380624, 339149, 340494, 398675]
14845C98675J03002A46606O25681l18308j64796P9917J34862B43483J52411p7650
14835C18244Q9752K96539k97940Q3993K3948H8572N7918J08429K10787j76423
14825B89283L23147o5997B20240N85686A98904L69473n3772l5439l2401J74035
14815F20800l2569J46820o8455j26082k21412K6788J55335E9787N88450j08036
14805E40201j12765O5996K90234k30346M0714M4219n9644r8586j9592J70919k40264
14794C91086Q8458B8523N03993n4008K00511k53648n6216m935J10771p3452J75679
14783E77218k25842J9106J19439J94934j10037m2981p9246k5305J23122J16964
14773F67372j40042P530K54024O3814p1079j92603j36300J36141L986n0293K03346
$$ y = [398675, 501677, 146606, 772287, 453979, 289183, 369100, 503962, 243483, 395894, 318244, 407996, 704535, 406595, 490588, 514536, 88572, 146490, 254919, 465706, 289283, 612430, 546433, 220240, 805926, 198904, 568377, 514605, 479166, 446765, 620800, 588231, 735051, 666596, 540514, 319102, 345890, 501225, 59787, 648237, 540201, 427436, 493432, 783666, 553320, 594034, 638253, 578609, 480023, 460431, 631350, 391086, 479544, 28523, 532516, 478508, 679019, 425371, 369155, 364220, 474991, 401539, 577218, 351376, 370482, 489921, 684855, 574818, 531837, 452591, 427286, 550408, 667372, 527330, 534860, 788884, 852698, 781619, 589016, 452716, 588857, 592843, 542550, 745896]
14762G45896j72088P2102J72826j78488O4000M3686k06527L5952j6993L93898
14752I54264k57923l05275K64167k02290L05252j47881k24025J42692K65180r4809
14742F99352J37819q8159k47565L64579j93052k10323J55464K58933j04595k44322
14732E28131K00739q0925j99507M83621N0877j16863k61626L39781J15451k59447
14722H00232m2627r7517K14672L0726k18564R3071k08742J43583K40997o3332
14712H92499k12986Q8319K93281m63606M11041j76686r7941j62671J92870j86743
14702E77377J44311J09433J45518n7083P228M7013C71228L80613J16688L66588
14692A235117l08423J59491k3569n2914l43797j22393L50222J84629J66895E80950
$$ y = [745896, 573808, 645910, 818736, 640248, 704248, 747934, 541407, 577359, 560366, 954264, 696341, 391066, 655233, 452943, 758195, 610314, 386289, 528981, 794161, 699352, 837171, 749012, 501447, 866026, 672974, 462651, 618115, 877048, 772453, 528131, 728870, 647945, 448438, 932059, 982936, 866073, 604447, 944228, 1059679, 800232, 757605, 660088, 874760, 905486, 686922, 779993, 571251, 714834, 955831, 892499, 679513, 767832, 1061113, 597507, 1008548, 831862, 733921, 571250, 764120, 577377, 721688, 831121, 976639, 919556, 926784, 973797, 371228, 751841, 868529, 1235117, 926694, 1086185, 1062616, 1009702, 665905, 543512, 893734, 1078363, 1245258, 580950]
14681A041438j13585k12920M15344m06984K94315p1800J7157k6483r0356K95181
14671A141307k47733n4641L63376E99683L98199L7178m30859J83760K86576j74115
14661I00422j12126j98309M12881M8625J69922l32304M1792M702J68706O9263
14651A173574J80515m99820L00762k36k37258J21782J94396m8612P5876m67444
14641G93535O89403l58251j34635J35262P7928k02858L9806K58070l43418L01892
14631A256734r5482L02716l46659J08544J72133j62932k0509J70293N2503n0011
14621A387330N0785J08615j6980P6623n7042k28683K12591k18481j32496K23913
14611A406175j22987J03385L33325k91817L0514q7719l2130l866K48731j71353
$$ y = [1041438, 927853, 714933, 1130277, 723293, 1017608, 945808, 962965, 936482, 846126, 1141307, 893574, 838933, 1202309, 599683, 997882, 1035060, 604201, 787961, 1074537, 900422, 788296, 589987, 1002868, 1051493, 1221415, 889111, 930903, 935605, 1104311, 1173574, 1354089, 854269, 1155031, 1154795, 917537, 1039319, 1233715, 1185103, 1260979, 793535, 1482938, 1124687, 990052, 1125314, 1203242, 1000384, 1040190, 1298260, 954842, 1256734, 1161252, 1463968, 1117309, 1225853, 1397986, 1235054, 1214545, 1384838, 1437341, 1387330, 1438115, 1546730, 1529750, 1606373, 1549331, 1320648, 1533239, 1314758, 1182262, 1406175, 1283188, 1386573, 1719898, 1428081, 1458595, 1370876, 1338746, 1334880, 1583611, 1412258]
14601A412258l76467P57679l03089j44192M01364j58442j58297J74942j47547
14592A458209J83451J30736j22970P4826j62836K7539L50835q7710j08406m09734
14582A333940N68942n8206j02416L4954K64464M7721l72866J59642Q1850K00586
14572B158611l27477O9695R1165o9889l5414O2800J27900l3893O0751j37619K59872
14561B226502K00824l58243J61370o1148M3150M56990J03718k84380j09405N2314
14551B431692K83674j86472L50840K35959n7368l26096N30555J2602K94939j17143
14541C453182N46615J42455L64699O12870R90193O36582J256263K377232M411009
14532A4791100N723729R053981j177275q650499p002792m257135k504626j541469
$$ y = [1412258, 1035791, 1793470, 1490381, 1346189, 1747553, 1589111, 1430814, 1605756, 1458209, 1641660, 1772396, 1649426, 1724252, 1561416, 1588955, 1939790, 1852080, 1743674, 1333940, 1902882, 1844676, 1742260, 1777214, 2041678, 2089399, 1716533, 1876175, 1958025, 2158611, 1831134, 1900829, 1991994, 1922105, 1886691, 1949491, 2077391, 2043498, 2104249, 1966630, 2226502, 2427326, 2069083, 2230453, 2169305, 2212455, 2669445, 2773163, 2488783, 2379378, 2431692, 2715366, 2528894, 2879734, 3115693, 3058325, 2732229, 3262784, 3275386, 3570325, 3453182, 3999797, 4142252, 4506951, 5119821, 6110014, 6746596, 8002859, 10380091, 14791100, 20514829, 29568810, 28391535, 19741036, 12738244, 8481109, 5976483, 4435014]
14524D435014n52269l95310l54893l76156j12103j73048l4207L42269o5842k41402
14514B472053j34371j35186M66566r4918K46981k34740j05136l3308K13966L6531
14504B698438l3912j64440L18646k33190J19437L1762J08908L55968O6262l28928
14494B938951k5846j31039O19592r9413j69726M5323O328n1465L79562m28246
14484C084021L71371J87714j59869m2586J94754j26555P44325p36059K00470k89656
14474C427930M21350J14115m37120L49511J18417p5953J97582J4333r6437j10986
14464C922742O39728m90863Q2896K84992j22871K00923r883J61915k03732j43153
14454D322694K63269J74661j41166O7955L7937J46623l561J58858l3677L60210
$$ y = [4435014, 3882745, 3487435, 3132542, 2756386, 2644283, 2471235, 2437028, 2779297, 2713455, 2472053, 2337682, 2202496, 2669062, 2574144, 2821125, 2586385, 2481249, 2447941, 2661907, 2698438, 2664526, 2500086, 2818732, 2585542, 2704979, 2736741, 2845649, 3201617, 3267879, 2938951, 2913105, 2782066, 3401658, 3302245, 3132519, 3177842, 3184170, 3132705, 3512267, 3084021, 3455392, 3643106, 3483237, 3440651, 3635405, 3508850, 4253175, 3517116, 3717586, 3427930, 3849280, 3963395, 3526275, 3875786, 3994203, 3918250, 4115832, 4130165, 4033728, 3922742, 4562470, 4071607, 4154503, 4439495, 4316624, 4517547, 4507664, 4669579, 4465847, 4322694, 4585963, 4760624, 4619458, 4687413, 4725350, 4871973, 4868412, 5027270, 4993593, 5353803]
14444E353803j27255K72272j02607N4826k45504J21432K16376J56222o1876j76243
14434E461446J80638N9095L03021J10927J3837j8254k02K38482J11457L873k37329
14423F226991L03978K09311P7884K85206j53276k35341M95023L68931K134k9913
14413G550928m749K61847k8989K55039K23868k98355L08629L03002J08917k16921
14403H463216J55368M71635M4010J36162l33992O51640k20814M09206O2101K6511
14393I865043O8769K13853N9380K17588Q3425M62133K56957j03312k21108P23395
14383A1626123o8257K32283L52044L24152r8161L12934L89864J34445J17297J75256
14373A3497980K16636L32901K19712L68553l4666P65046J03028Q7979L35806L6888
$$ y = [5353803, 5226548, 5498820, 5396213, 5451039, 5205535, 5326967, 5543343, 5699565, 5637689, 5461446, 5642084, 5701179, 6004200, 6115127, 6128964, 6110710, 6110508, 6348990, 6460447, 6464320, 6226991, 6530969, 6740280, 6818164, 7103370, 6950094, 6714753, 7209776, 7578707, 7580841, 7550928, 7546179, 7808026, 7779037, 8034076, 8257944, 7959589, 8268218, 8571220, 8680137, 8463216, 8618584, 9090219, 9134229, 9270391, 8936399, 9588039, 9367225, 9776431, 9838532, 9865043, 9933812, 10147665, 10207045, 10424633, 10508058, 10970191, 11227148, 11123836, 10902728, 11626123, 11557866, 11790149, 12142193, 12466345, 12368184, 12681118, 13070982, 13205427, 13322724, 13497980, 13714616, 14047517, 14267229, 14635782, 14601116, 15366162, 15469190, 15557169, 15892975, 15929863]
14363A5929863Q30992Q2278M67415m1252P89146O35695j84267L10914P04705K60473
14353A9785962L26969O03973L74674K25356M55686L46250P58434M23640O54778
14344B3955722K02634N21678R73440L25938P43028L03363Q39299N31344P42070
14335B9138516J061832O37575N56890O77375Q36904Q61737J127171Q23464P91577
14326C6513041J302391Q66615J097229J167347J055399J435365J007685J359148
14318D5804220J210229J613429J586182J304864J768346J770687J591724J814883
14310E8464564J969781K137116K268277K149772K400450K195302K567198K779544
14302G6932004K736317K950422L407684L229080L217686L663724L995598L905873
$$ y = [15929863, 16760855, 16843133, 17310548, 17269296, 18058442, 18694137, 18509870, 18820784, 19525489, 19785962, 20112931, 20716904, 21091578, 21316934, 21772620, 22118870, 22877304, 23300944, 23955722, 24158356, 24680034, 25653474, 25979412, 26722440, 27025803, 27865102, 28396446, 29138516, 30200348, 30837923, 31394813, 32072188, 32909092, 33770829, 34898000, 35721464, 36513041, 37815432, 38682047, 39779276, 40946623, 42002022, 43437387, 44445072, 45804220, 47014449, 48627878, 50214060, 51518924, 53287270, 55057957, 56649681, 58464564, 60434345, 62571461, 64839738, 66989510, 69389960, 71585262, 74152460, 76932004, 79668321, 82618743, 86026427, 89255507, 92473193, 96136917, 100132515, 104038388]
14294A04038388M196740M493719M986686N042138N067948N303161O090857O050630
14286A45270267O857787O788017P379776P588451P828225Q727260R124460R225937
14278B08790180J0246701J0450811J1235755J1619030J1862252J2614326J2724605
14271B89543660J3101592J3209132J2935086J2747496J2802390J2557598J1980289
14264C78877243J1477957J0452829J0271678R270039Q999808P833861N821555
14257D43004970K892441K024157J933573k178487m971964m601819o108801p094148
14249D24899922q529306r884112j0830647j2445062j2665200j2396539j3168742
14242C44980314j3499532j2947295j3714645j2260192j3077006j2821661j2569114
$$ y = [104038388, 108235128, 112728847, 117715533, 122757671, 127825619, 133128780, 139219637, 145270267, 152128054, 158916071, 166295847, 173884298, 181712523, 190439783, 199564243, 208790180, 219036881, 229487692, 240723447, 252342477, 264204729, 276819055, 289543660, 302645252, 315854384, 328789470, 341536966, 354339356, 366896954, 378877243, 390355200, 400808029, 411079707, 420349746, 429349554, 437183415, 443004970, 445897411, 447921568, 449855141, 447676654, 442704690, 438102871, 431994070, 424899922, 416370616, 406486504, 395655857, 383210795, 370545595, 358149056, 344980314, 331480782, 318533487, 304818842, 292558650, 279481644, 266659983, 254090869]
14235B54090869j2042736j1853957j1375773j0733447j0697566r501285r029726
14228A78856379q177642q263166p695041o931154o559055o354020n741072n679368
14220A23455861n271325m898501m471536m337316m152694l797724m037342l609738
14212H8879685l149987l438502l125436k631677k801174k877692j991232k214720
14204F6649265k627910k060748k146082j746658j735371j493968j689729j679515
14196E1469284j505924j436011j545725j323743r40069j438047j329395j118698
14188D0831672j043133j193137j207674n88901j355504m92168j017549r59942
14180C2973664p81108r09543o89399o57649o85040p51612q57544l72601p72319
$$ y = [254090869, 242048133, 230194176, 218818403, 208084956, 197387390, 187886105, 178856379, 170678737, 162415571, 154720530, 147789376, 141230321, 134876301, 129135229, 123455861, 118184536, 113286035, 108814499, 104477183, 100324489, 96526765, 92489423, 88879685, 85729698, 82291196, 79165760, 76534083, 73732909, 70855217, 68863985, 66649265, 64021355, 61960607, 59814525, 58067867, 56332496, 54838528, 53148799, 51469284, 49963360, 48527349, 46981624, 45657881, 44717812, 43279765, 41950370, 40831672, 39788539, 38595402, 37387728, 36798827, 35443323, 34951155, 33933606, 32973664, 32192556, 31283013, 30593614, 29935965, 29250925, 28499313, 27641769, 27269168, 26496849]
14171B6496849m30547q87169l45361l83912o63358o79576j62358o81812n59128
14162B1703628m17638K4674n85458o80964k67442p09808k15543j20718o32921
14153A8097810m00222m48798K25688j007870K9212r9293k05936n27053j69232
14144A5494306k92324m07341k60840k2462o66009N0121m08541l49146M6989l09877
14134A2874876k0639k53408k39012l61885J54530l04062m01654j31513p4533n04697
14124A0738003K13738l36039N1403j70725m08188L35788j54473n17823j87861
14115I563823J12846k57022j9006j27914q2245m61438k2793J39810m75689o5967
14105H304405L30446k46894k29890j37687N5732k97987j75379J05567k03272r4523
$$ y = [26496849, 26066302, 25179133, 24833772, 24449860, 23786502, 23106926, 22944568, 22262756, 21703628, 21285990, 21310664, 20725206, 20044242, 19776800, 19066992, 18851449, 18730731, 18097810, 17697588, 17248790, 17474478, 16466608, 16495820, 16396527, 16190591, 15663538, 15494306, 15201982, 14794641, 14533801, 14511339, 13845330, 13895451, 13486910, 13137764, 13184753, 12874876, 12854237, 12600829, 12361817, 11999932, 12154462, 11850400, 11448746, 11317233, 11242700, 10738003, 10951741, 10615702, 10667105, 10496380, 10088192, 10423980, 10269507, 9751684, 9563823, 9676669, 9419647, 9400641, 9272727, 9190482, 8729044, 8706251, 8846061, 8370372, 8304405, 8634851, 8387957, 8158067, 8020380, 8076112, 7778125, 7602746, 7708313, 7505041, 7410518]
14095G410518j63409j86534L9432Q181j48952k98771J8650J81488m06536J06357
14085F560424j15329j66861M8880k90184J86250J2294l71701L19625l07784o9745
14075E805869k75792J82082J31904k78927p0263j93014K01309m7933n87209N17629
14065E385655k80230J23193J15284k09578j00995n5568L0567l54391L70476k53760
14055D770653J97643l62340Q5758N4887k21047k59716L46314k34310J32333k61993
14045D248182J02254k8687K4375m99207L46248M5345k00967m86493M58049q8812
14035C920287k44687K09476l51875K74610j99787Q3907J12164m1386j39523L4752
14025C657938j79431J06386l24073J14314l5530R2463l30091J51156J55632K6576
$$ y = [7410518, 7247109, 7060575, 7100007, 7108188, 6959236, 6660465, 6679115, 6860603, 6454067, 6560424, 6445095, 6278234, 6327114, 6036930, 6223180, 6235474, 5863773, 6183398, 5875614, 5805869, 5530077, 5712159, 5844063, 5565136, 5494873, 5301859, 5503168, 5455235, 4868026, 5385655, 5105425, 5228618, 5343902, 5134324, 5033329, 4977761, 5008328, 4653937, 5024413, 4770653, 4968296, 4605956, 4691714, 4746601, 4525554, 4265838, 4612152, 4377842, 4510175, 4248182, 4350436, 4321749, 4346124, 3846917, 4193165, 4238510, 4037543, 3551050, 4009099, 3920287, 3675600, 3885076, 3533201, 3807811, 3608024, 3691931, 3804095, 3762709, 3623186, 3657938, 3478507, 3584893, 3260820, 3375134, 3339604, 3432067, 3101976, 3253132, 3408764, 3435340]
14015C435340o7955m8825l26277N20421l35712R778J00865l20430N5218n48588
14005B473835L70277k43743J92210j8524M3284R8219M5023m39271o2433L5665
13995B494542J33436j1368j31508R9950K0541k4428k58854q9359M05123k67515
13985B370560L73354l0932J80487l82926L13919j58114L26616K97023K98876N73413
13975D162276R56729J606739L638185N622465R923904K955477p817290o447622
13967A4600863m013546k495883j418186j272839p82427n04719l24840K57410m37660
13958C608173k17901k16339q1517k94153R2200k69292K31005j61259m546l87066
13948B299305M13499l88479K7431k35692K20071k03714K88161k00441J87065j2370
$$ y = [3435340, 3367385, 3318560, 2992283, 3512704, 3176992, 3186770, 3287635, 2967205, 3022423, 2473835, 2844112, 2600369, 2792579, 2774055, 2817339, 2915558, 2960581, 2521310, 2458877, 2494542, 2627978, 2616610, 2485102, 2585052, 2605593, 2581165, 2322311, 2232952, 2638075, 2370560, 2743914, 2712982, 2893469, 2510543, 2824462, 2666348, 2992964, 3289987, 3588863, 4162276, 5119005, 6725744, 10363929, 15986394, 25910298, 28865775, 21048485, 14600863, 10587317, 8091434, 6673248, 5400409, 4617982, 4113263, 3788423, 4045833, 3608173, 3390272, 3173933, 3092416, 2798263, 2890463, 2621171, 2852176, 2690917, 2686371, 2299305, 2712804, 2324325, 2351756, 2116064, 2336135, 2132421, 2420582, 2220141, 2407206, 2394836]
13938B394836l34130K7678L16570J64663q05053P6502K56818j45736j46084P7281
13928A883345M01498o90567M35017k13589p650j49840O5258K16826r1146j30946
13918A718206J45930J2197j94892J13241J70374J2124j47896m24998M18965k11224
13908A612027O6413r3379j92409M63792m0249j75346J56785O011p4084k06959
13898A522602j11916L01004J05665l30608k5484L26948m87914J47947q88K02960
13888A650316k92k91396J72630o7651J17705K40657n29822R0865M6079p7104M09908
13877A761895n03554J0331K09418k04576L2811j6010K74371k78469j830J25800
13867A410187J36185l67622k42K82846l00257n886j8449l72376L23654K76658
$$ y = [2394836, 2060706, 2088384, 2404954, 2569617, 1764564, 1841066, 2097884, 1952148, 1806064, 1883345, 2284843, 1594276, 2029293, 1815704, 1808054, 1658214, 1723472, 1940298, 1849152, 1718206, 1864136, 1876333, 1681441, 1794682, 1965056, 1977180, 1829284, 1404286, 1823251, 1612027, 1678440, 1585061, 1392652, 1856444, 1816195, 1640849, 1797634, 1803645, 1729561, 1522602, 1410686, 1711690, 1817355, 1486747, 1461263, 1788211, 1300297, 1448244, 1447356, 1650316, 1650024, 1358628, 1531258, 1463607, 1581312, 1821969, 1292147, 1383012, 1429091, 1351987, 1761895, 1258341, 1268672, 1478090, 1273514, 1306325, 1290315, 1564686, 1286217, 1284387, 1410187, 1546372, 1178750, 1178508, 1461354, 1161097, 1155211, 1136762, 764386, 1088040, 1364698]
13857A364698M7424j74179r4983J25300J68762j77075k11254M0741m5588P9504
13847A123350Q5127R4632j41346J99653k52289J45708o4798J24552k76009K56159
13837A294739R3135m72324J84400J41169p500O7534l09154k5787M2932Q7974K90552
13826A387670n69175Q8668J14168J02891k21691J03625K43600l02961J77181l4326
13816A089650K04238k25868j58216J11274l4061R7335j10937N917L84584n66437
13806G97479J85972K21888n17175K4634L1181K77442j6451k27361K49302o1807
13796I65104j47101J97697j91437r1175J74527l36784N28978j93433K33551l2848
13786A107079m76969j07065K51559K90640k42626p6214C39027Q36105k79550l5244
$$ y = [1364698, 1412122, 1237943, 1142960, 1268260, 1437022, 1259947, 1048693, 1089434, 1043846, 1123350, 1208477, 1303109, 1161763, 1361416, 1109127, 1254835, 1190037, 1314589, 1038580, 1294739, 1387874, 915550, 1099950, 1241119, 1233619, 1301153, 991999, 966212, 1009144, 1097118, 1387670, 818495, 907163, 1021331, 1124222, 902531, 1006156, 1249756, 946795, 1123976, 1089650, 1293888, 1068020, 909804, 1021078, 987017, 1084352, 973415, 979332, 1363916, 797479, 983451, 1205339, 688164, 712798, 743979, 1021421, 1004970, 777609, 1026911, 965104, 818003, 1015700, 824263, 733088, 907615, 570831, 1099809, 906376, 1139927, 1107079, 630110, 523045, 774604, 1065244, 822618, 746404, 339027, 1175132, 895582, 860338]
13776H60338r0385K29050l76024O28914E82853K07565k07102J66177J6871k36867
13766E29497K49655l5560k42606J85152M08522l05799j52018L66395k45430K76
13756G58084p1860Q6968m3310k164K07625K8807o7232k21352j06951J22L4596
13745F03333K94854j06192o1602j19551K20295k63800J79475M7865j58026r6931
13735E39720K24047k3141k59970L62833j08551M7317k40949O479R9910N1802K2355
13724G21852o1127n0299R2086N1726l21742L6299M6734j62130L36503J0762P2241
13713G72905j12265k61633K53290M8664J59219m04350K74156r810J82405l64921
13703E37660k64585K69863j52056M0623J50313N0205J13261n844r0814j28810
$$ y = [860338, 769953, 999003, 622979, 1251893, 582853, 790418, 583316, 749493, 766364, 529497, 779152, 743592, 500986, 686138, 1094660, 788861, 636843, 1003238, 757808, 758084, 686224, 773192, 729882, 727718, 935343, 964150, 896918, 675566, 568615, 568737, 603333, 898187, 791995, 730393, 610842, 831137, 567337, 746812, 794677, 636651, 539720, 763767, 740626, 480656, 843489, 734938, 782255, 541306, 547785, 647695, 699497, 721852, 660725, 610426, 702512, 754238, 432496, 468795, 515529, 353399, 689902, 700664, 772905, 660640, 399007, 652297, 700961, 860180, 455830, 729986, 720176, 902581, 537660, 273075, 542938, 390882, 431505, 581818, 632023, 745284, 739440, 648626, 519816]
13693E19816J00732k12449M8468K18593J02568L0274C58479J68394j58673K44157
13683F12357k36292K93768B75311M93941q9700O3202J60511l96611A15054O11532
13673G26586J8928k86185K97499j91786n2611Q9801n9278K24890p134k44971N7534
13662E73273m0718o6566r6059K25484L3173j06016J79398k91741n1476K77101
13652F35853k72290J52049J66035j57758j26045N61485l29788K0680m5461r2598
13642E12162A96731M19987j81752j23742K20313r6737K07136k54032r8521J20494
13632D09877J27194k09527j3044J2124J12849K06264j22442B08148N12779j0776
13622G10151l32864O7935j55589R4022J22792k9955A46387K67443L0231A09337
$$ y = [519816, 620548, 408099, 456567, 675160, 777728, 808002, 358479, 526873, 368200, 612357, 376065, 669833, 275311, 769252, 679552, 742754, 903265, 506654, 115054, 726586, 745514, 459329, 756828, 565042, 512431, 602232, 542954, 767844, 760710, 515739, 573273, 532555, 465989, 369930, 595414, 628587, 522571, 701969, 410228, 358752, 635853, 363563, 515612, 681647, 523889, 397844, 959329, 629541, 650221, 604760, 512162, 196731, 616718, 434966, 311224, 531537, 434800, 641936, 387904, 289383, 409877, 537071, 327544, 314500, 326624, 439473, 645737, 523295, 208148, 720927, 710151, 377287, 445222, 289633, 383655, 506447, 476492, 146387, 413830, 444061, 109337]
13611E81462B54733J16604J04695j00637A73201R9651M8197K64478q8362j76781
13601C20384L37135j60172K4347L3759j31826K6132m318j61120K30182r4784k5257
13590C94462L0379n7758o9926j12120K78807J618m6009L6969n4037J99716k54059
13579C48042j23440R7818J76455J08776j57209N4289r0907P6111k20352L59415
13569F28998k17144o6323p324P2239c5615D42417j7525L08409B46162K04441K1572
13558D72175k5534j01680L00649C20819J28071n6244M018k770J27554A83904J3831
13547A97735J03746g8335A70971K99070n1228i628E61230o7642B22342K91868
13537E14210k35181K1504K34257j83273J66841B24847J91109j3713r5129R6584
$$ y = [581462, 254733, 371337, 476032, 375395, 173201, 272852, 321049, 585527, 497165, 320384, 657519, 497347, 521694, 555453, 423627, 449759, 445441, 284321, 514503, 419719, 394462, 424841, 367083, 297157, 185037, 463844, 465462, 419453, 456422, 402385, 602101, 348042, 224602, 322420, 498875, 607651, 450442, 504731, 413824, 489935, 269583, 628998, 411854, 345531, 338207, 410446, -35615, 442417, 424892, 733301, 246162, 450603, 472175, 446641, 344961, 645610, 320819, 448890, 392646, 396664, 393894, 521448, 183904, 197735, 301481, -78335, 170971, 470041, 418813, -9628, 561230, 493588, 222342, 514210, 279029, 300533, 534790, 351517, 518358, 224847, 415956, 402243, 307114, 403698]
13527D03698J47678q5855B06297J26860N4346J48636n0266J07816k60105M8844
13517C82428J51211j3142B0710M68904p3543A53263J73832q5883P386K7202i2494
13505B28743O3240N6949A17432L77616k14632L14040B06208K24107A44132M59804
13495F03936E8945K44885K820J05830K61955k22228B789L19035K415L7655j365
13484C60529A17635O6642O8137C233L74512A80964K27012P181J6715A59700J29352
13473B89052J79912J13190k51096J10692j5300p4418c2481A80214C3947J63380
13463A97327J27636o6613b9928A39892K13126q3007o1534r5199K35405A14442
13452C59615j59748b4714B12737N2024D1490M52977A99154J61383J428n037j18262
$$ y = [403698, 551376, 465521, 206297, 333157, 387503, 536139, 485873, 593689, 333584, 382428, 533639, 520497, 20710, 489614, 416071, 153263, 327095, 241212, 248598, 275800, -92494, 228743, 291983, 348932, 117432, 495048, 280416, 594456, 206208, 430315, 144132, 603936, 58945, 303830, 306650, 412480, 674435, 452207, 2789, 321824, 324239, 361894, 360529, 117635, 184277, 252414, 3233, 377745, 180964, 407976, 415157, 431872, 159700, 289052, 468964, 582154, 331058, 441750, 426450, 352032, -32481, 180214, 33947, 197327, 324963, 258350, -29928, 139892, 353018, 270011, 208477, 113278, 348683, 114442, 359615, 199867, -24714, 212737, 264761, 41490, 494467, 199154, 360537, 361965, 356928, 238666]
13441B38666L9773J1548K01911k08493B8569L62483C8759a15030B78749k5665
13431B53084n2653N55048k14121B16567J58834g8497C63690J66345r6329B09624
13420E29734n3824B02573b80113A80070D3890J47561M15879B08873C9492K11872
13410B51364K30824A00761J40476j14328O1597r19c4960C73318A7105N80079A11113
13398B07878I0614J54402J58944F1115J68680r9658O3482q0246Q4539P3530c8303
13386A67031o8860M2273N02328k62056A19990J64642R3655j83268O038a1280F3428
13374B05538n3861n4750J37509J56312j18749j7073P6316c3029B94719C1659J06967
13363A38626D4201Q8577J31628L7711K58117B03542K04382A44777i5305C31161
$$ y = [238666, 278439, 289987, 491898, 283405, 28569, 391052, 38759, -115030, 278749, 253084, 200431, 755479, 541358, 216567, 375401, -78497, 363690, 530035, 433706, 209624, 529734, 475910, 202573, -280113, 180070, 43890, 191451, 607330, 208873, 39492, 251364, 482188, 100761, 241237, 126909, 188506, 187587, -34960, 373318, 17105, 597184, 111113, 207878, 90614, 245016, 403960, 61115, 229795, 130137, 193619, 113373, 197912, 271442, -38303, 167031, 98171, 140444, 642772, 380716, 119990, 284632, 378287, 195019, 201057, -11280, 63428, 205538, 151677, 96927, 234436, 390748, 271999, 254926, 331242, -33029, 294719, 31659, 138626, 44201, 132778, 264406, 302117, 560234, 203542, 407924, 144777, -95305, 331161]
13352B33368O3555j12610R5705a76691A24733a9944B24541I6001K47380J40454
13342D83835D9331h9265A0838J83404J6394c2464j11869G1094K74928A12782M00353
13331E13135Q8588B08349P1976L2580J9725j06058L4475J49656K02907k46617
13321C66993A16453D8694K75649A14153N855M7873J95632b46871B88187L4020
13311C22207j32113P9808m6168R6138A17772K52415j79910J7578K43330J66968
13301F18153B89859A36323h8482B69926Q0319g1552B93596I641M37418H2581k2763
13290E9818P6830J4792M1672o0247a51800B56517f8905I2824a05779C40289A19047
13278G9180l5562J84744e8351B10793I0185P5545Q2261d5463A84893n3529j4597
$$ y = [233368, 296923, 184313, 280018, -176691, 124733, -19944, 224541, 96001, 343381, 483835, 49331, -89265, 10838, 194242, 210636, -32464, -144333, 71094, 346022, 112782, 513135, 601723, 208349, 280325, 312905, 332630, 226572, 261047, 410703, 613610, 366993, 116453, 48694, 324343, 114153, 120008, 167881, 363513, -246871, 288187, 322207, 190094, 269902, 223734, 319872, 117772, 370187, 190277, 207855, 451185, 618153, 289859, 136323, -88482, 269926, 350245, -71552, 293596, 9641, 447059, 82581, 59818, 136648, 151440, 193112, 132865, -151800, 256517, -68905, 92824, -105779, 340289, 119047, 79180, 43618, 228362, -58351, 210793, 90185, 165730, 247991, -45463, 184893, 131364, 116767]
13267A16767J1394k2917m5700c2609B70452r1156Q1555O7926m8812F9548K34J00730
13255A70512o8501M5118J119F8238J31527D2177e2578B77503g4059B0295H28J42867
13243A43695c4937A7047L17719A26231J95638D9188a47529A41103D8304O6214
13233A14518b8850A27474L15338B00348I2154k3379K12900C2278N0560f5440C77458
13221C53727G2358K89673r2845h7934j82283A45022J27447c957B6928c1861k6724
13210e8585B18364E8508b88603B4244R4334J96176J14780G8588c8225B23099Q9486
13199C12585b07271D26393A1295B366J03877B7607J7112k571J06496J4451a23208
13187a62421B24034r8958J91857b7381E5127R8594K00087A72842M1118E6776b791
$$ y = [116767, 128161, 105244, 59544, -32609, 270452, 179296, 260851, 328777, 279965, 69548, 69782, 170512, 102011, 147129, 148248, 68238, 199765, 42177, -52578, 277503, -74059, 20295, 828, 143695, -34937, 17047, 334766, 126231, 321869, 49188, -147529, 141103, 48304, 114518, -28850, 127474, 442812, 200348, 92154, 68775, 281675, 32278, 82838, -65440, 377458, 353727, 72358, 362031, 269186, -87934, -270217, 145022, 272469, -3957, 26928, -31861, -58585, 218364, 58508, -288603, 24244, 118578, 314754, 429534, 78588, -38225, 223099, 312585, -207271, 426393, 11295, 2366, 106243, 27607, 44719, 42148, 148644, 163095, -123208, -162421, 224034, 125076, 316933, -27381, 55127, 153721, 353808, 172842, 213960, 56776, -2791]
13175b51851A07760h7862F3036A069J39019J10803j8072h0232L8051A29329b81121
13163G6766J07427P7254H104J88789D0550g84j5163D48461a22090C91850j45789
13152B46061G6178N1047d399A25783A7307L8052P6328f1485B29060p1387L7633
13141A95306n5983K15945A44359J72107N1555A54040h0249B30200B7784a52358
13130B71150p4835b03828B0060J38498N3744e3736B32801g0846r2985j24046d9545
13118A30612J9529a23630C7620c4482C25116j21831J6168G9793M9773m0815b0572
13106G0872c5458A93228A6226K26709M2517A7544g4363A30573J38146N0303a6520
13094A07838N6198a31653C04327B0791J20712K69801C8550J39287f1582C26136
$$ y = [-251851, 107760, -87862, 63036, 1069, 140088, 250891, 232819, -80232, -42181, 129329, -281121, 76766, 184193, 261447, 8104, 196893, 40550, -784, -15947, 448461, -122090, 391850, 246061, 76178, 127225, -4399, 125783, 17307, 55359, 131687, -61485, 229060, 157673, 195306, 139323, 355268, 144359, 316466, 368021, 154040, -80249, 230200, 27784, -152358, 271150, 196315, -203828, 20060, 158558, 212302, -53736, 232801, -70846, -163831, -287877, -49545, 130612, 150141, -123630, 37620, -34482, 325116, 203285, 219453, 79793, 129566, 88751, -20572, 70872, -35458, 193228, 16226, 242935, 285452, 17544, -74363, 130573, 268719, 319022, -16520, 107838, 164036, -131653, 304327, 20791, 141503, 411304, 38550, 177837, -61582, 326136]
13083A84417a55499j8283f132G1942N4442a64618D50368a08022M9746E9724a97378
13071A08198b18664A30854F3834i8313A97944k8740J85292a08043G0205K5767
13061I5972L589a10307F2059b10838g5013j70510C38317E9902Q1138O0662h1863
13049B91759A25609a43329h804B59598k9630F7246L9799m4295b306G5315l4307
13038D1008J46653A7391i5522c0363j9714B13495G7167Q4783L0960a63647A14161
13026a14435I5420J35265J6712E9744b75601C18552g6501A54078h7808L5104D7801
13014C44796i5773A71915p1961k3184B7128P1690O1289C3216J38351c0804k07060
13003b37864A79485f8977G4308J23912b91922a20225B40625D6532K49753D4556
$$ y = [184417, -155499, -173782, -6132, 71942, 126384, -164618, 450368, -108022, -58276, 59724, -197378, 108198, -218664, 130854, 63834, -98313, 197944, 169204, 354496, -108043, 70205, 95972, 99561, -110307, 62059, -210838, -75013, -245523, 338317, 59902, 141040, 201702, -81863, 291759, 125609, -143329, -8804, 259598, 229968, 67246, 107045, 62750, -2306, 75315, 41008, 187661, 17391, -95522, -30363, -50077, 213495, 77167, 161950, 192910, -163647, 114161, -114435, 95420, 230685, 247397, 59744, -275601, 318552, -76501, 154078, -87808, -52704, 47801, 344796, -95773, 171915, 99954, 76770, 27128, 98818, 160107, 33216, 171567, -30804, -237864, 179485, -68977, 74308, 198220, -291922, -120225, 240625, 46532, 296285, 44556]
12992B16263J47673H3003d42521A93618L79898g8734A25301c68829A96220D7402
12981a67092E31802A55553a83247B39392a10388j3109A99514c9126b035A37791
12970B5702O3975b94515A72756a20432A1350f9936F5682O6514J0100F6888l714
12959F3174e9966A8879J67073b83422Q2303k7172B85428c3749m6397k98394A09417
12947c39785a29609p8396B643a29442B30453L4476j6291c25844f0933B5373e1985
12935H7898L97835b54906i3601B11298b20659C23515J63144a83249D01428B6153
12924B51632e9241l2030j54748h1824l03641E8211M3508a20698a5608A90221m288
12913A85933b94798A03837a46337F3736L42880j09850a18129B09156c7290A77986
$$ y = [216263, 363936, 83003, -442521, 193618, 573516, -78734, 125301, -368829, 196220, 47402, -167092, 531802, 155553, -183247, 239392, -110388, -123497, 199514, -39126, -2035, 137791, 25702, 89677, -294515, 172756, -120432, 11350, -69936, 65682, 132196, 142296, 66888, 63174, -59966, 18879, 185952, -283422, -201119, -228291, 285428, -33749, -80146, -378540, 109417, -339785, -129609, -208005, 2643, -129442, 230453, 264929, 248638, -325844, -60933, 25373, -51985, 87898, 485733, -254906, -93601, 211298, -220659, 323515, 486659, -183249, 401428, 26153, 251632, -59241, -91271, -246019, -81824, -385465, 58211, 101719, -120698, -15608, 190221, 185933, -294798, 103837, -146337, 63736, 406616, 296766, -118129, 209156, -37290, 177986]
12902D45384D1858K85477o773F1666A4412a60296A45488c2319C90992i4626d5126
12890b1872E1222a05091A31211d4128l20523J64551m3790B01832h179A64203J5836
12879A80039J17308A24836a89843D1861J94487I3141J95807A25349k6765k5415
12869G3169O032J76023E2298c14467B49618c31611J52487B76745o3061A1548J0922
12858B2470c5803A48427a11564A61685o0426e4153D5908O8825o834c35696a41246
12846A41637b63696F4604K700b23535D083O3139a34456B7436a27276K4668m4596
12835a47204a0412k56515a0134A27515K94830B5705a50908A83971J83018H9337
12824A0944J36326p3F9079c1494A50747a79814N6947A75565n6567j1842A6911
$$ y = [445384, 41858, 327335, 320562, 61666, 14412, -160296, 145488, -32319, 390992, -94626, -45126, -21872, 51222, -105091, 131211, -44128, -364651, -200100, -243890, 201832, -8179, 164203, 180039, 297347, 124836, -189843, 41861, 236348, 93141, 288948, 125349, 98584, 73169, 79201, 255224, 52298, -314467, 249618, -331611, -179124, 276745, 213684, 11548, 22470, -35803, 148427, -111564, 161685, 101259, -54153, 45908, 114733, 107899, -335696, -141246, 141637, -263696, 64604, 67304, -223535, 4083, 67222, -134456, 27436, -127276, -102608, -147204, -10412, -266927, -10134, 127515, 422345, 25705, -150908, 183971, 366989, 89337, 10944, 147270, 147197, 69079, -31494, 150747, -179814, -122867, 175565, 118998, 107156, 16911]
12812B16347a95175M2677a9357j28002C28790j46518B7133P2674J49537j06495
12802A42849l2197g9157A61441O462O0838B4706d70661b34874h0401b010A14656
12790c3942B45642h2881A96356b7977F3478e8562j10730h34B31761D4195K4135
12779F8330b26216a2679A28793D4283J28389a10725A96856b28537f8767G413K5907
12768C3320P4372J90782a59679B75181J3992j27253J34323I3458O712M5619a00275
12756a4570k5018k11580A1279a80837A29316a20234l14237h0217F611a9244j3250
12745c2494A39919n7649J22631I3633c4622j15138M3167m9097L5280B46797b18691
12733a37501j76226H2091a29877D7399c528E00779a33503p1015b9129A82009o7152
$$ y = [216347, -195175, -152498, -19357, -147359, 328790, 182272, 27133, 99807, 249344, 142849, 110652, -79157, 161441, 167903, 228741, 24706, -470661, -234874, -80401, -2010, 114656, -33942, 245642, -82881, 196356, -27977, 63478, -58562, -169292, -834, 231761, 44195, 68330, -226216, -12679, 128793, 44283, 172672, -110725, 196856, -228537, -68767, 7413, 33320, 107692, 298474, -159679, 275181, 289173, 161920, 296243, 93458, 100170, 145789, -100275, -14570, -39588, -251168, 11279, -180837, 129316, -120234, -434471, -80217, 6611, -19244, -32494, 139919, 82270, 204901, 93633, -34622, -149760, -106593, -155690, -120410, 246797, -218691, -137501, -313727, 82091, -129877, 47399, -3528, 500779, -133503, -204518, -29129, 182009, 114857]
12722A14857K58080e2852k3147n5064C74862B2612g1126A12449b0371B66471A09506
12710C79537c52364a19549D0241b9269A32453J11044C3332f4267E1960b04359
12699A82958R3125E374K03050a80427C0368K54717j20275o4247L94329c4403G415
12687I1523P2476K96145A30430q858D4423d3538m5161q9463I6865P8169a01416
12675a33062B65654b26441P6175K9828k42423J46242H9382a65537A82869N579
12665A88448b23642A41653A7439J95305O9999K564j07578a18287B31245H4617
12654b2434o3217l4218A97403d3506A34323a7170F485K25597A07195D4378p586
12643C6792J33213R4870H7966c97300C59006A13847b9737A99787I3504K2967e7169
$$ y = [114857, 372937, -52852, -75999, -131063, 374862, 22612, -71126, 112449, -20371, 266471, 109506, 379537, -352364, -119549, 40241, -29269, 132453, 243497, 33332, -64267, 51960, -204359, 182958, 276083, 5374, 208424, -180427, 30368, 285085, 164810, 100563, 494892, -34403, 7415, 91523, 163999, 460144, 130430, 121572, 44423, -43538, -88699, -178162, 96865, 175034, -101416, -133062, 265654, -226441, -150266, -120438, -362861, -216619, 89382, -165537, 182869, 188448, -223642, 141653, 17439, 212744, 282743, 285307, 177729, -118287, 231245, 84617, -22434, -85651, -119869, 197403, -43506, 134323, -17170, 6485, 232082, 107195, 44378, 36792, 170005, 264875, 87966, -397300, 359006, 113847, -29737, 199787, 93504, 116471, -57169]
12631a15723A03329b5902B91689I4681K3878q795a50033E455a06539E9257K57755
12620C17012E69K4006b5642O993B11412J16861A10111L6026B486K97020j29592
12609A69914a42851n2782A13112L92650j78649E9501e8639o6496a706j1615A34899
12597c10643R0468e082k41908A4077e6164A29966f5879r8637O9891l23627B28989
12585i9786D20972g8999A98795q1341J19772r3173D0037J5976b41153a04464B67905
12573a09685B01256m4830M2071O3233G3656j6825A505e1756k73092A90987c6927
12561B54758Q7015g2255A51223o9844a93554B43586A5625K68483f7110B04439
12550b35121B98941A47944J80191l2709J08819G1894J14382M2363j07515h889
$$ y = [-115723, 103329, -25902, 291689, 94681, 118559, 109764, -150033, 5455, -106539, 59257, 317012, 569, 24575, -25642, -18649, 211412, 328273, 110111, 146137, 2486, 299506, 169914, -142851, -195633, 113112, 505762, 327113, 59501, -58639, -125135, -1706, -13321, 134899, -310643, -220175, -5082, -246990, 14077, -56164, 129966, -65879, -164516, -94625, -418252, 228989, -99786, 420972, -78999, 198795, 117454, 237226, 144053, 40037, 56013, -241153, -104464, 267905, -109685, 201256, 156426, 198497, 261730, 73656, 56831, 1505, -51756, -324848, 190987, -36927, 254758, 341773, -72255, 151223, 81379, -193554, 243586, 15625, 284108, -67110, 204439, -235121, 298941, 147944, 328135, 295426, 404245, 71894, 186276, 228639, 121124, -8889]
12539D8881K94609h1642C3158K49913A18470L40164c73091B05185b74296A82378
12528a62159d8953H8246C3373a01248k5828l07159I9464a38452Q073k25743C06888
12516B23603K8432Q250m8183r9292N7085J444b02661I5269K03756Q6672a02098
12504C15836a76381b7333a1914q7783B68282i1981l7589A44780n2125Q8473H9033
12492a4108k36222G249a18900F72f6374j09011A79056j5620b6550m5605j8355
12481i0510B87006a00754C1023a02608j42994C6103J3996c094A89582b07645A51772
12469H665a5146l7483D9891M6377a57644g446j19995j38663n897e7640B01312
12457e7776B21969b6990q9739K9832A12216i6801j52589R0916L2307K5646i380
$$ y = [48881, 343490, -81642, 33158, 283071, 118470, 458634, -373091, 205185, -274296, 182378, -162159, -48953, 88246, 33373, -101248, -127076, -434235, 99464, -138452, -130379, -356122, 306888, 223603, 252035, 260285, 212102, 112810, 169895, 171339, -202661, 95269, 299025, 385697, -102098, 315836, -176381, -27333, -11914, -99697, 268282, -91981, -129570, 144780, 92655, 181128, 89033, -14108, -250330, 7249, -118900, 672, -66374, -175385, 179056, 163436, -26550, -72155, -90510, 287006, -100754, 31023, -102608, -245602, 36103, 50099, -3094, 189582, -207645, 151772, 8665, -15146, -52629, 49891, 96268, -157644, -7446, -127441, -266104, -272001, -57640, 201312, -57776, 221969, -26990, -116729, -86897, 112216, -96801, -249390, -158474, -126167, -100521, -9380]
12445B18708m0256n2184b09993C65166h4344j51996C43636e6604A65842i5672
12434a68145j67903a24423A8895h2593A57185O7361I4624a20854A50879b49500
12423a8396j08957A08229a8032B04313a22843I7836N1315a85575B08446g6222
12412i3931J8538A38732c10072A70189I730J30270b29468A6799L6612d3662a4716
12400b96245B81880C1947K6660K46733h0715B53126A05845b7826A35856b74168
12389A1040i4743A36054F619a3006B6382d5705j46176A13355a94401E3646R9778
12378A53424a33932N7563A76500C3913f0238A79180f7375F1705J19155G9786K05299
12367B85085a41001b0377B00777e5056j3398C08830r3487p5943a23839B14523
$$ y = [218708, 178452, 126268, -209993, 365166, -84344, -236340, 343636, -56604, 165842, -95672, -168145, -336048, -124423, 18895, -82593, 157185, 224546, 94624, -120854, 150879, -249500, -18396, -127353, 108229, -18032, 204313, -122843, 97836, 149151, -185575, 208446, -76222, -93931, -75393, 138732, -310072, 170189, 9730, 140000, -229468, 16799, 53411, -43662, -14716, -296245, 281880, 31947, 58607, 305340, -80715, 253126, 105845, -27826, 135856, -274168, 11040, -94743, 136054, 6619, -13006, 26382, -45705, -191881, 113355, -194401, 53646, 153424, -133932, -76369, 176500, 33913, -60238, 179180, -67375, 61705, 180860, 79786, 285085, -141001, -20377, 200777, -55056, -68454, 308830, 215343, 139400, -123839, 214523]
12356c2815H0687b54855d6747E384a15094A48476J57975n9161a54726A09624m285
12345A05339d6152j33737b0888E7665K47492a91225R3379J5632D96904j38823
12335C58081a26898k24782A31539o3907P5457k9278A1267J33529i1208d0734A87876
12323B06492h8444D47695j78132d7527A4688D552b3095k19543C201f4222j06389
12312a70611B82108j03278e1642K5300D6904J1574b64479D3118a50481A75636
12301A27879n1342a54866f1272A53216C1741A3148f6489l4701M1446k20214A78182
12289B22459g1708A02889K8538a29453l897p2468H2080j707c2198m3086A35815
12277a51347C01964h7371L2325a3854j95422Q0260I8539B0734a39996B52336c9149
$$ y = [-32815, 80687, -254855, -46747, 5384, -115094, 148476, 306451, 247290, -154726, 109624, 105339, -46152, -179889, -20888, 57665, 305157, -191225, -97846, -82214, 496904, 358081, -126898, -351680, 131539, 67632, 143089, 113811, 11267, 144796, -91208, -40734, 187876, 206492, -88444, 447695, 269563, -47527, 14688, 4552, -23095, -242638, 3201, -64222, -170611, 282108, 178830, -51642, -26342, 46904, 58478, -264479, 43118, -150481, 175636, 127879, 76537, -154866, -61272, 153216, 31741, 13148, -66489, -101190, -59744, -279958, 178182, 222459, -71708, 102889, 131427, -129453, -133350, -205818, 82080, 80373, -32198, -75284, 135815, -151347, 301964, -87371, -55046, -13854, -209276, -129016, 98539, 20734, -139996, 252336, -39149]
12265a1876j23678f3181A05941K8642K0202m2157M44982k25966j962E1829h2252
12253b82141A472d974B03959M6326F5522L4376K0282K43823A30760c0039B65815
12241d9577B12204R4743A51473o745D9670b4459B79757r6608Q409h5650A59312
12229B41331h3688A67521q1183i9443c0861B5038M292J8389K87672A06982a6727
12217A44815A092J22921b34222d9230B43674j9937a40198A73483N2272K00135
12207D25890l8182F4578l0812J00465L3998P0514E2308J29216F6705b07636A06330
12195B48433a57033H604a30734j88194C51380j18630K71576b11489A10495J22929
12185B33424I7321b0514H4940K08351A39226L2002a0183r4712F6655a66894e0117
$$ y = [-11876, -135554, -63181, 105941, 134583, 154785, 112628, 557610, 331644, 329682, 51829, -82252, -282141, 1472, -4974, 203959, 250285, 65522, 99898, 120180, 364003, 130760, -30039, 265815, -49577, 212204, 306947, 151473, 144728, 49670, -24459, 279757, 183149, 191558, -85650, 159312, 241331, -83688, 167521, 86338, -99443, -30861, 25038, 29330, 47719, 335391, 106982, -16727, 144815, 1092, 124013, -234222, -49230, 243674, 223737, -140198, 173483, 225755, 425890, 387708, 64578, 33766, 134231, 168229, 238743, 52308, 181524, 66705, -207636, 106330, 248433, -157033, 8604, -130734, -318928, 351380, 232750, 504326, -211489, 110495, 233424, 97321, -20514, 84940, 293291, 139226, 171228, -10183, -104895, 66655, -166894, -50117]
12173C55448j2235A23975e3244C2783J78953P4567i0552A13611M1969B7746a0671
12161f541E01409A39422h6723A78447a61570D0696K24049i7597n7794A62935p511
12150A55424A5574a77964M702A38028K4486d7197B8460h2103B32522G11b780E3627
12137C9244R2112a18737e4723G6731J08000a23361A49127j4803C6611j0926a41007
12125a18629d4258B97965f7762A62122a00236A07612a12434M695C25569F9091
12114A51835B5779a08742B77697a74863D05536g1860E0224K32351e9814j41735
12104b01549A35013L282F6380a39754M1274g533G6412a38523J0319d27j47486
12093a47913E094J89366l9686a34898i663n1729B39884j15956P6883J11432j50991
$$ y = [355448, 343213, 123975, -53244, 32783, 211736, 286303, -90552, 113611, 155580, 27746, -10671, -6541, 501409, 139422, -86723, 178447, -161570, 40696, 264745, -97597, -155391, 162935, 155424, 15574, -177964, -173262, 138028, 162514, -47197, 28460, -82103, 232522, 711, -2780, 53627, 39244, 131356, -118737, -54723, 76731, 184731, -123361, 149127, 134324, 36611, 25685, -141007, -118629, -44258, 297965, -67762, 162122, -100236, 107612, -112434, -107739, 325569, 69091, 151835, 25779, -108742, 277697, -174863, 405536, -71860, 50224, 282575, -59814, -201549, 135013, 138295, 66380, -139754, -98480, -7533, 76412, -138523, -128204, -427, -147913, 5094, 194460, 154774, -134898, -9663, -61392, 239884, 123928, 200811, 312243, 161252]
12082A61252L7852d3277k82521d8389C79323B5845J65588c0089e423G7351i6503
12070H3957J64036c4183B50842b2629o5751B07095n5079R936b08123i5527c0865
12058A17917K00330B7684b6178K562A28070b06173a5317k9624A47247i5896B60978
12046C06640i2522A90726c6088j05982M9001E17829k24554N88784D00321D5529
12035B6247h700j36797A60383e2397J5546d61D6984i0529j42000D7669a57505
12023c64H2391f6933A83798b9772E9986a098j49921A03010a77483b9348E0748
12011G0987k981A3039j176a26026C03923r9102e4279k88968e2958p3858I8124
11999b5919C06505A25902f7885j5725m175A94822d9246D15836b16162R9348A82952
$$ y = [161252, 199104, -43277, -325798, -48389, 379323, 25845, 191433, -30089, -5423, 77351, -96503, 83957, 247993, -34183, 250842, -22629, -88380, 207095, 152016, 161952, -208123, -95527, -30865, 117917, 318247, 27684, -26178, -23616, 128070, -206173, -15317, -44941, 147247, -95896, 260978, 306640, -92522, 190726, -36088, -142070, -93069, 517829, 293275, 882059, 400321, 45529, 26247, -8700, -145497, 160383, -52397, -36851, -461, 46984, -90529, -232529, 47669, -157505, -364, 82391, -66933, 183798, -29772, 59986, -1098, -151019, 103010, -177483, -29348, 50748, 70987, 68006, 13039, 11863, -126026, 303923, 204821, -54279, -343247, -52958, -126816, 98124, -25919, 306505, 125902, -67885, -83610, -87785, 194822, -49246, 415836, -216162, -116814, 182952]
11987d1277A61759A8955a7268A09468b58527A360R9969b04764R7412A28503E604
11975a87919I6207a28641m7678a1695k75436A68231e9843F1864a49158L1294C4611
11963b973l83887a59679p2586l889F6411a6808D0416Q9643c62040e2337F1323
11951i3736J4324B61050K07711b58057A69088M7220I2800c796B15628q0421e0061
11939I2946k3773J0349b9655A52943a7876G03i9402d5629B17200B0159P191N6299
11927H3649a13092B49898e591j06249d0681j33178p8604d1836A62375b32018g7530
11915c01106a43845L585c3788m5753j5181B13467i4790K6506m3591A6931e2986
11903c6808E8884a66043B04443c7057n8560l958A90382c08837B53265a27735r6730
$$ y = [-41277, 161759, 18955, -17268, 109468, -258527, 1360, 101329, -204764, -107352, 128503, 5604, -187919, 96207, -128641, -176319, -11695, -287131, 168231, -59843, 61864, -149158, -117864, 34611, -2973, -386860, -159679, -232265, -236154, 66411, -16808, 40416, 130059, -362040, -52337, 61323, -93736, -79412, 261050, 468761, -258057, 169088, 216308, 92800, -3796, 215628, 135207, -50061, 92946, 69173, 79522, -29655, 152943, -17876, 703, -99402, -45629, 217200, 20159, 27350, 83649, -113092, 249898, -5591, -111840, -40681, -173859, -252463, -41836, 162375, -232018, -77530, -301106, -143845, -140260, -33788, -79541, -94722, 213467, -94790, -68284, -111875, 16931, -52986, -36808, 58884, -166043, 204443, -37057, -95617, -99575, 190382, -308837, 253265, -127735, -224465]
11892b24465d1838f42C422J53753f9936A45309F4498J11910D1294d2156D9419
11880A52436K25024b07086D4043J92799F2625a25358q6441H7141a60303J2506
11870a47797k7978e5949A2103J50802R8923c46960a53969P6760k365I0737C626
11858a27236b7244r0031D7538M72092B29796f9096j16447Q2941A39221n188A3660
11846a05856M6561A45290k3417C4154O6275m018D4365a12256q7712A3420c4559
11834A8832h9073q0688F7736B941i1504l03165h8604j17985A28617g4353p4312
11823a48665N1915D0557J50888a23579L8512b8006j72683j6669o2280J1479l5829
11812c03988A32912a34600A48120d1485j63455m9895r8A76369a77143I5603a13725
$$ y = [-224465, -41838, -642, 3422, 157175, -69936, 145309, 64498, 176408, 41294, -42156, 49419, 152436, 377460, -207086, 44043, 236842, 62625, -125358, -211799, 87141, -160303, -147797, -175775, -55949, 12103, 162905, 261828, -346960, -153969, -77209, -79574, 90737, 3626, -127236, -27244, -117275, 47538, 519630, 229796, -69096, -185543, -102602, 139221, 134033, 13660, -105856, -59295, 145290, 121873, 34154, 100429, 96411, 44365, -112256, -199968, 13420, -34559, 18832, -89073, -169761, 67736, 2941, -91504, -394669, -88604, -206589, 128617, -74353, -148665, -96750, 40557, 191445, -123579, -85067, -28006, -200689, -217358, -279638, -268159, -303988, 132912, -134600, 148120, -41485, -204940, -254835, -254933, 176369, -177143, 95603, -113725]
11800a07476J2481b6347B25662b05042A48813n9546b30525a1704G9125P4578F8504
11788a42051j44729C8323P4972b42001N9732o8468e6406A34528J14556q1783j0225
11777A57076p5558K3998b59288A1649P9915R3888o9840b42664d5075D1258c06470
11765b24383f2444A7277M94217E9600c3231I3354a34342A22180a88288A96623
11754F8866J06427a69541C21133b83449C14843c3955q8829A30964c3261B01204
11743a83684m1693g2997j00560B68416a26762A70443d250B96950A6213a28530
11732h0034d345r8451m8207k0928B28791a84969B24581B6647a51611a0225A61446
11720h0621j4368B40822h8449I2254K0372a41881C9880a46080k31495a82618n2838
$$ y = [-107476, -94995, -26347, 225662, -205042, 148813, 89267, -230525, -11704, 79125, 153703, 68504, -142051, -286780, 38323, 113295, -242001, -182269, -250737, -56406, 134528, 249084, 167301, 157076, 81518, 105516, -259288, 11649, 91564, 185452, 115612, -242664, -45075, 41258, -306470, -224383, -62444, 17277, 511494, 59600, -33231, 93354, -134342, 122180, -188288, 196623, 68866, 175293, -169541, 321133, -283449, 314843, -33955, -122784, 130964, -33261, 201204, -183684, -225377, -72997, -173557, 268416, -126762, 170443, -4250, 296950, 16213, -128530, -80034, -4345, -102796, -151003, -171931, 228791, -184969, 224581, 26647, -151611, -10225, 161446, -80621, -94989, 240822, -88449, 92254, 112626, -141881, 39880, -146080, -377575, -182618, -235456]
11709b35456f5688A01939a33428o9921E0696a73029a461k03801A740L6067a57147
11697e3953q9524j41607A16779J7580N0689a10746A91305a21205j56145a28546
11686A64825j9965a14054l0178I5919a56101O5221l26081E8502i8376q0014D4854
11674a63849c5753j17063J9380f4463A47204b05028e6343I2824C0920a30174F8038
11662B5921b8298I1862K95292B2706b02018C62099h5878j06804i446E268h8812
11650i3973B207a00413j89922C0824a8901n2655B77841D320M2627b21297F9993
11638A86807a10471J0786A16991a14107c0768j0919A36331i905G2920b8336k99910
11627c28246J18430k03651a27431N63G6375n331b1838n7464B15223G8867J26902
$$ y = [-235456, -65688, 101939, -133428, -203349, 50696, -173029, -1461, -205262, 1740, 37807, -157147, -53953, -143477, -285084, 116779, 134359, 185048, -110746, 191305, -121205, -277350, -128546, 164825, 144860, -114054, -144232, 95919, -156101, -90880, -416961, 58502, -98376, -178390, 44854, -163849, -35753, -152816, -133436, -64463, 147204, -205028, -56343, 92824, 30920, -130174, 68038, 25921, -28298, 91862, 387154, 22706, -202018, 362099, -85878, -192682, -9446, 5268, -88812, -93973, 2207, -100413, -290335, 30824, -18901, -71556, 277841, 4320, 46947, -221297, 69993, 186807, -110471, -99685, 116991, -114107, -30768, -41687, 136331, -9905, 72920, -28336, -328246, -209816, -413467, -127431, -126868, 76375, 71044, -21838, -79302, 215223, 78867, 205769]
11616B05769o7938a47146B6676i7419J4973D3861J3644J82916A15891J81623P0580
11605C68094i4071k407a2431D2583L19637a6955G5298i8716k2572j3401A70866
11593B45467j7760A7983M6637a29465I7857b47643A24314a39054F4859b35293
11582A8056J80953a94748I3308e2762q846A66209g1674p3440A02610a77375g6725
11570B11044E2195L35373A20882b29808B640c03425a8160C2394K11971d7265b1343
11558e6366j93751b4878H960b26854H1576M3385D6082a07679B36353b88368A98066
11546a26250A23698N13416D4512a950A6467c1748D1782H255d95266D1215c563
11534G8506A0866O6440i4422A52043a03095A50708G4790a6070q3856o9540E5705
$$ y = [205769, 137831, -147146, 26676, -97419, -82446, 43861, 57505, 240421, 115891, 297514, 368094, -94071, -96478, -12431, 42583, 362220, -16955, 75298, -98716, -121288, -134689, 170866, 245467, 227707, 17983, 64620, -129465, 97857, -247643, 124314, -139054, 64859, -235293, 18056, 199009, -194748, 93308, -52762, -61608, 166209, -71674, -145114, 102610, -177375, -76725, 211044, 52195, 387568, 120882, -229808, 2640, -303425, -18160, 32394, 244365, -47265, -21343, -56366, -250117, -24878, 8960, -226854, 81576, 124961, 46082, -107679, 236353, -288368, 198066, -126250, 123698, 637114, 44512, -1950, 16467, -31748, 41782, 8255, -495266, 41215, -3563, 78506, 10866, 77306, -94422, 152043, -103095, 150708, 74790, -16070, -99926, -169466, 55705]
11522E5594d0326B80510I9030J92184a14241A5738e9305D1758M6582J01908J75302
11511C65550A61644b37158a5549A20860i7714E19137k45913D4198a20387A20284
11500A73429D9366L9175A7370R8055j9048D1322J83490a24997A90423b02336G4549
11488B18616q5019P2555F181d6746B39705C9787M0415a37925A64469l1992f027
11476B95561b51280A66787m2144O3807c3974l3983B450L51247k7476e9703A91088
11464B88802A43252Q1456J7798A06110k9174L03901A22631O5850M3280p7475k8032
11453A26254c7126B12447e7857C34915H5038O8504J74561B8262K9772a11864A59737
11441I016i9489D6309d78699C792J72213G2532B9577c9781B08515q6144a9533
$$ y = [55594, -40326, 280510, 99030, 291214, -114241, 15738, -59305, 41758, 88340, 190248, 365550, 161644, -237158, -15549, 120860, -97714, 519137, 273224, 44198, -120387, 120284, 173429, 49366, 88541, 17370, 115425, 96377, 41322, 224812, -124997, 190423, -202336, 74549, 218616, 133597, 206152, 6181, -46746, 239705, 39787, 80202, -137925, 164469, 132477, -6027, 295561, -251280, 166787, 124643, 188450, -33974, -67957, 2450, 353697, 326221, -59703, 191088, 288802, 143252, 224708, 242506, 106110, 76936, 380837, 122631, 188481, 231761, 154286, 126254, -37126, 212447, -57857, 334915, 85038, 153542, 328103, 28262, 58034, -111864, 159737, 9016, -99489, 46309, -478699, 3792, 176005, 72532, 29577, -39781, 208515, 122371, -19533]
11429a49659P2079b3911C05558E8148k7677a06531A30271e5434B47370a19756
11418e3329A68679C9949L83555a8938A93458p2842a44746g836A75681a86630h5847
11406g5118C63955D1935N9417b78844P4705a4735A31508a29411F4518b69082J07027
11395a62055N523B01231a7781A18570j2311J01141I6439a03514j59807d8859j20763
11384a69622C76874b01864I5990j7431c5007l51134J52616d5260B15266g3995
11373a56840a3604j50700Q0825C7870b2628B3580h0864B22149D6122h6434j95949
11362b82383i2020G2073h404H5398J1508D6434o784Q9061g7188q554A15764f6266
11349c9153n7002L8907A29700a13159A54054d50633E9524j6594c17723a8118H8708
$$ y = [-149659, -77580, -23911, 305558, 58148, 30471, -106531, 130271, -55434, 247370, -119756, -53329, 168679, 39949, 423504, -18938, 193458, 120616, -144746, -7836, 175681, -186630, -85847, -75118, 363955, 41935, 101352, -278844, -204139, -14735, 131508, -129411, 64518, -269082, -162055, -156532, 201231, -17781, 118570, 106259, 207400, 96439, -103514, -263321, -48859, -169622, 376874, -201864, 95990, 78559, -35007, -386141, -233525, -45260, 215266, -73995, -156840, -13604, -164304, -83479, 37870, -22628, 23580, -80864, 222149, 46122, -86434, -282383, -92020, 72073, -8404, 85398, 96906, 46434, 39650, 128711, -77188, -85742, 115764, -66266, -39153, -96155, -57248, 129700, -113159, 154054, -450633, 59524, 42930, -317723, -18118, 88708]
11337b55154A37885B3347a58884K094l5160K8306A2577a28292H8628b38473m7893
11326b86366F0479f4744k19874R6413e895B4765J15781e0702j64435i9207n2251
11315a51458b777l0297j38300G193K67794a87903G7547c14850j76033A03141k6089
11304G7052K18585C4441a55419B28250F2698a98334E7615J16625b76863a26112
11293E5629b35818B38658Q4685e070l1596A41761M2705E7511J71759n9809P3668
11282B43129a22071j07283C60973c8231A4530K1943M3261M8645B101N2795a51470
11270b64776g8058A18293b66743Q0534O9201j22621A7572b59076d374A03515m2916
11259F0599a79627j20539a34983B8299L54957a11907j80615d8324o6242d3013
$$ y = [-255154, 137885, 23347, -158884, -156790, -191950, -163644, 12577, -128292, 88628, -238473, -286366, 60479, -64744, -284618, -188205, -5895, 24765, 140546, -50702, -215137, -99207, -151458, -2777, -33074, -171374, 7193, 274987, -187903, 77547, -314850, -490883, 103141, 77052, 295637, 34441, -155419, 228250, 62698, -198334, 57615, 174240, -276863, -126112, 55629, -235818, 238658, 323343, -5070, -36666, 141761, 184466, 57511, 229270, 169461, 243129, -122071, -229354, 360973, -38231, 14530, 36473, 79734, 128379, 2101, 54896, -151470, -264776, -78058, 118293, -266743, -186209, -117008, -239629, 17572, -259076, -4374, 103515, 60599, -179627, -300166, -134983, 28299, 383256, -111907, -292522, -48324, -114566, -43013]
11248b8879A07921G719K06088D099c00743B56320n2679b07147A56252i8765c2982
11236E0141b06541A25188e5487l57480B062N9801j2986c5995j66209P0349M2631
11225h9224J436I8633a09948d9498F3071J08030G0832C1029J70030e3685A01396
11213a9737p41357d378n1975j02939K9622f4423C99301a81696j5665A19158b82438
11201b7626j05337A58437a909n13363b1623B63068F6320c7325B71681l5479h6904
11189a72362P6064A99464b63836L8963o0202A27400l5053R2090c2812A51147d12292
11177b23556m3714J02175G6175b41297N8541D2302a58348n9882G4730a9955A19936
11165i37p7757c0637A29038N5056O5667F3436J22867b20024B1360a27206k27266
$$ y = [-28879, 107921, 7719, 213807, 4099, -300743, 256320, 203641, -207147, 156252, -98765, -32982, 50141, -206541, 125188, -55487, -412967, 2062, 61863, 48877, -35995, -202204, -131855, -89224, -87788, 98633, -109948, -49498, 63071, 171101, 70832, 31029, 201059, -53685, 101396, -19737, -761094, -4378, -56353, -159292, -129670, -64423, 399301, -181696, -197361, 119158, -282438, -27626, -132963, 158437, -1909, -515272, -21623, 263068, 66320, -37325, 271681, 236202, -86904, -172362, -96298, 199464, -263836, -224873, -285075, 127400, 92347, 184437, -32812, 151147, -412292, -223556, -267270, -165095, 76175, -241297, -182756, 42302, -158348, -218230, 74730, -19955, 119936, -937, -78694, -30637, 129038, 184094, 249761, 63436, 186303, -220024, 21360, -127206, -354472]
11154c54472a10236A86326a00411L5154n2012A32513A9338b31114P1059A04245
11143B14586i6214A3586Q9516e4928b6612j61480k624b2858A34703J57776A28402
11131a72506Q5664q6321n2066B00259a66328A18502a3814k07323c3972j0981k90073
11120c35026a2699C5706R2573J3756E0588b5166B97791r5193a32235k5704D34719
11108a20109A51901J19484a71170M7563A29398h399j40954F0849e6763B12402
11097B75488A19180E6152K01732J19862A47459D3415J34858K28377i9490k52820
11087c52310A11645a17496I2621P9381a9204B49624k8089q5460b11386D70131
11076D77155A3295M59198j96625H3261J41363G8384J40026A03861j8144a25501
$$ y = [-354472, -110236, 186326, -100411, -65257, -117269, 132513, 19338, -231114, -160055, 104245, 214586, -96214, 13586, 103102, -54928, -26612, -188092, -190716, -22858, 134703, 292479, 128402, -172506, -86842, -173163, -225229, 200259, -166328, 118502, -13814, -221137, -33972, -44953, -335026, -12699, 35706, 128279, 142035, 50588, -25166, 297791, 202598, -132235, -157939, 434719, -120109, 151901, 271385, -171170, -123607, 129398, -8399, -149353, 60849, -56763, 212402, 275488, 119180, 56152, 257884, 377746, 147459, 43415, 178273, 406650, -99490, -352310, 111645, -117496, 92621, 172002, -19204, 249624, 221535, 136075, -211386, 470131, 477155, 13295, 472493, 275868, 83261, 224624, 78384, 218410, 103861, 85717, -125501]
11065C25091L0836J22089k20921g7096C12716I5445J94716M2138j0674p7794E4564
11053D06559m4559K9474j82283L28352m3887K1359I1671K69055A78874K14724
11043C93598j41420L59411j40778k26693K20765q699L37767n10j71409J40801
11033G62833r7771m3314k1404M2978j16099j2235j88578L34809J07761j39865
11023F29115j66687J96457j26413J59608j33719K20103O2642D15446l1215K0161
11013D04392J49280K5725R1867r0457N7241k81639q4153M25960n7948M3942k54090
11002D30120k313j14910J05816O8295k34311p7278M59296j94949j07l1614J64653
10991E72698j23916o8109R1539J70242k24345K11663l0470n2137K21438j05606
$$ y = [325091, 355927, 478016, 257095, -77096, 312716, 95445, 290161, 332299, 321625, 243831, 54564, 406559, 362000, 391474, 209191, 537543, 493656, 515015, 91671, 360726, 178874, 393598, 252178, 611589, 470811, 244118, 464883, 456184, 793951, 793441, 622032, 762833, 665062, 621748, 600344, 643322, 527223, 514988, 326410, 661219, 768980, 629115, 462428, 658885, 532472, 692080, 558361, 778464, 841106, 415446, 384231, 404392, 553672, 579397, 671264, 580807, 638048, 356409, 272256, 698216, 640268, 684210, 430120, 427807, 312897, 418713, 487008, 252697, 175419, 634715, 439766, 439659, 408045, 572698, 448782, 380673, 472212, 642454, 418109, 629772, 599302, 547165, 768603, 662997]
10981F62997k40249K03858o2108o6413j33932A6614O61982J08854j26136L00082
10971I61396J0699m07368Q9140L27901J21251j63450l8497P5251J54693N11763
10961A642779j49866M59203J91326J41960L41887R1265o0043l19996m02137J92616
10951B128994n06552j512m27767K3400j8985n3786p4177m8586Q9978j22485J43443
10940A131965l63714j8189C39084L03118N8199k64406N0026j75556K11893B52889
10929D71559A56657O1191J16967E3262R2453L3449K7448d0450A61385L589R7066
10918B62040m2075J5335j17056e4972B32714I5729a04640i05G2344j8753J57097
10907B10688L0213n8268E3656K66199A18027A5484f4009k75264a25516L0160J0835
$$ y = [662997, 422748, 626606, 564498, 498085, 364153, 16614, 678596, 787450, 661314, 961396, 972095, 564727, 653867, 981768, 1103019, 939569, 901072, 976323, 1131016, 1642779, 1492913, 1952116, 2143442, 2285402, 2627289, 2718554, 2658511, 2338515, 1936378, 2128994, 1622442, 1620930, 1193163, 1216563, 1197578, 1143792, 1069615, 1021029, 1111007, 988522, 1131965, 768251, 750062, 339084, 642202, 700401, 435995, 486021, 310465, 522358, 252889, 471559, 156657, 217848, 334815, 53262, 145715, 179164, 206612, -40450, 161385, 164974, 262040, 219965, 235300, 118244, -54972, 232714, 95729, -104640, -905, 72344, 53591, 210688, 240901, 182633, 53656, 319855, 118027, 15484, -64009, -339273, -125516, -95356, -84521]
10896h4521A04229b95955C1339a63364C91240a17841A14232a1099k67534F0538
10885a48854A01635k5705J50844A08485a89918j925l8661A05576c82630a11862
10874A27036e2086k4167j46134h1231c7657F6812J9389k2814M3339g2725D2307
10862I3279e8928k54154A6874N6910L8758M69D3058j7425O2145B6641i812k32380
10850b42192B09301a99697Q482N3401E0268J82098G2155c34112F0902b4552A44985
10838d4357m5684C4942R869a37402A15631A8859b38783M9664n0503Q2685G4462
10826I6492d851D0886b48350j07896g6228A68077D5763p510b1610B31381b14979
10814A85423a24318K1304j34300D83855b1120B82694h459D24087a21465C8222
$$ y = [-84521, 104229, -295955, 31339, -163364, 391240, -117841, 114232, -11099, -278633, 60538, -148854, 101635, 75930, 226774, 108485, -189918, -191843, -230504, 105576, -382630, -111862, 127036, -52086, -76253, -222387, -81231, -37657, 66812, 86201, 63387, 106726, -72725, 42307, 93279, -58928, -313082, 16874, 73784, 112542, 113011, 43058, 25633, 87778, 26641, -9812, -242192, 209301, -199697, -191215, -137814, 50268, 232366, 72155, -334112, 60902, -24552, 144985, -44357, -90041, 34942, 44811, -137402, 115631, 18859, -238783, -189119, -239622, -156937, 74462, 96492, -4851, 40886, -248350, -356246, -76228, 168077, 45763, 38253, -21610, 231381, -214979, 185423, -124318, -103014, -237314, 483855, -21120, 282694, -8459, 424087, -121465, 38222]
10803d9699j20976A34605a76848a7033j14262l4442q394j91771b4654k97975G1664
10791a59593k2437h5039p8240F3529a75359p236G0816K1249h7595E6417e4937
10779B11320r7542a16845I7670D064b16381C5480a4067m2025I8055a7598C40420
10767a10260r204k5470A39837a28903M7229r2048e0381d477p635A18245a09945
10755E7522b28819A55816i3615m1938n4224l200H3959a70717k33144G6861b89655
10743b41731N3615R3283l3667b7656A8325m642a12101N3000l4555l0883K0584
10732a03955H0909o602C5998c43735d2462N878B7417R8148b12258A49201J40819
10721B90020B8678a46021n1938d0838k0986j15769q147L535A09705b17525B05581
$$ y = [-49699, -170675, 134605, -176848, -17033, -131295, -165737, -174131, -365902, -24654, -322629, 71664, -159593, -182030, -85039, -163279, 63529, -175359, -182595, 70816, 92065, -87595, 56417, -54937, 211320, 113778, -116845, 97670, 4064, -216381, 35480, -14067, -56092, 98055, -17598, 340420, -110260, -119464, -144934, 139837, -128903, -81674, -173722, -50381, -4477, -12112, 118245, -109945, 57522, -228819, 155816, -93615, -135553, -189777, -192977, 83959, -170717, -403861, 76861, -289655, -241731, -188116, -94833, -128500, -27656, 18325, 13683, -112101, -59101, -93656, -124539, -103955, 80909, 74307, 35998, -343735, -42462, -36584, 27417, 125565, -212258, 149201, 290020, 28678, -146021, -197959, -40838, -61824, -177593, -185740, -182205, 109705, -217525, 205581]
10709b93611a00347o7865N1211A13317J89401d09680D6199K8263a34030j23549
10699b57579B2946i0922K8517H25k27a90532A18503f2730A69389b9795k45192
10688b74987q6778a22498k7316g3361o2373m4996c7066A95450J4942l5906c8170
10676H2755K96483a39669B36875B9539L71782a4216r7732c5590k12175d3879k27968
10665b71847F4409K0288I128a80643D5539a11106j53549I5599B01a24824d6040
10653b16497B5963K65719H356L6786c02986e4652C8448a05890A19597c3385m16184
10642d49569P1785a793k81693a28772C5147M4691b72087j18463J88982n8190G1375
10630A1832L8005a94961j2196m7248I9799l3011C2888C51a04278k7390O1907n783
$$ y = [-293611, -100347, -168212, -117001, 113317, 302718, -409680, 46199, 74462, -134030, -257579, 22946, -90922, -62405, 825, 598, -190532, 118503, -62730, 169389, -29795, -274987, -361765, -122498, -149814, -73361, -135734, -180730, -37066, 195450, 210392, 174486, -38170, 82755, 379238, -139669, 236875, 29539, 401321, -14216, -111948, -35590, -247765, -43879, -271847, 64409, 84697, 9128, -180643, 45539, -111106, -264655, 95599, 201, -124824, -46040, -216497, 25963, 291682, 8356, 45142, -302986, -54652, 38448, -105890, 119597, -33385, -449569, -377784, -1793, -283486, -128772, 35147, 79838, -272087, -390550, -201568, -259758, 71375, 11832, 49837, -194961, -207157, -254405, 99799, 66788, 32888, 351, -104278, -131668, -69761, -75544]
10618g5544j48120f3964p1454k13609D3499a22715q7770K4964i2756n56476I549
10606a07644c7512k9465j5075A63470j5605m8651a95103A79585e3169j94659J18439
10595a29389I1589b02244M6177A27897a94697E5362A6927d1524F99e4940p9038
10584a33978B14609o088D1508c5963E76096h9462G5944c25270a33208l072O5318
10573g0962l2657q9929L2924L8257B32896b04748f999j42183N008j36936J10943
10562a70167C8866b1031A97354J7048D6329b51811A04647c17116B18048p673c23114
10550a22671E7234c3739H0141a17069k24869a20080D6105J32691h709C7618c20558
10538E6769a55931B21863G5948c87865g8990j8018l1992n3401J5540H8393J09022
$$ y = [-75544, -223664, -63964, -135418, -349027, 43499, -122715, -210485, -185521, -92756, -649232, 9549, -107644, -37512, -66977, -82052, 163470, 147865, 99214, -195103, 179585, -53169, -247828, -129389, 91589, -202244, -156067, 127897, -194697, 55362, 16927, -41524, 699, -54940, -133978, 214609, 208521, 41508, -35963, 576096, -89462, 75944, -325270, -133208, -136280, -70962, -103619, -193548, -160624, -122367, 232896, -204748, -6999, -149182, -144174, -281110, -170167, 38866, -21031, 197354, 214402, 46329, -251811, 104647, -317116, 218048, 210375, -323114, -122671, 57234, -33739, 80141, -117069, -341938, -120080, 46105, 178796, -8709, 37618, -320558, 56769, -155931, 221863, 75948, -387865, -78990, -97008, -129000, -182401, -166861, 88393, 197415]
10527A97415E5894M9176k4099a29786j00719N5629I1531R5006b51266B40937h4653
10515E2702a85879A7246d5729H896L74d0521j64797j34382b0062d165m1583E8763
10502a59147p2746j10020C8465J48782c1862A90048C4985J54722C555a166j9693
10491b0859l63358a78607n1308A08710J87382b054j15028d3009q0950r2383o1354
10480b77696N7204C17787D4128a87780h031o8099A83559b92981D4654J08128L7693
10469A90475a56800j7762B00675j1798p3949J60095A34342m5101J78818f1371
10458a01674o2572B2920a05781o1988H1329b22128A75975C1998J07632a99528
10447B94490c15086D1342a6966B2141K8018a1904k0960j95315h0391D215J64114
$$ y = [197415, 55894, 105070, 80971, -129786, -230505, -174876, 91531, 186537, -251266, 240937, -84653, 52702, -185879, 17246, -45729, 8896, 9270, -40521, -205318, -339700, -20062, -4165, -45748, 58763, -159147, -231893, -341913, 38465, 187247, -31862, 190048, 34985, 189707, 3555, -1166, -20859, -384217, -178607, -229915, 108710, 296092, -2054, -117082, -43009, -123959, -216342, -277696, -220492, 317787, 44128, -187780, -8031, -76130, 183559, -292981, 44654, 152782, 190475, -156800, -174562, 200675, 188877, 114928, 275023, 134342, 89241, 268059, -61371, -101674, -164246, 22920, -105781, -167769, 81329, -222128, 175975, 31998, 139630, -199528, 294490, -315086, 41342, -16966, 22141, 50159, -11904, -32864, -228179, -80391, 4215, 168329]
10436A68329b70142g0052A36034O640b2641H7162B5559J8973e8358F0676k4981
10425C5695J2097a38395j45916R0754B61057a36049B91205i8481C10231B9430
10414f9268h329B2172i1350K6711A84288a80413e6423j08009j84005a9706m0456
10403f0162A3764O1478B3716b5129O229n2468a222k6082D45227k16218B4181b36024
10390A25284a48536O9902A58045d7705B67449a46169P0465C3205e2992A92533
10379A11814g0643B32585m2026i2989M0606G8834a45307E1502L7799N9325P0798
10368B19424e3021A77463B2226g129A55021O1521B0899M00373J8704j59044C704
10356c7137B04171E1377K28041J32196a71903E84146q5195A85635K22461l5098
$$ y = [168329, -270142, -70052, 136034, 142674, -22641, 87162, 25559, 44532, -58358, 60676, 35695, 47792, -138395, -284311, -193557, 261057, -136049, 291205, -98481, 310231, 29430, -69268, -8329, 22172, -91350, -64639, 184288, -180413, -56423, -164432, -348437, -19706, -60162, 13764, 75242, 23716, -25129, -18900, -71368, -1222, -27304, 445227, 229009, 24181, -236024, 125284, -148536, -78634, 158045, -47705, 267449, -146169, -75704, 33205, -52992, 192533, 111814, -70643, 232585, 190559, -92989, -52383, 78834, -145307, 51502, 89301, 148626, 219424, -53021, 177463, 22226, -7129, 155021, 216542, 20899, 421272, 439976, 280932, 3704, -37137, 204171, 51377, 279418, 411614, -171903, 584146, 498951, 185635, 408096, 372998]
10346C72998j61658l0049j598j6500L5288i4268D08315A05126m310J1013K74225
10335C86054J18531k21348L1947r7419O7515d1449B97370h7782A70900p6329J9486
10324A14057n4565L60558D7373J57913H4740J59954a93523B50760j00459j6519
10314A33782c2336A53991o614a22417A24234P8395J19384j6865a1900G7443k3739
10303E3704e923F23881b13202A27776f6282A96266D7537L83807k05115p616b55971
10291d93573A8383a09133A33803b02708i094j02816B6216L96031A69350b08857
10280h3158F2536a24611d2195j45376c6972j35066B03596m9868a14956K2778m57367
10269e49545K29628a50972d5626q6055A28535a89697k00582a73033A22255J40465
$$ y = [372998, 211340, 181291, 179693, 163193, 198481, -94268, 408315, 105126, 100816, 111829, 386054, 504585, 283237, 315184, 217765, 285280, -41449, 297370, -87782, 170900, 94571, 114057, 59492, 420050, 47373, 205286, 84740, 244694, -193523, 250760, 150301, 133782, -32336, 153991, 147377, -122417, 124234, 202629, 322013, 305148, -11900, 77443, 53704, -5923, 623881, -213202, 127776, -66282, 196266, 47537, 431344, 226229, 218613, -255971, -493573, 18383, -109133, 133803, -202708, -9094, -111910, 26216, 422247, 169350, -208857, -83158, 62536, -124611, -42195, -187571, -36972, -172038, 203596, 153728, -114956, -92178, -549545, -319917, -150972, -45626, -131681, 128535, -189697, -390279, -173033, 122255, 262720]
10259B62720q6473a3356q6161j77021A86147B5584c3172k29575c2644j76121c7707
10247A79411a94128a8522B9818L82184a43267c9531j86828k6967G5602g6879I2626
10235a30436B11267i6781A35124b79372a06886B47590j03640D5122d6267A19787
10224a50431G2477b90629g3818j08504F3740L8498K48885A28549h1676E7184a12582
10212b49119D844a86012h0517D27486b25872B19130c92256n3003b3815j72793
10202a96608B5908a80381j49283B07437d437E9649j3811b57655k482J9515A84869
10190A28745E3637J54813b09545B0507K6496P9085a18659d5387B68365a9705A7763
10178A13870b81403F683a91488l7217q2633c3212D60960b19790N2446o2340C4733
$$ y = [262720, 176247, -13356, -99517, -276538, 186147, 25584, -33172, -262747, -32644, -208765, -37707, 179411, -194128, -18522, 29818, 412002, -143267, -39531, -226359, -253326, 75602, -76879, 92626, -130436, 211267, -96781, 135124, -279372, -106886, 247590, 143950, 45122, -46267, 119787, -150431, 72477, -290629, -73818, -182322, 63740, 102238, 351123, 128549, -81676, 57184, -112582, -249119, 4844, -186012, -80517, 427486, -225872, 219130, -392256, -445259, -23815, -196608, 25908, -180381, -329664, 207437, -4437, 59649, 45838, -257655, -260137, -240622, 184869, 128745, 53637, 208450, -209545, 20507, 47003, 126088, -118659, -45387, 268365, -19705, 17763, 113870, -281403, 6683, -191488, -228705, -311338, -33212, 460960, -219790, -167344, -229684, 34733]
10166E6921J42256d6112k00166A47411m0103i1725p2817g2522k04123H6717f3047
10154b74939H8055a12665L9312k41348a19189B41445C8272d229G0771a70790B00876
10142A60881a03932B54148h7386o653A70056a88517d2153g350j05795A1518h9574
10130a21645A02550J13625a81693A41247B7463a17905a69n3963j13021f1830k34052
10119b95882N7140A62684n1969a8606F9064J45073B1407a20041k66854B54681
10108F4282B8403a94457G0591a34999A18294a41229r8975L1012a9107r7175J1432
10097a04850m51934a49226f7012j3196B7925b17037D1087a36175M2471j50398
10087b44102a04738A39037f9781o996I3155a20961D6458N4951e7310K7292B06452
$$ y = [56921, 199177, -46112, -246278, 147411, 107308, -91725, -164542, -72522, -276645, 86717, -63047, -274939, 88055, -112665, -73353, -314701, -119189, 241445, 38272, -4229, 70771, -170790, 200876, 160881, -103932, 254148, -87386, -94039, 170056, -188517, -42153, -7350, -113145, 11518, -89574, -121645, 102550, 216175, -181693, 141247, 27463, -117905, -169, -54132, -167153, -61830, -295882, -238742, 162684, 110715, -18606, 69064, 214137, 21407, -120041, -386895, 254681, 64282, 28403, -194457, 70591, -134999, 118294, -141229, -240204, -209192, -19107, -116282, -104850, -556784, -149226, -67012, -80208, 27925, -217037, 41087, -136175, -93704, -244102, -104738, 139037, -69781, -76777, 93155, -120961, 46458, 101409, -57310, -30018, 206452]
10075B41715C082b19084B00357i4576O565B0361a66116d4883j4265c048j19322
10064a22370A84247a4395j6497o2223a8026k42513N9963F0123O5976B8509j2185
10053A6324c9006j26925H6673e2358H2395J84597r7696a07740A41053a12412l47890
10042d60302a0786j02976H3165L72232A54689G1491L8904a50144r2321B5972a87518
10030e2015m1772d2654M189k9700B17126m8326D1183a45519j74518I3733i1256
10018a02247A8932f2838G7304a98653B3544c91779a51010b0878j63550m1380b7950
10006A0771b64998A26645f214k11495Q1580l7019A43909A3853J81368p8254b29541
9994e6747r1146j16383J08050j83907a09196B2398a35555q529M7977n5005A33313
$$ y = [241715, 3082, -219084, 200357, -94576, -88011, 20361, -166116, -44883, -59148, -3048, -122370, 184247, -14395, -30892, -93115, -18026, -260539, -200576, 60123, 126099, 28509, 16324, -39006, -165931, 86673, -52358, 82395, 266992, 169296, -107740, 141053, -112412, -460302, -10786, -113762, 83165, 455397, 154689, 71491, 110395, -150144, -242465, 25972, -187518, -52015, -93787, -42654, -38465, -68165, 217126, 168800, 41183, -145519, -320037, 93733, -91256, -102247, 18932, -62838, 77304, -198653, 23544, -391779, -151010, -20878, -184428, -225808, -27950, 10771, -264998, 126645, -6214, -217709, -136129, -173148, 143909, 13853, 195221, 116967, -229541, -56747, -147893, -264276, -156226, -340133, -109196, 22398, -135555, -144084, -96107, -151112, 133313]
9982E5892a80767a7575E0398d11651A65366a925j52861I2489a18179A8760c7921
9970H821c5584I5491a4828k69455L8492a9067j03381B55493d2480j73596A25397
9958a89368J5763l6098B45795i017l04330A14867g3607a7967k45144C4268M9694
9947H3962a31507j28692J28275j9586m9243E3664a51767j69442J52763g9523G7776
9935b98097C52643F7968f1002j77805D3247e9230E8789c19371A3825f0306A17130
9923a97991f4866J0588a5172I4677a31362j18645q9389d9838A94168b91143a28436
9911b62214d658j84572F2763B189a18401A11545h7128G4134K6010a51041r7460
9900b48501J06560e3951D1753J13596c27592J59981L935C455g3617H8425k7370
$$ y = [55892, -180767, -17575, 50398, -411651, 165366, -1925, -154786, 92489, -118179, 18760, -37921, 8821, -35584, 95491, -14828, -284283, -245791, -19067, -122448, 255493, -42480, -216076, 125397, -189368, -173605, -209703, 245795, -9017, -313347, 114867, -73607, -17967, -263111, 34268, 83962, -131507, -260199, -131924, -151510, -200753, 53664, -151767, -321209, -168446, -79523, 77776, -298097, 352643, 67968, -61002, -238807, 43247, -59230, 58789, -319371, 13825, -60306, 117130, -197991, -64866, -54278, -15172, 94677, -131362, -250007, -339396, -49838, 194168, -291143, -128436, -262214, -4658, -189230, 62763, 2189, -118401, 111545, -87128, 74134, 100144, -151041, -248501, -141941, -53951, 41753, 155349, -327592, -167611, -163676, 3455, -73617, 88425, 61055]
9889F1055L0694j9866i0886K774E32J25037h7602C4046J1687c36854B17852D2762
9876F9296d01197a55581M7220G5088b02822Q0601K0166M9814B9022c4939A28572
9864a9804k6616E2296D994e1959j81926h35j27429I1952J18592A940a24418l61331
9852d85749a21743gj88304e2145C424a5725A33694D8154P344b45105k16566f2196
9839C9369h1268j7520k63445a47115A08306a38314A45524b01183j01410Q6502
9829b16091h8580L7897B32495a28536L1390A86073c63653F548K0755N6515J8228
9818A02046b316A44195a84042A57420i9484o7330A06422K7776c8856B4887c6381
9806a74155f1018j44310H3468r188d10748g2781A26173I492c15040D5786b44879
$$ y = [61055, 91749, 71883, -90886, -88112, 532, 125569, -87602, 34046, 45733, -336854, 217852, 42762, 69296, -401197, -155581, -108361, 75088, -202822, -122221, -102055, -52241, 29022, -34939, 128572, -19804, -46420, 52296, 4994, -51959, -233885, -835, -128264, 91952, 210544, 1940, -124418, -485749, -121743, -7, -188311, -52145, 3424, -15725, 133694, 48154, 55498, -245105, -461671, -62196, 39369, -81268, -98788, -362233, -147115, 108306, -138314, 145524, -201183, -302593, -216091, -88580, -50683, 232495, -128536, -97146, 186073, -363653, 6548, 27303, 83818, 102046, -2316, 144195, -184042, 157420, -99484, -166814, 106422, 134198, -38856, 24887, -36381, -174155, -61018, -205328, 83468, 74280, -410748, -72781, 126173, 9492, -315040, 45786, -244879]
9794B44607b90293c9917k08147M8010A26098F0878M1662c5347l4791B07279a34990
9782E1526b70164N6973A7942P2542L8338a20839n1663a4704E9485L2674D994a93059
9769b15295k3641J12161C186c78446a86533B32063a62509L8401K4620j8994A54587
9757h0167j31209O8820n4306R019B8242c41615i9377j4603r8427k9484O6971J1756
9745a63164A8460b28746f2130o5936b0570B21016k8470d2579m7135G4690b0824
9733f3574c236r0591F8105a895I3345a01056M3064m0060C99358D1912N047J32777
9721A79736D8600h0766N612d221j47558m4198B51886a24156h742j75589C81336
9709b72732i551k62912J32617b4517l27496a38771A70832D2595a90769I4270c15693
$$ y = [244607, -290293, -39917, -248064, -200054, 126098, 60878, 102540, -35347, -70138, 207279, -134990, 51526, -270164, -213191, 17942, 90484, 128822, -120839, -172502, -14704, 59485, 92159, 4994, -193059, -215295, -238936, -126775, 3186, -378446, -186533, 232063, -162509, -124108, -99488, -118482, 154587, -80167, -211376, -142556, -196862, -187843, 28242, -341615, -99377, -113980, -212407, -241891, -174920, -163164, 18460, -228746, -62130, -128066, -20570, 221016, 192546, -42579, -89714, 74690, -20824, -63574, -3236, -93827, 68105, -1895, 93345, -101056, -57992, -98052, 399358, 41912, 46959, 179736, 48600, -80766, -75154, -4221, -151779, -195977, 251886, -124156, -8742, -184331, 381336, -272732, -9551, -272463, -139846, -24517, -352013, -138771, 170832, 42595, -190769, 94270, -315693]
9697a42382n7312C32625A7902F674c49806a08466B42111f8988j14144C0748f3494
9685A8044o832c3202j32669K7928N8134k38837g5737k72444f6559A57038D1181
9673A0634L9395a59350C80912B1472b78213o5051a2396j38696L7743A19601e1564
9661c2106k7166A25485d13358h4701J4890j45963L5577A07955D5383a94091p0369
9650b64460b5217E7246L0013a57302P5480a8360B160c49256j77400d1184p6564
9639a17748e4158j28220A44070n2856R659e55151f5901j9598a5672C1932K45923
9628B77855j09353B2582b85778J6097A19329a7021F6803A067b14027O1684e8301
9616c16997b2159j01278p0015b8120A789J37327D0322O0421J08445a19250a5452
$$ y = [-142382, -199694, 332625, 17902, 6674, -349806, -108466, 242111, -68988, -183132, 30748, -63494, 18044, 11212, -33202, -165871, -137943, -79809, -318646, -75737, -348181, -66559, 157038, 41181, 10634, 50029, -159350, 380912, 21472, -278213, -343264, -12396, -151092, -113349, 119601, -51564, -32106, -59272, 125485, -413358, -84701, -69811, -215774, -180197, 107955, 45383, -194091, -264460, -25217, 57246, 87259, -157302, -81822, -18360, 2160, -349256, -526656, -41184, -117748, -54158, -182378, 144070, 91214, 100873, -555151, -65901, -85499, -15672, 31932, 277855, 168502, 22582, -285778, -269681, 119329, -17021, 66803, 1067, -214027, -152343, -58301, -316997, -22159, -123437, -193452, -28120, 1789, 139116, 40322, 100743, 209188, -119250, -15452]
9604B3153J22098C9471b55158c8596k6053A21559a248k22723i8436A00565D2270
9592A17629e2878A69178j5137h6418j48751e3098m8660I5208a53561k51167I3786
9580g8467k54292B27488i6117A14942a43775c3701o1680k43224A71049m4956K0694
9569A46787o5036N5726J20636I72d7014F5418a24096r7198i8341A67188q0878
9558H6310C7957C585J9265j310b405o3806l2631k01610f2860k68356d4170j19351
9546a63521f3039m38990K42211F7038J03505M4370b06683H8898i7760A50682e5297
9534D8056a88729A54151a1417l99835a68927E9051j446N2792a13802k1697b8882
9522B04466C6113a01251I9453l2231f634j70485n4765P8748o0100j7747I9932
$$ y = [23153, 145251, 39471, -255158, -38596, -64649, 121559, -1248, -223971, -98436, 100565, 42270, 117629, -52878, 169178, 154041, -86418, -235169, -53098, -101758, 95208, -153561, -404728, 93786, -78467, -332759, 227488, -96117, 114942, -143775, -33701, -95381, -338605, 171049, 126093, 146787, 81751, 137477, 258113, 972, -47014, 65418, -124096, -221294, -98341, 167188, 86310, 37957, 3585, 22850, 21540, -2405, -66211, -98842, -300452, -62860, -331216, -44170, -163521, -63039, -502029, -259818, 67038, 170543, 214913, -206683, 88898, -97760, 150682, -55297, 48056, -188729, 154151, -11417, -411252, -168927, 59051, 57605, 110397, -113802, -135499, -28882, 204466, 36113, -101251, 99453, 67222, -6634, -177119, -231884, -153136, -213236, -230983, 99932]
9510A00275R2033a1816j67566i585B93990h963B08883C0502P9216a25202c2488
9498b59497f5388j44838A58221a8279A32775b6008k61C9209j1016a35267C07906
9486H6241a94559i6321b09B5857g7888F3015K89468B5992R5234h7036J7143k970
9474g2863C1344a49069j49122J5005P6176q35d0937H9670M7449a16019q1647c9229
9461c7218A57303e8843B07413n541f9087j19316d4043A88315F4857a75970P5097
9450a00873j38487a16901b2239F6709f3846K8769m63737B08987a41831j13090
9440b54921K4747F208P801K6028M8037L80503a6412H331b62753p8990c8207D7739
9427b93768a21514c1713C52080f6417m7338l8067D9248b23332D7399K54552a84523
$$ y = [100275, 192308, -11816, -179382, -9585, 293990, -8963, 208883, 30502, 109718, -125202, -32488, -259497, -65388, -210226, 158221, -18279, 132775, -26008, -26269, 39209, 28193, -135267, 307906, 86241, -194559, -96321, -209, 25857, -77888, 63015, 352483, 25992, 121226, -87036, -69893, -72863, 31344, -149069, -298191, -283186, -207010, -207845, -40937, 89670, 137119, -116019, -197666, -39229, -37218, 157303, -58843, 207413, 201872, -69087, -188403, -44043, 188315, 64857, -175970, -100873, -239360, -116901, -22239, 66709, -63846, -35077, -498814, 208987, -141831, -254921, -230174, 6208, 14009, 40037, 88074, 468577, -16412, 8331, -262753, -341743, -38207, 47739, -293768, -121514, -31713, 352080, -66417, -113755, -151822, 49248, -223332, 47399, 301951, -184523]
9415A10736C6935b16779c7410k1336A11834a77716a8354l00667g8053A30458e2691
9403d8520B27275a69124a6928A06855a08300o0782E6743b9225J960B53695h3275
9391h3139k7063j60485A28841A8673b15169e0360b0604j53884e623p7476j80645
9380b63744B48421B383e4881H3989a55367B32468J30682j64789a23838j57990
9370b81828f6484A13459D9454b5230k85159d994B16023d9191a121A4119c59053
9358a57059A18041a78180G8432H928c32523q7518a15722k77954i8896n7425j44862
9347c01183N9691a0509j77594k22441A60185A494K84561a74806F1095c0335m45747
9336d76082A61706O8268b01851O5952G5363c12912B15582f5011G8538J95621b00051
$$ y = [110736, 36935, -216779, -37410, -58746, 111834, -177716, -18354, -319021, -78053, 130458, -52691, -48520, 227275, -169124, -16928, 106855, -108300, -169082, 56743, -29225, -27265, 253695, -83275, -83139, -110202, -270687, 128841, 18673, -215169, -50360, -20604, -174488, -5623, -83099, -263744, 248421, 2383, -54881, 83989, -155367, 232468, 363150, 198361, -123838, -281828, -66484, 113459, 49454, -25230, -310389, -4994, 216023, -49191, -1121, 14119, -359053, -157059, 118041, -178180, 78432, 8928, -332523, -420041, -115722, -393676, -98896, -156321, -301183, -241492, -10509, -188103, -410544, 160185, 1494, 286055, -174806, 61095, -30335, -476082, 161706, 229974, -201851, -135899, 75363, -312912, 215582, -65011, 78538, 274159, -200051]
9324A09778e1883q3080k68190R8998A23004d3877b0583j31704A12746o167b32402
9312b8130B76892a48450A9258b44863F9854g7060I6053l8676J32860E9589O0694
9301A20283a64544B96182b69953H5338b73813A68269l6325c01393J19956F104
9290B2729c71882J01464d8457p6606K7285j29570J00216e0532p1498b9949A3707
9278b1010A28756h8148o7183A6477b70566p8843P8427A18004K8503a76908C3842
9266a62216M9638j33436i1642L3184j59575A78517B0867a39735B7633b09007A370
9254B49889F5713O3271c18214a8643C00412b97282G9660b81525B81399b67850
9243c77123A9854a12249A62259q0889c48151a20610j2667J4418q031p0451a0795
$$ y = [109778, -51883, -134963, -403153, -304155, 123004, -43877, -20583, -152287, 112746, 106579, -232402, -28130, 276892, -148450, 19258, -244863, 69854, -77060, 96053, 57377, 190237, 59589, 120283, -164544, 296182, -269953, 85338, -273813, 168269, 131944, -301393, -181437, 6104, 22729, -371882, -270418, -48457, -125063, -97778, -227348, -127132, -50532, -122030, -29949, 13707, -21010, 128756, -88148, -155331, 16477, -270566, -349409, -270982, 118004, 146507, -176908, 33842, -162216, -112578, -246014, -91642, -58458, -218033, 178517, 20867, -139735, 27633, -209007, 1370, 249889, 65713, 128984, -318214, -18643, 300412, -297282, 79660, -281525, 281399, -267850, -377123, 19854, -112249, 162259, 81370, -348151, -120610, -133277, -118859, -126890, -197341, -10795]
9231a46420d0298h869j47751F3769K2155M1652e9983r6726K7868e9454B63078
9219d05789a99568D9818a27572d5916n7882J5529r4311c075j11656r5714A756
9207b41326P3169B18203a02927M2639A04755m5326C1d04305J57000O3582E1295
9195A80186A7724b55237A81239d42720J29067J13425h8905A61289F2604B7328
9184a87118O0480d4836k0225B55299G9668L8078J20637a09682k43168a55604e30
9172F0003e42726K39571a31983A18656a11854e5272j48724j8106g4652B65792
9161b62481a09116G994f4457k03781N7003E0932a4974k67618a21405o2499B05523
9149a94796A49567c62416a4745B16606c20604J30546f46j59277m020D0244i0786
$$ y = [-146420, -40298, -8869, -156620, 63769, 85924, 127576, -59983, -156709, -128841, -59454, 263078, -405789, -199568, 49818, -127572, -45916, -103798, -88269, -182580, -3075, -114731, -210445, 1756, -241326, -168157, 218203, -102927, -60288, 104755, 59429, 31, -404305, -247305, -183723, 51295, 180186, 17724, -255237, 181239, -442720, -313653, -200228, -88905, 161289, 62604, 27328, -187118, -126638, -44836, -65061, 255299, 79668, 117746, 238383, -109682, -352850, -155604, -530, 60003, -542726, -303155, -131983, 118656, -111854, -55272, -203996, -222102, -74652, 265792, -262481, -109116, 7994, -64457, -268238, -211235, 50932, -14974, -282592, -121405, -183904, 205523, -194796, 149567, -362416, -14745, 216606, -320604, -190058, -646, -159923, -163943, 40244, -90786]
9137a73302B4482a23302j49798B1106b12418o871a0951m7259O127B7743a71619
9125A78679q8503c15362A11716N944b4368A22890b42370F3994f4507G1250A7061
9113a59445C18703a18580G9741a53201C202e63800a46491j98054p102b6582d813
9101b16232j93152F8272k5050g4462A81122a56086A97208D9726K41084c66947
9090c9817k96608f6866A67731L3470g1646b1221l00339C81203A4460a78355B86341
9078H260b44083I9096l2168b68126B1599a04412B30362K5449f6383B436a56827
9066c80349a37451A1558J70254A1870c40869B51551C8069a3914j13142m4653e0349
9054D24926H9452h796j49795K5302c4891l5357j52811H8302m3513e1575G8712
$$ y = [-173302, 24482, -123302, -273100, 21106, -212418, -219289, -10951, -58210, -52083, 27743, -171619, 178679, 90176, -315362, 111716, 117660, -24368, 122890, -242370, 63994, -64507, 71250, 17061, -159445, 318703, -118580, 79741, -153201, 3202, -563800, -146491, -344545, -351647, -26582, -4813, -216232, -409384, 68272, 43222, -74462, 181122, -156086, 197208, 49726, 290810, -366947, -39817, -336425, -66866, 167731, 201201, -71646, -21221, -321560, 381203, 14460, -178355, 286341, 8260, -244083, 99096, 66928, -268126, 21599, -104412, 230362, 255811, -66383, 2436, -156827, -380349, -137451, 11558, 181812, 11870, -340869, 251551, 38069, -13914, -127056, -171709, -50349, 424926, 89452, -8796, -158591, -133289, -34891, -70248, -223059, 88302, 44789, -51575, 78712]
9042a54918j0467A04938R2604J1998o4611a36031A69430a88166A10636b38125
9031A43197l9017g3763B59262a80777B8766J49086b31701A4441L0970L4966L1533
9020A11910a55676A12502c66978i041H8387l9890f4622C61753b06759g2016A59365
9008A02975a39391l15990h3943C36411E2854d0667J9341G4473k1256d259B5176
8996a74287e2415b2520j67647L0871G0925e1119q804G5996j5004J18780E0951
8984D7P7089a10671e5159j15036P5788C0925g2203l83889a4333G8093N4321E0698
8971B48013j07183a33702k77042J61269C08708i8201B44024b8245A62132E8643
8960b63229n4229J31377H0493b30444g9262j35555B71104h3402m9767n09532a21279
$$ y = [-154918, -165385, 104938, 197542, 209540, 144929, -136031, 169430, -188166, 110636, -238125, 143197, 104180, -73763, 259262, -180777, 28766, 177852, -231701, 14441, 45411, 80377, 111910, -155676, 112502, -366978, -9041, 88387, 48497, -64622, 361753, -206759, -72016, 159365, 102975, -139391, -455381, -83943, 336411, 52854, -40667, -21326, 74473, 53217, -4259, 25176, -174287, -52415, -22520, -190167, -159296, 70925, -51119, -59923, 75996, 60992, 179772, 50951, 47, 77136, -110671, -55159, -170195, -94407, 30925, -72203, -456092, -14333, 78093, 132414, 50698, 248013, 140830, -133702, -410744, -249475, 308708, -98201, 244024, -28245, 162132, 58643, -263229, -317458, -186081, 80493, -230444, -79262, -214817, 271104, -83402, -133169, -642701, -121279]
8948h1549A27436i6701A80123h0179C6713d4014i579j61355j71273I5409R620
8937A05029i3599H4539e9087K6084j62483F4642b11744d8306B3324K23815r0439
8926A56700b15064D8641d9868A60352l4555N624L07077j61079F7361J13387M11899
8915E92647a45290N4794A88999M02325k38746J59166R13211Q27846J588756L757018
8905G598575J219430m225349k246921n37579H74181j99785C03905o6809K21779
8896D58875j48218L070g5399C04119o977L017p1473j10102b33271d8690J033k11484
8884b59141A93938l4787a35331O5275A14572d5036k0352A92781f7816j44352C0428
8872C22926A16405b60705a3097k57609Q525O0254D4882b49780F6159M7067a23697
$$ y = [-81549, 127436, -96701, 180123, -80179, 36713, -44014, -9579, -170934, -342207, 95409, 105029, -93599, 84539, -59087, -33003, -195486, 64642, -211744, -48306, 23324, 247139, 156700, -215064, 48641, -49868, 160352, 125797, 131421, 438498, 277419, 67361, 180748, 592647, -145290, -90496, 188999, 591324, 352578, 511744, 1424955, 2252801, 3841557, 7598575, 8818005, 4592656, 2345735, 1808156, 874181, 674396, 303905, 237096, 458875, 310657, 313727, -75399, 304119, 297142, 300159, 228686, 118584, -233271, -48690, -47657, -259141, 193938, 159151, -135331, -70056, 114572, -45036, -65388, 192781, -67816, -212168, 30428, 322926, 116405, -260705, -13097, -270706, -262181, -201927, 44882, -249780, 66159, 113226, -123697]
8860b7456l80792a51551m13770K80065n6344I234a67508C2056a67674A32742b06019
8848a21303h63B6303O8893a15554j12571A25754k2199J9737E4438Q4510B1160
8836A18656i3375i633m8583j060j79682A15833i3984j60649a23797D50558C4694
8824I1636a26126m8036A6221a58594j56781a13406E7420b65057J2480C6882J472
$$ y = [-27456, -408248, -151551, -565321, -285256, -341600, 9234, -167508, 32056, -167674, 132742, -206019, -121303, -863, 26303, 95196, -115554, -228125, 125754, 103555, 123292, 54438, 138948, 21160, 118656, -93375, -9633, -58216, -59276, -238958, 115833, -93984, -254633, -123797, 450558, 34694, 91636, -126126, -174162, 16221, -158594, -315375, -113406, 57420, -265057, -252577, 36882, 38354]
$$ [...]
##END NTUPLES=NMR SPECTRUM
##END=
