
##TITLE=UV1044_TOSA01-ROVE100B_6099685_3XVFmsaORB
##JCAMPDX= 6.0         $$ Bruker NMR JCAMP-DX V2.0
##DATA TYPE= NMR SPECTRUM
##DATA CLASS= NTUPLES
##ORIGIN= BRUKER
##OWNER= Administrator
$$ 1.72 TOPSPIN		Version 2.1
$$ 2012-05-13 02:27:25.046 -0500  Administrator@TOPSPIN
$$ Compression mode = diff/dup
##.OBSERVE FREQUENCY= 400.13188235
##.OBSERVE NUCLEUS= ^1H
##.ACQUISITION MODE= SIMULTANEOUS (DQD)
##.ACQUISITION SCHEME= undefined
##.AVERAGES= 64
##.DIGITISER RES= 22
##SPECTROMETER/DATA SYSTEM= spect
##.PULSE SEQUENCE= noesygpps1d.comp
##.SOLVENT NAME= COFFEE_meoh
##.SHIFT REFERENCE= INTERNAL, COFFEE_meoh, 1, 14.96684
##AUDIT TRAIL= $$ (NUMBER, WHEN, WHO, WHERE, PROCESS, VERSION, WHAT)
$$ ##TITLE= Audit trail, TOPSPIN		Version 2.1
$$ ##JCAMPDX= 5.01
$$ ##ORIGIN= Bruker BioSpin GmbH
$$ ##OWNER= Administrator
$$ $$ C:\Bruker\TOPSPIN/data/COFFEE/nmr/UV1044_TOSA01-ROVE100B_6099685_3XVFmsaORB/12/pdata/1/auditp.txt
$$ ##AUDIT TRAIL=  $$ (NUMBER, WHEN, WHO, WHERE, PROCESS, VERSION, WHAT)
(   1,<2012-05-13 02:27:20.046 -0500>,<Administrator>,<TOPSPIN>,<go>,<TOPSPIN 2.1>,
      <created by zg
	started at 2012-05-13 02:15:49.843 -0500,
	POWCHK enabled, PULCHK disabled,
       configuration hash MD5:
       AF F2 23 6B 01 CD 40 DD E5 A1 38 A0 06 EA F7 77
       data hash MD5: 64K
       CB 2F 9F 20 BA FA 11 A9 2B 55 D1 99 0B 55 30 92>)
(   2,<2012-05-13 02:27:22.812 -0500>,<Administrator>,<TOPSPIN>,<proc1d>,<TOPSPIN 2.1>,
      <Start of raw data processing
       efp LB = 0.3 FT_mod = 6 PKNL = 1 PHC0 = 0 PHC1 = 0 SI = 128K 
       data hash MD5: 128K
       7E 5D 22 FD 58 FD FD 1E F8 0E 5E FB F7 C3 67 67>)
(   3,<2012-05-13 02:27:24.078 -0500>,<Administrator>,<TOPSPIN>,<proc1d>,<TOPSPIN 2.1>,
      <pk PHC0 = 37.40295 PHC1 = 0 
       data hash MD5: 128K
       39 17 79 61 86 91 E6 DD AF A2 A7 1A CD 28 44 AC>)
(   4,<2012-05-13 02:27:24.718 -0500>,<Administrator>,<TOPSPIN>,<proc1d>,<TOPSPIN 2.1>,
      <abs ABSG = 1 
       data hash MD5: 128K
       0B C7 E9 70 8C 77 62 E8 01 8F A8 D1 2F A9 84 09>)
(   5,<2012-05-13 02:27:24.781 -0500>,<Administrator>,<TOPSPIN>,<proc1d>,<TOPSPIN 2.1>,
      <abs ABSG = 2 
       data hash MD5: 128K
       74 C8 DD E2 EB 05 F0 A4 04 E3 50 A6 84 65 3A 27>)
(   6,<2012-05-13 02:27:24.843 -0500>,<Administrator>,<TOPSPIN>,<proc1d>,<TOPSPIN 2.1>,
      <abs ABSG = 3 
       data hash MD5: 128K
       C9 48 12 98 74 F3 3C 98 C2 37 E8 0B 0E C8 D7 E6>)
(   7,<2012-05-13 02:27:24.890 -0500>,<Administrator>,<TOPSPIN>,<proc1d>,<TOPSPIN 2.1>,
      <abs ABSG = 4 
       data hash MD5: 128K
       9B 8F 10 5C 4A 89 3A 5A 64 E7 A8 16 73 F7 25 E7>)
(   8,<2012-05-13 02:27:24.953 -0500>,<Administrator>,<TOPSPIN>,<proc1d>,<TOPSPIN 2.1>,
      <abs ABSG = 5 
       data hash MD5: 128K
       7A 97 E8 8E 19 53 66 54 7E EE 40 B9 CE D9 83 7D>)
$$ ##END=
$$ 
$$ $$ hash MD5
$$ $$ 91 FB 81 6C 26 4E 26 67 AA 19 DA 42 42 E7 B5 6D
##$RELAX= 
##$RELAX= 
##$RELAX= 
##$RELAX= 
##$RELAX= 
##$RELAX= 
##$RELAX= 
##$RELAX= 
$$ [...]
##$TP07= 0
##$TPNAME0= <>
##$TPNAME1= <>
##$TPNAME2= <>
##$TPNAME3= <>
##$TPNAME4= <>
##$TPNAME5= <>
##$TPNAME6= <>
##$TPNAME7= <>
##$TPOAL= (0..7)
0.5 0.5 0.5 0.5 0.5 0.5 0.5 0.5
##$TPOFFS= (0..7)
0 0 0 0 0 0 0 0
##$TUNHIN= 0
##$TUNHOUT= 0
##$TUNXOUT= 0
##$USERA1= <user>
##$USERA2= <user>
##$USERA3= <user>
##$USERA4= <user>
##$USERA5= <user>
##$V9= 5
##$VALIST= <valist>
##$VCLIST= <CCCCCCCCCCCCCCC>
##$VD= 0
##$VDLIST= <DDDDDDDDDDDDDDD>
##$VPLIST= <PPPPPPPPPPPPPPP>
##$VTLIST= <TTTTTTTTTTTTTTT>
##$WBST= 2048
##$WBSW= 25
##$XGAIN= (0..3)
0 0 0 0
##$XL= 0
##$YL= 0
##$YMAX_a= 10672530
##$YMIN_a= -5160939
##$ZGOPTNS= <>
##$ZL1= 120
##$ZL2= 120
##$ZL3= 120
##$ZL4= 120
##$ABSF1= 14.96684
##$ABSF2= -5.58569
##$ABSG= 5
##$ABSL= 3
##$ALPHA= 0
##$AQORDER= 0
##$ASSFAC= 0
##$ASSFACI= 0
##$ASSFACX= 0
##$ASSWID= 0
##$AUNMP= <proc_prof1d_extract.lims>
##$AXLEFT= 0
##$AXNAME= <>
##$AXNUC= <1H>
##$AXRIGHT= 0
##$AXTYPE= 0
##$AXUNIT= <>
##$AZFE= 0.1
##$AZFW= 0.1
##$BCFW= 0
##$BC_mod= 0
##$BYTORDP= 0
##$COROFFS= 0
##$CY= 15
##$DATMOD= 1
##$DC= 0
##$DFILT= <>
##$DTYPP= 0
##$F1P= 0
##$F2P= 0
##$FCOR= 0.5
##$FTSIZE= 131072
##$FT_mod= 6
##$GAMMA= 0
##$GB= 0
##$INTBC= 1
##$INTSCL= 1
##$ISEN= 128
##$LB= 0.3
##$LEV0= 0
##$LPBIN= 0
##$MAXI= 10000
##$MC2= 0
##$MEAN= 0
##$ME_mod= 0
##$MI= 0
##$NCOEF= 0
##$NC_proc= -3
##$NLEV= 6
##$NOISF1= 0
##$NOISF2= 0
##$NSP= 0
##$NTH_PI= 0
##$NZP= 0
##$OFFSET= 14.96684
##$PC= 1
##$PHC0= 37.40295
##$PHC1= 0
##$PH_mod= 1
##$PKNL= yes
##$PPARMOD= 0
##$PPDIAG= 0
##$PPIPTYP= 0
##$PPMPNUM= 2147483647
##$PPRESOL= 1
##$PSCAL= 4
##$PSIGN= 0
##$PYNMP= <proc.py>
##$REVERSE= no
##$SF= 400.13000551208
##$SI= 131072
##$SIGF1= 0
##$SIGF2= 0
##$SINO= 400
##$SIOLD= 131072
##$SPECTYP= <>
##$SREGLST= <1H.CDCl3>
##$SSB= 0
##$STSI= 131072
##$STSR= 0
##$SW_p= 8223.68421052632
##$SYMM= 0
##$S_DEV= 0
##$TDeff= 65536
##$TDoff= 0
##$TI= <>
##$TILT= no
##$TM1= 0
##$TM2= 0
##$TOPLEV= 0
##$USERP1= <user>
##$USERP2= <user>
##$USERP3= <user>
##$USERP4= <user>
##$USERP5= <user>
##$WDW= 1
##$XDIM= 131072
##$YMAX_p= 418620352
##$YMIN_p= -84144608
##$CURPLOT= <Network HP LaserJet P1505>
##$CURPRIN= <$Network HP LaserJet P1505>
##$DFORMAT= <normdp>
##$LAYOUT= <+/1D_H.xwp>
##$LFORMAT= <normlp>
##$PFORMAT= <normpl>
##$SURQMSG= 1
$$ End of Bruker specific parameters
$$ ---------------------------------
##NTUPLES= NMR SPECTRUM
##VAR_NAME=  FREQUENCY,     SPECTRUM/REAL,   SPECTRUM/IMAG
##SYMBOL=    X,             R,               I
##VAR_TYPE=  INDEPENDENT,   DEPENDENT,       DEPENDENT
##VAR_FORM=  AFFN,          ASDF,            ASDF
##VAR_DIM=   131072,        131072,          131072
##UNITS=     HZ,            ARBITRARY UNITS, ARBITRARY UNITS
##FACTOR=    0.0627417313425165, 1,          1
##FIRST=     8223.62146879498, -809,         -100061
##LAST=      0,             2869,            -101986
##MIN=       0,             -84144608,       0
##MAX=       8223.62146879498, 418620352,    0
$$ Real data points
##PAGE= N=1
##DATA TABLE= (X++(R..R)), XYDATA
$$ [...]
63589E88448J783J710J475J745K492L870N929P340O370L814L040N837R789J1395
63575F55037J0624J0427J2368J4788J5537J4845J4676J6147J8496K0257K0871
63564H24073K1067K1998K4136K7108L0239L2959L4787L5599L6140L7678M0736
63553A166520M4525M8011N1077N4040N6475N7298N6067N3497N0375M6474M0974
63542A725333L3765K5780J7973J0430L021l409p482r157j0320j2773j6236j9251
63530A737674k1518k4226k8147l2598l6404l8887l9762l9147l7995l7415l7066
63519A364509l5220l1005k5630k0828j7067j4009j1673j0031q278n681k741m01
63507A181945J482L889P102J0409J3124J5043J6178J6974J8536K1663K5769K9543
$$ y = [588448, 590231, 591941, 593416, 595161, 597653, 601523, 607452, 614792, 621162, 624976, 628016, 633853, 643642, 655037, 665661, 676088, 688456, 703244, 718781, 733626, 748302, 764449, 782945, 803202, 824073, 845140, 867138, 891274, 918382, 948621, 981580, 1016367, 1051966, 1088106, 1125784, 1166520, 1211045, 1259056, 1310133, 1364173, 1420648, 1477946, 1534013, 1587510, 1637885, 1684359, 1725333, 1759098, 1784878, 1802851, 1813281, 1816302, 1812893, 1805411, 1796254, 1785934, 1773161, 1756925, 1737674, 1716156, 1691930, 1663783, 1631185, 1594781, 1555894, 1516132, 1476985, 1438990, 1401575, 1364509, 1329289, 1298284, 1272654, 1251826, 1234759, 1220750, 1209077, 1199046, 1190768, 1185087, 1182346, 1181945, 1183427, 1187316, 1194418, 1204827, 1217951, 1232994, 1249172, 1266146, 1284682, 1306345, 1332114, 1361657]
63495A361657L2564L5357L8166M0743M3258M6280M9793N3251N6595N9960O2125
63484A879749O0647N4159M3763L1626J9290P861j356p602j1641j5027j8478k1550
63472B021441k3629k4769k5804k8004l2144l7488m2169m5106m7091m9358n1626
63461A614253n2527n1757n0611n0133m9631m7673m4061m0112l7033l4657l2139
63450A123919k9421k7389k6410k5395k3061j9807j7431j6781j6627j5395j3287
63439H92915j1876j1926j2620j2754j1891j0252q356p080p235q479r162p943n334
63426G68007l075k154k002j547l80J216K681L381L043K304K309L230L816K979
63412G83808J291J17k13l00k10N27J442J301J38m50L07J068O25oQ42K887M513
$$ y = [1361657, 1394221, 1429578, 1467744, 1508487, 1551745, 1598025, 1647818, 1701069, 1757664, 1817624, 1879749, 1940396, 1994555, 2038318, 2069944, 2089234, 2097095, 2095739, 2088137, 2076496, 2061469, 2042991, 2021441, 1997812, 1973043, 1947239, 1919235, 1887091, 1849603, 1807434, 1762328, 1715237, 1665879, 1614253, 1561726, 1509969, 1459358, 1409225, 1359594, 1311921, 1267860, 1227748, 1190715, 1156058, 1123919, 1094498, 1067109, 1040699, 1015304, 992243, 972436, 955005, 938224, 921597, 906202, 892915, 881039, 869113, 856493, 843739, 831848, 821596, 813240, 806160, 798925, 790446, 781284, 773341, 768007, 764932, 762778, 760776, 759229, 758849, 760065, 762746, 766127, 769170, 771474, 773783, 777013, 780829, 783808, 785099, 785216, 785003, 784703, 784493, 785020, 786462, 787763, 787901, 787451, 787758, 788826, 789451, 789445, 790287, 793174, 797687]
63395G97687N226N700N978N540N049O014Q447J0594J1360J1531J2190J3590J6008
63382I14914K0030K5254L0202L4305L8446M2774M5806M6953M8105N0823N3286
63371A350898N2113M6613L9418L3405K9721K8444K9312L1551L4402L8024M2816
63360A756717M8084N2488N5665N8076N9521N9075N6520N2307M6182L7454K6821
63349B308910J6428P560k34p265j2474j5124j6505j8810k2859k7781l2417l6386
63337B143043m0192m4755n0271n5271n7586n6728n4571n3047n1966m9832m6103
63326A582721m1696l7657l4224l1036k7507k3149j8172j3709j0806r105o981l151
63314A325528K071P174J0906J3301J5344J7859K0974K4627K8990L3928L8590M2241
$$ y = [797687, 802913, 808613, 814591, 820131, 825180, 831194, 839641, 850235, 861595, 873126, 885316, 898906, 914914, 934944, 960198, 990400, 1024705, 1063151, 1105925, 1151731, 1198684, 1246789, 1297612, 1350898, 1403011, 1449624, 1489042, 1522447, 1552168, 1580612, 1609924, 1641475, 1675877, 1713901, 1756717, 1804801, 1857289, 1912954, 1971030, 2030551, 2089626, 2146146, 2198453, 2244635, 2282089, 2308910, 2325338, 2332898, 2332664, 2325399, 2312925, 2297801, 2281296, 2262486, 2239627, 2211846, 2179429, 2143043, 2102851, 2058096, 2007825, 1952554, 1894968, 1838240, 1783669, 1730622, 1678656, 1628824, 1582721, 1541025, 1503368, 1469144, 1438108, 1410601, 1387452, 1369280, 1355571, 1344765, 1335660, 1328679, 1325528, 1327599, 1334773, 1345679, 1358980, 1374324, 1392183, 1413157, 1437784, 1466774, 1500702, 1539292, 1581533]
63302A581533M5182M8113N0915N3137N5389N8754O2591O4398O2542N7921N2151
63291B192626M5297L6547K6265J5993O787j311q244j3493j6823j8889k0874k3873
63279B220008k8394l4059l9774m4513m8008n0671n3135n5772n8195n9191n7798
63268A690498n4566n1054m7949m4553m0348l6008l2249k8867k5679k3602k3755
63257A281868k6047k9421l2840l5381l6219l5416l4018l2532l0257k7008k4274
63246I38455k3145k2299j9925j6905j5796j6948j7965j7199j5554j4337j3353
63235G45029j2158j1301j1141j0824r690q522q178p950o695m821l786m109n108
63222F40746o176p026o946n260k761j462k328m075m738l826k391j450j135j189
$$ y = [1581533, 1626715, 1674828, 1725743, 1778880, 1834269, 1893023, 1955614, 2020012, 2082554, 2140475, 2192626, 2237923, 2274470, 2300735, 2316728, 2323515, 2322204, 2313960, 2300467, 2283644, 2264755, 2243881, 2220008, 2191614, 2157555, 2117781, 2073268, 2025260, 1974589, 1921454, 1865682, 1807487, 1748296, 1690498, 1635932, 1584878, 1536929, 1492376, 1452028, 1416020, 1383771, 1354904, 1329225, 1305623, 1281868, 1255821, 1226400, 1193560, 1158179, 1121960, 1086544, 1052526, 1019994, 989737, 962729, 938455, 915310, 893011, 873086, 856181, 840385, 823437, 805472, 788273, 772719, 758382, 745029, 732871, 721570, 710429, 699605, 689915, 681393, 673215, 665265, 658570, 653749, 649963, 645854, 640746, 634570, 627544, 620598, 615338, 612577, 611115, 608787, 604712, 599974, 596148, 593757, 592307, 591172, 589983]
63208E89983j504j866j734q09L52Q31M84J05L38R54J375J473J427J289J146J335
63192E95179K000K755L161L316L465L564L791M811O748Q363Q390P269O435O181
63178F65428N682N059N767Q356J1281J2733J2598J1853J0982J0040R507R924J0945
63165G90155J1572J1253J0249R194Q732R221J0322J1200J1438J1344J1055J0044
63153I15779Q131O153M886L800J874p41k948m411n844p573q867r077q483p498
63139H85181n959m014k944l797n358m861j246L288N798N916N551N945O609P182
63125H97291Q533J1145J3855J5421J6256J7156J7285J5348J2227J0352J0317J0221
63113A055407Q855P446P249P274N971L789K241J254n93l549o299q222j0353j3394
$$ y = [589983, 588479, 586613, 584879, 584070, 584422, 585253, 585737, 585842, 586180, 587134, 588509, 589982, 591409, 592698, 593844, 595179, 597179, 599934, 603095, 606411, 609876, 613440, 617231, 622042, 628790, 637153, 645543, 652812, 659247, 665428, 671110, 676169, 681936, 690292, 701573, 714306, 726904, 738757, 749739, 759779, 769286, 779210, 790155, 801727, 812980, 823229, 832423, 841155, 850376, 860698, 871898, 883336, 894680, 905735, 915779, 923910, 930063, 934949, 938749, 940623, 939882, 936934, 932523, 926679, 919106, 910239, 901162, 892679, 885181, 879222, 875208, 872264, 868467, 863109, 858248, 857002, 860290, 866088, 872004, 877555, 883500, 890109, 897291, 905824, 916969, 930824, 946245, 962501, 979657, 996942, 1012290, 1024517, 1034869, 1045186, 1055407, 1064262, 1071708, 1078957, 1086231, 1092202, 1095991, 1098232, 1099486, 1098893, 1095344, 1089045, 1080823, 1070470, 1057076]
63099A057076j6111j6862j5974j5490j6662j8699k0208k0949k1349k0948j8619
63088H55205j4620j1225j0423j1685j2862j2705j1493r674p363n135l859l448
63076G40713k880j700n15J68N04N84L58M99J956M263N662N400M520L957L463L142
63060G70094M094O403Q162Q022P192P428Q530R498J0601J2195J2789J0967Q428
63047H84403Q360J0973J3232J3230J2378J2654J3860J4565J4155J3024J1848J1299
63035A033981J1515J1587J0533Q814P673P102N931L984K297J012j019l985o377
63022A093048p348p970r077r610q562p043o742p432p603o775n533l992j887J64
63008A003638J149J304J866L127M074M264M756O633R429J1808J3297J4654J6678
$$ y = [1057076, 1040965, 1024103, 1008129, 992639, 975977, 957278, 937070, 916121, 894772, 873824, 855205, 840585, 829360, 818937, 807252, 794390, 781685, 770192, 760518, 753155, 748020, 744161, 740713, 737833, 736133, 735618, 735786, 736290, 736874, 737232, 737731, 739687, 743950, 749612, 755012, 759532, 763489, 766952, 770094, 774188, 780591, 788753, 796775, 803967, 811395, 819925, 829423, 840024, 852219, 865008, 875975, 884403, 892763, 903736, 916968, 930198, 942576, 955230, 969090, 983655, 997810, 1010834, 1022682, 1033981, 1045496, 1057083, 1067616, 1076430, 1084103, 1091205, 1097136, 1101120, 1103417, 1104429, 1103410, 1099425, 1093048, 1085700, 1077730, 1068653, 1059043, 1050481, 1043438, 1036696, 1029264, 1021661, 1014886, 1009353, 1005361, 1003474, 1003638, 1004787, 1006091, 1007957, 1011084, 1015158, 1019422, 1024178, 1030811, 1040240, 1052048, 1065345, 1079999, 1096677]
62995A096677J9231K1579K3280K4399K5009K5098K5153K6190K8610L1351L2949
62984A379526L3177L2863L2344L1201K9612K8736K9289L0617L1627L1853L1099
62973A721944K8902K5068K0253J5511J1554Q546N982K609k540q775j4214j7958
62961A796882k0786k3415k5376k6208k6446k6463k5583k3401k0920j9192j7750
62950A541342j5658j3072j0416o981k127K826N857P141Q802J1778J4661J5935
62938A560088J5796J5298J5005J5041J5410J5827J6028J6349J7044J7149J5311
62927A734346J1871Q691O567M307Q44l211o862j0263j3940j7654k1108k4780k8988
62914A639820l2873l5416l6755l7548l7741l7137l6412l6234l5812l3759l0224
$$ y = [1096677, 1115908, 1137487, 1160767, 1185166, 1210175, 1235273, 1260426, 1286616, 1315226, 1346577, 1379526, 1412703, 1445566, 1477910, 1509111, 1538723, 1567459, 1596748, 1627365, 1658992, 1690845, 1721944, 1750846, 1775914, 1796167, 1811678, 1823232, 1831778, 1837760, 1840369, 1837829, 1829054, 1814840, 1796882, 1776096, 1752681, 1727305, 1701097, 1674651, 1648188, 1622605, 1599204, 1578284, 1559092, 1541342, 1525684, 1512612, 1502196, 1495215, 1493088, 1495914, 1501771, 1508912, 1517714, 1529492, 1544153, 1560088, 1575884, 1591182, 1606187, 1621228, 1636638, 1652465, 1668493, 1684842, 1701886, 1719035, 1734346, 1746217, 1754908, 1761475, 1765782, 1766626, 1763415, 1756553, 1746290, 1732350, 1714696, 1693588, 1668808, 1639820, 1606947, 1571531, 1534776, 1497228, 1459487, 1422350, 1385938, 1349704, 1313892, 1280133, 1249909]
62903A249909k6829k4512k2779k1217k0268j9974j9223j7271j5331j5467j7969
62892A029069k0534k0440j7377j3791j2387j3380j4668j4631j3982j4320j5583
62881H57976j6061j4759j2584j1004j0381r986r077p591o198n855o738p688p393
62868G32661o116n375n632n506l877j654m89n69p81n64l31k65R4J066K401L672
62852G08735M338L741J988O57J384L648N152M654L269K549K517K359K047K301
62838G49339L485N370P473R031R191P945O370N267M181K560J099Q50J410J297
62824H14868j12k115m008n653o664o426n249m480m816n477n544n255n271n433
62810G48365n147m596m665n797p437q534q262o507m183k732k761l371l349k807
$$ y = [1249909, 1223080, 1198568, 1175789, 1154572, 1134304, 1114330, 1095107, 1077836, 1062505, 1047038, 1029069, 1008535, 988095, 970718, 956927, 944540, 931160, 916492, 901861, 887879, 873559, 857976, 841915, 827156, 814572, 803568, 793187, 783201, 774124, 766533, 760335, 754480, 747742, 740054, 732661, 726545, 721170, 715538, 710032, 706155, 704501, 704012, 703443, 702662, 702098, 701767, 701502, 701596, 702662, 705063, 708735, 713073, 716814, 718802, 719459, 720843, 724491, 729643, 734297, 737566, 740115, 742632, 744991, 747038, 749339, 752824, 758194, 765667, 774698, 783889, 791834, 798204, 803471, 807652, 810212, 811311, 812161, 813571, 814868, 814756, 812641, 808633, 802980, 796316, 789890, 784641, 780161, 775345, 769868, 764324, 759069, 753798, 748365, 743218, 738622, 733957, 728160, 720723, 712189, 703927, 697420, 693237, 690505, 687744, 684373, 681024, 678217]
62796F78217k889l914m647l842j800J18J069J185P37k74j531k168j675o20M4R7
62780F58107m3j89l80j72J094L000L938K860N74j136j238K04K660N309O973O812
62764F88373N076K721M99j078j464n85N85Q76L01j29K11J143K412L888N007N086
62748G12922M403M057M506N056N088M907N003N275N418N495N652N882O417P751
62734G87832R858J1958J3404J4347J5188J5989J6764J7783J9148K0632K2321K4766
62722I89990K8074L1390L3896L5809L7787L9776M1085M1423M1161M0586L9317
62711A400294L6539L1855K5909J9981J4669R238K862l775r110j2915j6704k1559
62699A477284k6594l0168l1759l2022l1838l2053l3315l5320l6703l6503l5232
$$ y = [678217, 675328, 671414, 666767, 662925, 661125, 661243, 662312, 663497, 664234, 663960, 662429, 660261, 658586, 657966, 658010, 658107, 658064, 657875, 657495, 657323, 658417, 661417, 665355, 668215, 668789, 667653, 666415, 666619, 669279, 674588, 681561, 688373, 693449, 696170, 696669, 695591, 694127, 693542, 694127, 695003, 695304, 695175, 695386, 696529, 698941, 702829, 707836, 712922, 717325, 721382, 725888, 730944, 736032, 740939, 745942, 751217, 756635, 762130, 767782, 773664, 780081, 787832, 797690, 809648, 823052, 837399, 852587, 868576, 885340, 903123, 922271, 942903, 965224, 989990, 1018064, 1049454, 1083350, 1119159, 1156946, 1196722, 1237807, 1279230, 1320391, 1360977, 1400294, 1436833, 1468688, 1494597, 1514578, 1529247, 1538485, 1541347, 1537572, 1528462, 1515547, 1498843, 1477284, 1450690, 1420522, 1388763, 1356741, 1324903, 1292850, 1259535, 1224215, 1187512, 1151009, 1115777]
62688A115777l3845l2287k9930k6925k4228k2426k1305k0293j8855j6791j4720
62677H54172j3705j3807j3534j1559q525o213n328n047m546l959l758l914l818
62664G56459k687k31K714M574M535L488L033L984O121Q765J0958J1856J1747J2085
62650H37401J3734J5896J7651J9687K3062K6950K9380L0113L1042L3458L6452
62639A114826L8570L9757M0916M2435M4002M5150M5361M4037M1104L7387L3869
62628A567414L0507K6100J9511J1104K838l438p856j2259j7955k4408l0354l5290
62616A525914l9207m1768m2794m2904m2717m1959m0432l9141l9088l9379l8043
62605A078482l4670l0847k8018k6215k4960k3996k2969k1575k0267j9708j9365
$$ y = [1115777, 1081932, 1049645, 1019715, 992790, 968562, 946136, 924831, 904538, 885683, 868892, 854172, 840467, 826660, 813126, 801567, 793042, 786829, 781501, 776454, 771908, 767949, 764191, 760277, 756459, 753772, 753541, 756255, 760829, 765364, 768852, 771885, 775869, 781990, 790755, 801713, 813569, 825316, 837401, 851135, 867031, 884682, 904369, 927431, 954381, 983761, 1013874, 1044916, 1078374, 1114826, 1153396, 1193153, 1234069, 1276504, 1320506, 1365656, 1411017, 1455054, 1496158, 1533545, 1567414, 1597921, 1624021, 1643532, 1654636, 1657474, 1654036, 1646180, 1633921, 1615966, 1591558, 1561204, 1525914, 1486707, 1444939, 1402145, 1359241, 1316524, 1274565, 1234133, 1194992, 1155904, 1116525, 1078482, 1043812, 1012965, 984947, 958732, 933772, 909776, 886807, 865232, 844965, 825257, 805892]
62594H05892j7983j5594j3570j2385j0851q371o465o843q847j0042q932o293m023
62581F75693l348l964m614m415l598k740j754k96J216J920J621O86q31k719l600
62566F49257k102Q50K585J965M99k47o18j344j789j048L50J242J489J690K014
62551F54793K435L377M980O377O796O884P799R398J0439J0321R606R068R065R804
62537G61142J1318J3176J4776J5931J6776J7235J6982J5889J4288J2896J2360
62526I22769J2419J1694R017M974J289j259l338n483p389r088j1279j3858j5551
62513H94917j5779j5584j5855j6048j5670j5474j5853j5559j3741j1941j2001
62502G31412j2922j2046q911n771m339m027l688l317l470m234n187n561m485k107
$$ y = [805892, 787909, 772315, 758745, 746360, 735509, 727138, 720673, 713830, 704983, 694941, 686009, 679716, 675693, 672345, 668381, 663767, 659352, 655754, 653014, 651260, 650964, 652180, 654100, 655721, 656407, 655576, 652857, 649257, 647155, 648005, 650590, 652555, 653054, 652807, 652189, 650845, 649056, 648008, 648358, 649600, 651089, 652779, 654793, 657228, 660605, 665585, 671962, 678758, 685642, 693441, 702839, 713278, 723599, 733205, 742273, 751338, 761142, 772460, 785636, 800412, 816343, 833119, 850354, 867336, 883225, 897513, 910409, 922769, 935188, 946882, 955899, 960873, 962162, 960903, 957565, 952082, 944693, 935605, 924326, 910468, 894917, 879138, 863554, 847699, 831651, 815981, 800507, 784654, 769095, 755354, 743413, 731412, 718490, 706444, 697533, 691762, 687423, 683396, 679708, 676391, 672921, 668687, 663500, 657939, 653454, 651347]
62488F51347k17n71k578l874l129j085J034K672L474L130K078J221P76M60P21
62473F55459K274M405N417N206N621P505R076Q517O823O592Q805J2062J4572J5745
62459G68079J6178J6989J8944K1558K3431K4091K4877K7133L0031L1388L0507
62448A033206K8915K8034K7239K4918K0848J6543J3385J1181Q870O036L212Q44
62436A223231j320l642n787o916o495m716k337j71J543L339N743Q231R675J0124
62422A230502J1269J4452J8808K2157K3263K2387K0192J7219J4173J1571Q953
62411A414946N306K89n566j1654j7497k2380k5765k7985k9703l0941l1565l2311
62399A185174l3926l5493l5222l3058l0889k9783k8715k6680k4331k2460k0342
$$ y = [651347, 651130, 650559, 647981, 644107, 640978, 639893, 640927, 643599, 647073, 650203, 652281, 653502, 654278, 654738, 655459, 657733, 662138, 667555, 672761, 678382, 685887, 694963, 703480, 710303, 716895, 725700, 737762, 752334, 768079, 784257, 801246, 820190, 841748, 865179, 889270, 914147, 941280, 971311, 1002699, 1033206, 1062121, 1090155, 1117394, 1142312, 1163160, 1179703, 1193088, 1204269, 1213139, 1219175, 1222387, 1223231, 1221911, 1218269, 1212482, 1205566, 1199071, 1194355, 1192018, 1191847, 1193390, 1196729, 1202472, 1210703, 1220378, 1230502, 1241771, 1256223, 1275031, 1297188, 1320451, 1342838, 1363030, 1380249, 1394422, 1405993, 1414946, 1420252, 1420541, 1414975, 1403321, 1385824, 1363444, 1337679, 1309694, 1279991, 1249050, 1217485, 1185174, 1151248, 1115755, 1080533, 1047475, 1016586, 986803, 958088, 931408, 907077, 884617, 864275]
62388H64275j7127j3835j2279j2506j2714j1519r176o692m778l714l417l516l755
62375G49247m119m199l101p99J026O64j381k972l074k649k706k869k631k773m281
62360G13383o486p554o784n287m176l185j716l78k63j077j247k0J583K404K668
62345F81865L108L476L055K163J898K455K838K482K081K553L928N658P387Q982
62331G33929J0285J1112J1320J0888J0223J0096J0735J1387J1592J2316J4615
62320H58498J7564J9243J9681K0851K3364K5362K5696K6033K8147L0903L2129
62309A127471L2290L3862L7722M2511M7367N2774N8505O3149O6638P1122P7969
62298A711380Q5421R0702R3442R5364R7210R7578R4785Q8618P9881O9211N6924
$$ y = [864275, 847148, 833313, 821034, 808528, 795814, 784295, 775119, 768427, 763649, 759935, 756518, 753002, 749247, 745128, 740929, 737828, 737029, 738055, 738719, 737338, 734366, 731292, 728643, 725937, 723068, 720437, 717664, 713383, 706897, 699343, 692559, 687272, 683096, 679911, 678195, 677817, 677554, 676477, 675230, 675210, 676793, 679197, 681865, 684973, 688449, 691504, 693667, 695565, 698020, 700858, 703340, 705421, 707974, 711902, 717560, 724947, 733929, 744214, 755326, 766646, 777534, 787757, 797853, 808588, 819975, 831567, 843883, 858498, 876062, 895305, 914986, 935837, 959201, 984563, 1010259, 1036292, 1064439, 1095342, 1127471, 1159761, 1193623, 1231345, 1273856, 1321223, 1373997, 1432502, 1495651, 1562289, 1633411, 1711380, 1796801, 1887503, 1980945, 2076309, 2173519, 2271097, 2365882, 2454500, 2534381, 2603592, 2660516]
62287B660516M3666L0476J8070O261n560j7244k7752l6641m5224n5029o5094p2185
62275B434260p4475p3975p4032p5122p4685p0989o5503o0898n8070n6098n4149
62264A696264n2135m9968m7489m5138m3659m2832m1378l8556l5125l2361l0680
62253A236943k9718k9183k8942k8567k7538k5862k3980k2083j9844j6859j3159
62242I71208r426o789o016o506o580n254l356k257j947j234M19K276L634M744
62228I32916O026P175P543P032O270O080O918Q485R944J0906J1994J3800J5574
62215A050663J6048J5626J6486J9881K4330K7365K8384K8981L0969L4879M0087
62204A333699M5581N0677N5548O0916O6936P2747P7600Q1987Q7008R2712R7711
$$ y = [2660516, 2704182, 2734658, 2752728, 2758989, 2753429, 2736185, 2708433, 2671792, 2626568, 2571539, 2506445, 2434260, 2359785, 2285810, 2211778, 2136656, 2061971, 1990982, 1925479, 1864581, 1806511, 1750413, 1696264, 1644129, 1594161, 1546672, 1501534, 1457875, 1415043, 1373665, 1335109, 1299984, 1267623, 1236943, 1207225, 1178042, 1149100, 1120533, 1092995, 1067133, 1043153, 1021070, 1001226, 984367, 971208, 961782, 954993, 948977, 942471, 935891, 930637, 927281, 925024, 923077, 921843, 922262, 924538, 928172, 932916, 938942, 946117, 953660, 960692, 966962, 973042, 979960, 988445, 998389, 1009295, 1021289, 1035089, 1050663, 1066711, 1082337, 1098823, 1118704, 1143034, 1170399, 1198783, 1227764, 1258733, 1293612, 1333699, 1379280, 1429957, 1485505, 1546421, 1613357, 1686104, 1763704, 1845691, 1932699, 2025411, 2123122]
62193B123122J00360R9742R5587Q7854P6735O2896M7508L1961J7423M468o891
62182B740765j7113k7095l7816m9269n9930o8121p3934p8924q3733q7018q7296
62171B070516q4910q1447p7893p4172p0031o5600o1255n7408n4158n0857m6685
62160A346100m1921l7846l4886l1908k8110k4489k2224k0589j8045j4841j2819
62149A058422j2703j3142j2594j0867q563o243m389l162j998l63J110J480J477
62136I88465K997O134Q395P905O079N791P854J0656J2740J4152J5407J6550J7610
62123A120735J8974K0701K2020K2123K1275K0790K1843K4397K7295K9382L0616
62112A380151L2065L4919L9519M5290N1305N6827O1505O5331O8498P1082P2672
$$ y = [2123122, 2223482, 2323224, 2418811, 2506665, 2583400, 2646296, 2693804, 2725765, 2743188, 2747656, 2740765, 2723652, 2696557, 2658741, 2609472, 2549542, 2481421, 2407487, 2328563, 2244830, 2157812, 2070516, 1985606, 1904159, 1826266, 1752094, 1682063, 1616463, 1555208, 1497800, 1443642, 1392785, 1346100, 1304179, 1266333, 1231447, 1199539, 1171429, 1146940, 1124716, 1104127, 1086082, 1071241, 1058422, 1045719, 1032577, 1019983, 1009116, 1000553, 994310, 989921, 986759, 984761, 984398, 985508, 986988, 988465, 991462, 997596, 1005991, 1013896, 1019975, 1025766, 1033620, 1044276, 1057016, 1071168, 1086575, 1103125, 1120735, 1139709, 1160410, 1182430, 1204553, 1225828, 1246618, 1268461, 1292858, 1320153, 1349535, 1380151, 1412216, 1447135, 1486654, 1531944, 1583249, 1640076, 1701581, 1766912, 1835410, 1906492, 1979164]
62101A979164P2284O8904O2441N4045M5103L5886K5697J4427L261o535j5004k3099
62089B316574l1381l9623m7237n3382n7190n8682n9141n9648n9614n7776n4432
62078A738468n1322m9204m6903m3149l8235l3254k8669k4461k0863j8081j5761
62067A368566j3367j0769p975m772j169K288N207P951J0921J3659J5430J6396
62055A402366J7424J8668J9074J7572J4425J1131R101Q500Q386P849O686M852
62043A546034J810k778p895j1610j3067j3242j3456j3820j3597j2407j0381p705
62031A427886m725k131k92J385L806O964R971J2251J4238J6844K0463K4533K7969
62018A559162L0237L2015L4434L7659M0764M3107M5012M6872M8502N0039N2362
$$ y = [1979164, 2051448, 2120352, 2182793, 2236838, 2281941, 2317827, 2343524, 2357951, 2361212, 2354677, 2339673, 2316574, 2285193, 2245570, 2198333, 2144951, 2087761, 2029079, 1969938, 1910290, 1850676, 1792900, 1738468, 1687146, 1637942, 1591039, 1547890, 1509655, 1476401, 1447732, 1423271, 1402408, 1384327, 1368566, 1355199, 1344430, 1336455, 1331683, 1330514, 1332802, 1338009, 1345960, 1356881, 1370540, 1385970, 1402366, 1419790, 1438458, 1457532, 1475104, 1489529, 1500660, 1509761, 1518261, 1526647, 1534496, 1541182, 1546034, 1547844, 1545066, 1537171, 1525561, 1512494, 1499252, 1485796, 1471976, 1458379, 1445972, 1435591, 1427886, 1423161, 1421030, 1420738, 1422123, 1425929, 1432893, 1442864, 1455115, 1469353, 1486197, 1506660, 1531193, 1559162, 1589399, 1621414, 1655848, 1693507, 1734271, 1777378, 1822390, 1869262, 1917764, 1967803, 2020165]
62007B020165N5715N8726O0064O0351O0995O1579O0113N5850N0078M3741L6073
61996B623450K6433J6081O809j328r618j8564k7409l5526m3090n0351n7055o2840
61984B366992o7472p0577p1759p1225o9738o7740o5062o1714n8425n5855n3599
61973A653826n0615m6663m2801m0197l8688l6889l3766k9888k6825k5302k4320
61962A257872k2483k0016j8685j9392k0564j9809j6939j4226j3473j3877j3540
61951A064868j2147j0949j0468r715p912n827m653m419m287l828l148k107m24
61938I84984J415K191J222q69k881m202m959n401n484n120m582m482n246o612
61924I39974p880q655r120r474r499r031q481q415q698q674q156p602p222o509
$$ y = [2020165, 2075880, 2134606, 2194670, 2255021, 2316016, 2377595, 2437708, 2493558, 2543636, 2587377, 2623450, 2649883, 2665964, 2672773, 2671445, 2661827, 2643263, 2615854, 2580328, 2537238, 2486887, 2429832, 2366992, 2299520, 2228943, 2157184, 2085959, 2016221, 1948481, 1883419, 1821705, 1763280, 1707425, 1653826, 1603211, 1556548, 1513747, 1473550, 1434862, 1397973, 1364207, 1334319, 1307494, 1282192, 1257872, 1235389, 1215373, 1196688, 1177296, 1156732, 1136923, 1119984, 1105758, 1092285, 1078408, 1064868, 1052721, 1041772, 1031304, 1021589, 1013677, 1007850, 1003197, 998778, 994491, 990663, 987515, 985408, 984984, 986399, 988590, 989812, 988943, 986062, 981860, 976901, 971500, 966016, 960896, 956314, 951832, 946586, 939974, 932094, 923439, 914319, 904845, 895346, 886315, 877834, 869419, 860721, 852047, 843891, 836289, 829067, 822558]
61910H22558n084l488k540k233j984j856k613m156m797l006M37L099L771L626
61896H01734M085M692M205K959K667M034O074Q003J0274J3150J5623J6784J7255
61883I11539J8150J9426K0455K1519K3402K5868K7863K9021K9715K9841K8910
61872A185709K7353K6337K6027K5344K3757K1949K0257J7857J4198R992O010K111
61860A406901j652m270n237n679o621p183o029l744k020q90J185M600P837R693
61846A386891J0589J1243J1614J1672J1669J0953Q053K969k063n268p607j1013
61834A439702j5347j8804k0634k1721k2751k3523k4060k4788k5278k4306k1793
61823A196697j9414j8580j8794j8733j8027j7073j5962j4589j3361j2631j1789
$$ y = [822558, 817474, 813986, 811446, 809213, 807229, 805373, 802760, 798604, 793807, 790801, 791238, 794337, 798108, 801734, 805819, 810511, 814716, 817675, 820342, 824376, 830450, 838453, 848727, 861877, 877500, 894284, 911539, 929689, 949115, 969570, 991089, 1014491, 1040359, 1068222, 1097243, 1126958, 1156799, 1185709, 1213062, 1239399, 1265426, 1290770, 1314527, 1336476, 1356733, 1374590, 1388788, 1398780, 1404790, 1406901, 1405249, 1400979, 1395742, 1390063, 1383442, 1376259, 1370230, 1366486, 1364466, 1363576, 1364761, 1369361, 1377198, 1386891, 1397480, 1408723, 1420337, 1432009, 1443678, 1454631, 1462684, 1465653, 1463590, 1458322, 1450715, 1439702, 1424355, 1405551, 1384917, 1363196, 1340445, 1316922, 1292862, 1268074, 1242796, 1218490, 1196697, 1177283, 1158703, 1139909, 1121176, 1103149, 1086076, 1070114, 1055525, 1042164, 1029533, 1017744]
61812A017744r966p539n819n182m451k608j83J718L181N299Q483J1770J4107J5773
61798A042327J7928K1007K4021K5791K6541K7780L0567L4288L7579M0154M2980
61787A370963M6505M9339M9508M6791M3043L9915L6901L2232K5433J8146J2353
61776A771129Q319M779Q05l078n588o094n024l125p34K033M577N885N662M990
61762A784536N186O006N757L386l23m165q322j3724k0046k5638k9579l2710l6141
61749A634223l9563m1643m1673m0224l8471l7252l6538l5506l3366l0323k7378
61738A232286k5123k3242k1407j9842j8650j7309j5532j3953j3098j2298j0653
61727A041179q688p840q434r334r687r829j0120j0001q840o971n275m355m459
$$ y = [1017744, 1007778, 1000239, 994420, 989238, 984787, 982179, 981996, 983714, 986895, 992194, 1000677, 1012447, 1026554, 1042327, 1060255, 1081262, 1105283, 1131074, 1157615, 1185395, 1215962, 1250250, 1287829, 1327983, 1370963, 1417468, 1466807, 1516315, 1563106, 1606149, 1646064, 1682965, 1715197, 1740630, 1758776, 1771129, 1779448, 1784227, 1785032, 1781954, 1776366, 1770272, 1765248, 1762123, 1761389, 1763422, 1767999, 1773884, 1779546, 1784536, 1789722, 1795728, 1801485, 1804871, 1804548, 1800383, 1792061, 1778337, 1758291, 1732653, 1703074, 1670364, 1634223, 1594660, 1553017, 1511344, 1471120, 1432649, 1395397, 1358859, 1323353, 1289987, 1259664, 1232286, 1207163, 1183921, 1162514, 1142672, 1124022, 1106713, 1091181, 1077228, 1064130, 1051832, 1041179, 1032491, 1024651, 1016217, 1006883, 997196, 987367, 977247, 967246, 958406, 951435, 946160, 941805, 937346]
61714I37346n513o666o645n244l896l866m445l935k028p4R03J218J363J060J15
61699H99693p25o97j96j33l18M18K463M624N478M910L813K735J574L27n57q06
61683I22603o97o03m48M7Q14J437J622J468J363J697K522L359L582L152K722K861
61667I47501L409L808L775L403K876K523K884M234O069P507Q076P797O746N080
61653A015688L377K329J976J762J381J138J398K069K765L067K598J311k73j538
61639A039048k409l099l378k868k003j832k637l645m401n484p239q701q648p287
61625I75417o031n886o607p191o711m959k784j437j206j246j109j598l249m846
61611I20557m764l362k536k971l322k486j311j298k498l599l512k193l18J206
$$ y = [937346, 931833, 925167, 918522, 913278, 909382, 905516, 901071, 897136, 895108, 895034, 895937, 897155, 898518, 899578, 899693, 898968, 898271, 898075, 897942, 897624, 898042, 900505, 905129, 910607, 915517, 919330, 922065, 923639, 923966, 923409, 922603, 921906, 921303, 920855, 920902, 921716, 923153, 924775, 926243, 927606, 929303, 931825, 935184, 938766, 941918, 944640, 947501, 950910, 954718, 958493, 961896, 964772, 967295, 970179, 974413, 980482, 987989, 996065, 1003862, 1010608, 1015688, 1019065, 1021394, 1023370, 1025132, 1026513, 1027651, 1029049, 1031118, 1033883, 1036950, 1039548, 1040859, 1040586, 1039048, 1036639, 1033540, 1030162, 1027294, 1025291, 1023459, 1020822, 1017177, 1012776, 1007292, 1000053, 991352, 982704, 975417, 969386, 963500, 956893, 949702, 942991, 938032, 935248, 933811, 932605, 931359, 930250, 928652, 925403, 920557, 915793, 912431, 909895, 906924, 903602, 901116, 899805, 898507, 896009, 892410, 888898, 886705, 886387, 887593]
61597H87593J675J087J66m08o02p24p90n26K73J545K954L955M203L976L912M138
61581I12427M116L535K814K398K020J140j93j389k086k426k695k978l088k715
61567I10880j832j031j044j752k194j859j421j659k286k597k806l690n050n611
61553H76048m635k815j392j105k204m502o933p903o851m967l848l897m619n749
61539H14628p184q233q119p144o404o207n848n146n098o307p684p665o298n149
61525G22142n264o115o671o720o708o858o942o763o437o134n841n430m859m224
61511F37176l574k821j896j034p80j536l092m654n355m857l542k215j470j212
61497E99138q83k05M19L85l47j183j512j312j079j246j661j607n07J297K608K436
$$ y = [887593, 889268, 890355, 890521, 890113, 889511, 888787, 887997, 887471, 887744, 889289, 892243, 896198, 900401, 904377, 908289, 912427, 916543, 920078, 922892, 925290, 927310, 928450, 928257, 926868, 924782, 922356, 919661, 916683, 913595, 910880, 909048, 908017, 906973, 905221, 903027, 901168, 899747, 898088, 895802, 893205, 890399, 886709, 881659, 876048, 871413, 868598, 867206, 866101, 863897, 859395, 852462, 844559, 837708, 832741, 828893, 824996, 820377, 814628, 807444, 799211, 791092, 783948, 777544, 771337, 765489, 760343, 755245, 748938, 741254, 733589, 727291, 722142, 716878, 710763, 704092, 697372, 690664, 683806, 676864, 670101, 663664, 657530, 651689, 646259, 641400, 637176, 633602, 630781, 628885, 627851, 627071, 625535, 622443, 617789, 612434, 607577, 604035, 601820, 600350, 599138, 598255, 598050, 598469, 598854, 598507, 597324, 595812, 594500, 593421, 592175, 590514, 588907, 588400, 589697, 592305, 594741]
61481E94741R90m83q73j52P69J127J170J755L021L824L007J046l67m70k51o96
61465F08158j270r88l06n36j688k220j282j3k6j386k761l056k359j505j225j527
61449E86010j711j151j49M15K86N1Pl69j295j829j013N28J176L87o85q39l29l09
61431E79181j216k240k308j220K55J260J654J895K283K536K151J037l04j099q51
61416E83014K65J497K159K168J848J373P52J59k00m98j050j648j696j097m03o2
61400E86581j04o07j646k511k036j98J390J370K67m64k93L36J092J760J723O47
61384E87307n18m35Q83K286L249M104M576L693J614J33M77J714K231J888J638
61369F14840J758J640J050M82L10N10J194K545M104M960M808M194L480K457J267
$$ y = [594741, 595731, 595248, 594375, 594223, 594992, 596119, 597289, 599044, 602065, 605889, 608896, 609942, 609575, 609105, 608854, 608158, 606888, 605900, 605594, 605058, 603370, 601150, 599868, 599855, 599829, 598443, 595682, 592626, 590267, 588762, 587537, 586010, 584299, 583148, 582999, 583414, 583700, 583751, 583758, 583389, 582094, 580265, 579252, 579780, 580956, 581343, 580658, 579819, 579490, 579181, 577965, 575725, 573417, 572197, 572452, 573712, 575366, 577261, 579544, 582080, 584231, 585268, 584964, 583865, 583014, 583279, 584776, 586935, 589103, 590951, 592324, 593076, 593235, 593035, 592537, 591487, 589839, 588143, 587046, 586643, 586581, 586477, 585870, 584224, 581713, 579677, 579479, 580869, 582239, 582506, 582042, 581749, 582085, 583177, 584937, 586660, 587307, 586789, 586354, 587237, 589523, 592772, 596876, 601452, 605145, 606759, 606892, 607369, 609083, 611314, 613202, 614840, 616598, 618238, 619288, 619770, 620080, 620590, 621784, 624329, 628433, 633393, 638201, 642395, 645875, 648332, 649599]
61354F49599R13J969L362L429K037O92M10M56l73j993l350l930m043l767k705
61339F42706j068j73j107l200m434l541j366K9m04j642j938r47O1K36L41J250
61323F24803K187J780M29N4J294K560K376J241L96R8K16J245L286M883M568L047
61307F54463K289K750L200L132L497M605N079L855K015J504K792M749O243O962
61293G07135O973O502O112O439P518Q749R592J0105J0686J1533J2467J3099J3032
61280H29942J1930R805P454O247O767P744P164M675K056Q28L84o41k067k575j973
61265H87740j526j982k582k420j668r90n52k00L8M6j11j96K04J536L523M841M436
61248H90137L200L175N016P328Q779R585J0343J0674J0032R033Q760R078Q641
$$ y = [649599, 650512, 652481, 655843, 659272, 661309, 662001, 662411, 662867, 662494, 660501, 657151, 653221, 649178, 645411, 642706, 641638, 641465, 640358, 637158, 632724, 629183, 627817, 627846, 627442, 625800, 623862, 622915, 622976, 623212, 623553, 624803, 626990, 628770, 629199, 629253, 630547, 633107, 635483, 636724, 637120, 637218, 637434, 638679, 641965, 646848, 651416, 654463, 656752, 659502, 662702, 665834, 669331, 673936, 679015, 682870, 684885, 686389, 689181, 693930, 700173, 707135, 714108, 720610, 726722, 733161, 740679, 749428, 759020, 769125, 779811, 791344, 803811, 816910, 829942, 841872, 851677, 859131, 865378, 872145, 879889, 887053, 891728, 893784, 894612, 894996, 894355, 892288, 889713, 887740, 886214, 884232, 881650, 879230, 877562, 876572, 876020, 875820, 875858, 875904, 875793, 875597, 875801, 877337, 880860, 885701, 890137, 893337, 896512, 901528, 908856, 917635, 927220, 937563, 948237, 958269, 967302, 976062, 985140, 993781]
61235I93781O475L032k53k127k480k438l170m561n543n713n678n592m614k649
61221I58470j398k232l788l322m34K236K437J186J291L828P151R175R550R211
61207I93361Q697P901P272P995J0395J2978J4083J3943J3989J4458J4199J3043
61195A132314J2678J4229J6205J6160J3707J0676Q676P707O983N916M088J266
61183A250605k051m742o206o968p811q618q567p391n911n135n031m688l617k467
61169A171402k037j990j186P81K847L592K680J168N31J429L189M525M899M869
61155A196699M956M752L745K513K156K847L785M426M743M493L427K182J834K405
61141A244963K973L348M420O535Q816J0448J1523J2316J3092J4929J8981K4229
$$ y = [993781, 1000256, 1003288, 1003035, 1000908, 998428, 995990, 992820, 988259, 982716, 977003, 971325, 965733, 961119, 958470, 957072, 954840, 951052, 947730, 947296, 949532, 951969, 953155, 954446, 958274, 965425, 974600, 984150, 993361, 1002058, 1009959, 1017231, 1025226, 1035621, 1048599, 1062682, 1076625, 1090614, 1105072, 1119271, 1132314, 1144992, 1159221, 1175426, 1191586, 1205293, 1215969, 1224645, 1232352, 1239335, 1245251, 1249339, 1250605, 1248554, 1243812, 1237606, 1230638, 1222827, 1214209, 1205642, 1198251, 1192340, 1187205, 1182174, 1177486, 1173869, 1171402, 1169365, 1167375, 1166189, 1166970, 1169817, 1173409, 1176089, 1177257, 1177788, 1179217, 1182406, 1186931, 1191830, 1196699, 1201655, 1206407, 1210152, 1212665, 1214821, 1217668, 1221453, 1225879, 1230622, 1235115, 1238542, 1240724, 1242558, 1244963, 1247936, 1251284, 1255704, 1262239, 1271055, 1281503, 1293026, 1305342, 1318434, 1333363, 1352344, 1376573]
61129A376573K7601K7422K5302K3573K2390K0811J9097J8058J7134J5293J3168
61118A606422J2367J2806J2613J0737Q114O002M533L244J925N15j170l253n775
61105A669080q779j2050j4954j6906j7852j8019j7782j7815j8490j8834j7380
61094A490219j4623j3035j3658j4379j3121j1062j0520j0910r532n859k386j129
61082A370005j644k846m501o230o968o421n720n880o599p082o869n537k751Q20
61068A301777L692N193O138P634R959J2695J5274J7369J9447K2524K6507K9568
61056A477777L0509L0911L3038L6211L7670L6935L6649L8633M1496M3051M2876
61045A885756M1337L8293L4146L0438K7839K4921K0413J5360J1627R224O592K780
$$ y = [1376573, 1404174, 1431596, 1456898, 1480471, 1502861, 1523672, 1542769, 1560827, 1577961, 1593254, 1606422, 1618789, 1631595, 1644208, 1654945, 1663059, 1669061, 1673594, 1676838, 1678763, 1679278, 1678108, 1674855, 1669080, 1660301, 1648251, 1633297, 1616391, 1598539, 1580520, 1562738, 1544923, 1526433, 1507599, 1490219, 1475596, 1462561, 1448903, 1434524, 1421403, 1410341, 1399821, 1388911, 1379379, 1373520, 1371134, 1370005, 1368361, 1365515, 1361014, 1354784, 1347816, 1341395, 1335675, 1329795, 1323196, 1316114, 1309245, 1303708, 1300957, 1301777, 1305469, 1310662, 1316800, 1324434, 1334393, 1347088, 1362362, 1379731, 1399178, 1421702, 1448209, 1477777, 1508286, 1539197, 1572235, 1608446, 1646116, 1683051, 1719700, 1758333, 1799829, 1842880, 1885756, 1927093, 1965386, 1999532, 2029970, 2057809, 2082730, 2103143, 2118503, 2130130, 2139354, 2145946, 2148726]
61033B148726j910o675j0650j3361j5670j9425k5043l0277l2492l1576k9676k8653
61021A903318k8773k9285k9363k8667k7555k6385k4568k1181j6789j3443j2315
61010A644994j2373j1948j0413p776l976M63M355P393J0719J5037J9229K1778
60998A677482K2601K2679K3065K4845K8710L3652L7528L9822M2257M5763M8917
60987B047321N0761N3058N7590O3119O7463P1196P6544Q3592R0303R5938J01830
60976B858715J08864J16358J23566J30482J37184J44017J52152J62346J73283
60967D106967J82805J90469J97545K05067K13549K23907K36935K52448K70560
60958F080252K92705L19382L48211L76891M07034M42404M84773N35292N98763
$$ y = [2148726, 2146816, 2140141, 2129491, 2116130, 2100460, 2081035, 2055992, 2025715, 1993223, 1961647, 1931971, 1903318, 1874545, 1845260, 1815897, 1787230, 1759675, 1733290, 1708722, 1687541, 1670752, 1657309, 1644994, 1632621, 1620673, 1610260, 1602484, 1598508, 1598971, 1603326, 1610719, 1621438, 1636475, 1655704, 1677482, 1700083, 1722762, 1745827, 1770672, 1799382, 1833034, 1870562, 1910384, 1952641, 1998404, 2047321, 2098082, 2151140, 2208730, 2271849, 2339312, 2410508, 2487052, 2570644, 2660947, 2756885, 2858715, 2967579, 3083937, 3207503, 3337985, 3475169, 3619186, 3771338, 3933684, 4106967, 4289772, 4480241, 4677786, 4882853, 5096402, 5320309, 5557244, 5809692, 6080252, 6372957, 6692339, 7040550, 7417441, 7824475, 8266879, 8751652, 9286944, 9885707]
60949I885707O81657P85362R05718J039961J189851J357623J544296J753431J990032
60940B1133638K252333K529977K810586L072428L255463L251867K962181K389333
60932D3657806J674962J023629N78714L65120L30849M07673N13573N24492L00608
60923D9377426k20548r56278j719262k334086k722110k897321k912738k821819
60915C2793264k669854k492403k310248k130349j954986j787897j632325j488224
60907A6326978j353924j228685j112911j007428r12741q27551p48462o72990o02350
60898G859936n39462m84842m36587l93552l55828l22416k91344k62425k37388
60889D536092k16879j99627j84889j73214j64217j55980j47477j39466j32267
$$ y = [9885707, 10567364, 11352726, 12258444, 13298405, 14488256, 15845879, 17390175, 19143606, 21133638, 23385971, 25915948, 28726534, 31798962, 35054425, 38306292, 41268473, 43657806, 45332768, 46356397, 46935111, 47300231, 47631080, 48038753, 48552326, 49076818, 49377426, 49156878, 48200600, 46481338, 44147252, 41425142, 38527821, 35615083, 32793264, 30123410, 27631007, 25320759, 23190410, 21235424, 19447527, 17815202, 16326978, 14973054, 13744369, 12631458, 11624030, 10711289, 9883738, 9135276, 8462286, 7859936, 7320474, 6835632, 6399045, 6005493, 5649665, 5327249, 5035905, 4773480, 4536092, 4319213, 4119586, 3934697, 3761483, 3597266, 3441286, 3293809, 3154343, 3022076]
60880C022076j24895j17240j10695j05538r9901r2776q5808q0628p6565p2760
60870B055270p0329p0037o9644o6313o0634n5608n2403m9666m6520m3565m0850
60859A429701l7415l3394l0464k9472k9173k7990k5683k2884k0271j8592j8110
60848A136253j7638j5468j1761q698p698p837p574o662n569m347l187k874l533
60835A033407l898l051k065k625m599o256o494n748n007m986n947p331p963p483
60821I59954p100p879q918q616p218o404o675o900o565o501p041p285o972p226
60807H58654q442q991p411m623k460j081N52K363L156K597J640R67M60K71J042
60792H38694K687M005M148L664L650M312M795M150K303L55j96J075K986M003L801
$$ y = [3022076, 2897181, 2779941, 2669246, 2563708, 2463807, 2371031, 2285223, 2204595, 2128030, 2055270, 1984941, 1914904, 1845260, 1778947, 1718313, 1662705, 1610302, 1560636, 1514116, 1470551, 1429701, 1392286, 1358892, 1328428, 1298956, 1269783, 1241793, 1216110, 1193226, 1172955, 1154363, 1136253, 1118615, 1103147, 1091386, 1082688, 1074990, 1067153, 1059579, 1052917, 1047348, 1043001, 1039814, 1036940, 1033407, 1029509, 1026458, 1024393, 1021768, 1017169, 1010913, 1004419, 998671, 993664, 988678, 982731, 975400, 967437, 959954, 952854, 944975, 936057, 927441, 920223, 913819, 907144, 900244, 893679, 887178, 880137, 872852, 865880, 858654, 850212, 841221, 833810, 829187, 826727, 825646, 826198, 828561, 831717, 834314, 835954, 836921, 837381, 837652, 838694, 841381, 845386, 849534, 853198, 856848, 861160, 865955, 870105, 872408, 872763, 872567, 873642, 876628, 880631, 884432]
60777H84432L089K302J301J54o84j086j355j546j321o02J50L55m23k369m803o021
60761H71573m824k307j119k622n457p203o797n217m410n579p884r017p847o044
60747G95246n874o885o694n001m376o185q041p132m296k603k991l729l672l555
60733G24212l820l401j633K00L86j009k390k536j518p9J122J847K255K597K855
60718G19088K856K848L411M617N557N337M318L893M782O083O509O169O368P522
60704G89358Q322P581O113N664O506P335P381P200P192O817N837M989M670M079
60690H79044K596J029N02R65J846L177M842N535L991Q89j876l516m740n953o576
60675H81755o216n397m846m865n432o221o565o138n464n071m610l611k496j755
$$ y = [884432, 887521, 889823, 891124, 891278, 890594, 889508, 888153, 886607, 885286, 884684, 884834, 885189, 884766, 882397, 877594, 871573, 866749, 864442, 863323, 860701, 855244, 848041, 841244, 836027, 831617, 826038, 818154, 809137, 801290, 795246, 789372, 782487, 775793, 770792, 766416, 760231, 752190, 745058, 740762, 738159, 735168, 731439, 727767, 724212, 720392, 716991, 715358, 715558, 715944, 714935, 712545, 710009, 708491, 708412, 709534, 711381, 713636, 716233, 719088, 721944, 724792, 728203, 732820, 738377, 743714, 748032, 751925, 756707, 762790, 769299, 775468, 781836, 789358, 797680, 805261, 811374, 817038, 823544, 830879, 838260, 845460, 852652, 859469, 865306, 870295, 874965, 879044, 881640, 882669, 883171, 884136, 885982, 889159, 894001, 899536, 903527, 904416, 902540, 899024, 894284, 888331, 881755, 875539, 870142, 865296, 860431, 854999, 848778, 842213, 836075, 830611, 825540, 820930, 817319, 814823, 813068]
60661H13068p83J023K727L110L014M332O816Q182P713P317Q262R221Q865Q352
60647H91219R417J1564J3044J3601J4387J5773J6949J7337J7054J6368J5844J6453
60635A069010J8266J9543J8599J6219J4771J5144J6056J6288J6024J5668J4867
60624A250455J3465J2326J2346J3109J3171J1383P775L524J76j556k368l391m710
60611A325705n464n443n827p861j1396j5125j7955j9681k0570k0789k0341j9261
60599A155992j7696j5942j4545j4139j4739j5286j4495j2546j1213j1509j1984
60588A001898j0661q265p595r378j0782r190n723l393l058l254l252l891n334
60575I18122o116n170l323k044j652j480j015l31P4l05j321j866r88Q04K183K768
$$ y = [813068, 812285, 813308, 816035, 819145, 822159, 826491, 833307, 841489, 849202, 856519, 864781, 874002, 882867, 891219, 900636, 912200, 925244, 938845, 953232, 969005, 985954, 1003291, 1020345, 1036713, 1052557, 1069010, 1087276, 1106819, 1125418, 1141637, 1156408, 1171552, 1187608, 1203896, 1219920, 1235588, 1250455, 1263920, 1276246, 1288592, 1301701, 1314872, 1326255, 1334030, 1337554, 1337730, 1336174, 1333806, 1330415, 1325705, 1320241, 1314798, 1308971, 1301110, 1289714, 1274589, 1256634, 1236953, 1216383, 1195594, 1175253, 1155992, 1138296, 1122354, 1107809, 1093670, 1078931, 1063645, 1049150, 1036604, 1025391, 1013882, 1001898, 991237, 982972, 975377, 965999, 955217, 946027, 940304, 936911, 933853, 930599, 927347, 923456, 918122, 912006, 906836, 903513, 901469, 899817, 898337, 897322, 896991, 897065, 896760, 895439, 893573, 892585, 893389, 895572, 898340]
60559H98340L147L136J550j700m574m910k795k32Q79j23k740n625p281p200o182
60544H63690n275m798m662m875n219n069m185l147k545k134j460q25r62j915k854
60529H13765k859j679R0J363J518J156J392K352L164L703N149P948J0313J0107
60515H57482P823O293P474J0593J3710J6003J7957K0024K1986K3572K5011K6538
60503A054466K7583K7039K4517K0772J6479J1267M894j256n198o873q081r552
60491A156057r612o598j372L691P280R704J1653J3509J5477J7621J9944K2682
60479A260036K5712K7632K6901K4411K2982K3178K1763J6156Q532L008K75k029
60467A458557m587n676m992m654n611o038m505k145l47J236K947L572K510J657
$$ y = [898340, 901487, 904623, 906173, 904473, 899899, 894989, 892194, 891962, 892841, 892718, 889978, 884353, 877072, 869872, 863690, 858415, 853617, 848955, 844080, 838861, 833792, 829607, 826460, 823915, 821781, 820321, 819496, 818534, 816619, 813765, 810906, 809227, 809317, 810680, 812198, 813354, 814746, 817098, 820262, 823965, 829114, 837062, 847375, 857482, 865305, 871598, 879072, 889665, 903375, 919378, 937335, 957359, 979345, 1002917, 1027928, 1054466, 1082049, 1109088, 1133605, 1154377, 1170856, 1182123, 1187017, 1185761, 1180563, 1173690, 1165609, 1156057, 1146445, 1139847, 1138475, 1142166, 1149446, 1159150, 1170803, 1184312, 1199789, 1217410, 1237354, 1260036, 1285748, 1313380, 1340281, 1364692, 1387674, 1410852, 1432615, 1448771, 1457303, 1460311, 1460586, 1458557, 1453970, 1448294, 1443302, 1438648, 1433037, 1426999, 1422494, 1420349, 1420002, 1421238, 1424185, 1427757, 1430267, 1431924]
60453A431924L080O133Q739J0461J2438J5099J7882K0715K4166K8338L2892L7792
60441A649659M3106M8549N4226O1006O9056P6845Q2825Q7225R0668R1919Q8874
60430B443958Q1274P0619N7652M1934K3881N226j2936l0860m8387o4022p6433
60419B491906q5620r1855r4713r4045r1050q7448q4034q0512p6363p1495o6521
60408A568250o2488n9805n7379n3591m8268m2842l8461l4934l1790k9335k7940
60397A081417k7092k5777k3353j9720j5429j1957j0949j2357j4049j3972j2190
60386H94572j0184q818p864o973o072n029l858l189l678m910n641n221m184l292
60372H15659k623j964j578k067l507n088n832n612n270n575o217o190n047l357
$$ y = [1431924, 1435004, 1441137, 1449876, 1460337, 1472775, 1487874, 1505756, 1526471, 1550637, 1578975, 1611867, 1649659, 1692765, 1741314, 1795540, 1856546, 1925602, 2002447, 2085272, 2172497, 2263165, 2355084, 2443958, 2525232, 2595851, 2653503, 2695437, 2719318, 2724544, 2711608, 2680748, 2632361, 2568339, 2491906, 2406286, 2314431, 2219718, 2125673, 2034623, 1947175, 1863141, 1782629, 1706266, 1634771, 1568250, 1505762, 1445957, 1388578, 1334987, 1286719, 1243877, 1205416, 1170482, 1138692, 1109357, 1081417, 1054325, 1028548, 1005195, 985475, 970046, 958089, 947140, 934783, 920734, 906762, 894572, 884388, 875570, 867706, 860733, 854661, 849632, 845774, 842585, 838907, 833997, 828356, 823135, 818951, 815659, 813036, 811072, 809494, 807427, 803920, 798832, 793000, 787388, 782118, 776543, 770326, 764136, 759089, 755732]
60358G55732j910r92o48q17q55L50K905N024M652J914r78k356k663l020l273k432
60342G50633n29J123J702J911K748L866L989K876J946K551M145M902L997K514
60328G88374J862J964J621L84p95p95L66J853L053L860M192L954L483L437L991
60313H20804M586M719M635M758M837M159K583Q88M1M30J801L538M939N472N007
60298H73197L795K342J366J386K020K114J212M92J361L392M769M742M371M588
60284I11147M855M455L839L759L929L678L211L132L234K858K030J286P25K40K59
60269I52637J170K263K461J888J662K214K817K714J741O6j608j816L87M006P152
60254I79754R377J1536J3571J4278J3648J3562J5347J8203K0932K3691K6908K9767
$$ y = [755732, 753822, 752830, 752182, 751365, 750510, 750860, 753765, 758789, 763441, 765355, 764377, 762021, 759358, 756338, 753065, 750633, 750104, 751227, 752929, 754840, 757588, 761454, 765443, 768319, 770265, 772816, 776961, 781863, 785860, 788374, 790236, 792200, 793821, 794205, 793410, 792615, 792981, 794834, 797887, 801747, 805939, 809893, 813376, 816813, 820804, 825390, 830109, 834744, 839502, 844339, 848498, 851081, 851969, 852010, 852440, 854241, 857779, 862718, 868190, 873197, 876992, 879334, 880700, 882086, 884106, 886220, 887432, 887924, 889285, 892677, 897446, 902188, 906559, 911147, 916002, 920457, 924296, 928055, 931984, 935662, 938873, 942005, 945239, 948097, 950127, 951413, 952138, 952378, 952637, 953807, 956070, 958531, 960419, 962081, 964295, 967112, 969826, 971567, 971633, 970025, 968209, 968596, 972602, 979754, 989131, 1000667, 1014238, 1028516, 1042164, 1055726, 1071073, 1089276, 1110208, 1133899, 1160807, 1190574]
60242A190574L1086L0766K9211K6152K1200J4872P915L68p679j4941j9833k2118
60230A287573k2700k2345k1533k0895k0551j9473j6828j3669j1898j1795j1880
60219A094006j1228j0584j0874j1776j2219j1583j0041q290p144o870o952o796
60207I79649o474o236n752m731l755l458l235k138q33j035k764l836k772q36k19
60192I31575j369l062m171m229l002p82J176J645P78k90r44j366j497q26O01J834
60176I16071K046J471J044J467K681L847L802K158J70j08J983M760N943N115L866
60161I56316L761M779N787N870M950L678L059L726N165O049N792N284N536O022
60147A025774N409L631K175K062K705L165L445L829L844L014K005J930K735L279
$$ y = [1190574, 1221660, 1252426, 1281637, 1307789, 1328989, 1343861, 1351776, 1352144, 1344465, 1329524, 1309691, 1287573, 1264873, 1242528, 1220995, 1200100, 1179549, 1160076, 1143248, 1129579, 1117681, 1105886, 1094006, 1082778, 1072194, 1061320, 1049544, 1037325, 1025742, 1015701, 1007411, 1000267, 993397, 986445, 979649, 973175, 966939, 961187, 956456, 952701, 949243, 946008, 943870, 943037, 942002, 939238, 935402, 932630, 931794, 931575, 930206, 927144, 922973, 918744, 915742, 914960, 916136, 917781, 918559, 918269, 917325, 915959, 914462, 913636, 914237, 916071, 918117, 919588, 920632, 922099, 924780, 928627, 932429, 934587, 934757, 934649, 936632, 941392, 947335, 952450, 956316, 960077, 964856, 970643, 976513, 981463, 985141, 988200, 991926, 997091, 1003140, 1008932, 1014216, 1019752, 1025774, 1031183, 1034814, 1036989, 1039051, 1041756, 1044921, 1048366, 1052195, 1056039, 1059053, 1061058, 1062988, 1065723, 1069002]
60133A069002K889J945J028M20M05J025J445O41j085k314k626l322n293p295p489
60118A049376n955m267l058j574K24Q93l73k103k221p18O03O84J97J2l5l15n08
60101A030862k97j49m48n23M01J681J930J152R80K365M155M559L289J594Q22J495
60085A053868L293N238O229O031N555N795O794P934Q775R109Q699P687O860O728
60071A148595O601N288K630l55k661l966m337m060l773l908l886k716n59J124
60057A134017J343P32M31O07P69R69J614K322K113R78L82J492L453M162K620j54
60041A157850k444l412l287k832k907l852m795m249j932N98J820J958J991J917
60027A136424J424J513L450O237P246N727L733K905K414J136k56q83j682l816
$$ y = [1069002, 1071891, 1073836, 1074864, 1075284, 1075689, 1076714, 1078159, 1078800, 1077715, 1075401, 1072775, 1069453, 1064160, 1056865, 1049376, 1043421, 1039154, 1036096, 1034522, 1034746, 1035639, 1035266, 1033163, 1030942, 1030224, 1030827, 1031511, 1031708, 1031720, 1031685, 1031370, 1030862, 1030565, 1030416, 1029968, 1029445, 1029846, 1031527, 1033457, 1034609, 1035589, 1037954, 1042109, 1046668, 1049957, 1051551, 1052373, 1053868, 1057161, 1062399, 1068628, 1074659, 1080214, 1086009, 1092803, 1100737, 1109512, 1118621, 1127320, 1135007, 1141867, 1148595, 1155196, 1160484, 1163114, 1162759, 1160098, 1156132, 1151795, 1147735, 1143962, 1140054, 1136168, 1133452, 1132893, 1134017, 1135360, 1136092, 1136523, 1137130, 1137899, 1138868, 1140482, 1142804, 1144917, 1145895, 1146277, 1147769, 1151222, 1155384, 1158004, 1157850, 1155406, 1151994, 1148707, 1145875, 1142968, 1139116, 1134321, 1130072, 1128140, 1128738, 1130558, 1132516, 1134507, 1136424, 1137848, 1139361, 1142811, 1149048, 1156294, 1162021, 1165754, 1168659, 1171073, 1172209, 1171953, 1171070, 1169388, 1165572]
60013A165572o320p349o947o616o829o942p071p963r310j0038j0178j0536j0718
60000A058755r635p967p803r373j0358r313p678p273p556o865n033l307k586k883
59986I61125l776m359l559j411O61J618J898K031J388m33k003j467R08L010L516
59971I59147K940K245J623P95m31k101l894n048n151m970n609o941p735p431o864
59956I10575o904p217o935n934m790l756k652j734j866l331m858m630k222R02
59942H54648K967L393K611J239l3l88M43J721K602L123L606L644K726J474J037
59927H84813J443J786J905K380K869K174M67k37J250L496M299L244J418l52j782
59912I09173k470k135j189j78P98J603J729J190Q16Q51K50j566l250l135j479
$$ y = [1165572, 1159252, 1151903, 1144956, 1138340, 1131511, 1124569, 1117498, 1109535, 1100225, 1090187, 1080009, 1069473, 1058755, 1049120, 1041153, 1033350, 1023977, 1013619, 1004306, 996628, 989355, 981799, 974934, 969901, 966594, 964008, 961125, 957349, 952990, 949431, 948020, 948681, 950299, 952197, 954228, 955616, 955183, 953180, 951713, 952621, 955631, 959147, 962087, 964332, 965955, 966750, 966319, 964218, 960324, 955276, 950125, 945155, 939546, 932605, 924870, 917439, 910575, 903671, 896454, 889519, 883585, 878795, 875039, 872387, 870653, 868787, 865456, 860598, 855968, 853746, 854648, 857615, 861008, 863619, 864858, 864825, 864437, 864880, 866601, 869203, 872326, 875932, 879576, 882302, 883776, 884813, 886256, 888042, 889947, 892327, 895196, 897370, 897837, 897600, 898850, 902346, 906645, 909889, 911307, 910955, 909173, 906703, 904568, 903379, 903201, 903999, 905602, 907331, 908521, 909337, 910188, 910438, 908872, 905622, 902487, 901008]
59897I01008K90J664K778K844R92j503k061k19J690J809Q97M18L04j12m61l61
59881I09977r79l589o914p926n611k338p22n95k07O85O47p91k089j835n82K99
59865H77430N93R99J650K049K164K336K283J380P9j91J233L496N426O485O394
59850I13806N066L384K868L869M986M943M066L284K698K018J480J379J356J066
59836I56269J020J961L885O286Q563R726Q779O426N229O757R442J0566R559P807
59822A052275O038L898J871J488L132N168N941N537N006M792M462L416J402j213
59808A103213l499m651m646l986k988j896j294j629k414k554j508L47K295L793
59794A078583M756N715P262Q882R177P961P209Q754J1635J3036J1452P727L485
$$ y = [901008, 901298, 902962, 905740, 908584, 909576, 908073, 906012, 905793, 907483, 909292, 910189, 910607, 910911, 910799, 910338, 909977, 908998, 905409, 898495, 890569, 884958, 882620, 881898, 881303, 881096, 881781, 882428, 881637, 879548, 877713, 877131, 877430, 878023, 879022, 880672, 882721, 884885, 887221, 889504, 890884, 890963, 890772, 892005, 895501, 900927, 907412, 913806, 918872, 922256, 925124, 928993, 933979, 938922, 942988, 946272, 948970, 950988, 952468, 953847, 955203, 956269, 957289, 959250, 963135, 969421, 977984, 987710, 996489, 1002915, 1008144, 1014901, 1024343, 1034909, 1044468, 1052275, 1058313, 1062211, 1064082, 1065570, 1068702, 1073870, 1079811, 1085348, 1090354, 1095146, 1099608, 1103024, 1104426, 1103213, 1099714, 1095063, 1090417, 1086431, 1083443, 1081547, 1080253, 1078624, 1076210, 1073656, 1072148, 1072495, 1074790, 1078583, 1083339, 1089054, 1096316, 1105198, 1114375, 1122336, 1129545, 1138299, 1149934, 1162970, 1174422, 1182149, 1185634]
59781A185634r5k203k670k375k303k318j942j954l606o443q504q986r084r932
59767A123219j1235j2358j3304j3954j3713j2689j2133j2859j3980j3986j2468
59756I80540j0280q554p860p741o941m772k362j667l126n142o012n468m234l142
59742I03239k890l679m786n349n569o095o400n265l059j788k331l203k853j751
59728H48221j101r60p97r14j809k880l032k259j593j736k540l453l784k923j095
59713H17345L83L09j007k080j863o54M15N97K02Q3M42N98K74L39J526L101L973
59696H23983M518N696O842O289M122K301J825J827J985L356N895P379O378M437
59682H86833L636L688L296K866L639N086N466M481L422K892K208J037L9l89p69
$$ y = [1185634, 1185539, 1183336, 1180666, 1178291, 1175988, 1173670, 1171728, 1169774, 1166168, 1159725, 1151221, 1142235, 1133151, 1123219, 1111984, 1099626, 1086322, 1072368, 1058655, 1045966, 1033833, 1020974, 1006994, 993008, 980540, 970260, 961706, 953846, 946105, 939164, 934392, 932030, 930363, 927237, 922095, 916083, 910615, 906381, 903239, 900349, 896670, 891884, 886535, 880966, 874871, 868471, 863206, 860147, 858359, 856028, 852825, 849972, 848221, 847120, 846160, 845363, 844449, 842640, 839760, 836728, 834469, 832876, 831140, 828600, 825147, 821363, 818440, 817345, 817728, 818037, 817030, 814950, 813087, 812433, 812848, 813445, 813647, 813730, 814172, 814770, 815044, 815383, 816909, 820010, 823983, 828501, 834197, 841039, 847328, 851450, 853751, 855576, 857403, 859388, 862744, 868639, 876018, 882396, 886833, 890469, 894157, 897453, 900319, 903958, 909044, 914510, 918991, 922413, 925305, 927513, 928550, 928589, 928200, 927431]
59667I27431j655k836l588l225j718p6L95l06q24m32p3n93j204q56pM00P76K076
59649I13685L841M612M006K884J911J221J146J843K565K643K816M142N959O508
59635I59782N446M187L767L811L639L060J915K08j155r54O48K009J819L15j316
59620I87181j978j280J06Q62N10J08P16J830K266J815Q48q56l365n441n866n366
59604I72090n395n578m415k225r56j113j198m97l6j98K00J523K205J247qR5J267
59587I57008K234K505K000L65j917l088k240r09j080k558l580l390k672k062j512
59572I39104r21m43k66o95j829k720j777J058L507L451J648O56J475K493J658
59557I46399j300m871p115o985m959k494o87M47J291J805J722J013k22j852l311
$$ y = [927431, 925776, 922940, 919352, 916127, 914409, 914333, 914728, 914422, 913598, 913166, 913093, 912500, 911296, 910440, 910433, 910833, 911609, 913685, 917526, 922138, 926144, 929028, 930939, 932160, 933306, 935149, 937714, 940357, 943173, 947315, 953274, 959782, 965228, 969415, 973182, 976993, 980632, 983692, 985607, 985815, 984660, 983706, 984354, 986363, 988182, 988497, 987181, 985203, 983923, 984029, 984891, 985401, 985509, 986225, 988055, 990321, 992136, 992984, 992128, 988763, 983322, 977456, 972090, 966695, 961117, 956702, 954477, 953521, 952408, 951210, 950713, 950677, 950479, 950679, 952202, 954407, 955654, 955646, 955741, 957008, 959242, 961747, 963747, 964112, 962195, 959107, 956867, 955958, 954878, 952320, 948740, 945350, 942678, 940616, 939104, 938183, 937740, 937474, 936779, 934950, 932230, 930453, 931511, 935018, 938469, 940117, 940773, 942248, 944741, 946399, 945099, 940228, 933113, 926128, 921169, 918675, 917988, 918435, 919726, 921531, 923253, 924266, 924044, 922192, 918881]
59542I18881l667k555o04J323K732L200K407R06j0K04P96J075J350J876J971J055
59526I30940l27j426k341l276l755l669m089n728p329p064n014k845j525p97n14
59511H81241r21j713k210k467k868k888j711j3N18k35l96J199L309M140L685L300
59495H81970L757M657N284N259M652M005L888M230M537M907O086Q164J0109J1185
59481I62690J2005J3415J5005J5775J5869J6409J7486J7425J4605R463M182O40
59469A114969q63j079p48j90L52O55P80J149K103L543N092O403P155O944N555
59454A151820L287Q39j191k584l446m103m969o227p526q172p779o815o327o962
59440A089845q173q614p619o053n308n596n805n116m000l348l144k571j112Q52
$$ y = [918881, 915214, 912659, 912055, 913378, 916110, 919310, 921717, 922623, 922613, 922817, 923613, 924688, 926038, 927914, 929885, 930940, 930613, 929187, 926846, 923570, 919815, 916146, 912057, 906329, 899000, 891936, 886922, 884077, 882552, 881755, 881241, 880320, 878607, 876397, 873930, 871062, 868174, 866463, 866450, 866968, 866733, 866337, 867536, 870845, 874985, 878670, 881970, 885727, 890384, 895668, 900927, 905579, 909584, 913472, 917702, 922239, 927146, 933232, 941396, 951505, 962690, 974695, 988110, 1003115, 1018890, 1034759, 1051168, 1068654, 1086079, 1100684, 1110147, 1114329, 1114969, 1114106, 1113027, 1112279, 1112089, 1112441, 1113096, 1113876, 1115025, 1117128, 1120671, 1125763, 1132166, 1139321, 1146265, 1151820, 1155107, 1155946, 1154755, 1152171, 1148725, 1144622, 1139653, 1133426, 1125900, 1117728, 1109949, 1103134, 1096807, 1089845, 1081672, 1073058, 1065439, 1059386, 1054078, 1048482, 1042677, 1037561, 1033561, 1030213, 1027069, 1024498, 1023386, 1024238]
59426A024238K343K534J538O98J622M548P987J0339J1441J2151J2963J3653J3926
59413A119981J3682J2819J1342R547P602N225K326k46j221k32J893M085N867P373
59399A200043Q941J0678J2210J3104J3691J4935J7113J9272K0670K1960K4017
59388A376634K6181K6972K6164K4724K2656J8510J1486K856n346j2005j6809j9495
59376A482528k0157j9687j9084j8657j8359j8294j8267j7451j5327j2656j0715
59365A293874r743q814p032m263p72L064O707R777J2582J5791J9367K2463K4691
59352A377692K6855K9623L1609K9760K2204J0565j046r229j3272j4383j3908j2500
59340A463970j0267p043k958N99R75l816j2925k2957l0549l4408l5089l3782l1672
$$ y = [1024238, 1026581, 1029115, 1030653, 1031351, 1032973, 1037521, 1045508, 1055847, 1067288, 1079439, 1092402, 1106055, 1119981, 1133663, 1146482, 1157824, 1167371, 1174973, 1180198, 1182524, 1182278, 1181057, 1180825, 1182718, 1186803, 1192670, 1200043, 1208984, 1219662, 1231872, 1244976, 1258667, 1273602, 1290715, 1309987, 1330657, 1352617, 1376634, 1402815, 1429787, 1455951, 1480675, 1503331, 1521841, 1533327, 1536183, 1530837, 1518832, 1502023, 1482528, 1462371, 1442684, 1423600, 1404943, 1386584, 1368290, 1350023, 1332572, 1317245, 1304589, 1293874, 1284131, 1275317, 1268285, 1264022, 1263250, 1266314, 1273021, 1282798, 1295380, 1311171, 1330538, 1353001, 1377692, 1404547, 1434170, 1465779, 1495539, 1517743, 1528308, 1527262, 1518033, 1504761, 1490378, 1476470, 1463970, 1453703, 1446660, 1443702, 1444301, 1445276, 1441460, 1428535, 1405578, 1375029, 1340621, 1305532, 1271750, 1240078]
59327A240078k9714k8210k6657k4421k1570j8848j6867j5411j3668j1223q769
59316A024720p475p446p293n734l153r29M12J445K340K329J150N7N97K697M574
59301A008291M506K565P06J065L842P136R250J0699J2937J5702J7250J7283J7637
59288A128869J9304K0741K0627K0491K2531K5901K7705K7194K6336K6012K4372
59277A390083K0126J5264J2634J2172J1342Q605M689P72k857o197q945j1030j2751
59264A433907j4022j4285j3639j3189j3701j4480j4318j3080j1637j0500r438
59253A291618q371p749p589p016n384l411k312k066j347O70L313N664Q006J1264
59239A275290J5339J8938K1095K2007K1963K0116J5105O877k605j0630j5562j7507
$$ y = [1240078, 1210364, 1182154, 1155497, 1131076, 1109506, 1090658, 1073791, 1058380, 1044712, 1033489, 1024720, 1017245, 1009799, 1002506, 996772, 993619, 992690, 993102, 994547, 996887, 999216, 1000366, 1000423, 1001020, 1003717, 1008291, 1012797, 1015362, 1016068, 1017133, 1020975, 1028111, 1037361, 1048060, 1060997, 1076699, 1093949, 1111232, 1128869, 1148173, 1168914, 1189541, 1210032, 1232563, 1258464, 1286169, 1313363, 1339699, 1365711, 1390083, 1410209, 1425473, 1438107, 1450279, 1461621, 1470226, 1474915, 1475687, 1472830, 1466633, 1457688, 1446658, 1433907, 1419885, 1405600, 1391961, 1378772, 1365071, 1350591, 1336273, 1323193, 1311556, 1301056, 1291618, 1283247, 1275498, 1267909, 1260893, 1255509, 1252098, 1249786, 1247720, 1246373, 1247043, 1250356, 1256020, 1264026, 1275290, 1290629, 1309567, 1330662, 1352669, 1374632, 1394748, 1409853, 1416730, 1414125, 1403495, 1387933, 1370426]
59227A370426j7508j6400j4395j1613q709o657n789n286l916j321J666M063N822
59214A290383P690J0122J2574J3992J3839J2722J1982J2553J4004J4845J4058
59203A428764J2165J0396Q927O588K687j703m920o749q362j0334j1823j2097j1920
59190A401619j2568j3889j4364j3106j1073r919j0047j0276r339p282n282m282
59178A280192m132l984l209j708L08K455M127M802M560M023L650L255K275L50
59164A296964k302m835o247o448o720q421j1096j2784j2562j1739j1781j2023
59152A190006j0826q430o911p205p762o935n412n057o087o734n586l163r89R7
59138A109006L76N64J108J971K715K927K697K663L373M703N959O574O623O584
$$ y = [1370426, 1352918, 1336518, 1322123, 1310510, 1301801, 1295144, 1289355, 1284069, 1280153, 1278832, 1280498, 1284561, 1290383, 1298073, 1308195, 1320769, 1334761, 1348600, 1361322, 1373304, 1385857, 1399861, 1414706, 1428764, 1440929, 1451325, 1460252, 1466840, 1469527, 1467824, 1462904, 1456155, 1447793, 1437459, 1425636, 1413539, 1401619, 1389051, 1375162, 1360798, 1347692, 1336619, 1326700, 1316653, 1306377, 1297038, 1289756, 1284474, 1280192, 1276060, 1272076, 1268867, 1267159, 1267467, 1269922, 1274049, 1278851, 1283411, 1287434, 1291084, 1294339, 1296614, 1296964, 1294662, 1289827, 1283580, 1277132, 1270412, 1261991, 1250895, 1238111, 1225549, 1213810, 1202029, 1190006, 1179180, 1170750, 1163839, 1156634, 1148872, 1141937, 1136525, 1131468, 1125381, 1118647, 1113061, 1109898, 1108909, 1109006, 1109382, 1109946, 1111054, 1113025, 1115740, 1118667, 1121364, 1124027, 1127400, 1132103, 1138062, 1144636, 1151259, 1157843]
59124A157843O695O691O272N683N572O334P742R147R879R529Q293P075O910Q013
59110A261678R584J0648J0940J0983J1557J3027J4780J5362J3864J1335R981J0543
59098A404282J1304J0311P762N198L100P06k122m482o090p847j0174j2137j2985
59085A386826j3378j4051j4212j2609r622p050n988o042o460o891p004o415n287
59072A271817m280l623k918j893n86J214L766O441Q021Q276Q405R381J0749J1661
59058A326431J2252J3156J4325J5164J5368J4976J4017J2850J2278J2515J2485
59047A475817J1126Q971P441O829O170M959L782L056K340J203j55j493k884m112
59033A523050m681m745n259o654q162q943r103r183r360r737j0563j1569j1939
$$ y = [1157843, 1164538, 1171229, 1177501, 1183184, 1188756, 1195090, 1202832, 1211979, 1221858, 1231387, 1239680, 1246755, 1253665, 1261678, 1271262, 1281910, 1292850, 1303833, 1315390, 1328417, 1343197, 1358559, 1372423, 1383758, 1393739, 1404282, 1415586, 1425897, 1433659, 1438857, 1441957, 1442663, 1440541, 1436059, 1429969, 1422122, 1411948, 1399811, 1386826, 1373448, 1359397, 1345185, 1332576, 1322954, 1315904, 1309916, 1303874, 1297414, 1290523, 1283519, 1277104, 1271817, 1267537, 1263914, 1260996, 1259103, 1258517, 1259731, 1263497, 1269938, 1277959, 1286235, 1294640, 1304021, 1314770, 1326431, 1338683, 1351839, 1366164, 1381328, 1396696, 1411672, 1425689, 1438539, 1450817, 1463332, 1475817, 1486943, 1495914, 1503355, 1510184, 1516354, 1521313, 1525095, 1528151, 1530491, 1531694, 1531539, 1530046, 1527162, 1523050, 1518369, 1513624, 1508365, 1501711, 1493549, 1484606, 1475503, 1466320, 1456960, 1447223, 1436660, 1425091, 1413152]
59020A413152j1610j1689j2783j3819j3664j2993j3172j3886j3510j1611r510
59009A274905q309p706p173o924p220p581p269o011m144k595k443l541l899j884
58995A198206J096J817m34k617j986L90J484M27j001j222n65j97o40j307r27J257
58979A193781M125N336M155K784L699O409Q313Q213P361P270Q153R573J1159J2431
58965A292762J3161J4045J5797J7560J7577J5679J3673J2984J3204J3356J3132
58954A452930J2364J0673Q455P041P118P922Q465Q459P678N864L928L581M815
58941A549293N399M068K663L542O272Q652R856J0525J0751J0191R642J0229J1249
58928A652332J0946R316P975P221N641L115J822L088N260O148O049O653Q026Q525
$$ y = [1413152, 1401542, 1389853, 1377070, 1363251, 1349587, 1336594, 1323422, 1309536, 1296026, 1284415, 1274905, 1266596, 1258890, 1251717, 1244793, 1237573, 1229992, 1222723, 1216712, 1212568, 1209973, 1207530, 1203989, 1200090, 1198206, 1199302, 1201119, 1200685, 1198068, 1196082, 1196472, 1197956, 1198383, 1197382, 1196160, 1195595, 1195398, 1194758, 1193451, 1192524, 1193781, 1197906, 1203242, 1207397, 1210181, 1213880, 1220289, 1228602, 1236815, 1244176, 1251446, 1259599, 1269172, 1280331, 1292762, 1305923, 1319968, 1335765, 1353325, 1370902, 1386581, 1400254, 1413238, 1426442, 1439798, 1452930, 1465294, 1475967, 1484422, 1491463, 1498581, 1506503, 1514968, 1523427, 1531105, 1536969, 1540897, 1544478, 1549293, 1554692, 1558760, 1561423, 1564965, 1571237, 1579889, 1589745, 1600270, 1611021, 1621212, 1630854, 1641083, 1652332, 1663278, 1672594, 1680569, 1687790, 1693431, 1696546, 1698368, 1701456, 1706716, 1712864, 1718913, 1725566, 1733592, 1742117]
58914A742117P424O153O717R672J3714J6844J7998J7913J8234J9736K1683K2868
58902A921073K2714K1250J8885J6526J5287J5386J5797J5270J3486J0976Q358
58891B095008N830L119r0l251m868m119k338j726k584l138k297j134j000j613
58877B075799k016k324l361n320p816j0642j3503j5615j6513j6733j6943j7019
58865A947994j6760j6717j7272j7644j6914j5489j4304j3171j1298r070p761p578
58853A784016p304n934l528l80L333O906R340J0595J1725J3423J5361J7178J9079
58840A873810K1032K2288K2269K1263J9879J8458J7408J7295J7995J8371J7472
58829B087540J5899J5368J6814J9097J9752J7338J3119R932Q961Q365N754J268
$$ y = [1742117, 1749541, 1755694, 1762411, 1772083, 1785797, 1802641, 1820639, 1838552, 1856786, 1876522, 1898205, 1921073, 1943787, 1965037, 1983922, 2000448, 2015735, 2031121, 2046918, 2062188, 2075674, 2086650, 2095008, 2100838, 2103957, 2103867, 2100616, 2095748, 2091629, 2089291, 2087565, 2084981, 2081843, 2079546, 2078412, 2077412, 2075799, 2073783, 2071459, 2068098, 2062778, 2054962, 2044320, 2030817, 2015202, 1998689, 1981956, 1965013, 1947994, 1931234, 1914517, 1897245, 1879601, 1862687, 1847198, 1832894, 1819723, 1808425, 1799355, 1791594, 1784016, 1776712, 1770778, 1767250, 1766870, 1770203, 1777109, 1786449, 1797044, 1808769, 1822192, 1837553, 1854731, 1873810, 1894842, 1917130, 1939399, 1960662, 1980541, 1998999, 2016407, 2033702, 2051697, 2070068, 2087540, 2103439, 2118807, 2135621, 2154718, 2174470, 2191808, 2204927, 2214859, 2223820, 2232185, 2237939, 2239207]
58817B239207l081o430r707j3402j6660j9132k1878k5516k8907l0876l1920l2862
58805A998836l2974l1135k8187k6309k6171k6296k5471k4326k3969k4153k3674
58794A706171k2040k0113j9124j9358j9915j9796j9100j8784j9038j8629j6408
58783A493866j3080j0663j0381j1693j3255j4072j3824j2838j1898j1452j0990
58772A359720r798q262p602q190q978q894q016o977o053n193m348l199j313P93
58758A273690J553K22j730k171r13M02P78Q82J363J647J097K52j71o77k182m169
58742A269873n005m264l490m158n691o356n615m668m673n271n248m177k839k160
58728A206258k199k298j831o29J015K486L235L300L239L251K743J356Q2L66K038
$$ y = [2239207, 2236126, 2229696, 2219989, 2206587, 2189927, 2170795, 2148917, 2123401, 2094494, 2063618, 2031698, 1998836, 1965862, 1934727, 1906540, 1880231, 1854060, 1827764, 1802293, 1777967, 1753998, 1729845, 1706171, 1684131, 1664018, 1644894, 1625536, 1605621, 1585825, 1566725, 1547941, 1528903, 1510274, 1493866, 1480786, 1470123, 1459742, 1448049, 1434794, 1420722, 1406898, 1394060, 1382162, 1370710, 1359720, 1349922, 1341660, 1334058, 1325868, 1316890, 1307996, 1299980, 1293003, 1286950, 1281757, 1277409, 1274210, 1272897, 1273690, 1275243, 1275465, 1273735, 1271564, 1270651, 1271053, 1271831, 1272713, 1274076, 1275723, 1276820, 1277072, 1276901, 1276224, 1274042, 1269873, 1264868, 1260604, 1257114, 1252956, 1247265, 1240909, 1235294, 1230626, 1225953, 1220682, 1215434, 1211257, 1208418, 1206258, 1204059, 1201761, 1199930, 1199301, 1200316, 1202802, 1206037, 1209337, 1212576, 1215827, 1218570, 1219926, 1220008, 1220374, 1222412]
58713A222412L225K685J243K27n17j910l688m606m399m154m521m775m063k547
58699A194612q78O45J773K025J333M91K73O16J110J836L100M695O010O666O714
58684A231021O485O587P526Q963R862R797R547R901J0524J0847J1299J2536J3823
58671A358718J3676J2165J1258J2255J3940J4136J2397J0261R132Q876Q616Q046
58659A493476P494P122O760O416O363O538O407N739N062M853M713L943K580J099
58645A568565o25l123o147q749j0768j3213j6730k0448k2897k3409k2414k1017
58633A399025k0572k1606k2833k2272j9801j7532j6987j7206j6537j5067j3952
58622A194660j3309j2351j1017r988r406q788p963o986n526l461j692j152j270
$$ y = [1222412, 1225637, 1228322, 1229565, 1229792, 1229275, 1227365, 1223677, 1219071, 1214672, 1210518, 1205997, 1201222, 1197159, 1194612, 1193734, 1194379, 1196152, 1198177, 1199510, 1200001, 1200274, 1200890, 1202000, 1203836, 1206936, 1211631, 1217641, 1224307, 1231021, 1237506, 1244093, 1251619, 1260582, 1270444, 1280241, 1289788, 1299689, 1310213, 1321060, 1332359, 1344895, 1358718, 1372394, 1384559, 1395817, 1408072, 1422012, 1436148, 1448545, 1458806, 1467938, 1476814, 1485430, 1493476, 1500970, 1508092, 1514852, 1521268, 1527631, 1534169, 1540576, 1546315, 1551377, 1556230, 1560943, 1564886, 1567466, 1568565, 1567940, 1564817, 1558670, 1549921, 1539153, 1525940, 1509210, 1488762, 1465865, 1442456, 1420042, 1399025, 1378453, 1356847, 1334014, 1311742, 1291941, 1274409, 1257422, 1240216, 1223679, 1208612, 1194660, 1181351, 1169000, 1157983, 1147995, 1138589, 1129801, 1121838, 1114852, 1109326, 1105865, 1104173, 1103021, 1101751]
58609A101751o28J148L271N214O981Q306Q865R104R573R684Q443O154M067K533
58595A184466J038k82p19n03n03n04L16J181J21k976n638n941m640l337k326j332
58579A158421q66j492k721l652l904l311j747J19J015P01K56J64m34j844k709
58564A137996j881j30J206K025K705K823K120J676K671M622O222P243Q304R352
58550A186954R742R353Q523P275N652M261L486K748J485J51o93j468k533l051
58536A231885k354j594k281l771m042k660j139k93Q33L052N639P568Q781R566
58522A249190R669Q934Q122Q343R889J1983J3526J3946J3472J2721J2073J1706
58510A383574J2119J3830J6206J7509J6912J5831J6452J9271K2835K5396K6153
$$ y = [1101751, 1101123, 1102271, 1105542, 1110756, 1117737, 1126043, 1134908, 1144012, 1153585, 1163269, 1171712, 1177866, 1181933, 1184466, 1185504, 1185222, 1184503, 1184000, 1183497, 1182993, 1183309, 1184490, 1184611, 1181635, 1175997, 1170056, 1165416, 1162079, 1159753, 1158421, 1157555, 1156063, 1153342, 1149690, 1145786, 1142475, 1140728, 1140847, 1141862, 1142563, 1142819, 1142983, 1142549, 1140705, 1137996, 1136115, 1135985, 1137191, 1139216, 1141921, 1144744, 1146864, 1148540, 1151211, 1155833, 1162055, 1169298, 1177602, 1186954, 1196696, 1206049, 1214572, 1221847, 1227499, 1231760, 1235246, 1237994, 1239479, 1239630, 1238937, 1237469, 1234936, 1231885, 1229531, 1227937, 1225656, 1221885, 1217843, 1215183, 1214044, 1213751, 1214584, 1217636, 1223275, 1230843, 1239624, 1249190, 1258859, 1267793, 1275915, 1284258, 1294147, 1306130, 1319656, 1333602, 1347074, 1359795, 1371868, 1383574, 1395693, 1409523, 1425729, 1443238, 1460150, 1475981, 1492433, 1511704, 1534539, 1559935, 1586088]
58499A586088K5399K4318K4064K4271K3075J9472J4900J1431R234P161M933L050
58487A777396R94k394o710r988j1337j1924j2973j4327j5657j7506k0088k2207
58475A633279k2590k1692k1071k1363k1628k0583j7940j4589j1906j0700j0624
58464A438593j0634j0030q800p064m765k163j27N52Q4m55l00J84R4o72j190q44
58448A392463j68K13P65J931K496R05j785k468k08K221K191O76J25O44N64l77
58432A400188q74m75O0N52J430K184J967J623L023O205R196J0905J2101J3199
58418A461284J3241J1962J0857J1082J1825J1771J0829R392P286M624K530J768
58406A568451J364j51k763n075o030n687m703l686k882k150j381q90q44n08Q90
$$ y = [1586088, 1611487, 1635805, 1659869, 1684140, 1707215, 1726687, 1741587, 1753018, 1762252, 1769413, 1774346, 1777396, 1778390, 1775996, 1769286, 1759298, 1747961, 1736037, 1723064, 1708737, 1693080, 1675574, 1655486, 1633279, 1610689, 1588997, 1567926, 1546563, 1524935, 1504352, 1486412, 1471823, 1459917, 1449217, 1438593, 1427959, 1417929, 1409129, 1402065, 1397300, 1395137, 1395010, 1395562, 1395646, 1395191, 1394891, 1395075, 1395169, 1394497, 1393307, 1392463, 1392295, 1392508, 1393273, 1395204, 1397700, 1398605, 1396820, 1394352, 1394144, 1396365, 1398556, 1399232, 1399357, 1400001, 1400565, 1400188, 1399314, 1398839, 1398899, 1399451, 1400881, 1403065, 1405032, 1406655, 1409678, 1415883, 1425079, 1435984, 1448085, 1461284, 1474525, 1486487, 1497344, 1508426, 1520251, 1532022, 1542851, 1552243, 1559529, 1564153, 1566683, 1568451, 1569815, 1569664, 1566901, 1561826, 1555796, 1550109, 1545406, 1541720, 1538838, 1536688, 1535307, 1534417, 1533573, 1533065, 1533955]
58391A533955K579K738Q72j398k401k190j789j778k334l633n363o521o472n638
58377A500627m630l299j195J523M209O217P036O560N643N653P086R050J0431J0973
58363A565884J1093J1437J2630J4576J5814J4674J1426Q167O115M384K003j74
58351A678029q02k39o5q72j754j861j483j466k150k999l096k089o47L66R34J536
58335A661342J940J474M85L36J465K701L141L469M448N316N049M476N434P929
58321A709005R655Q878O701N671O689Q245Q607P884P438P887Q615R067R408R641
58307A823391R284Q565Q798J0633J2850J4040J4607J5705J7027J7355J6787J6524
58295A985566J6710J6321J5252J4595J4686J4606J4056J4018J5048J6329J7005
$$ y = [1533955, 1536534, 1539272, 1540144, 1538746, 1536345, 1534155, 1532366, 1530588, 1528254, 1524621, 1519258, 1512737, 1506265, 1500627, 1495997, 1492698, 1491503, 1493026, 1497235, 1503452, 1510488, 1517048, 1522691, 1528344, 1535430, 1544480, 1554911, 1565884, 1576977, 1588414, 1601044, 1615620, 1631434, 1646108, 1657534, 1665701, 1671816, 1676200, 1678203, 1678029, 1677227, 1676988, 1676923, 1676051, 1674297, 1672436, 1670953, 1669487, 1667337, 1664338, 1661242, 1659153, 1658506, 1658872, 1659806, 1661342, 1663282, 1664756, 1665241, 1665577, 1667042, 1669743, 1672884, 1676353, 1680801, 1686117, 1691166, 1695642, 1701076, 1709005, 1718660, 1727538, 1734239, 1739910, 1746599, 1754844, 1763451, 1771335, 1778773, 1786660, 1795275, 1804342, 1813750, 1823391, 1832675, 1841240, 1850038, 1860671, 1873521, 1887561, 1902168, 1917873, 1934900, 1952255, 1969042, 1985566, 2002276, 2018597, 2033849, 2048444, 2063130, 2077736, 2091792, 2105810, 2120858, 2137187, 2154192]
58284B154192J7119J6877J6356J6187J7191J9019K0538K1640K3115K4681K5124
58273B372039K4611K4796K6119K7079K6908K6799K7594K8320K8164K7931K8243
58262B668603K8134K6867K5440K4935K4901K4711K5056K6654K8857L0766L2396
58251B967320L3729L4184L4265L5858L9425M2673M3555M2926M2558M2348M1546
58240C400387M1101M2385M4664M6145M6727M7700M9319N0748N1877N3447N5697
58229C930197N8301O1220O4378O7123O9166P1261P3893P6332P8137Q0463Q4370
58218D714841Q8901R2329R4489R6648R9858J04466J10128J15480J19281J22653
58208E759074J28286J36402J43909J49187J54948J64009J74731J83730J91157
$$ y = [2154192, 2171311, 2188188, 2204544, 2220731, 2237922, 2256941, 2277479, 2299119, 2322234, 2346915, 2372039, 2396650, 2421446, 2447565, 2474644, 2501552, 2528351, 2555945, 2584265, 2612429, 2640360, 2668603, 2696737, 2723604, 2749044, 2773979, 2798880, 2823591, 2848647, 2875301, 2904158, 2934924, 2967320, 3001049, 3035233, 3069498, 3105356, 3144781, 3187454, 3231009, 3273935, 3316493, 3358841, 3400387, 3441488, 3483873, 3528537, 3574682, 3621409, 3669109, 3718428, 3769176, 3821053, 3874500, 3930197, 3988498, 4049718, 4114096, 4181219, 4250385, 4321646, 4395539, 4471871, 4550008, 4630471, 4714841, 4803742, 4896071, 4990560, 5087208, 5187066, 5291532, 5401660, 5517140, 5636421, 5759074, 5887360, 6023762, 6167671, 6316858, 6471806, 6635815, 6810546, 6994276, 7185433]
58199G185433J99856K10540K21360K31532K42029K52892K62830K71829K81695
58190I359996K93687L07380L21871L36537L50931L65339L81175L99630M20494
58181A2537040M43182M67659M93465N19498N45980N74766O06437O39411O73457
58172A7500895P11132P53814P99366Q46473Q98034R56968J021476J088217J157481
58163B5733856J231305J309056J389105J472791J562590J658501J760371J871327
58155C7988902J994641K129945K277432K443210K635316K856742L107206L388599
58147E8821993L703497M052620M441269M885341N403905O009173O710536P522928
58139A01551262Q461044R530029J0733501J2086659J3608662J5305055J7167015
$$ y = [7185433, 7385289, 7595829, 7817189, 8048721, 8290750, 8543642, 8806472, 9078301, 9359996, 9653683, 9961063, 10282934, 10619471, 10970402, 11335741, 11716916, 12116546, 12537040, 12980222, 13447881, 13941346, 14460844, 15006824, 15581590, 16188027, 16827438, 17500895, 18212027, 18965841, 19765207, 20611680, 21509714, 22466682, 23488158, 24576375, 25733856, 26965161, 28274217, 29663322, 31136113, 32698703, 34357204, 36117575, 37988902, 39983543, 42113488, 44390920, 46834130, 49469446, 52326188, 55433394, 58821993, 62525490, 66578110, 71019379, 75904720, 81308625, 87317798, 94028334, 101551262, 110012306, 119542335, 130275836, 142362495, 155971157, 171276212, 188443227]
58132A88443227J9172357K1258718K3298169K5120337K6533794K7243550K6721002
58125C57791154K4275009J9456014J2531124M567051l042577r261021j3785098
58118C92531656j6904210j9066266k0535529k1347612k1478383k1003842k0113503
58111B52082311j9017464j7867263j6744573j5682464j4679891j3714571j2764538
58104A41611547j1822416j0890382r972225r077253q223927p430298o703435o042838
58096G1448773n448875m921335m453623m035309l659105l321120l017275k744437
58088C9847694k502924k292831k109112j944161j793802j657283j533361j420274
58080B4593946j318094j227272j145750j070786j002569r42925q91304q44914
$$ y = [188443227, 207615584, 228874302, 252172471, 277292808, 303826602, 331070152, 357791154, 382066163, 401522177, 414053301, 418620352, 415577775, 406316754, 392531656, 375627446, 356561180, 336025651, 314678039, 293199656, 272195814, 252082311, 233064847, 215197584, 198453011, 182770547, 168090656, 154376085, 141611547, 129789131, 118898749, 108926524, 99849271, 91625344, 84195046, 77491611, 71448773, 65999898, 61078563, 56624940, 52589631, 48930526, 45609406, 42592131, 39847694, 37344770, 35051939, 32942827, 30998666, 29204864, 27547581, 26014220, 24593946, 23275852, 22048580, 20902830, 19832044, 18829475, 17886550, 16995246, 16150332]
58072A6150332q01808p61237p21980o83079o45251o09127n73202n36183n00162
58063A0318303m68507m41399m16179l91483l68324l47629l29292l13323k99437
58054F942730k85826k70726k55020k41050k29174k17755k06267j95824j86600
58045D854488j77311j67744j59484j53342j47981j42044j36013j30955j26579
58036C513035j21573j15181j07838j00711r4916r0637q6819q2250p6829p1298
58026B564983o6014o0855n6110n2383m9570m6872m4045m1896m1259m1966m3010
58015B021003m3354m2544m0942l9288l7807l6033l3809l2032l1641l2183l2127
58004A619243l0726k8871k7848k7618k6838k4519k1365j9089j8475j8639j8428
$$ y = [16150332, 15348524, 14587287, 13865307, 13182228, 12536977, 11927850, 11354648, 10818465, 10318303, 9849796, 9408397, 8992218, 8600735, 8232411, 7884782, 7555490, 7242167, 6942730, 6656904, 6386178, 6131158, 5890108, 5660934, 5443179, 5236912, 5041088, 4854488, 4677177, 4509433, 4349949, 4196607, 4048626, 3906582, 3770569, 3639614, 3513035, 3391462, 3276281, 3168443, 3067732, 2972816, 2882179, 2795360, 2713110, 2636281, 2564983, 2498969, 2438114, 2382004, 2329621, 2280051, 2233179, 2189134, 2147238, 2105979, 2064013, 2021003, 1977649, 1935105, 1894163, 1854875, 1817068, 1781035, 1747226, 1715194, 1683553, 1651370, 1619243, 1588517, 1559646, 1531798, 1504180, 1477342, 1452823, 1431458, 1412369, 1393894, 1375255, 1356827]
57993A356827j7782j7177j6543j5750j5518j6375j7146j6140j3800j2377j2746
57982A185473j3419j3221j3020j3754j4581j4297j3255j2477j1939j1114j0243
57971A044153r889j0043j0668j2089j3723j3703j1237q251p160p922q862r421
57959I21185j0110j0542r772q349p882q507q650p607o484o137n857m886l820l507
57945H19075l561k966j586k71K52P6j82r1J98K71K22O73J751K645K698K374K433
57928H24011K696K550K152K120K357K264J847J488P90j019l528n162n049l808
57914H23709k345r90o6j83j327k513k928k783k594k421k307k816m353o282p384
57899G82417p179o388o041o277o176m858k793j608k364m383o164o972o956o217
$$ y = [1356827, 1339045, 1321868, 1305325, 1289575, 1274057, 1257682, 1240536, 1224396, 1210596, 1198219, 1185473, 1172054, 1158833, 1145813, 1132059, 1117478, 1103181, 1089926, 1077449, 1065510, 1054396, 1044153, 1034264, 1024221, 1013553, 1001464, 987741, 974038, 962801, 954550, 947390, 939468, 930606, 921185, 911075, 900533, 890761, 882412, 874530, 866023, 857373, 849766, 843282, 837145, 831288, 826402, 822582, 819075, 815514, 812548, 810962, 810691, 810943, 811019, 810837, 810746, 810944, 811215, 811437, 812110, 813861, 816506, 819204, 821578, 824011, 826707, 829257, 831409, 833529, 835886, 838150, 839997, 841485, 842275, 841256, 837728, 832566, 827517, 823709, 821364, 820374, 820308, 820125, 818798, 816285, 813357, 810574, 807980, 805559, 803252, 800436, 796083, 789801, 782417, 775238, 768850, 762809, 756532, 750356, 745498, 742705, 741097, 738733, 734350, 728186, 721214, 714258, 708041]
57885G08041m690k789j217j9J412L292N039O008N974N009L604K904L861O001P749
57870G50179Q214P911P574P163O369N208L658J423j380l820m945m717l894l495
57856G75448m492p248j0716j2758j1957q988n964m688n583p685r355r561q854
57843F67599q657r388r985r654r101r256r564q708o684m949m471m642m433l815
57829E64292l437l465l293k330o91Q99J765J808J532J585K262L282L875L264J349
57814E72697j019k771l574l693l051j286J059K345J667J75l63J66N89O88J578
57799E65207L550N035M648L264K865L944N148N370N073N319O339P372P458O135
57785F36727L876K019J867L350M835M539K220n63j939j534q71j740m097o028o076
$$ y = [708041, 703351, 700562, 699345, 699326, 700738, 704030, 709069, 715077, 721051, 726060, 729664, 732568, 736429, 742430, 750179, 758393, 766304, 773878, 781041, 787410, 792618, 796276, 797699, 796319, 792499, 787554, 782837, 778943, 775448, 770956, 763708, 752992, 740234, 728277, 719289, 713325, 708637, 703054, 695369, 686014, 676453, 667599, 658942, 649554, 639569, 629915, 620814, 611558, 601994, 593286, 586602, 581653, 577182, 572540, 568107, 564292, 560855, 557390, 554097, 551767, 551076, 551975, 553740, 555548, 557080, 558665, 560927, 564209, 568084, 571348, 572697, 571678, 568907, 565333, 561640, 558589, 557303, 558362, 560707, 562374, 562549, 562186, 562352, 562941, 563629, 565207, 568757, 573792, 578440, 581704, 584569, 588513, 593661, 599031, 604104, 609423, 615762, 623134, 630592, 636727, 640603, 642622, 644489, 647839, 652674, 657213, 659433, 658870, 656931, 655397, 654526, 652786, 648689, 642661, 636585]
57770F36585m943m213m049l418k285k030l256m555m214k135O83L429N340N425
57756F16364L761K306K904M817N644M389K184J73j603l144m038m519n446o620
57742F17172o635n125l777l989m875m881m349m837o507p817p767p010o597o661
57728E36345o724o443n725m604l316k154j169k68M89R80J274J426J292Q70M77
57713E12750K52j53p34n12J425M416O627O878N410L025M43j473j991j460j176
57698E33727j787k521k494k119k414l447m296m403m146m083m249m323l912k585
57684D86948l05J916K547J282k40k61R87J865J720J345J048j41k309l295j136
57669D91971K769M887L868J841J049J070M78l01M55K935N184N432L896K052R53
$$ y = [636585, 631642, 627429, 623380, 619962, 617677, 615647, 612391, 607836, 603622, 601487, 602170, 605599, 610939, 616364, 620125, 622431, 625335, 630152, 635796, 640185, 642369, 642542, 640939, 637795, 633757, 629238, 623792, 617172, 610537, 605412, 601635, 597646, 592771, 587890, 583541, 578704, 572197, 564380, 556613, 549603, 543006, 536345, 529621, 523178, 517453, 512849, 509533, 507379, 506210, 505942, 506431, 507411, 508685, 510111, 511403, 512273, 512750, 513002, 512849, 512115, 511603, 513028, 517444, 524071, 530949, 536359, 539384, 539827, 538354, 536363, 534903, 533727, 531940, 529419, 526925, 524806, 522392, 518945, 514649, 510246, 506100, 502017, 497768, 493445, 489533, 486948, 486643, 488559, 491106, 492388, 492148, 491887, 492874, 494739, 496459, 497804, 498852, 498711, 496402, 493107, 491971, 494740, 499627, 503495, 505336, 506385, 507455, 507933, 507632, 508087, 511022, 516206, 521638, 525534, 527586, 528539]
57654E28539P27J136J961K783K869J684k99j711j633o63j00j47L07K023M233N509
57638E47218N206L833K480K108K791L432K959J895J789K828L329K266J022J426
57624E84582L123M417M971N981P860R525J0346J1388J3965J7870K1708K4578K6901
57611G47215K9810L4068L9458M4957M9309N1133M8698M0505K6882J0593m773j7015
57599A100840k5757l1317l3990l4263l3097l1752l1197l1251l0356k7103k2333
57588G68424j8636j7311j6954j5861j4328j3243j1880r157o170n128n921o121
57576F27714m549k690j937j553l57J257K267K680K920K561J035j011k219k155
57562F23963j543j111j025j205j514j560r05L71J600K115J929J733K002K208J376
$$ y = [528539, 529266, 530402, 532363, 535146, 538015, 539699, 539400, 537689, 536056, 535393, 535293, 535146, 535453, 537476, 541709, 547218, 552424, 556257, 558737, 560845, 563636, 567068, 570027, 571922, 573711, 576539, 579868, 582134, 583156, 584582, 587705, 592122, 597093, 603074, 610934, 620459, 630805, 642193, 656158, 674028, 695736, 720314, 747215, 777025, 811093, 850551, 895508, 944817, 995950, 1044648, 1085153, 1112035, 1122628, 1117855, 1100840, 1075083, 1043766, 1009776, 975513, 942416, 910664, 879467, 848216, 817860, 790757, 768424, 749788, 732477, 715523, 699662, 685334, 672091, 660211, 651054, 644884, 639756, 633835, 627714, 623165, 620475, 618538, 616985, 616628, 617885, 620152, 622832, 625752, 628313, 629348, 628337, 626118, 623963, 622420, 621309, 620284, 619079, 617565, 616005, 615100, 615471, 617071, 619186, 621115, 622848, 624850, 627058, 628434]
57547F28434l49j458r64J95N41K35O12J943L113L393L167K786K119J445J407J731
57531F48350J334J21n56J64J431K010J746J194Q77J319K687L887L361J371N3M73
57515F69822J187P06k34l49j70r33k073j846j0J824K436K173K016K587L880M971
57499F85987M432K104n9j25J365K511K969L963N549O114M941L571L632M764N633
57484G37351N876N962N909N293M159L080K425K163K237K717L590M658N554N798
57470G96772N163M143L724M430N728O503O073M707L422L211M220N529O012N390
57456H65027M359L757L880M546N542O845Q462J0012J0617R548P133M680L325L300
57442I51033M326O031P599P842O444M684M005M280M387M160M467N386N677M671
$$ y = [628434, 628085, 626627, 625663, 625858, 626399, 626634, 627246, 629189, 632302, 635695, 638862, 641648, 643767, 645212, 646619, 648350, 649684, 649805, 649249, 649413, 650844, 652854, 654600, 655794, 656671, 657990, 660677, 664564, 667925, 669296, 669349, 669822, 671009, 671715, 671481, 671132, 670962, 670029, 667956, 666110, 666100, 667924, 670360, 672533, 674549, 677136, 681016, 685987, 690419, 692523, 692464, 692339, 693704, 696215, 699184, 703147, 708696, 714810, 719751, 723322, 726954, 731718, 737351, 743227, 749189, 755098, 760391, 764550, 767630, 770055, 772218, 774455, 777172, 780762, 785420, 790974, 796772, 801935, 806078, 809802, 814232, 819960, 826463, 832536, 837243, 840665, 843876, 848096, 853625, 859637, 865027, 869386, 873143, 877023, 881569, 887111, 893956, 902418, 912430, 923047, 932595, 939728, 944408, 947733, 951033, 955359, 961390, 968989, 976831, 983275, 987959, 991964, 996244, 1000631, 1004791, 1009258, 1014644, 1020321, 1024992]
57428A024992L523L700M877N403M538L315L087M015N336O532P613Q371Q170O809
57414A100281N305N168O794Q961J0119J0016R800J0667J2469J3675J2785J0028
57402A216068P444O973Q518J0313J1053J0974J0797J0558R934R151Q918R704J1325
57389A341730J2957J3393J2027R751Q323Q513R540J0555J1614J2724J3086J2300
57377A476513J1300J0979J0700R563Q428Q984J1044J2481J2087J0951J0571J0943
57365A604544J1218J1201J1385J2080J3250J4742J6194J6988J6768J5949J5385
57354A759704J5591J6218J6296J5286J4039J4158J5950J7682J7641J6383J5868
57343A934816J6709J7548J7166J5957J5052J5045J5978J7634J9411K0591K1089
$$ y = [1024992, 1028515, 1032215, 1037092, 1042495, 1047033, 1050348, 1053435, 1057450, 1062786, 1069318, 1076931, 1085302, 1093472, 1100281, 1105586, 1110754, 1117548, 1126509, 1136628, 1146644, 1156444, 1167111, 1179580, 1193255, 1206040, 1216068, 1223512, 1230485, 1239003, 1249316, 1260369, 1271343, 1282140, 1292698, 1302632, 1311783, 1320701, 1330405, 1341730, 1354687, 1368080, 1380107, 1389858, 1398181, 1406694, 1416234, 1426789, 1438403, 1451127, 1464213, 1476513, 1487813, 1498792, 1509492, 1519055, 1527483, 1536467, 1547511, 1559992, 1572079, 1583030, 1593601, 1604544, 1615762, 1626963, 1638348, 1650428, 1663678, 1678420, 1694614, 1711602, 1728370, 1744319, 1759704, 1775295, 1791513, 1807809, 1823095, 1837134, 1851292, 1867242, 1884924, 1902565, 1918948, 1934816, 1951525, 1969073, 1986239, 2002196, 2017248, 2032293, 2048271, 2065905, 2085316, 2105907, 2126996]
57332B126996K1308K1238K0570J9780K0028K1614K3477K4604K5025K4978K4281
57321B373899K3177K2821K3917K5548K6252K5809K5186K5155K5701K6524K7387
57310B651376K8008K8079K7358K5780K3918K3159K4519K7044K8460K7858K6746
57299B942305K6830K7923K8917K9673L0585L1209L0803K9804K9241K9168K9075
57288C265533K9490L1303L3452L3348L0361K7192K6648K8377L0063L0806L1662
57277C598235L3178L4162L3357L1354L0094L0796L2718L3860L2810L0065K7550
57266C948179K6702K7282K8242K9327L0940L2622L2891L1296K9757L0642L3755
57255D281635L6394L6581L5124L3921L3296L2213L0544K9629L0357L1825L2580
$$ y = [2126996, 2148304, 2169542, 2190112, 2209892, 2229920, 2251534, 2275011, 2299615, 2324640, 2349618, 2373899, 2397076, 2419897, 2443814, 2469362, 2495614, 2521423, 2546609, 2571764, 2597465, 2623989, 2651376, 2679384, 2707463, 2734821, 2760601, 2784519, 2807678, 2832197, 2859241, 2887701, 2915559, 2942305, 2969135, 2997058, 3025975, 3055648, 3086233, 3117442, 3148245, 3178049, 3207290, 3236458, 3265533, 3295023, 3326326, 3359778, 3393126, 3423487, 3450679, 3477327, 3505704, 3535767, 3566573, 3598235, 3631413, 3665575, 3698932, 3730286, 3760380, 3791176, 3823894, 3857754, 3890564, 3920629, 3948179, 3974881, 4002163, 4030405, 4059732, 4090672, 4123294, 4156185, 4187481, 4217238, 4247880, 4281635, 4318029, 4354610, 4389734, 4423655, 4456951, 4489164, 4519708, 4549337, 4579694, 4611519, 4644099]
57244D644099L2450L2386L2855L3177L2464L0720K8801K7579K7376K8054K9324
57233D979285L0708L1415L0815K9377K8585K9360L0751L0916K9360K7444K6658
57222E304674K7213K8629L0743L3344L5421L5776L4420L2720L2100L2917L4536
57211E662493L6041L6737L6301L4766L2427K9769K7355K5536K4260K3353K2955
57200E991993K3373K4478K5719K6789K7789K8637K8987K9062K9917L2192L5024
57189F303960L6845L7003L6159L5347L5262L6157L7607L8404L7436L4933L2351
57178F701464L0824L0051K8940K7052K5219K4684K5698K7071K7400K6695K6272
57167G001370K6865K7684K7835K7962K9378L1999L4446L6184L8357M2011M6584
$$ y = [4644099, 4676549, 4708935, 4741790, 4774967, 4807431, 4838151, 4866952, 4894531, 4921907, 4949961, 4979285, 5009993, 5041408, 5072223, 5101600, 5130185, 5159545, 5190296, 5221212, 5250572, 5278016, 5304674, 5331887, 5360516, 5391259, 5424603, 5460024, 5495800, 5530220, 5562940, 5595040, 5627957, 5662493, 5698534, 5735271, 5771572, 5806338, 5838765, 5868534, 5895889, 5921425, 5945685, 5969038, 5991993, 6015366, 6039844, 6065563, 6092352, 6120141, 6148778, 6177765, 6206827, 6236744, 6268936, 6303960, 6340805, 6377808, 6413967, 6449314, 6484576, 6520733, 6558340, 6596744, 6634180, 6669113, 6701464, 6732288, 6762339, 6791279, 6818331, 6843550, 6868234, 6893932, 6921003, 6948403, 6975098, 7001370, 7028235, 7055919, 7083754, 7111716, 7141094, 7173093, 7207539, 7243723, 7282080, 7324091, 7370675]
57156G370675N0853N4589N8376O2252O5512O7784O9407P0604P0916O9857O7762
57145H078587O5546O3664O1786N9494N6906N4128N0492M5135L8518L2504K8272
57134H635032K4725J9782J2899N438j261o953j1618j4834j6752j8710k1943k6231
57122H579574l0368l3543l5542l6400l6712l7686l9683m1065l9779l5949l1617
57111H181230k8017k4611k1063j8380j7135j6082j4012j2099j2729j6378k1094
57100G979630k4838k6984k7500k6212k3437k0092j6521j2072o466p36L887P382
57088G806041J0501J3378J5344J5675J4051J0642O433K850L17k459o883j2453
57076G873437j7410k1285k5714l2338m0896m9874n8387o6611p4778q2594q9903
$$ y = [7370675, 7421528, 7476117, 7534493, 7596745, 7662257, 7730041, 7799448, 7870052, 7940968, 8010825, 8078587, 8144133, 8207797, 8269583, 8329077, 8385983, 8440111, 8490603, 8535738, 8574256, 8606760, 8635032, 8659757, 8679539, 8692438, 8697876, 8696615, 8689662, 8678044, 8663210, 8646458, 8627748, 8605805, 8579574, 8549206, 8515663, 8480121, 8443721, 8407009, 8369323, 8329640, 8288575, 8248796, 8212847, 8181230, 8153213, 8128602, 8107539, 8089159, 8072024, 8055942, 8041930, 8029831, 8017102, 8000724, 7979630, 7954792, 7927808, 7900308, 7874096, 7850659, 7830567, 7814046, 7801974, 7795508, 7794772, 7798659, 7806041, 7816542, 7829920, 7845264, 7860939, 7874990, 7885632, 7892065, 7894915, 7895232, 7892773, 7885890, 7873437, 7856027, 7834742, 7809028, 7776690, 7735794, 7685920, 7627533, 7560922, 7486144, 7403550, 7313647]
57065G313647r7455j06518j17754j30715j44697j59809j76783j95741k15731k35706
57055E732738k55561k75940k97447l20340l44517l69342l93902m18004m42770
57046B614915m69920n00765n36078E32025h8039o65808p11220p55467p98958q42959
57036c862451q90127r44763j011650j095409j201982j339977j519130j747666
57028a3613155k031675k375588k782155l254788l803190m442436n173461n950592
57020d3427040o661064p137921p205473o738350n710829m215408k439400o09123
57012h4144608J069798K451017L460850M094601M400251M452404M328023M096668
57004e5790996L822408L562550L357435L221524L145784L108227L083699L049652
$$ y = [7313647, 7216192, 7109674, 6991920, 6861205, 6716508, 6556699, 6379916, 6184175, 5968444, 5732738, 5477177, 5201237, 4903790, 4583450, 4238933, 3869591, 3475689, 3057685, 2614915, 2144995, 1644230, 1108152, 532025, -88039, -753847, -1465067, -2220534, -3019492, -3862451, -4752578, -5697341, -6708991, -7804400, -9006382, -10346359, -11865489, -13613155, -15644830, -18020418, -20802573, -24057361, -27860551, -32302987, -37476448, -43427040, -50088104, -57226025, -64431498, -71169848, -76880677, -81096085, -83535485, -84144608, -83074810, -80623793, -77162943, -73068342, -68668091, -64215687, -59887664, -55790996, -51968588, -48406038, -45048603, -41827079, -38681295, -35573068, -32489369, -29439717]
56996b9439717K989577K894586K762870K598142K408070K202110J989382J778306
56988i816674J577321J393679J230620J087023R60623Q50346P54952O71348N96270
56979f94492a65528C05123M21718L80497L44792L13279K85359K60484K38157K18292
56969B767701K01430J88216J78358J70343J62990J56954J52982J47941J34123
56960D261038J04546N9273O142m4360q4582j11762j27177j34284j36777j37254
56950C654803j37051j36736j36277j35029j32414j28836j25573j23567j22519
56941B476801j21380j19723j18284j17933j18175j17515j15550j13819j13463
56932A420959j12851j09257j02715r6204r1456q6632p9342p0272o1948n5175m8870
$$ y = [-29439717, -26450140, -23555554, -20792684, -18194542, -15786472, -13584362, -11594980, -9816674, -8239353, -6845674, -5615054, -4528031, -3567408, -2717062, -1962110, -1290762, -694492, -165528, 305123, 726841, 1107338, 1452130, 1765409, 2050768, 2311252, 2549409, 2767701, 2969131, 3157347, 3335705, 3506048, 3669038, 3825992, 3978974, 4126915, 4261038, 4365584, 4424857, 4430999, 4386639, 4302057, 4190295, 4063118, 3928834, 3792057, 3654803, 3517752, 3381016, 3244739, 3109710, 2977296, 2848460, 2722887, 2599320, 2476801, 2355421, 2235698, 2117414, 1999481, 1881306, 1763791, 1648241, 1534422, 1420959, 1308108, 1198851, 1096136, 999932, 908476, 821844, 742502, 672230, 610282, 555107, 506237]
56921E06237m2813l8240l5545l3342l0455k7319k4662k2102j9029j5862j3425
56910B03443j1679r961q107o424m825k861n84J382K779M145N989P940R174R374
56896A99785Q783P488N206K047j086l307m617n465n745m925l154j524r89j523
56882A90974k336k445j010J985N263P248P880Q583J0105J1521J2012J2369J3413
56869B75562J3816J1221N356j341o374r266j0904j1976j2585j2651j2177j1451
56857B17230j0971j0841j0434r305q104p672p472o188l836j916j218q70j74J81
56843A38410l74p31M23K440L574L551L797N041O230O170N163M390M500N461P137
56828A95182R259J1074J1651J0542P952M535J248r50j898k514l684m865m556k293
$$ y = [506237, 463424, 425184, 389639, 356297, 325842, 298523, 273861, 251759, 232730, 216868, 203443, 191764, 181803, 173696, 167272, 162447, 159586, 159002, 160384, 163163, 167308, 173297, 181237, 190411, 199785, 208568, 216056, 221262, 223309, 222223, 218916, 214299, 208834, 203089, 198164, 195010, 193486, 192497, 190974, 188638, 186193, 185183, 187168, 192431, 199679, 207559, 216142, 226247, 237768, 249780, 262149, 275562, 289378, 300599, 305955, 304614, 298240, 288974, 278070, 266094, 253509, 240858, 228681, 217230, 206259, 195418, 184984, 175679, 167575, 159903, 152431, 146243, 142407, 140491, 139273, 138403, 138229, 138410, 138036, 137305, 137728, 140168, 143742, 147293, 151090, 156131, 162361, 168531, 173694, 178084, 182584, 188045, 195182, 204441, 215515, 227166, 237708, 245660, 250195, 251443, 250493, 248595, 246081, 242397, 237532, 232976, 230683]
56814B30683M43J889K012K252L601N752Q104J0607J3273J5650J7529J9532K2223
56801C53550K4794K5581K3990K1203J8614J6135J2540P304J527l062n735p038
56789D89403p638p416o031l959k207r69P38L831Q091J2634J6886K0613K3632K6131
56775E73739K8797L1750L3546L2145K6924J9164J0596K134n888j2997j8475k1643
56763F99792k2204k0740j8709j7356j6537j5109j2488r240o059k894O91M810R127
56750E73084J3031J5743J6765J6326J4969J2647Q771L174l558j0623j7167k1906
56738F21256k3732k3166k2231k2271k2487k1314j8503j5129j2103r538p306n385
56726D18091l696k154p78N47K229M310N925N912L898M45l662p802j1372j3817
$$ y = [230683, 231126, 233015, 235027, 237279, 240880, 246632, 254736, 265343, 278616, 294266, 311795, 331327, 353550, 378344, 403925, 427915, 449118, 467732, 483867, 496407, 503711, 505238, 502176, 496441, 489403, 481765, 474349, 468318, 464359, 462152, 461183, 461921, 465752, 473843, 486477, 503363, 523976, 547608, 573739, 602536, 634286, 667832, 699977, 726901, 746065, 756661, 758795, 752907, 739910, 721435, 699792, 677588, 656848, 638139, 620783, 604246, 589137, 576649, 567409, 561350, 558456, 559147, 563957, 573084, 586115, 601858, 618623, 634949, 649918, 662565, 671336, 674510, 670952, 660329, 643162, 621256, 597524, 574358, 552127, 529856, 507369, 486055, 467552, 452423, 440320, 430782, 423476, 418091, 414395, 412241, 411463, 412010, 414239, 418549, 424474, 430386, 434284, 434729, 431067, 423265, 411893, 398076]
56712C98076j4955j5075j4750j4588j4829j5018j4320j2472j0271q951r230j0841
56700B42776j2596j2949j1209q420o481o112o330o008n101m068l118k631l219
56687A54534m546m985l562j483o40j244k134k750l402l952l786l004k298j647
56673A15101m76P98Q52o08k240k860k653k208j439k11Q74J092M66m50j096j018
56657A03924j06R44J179O87N36J193J885J843J229L75p13j484p44J625L777L978
56641A20128K697J528Q01k74j542j762o00O91J023P16N21M36J87P1M83J070J176
56624A27350R45J172K052K664K088N03j178k450l384l768k957r54J040J956K172
56609A27251K705L411L133J639R3o17q89j146q75K58J338J448J194J791L077L732
$$ y = [398076, 383121, 368046, 353296, 338708, 323879, 308861, 294541, 282069, 271798, 262847, 253617, 242776, 230180, 217231, 206022, 197602, 191121, 185009, 178679, 172671, 167570, 163502, 160384, 157753, 154534, 149988, 145003, 141441, 139958, 139318, 138074, 135940, 133190, 129788, 125836, 122050, 119046, 116748, 115101, 114625, 115423, 116275, 115667, 113427, 110567, 107914, 105706, 104267, 104056, 104930, 106022, 106488, 106038, 104942, 103924, 103818, 104762, 105941, 106628, 107164, 108357, 110242, 112085, 113314, 113689, 112976, 111492, 110748, 112373, 116150, 120128, 122825, 124353, 125154, 124880, 123338, 121576, 120976, 121667, 122690, 123406, 123927, 124363, 124550, 124621, 125104, 126174, 127350, 128295, 129467, 131519, 134183, 136271, 136774, 135596, 133146, 129762, 125994, 123037, 122083, 123123, 125079, 127251, 129956, 133367, 136500, 138139, 138232, 137615, 136726, 135580, 134705, 134963, 136301, 137749, 138943, 140734, 143811, 147543]
56593A47543L206K199J320N33PK64J109J444P06k98n07J11Q67J384J661J611J128
56576A64288N14K72M33M44j89j189j605p01J194K902L638L710L742L618K824J563
56560A85458P36O93Q20N83L30N70J096J367J442J881K830L695L746K827J373M2
56544B09489o74o98l38MK18N41J195J938K103J258j84j277j532j248q40k94L80
56527B10041P38M94J30K77O30K35j168k726l385k645n06K457M851N255L826K438
56511B20942K648L960M695M104L005K494K731L063K978K792L331M898O629P337
56497B75607P043P061Q179R298Q565N727K603J202J771K848K895J634J1r07q56
56482C32681l58o2l07j089k030k388j718o55n04j664k943l010k128j811k792m116
$$ y = [147543, 150749, 152948, 154268, 154801, 154808, 155072, 156181, 157625, 158331, 158033, 157526, 157637, 158504, 159888, 161549, 163160, 164288, 164802, 165074, 165507, 165951, 165762, 164573, 162968, 162267, 163461, 166363, 170001, 173711, 177453, 181071, 183895, 185458, 186194, 186887, 187707, 188290, 188620, 189190, 190286, 191653, 193095, 194976, 197806, 201501, 205247, 208074, 209447, 209489, 208815, 208117, 207779, 207783, 208001, 208542, 209737, 211675, 213778, 215036, 214852, 213575, 212043, 210795, 209955, 209661, 210041, 210779, 211273, 211403, 211680, 212310, 212545, 211377, 208651, 205266, 202621, 202115, 204572, 209423, 214678, 218504, 220942, 223590, 227550, 232245, 236349, 239354, 241848, 244579, 247642, 250620, 253412, 256743, 261641, 268270, 275607, 282650, 289711, 297890, 307188, 315753, 321480, 324083, 325285, 327056, 329904, 332799, 334433, 334444, 333537, 332681, 332323, 332261, 331954, 330865, 328835, 326447, 324729, 324074, 323570, 321906, 318963, 315953, 313825, 312014, 309222, 305106]
56466C05106m370l372k211j909k350k618k151j366j055j367j685j607j537j984
56452B75524k510k082n42Q06N40j097k223j376P96K222J676j53j904l128m014
56437B62535m212k978n98J315J569P16J74M35Q27O86J2q65j611j781j169m22p60
56420B53873k458l960l294m82K086K311R36N73K122L447K307l75j594j96J890
56405B57186K522J847J244J148J122J280K195L611M428L920K389P11j41M88K106
56390B86056K970J744p69k409k162j026l26k39k60k19j79N1P63J814K665K806
56374B91280K128J055K60j7j97n68p09k44K79K00Q5J043K756L598K986K205K269
56357C08409K381J517K97k4M43O74O38J151K051K079R17l4M29J585J688J37j804
$$ y = [305106, 300736, 297364, 295153, 293244, 290894, 288276, 286125, 284759, 283704, 282337, 280652, 279045, 277508, 275524, 273014, 270932, 270390, 271196, 271736, 270639, 268416, 267040, 267836, 270058, 271734, 271581, 269677, 266549, 262535, 258323, 255345, 254747, 256062, 257631, 258347, 258521, 258956, 259783, 260469, 260481, 259616, 258005, 256224, 255055, 254633, 253873, 251415, 247455, 244161, 243679, 245765, 248076, 249012, 249585, 251707, 255154, 257461, 257086, 255492, 255296, 257186, 259708, 261555, 262799, 263947, 265069, 266349, 268544, 272155, 276583, 280503, 282892, 283603, 283462, 283950, 286056, 289026, 290770, 290001, 287592, 285430, 284404, 284078, 283839, 283579, 283360, 283181, 283232, 283995, 285809, 288474, 291280, 293408, 294463, 294723, 294706, 294509, 293941, 293232, 292988, 293267, 293467, 293552, 294595, 297351, 300949, 303935, 306140, 308409, 310790, 312307, 312604, 312580, 313023, 313697, 314335, 315486, 317537, 319616, 320533, 320499, 320928, 322513, 324201, 324338, 322534]
56340C22534k325q06J584K930K401J028M51J124K159K651K480J921J283J042J600
56325C42057K586L084K812K476K572K508J462l48j829k150j264L35J893K660K406
56310C61260J633Q96J87o23j077n24Q45K015K251J712R62L64R2K61P20J067J055
56293C73096P97N21M32Q20J846L073L621L115K132J442J090O23o9m92j05J242
56277C93184L206M993N639M708K777R48j12m77l90J93J347K801L945M145L202
56262D30109J763J183K394M694O077N139K503J54m27O97K336L130K405O50o44
56247D62163j61K023M519N983O127N479M640M095M266N187O198O406N553M154
56233E26632K798J682Q65N60Q65J451J839K017K566M077O431Q685R751R366Q304
$$ y = [322534, 320209, 319403, 320987, 323917, 326318, 327346, 327797, 328921, 331080, 333731, 336211, 338132, 339415, 340457, 342057, 344643, 347727, 350539, 353015, 355587, 358095, 359557, 359209, 357380, 355230, 353966, 354301, 356194, 358854, 361260, 362893, 363789, 363976, 363353, 362276, 361752, 362597, 364612, 366863, 368575, 369537, 369901, 369993, 370254, 370974, 372041, 373096, 373893, 374414, 374846, 375666, 377512, 380585, 384206, 387321, 389453, 390895, 391985, 392608, 392539, 392047, 391942, 393184, 396390, 401383, 407022, 411730, 414507, 415455, 415343, 414866, 414476, 414669, 416016, 418817, 422762, 426907, 430109, 431872, 433055, 435449, 440143, 446220, 451359, 453862, 454016, 453589, 454286, 456622, 459752, 462157, 462807, 462163, 462002, 464025, 468544, 474527, 480654, 486133, 490773, 494868, 499134, 504321, 510519, 516925, 522478, 526632, 529430, 531112, 531977, 532537, 533402, 534853, 536692, 538709, 541275, 545352, 551783, 560468, 570219, 579585, 587889]
56218E87889P565P399P429P530P971Q648Q893Q536Q546R848J1807J2800J2301
56205G07162J1601J2236J4318J6705J8261J8687J8602J9197K1383K4838K8191
56194I11181L0466L2006L3741L5960L8352M0892M3958M7594N1170N3970N5926
56183A375216N7615N9550O1470O2424O1772N9933N7731N5143N1369M6151M0024
56172A988398L2975K4016J3030K053o629j3228k0013k8161l6226m1955m4592m5151
56160A824517m5241m5964m7345m8456m8429m7408m6090m4692m3002m1196l9621
56149A327073l7963l5710l3346l1781l0518k7994k4207k1325k0647k0489j8551
56138A024542j5242j2822j1933j0998q977o820n609m863l689k585k762m118m975
$$ y = [587889, 595454, 602853, 610282, 617812, 625783, 634431, 643324, 651860, 660406, 670254, 682061, 694861, 707162, 718763, 730999, 745317, 762022, 780283, 798970, 817572, 836769, 858152, 882990, 911181, 941647, 973653, 1007394, 1043354, 1081706, 1122598, 1166556, 1214150, 1265320, 1319290, 1375216, 1432831, 1492381, 1553851, 1616275, 1678047, 1737980, 1795711, 1850854, 1902223, 1948374, 1988398, 2021373, 2045389, 2058419, 2060472, 2053843, 2040615, 2020602, 1992441, 1956215, 1914260, 1869668, 1824517, 1779276, 1733312, 1685967, 1637511, 1589082, 1541674, 1495584, 1450892, 1407890, 1366694, 1327073, 1289110, 1253400, 1220054, 1188273, 1157755, 1129761, 1105554, 1084229, 1063582, 1043093, 1024542, 1009300, 996478, 984545, 973547, 964570, 957750, 952141, 947278, 943589, 941004, 938242, 934124, 929149]
56125I29149m038j800K81J491K238K974L479L455L355L900M869N082L906K378
56111I60719K309M276O833P926P049N803O157Q261J0467J1533J1972J2809J3842
56098A069956J4165J3875J4061J5228J6937J8953K1383K3515K4025K3045K2730
56087A277873K4853K8751L2531L5456L8171M1311M5008M9382N4497O0041O5675
56076A753549P1477P7496Q3384Q9051R5019J01196J05799J06554J02935R6524
56066B682984Q9379Q2793P7366P3183O9601O5389N9421N1042M0077K6907J2737
56055C330879n10j0876j7463k1465k5800l2768m1897n0826n8333o5242p2092p7491
56043B856116p9737p8962p6451p2728o7455o0696n3192m5797l9406l4806l1741
$$ y = [929149, 925111, 923311, 923592, 925083, 927321, 930295, 933774, 937229, 940584, 944484, 949353, 954435, 958341, 960719, 963028, 967304, 974137, 982063, 989112, 994915, 1001072, 1009333, 1019800, 1031333, 1043305, 1056114, 1069956, 1084121, 1097996, 1112057, 1127285, 1144222, 1163175, 1184558, 1208073, 1232098, 1255143, 1277873, 1302726, 1331477, 1364008, 1399464, 1437635, 1478946, 1523954, 1573336, 1627833, 1687874, 1753549, 1825026, 1902522, 1985906, 2074957, 2169976, 2271172, 2376971, 2483525, 2586460, 2682984, 2772363, 2855156, 2932522, 3005705, 3075306, 3140695, 3200116, 3251158, 3291235, 3318142, 3330879, 3330369, 3319493, 3302030, 3280565, 3254765, 3221997, 3180100, 3129274, 3070941, 3005699, 2933607, 2856116, 2776379, 2697417, 2620966, 2548238, 2480783, 2420087, 2366895, 2321098, 2281692, 2246886, 2215145]
56032B215145k8753k4828k0549j6908j3843j0834q032n654l145j32K588M370O132
56019B095557R041J2570J5365J7469J9961K2923K5347K6800K7625K7799K7153
56008B327610K6487K7044K8953L1444L4108L6606L7822L7039L5657L5893L8031
55997B696694M0491M2330M3836M4980M5285M5321M6403M8599N0642N1885N2744
55986C209210N3434N3945N5214N8320O2516O5970O8465P1336P4752P7295P8630
55975C929087Q0357Q3507Q7085R0000R2771R6531J01555J07313J12966J17836
55965D899008J22429J28500J36693J44918J51107J56668J64530J74395J83154
55956F261402J90013J97834K08654K21100K33220K45043K57146K69311K81852
$$ y = [2215145, 2186392, 2161564, 2141015, 2124107, 2110264, 2099430, 2091398, 2085744, 2082599, 2082467, 2085055, 2089425, 2095557, 2104598, 2117168, 2132533, 2150002, 2169963, 2192886, 2218233, 2245033, 2272658, 2300457, 2327610, 2354097, 2381141, 2410094, 2441538, 2475646, 2512252, 2550074, 2587113, 2622770, 2658663, 2696694, 2737185, 2779515, 2823351, 2868331, 2913616, 2958937, 3005340, 3053939, 3104581, 3156466, 3209210, 3262644, 3316589, 3371803, 3430123, 3492639, 3558609, 3627074, 3698410, 3773162, 3850457, 3929087, 4009444, 4092951, 4180036, 4270036, 4362807, 4459338, 4560893, 4668206, 4781172, 4899008, 5021437, 5149937, 5286630, 5431548, 5582655, 5739323, 5903853, 6078248, 6261402, 6451415, 6649249, 6857903, 7079003, 7312223, 7557266, 7814412, 8083723, 8365575]
55947H365575K95962L11517L26638L40443L54335L69922L87553M07288M29010
55938A1588243M51354M73023M95344N20883N49589N79381O10473O45491O85088
55929A6598869P27314P71854Q20733Q74120R29757R87420J049443J115756J183328
55920B5058594J251929J325407J405534J489972J578484J675802J785874J908756
55912C7480352K046002K203632K386621K595656K832065L100351L403347L741785
55904E9789811M122488M560728N071551N666001O358133P165508Q097396R151826
55896A09983442J0329459J1640863J3096608J4702324J6462659J8362347K0324521
55889B14902223K2196519K3762000K4695631K4463451K2369378J7912532J1257751
$$ y = [8365575, 8661537, 8973054, 9299692, 9640135, 9994470, 10364392, 10751945, 11159233, 11588243, 12039597, 12512620, 13007964, 13528847, 14078436, 14657817, 15268290, 15913781, 16598869, 17326183, 18098037, 18918770, 19792890, 20722647, 21710067, 22759510, 23875266, 25058594, 26310523, 27635930, 29041464, 30531436, 32109920, 33785722, 35571596, 37480352, 39526354, 41729986, 44116607, 46712263, 49544328, 52644679, 56048026, 59789811, 63912299, 68473027, 73544578, 79210579, 85568712, 92734220, 100831616, 109983442, 120312901, 131953764, 145050372, 159752696, 176215355, 194577702, 214902223, 237098742, 260860742, 285556373, 310019824, 332389202, 350301734, 361559485]
55882C61559485L366971m405077j0932485j5675657j8627667k0071868k0389594
55875B74824108j9958968j9092177j8004282j6827059j5641462j4495103j3409586
55868A57395471j2393393j1451925j0584404r780072r025402q312131p635565
55861H8212579o991455o379402n804698n272331m782502m334441l929818l568691
55853D7149241l245653k953346k687154k444700k224295k026244j852497j702591
55845B8012761j572146j456707j354273j263119j180387j104211j034312r69512
55837A8078094r07786q49536p97154p50178p04665o58815o15433n76910n41228
55828A1676389n05143m68229m31552l95215l59568l26361k96473k68476k41469
$$ y = [361559485, 364926456, 360521379, 349588894, 333913237, 315285570, 295213702, 274824108, 254865140, 235772963, 217768681, 200941622, 185300160, 170805057, 157395471, 145002078, 133550153, 122965749, 113185677, 104160275, 95848144, 88212579, 81221124, 74841722, 69037024, 63764693, 58982191, 54647750, 50717932, 47149241, 43903588, 40950242, 38263088, 35818388, 33594093, 31567849, 29715352, 28012761, 26440615, 24983908, 23629635, 22366516, 21186129, 20081918, 19047606, 18078094, 17170308, 16320772, 15523618, 14773440, 14068775, 13409960, 12794527, 12217617, 11676389, 11171246, 10703017, 10271465, 9876250, 9516682, 9190321, 8893848, 8625372, 8383903]
55819H383903k17442j99285j88233j84570j88421j98126k09776k20145k28638
55810F549267k35457k39884k41526k41034k38328k32272k23260k13834k05405
55801D478267j96720j86852j77195j68815j60360j50599j40828j32628j25311
55792C038959j17559j09813j02963r6438q9640q3546p8979p4882p0249o6012o2936
55781B085942n9509n4431m9569m7630m7909m7146m3993m0118l7230l5279l3601
55770A589527l2009l0645k9912l0174l0522k8952k5176k1990k1949k3690k3797
55759A290711k1506j9139j8179j7529j6057j4567j4305j5099j5831j5803j4895
55748A107801j3196j1025q949p527p165p847q672q250o350m548m324n015m742
$$ y = [8383903, 8166461, 7967176, 7778943, 7594373, 7405952, 7207826, 6998050, 6777905, 6549267, 6313810, 6073926, 5832400, 5591366, 5353038, 5120766, 4897506, 4683672, 4478267, 4281547, 4094695, 3917500, 3748685, 3588325, 3437726, 3296898, 3164270, 3038959, 2921400, 2811587, 2708624, 2612186, 2522546, 2439000, 2360021, 2285139, 2214890, 2148878, 2085942, 2026433, 1972002, 1922433, 1874803, 1826894, 1779748, 1735755, 1695637, 1658407, 1623128, 1589527, 1557518, 1526873, 1496961, 1466787, 1436265, 1407313, 1382137, 1360147, 1338198, 1314508, 1290711, 1269205, 1250066, 1231887, 1214358, 1198301, 1183734, 1169429, 1154330, 1138499, 1122696, 1107801, 1094605, 1083580, 1074631, 1067104, 1059939, 1052092, 1043420, 1035170, 1028820, 1024272, 1019948, 1014933, 1010191]
55735A010191k990j125m02n56n82j19J46p99l121n541o393n617n124o686j0067
55720I61215j3682j6334j7672j7753j7083j6489j6066j4790j2008q741o655o224
55708G97718o692p306p720p771p703q130q936q939p600o306o804q818j0533j1012
55694F83448j0798j0448r851r093q688q705q600q169p864p950q077p877p419o949
55680E62960o622o603o948p328p198o341n101m245m520n867p024o573m743l419
55666D80428l900n373o211n955n314m827m555m536m674m432l391j898n40N90J472
55651D26884J585N51j068k319k797k517j444KN60p21l223n434o550o746o318n400
55635C85045m319l463k995l075l808m556m168k605j412j728k695k909k467k257
$$ y = [1010191, 1007201, 1006076, 1005674, 1005118, 1004536, 1004417, 1004563, 1003764, 1000643, 995102, 988709, 983092, 977968, 971282, 961215, 947533, 931199, 913527, 895774, 878691, 862202, 846136, 831346, 819338, 810597, 803942, 797718, 791026, 783720, 776000, 768229, 760526, 752396, 743460, 734521, 726921, 720615, 713811, 704993, 694460, 683448, 672650, 662202, 652351, 643258, 634570, 625865, 617265, 609096, 601232, 593282, 585205, 577328, 569909, 562960, 556338, 549735, 542787, 535459, 528261, 521920, 516819, 512574, 508054, 502187, 495163, 488590, 483847, 480428, 476528, 471155, 464944, 458989, 453675, 448848, 444293, 439757, 435083, 430651, 427260, 425362, 424822, 425412, 426884, 428469, 429020, 427952, 425633, 422836, 420319, 418875, 418877, 419437, 418716, 415493, 410059, 403509, 396763, 390445, 385045, 380726, 377263, 374268, 371193, 367385, 362829, 358661, 356056, 354644, 352916, 350221, 347312, 344845, 342588]
55621C42588k161j616j228k018l310l328j858o41q26j659k033j930j732j321n75
55606C16352Q5K15k00r75j811k014j025O28J668J514O85k77j263j908j481J5J395
55589C11603J598R01M35Q69J946L023L748M176M355L853K079p84l546n027n087
55574C24142m449l941m121n024n902n854m983m179l588k507j197j247l114m845
55560B69191m637l334k804l107l154k953l037k645r04Q87P52o51r07K13N20o99
55544B42731j645j422j556k967m196l988l273k927j933M08K399K180N85k35J07
55529B24268M23J38m82j476k831l674l246k033o72J295M132O408O547N189M275
55514B38261M340M401M026L724L591L289L184L861M687M476L439K722K102J72
$$ y = [342588, 340427, 338811, 337583, 335565, 332255, 328927, 327069, 326428, 325602, 323943, 321910, 319980, 318248, 316927, 316352, 316437, 316652, 316452, 315477, 313666, 311652, 310627, 311255, 312923, 314437, 315122, 314845, 313582, 311674, 310193, 310208, 311603, 313201, 314102, 314537, 315406, 317352, 320375, 324123, 328299, 332654, 336507, 338586, 337802, 334256, 329229, 324142, 319693, 315752, 311631, 306607, 300705, 294851, 289868, 285689, 282101, 279594, 278397, 277150, 274036, 269191, 264554, 261220, 258416, 255309, 252155, 249202, 246165, 243520, 242616, 243503, 244255, 243604, 242697, 242910, 243430, 242731, 241086, 239664, 238108, 235141, 230945, 226957, 223684, 220757, 218824, 219232, 221631, 223811, 224396, 224161, 224268, 224691, 224829, 224347, 222871, 220040, 216366, 213120, 211087, 210415, 211710, 215842, 222250, 228797, 233986, 238261, 242601, 247002, 251028, 254752, 258343, 261632, 264816, 268677, 273364, 277840, 281279, 284001, 286103, 286275]
55500B86275k894m880m684m071n091p155q120p314n983n272n142n167n184n011
55486B10307m335l231k218j610j174o04O7O48J061J104K98j545l678m830m505
55471A85755l438k602k130j672j217r48n56L62J322J247L0j152j514j768k876
55456A68843m294m367k319P06K631K240J84j565j588m07L20pk82M94J648J841
55440A64078Q72l52j227j857k296k309j942j555j147l26Q05J373P39o12j599j913
55424A50732k241k948k975r31K666N177M678K278N57K41o6j038j437l37J224J952
55408A57532K200K793L021J561j224l491m205l772k601o49J510K626K291J402
55394A58994O51l76j984l281l206k058j157j127j253o24O47J580J593J211J364
$$ y = [286275, 283381, 278501, 273817, 269746, 264655, 257500, 249380, 242066, 236083, 230811, 225669, 220502, 215318, 210307, 205972, 202741, 200523, 198913, 197739, 197135, 197202, 197850, 198911, 200015, 200313, 198768, 195090, 190260, 185755, 182317, 179715, 177585, 175913, 174696, 173748, 173192, 173554, 174876, 176123, 176153, 175001, 173487, 171719, 168843, 164549, 160182, 157863, 158569, 161200, 163440, 163624, 162059, 160471, 160064, 160384, 160377, 160095, 160589, 162237, 164078, 164950, 164598, 163371, 161514, 159218, 156909, 154967, 153412, 152265, 151939, 152744, 154117, 154856, 154244, 152645, 150732, 148491, 145543, 142568, 141637, 144303, 149480, 154158, 156436, 156993, 157234, 157168, 156130, 154693, 154356, 155580, 157532, 159732, 162525, 165546, 167107, 165883, 162392, 158187, 154415, 151814, 151165, 152675, 155301, 157592, 158994, 159645, 159269, 157285, 154004, 150798, 148740, 147583, 146456, 145203, 144579, 145226, 146806, 148399, 149610, 150974]
55379A50974K069K345J536K49n18p27j073j611j392K42K521L831L334J802P46
55364A64328P25P88j90j841k580j529N63K458L646M103L739K750J726P39q73l043
55348A75509m200l155j032ln38j276j242o54K94J693K701J825r13l442m066l310
55332A58191k551j986j048J33Q94J217J577J894J644R34N23O05L61r11k608l252
55316A55617k082m0J025K64j187j489k13J217J313J77r04j083p60r07j950l262
55300A45736l709k720q96O94J601K081K268J887R77K36K81R19J494J689J673J671
55284A55882J703J638J336Q33L69O4l62j175k028k220j593o80PL46K90r3j31R78
55266A55164K802L606K257l41k306k745k102j129l03Q0P4J86O63R16K63r14j565
$$ y = [150974, 153043, 155388, 156924, 157173, 156655, 155928, 154855, 153244, 151852, 152094, 154615, 158446, 161780, 163582, 164328, 165053, 165841, 165651, 163810, 161230, 159701, 160264, 162722, 166368, 170471, 174210, 176960, 178686, 179425, 178552, 175509, 171309, 168154, 167122, 167119, 166581, 165305, 164063, 163409, 163703, 165396, 168097, 169922, 169009, 165567, 161501, 158191, 155640, 153654, 152606, 152739, 153633, 154850, 156427, 158321, 159965, 160899, 161422, 162027, 162388, 161477, 158869, 155617, 153535, 153495, 154520, 154784, 153597, 152108, 151895, 153112, 154425, 154602, 153698, 152615, 151855, 150948, 148998, 145736, 142027, 139307, 138411, 139105, 140706, 142787, 145055, 146942, 147919, 148155, 148436, 149355, 150849, 152538, 154211, 155882, 157585, 159223, 160559, 161392, 161761, 161825, 161463, 160288, 158260, 156040, 154447, 153767, 153774, 154120, 154410, 154317, 154186, 155164, 157966, 161572, 163829, 163488, 161182, 158437, 156335, 155206, 154903, 154983, 155057, 155243, 155906, 156822, 157085, 156171, 154606]
55249A54606j317q08p41j297k290l082k546k48K253K612O85r32k27J569J957Q71
55233A51065N83K049L423K891J312P00J056M98j727m004m512l314j574J88J989
55218A50623L207K866J187k52l29L86P21N65P72J623K229J725M99k40J5M14j67
55201A65844j707k999k920j466M72J930K375J859J109J141K168L086K568P34q72
55186A73322j120n78n63j431k317k414j816j079m32K11P55R17P09O13J012J564
55170A67353J478N28m99o08K21J004R80N40O43J506K313K244J368K93p21j720
55154A76923k365k055r42o8l7j41N42J679K147J658R20L64k68r75j164o04K24
55137A75838R29J470J450L38j294k091j975k299l166k495O42L539L072K50j123
$$ y = [154606, 153289, 152481, 151740, 150443, 148153, 145071, 142525, 142277, 144530, 147142, 147827, 146895, 146668, 148237, 150194, 151065, 151648, 153697, 157120, 160011, 161323, 162023, 163079, 163577, 161850, 157846, 153334, 150020, 148446, 148634, 150623, 153830, 156696, 157883, 157631, 157302, 157688, 158409, 158974, 159746, 161369, 163598, 165323, 165822, 165582, 165597, 166011, 165844, 164137, 161138, 158218, 156752, 157224, 159154, 161529, 163388, 164497, 165638, 167806, 170892, 173460, 174194, 173322, 172202, 171624, 171061, 169630, 167313, 164899, 163083, 162004, 161572, 161783, 162538, 163455, 164164, 164777, 165789, 167353, 168831, 169359, 168860, 168252, 168473, 169477, 170457, 170997, 171640, 173146, 175459, 177703, 179071, 179364, 178643, 176923, 174558, 172503, 171561, 171493, 171456, 171315, 171857, 173536, 175683, 177341, 178261, 178625, 178357, 177382, 176218, 175614, 175838, 176767, 178237, 179687, 180025, 178731, 176640, 174665, 172366, 169200, 166705, 167347, 170886, 173958, 174208, 173085]
55122A73085J13J247J49j832k412j501l97M15J139J550J481J553K294L124L111
55107A83119K122N75j128k369k495j906j848k405k096m23P65pj215n02J581K381
55091A74149J213J92Q11J894J746N28m83p76q16j054j460j584r28L02R55K46r14
55074A74021r81m4K70p66j976k046r63O80K414L374K485P5j868j932q14R2M32
55057A72453L43m43j645j826k88J311R92n57q89O69K321K580J925J397J247J478
55041A81068K170K660J730n19k222j917k15J429K476K910K334P30o68o38L23Q01
55025A92452N87O52J263J514R41K26o4l16r26j385j035j06O01O42J12o92j270
55008A93196j078j73N47L00o17j254j134n54L9M23M10j68j113j872k052j778j474
$$ y = [173085, 173198, 174445, 174594, 172762, 170350, 168849, 168452, 168867, 170006, 171556, 173037, 174590, 176884, 180008, 183119, 185241, 185816, 184688, 182319, 179824, 177918, 176070, 173665, 171569, 171146, 171911, 171904, 170689, 170187, 171768, 174149, 175362, 175554, 176365, 178259, 180005, 180533, 180050, 179274, 178458, 177404, 175944, 174360, 173432, 173734, 174689, 174935, 174021, 173040, 172996, 173266, 172500, 170524, 168478, 167515, 168195, 170609, 173983, 176468, 176543, 174675, 172743, 171929, 172021, 172453, 172796, 172353, 170708, 168882, 168594, 169905, 170897, 170340, 169451, 170120, 172441, 175021, 176946, 178343, 179590, 181068, 183238, 185898, 187628, 187109, 184887, 182970, 182755, 184184, 186660, 189570, 191904, 192634, 191966, 191328, 191651, 192452, 193039, 193691, 194954, 196468, 197409, 197635, 197571, 197255, 196329, 194944, 193909, 193803, 194404, 195046, 195158, 194466, 193196, 192118, 191945, 192492, 192792, 192175, 190921, 189787, 189233, 189272, 189695, 190105, 189937, 188824, 186952, 184900, 183122, 181648]
54991A81648j392j374j015j00J052J851K029J852J636J385J009O32M07K39j9l44
54975A89496o72r70r85l55O61R89Nj367j643p38j4k22l93N67J911J734n08l034
54957A84462l610j868O63K421L118L224K994K458J944J795J751J333Q35J068J837
54942B04425J679k62k824m176l934l032k006o08J074K378L076L650M173L920K420
54927B09953K48j569k306j687q4J274J222J62k48O54J566J040o27k157l025l466
54911B00950l324k177l60J083J577J412J081Q33Q70J359K145K890L471L933M037
54896B19780L325J691k25j296p20J003K060J048j250k641k259j383j149q45M64
54881B17603J904K012J170J015J774K016J123J83P4K13j09m61j37P23J678K735
$$ y = [181648, 180256, 178882, 177867, 177767, 178819, 180670, 182699, 184551, 186187, 187572, 188581, 189213, 189620, 189859, 189840, 189496, 188824, 187854, 186869, 186514, 187175, 188164, 188169, 186802, 185159, 184421, 184407, 184185, 183792, 184359, 186270, 188004, 187496, 184462, 180852, 178984, 179647, 182068, 185186, 188410, 191404, 193862, 195806, 197601, 199352, 200685, 201520, 202588, 204425, 206104, 205842, 203018, 198842, 194908, 191876, 189870, 189262, 190336, 192714, 195790, 199440, 203613, 207533, 209953, 210201, 208632, 206326, 204639, 204555, 205829, 207051, 207213, 206965, 207619, 209185, 210225, 209598, 207441, 204416, 200950, 197626, 195449, 195089, 196172, 197749, 199161, 200242, 201075, 201945, 203304, 205449, 208339, 211810, 215743, 219780, 223105, 224796, 224571, 223275, 222555, 223558, 225618, 226666, 225416, 222775, 220516, 219133, 217984, 217139, 217603, 219507, 221519, 222689, 223704, 225478, 227494, 228617, 228800, 228874, 229087, 228978, 228517, 228380, 229103, 230781, 233516]
54865B33516L817M213L453K217J618J975K803L748M845O098P299Q145Q314P607
54851B99668O213M634L187J843N06q90k479m148n242n289m921n134n673n226l493
54836B73556j868j569k164k655k874k908k265q12K65j58j297j435m29J94k89o73
54820B52619L56K379L869M058L613L758M985O546P123O259M890M243M500M968
54806C14166N041M378K604j19k566l587l726m567o371p629p313o274n763n623
54792B72651m957l798l093l371m301n237n555m795l313k404k961m136m291l193
54778B17246k258k503l240l347k880k579k386j453L69K028K526K021J338Q79N29
54763B06290K57K33M05N70P95J268J685J406M36l43k88K09M92N81O93M22o57j860
$$ y = [233516, 237333, 241546, 244999, 247216, 248834, 250809, 253612, 257360, 262205, 268303, 275602, 283747, 292061, 299668, 305881, 310515, 313702, 315545, 316051, 315161, 312682, 308534, 303292, 298003, 293082, 287948, 282275, 277049, 273556, 271688, 270119, 267955, 265300, 262426, 259518, 257253, 256441, 256706, 256548, 255251, 253816, 253387, 253581, 253292, 252619, 252975, 255354, 259223, 263281, 266894, 270652, 275637, 282183, 289306, 295565, 300455, 304698, 309198, 314166, 319207, 323585, 326189, 326070, 323504, 319917, 316191, 311624, 305253, 297624, 290311, 284037, 278274, 272651, 267694, 263896, 260803, 257432, 253131, 247894, 242339, 237544, 234231, 231827, 228866, 224730, 220439, 217246, 214988, 212485, 209245, 205898, 203018, 200439, 198053, 196600, 196969, 198997, 201523, 203544, 204882, 205761, 206290, 206547, 206780, 207185, 207755, 208550, 209818, 211503, 212909, 213345, 213002, 212714, 212923, 213415, 213996, 214689, 215111, 214454, 212594]
54745B12594j980r72m2R0O8O16J452J990K260K440K147J102o7m60o8M47P23P87
54727B23127N42J06K03J262K350K132Q86L62J401K898L497L222K700J948Q62K80
54711B47778J242L478N528O378O296O105O315O936P531P395O247M809M162M496
54697C24696M908M549L457K094N34j556m229o766p953p111m954l054k187j684
54683C00744r34p50k222m586n741m983l789l365k891j302M98P28o76k101k670
54668B65960k901k930j855M94K465K493J316J111K808N283P170Q364R304R536
54654C08618P910M263L18j696j311k90o57k635m880o253o657o388n699n108n161
54639B74374n436m693k620o75l53j279j957j870j712j754j421o38l70j257k597
$$ y = [212594, 210614, 209642, 209600, 209690, 209758, 210374, 211826, 213816, 216076, 218516, 220663, 221765, 221698, 221238, 221170, 221617, 222340, 223127, 223669, 223775, 223978, 225240, 227590, 229722, 230608, 230970, 232371, 235269, 238766, 241988, 244688, 246636, 247498, 247778, 249020, 252498, 258026, 264404, 270700, 276805, 283120, 290056, 297587, 304982, 311229, 316038, 320200, 324696, 329604, 334153, 337610, 339704, 340238, 338682, 334453, 327687, 319734, 312623, 307669, 304615, 302428, 300744, 299810, 299060, 296838, 292252, 286511, 281528, 277739, 274374, 271483, 270181, 270679, 271407, 270731, 268630, 265960, 263059, 260129, 258274, 258768, 261233, 263726, 265042, 266153, 268961, 274244, 281414, 289778, 299082, 308618, 316528, 320791, 321109, 319413, 318102, 317812, 317155, 314520, 309640, 303387, 296730, 290342, 284643, 279535, 274374, 268938, 264245, 261625, 260950, 260597, 259318, 257361, 255491, 253779, 252025, 250604, 249966, 249596, 248339, 245742]
54624B45742l296l125k494j716j155j386k351k913k162p93j77l44o1J086J909
54609B26764J280l70j736k067j437l48M31K94l67l79O15J504J391R93J311J612
54593B29491M30j820l012k284j136r75j217q05j64k23m86K35J711K427J698L64
54577B24234o10j042r62m01J41Jn53n46J71N96P7q89j637k070j986r58N06Q68
54559B14940l73j580j082N04J306Q42K35K97Q77J807L002L682L118K154K456L805
54543B35990L851J385j614k425j078J4o71k157k628j545J89J476J968J969J676
54528B36400Q73l98j256q63J82L71n04q14M96K141K299J309J044K042K810J998
54512B48130o0k236l736m129l380k369k251k814k536p99J024J598J490J916K548
$$ y = [245742, 242446, 239321, 236827, 235111, 233956, 232570, 230219, 227306, 225144, 224351, 224174, 223830, 223769, 224855, 226764, 228044, 227674, 225938, 223871, 222434, 222086, 222517, 222811, 222444, 222065, 222680, 224184, 225575, 226568, 227879, 229491, 229921, 228101, 225089, 222805, 221669, 220694, 219477, 218672, 218508, 218285, 217799, 218034, 219745, 222172, 223870, 224234, 223624, 222582, 221620, 221219, 221360, 221361, 220808, 220262, 220433, 221029, 221106, 220217, 218580, 216510, 214524, 213566, 214072, 214940, 214567, 212987, 211905, 212409, 213715, 214557, 214792, 215089, 215966, 217773, 220775, 224457, 227575, 229729, 232185, 235990, 239841, 241226, 239612, 237187, 236109, 236123, 235452, 233295, 230667, 229122, 229311, 230787, 232755, 234724, 236400, 237273, 236875, 235619, 234756, 234938, 235309, 234805, 233991, 234487, 236628, 238927, 240236, 241280, 243322, 246132, 248130, 248070, 245834, 242098, 237969, 234589, 232220, 229969, 227155, 224619, 223820, 224844, 226442, 227932, 229848, 232396]
54497B32396K184J066P98J818K554J708J38m46J97Q86R34R18J421J962J634M27
54481B50595o62q53m48k09j71L89J745L017L115K070R46M75L73M6n12q42o71j67
54463B58236K99M57L06J77N27J418K309K455J546j01j762k697k563j702r54q70
54447B57081j084o59P26K260K826K294J582J367J166J02j619k670k148o69L98
54432B60953M34l6k14J88Q53J209Q89K03O9J139K938M134L759K065K41n96l24
54415B77904K19K62J35P72K165L089K703J653R42N65K12M49J767L047K727J279
54399B99890P09J408J543J80r91k65J464K250J930J625J399L62j368k603k894
54384C04639k954l221l343l070k543j720o27p9q87k443l289l067k631k312j551
$$ y = [232396, 234580, 235646, 236444, 238262, 240816, 242524, 242662, 242216, 242413, 243299, 244233, 245151, 246572, 248534, 250168, 250595, 249933, 249080, 248632, 248423, 248252, 248641, 250386, 253403, 256518, 258588, 259534, 260009, 260382, 260428, 259916, 259074, 258403, 258236, 258535, 258992, 259298, 259475, 260002, 261420, 263729, 266184, 267730, 267629, 265867, 263170, 260607, 258905, 257951, 257081, 255997, 255338, 256064, 258324, 261150, 263444, 265026, 266393, 267559, 267661, 266042, 263372, 261224, 260555, 260953, 261387, 261351, 261137, 261325, 262178, 263387, 264276, 264479, 264548, 265687, 268625, 272759, 276518, 278583, 278824, 278228, 277904, 278123, 278385, 278520, 279292, 281457, 284546, 287249, 288902, 289844, 290409, 290621, 291070, 292837, 295884, 298611, 299890, 300599, 302007, 303550, 303730, 302739, 302474, 303938, 306188, 308118, 309743, 311142, 311504, 310136, 307533, 304639, 301685, 298464, 295121, 292051, 289508, 287788, 287161, 287082, 286195, 283752, 280463, 277396, 274765, 272453, 270902]
54369B70902m22J77J84P51K232L279K728J170k44j322k113j861q7J988K534J417
54353B81313L59P85K300L304K620O50r28q65J07J24j329k699k531j231q4M48M96
54336B82839ko78k27K051M738N677M569K916J774R40K23k3J23j02r40j653j659
54319C00566j390j556k146k472j896m81Q04Q11m69j652j598p96l09l4P52J590
54303B89724J188l78j360o16J050K257K550K022O25j371l022l532k993j950q52
54288B83342j44r5k27J67P68M88o61j201l07Q51Q19j18p24p39q41j181j240q44
54270B78113l56P0N92J037Q37k78j941l360l718k767j252k63M7N38J586K428K364
54253B73677J684Q32l35j602j784k58J684K278J424K75n05q03j29J664L266L167
$$ y = [270902, 270480, 270657, 270841, 271592, 273824, 277103, 279831, 281001, 280757, 279435, 277322, 275461, 275374, 277362, 279896, 281313, 281672, 282457, 284757, 288061, 290681, 291331, 290403, 289538, 289645, 289769, 288440, 285741, 283210, 281979, 281895, 282343, 282839, 282837, 282159, 281932, 283983, 288721, 294398, 298967, 301883, 303657, 304597, 304820, 304797, 304920, 304818, 303878, 302225, 300566, 299176, 297620, 295474, 293002, 291106, 290625, 291429, 292240, 291771, 290119, 288521, 287725, 287416, 287382, 288134, 289724, 290912, 290534, 289174, 288558, 289608, 291865, 294415, 296437, 297062, 295691, 292669, 289137, 286144, 284194, 283342, 283198, 283103, 282876, 283043, 283811, 284299, 283638, 282437, 282130, 282981, 283800, 283682, 282958, 282219, 281378, 280197, 278957, 278113, 277757, 277827, 278419, 279456, 280293, 280015, 278074, 274714, 270996, 268229, 266977, 266714, 266761, 267299, 268885, 271313, 273677, 275361, 276193, 275858, 274256, 272472, 272214, 273898, 276176, 277600, 277875, 277370, 276567, 276438, 278102, 281368, 284535]
54237B84535J797P44K71m77j093j61J775K113k7k147j855q2R10R82J438K087J390
54220B92200q00k724l110k446j632r02l65l85q19q97l61N4k22o87n34J72O47L54
54202B77543n66j532j810r25P76K079J887L83r79q13Q26K415K442Q17j204k387
54186B78952k447j682l78J016J699J165l7q04p15l45l81r18j627k111k038j396
54170B67953p24p51j638k861l747l811k738p40J049J305%j376j447l95O26R70
54154B51675Q91Q76J189J896K836L587L805L529K844J624J8j176j282p16n07r25
54138B70164j325j249r45o41k05K33J75l04l28M37R81L68o70o94L37J083Q64L87
54120B68668J93k64j354k141j524J45J505J854J427M23j155k699l125k133o08
$$ y = [284535, 286332, 287076, 287347, 286870, 285777, 285616, 287391, 289504, 289477, 287330, 285475, 285393, 286303, 287285, 288723, 290810, 292200, 291400, 288676, 285566, 283120, 281488, 280586, 280221, 279836, 279017, 278120, 277759, 277813, 277591, 276904, 276370, 276542, 277189, 277543, 276977, 275445, 273635, 272710, 273486, 275565, 277452, 277835, 276856, 276043, 276869, 279284, 281726, 282543, 281339, 278952, 276505, 274823, 274445, 275461, 277160, 278325, 278288, 277484, 276769, 276424, 276043, 275125, 273498, 271387, 269349, 267953, 267229, 266478, 264840, 261979, 258232, 254421, 251683, 250943, 251992, 253297, 253297, 251921, 250474, 250079, 250705, 251675, 252566, 253442, 254631, 256527, 259363, 262950, 266755, 270284, 273128, 274752, 274770, 273594, 272312, 271596, 271089, 270164, 268839, 267590, 266645, 266004, 265799, 266032, 266207, 265903, 265575, 266012, 266993, 267361, 266691, 265997, 266334, 267417, 268281, 268668, 268861, 268597, 267243, 265102, 263578, 263723, 265228, 267082, 268509, 268932, 267777, 265078, 261953, 259820, 259212]
54105B59212O18J612K567K928K159R44O65J608K431J751j82j831k073j162q0N51
54089B71718O26M9j304k916l462k022O20K456K403J508J492K418K590R00j547
54074B75529k731k231j527j820k425j803L38K664L805L602K815K059J539J321
54060B81135J396J452R79j67j382j717q35M17O99l58j600j613m12O04M03n67j153
54043B77281r13l66j71l85m08M56K098L308K917J252j49m94n28r37j094k75Q12
54026B82404J051P50R50J300M69j321k157j391q52j966l222k167J016L657M018
54011B82539L020K511L127M201M752M091K180p7j312r54J14M74l20j364j522p43
53995C00717l0n9l21n6M35L77J54J107L308M860M317K771K440L871N735O832O989
$$ y = [259212, 259830, 261442, 264009, 266937, 269096, 270040, 270705, 272313, 274744, 276495, 276313, 274482, 272409, 271247, 271167, 271718, 272344, 272393, 271089, 268173, 264711, 262689, 263309, 265765, 268168, 269676, 271168, 273586, 276176, 277076, 275529, 272798, 270567, 269040, 267220, 264795, 262992, 263330, 265994, 269799, 273401, 276216, 278275, 279814, 281135, 282531, 283983, 284962, 284795, 283413, 281696, 280861, 281278, 281977, 281619, 280019, 278406, 277994, 278598, 279001, 278434, 277281, 276368, 276002, 275831, 275446, 275038, 275494, 277592, 280900, 283817, 285069, 284920, 284426, 283898, 282961, 281867, 281592, 282404, 283455, 284205, 285155, 286455, 286924, 285603, 283446, 282055, 281203, 279237, 276015, 273848, 274864, 278521, 282539, 285559, 288070, 291197, 295398, 300150, 304241, 306421, 306344, 305032, 304078, 304192, 304666, 304346, 302982, 301460, 300717, 300687, 300628, 300307, 300251, 300686, 301063, 301217, 302324, 305632, 310492, 314809, 317580, 320020, 323891, 329626, 336458, 343447]
53978C43447O357N176M208M215M879N259N249N534O070N980N085M269L929L353
53964D13010K218J420J629K060J687R36J175K854N008O209N554L106M3k047k564
53949D42298k317k273k491k706l179m219n386o003o009n659m829l486k404k489
53935C88848l555m457m378l359j819k15Q63R06j20j727l066l194j981q57j508
53920C60381l280l366o50K141J878n61j614o4J852K265J890J775J462O10L55J392
53904C66466K352J856R43J582L618N019M705L518K684K706L688N483P478R225
53890D21323J1102J3422J5298J5596J4764J4396J4999J5455J4692J2558Q989L933
53878E76527j393m639m790l611l617n193o551o134m254k474j969k470k620j517
$$ y = [343447, 349804, 354980, 359188, 363403, 368282, 373541, 378790, 384324, 390394, 396374, 401459, 405728, 409657, 413010, 415228, 416648, 418277, 420337, 422024, 422960, 424135, 426989, 431997, 438206, 443760, 446866, 446909, 444862, 442298, 439981, 437708, 435217, 432511, 429332, 425113, 419727, 413724, 407715, 402056, 397227, 393741, 391337, 388848, 385293, 380836, 376458, 373099, 371280, 371065, 371928, 372834, 372714, 370987, 367921, 364727, 362746, 361889, 360381, 357101, 353735, 353085, 355226, 357104, 356543, 354929, 354865, 356717, 358982, 360872, 362647, 364109, 364719, 365074, 366466, 368818, 370674, 371617, 373199, 376817, 381836, 386541, 390059, 392743, 395449, 399137, 404620, 412098, 421323, 432425, 445847, 461145, 476741, 491505, 505901, 520900, 536355, 551047, 563605, 572594, 576527, 575134, 570495, 565705, 562094, 558477, 553284, 546733, 540599, 536345, 533871, 531902, 529432, 526812, 525295]
53864E25295J16P25j46j462k202k220j310J205M976P831P961O405N844P135Q515
53849E68668Q358P173O217N490M137K082J71r97j459j382r54p07j183k206l065
53834E90343l508l964m721n485n969o275o374n900m972m650n719p308p720o639
53820E11139n554n684o425o472n803n492n881o020n146l847l283l798m856n894
53806D36984o630o644n502l570k177k372l614m191l160j409n21q85j532j702j806
53791C91269k403k956k395p28O99O83o20k037k560k011j020n43r98j761j890j434
53775C69295j364j999k341j611o88r96k250k620j272M32R08N73J043K527L297
53760C62934K011l13j418m90J152J987K056K233K592K504K110K382L356L596K326
$$ y = [525295, 525411, 526136, 525990, 524528, 522326, 520106, 518796, 520001, 524977, 532808, 540769, 547174, 553018, 560153, 568668, 577026, 584199, 590416, 595906, 600043, 602125, 602296, 601299, 599840, 598458, 597504, 596797, 595614, 593408, 590343, 586835, 582871, 578150, 572665, 566696, 560421, 554047, 548147, 543175, 538525, 532806, 525498, 517778, 511139, 505585, 499901, 493476, 487004, 481201, 475709, 469828, 463808, 458662, 454815, 451532, 447734, 442878, 436984, 430354, 423710, 418208, 414638, 412461, 410089, 406475, 402284, 399124, 397715, 397194, 396309, 394777, 393075, 391269, 388866, 385910, 383515, 382787, 383486, 384169, 383549, 381512, 378952, 376941, 375921, 375378, 374380, 372619, 370729, 369295, 367931, 365932, 363591, 361980, 361292, 360296, 358046, 355426, 354154, 354586, 355494, 356067, 357110, 359637, 362934, 364945, 364632, 363214, 362724, 363876, 365863, 367919, 370152, 372744, 375248, 377358, 379740, 383096, 386692, 389018]
53745C89018J083J845M005M911L531J984K706N317P400P549O562N959O407P446
53731D55723P943O956M753K848K403K931L246L297L911N003N494N132M990N555
53717E20185N616M075J926J230K653N015O838P338O206L608M77k187m413o936
53703E51631r761j1930j2855j2910j2481j1397r843q816q856q984p849n641l929
53690D26379l722m541n477o315p135p418o236l450k45J733J854R51K84J73q8j029
53674C85718k055j904M9L005N221N338L590J715J280K039K296J000j089k492k654
53659D01057k001r26M99J961K916L172L029K781K510K320K312K376K519L204M688
53644D32417O041N829L974K217K156L483M668M835M158L002J634P33J081K452
$$ y = [389018, 390101, 391946, 395951, 400862, 404393, 406377, 409083, 414400, 421800, 429349, 435911, 441870, 448277, 455723, 463666, 470622, 475375, 478223, 480626, 483557, 486803, 490100, 494011, 499014, 504508, 509640, 514630, 520185, 525801, 529876, 531802, 533032, 535685, 540700, 547538, 554876, 561082, 564690, 565167, 562980, 558567, 551631, 541870, 529940, 517085, 504175, 491694, 480297, 470454, 461638, 452782, 443798, 435949, 430308, 426379, 422657, 418116, 412639, 406324, 399189, 391771, 385535, 382085, 381840, 383573, 385427, 386378, 386662, 386835, 386747, 385718, 383663, 381759, 381808, 384813, 390034, 395372, 398962, 400677, 401957, 403996, 406292, 407292, 406203, 403711, 401057, 399056, 398130, 398629, 400590, 403506, 406678, 409707, 412488, 414998, 417318, 419630, 422006, 424525, 427729, 432417, 438458, 444287, 448261, 450478, 452634, 456117, 460785, 465620, 469778, 472780, 474414, 475147, 476228, 478680]
53630D78680L445L038J846J307J855K482K150J120N27R50J886K636L152L670L849
53615E12593K906O93j799l294l429k944k806l331m063m341l905l003k050j319
53601D79908j064j583k848m159m607l950k748j610p34k11k68r21j747k290k362
53586D48806j825n00J264K564L011L474M912O694O957M876J813j12r4J014J900
53571D84754J844R25j84n90K40K065M077N484N921N550M905M540M526M480M157
53556E32694L810L754L860L865L968M521N222N278M638M360N096N811M958K823
53542E94658J594K639M651N252L892K076J062N35j50o40l66Q8m94k223l789m168
53526F04617l879m140n061n286l546l67K098K113K1k373l927m939n696n232k620
$$ y = [478680, 482125, 485163, 487009, 488316, 490171, 492653, 494803, 495923, 496450, 497400, 499286, 501922, 505074, 508744, 512593, 515499, 516192, 514393, 511099, 507670, 504726, 501920, 498589, 494526, 490185, 486280, 483277, 481227, 479908, 478844, 477261, 474413, 470254, 465647, 461697, 458949, 457339, 456605, 456394, 456126, 455205, 453458, 451168, 448806, 446981, 446481, 447745, 450309, 453320, 456794, 461706, 468400, 475357, 480233, 482046, 481934, 481840, 482854, 484754, 486598, 487523, 487339, 486749, 486989, 489054, 493131, 498615, 504536, 510086, 514991, 519531, 524057, 528537, 532694, 536504, 540258, 544118, 547983, 551951, 556472, 561694, 566972, 571610, 575970, 581066, 586877, 591835, 594658, 596252, 598891, 603542, 608794, 612686, 614762, 615824, 616359, 616209, 615569, 615203, 615291, 614797, 612574, 608785, 604617, 600738, 596598, 591537, 586251, 582705, 582338, 584436, 586549, 586570, 584197, 580270, 575331, 569635, 564403, 561783]
53511E61783J020L039K158l3r46K59K244L261K687J180q4l52J88Q30J348K153
53495E80735L231L691L019K262K827M378N103M355L733M924P383R209R643R548
53481F54041R647R581Q944Q227Q202R076J0702J2988J5544J7524J8561J9319K0440
53468H22796K1412K1510K1435K2665K5126K6991K7222K6917K7298K7767K7426
53457A098565K7396K9599L3538L6386L6755L6435L7534L9509M0556M0669M1464
53446A498406M3238M4079M2346L8817L5764L4605L4916L5296L4716L3299L2078
53435A907560L1877L2477L2948L2616L1426K9680K7992K7150K7310K7507K6807
53424B235350K5682K5167K4851K3221K0242J7885J7246J6745J4550J1407R246
$$ y = [561783, 562803, 565842, 568000, 567967, 567021, 567280, 569524, 572785, 575472, 576652, 576568, 576216, 576404, 577234, 578582, 580735, 583966, 587657, 590676, 592938, 595765, 600143, 605246, 609601, 613334, 618258, 625641, 634850, 644493, 654041, 663688, 673269, 682213, 690440, 698642, 707718, 718420, 731408, 746952, 764476, 783037, 802356, 822796, 844208, 865718, 887153, 909818, 934944, 961935, 989157, 1016074, 1043372, 1071139, 1098565, 1125961, 1155560, 1189098, 1225484, 1262239, 1298674, 1336208, 1375717, 1416273, 1456942, 1498406, 1541644, 1585723, 1628069, 1666886, 1702650, 1737255, 1772171, 1807467, 1842183, 1875482, 1907560, 1939437, 1971914, 2004862, 2037478, 2068904, 2098584, 2126576, 2153726, 2181036, 2208543, 2235350, 2261032, 2286199, 2311050, 2334271, 2354513, 2372398, 2389644, 2406389, 2420939, 2432346, 2441592]
53413B441592P855N111L52m646q305j1089j4068j7228j9994k2260k4074k5455
53401B307791k7030k9623l2443l3197l1270k9381l0376l3360l4934l3757l1756
53390A960664l0890l0795l0161k8725k6997k5225k3526k2143k0885j9076j6661
53379A685580j4553j3285j2083r971p018l790l18L465O941R479J1500J3916J6756
53366A686619J9243K1101K2865K4989K7425L0096L3034L5995L8580M0772M2771
53355B023490M4473M5854M7693N0976N5376N9305O1825O3638O5716O7832O9204
53344B655382P0014P1347P3835P7156Q0714Q4013Q6354Q7065Q6420Q5806Q6428
53333C544534Q8006Q9108Q8640Q6695Q4006Q1033P7786P4221P0492O6777O3022
$$ y = [2441592, 2449447, 2454558, 2454910, 2450264, 2441959, 2430870, 2416802, 2399574, 2379580, 2357320, 2333246, 2307791, 2280761, 2251138, 2218695, 2185498, 2154228, 2124847, 2094471, 2061111, 2026177, 1992420, 1960664, 1929774, 1898979, 1868818, 1840093, 1813096, 1787871, 1764345, 1742202, 1721317, 1702241, 1685580, 1671027, 1657742, 1645659, 1635688, 1628670, 1624880, 1624562, 1628027, 1634968, 1644447, 1655947, 1669863, 1686619, 1705862, 1726963, 1749828, 1774817, 1802242, 1832338, 1865372, 1901367, 1939947, 1980719, 2023490, 2067963, 2113817, 2161510, 2212486, 2267862, 2327167, 2388992, 2452630, 2518346, 2586178, 2655382, 2725396, 2796743, 2870578, 2947734, 3028448, 3112461, 3198815, 3285880, 3372300, 3458106, 3544534, 3632540, 3721648, 3810288, 3896983, 3980989, 4062022, 4139808, 4214029, 4284521, 4351298, 4414320]
53322D414320N8891N3865M7588M0369L3256K7238K2087J6366Q898K23p762j3708
53310D701631j8393k4231l3050m4273n5351o4109p0414p5441p9847q3394q6048
53299D067080q8394r0637r2221r2904r3456r4458r5123r4192r1624q8529q5759
53288C059783q3430q1624q0487p9516p7673p4431p0203o5736o1759n9010n7650
53277B268264n6586n4241n0386m6324m3115m0452l7586l4406l0994k7079k2680
53266A824415j8706j6117j4748j3576j1952r960p823n473k820k83J206J116M86
53253A725765J524N222R890J3216J5253J7787K0986K2914K2822K2637K4094K6458
53241A928568K8669L1578L5921L9782M0764L9691L9456M0832M2064M2264M2267
$$ y = [4414320, 4473211, 4527076, 4574664, 4615033, 4648289, 4675527, 4697614, 4713980, 4722878, 4723101, 4715339, 4701631, 4683238, 4659007, 4625957, 4581684, 4526333, 4462224, 4391810, 4316369, 4236522, 4153128, 4067080, 3978686, 3888049, 3795828, 3702924, 3609468, 3515010, 3419887, 3325695, 3234071, 3145542, 3059783, 2976353, 2894729, 2814242, 2734726, 2657053, 2582622, 2512419, 2446683, 2384924, 2325914, 2268264, 2211678, 2157437, 2107051, 2060727, 2017612, 1977160, 1939574, 1905168, 1874174, 1847095, 1824415, 1805709, 1789592, 1774844, 1761268, 1749316, 1739356, 1731533, 1726060, 1723240, 1722957, 1724163, 1725279, 1725765, 1727289, 1732511, 1742401, 1755617, 1770870, 1788657, 1809643, 1832557, 1855379, 1878016, 1902110, 1928568, 1957237, 1988815, 2024736, 2064518, 2105282, 2144973, 2184429, 2225261, 2267325, 2309589, 2351856]
53230B351856M2166M0899L8773L7535L7073L4787K9468K3229J8155J3626Q721
53219B676288M776L043J783j488o156r807j2365j6002k1357k6668l0704l3948
53207B527395l6716l8551l9957m2286m5255m6876m6786m7278m9747n2240n2412
53196B029291n1137n1068n2647n3786n3074n1314m9846m8977m8352m7685m6742
53185A474663m5470m4279m3568m2967m1679l9549l7082l4578l2033k9837k8643
53174A054978k8387k8184k7349k5895k3932k1448j8890j7196j6711j6663j6158
53163H14165j5260j4651j4600j4698j4434j3669j2786j2577j3549j5024j5308
53152F57609j3344j0052p478o794p474q310q606q336p747p161o891o976p105o923
$$ y = [2351856, 2394022, 2434921, 2473694, 2511229, 2548302, 2583089, 2612557, 2635786, 2653941, 2667567, 2676288, 2681064, 2684107, 2685890, 2684402, 2678246, 2668439, 2656074, 2640072, 2618715, 2592047, 2561343, 2527395, 2490679, 2452128, 2412171, 2369885, 2324630, 2277754, 2230968, 2183690, 2133943, 2081703, 2029291, 1978154, 1927086, 1874439, 1820653, 1767579, 1716265, 1666419, 1617442, 1569090, 1521405, 1474663, 1429193, 1384914, 1341346, 1298379, 1256700, 1217151, 1180069, 1145491, 1113458, 1083621, 1054978, 1026591, 998407, 971058, 945163, 921231, 899783, 880893, 863697, 846986, 830323, 814165, 798905, 784254, 769654, 754956, 740522, 726853, 714067, 701490, 687941, 672917, 657609, 644265, 634213, 626735, 619941, 612467, 604157, 595551, 587215, 579468, 572307, 565416, 558440, 551335, 544412]
53138E44412o389n803n610o096o967p294o379m826m183n119o366o082m011j646
53124D67641m07m52j245k442l714m496m483m001l434k729j944j666k083k177q63
53109D31505J277K487K057J009M07J74o2j8N61J135J040M23j97p14j066p50M25
53092D39693J556J644R53M72K98k64j167j489r84n58o97n99M11J549J536L80p09
53075D42025r12n27j90j61m53j063j779k091j725j080p95p91k84J014K038J466
53059D34692m28j931k113j846k086k208j267rN2q77j061l8N96k57j537j844j451
53042D16387j356j542j439j264j464j622j235j052k110l736m041k400j70J206
53028C94162J613J588J377J059P18Q6j212k741l409k875k124k152k701k780j967
$$ y = [544412, 538023, 532220, 526610, 520514, 513547, 506253, 499874, 495048, 490865, 485746, 479380, 473298, 469287, 467641, 467234, 466782, 465537, 463095, 459381, 454885, 450402, 446401, 442967, 440238, 438294, 436628, 434545, 432368, 431505, 432782, 435269, 437326, 438335, 438742, 438916, 438854, 438836, 439397, 440532, 441572, 441995, 441798, 441084, 440018, 439268, 439693, 441249, 442893, 443846, 444318, 444616, 444352, 443185, 441696, 440712, 440154, 439457, 438858, 439269, 440818, 442354, 442734, 442025, 441113, 440586, 440396, 440235, 439782, 438719, 436940, 434849, 433124, 432044, 431249, 430458, 430174, 431188, 433226, 434692, 434264, 432333, 430220, 428374, 426288, 424080, 422813, 422804, 422856, 421979, 420918, 420880, 421476, 421219, 419682, 417838, 416387, 415031, 413489, 412050, 410786, 409322, 407700, 406465, 405413, 403303, 399567, 395526, 393126, 392956, 394162, 395775, 397363, 398740, 399799, 400517, 400603, 399391, 396650, 393241, 390366, 388242, 386090, 383389, 380609, 378642]
53013C78642p83oL2l65o21n34m99q09j084q61m15k92l04J06O18K33j117k323k735
52994C66883k954l400l297j935j07Q38Q68J094K025K936K960K003N79o11r52l85
52978C66545K84K00l88l78N48J310R16M7K05J394J677k78k982l652j790J42J34
52961C63934p44l61R57R66p00j570O9K469K747P79q58l07J635K946K538P85j164
52944C74121k163j796o58K06J82o37j719k324j850m88P29R51M34Lr7j89l04p9
52926C64322M84Q71P66M09J59J58M44R85J417J177N9j441k411k160q88J80j58
52909C64373j503j876j14K362L150J938O70O64J114R84R11J897L113K678N00j298
52893C79563j251n24j147l076m247l315j173M47Q59L94n75j637j965j057J91K76
$$ y = [378642, 377859, 377853, 377885, 377520, 376899, 376365, 375866, 375057, 373973, 373112, 372697, 372405, 372101, 372207, 372825, 373058, 371941, 369618, 366883, 363929, 360529, 357232, 355297, 355190, 356028, 356896, 357990, 360015, 362951, 365911, 367914, 368493, 367882, 366930, 366545, 366829, 367029, 366641, 366263, 366811, 368121, 369037, 369084, 369289, 370683, 372360, 372082, 369100, 365448, 363658, 363800, 363934, 363190, 362829, 363786, 364752, 364052, 362482, 362551, 365020, 367767, 368546, 367688, 367381, 369016, 371962, 374500, 375285, 374121, 371958, 370162, 369504, 369710, 369892, 369255, 367536, 365212, 363362, 362874, 363603, 364554, 364988, 364991, 364894, 364705, 364401, 364322, 364806, 365677, 366443, 366852, 367011, 367169, 367613, 368598, 370015, 371192, 371251, 369810, 367399, 365239, 364351, 364531, 364373, 362870, 360994, 360880, 363242, 366392, 368330, 369000, 369664, 370778, 371762, 372673, 374570, 377683, 380361, 380861, 379563, 378312, 377788, 376641, 373565, 369318, 366003, 364830, 365277, 366136, 366530, 365955, 364318, 362353, 361296, 361487, 361763]
52877C61763q74j685j102P4N51K92O8j5l44o48k29O86Q92k43j893k716k115m61
52859C52001J375K458K314J351M55R9J02K28M92P76O48j13j152j907k246k410
52843C54471k462k061r82K28N00m88j585j325K51J702K102J870J416L02j445k389
52827C50105j365P32K265L140M140M627L182M69q51K15J543J097k83p65n65j129
52811C66557k257k175l92J423J796J249J096J508J645J227R88J534K368K597K301
52796C81465K435L119K952Q56j943l028j893n27p06j976k973l404l735l866l382
52781C63394k509j792j131j90O46O53j68j248k299l161l183j921k07N88L38K06
52765C48016Q38J622J804J301J78j547l191l516k111kJ621K535K951K702J785
$$ y = [361763, 360889, 359204, 358102, 358176, 358727, 359019, 359087, 359072, 358728, 358080, 357851, 358537, 359429, 359186, 357293, 354577, 352462, 352001, 353376, 355834, 358148, 359499, 359954, 360053, 360155, 360383, 360875, 361651, 362299, 362186, 361034, 359127, 356881, 354471, 352009, 349948, 348966, 349194, 349694, 349206, 347621, 346296, 346547, 348249, 350351, 352221, 353637, 353939, 352494, 350105, 348740, 349472, 351737, 354877, 359017, 363644, 366826, 367295, 366444, 366659, 368202, 369299, 369016, 368251, 367686, 366557, 364300, 362125, 361733, 363156, 364952, 366201, 367297, 368805, 370450, 371677, 372665, 374199, 376567, 379164, 381465, 383900, 387019, 389971, 390827, 388884, 385856, 383963, 383436, 382730, 380754, 377781, 374377, 370642, 366776, 363394, 360885, 359093, 357962, 357772, 358418, 359071, 358903, 357655, 355356, 352195, 349012, 347091, 346884, 347472, 347810, 348016, 348854, 350476, 352280, 353581, 353759, 352212, 349021, 345505, 343394, 343392, 345013, 347548, 350499, 353201, 354986]
52750C54986J028J386K728M037M588M413L845L116K302J222l18j846k297j475
52736C77715r58k508n560p474o601m132k356j939j846j284o14m32p38j175j292
52721C38806m88J384L142L015Q39j324j486P7J719K660L114K794J023j618l266
52706C50391k967j795j245j545k055k352k202j389l45q2p16r34J24J361J309M42
52690C36000L43J108J268L40l16M12J846K717K639J753R7j749k416j288L80J027
52674C44161Q88J296K267K359J051k17j29N73L18q88j550r79k24m91j611k556
52658C44268k690j970n71R58J692J323Q36J332K406K659J692N65J02j10p27j594
52642C50171k215k486k421j884j070n46l23K62J229J433K43j218j468n92L54J067
$$ y = [354986, 356014, 357400, 360128, 364165, 368753, 373166, 377011, 380127, 382429, 383651, 383333, 381487, 379190, 377715, 376757, 374249, 368689, 361215, 354614, 350482, 348126, 346187, 344341, 343057, 342443, 342011, 341273, 340098, 338806, 338318, 339702, 342844, 345859, 346698, 345374, 343888, 343965, 345684, 348344, 351458, 354252, 355275, 353657, 350391, 347424, 345629, 344384, 342839, 340784, 338432, 336230, 334841, 334496, 334414, 333698, 332764, 332888, 334249, 335558, 336000, 336343, 337451, 338719, 339059, 338743, 339155, 341001, 343718, 346357, 348110, 348207, 346458, 344042, 342754, 343134, 344161, 345049, 346345, 348612, 350971, 352022, 351805, 351676, 352249, 352567, 351679, 350129, 349150, 348926, 348435, 346824, 344268, 341578, 339608, 339037, 339995, 341687, 343010, 343846, 345178, 347584, 350243, 351935, 352500, 352602, 352492, 351765, 350171, 347956, 345470, 343049, 341165, 340095, 339549, 339226, 339488, 340717, 342150, 342393, 341175, 339707, 339115, 339469, 340536]
52626C40536J867K339J628kj171r69M48K558M557N068L345Q10j28R10J843J071
52610C64710n97j518j350p66j37M84R11J115J421J841J888J411Q31J69j054k453
52594C66906k560p85J573L122L961M374L352K17l228m269k678p66j30j90j14k53
52578C68532q89j148k91Q53Q57l55j386j007O47K382L073K618J899J780K199K486
52562C82250K283J655O31n68j060j31J374J644K42j254j570j498k342l562l437
52547C74657j730j92j97j127j558j102l73K63R73J730K059J701J076Q29J118J554
52531C79681J741J671J632J854K258K495K196J329L40j82l5M60R43J385J787J764
52515D01319R68j01k49J010K487K319n3l200n095m954l547k088j175p91p97j100
$$ y = [340536, 342403, 344742, 346370, 346368, 345197, 344228, 344676, 347234, 351791, 356859, 360204, 361014, 360886, 361796, 363639, 364710, 364113, 362595, 361245, 360479, 360342, 360826, 361737, 362852, 364273, 366114, 368002, 369413, 370244, 370413, 369359, 366906, 364346, 363561, 365134, 368256, 372217, 376591, 379943, 380160, 376932, 372663, 369985, 369219, 369089, 368899, 368785, 368532, 367643, 366495, 366204, 367057, 367914, 367559, 366173, 365166, 365813, 368195, 371268, 373886, 375785, 377565, 379764, 382250, 384533, 386188, 386819, 386251, 385191, 385060, 386434, 388078, 388320, 387066, 385496, 383998, 381656, 378094, 374657, 372927, 372735, 372538, 371411, 369853, 368751, 368378, 368641, 369614, 371344, 373403, 375104, 376180, 377009, 378127, 379681, 381422, 383093, 384725, 386579, 388837, 391332, 393528, 394857, 395197, 395015, 394980, 395440, 396383, 397768, 399555, 401319, 402287, 402186, 401937, 402947, 405434, 407753, 407700, 404500, 399405, 394451, 390904, 388816, 387641, 386850, 386053, 384953]
52499C84953j507j793j885j734j092J32J278J316K92k38J010L072L580J670q85
52484C88169j852j012K79J100J496J391M92o38o71O63J808J283l96j553j635j520
52468C87404j777j862j347q33r25j029j38J580K726K373J117K88N26J397K028
52453C91528J848R63J25J98J266K326K343J642J733L325N036M844K680N38k64
52438D20131p60k404m434m663k744r36j111k340k456j014N07J038J004J105J225
52423D02148J029P34O78N63j34j223j767j119L54J645K038J604R42N92O35O94
52407D09413K00j023k254k200k71K525M435M774M266L625K607R69l83k00J398
52392D27881K858K849J415m83j969k681k752k620k537k232j346j90L55j37j128
$$ y = [384953, 383446, 381653, 379768, 378034, 376942, 377074, 378352, 379668, 379960, 379722, 380732, 383804, 387384, 389054, 388169, 386317, 385305, 385584, 386684, 388180, 389571, 390063, 389425, 388754, 389417, 391225, 392508, 392112, 390559, 388924, 387404, 385627, 383765, 382418, 381585, 380660, 379631, 379493, 381073, 383799, 386172, 387289, 387577, 388103, 389500, 391528, 393376, 394339, 394464, 394662, 395928, 398254, 400597, 402239, 403972, 407297, 412333, 417177, 419857, 420395, 420131, 419371, 416967, 412533, 407870, 405126, 404190, 403079, 400739, 398283, 397269, 397776, 398814, 399818, 400923, 402148, 403177, 403911, 404589, 405152, 405018, 403795, 402028, 400909, 401263, 402908, 404946, 406550, 407492, 408084, 408719, 409413, 409613, 408590, 406336, 404136, 403865, 406390, 410825, 415599, 419865, 423490, 426097, 427066, 426683, 426483, 427881, 430739, 433588, 435003, 434520, 432551, 429870, 427118, 424498, 421961, 419729, 418383, 418193, 418548, 418411, 417283]
52377D17283j752j736j472j403j526j504j139o73m66m30p9P64J618J850J199j77
52361D10357j657k076o12J845L116K366J384K185M055M586L203J887K191L249
52347D36079L528L109L085L685M186M258M219M101L268J346r83k407k219j093
52333D64162m57r84j935k261j969j834k117k321k153j819j377o03L30P90N15r9
52317D45868n72n48L49K045L503L820L702M485N698N358L159J476K158L936M389
$$ y = [417283, 415531, 413795, 412323, 410920, 409394, 407890, 406751, 406078, 405612, 405182, 405103, 405867, 407485, 409335, 410534, 410357, 408700, 406624, 406012, 407857, 410973, 413339, 414723, 416908, 420963, 425549, 428752, 430639, 432830, 436079, 439607, 442716, 445801, 449486, 453672, 457930, 462149, 466250, 469518, 470864, 469881, 467474, 465255, 464162, 463705, 462721, 460786, 458525, 456556, 454722, 452605, 450284, 448131, 446312, 444935, 444332, 444662, 445452, 445967, 445868, 445296, 444748, 445097, 447142, 450645, 454465, 458167, 462652, 468350, 473708, 476867, 478343, 480501, 484437, 488826]
$$ [...]
##END NTUPLES=NMR SPECTRUM
##END=
