
##TITLE=UV1050_TOSA01-ROVE100B_6307269_Gee40o2MTb
##JCAMPDX= 6.0         $$ Bruker NMR JCAMP-DX V2.0
##DATA TYPE= NMR SPECTRUM
##DATA CLASS= NTUPLES
##ORIGIN= BRUKER
##OWNER= Administrator
$$ 1.72 TOPSPIN		Version 2.1
$$ 2012-06-07 00:04:48.968 -0500  Administrator@TOPSPIN
$$ Compression mode = diff/dup
##.OBSERVE FREQUENCY= 400.13188235
##.OBSERVE NUCLEUS= ^1H
##.ACQUISITION MODE= SIMULTANEOUS (DQD)
##.ACQUISITION SCHEME= undefined
##.AVERAGES= 64
##.DIGITISER RES= 22
##SPECTROMETER/DATA SYSTEM= spect
##.PULSE SEQUENCE= noesygpps1d.comp
##.SOLVENT NAME= COFFEE_meoh
##.SHIFT REFERENCE= INTERNAL, COFFEE_meoh, 1, 14.98061
##AUDIT TRAIL= $$ (NUMBER, WHEN, WHO, WHERE, PROCESS, VERSION, WHAT)
$$ ##TITLE= Audit trail, TOPSPIN		Version 2.1
$$ ##JCAMPDX= 5.01
$$ ##ORIGIN= Bruker BioSpin GmbH
$$ ##OWNER= Administrator
$$ $$ C:\Bruker\TOPSPIN/data/COFFEE/nmr/UV1050_TOSA01-ROVE100B_6307269_Gee40o2MTb/12/pdata/1/auditp.txt
$$ ##AUDIT TRAIL=  $$ (NUMBER, WHEN, WHO, WHERE, PROCESS, VERSION, WHAT)
(   1,<2012-06-07 00:04:43.343 -0500>,<Administrator>,<TOPSPIN>,<go>,<TOPSPIN 2.1>,
      <created by zg
	started at 2012-06-06 23:53:13.109 -0500,
	POWCHK enabled, PULCHK disabled,
       configuration hash MD5:
       D5 CA 7A 23 FE 6B EE E2 50 67 74 61 24 F7 5E 3B
       data hash MD5: 64K
       A9 D7 55 21 D4 99 EC 3D 3A CA 8C A2 CE 1F 07 91>)
(   2,<2012-06-07 00:04:46.203 -0500>,<Administrator>,<TOPSPIN>,<proc1d>,<TOPSPIN 2.1>,
      <Start of raw data processing
       efp LB = 0.3 FT_mod = 6 PKNL = 1 PHC0 = 0 PHC1 = 0 SI = 128K 
       data hash MD5: 128K
       58 0F E6 40 09 A3 95 2B 77 F5 CA 1E 7D AD 5B 8A>)
(   3,<2012-06-07 00:04:47.718 -0500>,<Administrator>,<TOPSPIN>,<proc1d>,<TOPSPIN 2.1>,
      <pk PHC0 = 31.02539 PHC1 = 0 
       data hash MD5: 128K
       F8 31 BF 72 21 D8 2F FC 3C FE F6 62 B4 4D DC 49>)
(   4,<2012-06-07 00:04:48.609 -0500>,<Administrator>,<TOPSPIN>,<proc1d>,<TOPSPIN 2.1>,
      <abs ABSG = 1 
       data hash MD5: 128K
       4A EB 15 4B EC A6 77 1F E7 EC CE 42 CC 1B E4 E4>)
(   5,<2012-06-07 00:04:48.703 -0500>,<Administrator>,<TOPSPIN>,<proc1d>,<TOPSPIN 2.1>,
      <abs ABSG = 2 
       data hash MD5: 128K
       18 F3 89 BE 10 E8 E8 28 22 E9 CC 3A 9A 60 BD DA>)
(   6,<2012-06-07 00:04:48.765 -0500>,<Administrator>,<TOPSPIN>,<proc1d>,<TOPSPIN 2.1>,
      <abs ABSG = 3 
       data hash MD5: 128K
       82 05 53 E7 AD 65 50 F1 8B 6C 52 86 DB F3 A8 8C>)
(   7,<2012-06-07 00:04:48.828 -0500>,<Administrator>,<TOPSPIN>,<proc1d>,<TOPSPIN 2.1>,
      <abs ABSG = 4 
       data hash MD5: 128K
       22 62 A4 EB F5 3F 96 26 C4 8C 32 D0 94 E0 36 DD>)
(   8,<2012-06-07 00:04:48.890 -0500>,<Administrator>,<TOPSPIN>,<proc1d>,<TOPSPIN 2.1>,
      <abs ABSG = 5 
       data hash MD5: 128K
       E5 C4 66 43 74 74 EB 14 CD 1E 15 C4 D7 AD 83 C4>)
$$ ##END=
$$ 
$$ $$ hash MD5
$$ $$ 0F 5F B3 2D F9 FD E6 5A D1 4D 1D C9 61 46 F6 DD
##$RELAX= 
##$RELAX= 
##$RELAX= 
##$RELAX= 
##$RELAX= 
##$RELAX= 
##$RELAX= 
##$RELAX= 
$$ [...]
150 150 150 150 150 150 150 150
##$TP07= 0
##$TPNAME0= <>
##$TPNAME1= <>
##$TPNAME2= <>
##$TPNAME3= <>
##$TPNAME4= <>
##$TPNAME5= <>
##$TPNAME6= <>
##$TPNAME7= <>
##$TPOAL= (0..7)
0.5 0.5 0.5 0.5 0.5 0.5 0.5 0.5
##$TPOFFS= (0..7)
0 0 0 0 0 0 0 0
##$TUNHIN= 0
##$TUNHOUT= 0
##$TUNXOUT= 0
##$USERA1= <user>
##$USERA2= <user>
##$USERA3= <user>
##$USERA4= <user>
##$USERA5= <user>
##$V9= 5
##$VALIST= <valist>
##$VCLIST= <CCCCCCCCCCCCCCC>
##$VD= 0
##$VDLIST= <DDDDDDDDDDDDDDD>
##$VPLIST= <PPPPPPPPPPPPPPP>
##$VTLIST= <TTTTTTTTTTTTTTT>
##$WBST= 2048
##$WBSW= 25
##$XGAIN= (0..3)
0 0 0 0
##$XL= 0
##$YL= 0
##$YMAX_a= 19098543
##$YMIN_a= -10379209
##$ZGOPTNS= <>
##$ZL1= 120
##$ZL2= 120
##$ZL3= 120
##$ZL4= 120
##$ABSF1= 14.98061
##$ABSF2= -5.57192
##$ABSG= 5
##$ABSL= 3
##$ALPHA= 0
##$AQORDER= 0
##$ASSFAC= 0
##$ASSFACI= 0
##$ASSFACX= 0
##$ASSWID= 0
##$AUNMP= <proc_prof1d_extract.lims>
##$AXLEFT= 0
##$AXNAME= <>
##$AXNUC= <1H>
##$AXRIGHT= 0
##$AXTYPE= 0
##$AXUNIT= <>
##$AZFE= 0.1
##$AZFW= 0.1
##$BCFW= 0
##$BC_mod= 0
##$BYTORDP= 0
##$COROFFS= 0
##$CY= 15
##$DATMOD= 1
##$DC= 0
##$DFILT= <>
##$DTYPP= 0
##$F1P= 0
##$F2P= 0
##$FCOR= 0.5
##$FTSIZE= 131072
##$FT_mod= 6
##$GAMMA= 0
##$GB= 0
##$INTBC= 1
##$INTSCL= 1
##$ISEN= 128
##$LB= 0.3
##$LEV0= 0
##$LPBIN= 0
##$MAXI= 10000
##$MC2= 0
##$MEAN= 0
##$ME_mod= 0
##$MI= 0
##$NCOEF= 0
##$NC_proc= -2
##$NLEV= 6
##$NOISF1= 0
##$NOISF2= 0
##$NSP= 0
##$NTH_PI= 0
##$NZP= 0
##$OFFSET= 14.98061
##$PC= 1
##$PHC0= 31.02539
##$PHC1= 0
##$PH_mod= 1
##$PKNL= yes
##$PPARMOD= 0
##$PPDIAG= 0
##$PPIPTYP= 0
##$PPMPNUM= 2147483647
##$PPRESOL= 1
##$PSCAL= 4
##$PSIGN= 0
##$PYNMP= <proc.py>
##$REVERSE= no
##$SF= 400.13
##$SI= 131072
##$SIGF1= 0
##$SIGF2= 0
##$SINO= 400
##$SIOLD= 131072
##$SPECTYP= <>
##$SREGLST= <1H.CDCl3>
##$SSB= 0
##$STSI= 131072
##$STSR= 0
##$SW_p= 8223.68421052632
##$SYMM= 0
##$S_DEV= 0
##$TDeff= 65536
##$TDoff= 0
##$TI= <>
##$TILT= no
##$TM1= 0
##$TM2= 0
##$TOPLEV= 0
##$USERP1= <user>
##$USERP2= <user>
##$USERP3= <user>
##$USERP4= <user>
##$USERP5= <user>
##$WDW= 1
##$XDIM= 131072
##$YMAX_p= 322482008
##$YMIN_p= -13292
##$CURPLOT= <Network HP LaserJet P1505>
##$CURPRIN= <$Network HP LaserJet P1505>
##$DFORMAT= <normdp>
##$LAYOUT= <+/1D_H.xwp>
##$LFORMAT= <normlp>
##$PFORMAT= <normpl>
##$SURQMSG= 1
$$ End of Bruker specific parameters
$$ ---------------------------------
##NTUPLES= NMR SPECTRUM
##VAR_NAME=  FREQUENCY,     SPECTRUM/REAL,   SPECTRUM/IMAG
##SYMBOL=    X,             R,               I
##VAR_TYPE=  INDEPENDENT,   DEPENDENT,       DEPENDENT
##VAR_FORM=  AFFN,          ASDF,            ASDF
##VAR_DIM=   131072,        131072,          131072
##UNITS=     HZ,            ARBITRARY UNITS, ARBITRARY UNITS
##FACTOR=    0.0627417313425165, 1,          1
##FIRST=     8223.62146879498, 600,          -76548
##LAST=      0,             3514,            -76163
##MIN=       0,             -13292,          0
##MAX=       8223.62146879498, 322482008,    0
$$ Real data points
##PAGE= N=1
##DATA TABLE= (X++(R..R)), XYDATA
$$ [...]
64476 62477 63114 64104 64657 64399 63652 63079 63091 63579 64186 64766 65462 66308 66969 67049 66561 65885 65295 64888 64936 65860
64456 65860 67560 69158 69800 69555 69165 69061 69063 68974 68966 69259 69739 70098 70142 69919 69759 70161 71275 72447 72692 71831
64436 71831 70744 70247 70094 69507 68399 67559 67678 68631 69732 70357 70254 69521 68454 67325 66260 65415 65147
64419 65147 65777 67205 68913 70363 71237 71426 71057 70569 70482 70967 71692 72123 71928 71159 70207 69500 69129 68833
64401 68833 68472 68322 68668 69347 70029 70743 71637 72314 72035 70724 69243 68481 68591 69318 70537 72126 73715
64384 73715 75004 76053 76965 77557 77648 77374 76910 76270 75772 76228 78078 80593 82524 83373 83458 83062 82315 81832
64366 81832 82502 84410 86663 88605 90578 93158 96214 99138 101609 103690 105545 107462 109878 112983 116458
64351 116458 119887 123240 126677 130179 133696 137438 141663 146322 151205 156297 161693 167300 172837 178053
64337 178053 182764 186903 190686 194395 197797 200111 200880 200465 199293 197073 193387 188706 184055 179721 175112
64322 175112 169899 164539 159475 154506 149314 144010 138758 133376 127850 122889 119396 117440 116150 114553
64308 114553 112254 109441 106604 104207 102406 101053 100111 99883 100510 101379 101419 100086 97824 95521 93782 92833
64292 92833 92721 93277 93978 94250 94006 93747 94008 94797 95628 96025 95945 95761 95883 96331 96636 96306 95429 94715 94804 95669
64272 95669 96829 97918 98809 99392 99692 100129 101165 102644 103953 104933 106060 107512 108712 109297 109982 111810
64256 111810 114914 118634 122560 126733 131071 135456 140330 146302 152979 158975 163366 166438 168710 169965
64242 169965 169721 167989 164994 160637 154944 148724 143096 138505 134683 131402 128688 126402 124210 122030
64228 122030 120092 118492 117083 115787 114627 113431 111957 110425 109530 109696 110627 111791 113070 114668 116523
64213 116523 118149 119102 119419 119470 119438 119132 118409 117574 117008 116439 115095 112825 110628 109575 109494 109312 108531 107706
64195 107706 107365 107193 106645 105814 105187 104868 104592 104400 104810 106221 108401 110612 112107 112623 112603 112860 113777 114956
64177 114956 115942 117142 119493 123144 127007 129874 131561 132593 133248 133594 134202 135929 138731 141402 143012
64162 143012 144149 146180 149497 153147 156164 158658 161380 164681 168257 171716 175105 178876 183478 188897
64148 188897 194611 200166 205778 212041 218962 225784 232107 238779 247061 257001 267288 276758 285456 293976
64134 293976 302321 309908 316292 321341 324963 327363 329466 332267 335495 337591 337417 335416 332523 328531
64120 328531 322327 313507 302865 291325 279279 267176 255787 245401 235423 225375 215736 207233
64108 207233 199783 192804 186168 180103 174471 168916 163596 159025 155298 152129 149510 147564 145848 143671
64094 143671 141178 139238 138166 137441 136858 136954 137901 138903 139252 139193 139159 138917 138176 137336 136868 136510 135872 135276
64076 135276 135140 135025 134292 133376 133400 134714 136710 138883 141080 142688 142732 141073 138769 136973 136099 136109 136804
64059 136804 137566 137597 136815 135974 135613 135442 134998 134285 133446 132414 131332 130790 131202 132258 133325 134015 134158 133766
64041 133766 133353 133730 134988 136170 136435 136148 136265 137057 138111 139263 140777 142697 144750 146921 149552 152688
64025 152688 155848 158589 160947 163114 165031 166504 167544 168341 169032 169578 169873 169878 169669 169376 169056 168650 167990
64008 167990 166774 164657 161699 158774 157126 157216 158148 158528 157832 156788 156548 157681 159816 161998 163389 163805
63992 163805 163668 163513 163701 164507 166077 168148 170185 172018 174010 176339 178581 180367 182145 184668 187996
63977 187996 191582 195181 198967 202762 205906 208149 210111 212473 215139 217588 219679 221683 223683 225427
63963 225427 226783 228057 229720 231958 234528 236991 239055 240705 242027 243029 243776 244583 245862 247775 250229
63948 250229 253197 256782 260900 265208 269459 273718 278059 282359 286587 291093 296276 302080 308109 314192
63934 314192 320557 327395 334514 341510 348155 354562 361052 367911 375195 382759 390553 398868 408151 418581
63920 418581 429981 442178 455271 469469 484780 501029 518075 535910 554681 574764 596691
63909 596691 620727 646536 673573 701860 732057 764681 799554 836303 875124 916639 961127
63898 961127 1008355 1058178 1110923 1167101 1227078 1291180 1359843 1433485 1512536 1597762 1690299
63887 1690299 1791069 1900538 2019470 2149761 2294044 2454476 2632293 2828593 3045127
63878 3045127 3284082 3547286 3835672 4149094 4486298 4845087 5222817 5616810 6024146
63869 6024146 6441010 6862205 7281188 7690331 8081042 8443879 8769235 9048769 9276693
63860 9276693 9449709 9565623 9622163 9617151 9549491 9419613 9229343 8982162 8683881 8342548
63850 8342548 7967163 7566357 7148139 6720227 6289823 5862987 5444622 5039195 4651209
63841 4651209 4284699 3942339 3625114 3332838 3064935 2820874 2599985 2400970 2221718
63832 2221718 2059764 1913038 1780158 1660022 1551297 1452480 1362406 1280393 1205776 1137435
63822 1137435 1074022 1014604 958912 906962 858642 813720 772002 733294 697343 663989 633239
63811 633239 604978 578649 553502 529206 506092 484742 465427 447907 431569 415752 400136
63800 400136 384943 370727 357942 346704 336843 327990 319692 311653 303921 296685 289960 283700 278113
63787 278113 273473 269539 265535 260992 256343 252445 249657 247583 245566 243200 240482 237647 234837 231912
63773 231912 228765 225783 223587 222114 220454 217992 215284 213252 211777 209834 206885 203372 199741 195789
63759 195789 191363 187084 183777 181466 179380 176826 173728 170501 167687 165563 163817 161733 158893 155636
63745 155636 152672 150494 149268 148972 149282 149579 149392 148723 147672 146074 143860 141496 139591 138259 137303 136763
63729 136763 136680 136515 135532 133787 132087 130960 130279 129934 130052 130311 129919 128689 127436 126823 126471 125814 125134
63712 125134 124947 124858 123994 122337 120695 119506 118557 117946 118334 119916 121815 122964 123152 122918 122811 123077 123706
63695 123706 124435 124934 125251 125857 127103 128858 130852 132968 134963 136254 136487 136224 136660 138548 141562 144770
63679 144770 147627 150439 153852 158020 162525 167164 172375 178462 184713 189995 194255 198778 204799 212410
63665 212410 221015 230147 239386 248053 255651 262299 268229 273168 276745 279170 280813 281319 279866 276299
63651 276299 271364 265777 259705 253312 247111 241418 235921 230217 224493 219303 214903 211098 207633 204490
63637 204490 201872 200006 198796 197569 195424 192104 188388 185351 183383 182166 181455 181490 182578 184585 187056
63622 187056 189660 192415 195533 199248 203689 208752 214080 219349 224700 230739 237956 246171 254727 263110
63608 263110 271187 278829 285641 291169 295133 297325 297541 295835 292628 288250 282561 275329 266937 258359
63594 258359 250466 243564 237520 231957 226397 220659 215242 211039 208527 207392 206958 206632 205966 204773 203430
63579 203430 202719 203112 204430 206412 209231 213091 217632 222205 226668 231484 237066 243356 250095 257202 264808
63564 264808 273137 282401 292663 303775 315591 328192 341749 356207 371355 387130 403584 420649
63552 420649 438264 456752 476574 497461 518154 537339 554597 570082 583501 593952 600906 604952
63540 604952 607332 608901 609723 609522 608274 606209 603385 599431 593862 586596 578044 568625 558409 547393
63526 547393 535950 524640 513538 502150 490194 478249 467257 457532 448583 439971 431929 424944
63514 424944 419007 413685 408844 404912 402317 400998 400676 401321 403037 405668 409016 413346 419181 426455 434432
63499 434432 442829 452501 464445 478403 493072 507524 521767 536076 550662 566215 583802 603609
63487 603609 624312 644204 662519 679121 693553 705199 714143 721043 726334 730311 733843 738048 743059
63474 743059 747874 751647 754464 756561 757440 756113 751748 743798 732046 716890 699120 679173 657083
63461 657083 633393 609448 586343 564148 542564 521681 501584 482018 463235 446536 432965
63450 432965 421878 411778 402218 393767 386375 379114 371735 365240 360409 356762 353533 350812 349016 347875
63436 347875 346755 345632 345079 345518 346998 349501 352947 356977 361178 365530 370378 376068 382726 390162 397824
63421 397824 405190 412477 420633 430212 440495 450082 458114 464539 469414 472549 473799 473226 470886 466831
63407 466831 461383 455078 448216 440758 432870 425292 418902 413923 409722 405512 401250 397759 395866 395483
63393 395483 395760 396112 396739 398018 399779 401543 403177 404889 406776 408850 411504 415449 421045 428002 435816
63378 435816 444168 452815 461519 470339 479802 490575 503103 517630 534217 552435 571299 589940
63366 589940 608358 627338 647735 670064 694520 720833 748008 774779 800668 826251 851954
63355 851954 876820 898914 916859 930493 940119 945859 948113 948103 947259 946083 943996 940280 934839 928062
63341 928062 920293 911531 901416 889408 875169 858897 841255 823041 805017 787813 771702 756477
63329 756477 741846 727897 714995 703395 693388 685660 680834 678543 677469 676600 675989 676098 677025 678828
63315 678828 682048 687189 693896 701324 709257 718243 728611 739965 751843 764360 777930 792704 808583
63302 808583 825466 843140 861128 879035 896989 915413 934318 952977 970276 985137 996639
63291 996639 1004165 1007744 1008091 1005987 1001726 995444 987815 979810 971611 962287 950957 937827 923585 908130
63277 908130 890616 870708 849125 826864 804519 782440 760912 739867 718998 698450 678858
63266 678858 660364 642215 623896 606128 590110 576088 563350 551364 540174 529809 520060 510907
63254 510907 502543 494819 487227 479532 471990 464759 457546 450062 442481 435288 428892 423414 418566 413719
63240 413719 408458 403059 397995 393000 387234 380527 373880 368369 364049 360303 356757 353267 349394 344613
63226 344613 339126 333956 330104 327797 326503 325395 323822 321674 319422 317657 316530 315727 314913 313993 312940
63211 312940 311608 309836 307671 305459 303674 302571 301913 301184 300193 299345 299134 299482 299825 299790 299493 299157 298717
63194 298717 298026 297259 296889 297256 298267 299466 300317 300519 300265 300229 301095 302945 305157 307030 308489 310003 311907
63177 311907 314058 316240 318625 321514 324726 327583 329650 331314 333462 336646 340644 344765 348502 351868
63163 351868 355123 358255 360890 362857 364681 367233 370823 374896 378683 381927 384783 387295 389283 390666
63149 390666 391521 391824 391471 390720 390316 390880 392257 393718 394741 395416 396074 396822 397551 398228 399011 400154 401873
63132 401873 404161 406636 408787 410632 413000 416851 422296 428538 434766 440829 447046 453722 461059 469198
63118 469198 478031 487074 495757 503789 511222 518374 525805 533978 542675 550930 557957 563920 569497 574887
63104 574887 579699 583727 587186 590156 592321 593476 593793 593311 591621 588483 584423 580169 575661 570147 563302
63089 563302 555746 548257 540848 532933 524185 514906 505655 496866 488875 481978 476220 471301 466938 463276
63075 463276 460708 459300 458574 457865 456732 455082 453182 451633 450990 451234 451821 452397 453173 454374 455613 456208
63059 456208 456018 455582 455453 455688 456027 456293 456567 457118 458132 459387 460295 460481 460184 459868 459606 459216 458846 458925
63041 458925 459526 460252 460847 461465 462192 462780 463113 463557 464539 466047 467829 469784 471837 473725 475393 477400
63025 477400 480458 484482 488516 491767 494510 497920 503126 510429 519188 528301 536939 544953 552629 560164
63011 560164 567498 574588 581573 588475 594920 600366 604610 607825 610061 610940 610058 607537 603964 599818 595227
62996 595227 590198 584726 578596 571436 563237 554596 546282 538740 532175 526762 522473 518952 515849 513081
62982 513081 510474 507513 503975 500518 498048 496600 495406 494030 492787 492034 491727 491879 492798 494489 496255
62967 496255 497287 497468 497358 497623 498555 499939 501303 502461 503630 504682 504633 502639 499334 496291 494112 492121
62951 492121 490147 489332 490419 492360 493664 494395 495676 497760 499893 501871 504535 508600 513988 520480 528152
62936 528152 536850 545992 555158 564358 573498 582239 590595 599116 608127 617238 625951 634307 642592 650716
62922 650716 658233 664780 670213 674367 676900 677392 675642 671913 666664 659935 651275 640594 628657 616177
62908 616177 602729 587312 569820 551140 531873 511988 491969 473173 456466 441270 426625
62897 426625 412495 399334 387039 375254 364290 354710 346171 337689 329155 321650 315873 310938 305238
62884 305238 298150 290444 283212 276875 271264 266335 262451 259834 257980 256037 253857 252269 251949 252340 252222
62869 252222 251192 249966 249165 248460 247191 245328 243401 241783 240570 239936 239985 240222 239717 238114 236178 234993
62853 234993 234831 235118 235369 235672 236233 236876 237224 237128 236658 235934 235238 235058 235618 236463 236917 236935 237148 238062 239573
62834 239573 241319 243090 244760 246220 247637 249419 251694 254088 256272 258442 261029 264199 267919 272114
62820 272114 276350 279759 281930 283770 286854 291847 298058 304546 310998 317332 323148 328114 332505 336755
62806 336755 340644 343498 345151 346181 347035 347356 346481 344331 341431 338188 334516 330250 325590 320874 316109
62791 316109 311020 305543 300055 295055 290823 287413 284714 282396 280010 277328 274476 271630 268799 266095
62777 266095 263871 262240 260677 258638 256493 255269 255339 255934 256254 256512 257382 258812 260012 260518 260614 260661 260527
62760 260527 259940 258965 257797 256362 254439 252099 249715 247636 246042 245041 244602 244389 243922 243031 241990 241078
62744 241078 240129 238689 236627 234435 232836 232106 231854 231498 230872 230307 230147 230366 230668 230827 230793 230579 230270 230137
62726 230137 230572 231734 233324 234798 235839 236555 237223 237922 238590 239444 241088 243924 247540 251031 254077 257352
62710 257352 261642 266816 272032 276774 281285 286022 291160 296755 302902 309467 315909 321622 326332 329997
62696 329997 332567 334094 334871 335141 334791 333586 331645 329429 327306 325292 323167 320584 317164 312767 307745
62681 307745 302736 298120 293787 289357 284524 279261 273935 269094 264900 260791 256053 250775 245958 242569
62667 242569 240703 239716 238933 238094 237358 237063 237333 237844 238123 238178 238534 239520 240823 241979 243101 244709 246981
62650 246981 249581 252263 255309 259144 263788 268932 274493 280807 288189 296387 304686 312551 320085 327801
62636 327801 336139 345365 355727 367333 379860 392787 406103 420505 436614 454250 472751 491789
62624 491789 511462 531609 551503 570303 587514 602854 615927 626259 633558 637793 639073 637495
62612 637495 633014 625455 614789 601474 586329 569983 552577 534162 515240 496679 479056 462223
62600 462223 445589 428856 412489 397395 384043 371945 360195 348493 337379 327421 318533 310330
62588 310330 302811 296250 290592 285404 280393 275596 271071 266808 262962 259704 256726 253333 249298 245226
62574 245226 241824 239174 237041 235448 234413 233410 231731 229358 226998 225216 223982 223039 222204 221233 219835
62559 219835 218096 216464 215155 213889 212472 211279 210796 210913 211039 210867 210730 211197 212451 214067 215394 216224
62543 216224 217056 218550 220759 223145 225271 227125 228763 230194 231814 234362 237994 241801 244749 246884
62529 246884 249142 252183 255924 260071 264474 268906 272995 276595 279907 283174 286523 290066 293741 296975
62515 296975 298955 299461 299156 298826 298574 297963 296720 294964 292869 290437 287675 284738 281760 278607 275036
62500 275036 271120 267357 264228 261772 259835 258528 258024 257922 257346 255892 253958 251888 249358 246134 242946
62485 242946 240866 240002 239490 238682 237695 236861 236348 236379 237112 238166 238819 238887 238860 239052 239255 239438 240109 241571 243383
62466 243383 245019 246578 248410 250451 252435 254457 256814 259543 262571 266111 270466 275486 280574 285142
62452 285142 288957 292361 296403 302287 310246 319245 328268 337529 347847 359136 370338 380855 391305
62439 391305 402603 414799 427052 438347 448000 455766 461764 466215 469187 470651 470717 469514 466831 462157
62425 462157 455210 446353 436481 426617 417489 409260 401673 394541 387950 381878 375913 369769 363833 358694
62411 358694 354195 349505 344182 338703 333788 329710 326443 324023 322330 320818 318897 316573 314459 313203
62397 313203 312951 313250 313385 312980 312374 312252 312901 314000 315176 316416 317759 318975 319911 320927 322554 324704
62381 324704 326550 327299 326948 326270 326188 327161 328935 330833 332322 333363 334199 334890 335193 334880 334021 332929 331935
62364 331935 331270 331070 331411 332344 333872 335903 338247 340754 343480 346612 350193 354006 357830 361772 366179
62349 366179 371246 376849 382847 389299 396229 403337 410366 417736 426399 436777 448086 459024 468977
62336 468977 478283 487443 496542 505543 514674 524106 533350 541332 547312 551679 555720 560492 565918 571042
62322 571042 575132 578409 581631 585265 589350 594010 599606 606302 613918 622511 632779 645440 660305
62309 660305 676432 693238 711063 730538 751896 775271 801285 830644 863155 897698 933439
62298 933439 970654 1010065 1051693 1094818 1138832 1183507 1228240 1271414 1310794 1344533 1371799
62287 1371799 1392672 1407571 1416701 1419954 1417326 1409183 1395869 1377194 1352750 1322854 1288809 1252146
62275 1252146 1213913 1174863 1135868 1097771 1061032 1025861 992564 961502 932837 906594 882876
62264 882876 861753 843025 826338 811478 798372 786938 777138 769067 762759 758022 754640 752545 751561
62251 751561 751253 751400 752398 754680 757917 761318 764725 768803 773979 779774 785425 790734 795982 801363 806883
62236 806883 812537 818208 823551 828319 832676 836922 841079 845129 849443 854544 860450 866803 873740 882080
62222 882080 892314 903752 915182 926208 937511 949856 963308 977531 992388 1008014 1024632
62211 1024632 1042615 1062467 1084372 1107966 1132917 1159521 1188316 1219212 1251617 1285493 1321718
62200 1321718 1361113 1403501 1448028 1494133 1541924 1591749 1643549 1696367 1748326 1797410 1842553
62189 1842553 1883778 1921092 1953534 1979527 1997830 2008000 2010482 2006711 1998704 1987770 1973692 1955660
62177 1955660 1933972 1910325 1886513 1863361 1840958 1819348 1798757 1779509 1762025 1746808 1734318
62166 1734318 1724818 1718166 1713686 1710569 1708721 1708965 1712008 1717462 1724375 1732451 1742100 1753357 1765488 1777861
62152 1777861 1790682 1804624 1820100 1837012 1854963 1873644 1893328 1914785 1938307 1962952 1987443
62141 1987443 2011760 2037114 2064230 2092483 2121025 2150087 2180658 2213407 2248331 2285033 2322912
62130 2322912 2361457 2400723 2441153 2482683 2524534 2566173 2607832 2649476 2689819 2727069 2760334
62119 2760334 2789650 2815055 2836614 2855277 2872750 2890121 2907198 2923527 2939629 2956847 2976225
62108 2976225 2997865 3021320 3046372 3073318 3102492 3133523 3165150 3195819 3224351 3250039 3272374
62097 3272374 3290878 3305088 3314583 3319166 3319124 3315039 3307208 3295479 3279884 3261078 3239832 3216370 3190646
62084 3190646 3163110 3134724 3106295 3078228 3050906 3024762 2999801 2975447 2951197 2927333 2904755
62073 2904755 2884163 2865478 2848021 2831217 2815091 2800068 2786355 2773654 2761483 2749596 2738019
62062 2738019 2726904 2716510 2707107 2698690 2690862 2683171 2675429 2667608 2659580 2651116 2641994 2631963 2620788
62049 2620788 2608495 2595405 2581749 2567441 2552374 2536727 2520739 2504448 2487892 2471373 2455229
62038 2455229 2439560 2424424 2410110 2396833 2384359 2372311 2360791 2350401 2341669 2334685 2329161 2324590
62026 2324590 2320535 2317088 2314959 2314821 2316693 2320231 2325367 2332277 2340856 2350672 2361339 2372530 2383827
62013 2383827 2394990 2406327 2418239 2430461 2442271 2453396 2464010 2473597 2480390 2482370 2478656 2469826
62001 2469826 2457289 2442556 2426749 2410301 2392919 2373648 2350815 2322362 2286985 2245173 2198628
61990 2198628 2148601 2095385 2039516 1982518 1925830 1869642 1813641 1758555 1706034 1656959 1610732
61979 1610732 1566478 1524300 1484935 1448653 1415051 1383749 1354768 1328217 1303977 1281847 1261733
61968 1261733 1243472 1226614 1210552 1194839 1179179 1163169 1146278 1128157 1108887 1088923 1068996
61957 1068996 1050058 1033001 1018141 1005130 993510 983221 974414 967050 961088 956963 955482 957065
61945 957065 961329 967513 975184 984397 995242 1007213 1019033 1029182 1036717 1041527 1043750 1043138 1039108
61932 1039108 1031185 1019151 1003032 983355 961322 938340 915341 892742 870886 850106 830418
61921 830418 811606 793721 777189 762384 749394 738192 728724 720830 714453 709903 707513 706986 707538
61908 707538 708801 711117 714794 719595 725212 731809 739731 749011 759555 771518 785158 800486 817401
61895 817401 836018 856588 879264 904203 931714 962135 995661 1032520 1073123 1117813 1166584
61884 1166584 1219176 1275244 1334319 1395876 1459568 1525071 1591549 1657773 1723118 1787970 1852600
61873 1852600 1916009 1976498 2033139 2086027 2135220 2180188 2220317 2255274 2284749 2308543 2327250
61862 2327250 2342389 2355606 2368224 2381816 2398571 2420516 2448643 2483310 2525210 2575375 2634245
61851 2634245 2701183 2774914 2854107 2937533 3024131 3113086 3203708 3295247 3387157 3479543 3573068
61840 3573068 3668253 3765109 3863468 3963128 4063094 4160542 4250689 4327614 4385195 4417671 4420217
61829 4420217 4389782 4325864 4230729 4108923 3966282 3808843 3642126 3470968 3299582 3131482
61819 3131482 2969370 2815332 2671153 2538267 2417371 2308342 2210642 2123751 2047242 1980696
61809 1980696 1923692 1875820 1836633 1805745 1783017 1768462 1761966 1763317 1772643 1790459 1817043 1851957
61797 1851957 1894427 1943971 2000342 2063045 2131327 2204603 2282426 2363944 2447584 2531346 2613185
61786 2613185 2691069 2762928 2826721 2880575 2923060 2953612 2972735 2981596 2981501 2973997 2961288 2946027
61774 2946027 2930505 2916295 2904676 2896911 2893736 2894772 2898652 2903544 2907418 2908114 2903544 2891893 2871578
61761 2871578 2841289 2800313 2748792 2687561 2617827 2541118 2459282 2374238 2287703 2201243 2116422
61750 2116422 2034643 1956899 1883851 1816066 1754042 1698115 1648588 1605851 1570069 1540735 1516843
61739 1516843 1497709 1483413 1474328 1470430 1471304 1476564 1485879 1498682 1514400 1533262 1556463 1585119
61727 1585119 1619288 1658459 1702785 1753261 1810741 1875486 1947893 2028951 2119544 2219924 2330501
61716 2330501 2452704 2588306 2738121 2902120 3080638 3274547 3484104 3708406 3946177
61707 3946177 4196156 4455924 4720477 4982017 5230505 5454048 5639556 5774514 5849268 5858627
61697 5858627 5802470 5685624 5516866 5307060 5067335 4808161 4539007 4267917 4001164 3743410
61687 3743410 3498073 3267406 3052512 2853671 2670676 2502794 2348794 2207478 2078150
61678 2078150 1960383 1853573 1756968 1669969 1592036 1522423 1460337 1405246 1356665 1313777 1275686
61667 1275686 1242015 1212764 1187444 1164723 1143120 1121776 1100294 1078095 1054341 1028600 1001375
61656 1001375 973733 946378 919200 891775 864102 836609 809573 782975 757021 732388 709704
61645 709704 689068 670293 653327 638069 624030 610579 597422 584490 571553 558418 545439
61634 545439 533311 522218 511641 501219 491398 482876 475632 468897 462058 455247 448911 443051 437200
61621 437200 431138 425310 420266 415856 411405 406723 402543 399683 398043 396746 395198 393678 392923 393347 394711
61606 394711 396348 397625 398263 398305 397879 397174 396635 396983 398866 402557 407910 414419 421334 428109 434905 442401
61590 442401 450969 460337 470224 480773 492013 503257 513529 522344 529597 534964 538038 539022 538736 537863
61576 537863 536584 534939 533104 531269 529672 528858 529506 531868 535653 540473 546041 551886 557378 562161 566117
61561 566117 568742 569003 566173 560458 552475 542433 530298 516560 502294 488377 474931 461638 448391
61548 448391 435535 423622 413031 403737 395356 387474 379987 373130 367155 362020 357474 353457 350292
61535 350292 348359 347647 347761 348301 349064 349982 351181 353091 356059 359750 363368 366729 370612 375678 381529
61520 381529 387397 393370 400195 408029 416268 424600 433356 442610 451777 460666 470185 481253 493344 504886
61506 504886 515001 524211 533322 542238 550200 556858 562667 568237 573644 578550 582855 586983 591437 596277
61492 596277 601186 605921 610541 615252 620194 625333 630352 634773 638407 641623 644888 648034 650285 651008
61478 651008 650244 648486 646214 643670 640780 637281 633172 629061 625690 623117 620851 618946 618453 620414 624797
61463 624797 630839 638181 647119 657865 670179 683858 699176 716592 736217 757814 781267 806882
61451 806882 835257 866987 902429 941595 984153 1029640 1077840 1128942 1183197 1240373 1299596
61440 1299596 1359656 1419128 1476091 1528129 1573025 1609434 1636636 1653897 1660584 1656933 1644196 1623841
61428 1623841 1596915 1564373 1527719 1488995 1450171 1412653 1377174 1343936 1312894 1284075 1257745
61417 1257745 1234350 1214337 1197858 1184534 1173608 1164575 1157574 1152968 1150674 1150219 1151321 1153969 1157976
61404 1157976 1162991 1169105 1176933 1186791 1198207 1210562 1223946 1238912 1255506 1272930 1290197 1306955
61392 1306955 1323662 1341085 1359641 1379158 1399328 1420259 1442353 1465584 1489164 1512094 1533881
61381 1533881 1554534 1573973 1591579 1606335 1617469 1625100 1630228 1633882 1636317 1637278 1636916 1635992 1635109 1634143
61367 1634143 1632603 1630159 1626627 1621835 1615816 1608797 1600725 1591068 1579435 1566184 1552082 1537535 1522525
61354 1522525 1507243 1492398 1478743 1466412 1454809 1443146 1431154 1419241 1407874 1396975 1386208
61343 1386208 1375735 1366222 1358035 1350884 1344486 1339165 1335579 1334242 1335660 1340496 1349118 1361229 1376386
61330 1376386 1394851 1417572 1445362 1478322 1515948 1557625 1603077 1652515 1706229 1763971 1824916
61319 1824916 1888236 1953278 2018907 2082983 2142758 2195635 2239512 2272973 2295672 2308311 2311809
61308 2311809 2306600 2292846 2271023 2242020 2206995 2167387 2124669 2079724 2032871 1984883 1937462
61297 1937462 1892131 1849107 1807954 1769071 1733746 1702866 1676268 1653334 1633591 1616700 1602393
61286 1602393 1590478 1580519 1571594 1562805 1553830 1544517 1534219 1522236 1508810 1494926 1481138 1467289
61274 1467289 1453396 1440158 1428477 1419124 1412826 1409888 1409598 1410653 1412319 1414456 1416510 1417496 1417265 1416728
61260 1416728 1416369 1415532 1413846 1412319 1411975 1412082 1410882 1407817 1403989 1400492 1397325 1394109 1391007 1388442 1386425
61245 1386425 1384602 1382838 1381438 1380779 1380875 1381358 1381923 1382603 1383360 1383559 1382279 1379162 1374408 1367825 1358621 1346612
61229 1346612 1333060 1319625 1306836 1294251 1281869 1270585 1261278 1254123 1248876 1245260 1242958 1241774
61217 1241774 1242007 1244238 1248621 1254790 1262625 1272697 1285625 1301381 1319597 1340338 1364182 1391542
61205 1391542 1422172 1455394 1490548 1527037 1563906 1599635 1632665 1662252 1688678 1712513 1733930
61194 1733930 1752928 1769972 1785930 1801320 1815839 1828594 1838560 1844870 1847040 1845037 1838880 1828080
61182 1828080 1811713 1789094 1760223 1725641 1686282 1643562 1599235 1554782 1511052 1468598 1428048
61171 1428048 1389913 1354266 1320968 1290138 1262147 1237156 1214843 1194515 1175346 1156657 1138262
61160 1138262 1120554 1104042 1088839 1074732 1061637 1049661 1038732 1028540 1018946 1010153 1002328 995379
61148 995379 989307 984458 981076 978770 976828 974969 973438 972408 971732 971333 971398 972011 973026 974599 977484
61133 977484 982349 988931 996336 1004099 1012547 1022119 1032785 1044318 1056658 1069612 1082313 1093355 1101562
61120 1101562 1106539 1108607 1108395 1106512 1103384 1099109 1093373 1085506 1074827 1061157 1045108 1027755 1009874
61107 1009874 991460 972014 951320 929867 908479 887591 867049 846653 826767 808132 791185
61096 791185 775844 762046 750065 740079 731729 724547 718658 714631 712663 712346 713298 715578 719365 724561
61082 724561 730927 738269 746218 753974 760468 764627 765535 762768 756903 749370 741400 733199 724397 715065
61068 715065 705866 697297 689280 681581 674285 667625 661621 656161 651257 646990 643175 639272 634763 629646
61054 629646 624531 620181 616879 614180 611287 607772 603993 600845 599009 598426 598532 598942 599753 601138 602955
61039 602955 605016 607572 611142 615800 620890 625520 629087 631292 631908 630752 627782 623180 617444 611307
61025 611307 605303 599419 593394 587315 581555 576212 571122 566528 563182 561476 560987 561167 561979 563454 565158
61010 565158 566736 568559 571094 573856 575849 577035 578540 581163 584371 587098 588985 590400 591697 593083
60996 593083 594957 597776 601412 605091 608228 611154 614738 619342 624448 629422 634337 639747 645876 652508
60982 652508 659632 667556 676162 684612 692251 699422 706921 714998 723389 731995 740912 750046 759396 769573
60968 769573 781290 794298 807595 820822 834754 850154 866725 883578 900226 916775 933517
60957 933517 950756 968735 987375 1006191 1024666 1042614 1060186 1077835 1096282 1116140 1137418
60946 1137418 1159750 1183157 1208207 1235343 1264557 1295851 1329525 1365861 1405019 1447428 1493787
60935 1493787 1544419 1599130 1657928 1721316 1789570 1862322 1939270 2020912 2108269 2202353 2304121
60924 2304121 2414284 2532835 2659457 2794808 2940688 3098384 3267475 3446671 3635020
60915 3635020 3831822 4036609 4250385 4476254 4717864 4977978 5259419 5566255 5902361
60906 5902361 6269394 6667677 7098807 7566645 8077563 8642429 9277601 10000811 10825303
60897 10825303 11759615 12812458 13995377 15322284 16811878 18491906 20397037 22563041
60889 22563041 25029337 27839998 31005496 34416797 37784055 40698859 42820061 44047694
60881 44047694 44542685 44596966 44491173 44441364 44594907 44984192 45449474 45645736 45194619 43885778
60871 43885778 41767884 39075614 36084447 33012327 30001311 27137245 24468044 22016011
60863 22016011 19789239 17788267 16006142 14428850 13039753 11822366 10758137 9824893
60855 9824893 9000403 8266821 7610790 7021334 6489616 6009583 5576695 5186113 4832951
60846 4832951 4513475 4224774 3963679 3726916 3511767 3315560 3134961 2966711 2808888
60837 2808888 2660725 2521610 2390996 2268852 2155275 2049724 1951204 1859129 1773523 1694523
60827 1694523 1622018 1555475 1493832 1435945 1381449 1330735 1283851 1240101 1199058 1161072 1126105
60816 1126105 1092903 1060236 1028362 998304 970231 943533 918009 893864 870821 848409 827044
60805 827044 807715 790556 774720 759632 745379 731790 718296 705019 693012 682898 674048 665488
60793 665488 656920 648446 640110 632244 625586 620361 615751 610925 606266 602879 601128 600231 599240 597884 596430
60778 596430 595088 593672 591694 588820 585336 582021 579460 577654 576411 575800 575991 576936 578513 580775 583720
60763 583720 586990 590205 593553 597617 602536 607598 611844 614964 617537 620609 625078 631215 638463 645686
60749 645686 651822 656433 659610 661462 661961 661286 660025 658764 657616 656363 654818 652712 649433 644542 638544
60734 638544 632607 627300 622135 616565 610818 605325 599928 594294 588733 583859 579663 575609 571515 567590
60720 567590 563639 559048 553787 548804 545050 542568 540801 539346 538047 536687 535093 533465 532275 531791
60706 531791 531844 532104 532497 533303 534830 537081 539878 543227 547220 551507 555343 558447 561444 564999 568909
60691 568909 572572 576022 579739 583561 586578 588211 588756 588704 588065 586539 583828 579672 574055 567586 561126
60676 561126 554818 547938 539928 531114 522190 513450 504788 496031 487068 478051 469718 463023 458101 453945
60662 453945 449430 444307 438964 433670 428495 423631 419287 415400 411785 408425 405335 402294 399010 395525
60648 395525 392253 389686 388023 386975 385994 384936 384329 384498 384629 383405 380705 377938 376385 375939 375844 375921
60632 375921 376367 376985 377478 378236 379976 382620 385195 386997 388407 390422 393653 397843 402167 406006 409525
60617 409525 413408 418027 423055 427945 432436 436565 440624 445281 451213 458293 465555 472270 478654 485270
60603 485270 492250 499526 507228 515346 523377 530879 538045 545307 552769 560483 568683 577139 584768 590683
60589 590683 595266 599420 603126 605632 606797 607287 607459 606938 605354 602733 599108 594490 589261 583876 578217
60574 578217 572001 565796 560696 556803 553009 548579 544063 540236 537018 534066 531681 530325 529727 529223 528752
60559 528752 528897 530028 531940 534220 536584 538833 540806 542438 543846 545529 548472 553598 560839 569058
60545 569058 577220 585335 594001 603433 613380 623742 634674 646106 657649 669113 680767 692928
60533 692928 705486 717906 729524 739757 748177 754521 758572 759996 758400 753687 746342 737254 727244
60520 727244 716756 705982 695060 684015 672706 661206 650193 640556 632428 624989 617497 610207
60508 610207 603932 598908 594578 590396 586400 582910 580020 577567 575424 573725 572828 572985 573959 575127 576106
60493 576106 577131 578615 580595 582850 585355 588254 591534 595115 599086 603482 607929 611999 615920 620568
60479 620568 626720 634559 643768 653766 664037 674693 686621 700610 716358 732839 749631 767405
60467 767405 787149 809398 834230 861487 890953 922817 958053 997826 1042449 1091386 1144342
60456 1144342 1201769 1264283 1332249 1406080 1486031 1571075 1658373 1744228 1825325 1898964 1962846
60445 1962846 2015275 2055401 2082906 2097697 2100173 2091384 2072614 2045043 2010057 1969456 1925022 1878202
60433 1878202 1830589 1784333 1741640 1704031 1672343 1647167 1628930 1617814 1613995 1617784 1629285 1648177
60421 1648177 1674175 1707386 1747716 1793909 1843416 1893136 1940252 1982695 2019213 2048981 2071219
60410 2071219 2085617 2093330 2097055 2099679 2103084 2108464 2117226 2130983 2150929 2177839 2212554 2256000
60398 2256000 2308959 2372387 2447962 2537850 2643909 2767476 2909865 3072617 3257167 3464600
60388 3464600 3695826 3951840 4233767 4542649 4878763 5240434 5622990 6018367 6414932
60379 6414932 6797183 7146166 7441474 7664142 7798991 7836214 7772829 7613645 7370619 7060427
60369 7060427 6701567 6312069 5907960 5502457 5105851 4725734 4367112 4032691 3723648
60360 3723648 3440379 3182511 2948612 2736579 2544514 2371008 2214665 2073841 1946984
60351 1946984 1832881 1730401 1638256 1555163 1480048 1411919 1349751 1292637 1239966 1191338 1146367
60340 1146367 1104667 1065982 1030351 998067 969266 943442 919556 896869 875509 856017 838444
60329 838444 822188 806611 791516 777028 763352 750626 738742 727279 715879 704663 693975
60318 693975 683701 673237 662242 651101 640493 630743 621782 613478 605760 598609 592101 586348 581251
60305 581251 576503 572025 568204 565373 563152 560643 557332 553529 549817 546338 542784 538842 534394 529448
60291 529448 524223 519228 514817 510604 505763 500153 494759 490617 487615 484844 481942 479454 477863 476986
60277 476986 476546 476753 477783 479141 480102 480704 481705 483600 486051 488440 490595 492746 494975 497094 499052
60262 499052 501173 503745 506545 509102 511415 514001 517069 520075 522398 524105 525580 526773 527458 528032 529239
60247 529239 531118 532985 534597 536555 539285 542444 545785 549851 555124 561016 566484 571289 576002 580945
60233 580945 585727 589728 592521 593909 593946 592834 590586 587021 582400 577590 573148 568635 563417 557752 552416
60218 552416 547537 542700 538124 534818 533372 533241 533515 533889 534605 535907 537835 540330 543345 547015 551642
60203 551642 557199 562906 567731 571406 574674 578486 583290 589096 595835 603505 612144 621751 632161 643203
60189 643203 655180 668897 684770 702186 720281 739170 759752 782439 806757 832294 859327
60178 859327 888258 918967 950912 983345 1015266 1045787 1074947 1103687 1132689 1161480 1188919
60167 1188919 1214089 1236469 1255692 1271665 1284654 1294889 1302255 1306700 1308645 1308660 1306962 1303710 1299615
60154 1299615 1295792 1292969 1291256 1290777 1292118 1295822 1301690 1308945 1317225 1327109 1339440 1354335 1371226
60141 1371226 1389854 1410719 1434359 1460582 1488728 1518226 1548455 1578425 1607244 1634774 1661194
60130 1661194 1685943 1707671 1725303 1738687 1748230 1754424 1757697 1758085 1754928 1747537 1736371 1722996 1708755
60117 1708755 1694122 1679661 1666813 1657073 1650825 1647613 1647280 1650311 1657233 1668246 1683406 1702815 1726577
60104 1726577 1754799 1787509 1824453 1865065 1908790 1955203 2003688 2053273 2102930 2151708 2198261
60093 2198261 2240587 2276634 2305068 2325192 2336450 2338410 2331208 2315717 2293436 2266437 2237187 2207932
60081 2207932 2180258 2155420 2134905 2120195 2111951 2109828 2113307 2122583 2138478 2161622 2191869 2228676
60069 2228676 2272001 2322564 2380985 2446810 2518796 2596051 2678377 2765337 2855548 2947212 3038900
60058 3038900 3129331 3216725 3298971 3374320 3441590 3499902 3548689 3587818 3617079 3635479 3641530
60047 3641530 3634360 3614195 3581708 3537419 3482024 3416947 3344171 3265694 3183518 3100009 3017782
60036 3017782 2938980 2864837 2796073 2733557 2678349 2631186 2592227 2561401 2538749 2524229 2517391
60025 2517391 2517574 2524279 2536938 2554252 2574208 2595016 2615780 2635992 2654603 2670020 2681011 2687321
60013 2687321 2689313 2687296 2681314 2671396 2657745 2640764 2621136 2599907 2578186 2556554 2534951 2513392
60001 2513392 2492650 2473908 2457785 2444206 2433346 2426271 2424394 2428614 2439255 2456319 2479316 2507186
59989 2507186 2538930 2574156 2612506 2652752 2692992 2731561 2767165 2798419 2824156 2844293 2859550
59978 2859550 2870087 2875101 2873914 2866657 2853505 2834063 2808105 2776315 2739631 2698314 2652310 2602143
59966 2602143 2548782 2492854 2434714 2375202 2315689 2257364 2200979 2147316 2097374 2051861 2010901
59955 2010901 1974423 1942654 1915984 1894517 1877955 1866041 1859041 1857615 1862077 1871923 1886353 1905155
59943 1905155 1928617 1956535 1987787 2021144 2056084 2092478 2129833 2167272 2203964 2239114 2271558
59932 2271558 2299793 2322488 2338862 2348698 2352220 2349841 2341776 2327892 2308067 2282687 2252789 2219837
59920 2219837 2185338 2150401 2115608 2081534 2049392 2020732 1996449 1976566 1961204 1951180 1947163
59909 1947163 1948623 1954152 1962662 1973932 1988241 2005932 2027143 2051456 2077830 2105198 2133063 2161200
59897 2161200 2188954 2215253 2239281 2260859 2280162 2297336 2312336 2324921 2334816 2342059 2347134 2350729
59885 2350729 2353538 2356396 2360367 2366531 2375892 2389536 2408482 2433198 2463696 2500342 2544141 2595925
59873 2595925 2655765 2723538 2799480 2883567 2974708 3071158 3171284 3273216 3374076 3470396 3559122
59862 3559122 3637427 3701726 3748049 3773783 3778459 3762694 3727227 3673492 3604490 3524269 3436501
59851 3436501 3343759 3247940 3151004 3055294 2963252 2876835 2797203 2725008 2660897 2605540 2559238
59840 2559238 2521753 2492537 2471050 2457003 2450519 2451901 2461053 2477183 2499225 2526210 2556987 2589966
59828 2589966 2623645 2657129 2689550 2719138 2743443 2760372 2768466 2766276 2752351 2726158 2688540 2641068
59816 2641068 2585322 2522895 2455516 2384755 2311806 2237707 2163480 2089926 2017584 1947037 1879016
59805 1879016 1814124 1752791 1695572 1643166 1595993 1554040 1517230 1485544 1458680 1435914 1416573
59794 1416573 1400407 1387285 1376720 1367924 1360292 1353747 1348688 1345532 1344173 1343997 1344557 1346021 1348664 1352216
59780 1352216 1356248 1361003 1367117 1374432 1381727 1387770 1391999 1393933 1392728 1387885 1379900 1369571 1356953
59767 1356953 1341702 1324277 1306088 1288279 1270842 1253211 1235378 1218108 1202164 1187700 1174528
59756 1174528 1162801 1153107 1145902 1141156 1138759 1139030 1142516 1149341 1159096 1171327 1185861 1202635 1221537
59743 1221537 1242478 1265339 1289777 1315328 1341812 1369314 1397541 1425230 1450393 1471211 1486903
59732 1486903 1498028 1506088 1512812 1519725 1528226 1539527 1554015 1570739 1587952 1604366 1619948 1635791
59720 1635791 1653606 1675178 1701773 1733862 1771555 1815245 1865576 1922888 1987044 2057718 2134430
59709 2134430 2216141 2301003 2386285 2468090 2541119 2599394 2637856 2653694 2646767 2619452 2576116
59698 2576116 2522001 2461871 2399234 2336376 2274731 2215416 2159859 2109876 2066813 2030789 2001226
59687 2001226 1977896 1960856 1949615 1943346 1942063 1946731 1957830 1974591 1996096 2022470 2054382 2091922
59675 2091922 2134671 2182611 2236222 2295768 2361092 2432255 2509985 2595214 2688359 2789207 2897530
59664 2897530 3013702 3138605 3272955 3416923 3570455 3733531 3905744 4085923 4272552
59655 4272552 4464271 4659391 4855139 5048196 5236053 5417406 5591477 5757912 5917507
59646 5917507 6072158 6223763 6373731 6523645 6675388 6829938 6986540 7143298 7297824
59637 7297824 7446958 7586840 7714108 7826533 7921874 7996931 8048881 8077387 8084679 8073891 8048135
59626 8048135 8010806 7965624 7916048 7865318 7817202 7776027 7745663 7728799 7727235 7742474 7775868
59615 7775868 7828549 7901402 7994931 8109153 8243811 8398478 8572021 8761823 8963685 9172314
59605 9172314 9381473 9583605 9769668 9929623 10053299 10131462 10157042 10126174 10038457 9896642
59595 9896642 9706281 9475344 9213335 8929944 8634028 8333301 8034548 7743712 7465505
59586 7465505 7202682 6955727 6723429 6503671 6293406 6088114 5882176 5670597 5450692
59577 5450692 5222504 4988325 4752003 4517884 4289482 4068955 3857936 3658401 3472290
59568 3472290 3300469 3142515 2997441 2864445 2743149 2633403 2534728 2445870 2365244 2291971
59558 2291971 2226016 2167084 2114036 2065923 2022941 1985493 1952668 1922568 1894024 1867181 1842355
59547 1842355 1819202 1797193 1776130 1755696 1734968 1712797 1688535 1662191 1634185 1605197 1576018
59536 1576018 1547268 1519247 1492109 1466075 1441408 1418268 1396657 1376511 1357864 1340929 1325926
59525 1325926 1312825 1301421 1291636 1283440 1276534 1270534 1265609 1262424 1261233 1261603 1263359 1267154 1273479 1281656
59511 1281656 1290586 1300092 1310688 1322276 1334062 1345763 1357995 1371337 1385825 1401597 1419296 1439409
59499 1439409 1461713 1485713 1511223 1538364 1567531 1599602 1635632 1675941 1719852 1766660 1816526
59488 1816526 1870133 1927821 1989439 2054709 2123345 2194970 2269215 2345733 2423855 2502355 2579815
59477 2579815 2655150 2727662 2796837 2862264 2923553 2980008 3030399 3073197 3107022 3130908 3144598
59466 3144598 3148939 3145941 3138048 3127121 3113970 3098798 3082162 3065713 3052007 3043310 3040492 3043285
59454 3043285 3051662 3066614 3089382 3120289 3158574 3202862 3251070 3299826 3344783 3382045 3409207
59443 3409207 3424817 3427214 3414381 3384947 3338909 3277307 3201619 3113826 3016701 2913520 2807381
59432 2807381 2700945 2596619 2496465 2401875 2313691 2232672 2159449 2093953 2035467 1983527 1938374
59421 1938374 1900221 1868616 1842998 1823454 1810317 1803214 1801225 1803936 1811782 1825237 1844165 1868073
59409 1868073 1896622 1929747 1967505 2009915 2056683 2107100 2160426 2216218 2273835 2331665 2387373
59398 2387373 2439006 2485367 2525071 2555875 2575464 2582740 2577909 2561415 2533302 2493776 2444076 2386448
59386 2386448 2323207 2255917 2185495 2112937 2039696 1967408 1897436 1830766 1768068 1709647 1655435
59375 1655435 1605221 1558835 1516124 1476967 1441507 1410092 1382814 1359297 1339184 1322517 1309313
59364 1309313 1299067 1291144 1285482 1282442 1282118 1284327 1289155 1296838 1307020 1318774 1331607 1345939 1362313
59351 1362313 1380714 1401125 1424278 1451018 1480805 1511286 1539563 1563862 1584239 1602258 1620226
59340 1620226 1640376 1664126 1691915 1723847 1760477 1802492 1849280 1898134 1945637 1990150 2032732
59329 2032732 2075617 2120347 2167658 2218450 2273953 2334879 2401021 2471893 2547479 2628301 2715117
59318 2715117 2808653 2909337 3017138 3131829 3253553 3383035 3521134 3668269 3824362 3989245
59308 3989245 4162930 4345190 4534681 4728565 4923288 5115772 5303681 5484757 5656591
59299 5656591 5817269 5965758 6101295 6222895 6329912 6422706 6502149 6568648 6622029 6662082
59289 6662082 6688598 6700958 6698069 6678624 6641124 6584073 6506866 6410465 6296749 6167435 6024202
59278 6024202 5869543 5706535 5537618 5364422 5189018 5014640 4844589 4680761 4523503
59269 4523503 4372643 4228391 4091583 3963393 3844737 3735757 3635920 3544516 3460938 3384642
59259 3384642 3315201 3252399 3195992 3145480 3100367 3060452 3025414 2994307 2966006 2940083 2916685
59248 2916685 2895555 2875783 2856527 2837356 2817725 2796732 2773678 2748392 2720814 2690806 2658621
59237 2658621 2625021 2590530 2554926 2517885 2479784 2441490 2403581 2366185 2329493 2294130 2260940
59226 2260940 2230493 2202811 2177615 2154992 2135769 2121009 2111200 2106084 2105197 2108255 2115127 2125818
59214 2125818 2140451 2158919 2180545 2204431 2230031 2256878 2283760 2308699 2329951 2346617 2358219
59203 2358219 2364171 2363943 2357378 2344600 2325896 2301916 2273770 2242736 2209935 2176307 2142714 2110044
59191 2110044 2079365 2051824 2028250 2009055 1994810 1986550 1984986 1989727 1999922 2015451 2036592 2062407
59179 2062407 2090157 2116541 2139175 2157089 2170779 2182146 2193767 2207734 2225303 2247384 2274625
59168 2274625 2306940 2343844 2385621 2433594 2488914 2551622 2621159 2697244 2779952 2869481 2966134
59157 2966134 3070114 3181134 3298637 3422504 3552908 3689190 3829333 3970566 4109802
59148 4109802 4243375 4367265 4478075 4573218 4649910 4704884 4735629 4741293 4722004 4678344 4612377
59137 4612377 4528483 4431938 4326651 4214815 4098355 3979872 3862112 3747129 3636122 3529740
59127 3529740 3428408 3332432 3241759 3155862 3074278 2997233 2925193 2857882 2794449 2734717 2679407
59116 2679407 2628880 2582589 2540210 2502302 2469121 2439632 2412657 2388380 2367750 2350803 2336538
59105 2336538 2324204 2313849 2305669 2299577 2295401 2292964 2292046 2292632 2294944 2298769 2303087 2306880 2309968 2312457
59091 2312457 2313791 2313122 2310447 2306477 2301395 2294420 2284758 2272423 2257936 2241616 2223440 2203430 2182000
59078 2182000 2159896 2137697 2115413 2092791 2069908 2047106 2024489 2002094 1980573 1960912 1943336
59067 1943336 1927375 1913345 1902762 1896673 1894484 1895234 1899180 1907048 1918341 1931557 1945879 1961647
59055 1961647 1979370 1999063 2020443 2042991 2065928 2088764 2111655 2134612 2156595 2176051 2192084
59044 2192084 2204528 2213428 2219313 2223630 2227941 2232841 2238452 2245618 2255587 2268732 2284575 2302805 2322958
59031 2322958 2343028 2359574 2369574 2371285 2363293 2343998 2312694 2270354 2218768 2159484 2093946 2023950
59019 2023950 1951386 1877929 1805219 1734787 1667443 1603201 1542176 1485086 1432563 1384483 1340416
59008 1340416 1300392 1264741 1233421 1205906 1181668 1160478 1142288 1127011 1114486 1104581 1097332 1092852
58996 1092852 1091022 1091488 1094086 1099018 1106290 1115192 1124679 1134082 1143061 1151143 1157901 1163645 1169503 1176825
58982 1176825 1186684 1199781 1216297 1235944 1258576 1284780 1315466 1350883 1390262 1432169 1474633
58971 1474633 1514954 1549868 1576350 1592466 1598001 1594680 1585513 1573322 1559645 1544924 1529237 1512525
58959 1512525 1494745 1476489 1459231 1444355 1432140 1422128 1414125 1408129 1403513 1399072 1393971 1388175
58947 1388175 1382000 1375665 1369191 1362289 1354403 1345142 1334423 1321977 1307198 1289925 1270787 1250213
58935 1250213 1227700 1202837 1176540 1150374 1125063 1100572 1077282 1056021 1037152 1020596 1006559
58924 1006559 995255 986100 978325 972272 969030 968754 970477 973661 978818 986340 995752 1006584 1019159
58911 1019159 1034165 1052003 1072714 1095920 1120698 1146168 1172188 1198844 1225311 1250011 1271827
58900 1271827 1290395 1305428 1316923 1326061 1334810 1344313 1354499 1365311 1377312 1390986 1406554 1424593
58888 1424593 1445659 1468904 1492167 1513837 1533634 1551358 1566142 1577598 1586629 1594407 1601472 1608444
58876 1608444 1616644 1627197 1640175 1655276 1672655 1692411 1713970 1736665 1760411 1785267 1810927
58865 1810927 1837253 1864790 1894334 1926590 1962637 2003921 2051084 2103365 2159809 2220631 2286976
58854 2286976 2359919 2440184 2528271 2624266 2728008 2839897 2961067 3092359 3233608 3384266
58844 3384266 3544013 3712279 3887808 4069164 4254990 4443179 4630308 4812400 4985573
58835 4985573 5145451 5286710 5404047 5493354 5551618 5576492 5566894 5523809 5449936 5348780 5224379
58824 5224379 5081272 4924044 4757054 4584689 4411118 4239237 4070453 3905972 3747682
58815 3747682 3597234 3454925 3320216 3192854 3072855 2959924 2853655 2754074 2661409 2575651
58805 2575651 2496730 2424621 2358727 2297544 2239375 2182907 2126853 2069855 2011484 1952791 1895225
58794 1895225 1839509 1786073 1735827 1689612 1647390 1608732 1573657 1542225 1513920 1488364 1466272
58783 1466272 1448675 1435434 1425420 1417972 1413222 1411062 1410807 1412191 1415955 1423088 1433815 1447541 1463568
58770 1463568 1481756 1502556 1526390 1553086 1582170 1613645 1648070 1685827 1726888 1771372 1819689
58759 1819689 1871928 1927804 1987462 2051543 2120132 2192556 2268756 2350046 2437846 2532378 2633264
58748 2633264 2740666 2855131 2977048 3107003 3245888 3393664 3548662 3709122 3874816
58739 3874816 4045986 4220974 4395912 4566348 4728063 4876577 5007198 5115869 5199137 5253370
58729 5253370 5275102 5262695 5217280 5141904 5040156 4915545 4771655 4612580 4443106 4268065
58719 4268065 4091122 3914512 3740226 3570864 3408784 3254906 3109061 2971083 2840852
58710 2840852 2717769 2601215 2491538 2389778 2296405 2210900 2132513 2060810 1995546 1936626
58700 1936626 1884231 1838449 1798665 1763733 1732850 1706076 1684107 1667742 1657433 1653120 1654579 1661918
58688 1661918 1675419 1694940 1720072 1750999 1788547 1833162 1884525 1942335 2006441 2075469 2145853
58677 2145853 2212593 2270306 2313368 2336625 2337518 2317357 2279903 2229149 2168900 2103291 2036167 1969946
58665 1969946 1905673 1843775 1784090 1725749 1667963 1610745 1554397 1498864 1444182 1390875 1339245
58654 1339245 1288919 1239775 1192560 1147878 1105458 1065265 1028360 995528 965886 938078 912112
58643 912112 888778 868018 849248 832657 818709 806835 796073 786571 778949 772492 765577 757778
58631 757778 750093 743189 736893 731398 727456 725163 723835 723330 724384 727484 732423 739043 747411 757249
58617 757249 768247 780963 796432 814869 835701 858699 883995 911106 939124 967829 997416
58606 997416 1027041 1054748 1078892 1098691 1113591 1123330 1128598 1130405 1128666 1122531 1112029 1098148
58594 1098148 1081296 1060995 1037258 1010964 982722 952661 921619 891272 862704 835905 810948
58583 810948 788542 769098 752356 738194 726776 717641 709800 703054 698168 695401 693973 693311 693818
58570 693818 696020 699905 705455 712817 721622 731062 741050 752487 766093 781775 799323 818803 840092
58557 840092 862921 887570 914623 943984 975103 1008216 1044195 1083034 1123635 1165398 1208898
58546 1208898 1254735 1302874 1353436 1407017 1463694 1522566 1582418 1641859 1698686 1750386 1795612
58535 1795612 1834054 1864637 1885203 1894489 1893323 1883412 1866157 1843173 1816747 1788996 1761359 1735307
58523 1735307 1712521 1693883 1679318 1669173 1664703 1666710 1674716 1688125 1707251 1732576 1763832 1800492
58511 1800492 1842440 1889772 1942754 2002409 2070280 2147069 2232092 2324182 2422120 2523651 2624763
58500 2624763 2719933 2802141 2862719 2893061 2887938 2847214 2774644 2676100 2558778 2430144 2296282
58489 2296282 2161522 2029613 1904033 1786791 1678115 1577863 1486276 1403167 1327701 1259532
58479 1259532 1199058 1146081 1099367 1057944 1021641 989896 961351 935280 912218 892545 875527
58468 875527 860358 846970 835284 824780 815445 807926 802165 796978 791616 786552 782233 778333 774872
58455 774872 772771 772528 773541 775427 778737 783711 789699 796669 805876 818009 831933 846335 861581
58442 861581 878893 898710 920894 945692 973503 1004447 1038926 1077861 1121811 1170715 1224876
58431 1224876 1285004 1350727 1420219 1491736 1564066 1634812 1699829 1755449 1800177 1833570 1854983
58420 1854983 1864356 1862586 1849843 1824742 1786329 1735804 1675416 1607140 1533620 1458885 1386415 1317285
58408 1317285 1251352 1189273 1132194 1080502 1034160 993398 957988 926694 898531 873706 852468
58397 852468 834011 817459 802876 790428 779637 770294 762930 757476 752744 748191 744864 743628 743792
58384 743792 744536 746243 749331 753253 757837 764143 772653 782052 791152 800625 811476 823248 835178 847588
58370 847588 860437 871761 879260 882398 881640 877063 869272 860255 851547 842712 833165 824107 816952 811199
58356 811199 805753 801143 798557 797869 798524 801218 806717 814016 821691 830213 841023 854136 868408 883272
58342 883272 898370 912381 924056 933647 941602 946821 947987 945763 941909 937043 931046 924735 919279
58329 919279 914673 910410 906886 904665 903371 902862 904413 909029 915665 922710 930151 938684 948052 957877
58315 957877 968586 979565 987871 990948 989419 985374 979569 972490 966361 963168 961849 960092 957960 957265
58301 957265 958454 960768 964567 970794 978836 987409 996898 1008534 1022039 1036387 1051986 1069739 1088778
58288 1088778 1107463 1125702 1143986 1161155 1175523 1187220 1197088 1204367 1207990 1209095 1209731 1210134 1209738
58275 1209738 1209597 1211171 1213864 1216516 1220120 1226382 1234798 1243933 1254282 1267046 1281452 1296267 1312507
58262 1312507 1331550 1352102 1372349 1393618 1418268 1445344 1472073 1498533 1526991 1557601 1588561
58251 1588561 1619633 1651670 1683439 1712621 1739212 1764383 1786998 1805110 1819949 1834615 1849840
58240 1849840 1864964 1881831 1903269 1928556 1954711 1981550 2011200 2043579 2076975 2112390 2152685
58229 2152685 2197862 2245633 2296092 2351433 2411794 2475934 2545244 2622382 2706700 2795779 2890586
58218 2890586 2994169 3106313 3224825 3351110 3488642 3636454 3789698 3945916 4104582
58209 4104582 4260856 4406089 4534732 4645168 4734331 4798167 4837763 4858986 4865902 4860456 4848155
58198 4848155 4837235 4831858 4832304 4841658 4865506 4905153 4958130 5025294 5110206 5211621 5324376 5448048
58186 5448048 5587061 5742071 5909264 6088545 6284081 6496312 6721910 6962195 7222852
58177 7222852 7504738 7804000 8121830 8464538 8833079 9222237 9631145 10064626 10523362
58168 10523362 11003580 11507879 12045543 12620711 13231188 13879949 14575980 15322537 16116988
58159 16116988 16963553 17873086 18849083 19887938 20994514 22182888 23460936 24831012
58151 24831012 26307944 27918970 29683556 31611374 33722067 36047113 38610899 41433773
58143 41433773 44558591 48052487 51981847 56413256 61440050 67172994 73697517 81075211
58135 81075211 89396241 98795958 109417830 121403432 134917147 150130709 167213958
58128 167213958 186433961 208147255 232242801 257155093 279467042 294990823 300796332
58121 300796332 296559598 284237750 266670090 246384620 225187155 204238263 184220337
58114 184220337 165502416 148294502 132715544 118778373 106399682 95462830 85849770
58107 85849770 77419469 70007860 63470508 57700570 52602114 48079426 44061463 40507497
58099 40507497 37377853 34620630 32190686 30055967 28178352 26511321 25023529 23704700
58091 23704700 22543669 21520887 20626508 19864342 19231216 18710133 18288022 17962239 17726342
58082 17726342 17568806 17490937 17509227 17637162 17882528 18264319 18811368 19539143 20445939 21535616
58072 21535616 22827040 24342469 26109886 28177939 30604766 33433989 36706219 40463358
58064 40463358 44637619 48864821 52456251 54671680 55104794 53846861 51328552 48043172
58056 48043172 44378719 40595229 36860346 33282825 29935910 26868833 24106041 21647572
58048 21647572 19478952 17580281 15926723 14488591 13236942 12147297 11197301 10365302
58040 10365302 9633221 8987709 8417515 7912291 7463655 7063993 6704329 6376260 6075218
58031 6075218 5798601 5541563 5297944 5064361 4840131 4624187 4415379 4214633 4023136
58022 4023136 3838986 3658643 3480975 3307238 3138352 2975166 2820155 2675732 2541709
58013 2541709 2416925 2302027 2197966 2103148 2014881 1932464 1856330 1785614 1719233 1657878 1602116
58002 1602116 1549868 1498530 1448323 1400923 1356119 1312587 1270692 1231769 1195582 1160971 1128109
57991 1128109 1097857 1069949 1043814 1019956 998593 978379 958446 940083 924405 910137 895879
57980 895879 882575 871382 861020 849827 838626 828883 819824 810126 800784 793355 786888 779560 772002
57967 772002 766076 761641 757450 753984 752345 751439 749296 746385 744644 744013 742873 741292 741013 742620 745392
57952 745392 749480 755706 763578 772007 781684 794498 810946 830267 852591 878704 908061 939176
57940 939176 971587 1005503 1039988 1073318 1104378 1131765 1152375 1163160 1163748 1155453 1138701 1113674
57928 1113674 1082580 1048592 1012955 975429 937056 900033 865168 831819 800083 770845 743962
57917 743962 718706 695830 676967 662032 649252 637660 627582 618848 610595 602804 596205 590753
57905 590753 585959 582393 581035 581433 582417 584223 587801 592364 595790 597347 597865 597316 594444 588948 581976
57890 581976 574251 565668 556899 549345 543120 536936 530320 524242 519298 515043 511544 509882 510567 512891
57876 512891 516344 521413 528567 537487 547473 557631 566797 574474 581649 589418 597103 603073 607052 609984
57862 609984 611881 611616 608810 604190 598040 589956 580246 569917 559071 546931 533616 520366 507877
57849 507877 495932 484797 475325 467405 459933 452654 446522 441857 437631 433021 428281 423691 419017 414497
57835 414497 411057 409050 407810 406812 406200 405983 405883 406234 407857 410727 413871 416816 420064 423989 428382
57820 428382 433196 438588 444026 448506 451816 454531 456715 457855 458128 458383 458647 457916 455688 452546 449085
57805 449085 445465 442153 439805 438203 436532 434897 434290 434882 435736 436508 438040 440850 444361 448111 452507
57790 452507 457913 464051 470701 477899 485111 491358 496544 501492 506370 510237 512551 513884 514706 514646 513431
57775 513431 511436 508821 505218 500803 496542 492870 489189 485215 481745 479479 478062 476876 475898 475249 474745
57760 474745 474372 474389 474602 474469 474207 474722 476029 476863 476362 475061 473602 471574 468357 464187 459659 454963
57744 454963 450315 446349 443268 440210 436141 431023 425736 421329 418606 417727 417865 417839 417378 417192 417810 419168
57728 419168 421421 425074 429981 435245 440525 446518 453745 461786 470145 478891 487965 496781 505131 513644
57714 513644 522764 531988 540657 548766 556483 563454 569086 572961 574746 574323 572291 569563 566257 561694
57700 561694 555603 548465 540533 531562 521733 511805 502111 492513 483539 476322 470960 466219 461413 457335
57686 457335 454766 453330 452524 452608 453633 454798 455730 457253 459854 462499 464145 465436 467552 470140 471772
57671 471772 471976 471591 471452 471848 473085 475448 478583 481703 484461 487186 490383 494335 498968 503869 508804
57656 508804 514261 520804 527778 533635 537976 542269 547901 554494 560912 567000 573349 580075 586849 593647
57642 593647 600617 607722 615287 624327 635489 648153 661373 675156 689978 705601 721304 736770
57630 736770 751837 765807 778046 789021 799899 811337 823565 837331 853815 873628 896643
57619 896643 922765 952278 985625 1023458 1066730 1116121 1171536 1232702 1300037 1374342 1455892
57608 1455892 1544366 1639472 1741044 1848596 1960905 2075024 2184475 2278611 2345321 2375877
57598 2375877 2368194 2326531 2258747 2173219 2076898 1975030 1871907 1771224 1675528 1585939 1502875
57587 1502875 1426775 1357875 1295804 1239922 1189824 1145225 1105740 1071077 1041138 1015675 994211
57576 994211 976406 961985 950200 940102 931545 925153 921012 918273 916447 916074 917542 920307 924018
57563 924018 929433 937245 946837 957302 968993 982956 999377 1017744 1038059 1060696 1085409 1111691
57551 1111691 1140010 1171552 1206664 1244363 1283340 1322570 1360964 1397262 1430381 1459234 1482170
57540 1482170 1497256 1503252 1500004 1488043 1468262 1441734 1409407 1372174 1331558 1289759 1248375 1207530
57528 1207530 1166938 1127350 1090106 1055649 1023448 993175 964996 938785 913984 890398 868414
57517 868414 848324 830003 813274 798080 784257 771614 760191 750081 741113 733145 726403 721139
57505 721139 717098 713761 710848 708223 705681 703290 701575 700912 701138 702156 704264 707331 710314 712465 714443
57490 714443 717399 721421 725859 730703 736522 743258 750180 756999 764080 771607 779350 787206 795157 802801
57476 802801 809726 816259 823089 830284 837505 845017 853530 863093 873052 883188 894041 906105 919509
57463 919509 934572 951860 971576 993628 1018304 1046139 1077013 1110135 1145066 1182083 1221441
57452 1221441 1262891 1305914 1349668 1392520 1432358 1467549 1497134 1520099 1535178 1541614 1539672 1530438
57440 1530438 1515516 1496743 1475443 1451930 1426250 1399296 1372502 1346577 1321369 1296997 1274362
57429 1274362 1254359 1237248 1222875 1210895 1200718 1191866 1184513 1179203 1176056 1174775 1175228 1177348 1180498
57416 1180498 1183767 1186980 1190823 1195875 1202121 1209380 1217641 1226987 1237738 1250568 1265845 1283004 1301182
57403 1301182 1320253 1340561 1361961 1384046 1407141 1432040 1458843 1487047 1516751 1548616 1582453
57392 1582453 1616936 1650978 1684390 1716871 1747330 1774633 1798157 1817112 1830174 1836316 1835504 1828248
57380 1828248 1815111 1796971 1775152 1750922 1725329 1699610 1674991 1651846 1629732 1608609 1589310
57369 1589310 1572478 1557749 1544472 1532655 1522754 1514980 1509180 1505093 1502422 1500974 1500816 1501968 1503934
57356 1503934 1506055 1508329 1511355 1515484 1520608 1526675 1533669 1541064 1548124 1554894 1562160 1570383 1579417 1589328
57342 1589328 1600554 1613080 1626308 1639923 1654020 1668235 1681818 1694911 1708765 1724183 1740607
57331 1740607 1757255 1774231 1791918 1810085 1828292 1846578 1865140 1883849 1902574 1921489 1940583
57320 1940583 1959401 1977671 1995731 2014024 2032721 2052082 2072480 2093757 2115266 2136929 2159527
57309 2159527 2183459 2207981 2232221 2256298 2280892 2306304 2332436 2359150 2386083 2412575 2438235
57298 2438235 2463165 2487393 2510724 2533412 2556237 2579564 2603111 2627014 2652172 2678980 2706627
57287 2706627 2734337 2762412 2791254 2820215 2848475 2876465 2905334 2935382 2965908 2996292 3026457
57276 3026457 3056576 3087115 3118881 3152243 3186531 3220844 3255115 3289794 3324909 3360318 3396552
57265 3396552 3434451 3474029 3514435 3555030 3595864 3637162 3679048 3721759 3765461 3809748 3853862
57254 3853862 3897577 3941490 3986306 4032095 4078243 4123909 4168506 4211972 4254717 4297366 4340618
57243 4340618 4385133 4431122 4477999 4524949 4571879 4619341 4667517 4715951 4764513 4813848 4864525
57232 4864525 4916322 4968746 5021624 5074717 5127418 5179384 5230998 5282734 5334586 5386617 5439494
57221 5439494 5493899 5549858 5607163 5665921 5726092 5787019 5848113 5909601 5971941 6034835 6097402
57210 6097402 6159001 6219253 6277658 6333844 6387906 6439912 6489394 6535960 6580081 6622545 6663439
57199 6663439 6702447 6740033 6777535 6816014 6855508 6895510 6935791 6976645 7018598 7061887 7106213
57188 7106213 7151047 7196100 7241107 7285355 7328176 7370107 7412802 7457477 7504120 7552444 7602753
57177 7602753 7655387 7710212 7767244 7826893 7888890 7951790 8014312 8076394 8138058 8198127 8255123
57166 8255123 8308751 8359405 8406769 8450121 8489542 8525699 8558954 8589889 8620158 8651256 8682662
57155 8682662 8712766 8741715 8771780 8804641 8839768 8875998 8913276 8951852 8990737 9028140 9063103
57144 9063103 9095968 9127380 9157382 9185481 9211246 9234813 9256917 9278439 9300058 9322397 9346148
57133 9346148 9371751 9399358 9429630 9464186 9504451 9550166 9599669 9651637 9705844 9762187 9819681
57122 9819681 9876606 9931036 9981008 10024688 10060686 10088047 10105986 10114053 10112494 10101940 10082763 10055328
57110 10055328 10021051 9982672 9943257 9905385 9871586 9844973 9828748 9824987 9834083 9855158 9886545
57099 9886545 9925722 9969106 10012442 10051743 10084163 10108497 10125491 10137804 10148942 10161469 10176143
57088 10176143 10192919 10212210 10234470 10258920 10283741 10307724 10331045 10354356 10377841 10401271 10424167
57077 10424167 10445698 10465104 10482464 10498339 10512608 10524615 10534806 10545216 10557688 10572128 10586689
57066 10586689 10598932 10606707 10609154 10607748 10605848 10606799 10612929 10626277 10649208 10683978 10732787 10798745
57054 10798745 10885852 10997760 11137784 11310728 11523786 11785599 12105940 12496824 12972468
57045 12972468 13547564 14237209 15059528 16037526 17198736 18575620 20207687 22141861 24430446
57036 24430446 27130825 30307420 34030795 38373348 43408300 49213262 55870285 63459646
57028 63459646 72055906 81727481 92524870 104451816 117441583 131357882 145995661
57021 145995661 161033794 175941113 189916235 201957671 211082056 216597004 218281850
57014 218281850 216379314 211422351 204021594 194737420 184064704 172466543 160387121
57007 160387121 148230888 136335637 124959669 114282095 104410393 95392463 87229455
57000 87229455 79886611 73304556 67412995 62142010 57426325 53205968 49428585 46051150
56992 46051150 43036486 40347272 37943878 35786388 33836865 32061293 30432871 28934317
56984 28934317 27555615 26289122 25126966 24061099 23082904 22182413 21349487 20575921 19855179
56975 19855179 19180052 18541650 17930800 17339998 16764840 16204863 15662725 15141354 14641707
56966 14641707 14163343 13705924 13268846 12850094 12446830 12056773 11677812 11306663 10939062
56957 10939062 10571231 10200600 9825974 9448362 9071358 8699376 8335380 7980876 7637363
56948 7637363 7306485 6988919 6684275 6392042 6111677 5841886 5580866 5327483 5081562
56939 5081562 4843037 4611511 4386664 4168548 3957537 3754558 3561410 3380462 3214024
56930 3214024 3064137 2932574 2820575 2728673 2657098 2606377 2577519 2571790 2589933 2630987 2691953
56919 2691953 2769593 2863187 2975726 3112983 3281795 3488336 3737091 4031895 4376611 4768110
56909 4768110 5180567 5556551 5823081 5927212 5861838 5660780 5373225 5042181 4697517 4357242
56899 4357242 4030627 3722587 3437439 3178508 2945411 2734357 2541536 2364811 2202590
56890 2202590 2053269 1916124 1791043 1677166 1573091 1478311 1392918 1315954 1245628 1181226
56880 1181226 1123363 1072319 1027602 989179 957673 933117 914797 902489 896654 897265 903286 912793
56868 912793 922149 925523 917465 896748 866609 831087 792433 751996 711583 672884 636603 602927
56856 602927 572099 544082 518455 495050 474076 455469 438822 423946 410723 398488 386554
56845 386554 375326 365930 358733 353220 349319 347720 348698 351635 355958 361693 368915 377489 387440 398864
56831 398864 411532 425287 440637 458127 477409 497858 519540 542157 563266 579178 587865 589864
56819 589864 586491 578743 568132 556862 546432 537037 528797 522558 519200 519249 523483 532782 547050 565367
56805 565367 587589 614738 647525 685736 729574 780313 838475 901437 962862 1014082 1046893
56794 1046893 1057210 1047210 1023433 992412 958381 924234 892520 864863 841860 824305 813463
56783 813463 809795 812703 822113 839074 864188 896823 936745 985453 1045096 1116876 1200474 1292646
56771 1292646 1384470 1461398 1509011 1520198 1497291 1448530 1383499 1310615 1236179 1164104 1096464
56760 1096464 1034510 979340 932107 893958 865606 846873 837047 835803 843235 859004 882362 913486
56748 913486 953952 1004847 1063950 1124410 1175852 1207712 1213624 1194104 1155037 1103378 1044394 982083
56736 982083 920079 861062 806164 755942 711432 673743 643206 619523 602248 590714 584117 582246
56724 582246 585702 595036 610198 630877 656263 683541 707216 721019 720882 706396 680188 646281
56712 646281 608352 568712 528685 489560 452563 418046 385675 355590 328556 304824 283800
56701 283800 265072 248778 234574 221269 208068 195402 184037 174127 165555 158292 151915 145616
56689 145616 139295 133867 129946 127002 124314 121837 119565 116953 113825 111053 109492 108849 108415 108235 108685
56674 108685 109415 109631 109101 108145 106955 105574 104279 103368 102707 101902 100731 99176 97441 96037 95341 94876
56658 94876 93709 91820 90262 89671 89535 89368 89679 91004 92779 94030 94682 95444 96786 98674 100922 103230
56642 103230 105133 106437 107382 108083 108224 107606 106562 105574 104959 105093 106274 108102 109627 110382 110722 111011 111214
56625 111214 111402 111846 112448 112887 113445 114773 116773 118720 120540 122755 125112 126795 128228 130991 135387
56610 135387 139773 143068 146225 150229 154328 157559 160576 164488 169072 173552 178004 182577 186368 188636
56596 188636 190247 192386 194519 195149 193930 191628 188608 184772 180458 175971 170663 163755 155669 147366
56582 147366 138985 130366 122310 115906 110998 106719 103055 100585 99065 97689 96501 96195 96791 97756 99129
56567 99129 101164 103115 103757 103050 102076 101448 100952 100583 100655 100914 100651 99749 98627 97397 96104 95503 96312 97850
56549 97850 98693 98660 98956 100305 102141 103776 105277 106907 108537 109818 110340 109732 108183 106650 105853 105484
56533 105484 105149 105463 107124 109403 110817 111033 110902 110948 111092 111655 113256 115665 117930 119745 121691 124158
56517 124158 127028 130301 133934 137233 139457 140986 142899 145528 148463 151693 155552 159726 163552 167207
56503 167207 171429 176192 180903 185769 191635 198560 205849 213460 221950 230993 239441 247070 254902 263508
56489 263508 272236 280409 288034 295040 301021 306066 310736 314941 317954 319719 320978 321837 321461 319527 316746
56474 316746 313553 309446 304123 298115 291813 284957 277620 270687 264729 259274 253675 247915 242118 236133
56460 236133 230047 224276 218692 212386 204786 196423 188331 181315 175942 172402 170024 167609 164501 160804
56446 160804 156662 152194 148102 145261 143487 141699 139518 137722 136932 136869 137210 138068 139196 139730 139338 138846
56430 138846 139151 140119 140940 140997 140087 138390 136505 135065 134243 134087 135049 137347 139999 141563 141844 141898 142362
56413 142362 142936 143583 144974 147432 150457 153631 156977 160219 162769 164780 167154 170152 172986 175130 176960
56398 176960 178770 180257 181475 183219 185883 188835 191562 194528 198288 202457 206238 209460 212564 215964
56384 215964 219725 223531 226870 229640 232489 236021 239919 243547 247081 251087 255204 258382 260331 261682
56370 261682 262795 263553 264182 265040 265657 265250 264208 263672 263618 262771 260552 257645 254473 250689 246481 242882
56354 242882 240283 238049 235921 234348 233004 230614 226911 223277 220760 218772 216411 213695 210771 207266
56340 207266 203235 199570 196728 194115 191309 188725 186512 184132 181612 179976 179675 179841 179739 179721 180118 180531
56324 180531 180871 181771 183266 184440 185087 186262 188394 190361 191375 192246 193675 194790 194691 194202 194704 196193
56308 196193 197657 198457 198320 196996 195022 193875 194298 195307 195695 195490 195091 194265 193169 193135 195100 198147
56292 198147 200830 203086 205661 208485 210925 213038 215406 218193 221231 224458 227589 230127 232390 235609
56278 235609 240176 244734 247835 249583 250837 251837 252607 253711 255546 257607 259363 261075 263022 264794
56264 264794 266103 267359 268759 269859 270761 272540 275699 279405 283037 287144 291982 296552 300233 304035
56250 304035 309004 314602 319822 324720 329626 334123 338034 342185 346857 350768 352993 354701 357472 361072
56236 361072 364407 367614 371458 375564 378895 381324 383315 384745 385353 385683 386355 387098 387614 388510 390283 392312
56220 392312 393999 395849 398328 400850 403114 406189 410857 416171 421095 426320 432891 440275 447527 455181
56206 455181 464224 474200 484172 494610 506535 519645 533055 547114 562769 579940 598117 617762
56194 617762 639476 662592 686184 710508 735872 761175 785322 809028 833290 857002 878111
56183 878111 896291 912470 926440 937047 944177 948635 950544 949707 947028 943768 939880 934647 928357
56170 928357 921782 914795 907152 899745 893318 886892 879271 871187 863988 857084 848788 838902 828443 817593
56156 817593 805975 794217 783106 771860 759251 745846 733218 721675 710640 700328 691019 681732
56144 681732 671791 662599 655527 649230 641723 634038 628823 626093 623488 620310 618126 617489 617064 616157 615364
56129 615364 614500 612539 609850 608079 607530 606900 605828 605400 606016 606891 607864 609645 612219 614985 618392 623429
56113 623429 629559 635170 639906 644680 649734 654749 660433 667843 676511 685268 694389 704716 715448 725278
56099 725278 735095 746931 760799 775169 789957 806206 823410 840184 857165 876135 896526 915989
56087 915989 934341 953804 975295 997648 1020673 1045834 1073502 1102492 1132679 1165278 1200301
56076 1200301 1236618 1274864 1317586 1366273 1420922 1482580 1553451 1634310 1724715 1825881 1940459
56065 1940459 2069299 2211219 2365839 2533348 2711010 2892647 3071704 3242277 3398019
56056 3398019 3534192 3651477 3754664 3847235 3929822 4002941 4066697 4117478 4149406 4160349 4153447
56045 4153447 4132483 4099506 4057181 4008623 3953078 3885158 3799817 3695407 3571806 3429795 3273817
56034 3273817 3111812 2950695 2794346 2646151 2509712 2386087 2273781 2172378 2083023 2004979
56024 2004979 1935442 1873422 1820021 1774309 1732949 1694736 1661495 1633613 1608772 1586032 1567005
56013 1567005 1551906 1538493 1526047 1516327 1509565 1503662 1498322 1495759 1496271 1497522 1499186 1503747 1511664
56000 1511664 1520414 1529490 1541491 1556979 1573236 1589487 1608286 1630225 1652448 1674111 1698091 1725476
55988 1725476 1753642 1781650 1812158 1845976 1880186 1913816 1949819 1989188 2028789 2067509 2108823
55977 2108823 2154525 2201462 2247308 2294108 2343416 2393491 2444063 2498159 2556461 2615625 2674963
55966 2674963 2738805 2809441 2883919 2960694 3042822 3131300 3222011 3312950 3408002 3509930 3616324
55955 3616324 3726166 3843423 3970145 4102936 4240316 4386525 4543926 4708948 4879803
55946 4879803 5060618 5253602 5455042 5663815 5885726 6124387 6376105 6638982 6918408
55937 6918408 7218035 7534340 7866240 8220892 8603334 9009235 9434539 9883181 10358747
55928 10358747 10858343 11381994 11938388 12534116 13167335 13839070 14559536 15335614 16164014
55919 16164014 17045063 17990458 19008397 20094648 21248359 22482757 23810054 25231717
55911 25231717 26756219 28410849 30222843 32205037 34373665 36762418 39404422 42321039
55903 42321039 45547313 49150421 53207894 57792802 62999883 68955415 75770641 83509285
55895 83509285 92229125 102031270 113048622 125430367 139372822 155120244 172910139
55888 172910139 192993336 215684055 241023328 267873591 293195776 312639789 322482008
55881 322482008 321450586 310970131 293899978 273069490 250589493 227859968 205763757
55874 205763757 184826130 165361279 147570302 131545243 117256635 104602507 93465307
55867 93465307 83709239 75164015 67655577 61044105 55214750 50055351 45469955 41397943
55859 41397943 37795499 34608472 31778997 29262746 27020195 25003332 23169176 21496803
55851 21496803 19975892 18588365 17314932 16148780 15087485 14119397 13230857 12418437
55843 12418437 11681286 11008639 10386560 9809957 9277127 8779882 8310222 7870333 7465311
55834 7465311 7091623 6742184 6416612 6116665 5837192 5571261 5319410 5085058 4865500
55825 4865500 4655790 4456848 4271577 4097485 3930920 3774174 3630887 3498825 3374528
55816 3374528 3260637 3161242 3074237 2995598 2927048 2872142 2828638 2792138 2763898 2747933 2743458
55805 2743458 2746745 2756877 2772496 2785628 2785792 2768446 2733925 2681193 2609173 2521894 2425958 2324445
55793 2324445 2218384 2111683 2008930 1910404 1814578 1723433 1640211 1564295 1493604 1429775 1375601
55782 1375601 1329368 1287106 1248646 1216369 1189724 1166133 1145881 1131242 1122112 1116928 1116354 1121662
55770 1121662 1131120 1142467 1157175 1177610 1201287 1222187 1236312 1241963 1236662 1218760 1190958 1157831
55758 1157831 1120810 1079350 1035338 991975 949627 907079 865722 828325 794833 763470 734806
55747 734806 710629 689968 670394 652293 637782 626432 616134 607216 601536 598283 594862 591348
55735 591348 590014 590926 591868 592193 592975 593723 592673 590078 587655 585065 580376 573666 566805 560013 552072
55720 552072 543591 536639 531268 525719 519999 516066 514345 512940 510255 505842 498996 489258 477966 466782
55706 466782 455237 442243 429019 417582 407262 395918 383826 373017 363398 352990 341649 331025
55694 331025 320927 309150 295009 279986 264855 249296 234400 222413 213677 206545 200416 196077
55682 196077 193084 189743 185854 182679 180086 176547 172092 168507 166366 164619 163312 163862 166166 168156
55668 168156 168737 168771 168748 167871 165869 163465 160763 157300 153820 151688 150452 148271 144880 141816 139680 137616
55652 137616 135573 134570 134446 133841 132748 132736 134327 136416 138589 141713 145814 149575 152235 153992 154408
55637 154408 152681 149570 146838 144683 142034 139342 138482 139628 140910 141597 143022 145828 148891 151772 155741
55622 155741 161405 167466 172809 177910 183377 188837 193924 198671 202436 204140 203876 202579 200043 195244
55608 195244 188614 181793 174989 167002 158084 150218 144078 138276 132253 127389 124392 122034 119503 117745
55594 117745 117399 117552 117579 118211 119733 121101 121829 122879 124638 125807 125324 123710 121694 119238 116628 114696
55578 114696 113171 110703 107299 104774 103949 103442 102090 100493 99144 97187 94325 91950 91017 90553 89581
55563 89581 88709 88436 87628 85170 81672 78197 74746 71276 68645 67210 65897 63979 62361 61810 61394 60145
55547 60145 58864 58785 59632 60444 61242 62379 63268 63190 62518 61933 61295 60375 59778 60014 60541 60733 60877 61248 61221
55528 61221 60288 58956 57747 56438 55262 55528 57833 60805 62907 64470 66645 69410 72037 74703 78169
55513 78169 82502 87386 93158 100315 108473 116911 125730 135541 146443 158084 170224 182449 193826
55500 193826 203535 211286 216662 218847 217587 213616 207511 199019 188115 175822 163258 150779 138658
55487 138658 127555 117538 107673 97386 87379 78500 70726 63899 58290 53647 48864 43535 38704
55474 38704 35260 32780 30806 29839 29980 29972 28929 27700 27106 26119 23502 20171 18016 17093 15862 13798
55458 13798 11977 11196 11067 11010 10937 10918 11173 12323 14805 18189 21749 25248 28497 30830 32072 33436 36305
55441 36305 40428 44300 46994 48686 49758 50374 50660 50395 48784 45376 40853 36257 31867 27629 24082
55426 24082 21847 20562 19249 17482 15488 13494 11729 10615 10156 9535 8081 6209 4728 3711 2785
55411 2785 1908 1094 -32 -1499 -2365 -1810 -381 733 1138 1071 348 -1405 -3798 -5940 -7447 -8419 -8728 -8253
55393 -8253 -7486 -7029 -6695 -5875 -4556 -3278 -2331 -1610 -926 47 1685 3685 5074 5476 5680 6250 6402 5210
55375 5210 3206 1710 1158 1115 1350 1805 2059 1959 2372 4151 6649 8351 8697 8278 7614 6835 6319 6530
55357 6530 7272 8013 8744 9714 10633 11053 11277 11947 13071 14355 16138 18892 22014 24279 25402 26252 27560
55340 27560 29299 31191 32910 33846 33540 32352 31088 30081 29173 28215 26954 24939 22324 20277 19654 19746
55324 19746 19203 17688 15696 13425 11033 9360 8957 8783 7363 5033 3571 3666 4243 4324 4102 3958 3785
55307 3785 3708 4288 5583 6914 7826 8397 8504 7860 6963 6888 7776 8477 8029 6673 5156 3979 3574 4224
55289 4224 5363 5817 5210 4420 4299 4691 5035 5150 5022 4564 4052 4177 5093 5967 5926 5100 4312 4063 4211
55270 4211 4426 4655 5141 6028 6893 6966 6099 5183 5110 5602 5699 5158 4603 4390 4172 3669 3107 2717 2460 2438 3010
55249 3010 4215 5466 6005 5442 3888 1924 396 -107 344 1304 2377 3221 3572 3660 4072 4776 4833 3694
55231 3694 2224 1632 1940 2361 2620 2864 2726 1720 418 16 684 1446 1680 1760 2073 2449 2713 2905 2767
55212 2767 1817 153 -1529 -2816 -3828 -4639 -5184 -5643 -6110 -5984 -4616 -2471 -695 423 1546 2816 3487
55195 3487 3255 2905 3239 4206 5344 6298 6670 6231 5543 5570 6389 7074 7075 6894 7158 7788 8417 8872 8998 8666
55175 8666 8176 8024 8099 7822 7139 6603 6430 6297 6114 6088 5949 5134 3953 3511 4194 5177 5727 6004 6283 6459
55155 6459 6726 7682 9186 10145 9949 9267 8853 8590 8337 8704 10130 11963 13370 14465 15679 16634 16644 15942
55137 15942 15468 15562 15653 15206 14400 13789 13621 13603 13310 12897 13205 14737 16716 17822 17834 17792 18476 19523 20224
55118 20224 20293 19553 17674 14733 11435 8465 6228 5246 5903 7519 8671 8857 8872 9089 8585 6784 4907
55101 4907 4675 6198 8140 9448 9922 9557 8484 7439 7351 8279 9325 9631 9100 8275 7865 8266 9209 10019
55083 10019 10399 10692 11223 11844 12349 12868 13520 14146 14649 15131 15367 14727 13066 11236 10299 10573 11747 13366
55065 13366 14830 15504 15391 15326 16046 17398 18780 19900 20787 21571 22662 24643 27513 30539 33191 35735
55049 35735 38483 41040 42812 43718 43940 43551 42934 42950 43952 45098 45331 44654 43803 43027 41935 40341 38573
55032 38573 37065 36125 35928 36265 36513 36323 36109 36378 36877 36891 36246 35461 35038 34975 34957 34668 34010 33241 32834 33024
55012 33024 33586 34055 34029 33312 32159 31286 31255 31831 32453 33118 34128 35120 35311 34759 34335 34221 33523 31795 29866
54993 29866 28596 27873 27477 27880 29292 30815 31555 31869 32589 33657 34468 34995 35599 36234 36736 37462 38722
54976 38722 40024 40772 41271 42126 43060 43300 42869 42564 42845 43568 44575 45724 46580 46893 47200 48203 49802
54959 49802 51469 53203 55228 57047 57838 57692 57575 58075 58947 59832 60628 61163 61279 61274 61592 62044 61971 61203 60401
54940 60401 60354 61353 63070 64715 65480 65218 64433 63414 61996 60434 59672 60033 60486 60065 59261 58991 58931 58134
54922 58134 56684 55375 54228 52812 51771 52428 54817 57480 59316 60358 60695 60118 59121 58867 59680 60709
54906 60709 61467 62488 63968 65014 64931 64242 63765 63584 63616 64292 65929 68106 70353 72815 75607 78219 80315
54889 80315 82524 85636 89475 93270 96859 100819 105665 111480 118160 125512 133184 140864 148412 155666
54875 155666 162412 168756 175101 181455 187065 191010 192845 192464 189800 185031 178773 171660 163956 155762
54861 155762 147313 138841 130437 122318 114903 108392 102582 97286 92626 88714 85450 82884 81330 80810
54847 80810 80756 80674 80780 81558 82962 84472 85784 87072 88735 91251 95160 100678 107267 113940 120177 126384
54831 126384 133285 140933 148473 154899 159901 163751 166430 167248 165573 161679 156486 150577 143873 136299
54817 136299 128354 120843 114197 108189 102317 96487 91313 87502 84948 82800 80625 78966 78348 78258 77769
54802 77769 76857 76274 76252 76158 75542 74719 74063 73367 72291 70984 69853 68964 68011 66713 65110 63531 62322
54785 62322 61529 60882 60187 59496 58687 57271 54987 52306 49879 47794 45880 44369 43532 42887 41659 39936
54769 39936 38569 37955 37768 37901 38696 39941 40621 40136 39070 38308 37967 37615 37013 36187 35238 34487 34401 35093
54751 35093 36240 37710 39816 42767 46305 50055 53654 56419 57638 57523 57194 57350 57693 58072 59290 62028
54735 62028 65710 69392 73237 78070 83728 89024 93431 97857 103420 110165 117421 124884 132846 141542
54721 141542 150749 160071 169373 178784 188278 197312 204925 210192 212663 212530 210569 207798 204891 201831
54707 201831 198269 194187 190045 186357 183403 181325 180212 180069 180908 182873 186002 189945 194223 198734 203693
54692 203693 209155 214895 220646 225999 230204 232569 233139 232527 231164 229211 227122 225584 224728 224054 223289
54677 223289 222784 222883 223512 224537 225906 227118 227169 225361 221664 216029 208045 197769 186329 175101 164635
54662 164635 154817 145669 137389 129910 122965 116505 110641 105344 100526 96302 92842 90119 88016 86412
54648 86412 84981 83205 80948 78778 77430 77092 77422 77988 78445 78552 78340 78137 78228 78663 79474 80758 82418
54631 82418 84112 85685 87261 88779 89823 90208 90410 91069 92338 93985 95901 98192 100902 103842 106615
54616 106615 108821 110428 111980 114144 117131 120846 125339 130512 135564 139598 142874 146554 150943 154927
54602 154927 157636 159803 162728 166522 170180 173014 175315 177823 181109 185398 190597 196603 203658 212088
54588 212088 221659 231839 242837 255558 270152 285447 300370 315092 329968 344058 355626 363671
54576 363671 368083 368784 365667 359224 350365 339704 327589 314623 301434 288190 274983 262427 251145
54563 251145 240929 231120 221651 213033 205494 198889 193209 188449 184133 179753 175485 171673 167828 163119
54549 163119 157765 152911 149055 145567 141976 138710 136180 133957 131396 128441 125358 122216 119075 116242
54535 116242 113919 111947 110216 108989 108448 108209 107646 106558 105299 104345 103862 103568 103000 102031 101034 100330 99657
54518 99657 98570 97269 96513 96666 97295 97803 98053 98261 98653 99408 100584 101928 102982 103515 103729 104047 104888
54501 104888 106453 108440 110109 111061 111866 113403 115628 117582 118647 119248 120130 121516 123231 125164 127297
54486 127297 129607 132242 135518 139462 143667 147872 152403 157667 163415 168931 173917 178877 184513 190985
54472 190985 197852 204606 211030 217030 222305 226373 228909 229864 229288 227209 223685 218793 212579 205281 197555
54457 197555 190081 182925 175699 168405 161651 155863 150940 146837 143739 141203 137994 133554 129050 126096
54443 126096 124929 124678 124884 125637 126575 127034 127192 127806 128705 128806 127976 127674 129089 131623 133946 135727 137478
54426 137478 139343 141030 142638 144656 147150 149624 151702 153439 154925 156028 156701 157282 158328 160143 162469
54411 162469 164597 165929 166516 166940 167659 168560 169116 168828 167601 165897 164523 163958 163967 164071 164255 164862 165920
54394 165920 167059 168079 169063 169899 170176 169711 168714 167338 165528 163417 161356 159331 156892 153990 151399
54379 151399 149955 149687 149933 149991 149389 147894 145650 143117 140672 138479 136814 136048 136066 136162 135877 135567 135798
54362 135798 136502 137169 137597 138022 138697 139699 140991 142323 143249 143632 144016 145162 147264 149867 152422 154636
54346 154636 156456 158057 159845 162201 165206 168645 172120 175099 177133 178298 179195 180235 181163 181580 181644
54331 181644 181795 181958 181540 180220 178312 176253 174150 171984 169872 167893 165862 163582 161228 159277 158010
54316 158010 157217 156394 155184 153636 152111 150952 150252 149875 149674 149663 149923 150353 150593 150347 149772 149372 149438 149761
54298 149761 150060 150505 151588 153570 156254 159237 162097 164406 165881 166735 167639 169198 171513 174190 176639
54283 176639 178356 179115 179021 178295 177030 175217 172930 170317 167463 164464 161555 158951 156562 154154 151789
54268 151789 149842 148439 147099 145137 142420 139590 137508 136412 135623 134134 131507 128095 124499 121113
54254 121113 118130 115551 112951 109697 105719 101751 98479 95856 93556 91610 90039 88333 86056 83636
54240 83636 81791 80413 78822 76931 75225 73682 71773 69641 68172 67556 66769 65012 62818 61172 60251
54225 60251 59709 59526 59808 60219 60360 60442 60926 61698 62177 62040 61353 60203 58717 57303 56363 55794 55135 54173
54207 54173 53164 52608 52997 54546 56866 59093 60643 61615 62270 62497 62208 61826 61818 61947 61608 60850 60489 61125
54189 61125 62532 64114 65582 66972 68279 69327 69968 70272 70530 71031 71790 72482 72661 72044 70695 69036
54173 69036 67621 66721 66245 66159 66724 67924 68961 68909 67890 66956 66743 66878 66842 66685 66591 66401 66032 65757 65598
54154 65598 64939 63332 61185 59112 57078 54812 52675 51308 50697 50335 50176 50671 51846 52980 53326 52675
54138 52675 51225 49436 48041 47614 47932 48160 47806 47186 46797 46600 46122 45137 44049 43589 44062 44921 45267 44881
54120 44881 44448 44577 44989 45059 44815 44845 45329 45733 45550 44902 44318 44153 44331 44446 43998 42721 40729 38401 36287
54101 36287 35055 35136 36211 37351 37938 38167 38457 38764 38864 38877 39029 39153 39008 38913 39506 40959 42774 44246
54083 44246 44791 44120 42613 41294 40944 41374 42008 42830 44097 45449 46142 46127 46062 46227 46248 46029 46154 46989 48037
54064 48037 48544 48304 47583 46727 46143 46202 46839 47560 48068 48476 48745 48469 47590 46861 47098 48254 49665 50903
54046 50903 51917 52500 52267 51256 50171 49772 50171 50856 51316 51495 51614 51739 51788 51897 52417 53313 53917 53691
54028 53691 53049 52980 53898 55340 56722 57890 58808 59282 59254 58981 58704 58458 58399 58915 60071 61254 61760 61556
54010 61556 61155 60853 60418 59507 58145 56731 55729 55353 55536 56162 57269 58876 60622 61895 62478 62919 63989
53993 63989 65815 67689 68776 68952 68879 69293 70321 71572 72743 73890 75038 75864 76033 75655 75242 75342 76419
53976 76419 78727 81939 85120 87567 89607 92121 95341 98649 101531 104152 106826 109544 112324 115528
53962 115528 119346 123286 126701 129723 133176 137541 142350 146739 150362 153525 156573 159404 161718 163546
53948 163546 165286 167191 169050 170450 171111 170914 169893 168423 167065 165917 164376 161936 158987 156350 154167
53933 154167 151816 148895 145720 142699 139707 136300 132292 127983 124072 121353 120128 119784 119252 117963 116140
53918 116140 114228 112434 110848 109563 108487 107407 106390 105751 105474 105027 103920 102132 99861 97294 94808
53903 94808 92989 92113 91905 92087 92823 94353 96462 98699 100850 102858 104441 105214 105182 104856 104925 105923 108000
53886 108000 110750 113380 115384 117079 119290 122491 126365 130102 133094 135415 137781 140943 144999 149350
53872 149350 153329 156742 159758 162488 164824 166565 167534 167681 167249 166740 166668 167316 168659 170347 171787 172530
53856 172530 172746 173176 174497 176784 179587 182318 184578 186353 188068 190392 193871 198725 204770 211381 217695
53841 217695 223240 228317 233470 238685 243494 247761 251838 255854 259403 262110 264064 265509 266561 267440
53827 267440 268474 269530 269865 268956 267152 265139 263048 260479 257139 253086 248549 243918 239642 235782 231746
53812 231746 226864 221132 215120 209340 204049 199477 195770 192612 189252 185021 179772 173924 168282 163639
53798 163639 160255 157751 155668 153947 152672 151557 150084 148070 145824 143763 142101 140821 139648 138112
53784 138112 135967 133568 131638 130602 130220 129792 128602 126396 123688 121461 120306 119960 119835 119766 119856 119901 119591
53767 119591 119283 119902 121802 124128 125634 125870 125276 124402 123459 122594 122108 122195 122639 122975 122952 122671 122288 121797
53749 121797 121283 121248 122325 124550 127121 129125 130402 131520 132964 134607 136032 137140 138270 139758 141565
53734 141565 143448 145424 147836 150813 153841 156167 157677 159166 161611 165326 169902 174780 179670 184499
53720 184499 189146 193326 196732 199232 200901 201849 202180 202217 202525 203351 204088 203715 201916 199470 197346 195719
53704 195719 194043 191884 189381 187017 185196 183970 182976 181635 179573 176912 174169 171852 170103 168617
53690 168617 166944 165018 163332 162404 162153 162019 161618 160980 160180 159190 158186 157547 157299 156901 155823 154055 151858
53673 151858 149328 146536 143915 142152 141667 142237 143006 142981 141883 140556 140096 140495 140715 140248 139930 140726 142276
53656 142276 143353 143427 143066 142962 143280 143955 144958 146057 146789 146948 146881 147194 148352 150456 153152 155732 157650
53639 157650 158981 160144 161285 162253 163213 164828 167597 171213 174795 177761 180372 183415 187354 191811 195978
53624 195978 199476 202632 205908 209375 212870 216308 219608 222594 225253 227808 230256 232140 233203 234036
53610 234036 235532 237799 240085 241757 242867 243732 244404 244777 244917 245069 245486 246284 247321 248248 248842 249266 249769
53593 249769 250244 250356 250083 249782 249661 249440 248708 247467 246224 245535 245480 245582 245268 244364 243047 241441 239674
53576 239674 238276 237953 238612 239122 238501 237042 235820 235402 235559 235979 236611 237389 238233 239282 240633 241890 242590
53559 242590 243067 244254 246460 248914 250729 251803 252612 253634 255340 258265 262549 267536 272167 275867 279028
53544 279028 282728 287877 294351 300963 306592 311270 315800 320478 324847 328832 333254 338784 344881 350418
53530 350418 355059 359408 363925 368317 372072 375209 378284 381907 386339 391412 396740 402051 407264 412187
53516 412187 416273 418961 420268 420843 421336 421805 421866 421296 420303 419273 418435 417789 417156 416107 414160 411382 408734
53499 408734 407330 407213 407225 406279 404428 402461 400818 399282 397515 395451 393296 391457 390374 390094 390108 389948
53483 389948 389789 390055 390613 390894 390840 391216 392812 395668 399220 402919 406600 410473 414881 419861 424979 429826
53467 429826 434617 440073 446753 454800 464146 474510 485257 495858 506635 518566 532196 547186
53455 547186 563103 580106 598508 618109 638435 659422 681453 704788 729280 754639 780681
53444 780681 807357 834720 863017 892747 924479 958398 993990 1030355 1067110 1104817 1144228
53433 1144228 1185235 1226937 1268681 1310568 1352875 1395376 1437558 1479285 1521051 1563708 1608064
53422 1608064 1654605 1703436 1754434 1807272 1861211 1915121 1968015 2019432 2068971 2115719 2158644
53411 2158644 2197533 2233065 2265930 2296316 2324285 2350147 2374322 2397270 2419643 2442064 2464715
53400 2464715 2487544 2510800 2534707 2558422 2580007 2597793 2611346 2620976 2626942 2629529 2629155 2625738
53388 2625738 2618353 2606149 2589388 2569065 2545708 2519077 2488931 2455609 2419829 2382228 2343091
53377 2343091 2302325 2259745 2215559 2170463 2125215 2080338 2036214 1993029 1950423 1907654 1864453
53366 1864453 1821412 1779266 1738239 1698545 1661091 1627087 1597058 1570649 1547318 1526856 1509439
53355 1509439 1495595 1486029 1481143 1480829 1484972 1493820 1507458 1525150 1545838 1569221 1595924 1626601
53343 1626601 1661251 1699322 1740050 1782731 1827110 1873594 1922754 1974616 2028730 2084852 2143129
53332 2143129 2203688 2266530 2331996 2400833 2473543 2549960 2629735 2712985 2800172 2891436 2986281
53321 2986281 3083865 3183462 3284690 3387423 3491551 3596851 3703053 3809886 3916914 4023354
53311 4023354 4128253 4230842 4330519 4426489 4517676 4603303 4683555 4759475 4832054 4901527 4967658
53300 4967658 5030576 5090925 5149056 5204344 5255580 5301718 5341917 5375090 5399974 5415564 5420823
53289 5420823 5413870 5392135 5353761 5298667 5228219 5144433 5049695 4946532 4836907 4721899 4602392
53278 4602392 4479675 4354944 4228631 4100950 3972883 3845895 3720593 3596273 3472006
53269 3472006 3347737 3224228 3102330 2982595 2865391 2751059 2639976 2532573 2429328
53260 2429328 2330771 2237440 2149723 2067762 1991703 1922000 1859113 1802850 1752399 1707250 1667678
53249 1667678 1633969 1605617 1581777 1562169 1546967 1535921 1528158 1522886 1519827 1518941 1520139 1523328 1528364
53236 1528364 1534949 1542862 1552290 1563591 1576803 1591744 1608521 1627505 1648760 1671966 1697086 1724718
53224 1724718 1755514 1789493 1826102 1864790 1905399 1948123 1993107 2039948 2087622 2135151 2182373
53213 2182373 2229823 2277800 2325803 2372936 2418592 2462664 2505306 2546717 2587007 2626168 2664202
53202 2664202 2701281 2737645 2773255 2807550 2839494 2867803 2891318 2909429 2922116 2929356 2930503 2924481
53190 2924481 2910693 2889475 2861532 2827051 2785530 2736456 2680032 2617301 2549660 2478400 2404679
53179 2404679 2329647 2254318 2179343 2105163 2032414 1961901 1894097 1828897 1765887 1704500 1643852
53168 1643852 1582924 1521231 1459000 1396408 1333022 1268482 1203470 1139524 1077910 1018952 962345
53157 962345 907842 855769 807137 763043 723721 688401 656274 627199 601115 577379 555421
53146 555421 535587 518409 503188 488278 472892 457804 443986 431423 419671 408841 399277 390633
53134 390633 381984 372814 363422 354326 345629 337100 328640 320443 312731 305518 298713 292308 286234 280155
53120 280155 273845 267723 262552 258382 254359 249824 245027 240293 235216 229495 224019 220048 217516 215174
53106 215174 212383 209745 207792 206128 204238 202285 200540 198763 196681 194515 192513 190396 187807 184909
53092 184909 182144 179746 177907 176961 176926 177162 176949 176177 175130 173870 172304 170565 168937 167529 166355 165501
53076 165501 164841 163906 162466 161059 160444 160556 160496 159605 158220 157285 157416 158445 159730 160796 161624 162303 162593
53059 162593 162122 161031 160080 159980 160829 162215 163507 164056 163587 162627 162148 162550 163399 164311 165519 167133 168444
53042 168444 168617 167764 166688 165784 164812 163687 162813 162491 162437 162034 160795 158610 155914 153643 152623 152825 153468
53025 153468 153885 154124 154657 155771 157369 159166 160974 162893 165250 168222 171548 174661 177158 179008 180380
53010 180380 181400 182054 182260 182015 181495 180932 180408 179850 179209 178361 176897 174395 171101 167929 165458 163229
52994 163229 160418 156954 153505 150495 147654 144615 141488 138681 136357 134319 132307 130316 128639 127509
52980 127509 126645 125337 123183 120607 118362 116597 114727 112200 109068 105700 102303 98922 95735 93096
52966 93096 91268 90193 89502 88728 87587 86132 84678 83554 82877 82441 81811 80635 78929 77019 75216 73688
52950 73688 72618 72151 72015 71475 70032 68134 66876 66942 67965 68912 68962 68027 66727 65936 66179 67251 68355
52933 68355 68728 68218 67315 66582 66082 65447 64551 63899 64077 64886 65445 65254 64844 65127 66309 67711 68543 68619 68361
52914 68361 68309 68659 69158 69455 69532 69704 70194 70870 71485 71964 72336 72553 72625 72776 73306 74280 75463 76498 77065
52895 77065 76993 76383 75575 74920 74612 74781 75588 77141 79353 81940 84501 86653 88241 89419 90414 91325 92329
52878 92329 93892 96329 99202 101635 103362 105042 107369 110302 113313 115939 117843 118826 119140 119447 120086
52863 120086 120706 120886 120714 120400 119816 118894 118009 117346 116310 114270 111606 109225 107191 104718 101523 98353
52847 98353 95965 94311 93047 92177 91781 91564 91104 90250 88946 86991 84324 81348 78654 76504 74781 73281
52831 73281 71934 70849 70237 70074 69823 68838 67198 65774 65251 65332 65297 65039 65100 65764 66576 66904 66627 66124 65775
52812 65775 65711 65902 66262 66665 67028 67369 67618 67383 66205 64237 62426 61654 61764 61811 61264 60561 60392 60883 61713
52793 61713 62586 63208 63123 62123 60744 59971 60420 61991 64128 66103 67308 67808 68477 70086 72229 73712
52777 73712 74137 74506 76022 78713 81628 84009 85754 86906 87321 86993 86373 86047 86175 86457 86638 86877 87508
52760 87508 88543 89606 90361 90838 91267 91762 92271 92725 93100 93470 94089 95268 97073 99240 101515 103861 106247
52743 106247 108493 110505 112383 113982 114642 113818 111923 110026 108683 107377 105305 102411 99482 97329 96068
52728 96068 95166 94142 93105 92442 92080 91382 89916 87956 85973 84016 82010 80297 79289 78723 77839 76355
52712 76355 74785 73738 73298 73139 72873 72232 71301 70619 70674 71191 71303 70519 69197 67951 66944 65926 64645
52695 64645 63031 61249 59726 58916 58866 59180 59470 59672 59874 60125 60494 61043 61607 61755 61139 59781 58041 56406
52677 56406 55344 55116 55641 56577 57450 57717 57001 55522 54104 53462 53605 54148 54857 55519 55716 55311 54908 55170
52659 55170 55876 56360 56630 57190 57844 57741 56739 55735 55294 54995 54590 54831 56362 58517 60135 61025 61795
52642 61795 62624 63055 62875 62370 61769 61001 60107 59354 58941 58869 59121 59637 60187 60530 60611 60467 60151 59952 60325 61296
52622 61296 62281 62827 63201 63866 64729 65405 65895 66469 67151 67821 68599 69625 70674 71578 72756 74703 77093
52605 77093 79098 80511 81920 83814 86136 88681 91327 93835 96063 98348 101024 103499 104588 103933 102375
52590 102375 100792 99339 98171 97920 98810 99892 99976 98961 97624 96368 94874 92844 90432 87941 85598
52575 85598 83630 82205 81223 80457 79851 79426 79072 78763 78784 79298 79799 79651 79111 79193 80253 81283 81047 79524
52557 79524 77747 76451 75473 74420 73386 72742 72484 72121 71230 70021 69223 69288 69735 69516 68232 66803 66563
52540 66563 67736 69160 69566 68752 67314 65703 64007 62475 61661 61864 62695 63388 63495 63229 63199 63791 64779
52523 64779 65577 65869 65846 65750 65541 65199 65032 65244 65464 65229 64799 64909 65730 66729 67612 68656 69822 70348 69779
52504 69779 68819 68465 68756 69084 69396 70153 71210 71670 71084 70058 69366 69074 68955 69227 70308 72062 73806
52487 73806 74992 75551 75651 75420 74875 73922 72495 70942 70110 70706 72515 74574 76133 77141 77734 77699 76871
52470 76871 75738 75156 75438 76150 76902 77889 79362 80967 82067 82599 83120 84002 84985 85626 85834 85831 85850 86043 86410
52451 86410 86643 86247 85089 83683 82729 82438 82425 82117 81113 79391 77378 75714 74670 73906 72996 72057 71593
52434 71593 71755 72117 72235 72213 72566 73659 75301 76817 77467 76885 75272 73223 71417 70359 70178 70571 71094
52417 71094 71579 72151 72769 73067 72853 72512 72644 73417 74550 75781 77018 78083 78711 78866 78780 78657 78538 78518
52399 78518 78756 79232 79685 79960 80151 80316 80296 79996 79637 79473 79396 79079 78494 77988 77841 77927 77953 77920 78216 79281
52379 79281 81166 83409 85258 86202 86370 86383 86678 87054 87044 86651 86345 86336 86271 85927 85761 86263 87029 87153 86534 86147
52359 86147 86807 88150 89130 89123 88246 86977 85831 85198 85109 85318 85787 86789 88243 89304 89191 88233 87553 87725
52341 87725 88255 88436 88191 87877 87712 87761 88236 89373 90941 92160 92368 91745 91184 91332 91881 92007 91401 90490
52323 90490 89696 88951 88176 87809 88383 89740 91093 91855 92169 92654 93800 95564 97413 98865 100019 101301
52307 101301 102648 103386 103249 103076 103966 105975 108138 109599 110228 110271 110029 109898 110186 110737 111038 110806 110262 109872
52289 109872 110100 111195 112840 114145 114453 114075 113878 114293 115203 116536 118278 120050 121410 122598 124161 125802
52273 125802 126495 125968 125128 124659 124107 122956 121731 121226 121271 121198 121059 121462 122425 123304 123773 124087 124398 124576 124743
52254 124743 125266 126062 126624 126930 127707 129477 131857 134181 136350 138694 141327 143997 146298 147737 147977 147431
52238 147431 147345 148728 151313 153963 156035 157872 160008 162495 165183 168121 171383 174835 178414 182286 186335
52223 186335 189779 191881 192914 193954 195661 197761 199769 201660 203570 205330 206708 207860 209126 210569
52209 210569 212014 213443 214992 216627 218080 219108 219699 220115 220834 222273 224381 226702 228965 231327 233840
52194 233840 236098 237836 239545 241985 245243 248802 252320 255759 258890 261418 263671 266446 269961 273458
52180 273458 276143 278027 279646 281417 283532 286007 288490 290362 291415 292209 293476 295390 297589 299646
52166 299646 301265 302262 302656 302724 302876 303618 305532 308841 312872 316409 318811 320438 321875 323280 324754 326728
52150 326728 329531 332941 336691 340997 346009 351083 355292 358545 361588 364913 368244 371157 373736 376392
52136 376392 379405 382799 386460 390235 394050 397925 401770 405280 408243 410861 413513 416276 418907 421188
52122 421188 423087 424680 426190 427928 429872 431430 431995 431712 431340 431388 431727 432007 432063 431826 431274 430625 430234
52105 430234 430137 429996 429680 429557 429977 430697 431190 431335 431398 431350 430626 428832 426411 424271 422732 421173 418895 416087
52087 416087 413700 412417 412037 411837 411271 410208 408829 407484 406502 405899 405321 404364 402854 400815 398383 395863
52071 395863 393595 391528 389093 385730 381528 377252 373894 372153 372012 372538 372380 370751 367886 364484 361068
52056 361068 358075 356100 355472 355758 356098 355975 355283 353945 351985 349861 348131 346785 345427 344139 343538 343805
52040 343805 344228 344082 343523 343200 343334 343654 344075 344867 346147 347589 348884 350283 352371 355286 358382 360928
52024 360928 363045 365601 369063 372814 375942 378412 380914 383722 386407 388769 391397 394804 398513 401570
52010 401570 403762 405758 408122 410740 413370 416237 419657 423329 426416 428390 429505 430412 431555 433035
51996 433035 434797 436697 438467 439930 441291 443007 445274 447800 450196 452441 454763 457144 459146 460267
51982 460267 460428 460068 459780 459842 460130 460392 460447 460055 458922 457089 455101 453373 451552 449031 446045 443531 441774
51965 441774 439875 436980 433380 429874 426622 423308 420066 417398 415385 413729 412423 411587 410649 408604 405313
51950 405313 401797 398951 396662 394519 392712 391644 391136 390645 389990 389301 388458 387124 385277 383275 381413
51935 381413 379732 378167 376517 374288 370984 366547 361299 355496 349349 343413 338403 334303 330110 324858
51921 324858 318674 312379 306246 299758 292670 285709 279761 274741 269816 264589 259402 254419 249025 242625
51907 242625 235651 229269 224095 219532 214365 207824 200116 192149 184788 178278 172413 167145 162758 159311
51893 159311 156294 153154 149890 146799 143833 140689 137422 134525 132377 130905 129799 128717 127351 125698
51879 125698 124254 123568 123504 123253 122137 120164 117879 115993 115093 115268 115934 116379 116453 116427 116282 115708 114746 113790
51861 113790 112823 111364 109431 107871 107324 107438 107573 107719 108124 108488 108351 108024 108340 109423 110414 110535 109902
51844 109902 109031 108090 106938 105691 104816 104687 105230 106047 106830 107587 108485 109511 110390 110834 110742 110140 109106 107827
51826 107827 106596 105650 105103 105057 105575 106412 107033 107101 106837 106708 106835 106851 106236 104774 102799 101116 100445 100841
51808 100841 101754 102687 103530 104195 104416 104189 104031 104319 104579 103919 102124 99945 98319 97669 97905 98732 99786
51791 99786 100722 101394 101875 102320 102900 103725 104654 105277 105326 105058 104982 105272 105667 105958 106301 107029 108356 110254 112403
51772 112403 114275 115584 116756 118623 121456 124449 126406 126930 126823 127280 128816 130996 133205 135446 138244
51757 138244 141836 145815 149761 153906 158861 164786 171131 177172 182560 187356 191803 196178 200644 205121
51743 205121 209344 213010 215756 217076 216606 214605 211911 209261 206673 203616 199665 194924 189863 184865
51729 184865 180039 175500 171652 168944 167229 165692 163696 161571 160174 159727 159439 158448 156795 155185 153989
51714 153989 152870 151387 149692 148381 147744 147402 146793 145847 144970 144490 144396 144635 145184 145659 145277 143689 141601
51697 141601 140084 139308 138487 137033 135284 133884 132964 132207 131352 130315 129119 128065 127714 128255 129010 128992 127971
51680 127971 126659 125834 125688 126039 126761 127675 128352 128394 127885 127288 126891 126600 126305 126162 126390 126899 127310 127326 127009
51661 127009 126708 126748 127123 127448 127288 126648 126054 126085 126843 127932 128866 129356 129336 128929 128421 128020 127629 127003 126110
51642 126110 125165 124276 123338 122330 121471 120947 120687 120541 120448 120223 119479 118102 116631 115818 115867 116361 116783 116789 116075
51623 116075 114540 112699 111535 111659 112778 114127 115175 115774 115926 115736 115454 115291 115259 115422 116130 117637 119482
51606 119482 120642 120529 119582 118714 118388 118508 118947 119716 120555 120891 120523 120065 120323 121322 122319 122739 122727 122663 122541
51587 122541 122064 121177 120205 119556 119456 119917 120715 121461 121846 121892 121865 121975 122267 122756 123514 124596 125953 127438
51569 127438 128827 129845 130249 129973 129293 128874 129503 131521 134383 136921 138197 138154 137510 137145 137522 138446 139289
51552 139289 139589 139524 139572 139728 139405 138288 136884 135934 135557 135379 135242 135280 135421 135355 135046 134799 134718 134555 134268 134280
51532 134280 134870 135642 136027 136070 136252 136580 136284 134691 132166 129944 128952 128984 129071 128558 127646 126915 126558 126277 125827
51513 125827 125421 125536 126411 127772 129052 129893 130392 130776 130942 130588 129829 129321 129582 130481 131648 133017 134564
51496 134564 135857 136473 136738 137375 138377 138946 138746 138499 138881 139448 139316 138573 138228 138776 139503 139462 138680 138067
51478 138067 138331 139328 140423 141241 141946 142830 143820 144530 144779 144859 145206 145934 146827 147717 148693 149956 151583 153425
51460 153425 155117 156268 156754 156897 157211 157919 158728 159189 159265 159498 160464 162061 163478 164016 163836 163695 164006 164484
51442 164484 164757 164912 165191 165420 165211 164600 164088 163992 164115 164145 164024 163661 162617 160510 157712 155246 153887 153544
51424 153544 153589 153532 153198 152486 151318 149872 148605 147886 147657 147510 147102 146502 146126 146246 146489 146017 144413 142219
51406 142219 140363 139083 137780 135939 133794 131975 130825 130253 129870 129029 127143 124405 121941 120797 120904
51391 120904 121423 121841 122202 122415 122039 120921 119506 118313 117486 117051 117106 117420 117279 116170 114490 113169 112677
51374 112677 112735 112894 113029 113171 113144 112621 111533 110327 109673 109824 110331 110477 109972 109077 108188 107565 107424 107876 108678
51355 108678 109351 109807 110545 111941 113566 114567 114667 114481 114825 115959 117546 119114 120441 121518 122376 123049
51339 123049 123702 124577 125636 126397 126404 125838 125394 125540 126192 127138 128342 129650 130582 130815 130632 130564 130769 131106 131660
51320 131660 132776 134500 136311 137530 137877 137574 137055 136521 135718 134211 131932 129307 126700 124025 121162
51305 121162 118483 116498 115054 113420 111296 109251 107890 106970 105751 104030 102337 101074 99885 98199
51291 98199 96146 94569 94054 94313 94681 94918 95143 95183 94530 93074 91480 90558 90541 91191 92327 93846 95427
51274 95427 96560 96909 96484 95563 94601 94025 93830 93570 93007 92519 92519 92697 92397 91614 90959 90627 90067 88909 87636
51255 87636 86891 86590 86175 85515 85074 85249 85894 86470 86453 85756 84960 84954 86035 87494 88398 88676 89048 89982 91193
51236 91193 92253 93244 94540 96177 97720 98608 98473 97283 95460 93782 92894 92804 92915 92632 91892 91102 90677
51219 90677 90678 90846 90908 90799 90625 90518 90642 91246 92466 93973 95013 95033 94218 93246 92527 91870 90910 89574 88046
51200 88046 86477 84969 83738 83085 83171 83928 85158 86631 88065 89164 89672 89415 88404 87003 85887 85581
51184 85581 86054 86883 87776 88744 89809 90851 91832 92898 94088 95111 95592 95432 94805 93923 92995 92333 92299 93096
51166 93096 94679 96803 99084 101037 102205 102321 101411 99884 98458 97747 97748 97906 97835 97806 98339 99493 100828
51149 100828 101952 102815 103478 103959 104324 104664 104824 104422 103325 101936 100848 100327 100273 100554 101159 102014 102889 103552
51131 103552 103975 104315 104709 105109 105307 105146 104751 104540 104824 105361 105398 104403 102768 101558 101401 101790 101731 100921 99948
51112 99948 99327 98834 97982 96813 95809 95237 94984 94960 95264 95919 96760 97682 98683 99576 99942 99569 98804 98246
51094 98246 98205 98632 99425 100608 102143 103786 105234 106357 107188 107717 107849 107688 107743 108596 110307 112335 114128
51077 114128 115556 116631 117166 117127 117077 117731 119032 120208 120920 121830 123679 126165 128205 129108 129027 128386 127386
51060 127386 126203 125202 124681 124569 124638 124854 125276 125661 125441 124229 122255 120231 118770 117938 117328 116548 115632
51043 115632 115019 115086 115723 116394 116678 116622 116445 115994 114828 112943 111086 110057 109888 110089 110547 111624 113259
51026 113259 114564 114759 114182 113892 114425 115425 116422 117390 118331 118836 118513 117644 117016 117064 117435 117453 116845 115963 115374
51007 115374 115356 115774 116385 117132 118034 118861 119249 119262 119609 120955 123091 125077 126218 126615 126665 126397 125600 124428
50989 124428 123491 123226 123423 123552 123477 123685 124699 126325 127694 128169 128154 128732 130419 132488 133724 133716 133158 132963
50971 132963 133385 134063 134613 134999 135453 136281 137691 139618 141724 143720 145699 148056 151074 154666 158529 162369
50955 162369 165911 168883 171183 173030 174794 176641 178448 179993 181092 181617 181613 181471 181689 182338 182936 183036
50939 183036 182681 182037 180909 179125 177231 176232 176508 177470 178398 179102 179501 179141 177690 175689 174262 174166 175398
50922 175398 177531 179976 182048 183299 183842 184130 184468 185029 186130 188010 190384 192747 195148 198265 202522
50907 202522 207522 212464 216854 220794 224842 229633 235267 241057 246252 251035 256315 262523 269148 275633
50893 275633 282177 289279 296929 304710 312442 320405 329030 338516 348522 358162 366694 374376 382294 391148
50879 391148 400668 410372 420320 430757 441455 451901 461796 471001 479405 487279 495274 503428 510572
50866 510572 515292 517228 516831 514280 509464 502786 495085 486626 476957 465917 454146 442392 430853
50853 430853 419376 407883 396457 385458 375650 367678 361202 355035 348381 341629 335725 331141 327644
50840 327644 324754 322206 320147 319006 318995 319691 320389 320824 321248 321891 322801 324169 326276 328928 331393 333144
50824 333144 334329 335398 336654 338225 340026 341548 342166 341901 341474 341357 341213 340526 339339 338060 336925 336075
50808 336075 335765 336056 336568 337001 337660 339047 341074 343188 345179 347439 350346 353806 357528 361575 366477
50793 366477 372761 380314 388266 395717 402727 410377 419724 430879 443214 456148 469479 483207 497438
50780 497438 512378 528139 544649 561915 580273 600097 621323 643507 666303 689633 713431
50769 713431 737485 761626 785971 810925 837001 864580 893747 924354 956217 989142 1022750
50758 1022750 1056433 1089605 1121971 1153501 1184147 1213502 1240600 1264150 1283184 1297500 1307360
50747 1307360 1312890 1314117 1311492 1305954 1298347 1289109 1278568 1267204 1255515 1244038 1233615 1225228 1219375
50734 1219375 1216000 1215172 1217388 1223046 1232214 1245214 1262842 1285458 1312423 1343124 1378157 1418702
50722 1418702 1464880 1515550 1569648 1626830 1686471 1746801 1805553 1861160 1912861 1959903 2001181
50711 2001181 2035771 2063435 2084382 2098671 2106147 2106923 2101503 2090078 2071924 2045991 2012106 1971161
50699 1971161 1924032 1870898 1811967 1748409 1682145 1614961 1548200 1482989 1420214 1360306 1303469
50688 1303469 1250120 1200855 1156081 1115925 1080400 1049432 1022777 1000109 981085 965257 952260
50677 952260 942237 935695 932602 932028 933132 936174 942061 951157 963138 977759 995032 1014595 1035535
50664 1035535 1057019 1078785 1100928 1123513 1146371 1168935 1190346 1210063 1228261 1245328 1261186
50653 1261186 1275535 1288493 1300407 1311175 1320449 1328472 1336046 1343614 1351015 1358259 1365839 1374125 1383028
50640 1383028 1392498 1402699 1413448 1424093 1434375 1444917 1456443 1468886 1481612 1494167 1506487
50629 1506487 1518718 1531186 1544218 1557772 1571622 1586224 1602985 1623230 1647233 1674594 1705191
50618 1705191 1739166 1776305 1816075 1858281 1903212 1951160 2002259 2056930 2116189 2181379 2253759
50607 2253759 2334288 2423542 2521758 2628994 2745136 2869452 3000114 3134354 3269092 3401431
50597 3401431 3528722 3648503 3758546 3857097 3943309 4017523 4080793 4133663 4175353 4204304 4219412
50586 4219412 4220434 4207274 4179449 4136661 4079835 4011261 3933665 3849289 3759944 3667612 3574653
50575 3574653 3483422 3395941 3313929 3238706 3170746 3109585 3054530 3005339 2961844 2923115 2887487
50564 2887487 2853521 2820545 2788242 2756218 2724233 2692454 2661118 2630197 2599746 2570463 2543547
50553 2543547 2519980 2500116 2483970 2471663 2463459 2459386 2458913 2461063 2464835 2469412 2474022 2477782 2479824
50540 2479824 2479320 2475189 2465962 2450221 2427095 2396208 2357512 2311582 2259777 2203603 2143939 2081340
50528 2081340 2016821 1951782 1887239 1823833 1762498 1704345 1649786 1598603 1551056 1508072 1470016
50517 1470016 1436159 1405904 1379754 1358454 1341862 1329310 1320489 1315182 1312729 1312675 1315532 1321980 1331562
50504 1331562 1343143 1356412 1371987 1390126 1410391 1432640 1457295 1484296 1512810 1542543 1574644
50493 1574644 1610696 1651344 1696431 1746084 1801081 1862407 1930913 2007185 2091294 2182652 2280214
50482 2280214 2382552 2487546 2592472 2694967 2793782 2888371 2978069 3062240 3141056 3215394
50472 3215394 3285794 3351881 3412999 3468997 3520080 3566212 3606995 3642065 3671384 3695379 3715203
50461 3715203 3732848 3750534 3769695 3790670 3813446 3838365 3865776 3895168 3925070 3953845 3980248
50450 3980248 4003089 4020712 4031106 4032456 4023467 4003314 3971569 3928256 3873912 3809586 3736803 3657419
50438 3657419 3573413 3486799 3399680 3314257 3232738 3157261 3089730 3031483 2983080 2944648 2916332
50427 2916332 2898016 2888497 2885321 2885648 2886945 2886684 2881884 2869562 2847593 2814869 2770857 2715524 2649696
50414 2649696 2575068 2493646 2407293 2317712 2226494 2135007 2044326 1955286 1868593 1784984 1705386
50403 1705386 1630731 1561463 1497338 1437890 1382834 1331868 1284472 1240358 1199939 1163858 1132119
50392 1132119 1104109 1079337 1057612 1038509 1021316 1005823 992632 982320 974595 968618 963879 960419
50380 960419 958366 957705 958454 960733 964587 969918 976702 985078 995132 1006824 1020282 1036066 1054840
50367 1054840 1076708 1101145 1127741 1156756 1188668 1223425 1260617 1300229 1342557 1387226 1433022
50356 1433022 1479071 1525642 1573295 1621775 1670427 1719196 1768341 1817416 1865570 1912937 1960720
50345 1960720 2009585 2058742 2107080 2154428 2201101 2246781 2290554 2331710 2369807 2404080 2433458
50334 2433458 2457223 2475196 2487264 2493081 2492245 2484321 2468567 2444070 2410447 2368303 2318935 2263814
50322 2263814 2204441 2142360 2079021 2015693 1953746 1894873 1840662 1791873 1748423 1710205 1677583
50311 1677583 1650861 1629600 1612975 1600650 1592615 1587923 1584155 1578600 1569713 1557144 1540775 1520328
50299 1520328 1495784 1467550 1436127 1402004 1365857 1328440 1290228 1251585 1213302 1176436 1141381
50288 1141381 1107599 1074585 1042825 1013424 986939 962912 940432 918984 898768 880383 864157
50277 864157 849768 836599 824458 813754 804885 797624 791244 785050 778722 772287 765936 759907 754507
50264 754507 750193 747345 745753 744497 742718 740479 738576 737569 737433 738081 739672 742279 745706 749893 755103
50249 755103 761512 769010 777621 787669 799249 811957 825539 840384 856785 873942 890313 905029
50237 905029 918558 931814 944826 956396 965027 970226 972852 974119 974358 973031 969852 965325 959976
50224 959976 953604 945609 935669 923767 910000 894804 878996 863068 846766 829911 813316 798256
50212 798256 785125 773234 761905 751207 741622 733471 726661 720567 714259 707348 700549 694909 690525
50199 690525 686624 682732 679021 675409 671304 666603 662141 658559 655324 651606 647664 644597 642896 641988
50185 641988 641229 640761 641185 642753 645072 647424 649271 650618 651922 653530 655306 656951 658603 660821 664001
50170 664001 667983 672269 676409 680169 683559 686861 690442 694357 698185 701345 703566 704973 705774 706037 705833
50155 705833 705464 705315 705493 705785 706122 706895 708541 710937 713527 716095 719071 722910 727414 732007 736498 741218
50139 741218 746398 751722 756629 760918 764929 769297 774628 781301 789320 798294 807630 816908 826171 835945
50125 835945 846982 859861 874574 890412 906357 921730 936541 951221 966133 981432 997275
50114 997275 1013860 1031127 1048665 1066108 1083615 1101816 1121245 1141922 1163435 1185403 1207938
50103 1207938 1231749 1257743 1286374 1317392 1350301 1385004 1421942 1461687 1504585 1550763 1600370
50092 1600370 1653844 1712052 1776100 1846725 1923925 2007471 2097905 2196775 2305708 2425416 2555825
50081 2555825 2696983 2849481 3013866 3189879 3376280 3571063 3771402 3973323 4171734
50072 4171734 4361171 4536846 4695395 4835166 4956241 5060174 5149373 5226237 5292384 5348058
50062 5348058 5391760 5420346 5429705 5415545 5373790 5301021 5195620 5058987 4895341 4710057 4508437
50051 4508437 4295992 4078903 3863120 3652940 3450913 3258955 3078869 2911813 2757925
50042 2757925 2616798 2487887 2370432 2263535 2166663 2079696 2002245 1933246 1871465 1816043
50032 1816043 1766276 1721306 1680422 1643357 1609905 1579522 1551749 1526814 1505321 1487393 1472560
50021 1472560 1460312 1450290 1441996 1434895 1428876 1424235 1421105 1419340 1419059 1420748 1424537 1429822 1436033 1443493
50007 1443493 1453039 1464947 1478690 1493704 1509976 1527747 1547035 1567683 1589694 1613318 1638916
49996 1638916 1666864 1697480 1730780 1766272 1803193 1841110 1880335 1921689 1965876 2013058 2062960
49985 2062960 2115276 2169988 2227389 2287978 2352332 2420970 2494172 2571951 2654365 2741994 2836064
49974 2836064 2938018 3048944 3169482 3300237 3442171 3596609 3765010 3948852 4149632
49965 4149632 4368769 4607438 4866422 5145976 5445584 5763656 6097231 6441651 6790438
49956 6790438 7135896 7470587 7788842 8087281 8364345 8619804 8854671 9070844 9269839
49947 9269839 9451241 9612061 9747322 9851022 9916667 9937686 9908435 9825659 9689335 9502260
49937 9502260 9269053 8995694 8689458 8358197 8008956 7647304 7278193 6907074 6539672
49928 6539672 6180791 5833829 5501383 5185713 4888441 4610259 4351260 4111303 3889954
49919 3889954 3686408 3499716 3328926 3172900 3030373 2900304 2781815 2673594 2573879 2481366
49909 2481366 2395714 2316695 2243295 2174173 2108645 2046553 1987405 1930440 1875467 1822852 1772623
49898 1772623 1724306 1677866 1634095 1593737 1556809 1523094 1492658 1465375 1440476 1417197 1395595
49887 1395595 1376196 1359068 1343806 1330256 1318655 1309066 1301170 1294741 1289934 1287038 1286186 1287314 1290111
49874 1290111 1294094 1299057 1305396 1313575 1323301 1333758 1344776 1357302 1372422 1390317 1410504 1432774
49862 1432774 1457437 1484819 1514996 1548082 1584408 1624325 1668040 1715715 1767545 1823689 1884457
49851 1884457 1950797 2024459 2107311 2200432 2304055 2418378 2544172 2682392 2833516 2997677
49841 2997677 3175231 3366557 3570851 3785401 4006214 4229004 4449151 4661144 4859070
49832 4859070 5038276 5196523 5333702 5451047 5550894 5636482 5710889 5775430 5828821 5867462
49822 5867462 5886099 5878382 5837733 5758933 5639826 5482047 5290254 5070650 4830048 4575816
49812 4575816 4315823 4057455 3806226 3565323 3336504 3121223 2920870 2736339 2567717
49803 2567717 2414330 2274900 2147861 2031984 1926874 1832642 1748954 1674440 1607132 1545479
49793 1545479 1488947 1437611 1391285 1349128 1310183 1274056 1240810 1210251 1181774 1155043 1130341
49782 1130341 1107939 1087406 1067904 1049016 1030847 1013470 996736 980634 965350 950852 936746
49771 936746 922782 909235 896604 885047 874251 863769 853484 843777 835148 827494 819959 811819
49759 811819 803380 795607 788943 783057 777797 773649 770836 768491 765331 760970 756140 751788 748346 745732
49745 745732 743534 741164 738267 735140 732573 731161 730854 731095 731197 730668 729433 727819 726194 724644 723090
49730 723090 721607 720448 719779 719508 719255 718401 716391 713276 709840 706946 704802 703069 701476 700016 698635
49715 698635 697149 695482 693743 692038 690412 688883 687327 685406 682945 680223 677547 674700 671274 667521
49701 667521 664304 662140 660788 659799 658946 657931 656356 654284 652350 650931 649617 647872 645791 643803 642023
49686 642023 640414 639212 638615 638308 637820 637179 636678 636219 635475 634540 633806 633260 632517 631496 630449 629357 628080
49669 628080 627126 627388 628766 629947 630079 629974 630853 632488 633470 633114 632196 631760 631967 632348 632581 632695 632866 633300
49651 633300 634023 634633 634576 633897 633446 634089 635928 638500 641416 644461 647300 649624 651605 653849 656761 660186
49635 660186 663716 667025 669765 671554 672489 673542 676037 680500 686155 691573 695757 698686 701099 703926
49621 703926 707745 712482 717479 721907 725267 727680 729807 732412 735825 739774 743839 747972 752438 757312
49607 757312 762411 767744 773552 779668 785226 789535 793031 796838 801422 806203 810545 814583 818867 823686
49593 823686 829045 834895 841006 846941 852650 858816 866104 874176 881973 888921 895322 901548 907528 913297
49579 913297 919488 926721 934754 942684 949892 956467 962787 969030 975119 980836 986013 990819 995885 1001912
49565 1001912 1009049 1016809 1024558 1031975 1039062 1045958 1052817 1059656 1066301 1072621 1078862 1085524 1092872 1100786
49551 1100786 1109117 1117885 1126990 1136063 1144910 1153860 1163372 1173405 1183540 1193590 1203746 1214137 1224607
49538 1224607 1235012 1245422 1256008 1267034 1278971 1292172 1306252 1320207 1333558 1347058 1361843
49527 1361843 1378040 1394646 1410697 1426084 1441235 1456510 1472113 1488223 1504872 1521864 1539003
49516 1539003 1556278 1573695 1591110 1608432 1625819 1643517 1661643 1680253 1699341 1718486 1736743
49505 1736743 1753408 1768913 1784487 1800773 1817186 1832833 1847736 1862714 1878250 1893810 1908310
49494 1908310 1921013 1932080 1942579 1953870 1966529 1979693 1991769 2002045 2011309 2020661 2030053 2038430
49482 2038430 2045177 2050793 2056124 2061426 2066510 2071365 2076200 2081020 2085557 2089611 2093170 2096301 2099238 2102489
49468 2102489 2106465 2110972 2115408 2119617 2124149 2129538 2135709 2142344 2149413 2156899 2164180 2170244 2174619 2177821
49454 2177821 2180818 2184240 2188071 2191773 2194691 2196576 2197850 2199145 2200509 2201203 2200340 2197575 2193208 2187792
49440 2187792 2181694 2174829 2166827 2157641 2147935 2138509 2129283 2119192 2107336 2093945 2080006 2066176 2052342
49427 2052342 2038105 2023396 2008618 1994305 1980636 1967252 1953699 1939954 1926271 1912504 1898091
49416 1898091 1882875 1867467 1852394 1837376 1821875 1806031 1790424 1775228 1760299 1745958 1732881
49405 1732881 1721086 1709737 1698222 1686809 1676046 1666074 1656854 1648494 1640828 1633175 1625032 1616739 1608959
49392 1608959 1601770 1594790 1587949 1581535 1575610 1569990 1564838 1560656 1557482 1554597 1551349 1547898 1544771 1541923
49378 1541923 1538676 1534641 1530357 1526900 1524927 1524258 1524281 1524524 1524740 1524710 1524339 1524002 1524452 1526129 1528757 1531801
49362 1531801 1535153 1539129 1543974 1549679 1556241 1563739 1572099 1581089 1590608 1600675 1610957 1620572 1628665
49349 1628665 1635086 1640339 1645006 1649502 1654357 1660302 1667779 1676450 1685476 1694342 1703260 1712776 1723229 1734668
49335 1734668 1746975 1759724 1772100 1783391 1793632 1803487 1813371 1822998 1831867 1839889 1847338 1854484 1861541
49322 1861541 1868783 1876437 1884550 1893149 1902445 1912601 1923464 1934627 1945673 1956253 1966178 1975665 1985271
49309 1985271 1995314 2005594 2015936 2026765 2038691 2051656 2064982 2078201 2091449 2105051 2119170
49298 2119170 2133970 2149713 2166525 2184303 2202897 2222104 2241470 2260537 2279485 2299193 2320426
49287 2320426 2343131 2366651 2390395 2414117 2437810 2461582 2485587 2509891 2534342 2558621 2582468
49276 2582468 2605978 2629760 2654544 2680387 2706420 2731727 2756295 2780710 2805121 2829125 2852633
49265 2852633 2876135 2899860 2923327 2946091 2968425 2990768 3012939 3034382 3054888 3074581 3093406
49254 3093406 3111200 3128169 3144759 3161040 3176576 3190921 3203931 3215637 3226199 3236071 3245815 3255585
49242 3255585 3264933 3273201 3279938 3284956 3288320 3290488 3292324 3294685 3297807 3301080 3303513 3304544 3304438 3303927
49228 3303927 3303545 3303442 3303620 3304004 3304266 3304017 3303321 3302702 3302458 3302273 3301681 3300574 3298970 3296634 3293358 3289441 3285387
49211 3285387 3281186 3276242 3270014 3262375 3253320 3242679 3230254 3216081 3200409 3183522 3165561 3146403
49199 3146403 3125771 3103539 3079935 3055391 3030346 3005173 2980085 2954935 2929295 2902913 2875954
49188 2875954 2848769 2821705 2795192 2769530 2744335 2718647 2691990 2664948 2638272 2611880 2585241
49177 2585241 2558341 2531550 2504900 2478308 2452300 2427566 2403745 2379578 2354396 2328691 2303075
49166 2303075 2277612 2252537 2228656 2206347 2184800 2163019 2141088 2119791 2099387 2079502 2059931
49155 2059931 2040808 2022117 2003770 1986134 1969800 1954673 1939863 1924735 1909675 1895544 1882650
49144 1882650 1870447 1858102 1845244 1832239 1819760 1808010 1796464 1784539 1772374 1760635 1749633
49133 1749633 1739016 1728376 1717778 1707525 1697689 1688158 1678907 1669945 1661157 1652477 1644222 1636880 1630456
49120 1630456 1624285 1617747 1611120 1605430 1601398 1598693 1596295 1593435 1590041 1586477 1583159 1580351 1578031 1575839
49106 1575839 1573397 1570826 1568790 1567929 1568377 1569834 1571862 1574009 1575918 1577614 1579542 1582052 1584949 1587845
49092 1587845 1590858 1594584 1599237 1604188 1608713 1613083 1618503 1625834 1634609 1643570 1652034 1660378 1669170 1678212
49078 1678212 1686794 1694619 1702051 1709483 1716831 1723778 1730171 1736023 1741353 1746259 1751111 1756498 1762932 1770507
49064 1770507 1778684 1786480 1793181 1798986 1804804 1811343 1818510 1825626 1831977 1837176 1841382 1845257 1849409 1853821
49050 1853821 1858141 1862533 1867637 1873473 1879013 1883354 1886945 1891086 1896489 1902776 1909118 1914805 1919458 1923364
49036 1923364 1927488 1932530 1937969 1942607 1946013 1948773 1951346 1953491 1955051 1956475 1958072 1959380 1959862 1959740
49022 1959740 1959594 1959455 1958924 1957911 1956657 1955202 1953435 1951644 1950413 1949861 1949485 1948876 1948176 1947669 1947268 1946670
49006 1946670 1945745 1944517 1942923 1940821 1938181 1935144 1931958 1928934 1926356 1924284 1922495 1920642 1918425 1915703
48992 1915703 1912688 1910043 1908535 1908337 1908843 1909307 1909599 1910214 1911726 1914430 1918347 1923289 1928887 1934824 1941109
48977 1941109 1947948 1955353 1963052 1970946 1979469 1989346 2001022 2014468 2029442 2045725 2063065 2081135
48965 2081135 2099735 2118993 2139159 2160201 2181851 2204113 2227531 2252741 2279886 2308672 2338854
48954 2338854 2370373 2403102 2436905 2472105 2509477 2549503 2591872 2635957 2681553 2728801 2777618
48943 2777618 2827591 2878344 2929650 2981309 3033310 3086008 3139652 3193713 3247183 3299639 3351525
48932 3351525 3403308 3454906 3506225 3557661 3609620 3661941 3714217 3766261 3817635 3867070 3913089
48921 3913089 3955217 3994030 4030013 4062917 4092341 4118403 4141651 4162677 4181977 4199835 4216075
48910 4216075 4230203 4241880 4251024 4257356 4260281 4259428 4255039 4247559 4237119 4223805 4208257 4191621 4174854
48897 4174854 4158252 4141649 4124852 4107872 4090875 4074140 4058098 4043331 4030300 4018951 4008759
48886 4008759 3999421 3991433 3985665 3982384 3981068 3981263 3983218 3987371 3993554 4001153 4010005 4020692 4033842 4049349
48872 4049349 4066570 4085217 4105884 4129586 4156833 4187333 4220557 4256302 4294530 4334907 4376975
48861 4376975 4420817 4467186 4516792 4569561 4624671 4681215 4738806 4797756 4858708 4921956 4987138
48850 4987138 5053752 5121856 5192041 5264809 5340299 5418511 5499367 5582570 5667995 5756308 5848619
48839 5848619 5945213 6045149 6147408 6251936 6359088 6468559 6579579 6691904 6805843 6921282
48829 6921282 7037267 7152738 7267259 7380830 7493250 7603846 7711639 7815650 7915160 8009842
48819 8009842 8099734 8185093 8266149 8342685 8413757 8478072 8534823 8583941 8625324 8658226 8681774
48808 8681774 8695875 8701141 8698020 8686373 8665894 8636570 8598673 8552702 8499411 8439695 8374292 8303647
48796 8303647 8227912 8146891 8060179 7967759 7870589 7770368 7668557 7565677 7461538 7356104
48786 7356104 7250238 7145611 7043628 6944335 6846552 6749295 6652827 6558200 6466222 6377320 6292081
48775 6292081 6211277 6135356 6064324 5998108 5936704 5880063 5828145 5781026 5738564 5700260 5665911
48764 5665911 5636190 5611940 5592967 5578252 5567345 5560827 5559211 5562136 5568989 5579731 5594677 5613907
48752 5613907 5637291 5664739 5696027 5730723 5768657 5810168 5855535 5904411 5956245 6011016 6069126
48741 6069126 6130701 6195370 6262636 6332162 6403756 6477448 6553526 6632222 6713259 6795918 6879587
48730 6879587 6964206 7050215 7138170 7228395 7320947 7415761 7512640 7610950 7709591 7807745 7905543
48719 7905543 8003532 8101368 8197683 8291556 8383576 8474772 8564661 8650948 8731216 8804531 8871357
48708 8871357 8932384 8987695 9036822 9079148 9114191 9141715 9161919 9175463 9183099 9185116 9181379 9172054
48696 9172054 9157996 9139977 9117671 9089790 9055159 9013232 8963591 8905565 8838614 8762741 8678320
48685 8678320 8585820 8485787 8378813 8265475 8146637 8023852 7898931 7773041 7646705 7520748
48675 7520748 7396433 7274348 7153959 7034834 6917739 6803814 6693215 6585286 6479746
48666 6479746 6376941 6277144 6180438 6087220 5998089 5913110 5831743 5753547 5678560 5607049 5539390
48655 5539390 5476118 5417563 5363447 5313314 5267235 5225547 5187965 5153639 5122202 5094062 5069524
48644 5069524 5048200 5029509 5013186 4999103 4987106 4977331 4970126 4965338 4962137 4959937 4959082 4960228 4963420
48631 4963420 4968225 4974507 4982568 4992634 5004557 5017931 5032249 5047038 5062189 5078140 5095479 5114382
48619 5114382 5134514 5155417 5176875 5198990 5222067 5246382 5271988 5298755 5326526 5355107 5384180
48608 5384180 5413513 5443147 5473033 5502575 5531070 5558710 5586510 5614916 5642954 5669228 5693314
48597 5693314 5715647 5736406 5755202 5771804 5786407 5798985 5808833 5815065 5817327 5815822 5810723 5801708
48585 5801708 5788053 5769162 5745109 5716608 5684348 5648353 5608118 5563286 5514169 5461704 5406995
48574 5406995 5350797 5293351 5234866 5176124 5118270 5061858 5006513 4951759 4897773 4844910 4792942
48563 4792942 4741462 4690771 4641627 4594099 4547477 4501460 4456747 4414158 4373777 4335352 4298994
48552 4298994 4264924 4232888 4202380 4173273 4145774 4119888 4095361 4072109 4050366 4030468 4012815
48541 4012815 3997927 3986137 3977249 3970771 3966448 3964248 3963899 3964924 3967242 3971390 3977950 3986933 3997826
48528 3997826 4010007 4023022 4036681 4051118 4066674 4083562 4101655 4120548 4139755 4158969 4178338
48517 4178338 4198412 4219582 4241577 4263772 4285936 4308330 4331130 4354154 4377259 4400443 4423375
48506 4423375 4445351 4466137 4486429 4507010 4527679 4547530 4566104 4583720 4600706 4616777 4631275
48495 4631275 4643622 4653510 4660959 4666325 4670053 4672310 4672960 4671755 4668392 4662626 4654766 4645916 4637243 4628942
48481 4628942 4620231 4610278 4598656 4585016 4569067 4551093 4531928 4512123 4491555 4470131 4448279 4426319
48469 4426319 4403805 4380000 4354731 4328285 4300753 4272035 4242378 4212347 4182278 4152145 4121964
48458 4121964 4091914 4062019 4032019 4001587 3970503 3938669 3906205 3873474 3840806 3808293 3776021
48447 3776021 3744225 3712867 3681318 3648990 3616231 3584039 3552868 3522189 3491378 3460597 3430568
48436 3430568 3401797 3374178 3347143 3320072 3292802 3265873 3240066 3215682 3192427 3169948 3148112
48425 3148112 3126762 3105658 3084790 3064385 3044440 3024683 3005225 2986805 2970012 2954542 2939574
48414 2939574 2924599 2909525 2894281 2878880 2863769 2849547 2836254 2823330 2810405 2797733 2785678
48403 2785678 2774119 2762676 2751268 2740132 2729315 2718466 2707153 2695130 2682157 2667863 2652104
48392 2652104 2635448 2618907 2603027 2587416 2571334 2554574 2537505 2520422 2503210 2485665 2467861
48381 2467861 2450071 2432517 2415281 2398246 2381078 2363414 2345223 2326778 2308244 2289472 2270291
48370 2270291 2250815 2231434 2212657 2194982 2178589 2163021 2147496 2131749 2116363 2102009 2088625
48359 2088625 2075597 2062497 2049250 2035730 2021742 2007559 1994106 1982331 1972402 1963542 1954625 1945073
48347 1945073 1935322 1926339 1918478 1910962 1902789 1894072 1886073 1879837 1875164 1871081 1866933 1862623 1858157 1853523
48333 1853523 1849061 1845419 1842902 1841144 1839634 1838330 1837455 1836941 1836508 1836237 1836621 1837885 1839575 1840954 1841539
48318 1841539 1841112 1839654 1837632 1836033 1835553 1835875 1836172 1836187 1836237 1836269 1835715 1834527 1833641 1833846 1834683 1835087 1834858 1834829
48300 1834829 1835648 1836970 1838016 1838514 1838835 1839389 1840135 1840662 1840732 1840651 1840983 1841899 1843066 1844240 1845589 1847171 1848524
48283 1848524 1849242 1849674 1850433 1851308 1851342 1850063 1848003 1845743 1843028 1839237 1834296 1828608 1822303 1815185 1807438
48268 1807438 1799889 1793247 1787233 1780730 1772807 1763484 1753413 1742960 1731882 1719929 1707404 1694841
48256 1694841 1682361 1669790 1657321 1645520 1634540 1623726 1612243 1599854 1587009 1574460 1562909
48245 1562909 1552607 1543045 1533373 1523353 1513569 1504446 1495582 1486520 1477673 1469759 1462562 1455124 1447157
48232 1447157 1439439 1432569 1426087 1419293 1412329 1405857 1399999 1394219 1388131 1381929 1375973 1370293 1364576 1358462
48218 1358462 1351886 1345277 1339301 1334182 1329382 1324271 1318958 1314143 1310145 1306449 1302348 1297734 1293077 1288794
48204 1288794 1284811 1280627 1275789 1270333 1264822 1259796 1255213 1250579 1245578 1240284 1234693 1228418 1221085 1212889
48190 1212889 1204501 1196499 1189063 1182192 1175959 1170451 1165509 1160604 1155102 1148733 1141745 1134450 1126791 1118649
48176 1118649 1110522 1103379 1097593 1092434 1087012 1081445 1076672 1073188 1070409 1067295 1063291 1058621 1053961 1049875
48162 1049875 1046311 1042559 1037851 1032065 1025719 1019358 1013177 1007144 1001179 995134 988901 982657 976801 971498
48148 971498 966470 961301 955911 950698 946277 942913 940084 936842 932965 929474 927492 926764 925986 924598 923392
48133 923392 923095 923257 923223 923468 925140 928633 933528 939804 948216 959370 973164 989359 1008114 1029783
48119 1029783 1054710 1083502 1117042 1155952 1200399 1250395 1305252 1361727 1412950 1450260 1466995
48108 1466995 1461124 1435041 1393645 1342481 1286599 1229959 1175274 1124203 1077559 1035379 997142
48097 997142 962312 930831 903022 878968 858079 839395 822250 806510 792151 778842 766211
48086 766211 754394 743972 735231 727661 720436 713230 706392 700329 695041 690304 686082 682469 679289 676047
48072 676047 672495 669114 666741 665622 665000 663821 661737 659259 656981 655011 653216 651730 650889 650786 651228
48057 651228 652116 653559 655482 657433 659031 660441 662032 663673 664779 665155 665396 666204 667648 669411 671415
48042 671415 673663 675619 676420 675855 674661 673609 672772 671902 671018 670067 668406 665358 661238 657251 654246 651983
48026 651983 649734 647160 644400 641694 639231 637128 635278 633319 630969 628308 625601 623004 620528 618131
48012 618131 615614 612616 608993 605159 601816 599310 597389 595516 593291 590601 587569 584446 581492 578949
47998 578949 577063 575948 575293 574387 572678 570250 567593 565028 562684 560812 559626 558717 557246 555065 553190
47983 553190 552627 552951 552708 551183 549183 547926 547626 547514 546796 545226 543027 540769 539209 538777 539181 539819
47967 539819 540559 541792 543707 545953 548080 549977 551682 553144 554375 555551 556685 557492 557902 558445 559731
47952 559731 561641 563438 564643 565389 565877 565906 565148 563663 561926 560400 559138 557673 555281 551553 546811
47937 546811 541880 537434 533645 530386 527476 524634 521532 518140 514822 511827 508769 504921 500014 494489
47923 494489 488906 483401 477939 472864 468787 465780 462937 459104 454079 448869 444625 441491 438637 435298
47909 435298 431475 427641 424067 420647 417286 414155 411431 408874 405827 401802 397036 392371 388555 385692
47895 385692 383390 381209 378898 376391 373826 371441 369231 366768 363702 360415 357845 356511 355939 355205 353840
47880 353840 352066 350445 349528 349619 350480 351248 351002 349528 347393 345297 343607 342549 342445 343388 344781 345625
47864 345625 345414 344584 343962 343939 344284 344601 344749 344846 345121 345827 347102 348805 350531 351859 352562 352683 352569 352810
47846 352810 353839 355501 357211 358636 360027 361751 363829 366200 369118 372886 377236 381376 384648 386908
47832 386908 388381 389516 390958 393193 396094 399158 402239 405699 409696 413812 417634 421308 425119 428795
47818 428795 431681 433523 434715 435839 437243 439005 440965 442762 444175 445434 446983 448900 450845 452628
47804 452628 454479 456586 458618 460019 460634 460797 460897 461145 461772 463043 464859 466584 467604 468019 468444 469111
47788 469111 469542 469268 468544 467962 467575 466859 465568 464105 462830 461468 459562 457267 455195 453540 451868 449940
47772 449940 448375 448042 448887 449664 449010 446692 443703 441277 439981 439696 440107 440945 441856 442410 442362 441784 440894
47755 440894 439908 439058 438511 438188 437802 437256 436774 436492 436104 435254 434190 433650 434010 434830 435439 435738 436105 436691
47737 436691 437099 436880 436087 435196 434634 434573 435049 436000 437140 438051 438545 438829 439221 439860 440802 442201 444153 446380
47719 446380 448288 449428 449771 449558 449047 448398 447684 446953 446363 446245 446806 447698 448081 447324 445642 443906 442811
47702 442811 442329 442004 441588 441206 440916 440489 439847 439496 440097 441617 443343 444869 446596 449018 451888 454466
47686 454466 456326 457571 458501 459463 460787 462414 463810 464671 465489 466837 468332 468968 468351 466858 464667 461562
47670 461562 457828 454332 451247 447504 442110 435371 428287 421401 414976 409608 405701 402586 399116 395071
47656 395071 391238 388163 385536 382899 380326 378220 376930 376657 377257 378078 378434 378362 378473 379010 379521 379656 379749
47639 379749 380310 381307 382336 383254 384335 385838 387699 389563 391052 392038 392831 394084 396451 400187 404941
47624 404941 409894 414276 417882 421019 423911 426474 428744 431144 433952 436796 439111 440956 442907 445266
47610 445266 447844 450427 452975 455341 457324 459003 460689 462499 464421 466705 469634 472808 475310 476812
47596 476812 477995 479575 481380 482755 483433 483604 483436 483032 482688 482748 483238 483915 484710 485954 488144 491477 495514
47579 495514 499397 502691 505970 510195 515491 520927 525601 529380 532366 534289 534996 535084 535368 535794 535464 533641
47563 533641 530296 525696 519964 513199 505695 497842 489868 481671 472832 462977 452395 442153 433260 425736
47549 425736 418841 412100 405722 399958 394528 388972 383301 378002 373439 369476 365704 361876 358040 354374
47535 354374 350998 347965 345274 342810 340380 337957 335793 334103 332663 330952 328682 325991 323097 320118
47521 320118 317267 314860 312954 311240 309513 307925 306603 305367 304125 303187 302737 302213 300764 298333 295864
47506 295864 294345 293924 293968 293736 292930 291840 290987 290483 289835 288603 287078 285984 285574 285433 285203 285050 285270
47489 285270 285782 286277 286666 287122 287766 288465 288889 288716 287946 287103 286938 287824 289510 291523 293655 295934 298337
47472 298337 300768 303292 306161 309531 313276 317160 321112 325174 329214 332896 336124 339385 343318 347864
47458 347864 352008 354523 354922 353666 351671 349650 347692 345241 341647 336913 331753 326839 322259 317888
47444 317888 313919 310584 307620 304453 300910 297377 294317 291942 290225 288823 287148 285002 283130 282569
47430 282569 283358 284390 284646 284079 283150 282082 280966 280190 280307 281547 283627 285864 287385 287631 286883 286035
47414 286035 285671 285719 286081 287022 288562 290046 290891 291426 292401 293887 295228 295961 296248 296479 296908 297597 298276 298387
47396 298387 297815 297432 298251 300030 301448 301813 301860 302552 303776 304745 305208 305551 305999 306354 306510 306758 307481 308841
47378 308841 310741 312837 314561 315441 315492 315199 315068 315302 315824 316452 317064 317685 318349 318844 318759 317969 316921 316231
47360 316231 316115 316361 316679 316797 316451 315700 315161 315436 316217 316464 315684 314634 314466 315414 316669 317335 317161 316456
47342 316456 315683 315222 315298 315920 316891 317873 318545 318890 319398 320719 322940 325413 327514 329322 331217 333027 334083
47325 334083 334150 333837 333926 334663 335900 337473 339085 340114 340020 338920 337443 336081 334992 334335 334308 334691 334766 334040
47307 334040 332826 331768 330954 329870 328190 326250 324571 323278 322226 321495 321393 321993 322921 323695 324061 324022
47291 324022 323725 323393 323159 322844 322149 321201 320691 321198 322552 324162 325763 327487 329229 330527 331211 331718 332448
47274 332448 333168 333456 333491 333834 334491 334725 333936 332335 330534 328897 327575 326758 326336 325505 323347 319942 316394
47257 316394 313551 311155 308550 305745 303214 301005 298778 296650 295284 294936 295021 294882 294386 293443 291651 288974
47241 288974 286326 284675 283830 282820 281335 280001 279268 278875 278539 278385 278321 277708 276153 274122 272330 270943
47225 270943 269838 269194 269168 269283 268759 267393 265670 264033 262506 260961 259345 257642 255931 254506 253691 253560
47209 253560 254003 254827 255536 255328 253831 251760 250360 250251 251138 252440 253620 254009 253094 251233 249576 248953
47193 248953 249177 249552 249642 249350 248776 248328 248606 249734 251002 251511 251056 250167 249471 249330 249940 251410 253659 256375
47175 256375 259102 261419 263205 264778 266552 268450 269899 270532 270667 270903 271516 272427 273546 274817 276028
47160 276028 276863 277136 276888 276343 275863 275770 276041 276335 276477 276749 277513 278717 280016 281229 282404 283499 284292
47143 284292 284708 285038 285699 286740 287667 287912 287586 287614 288906 291423 294375 297223 300101 303273 306710 310403
47127 310403 314517 318888 322808 325724 327869 329827 331852 333962 336307 338869 341139 342709 344005 345728
47113 345728 347721 349055 349284 348933 348633 348346 347634 346250 344293 342155 340450 339569 339249 338974 338793 339218 340191
47096 340191 340828 340485 339545 338856 338867 339652 341311 343776 346515 348915 350885 352769 354834 357093 359439 361640
47080 361640 363434 364846 366238 367834 369459 370971 372549 374261 375663 376357 376719 377582 379274 381330 383035
47065 383035 383913 383800 382899 381754 380836 380154 379430 378524 377404 375992 374435 373321 373148 373584 373684 372791 370933
47048 370933 368534 366181 364523 363755 363239 362152 360508 359004 357882 356659 355141 354005 354003 355048 356373
47033 356373 357185 356977 355721 354109 353085 352761 352217 350738 348807 347435 346940 346921 347018 347022 346445 344748 342064
47016 342064 339212 336893 335178 333756 332326 330769 329273 328274 327945 327746 326831 324910 322466 320135 318140
47001 318140 316277 314140 311416 308265 305407 303542 302689 302328 302119 302088 302202 302154 301677 300732 299345 297618 295957
46984 295957 294994 295062 295896 296889 297484 297435 296975 296712 297018 297548 297589 296894 295864 295043 294816 295443 296819 298139 298498
46965 298498 297956 297498 297728 298203 298323 298243 298431 298858 299220 299629 300433 301528 302409 302867 303209 303837 304932 306476
46947 306476 308241 309826 310966 311719 312139 311991 311176 310265 310147 311074 312387 313185 313062 312292 311565 311478 312032 312647
46929 312647 312906 313079 313619 314350 314633 314320 314135 314950 316874 319078 320367 320058 318562 317062 316386 316320 316181
46912 316181 315761 315342 315114 315132 315611 316645 317648 317785 317047 316352 316469 317360 318582 319692 320133 319502 318302
46895 318302 317847 318918 320973 322990 324537 325573 325854 325279 324541 324657 325938 327905 330056 332106 333613
46880 333613 334112 333840 333753 334583 336203 338129 340248 342729 345428 347734 349092 349540 349607 349704 349713 349338 348773 348617
46862 348617 349025 349353 349022 348473 348703 349975 351494 352419 352731 352892 353123 353367 353691 354311 355260 356351 357438
46845 357438 358491 359363 359787 359779 359889 360764 362406 364051 364888 364758 364080 363301 362676 362450 362845 363792 364947 366070
46827 366070 367163 368131 368682 368706 368505 368377 368260 368047 368007 368552 369737 371329 373145 375044 376719 378037 379445
46810 379445 381523 384058 386120 387216 387926 389075 390645 391869 392262 392221 392618 393998 396182 398549 400670
46795 400670 402658 404842 407235 409568 411818 414314 417100 419535 420899 421338 421904 423556 426301 429290 431656
46780 431656 433160 434182 435198 436305 437225 437758 438166 439053 440865 443460 446204 448555 450553 452682 455206
46765 455206 457794 459916 461459 462791 464270 465965 467827 469859 472043 474318 476725 479330 481871 483799
46751 483799 484931 485893 487562 490124 492956 495408 497410 499188 500722 501781 502412 503087 504324 506320 508948
46736 508948 511936 514922 517536 519663 521623 523952 526940 530445 534074 537453 540441 543343 546789 551063
46722 551063 555535 559212 561986 564846 568526 572479 575774 578515 581549 584928 587686 589349 590748 592785
46708 592785 595098 596707 597555 598608 600556 603100 605491 607150 607705 607090 605846 604871 604517 604224 603341 602045
46692 602045 601194 601397 602460 603606 604042 603474 602282 601138 600356 599741 599180 599055 599797 601270 602968 604704
46676 604704 606683 608952 611278 613668 616478 619786 623115 626116 629242 633270 638371 644134 650348 657194
46662 657194 664527 671559 677641 683056 688700 695096 701960 708697 715035 721106 727082 732841 738055 742565
46648 742565 746629 750648 754705 758476 761578 763851 765345 766369 767600 769765 772947 776421 779368 781551
46634 781551 783102 784015 784327 784573 785509 787292 789356 791096 792333 792994 792811 791581 789486 786922 784151 781209
46618 781209 777939 774012 769155 763463 757295 750717 743430 735460 727483 720032 712637 704306 694787 684791
46604 684791 674948 665135 655212 645875 638139 632017 626282 619729 612350 605120 598803 593249 587687 581451
46590 581451 574434 567092 560071 553666 547581 541345 534937 528819 523366 518553 514274 510635 507738 505444
46576 505444 503605 502252 501166 499574 496887 493664 491294 490601 491256 492615 494497 496792 498855 499944 500055
46561 500055 499766 499408 498880 498209 497702 497390 496789 495515 493863 492474 491608 491009 490425 489986 490013 490622 491568 492473
46543 492473 493287 494544 497091 501345 506820 512470 517478 521654 525173 528297 531385 534822 538576 542076
46529 542076 544868 547272 549941 552861 555302 556900 558188 559748 561371 562583 563622 565151 567127 568643
46515 568643 569029 568528 567743 566924 566113 565587 565785 566965 569071 571724 574240 575951 576734 576994 577019 576689 575940
46498 575940 575183 574985 575538 576599 577649 577947 576875 574643 572343 570957 570551 570670 571086 571700 572133 572079 571841
46481 571841 571917 572195 572198 571990 572129 572754 573423 573895 574313 574509 574011 573071 572793 573673 574739 574941 574740 575386 577019
46462 577019 578639 579887 581686 584768 588478 591669 594109 596350 598697 601096 603834 607451 611791 615811
46448 615811 618771 621230 624486 629245 635178 641601 648165 654826 661546 668265 675004 681847 688847 696026
46434 696026 703384 710847 718288 725649 732965 740273 747613 755163 763157 771534 779844 787698 795206 802687
46420 802687 810013 816552 821879 826294 830412 834358 837599 839589 840382 840510 840397 840023 839136 837680 835982
46405 835982 834538 833586 832809 831541 829397 826688 824008 821471 818639 815241 811540 807748 803571 798772 793815
46390 793815 789240 784592 778759 771470 763683 756270 749083 741720 734425 727566 720828 713708 706512 700082
46376 700082 694718 690108 686183 683233 681177 679422 677664 676219 675430 675319 676002 677848 680892 684536 688151
46361 688151 691661 695417 699811 705145 711388 717769 723031 726435 728386 729905 731839 734602 738099 741584
46347 741584 744015 744996 745089 744926 744354 742767 739956 736298 732402 728873 726033 723522 720543 716828 712911
46332 712911 709111 705016 700606 697210 696203 697092 698010 698065 698039 698625 699263 699238 698982 699483 701100 703624 706972
46315 706972 711008 715129 718856 722615 727143 732160 736443 739376 741789 744950 749185 753794 757972 761417
46301 761417 764184 766335 767862 768790 769257 769418 769243 768443 766773 764441 762190 760831 760590 760873 760762 759837
46285 759837 758586 757919 758316 759607 761449 763718 766274 768772 771067 773685 777365 782118 787134 791782 796446
46270 796446 802086 809093 816861 824561 832211 840822 851415 863855 876797 888939 900254 911796 924261
46257 924261 937106 949257 960409 971197 982088 992562 1001660 1009076 1015304 1020712 1024864 1026976 1026799
46244 1026799 1024787 1021488 1017154 1012040 1006639 1001293 995717 989365 982301 975419 969590 964780 960190 955184
46230 955184 949945 945266 941845 939758 938609 938204 938980 941550 945771 950577 955056 959513 965150 972753 982057
46215 982057 992371 1003318 1014753 1026433 1038199 1050283 1063001 1076176 1089240 1101893 1114351
46204 1114351 1126914 1139576 1152145 1164426 1176140 1186959 1196787 1205829 1214186 1221561 1227524 1231888
46192 1231888 1234650 1235790 1235391 1233761 1231182 1227660 1223273 1218550 1214059 1209668 1204765 1199325 1194162 1189801
46178 1189801 1185599 1180545 1174664 1169033 1164479 1160884 1157908 1155815 1155147 1155923 1157644 1159956 1162837 1166044
46164 1166044 1168912 1171030 1172969 1175943 1180668 1186808 1193570 1200583 1207996 1215940 1224227 1232611 1241029 1249412
46150 1249412 1257476 1264949 1271917 1278751 1285653 1292467 1298954 1305105 1311140 1317280 1323579 1329905 1336017 1341743
46136 1341743 1347176 1352666 1358520 1364701 1370786 1376251 1380830 1384720 1388441 1392448 1396860 1401564 1406501 1411728
46122 1411728 1417209 1422734 1428105 1433269 1438261 1443209 1448470 1454488 1461300 1468347 1475043 1481441 1488034 1495039
46108 1495039 1502203 1509354 1516780 1524873 1533691 1543041 1552859 1563297 1574516 1586453 1598662 1610337 1620782
46095 1620782 1630130 1639386 1649511 1660561 1671919 1683178 1694475 1706051 1717942 1730091 1742473 1755005
46083 1755005 1767621 1780481 1793817 1807480 1821016 1834340 1847980 1862381 1877285 1892210 1907272
46072 1907272 1923086 1939885 1957192 1974425 1991545 2009034 2027526 2047410 2068414 2089488 2109544
46061 2109544 2128573 2147657 2167634 2188115 2208225 2228004 2248386 2269821 2291505 2312234 2331582
46050 2331582 2350039 2368337 2387012 2406415 2426711 2447816 2469494 2491419 2513088 2533929 2553845
46039 2553845 2573571 2594118 2615810 2638078 2660114 2681453 2701981 2721734 2740832 2759336 2777033
46028 2777033 2793585 2808930 2823287 2836727 2849057 2860304 2870973 2881600 2892284 2902910 2913593
46017 2913593 2924611 2936094 2948030 2960405 2973116 2985892 2998589 3011353 3024247 3036993 3049440
46006 3049440 3062007 3075140 3088466 3101034 3112374 3122744 3132391 3141163 3149078 3156703 3164727 3173484
45994 3173484 3183031 3193252 3203668 3213701 3223409 3233589 3244825 3256899 3269442 3282695 3297142 3312819
45982 3312819 3329488 3347155 3365788 3384840 3403756 3422813 3442766 3463661 3484672 3505179 3525444
45971 3525444 3546056 3567223 3588858 3610891 3633291 3656131 3679834 3704944 3731387 3758262 3784599
45960 3784599 3810140 3835290 3860637 3886705 3913798 3941724 3969844 3997612 4024951 4052033 4078952
45949 4078952 4105765 4132572 4159379 4186087 4212710 4239290 4265522 4290971 4315953 4341618 4368625
45938 4368625 4396099 4422587 4447866 4473150 4499567 4527066 4555005 4583226 4612168 4642245 4673421
45927 4673421 4705372 4737870 4771038 4805135 4840068 4875281 4910345 4945420 4980812 5016304 5051369
45916 5051369 5085914 5120220 5154036 5186317 5216104 5243264 5268175 5291140 5312363 5332060 5350279
45905 5350279 5366858 5381834 5395592 5408372 5420021 5430525 5440304 5449538 5457621 5463944 5468916 5473567
$$ [...]
##END NTUPLES=NMR SPECTRUM
##END=
