
##TITLE=UV1051_TOCA01-ROVE100D_6099954_pvEI1hl4MJ
##JCAMPDX= 6.0         $$ Bruker NMR JCAMP-DX V2.0
##DATA TYPE= NMR SPECTRUM
##DATA CLASS= NTUPLES
##ORIGIN= BRUKER
##OWNER= Administrator
$$ 1.72 TOPSPIN		Version 2.1
$$ 2012-05-12 19:00:52.671 -0500  Administrator@TOPSPIN
$$ Compression mode = diff/dup
##.OBSERVE FREQUENCY= 400.13188235
##.OBSERVE NUCLEUS= ^1H
##.ACQUISITION MODE= SIMULTANEOUS (DQD)
##.ACQUISITION SCHEME= undefined
##.AVERAGES= 8
##.DIGITISER RES= 22
##SPECTROMETER/DATA SYSTEM= spect
##.PULSE SEQUENCE= zg30
##.SOLVENT NAME= COFFEE_meoh
##.SHIFT REFERENCE= INTERNAL, COFFEE_meoh, 1, 14.98061
##AUDIT TRAIL= $$ (NUMBER, WHEN, WHO, WHERE, PROCESS, VERSION, WHAT)
$$ ##TITLE= Audit trail, TOPSPIN		Version 2.1
$$ ##JCAMPDX= 5.01
$$ ##ORIGIN= Bruker BioSpin GmbH
$$ ##OWNER= Administrator
$$ $$ C:\Bruker\TOPSPIN/data/COFFEE/nmr/UV1051_TOCA01-ROVE100D_6099954_pvEI1hl4MJ/10/pdata/1/auditp.txt
$$ ##AUDIT TRAIL=  $$ (NUMBER, WHEN, WHO, WHERE, PROCESS, VERSION, WHAT)
(   1,<2012-05-12 19:00:45.765 -0500>,<Administrator>,<TOPSPIN>,<go>,<TOPSPIN 2.1>,
      <created by zg
	started at 2012-05-12 18:59:38.281 -0500,
	POWCHK enabled, PULCHK disabled,
       configuration hash MD5:
       AF F2 23 6B 01 CD 40 DD E5 A1 38 A0 06 EA F7 77
       data hash MD5: 64K
       B3 3D 74 DB 8B 63 6C 67 A4 83 02 81 66 00 D3 61>)
(   2,<2012-05-12 19:00:48.531 -0500>,<Administrator>,<TOPSPIN>,<proc1d>,<TOPSPIN 2.1>,
      <Start of raw data processing
       efp LB = 0 FT_mod = 6 PKNL = 1 PHC0 = 0 PHC1 = 0 SI = 32K 
       data hash MD5: 32K
       B6 BD 24 F8 F9 D4 D5 0A 7D F2 C6 D7 36 45 D1 DA>)
(   3,<2012-05-12 19:00:48.921 -0500>,<Administrator>,<TOPSPIN>,<proc1d>,<TOPSPIN 2.1>,
      <pk PHC0 = 217.6062 PHC1 = 0 
       data hash MD5: 32K
       6D 25 94 2A 56 9B 08 13 42 8B 44 33 F3 82 D4 F3>)
(   4,<2012-05-12 19:00:49.046 -0500>,<Administrator>,<TOPSPIN>,<proc1d>,<TOPSPIN 2.1>,
      <abs ABSG = 1 
       data hash MD5: 32K
       31 C9 97 B0 7A F3 9A 03 9A 4F D8 77 AC 3F 1E 3B>)
(   5,<2012-05-12 19:00:49.093 -0500>,<Administrator>,<TOPSPIN>,<proc1d>,<TOPSPIN 2.1>,
      <abs ABSG = 2 
       data hash MD5: 32K
       81 F9 80 20 08 93 78 00 CB AF FC 89 7A 99 61 24>)
(   6,<2012-05-12 19:00:49.125 -0500>,<Administrator>,<TOPSPIN>,<proc1d>,<TOPSPIN 2.1>,
      <abs ABSG = 3 
       data hash MD5: 32K
       2B 2B 5F 90 B8 F5 D3 CB 17 0D 3E 50 8E 13 84 52>)
(   7,<2012-05-12 19:00:49.171 -0500>,<Administrator>,<TOPSPIN>,<proc1d>,<TOPSPIN 2.1>,
      <abs ABSG = 4 
       data hash MD5: 32K
       4F C0 0E 8C F2 F5 CF B0 4E BF 0D AC D3 C7 7F 45>)
(   8,<2012-05-12 19:00:49.203 -0500>,<Administrator>,<TOPSPIN>,<proc1d>,<TOPSPIN 2.1>,
      <abs ABSG = 5 
       data hash MD5: 32K
       17 9B F2 6E D4 17 83 FB 59 A6 CE 3E 4B 95 62 57>)
$$ ##END=
$$ 
$$ $$ hash MD5
$$ $$ F9 06 B6 4C 48 67 09 2D 55 89 A9 2E 43 A9 DD A3
##$RELAX= 
##$RELAX= 
##$RELAX= 
##$RELAX= 
##$RELAX= 
##$RELAX= 
##$RELAX= 
$$ Bruker specific parameters
$$ --------------------------
$$ [...]
##$TP= (0..7)
150 150 150 150 150 150 150 150
##$TP07= 0
##$TPNAME0= <>
##$TPNAME1= <>
##$TPNAME2= <>
##$TPNAME3= <>
##$TPNAME4= <>
##$TPNAME5= <>
##$TPNAME6= <>
##$TPNAME7= <>
##$TPOAL= (0..7)
0.5 0.5 0.5 0.5 0.5 0.5 0.5 0.5
##$TPOFFS= (0..7)
0 0 0 0 0 0 0 0
##$TUNHIN= 0
##$TUNHOUT= 0
##$TUNXOUT= 0
##$USERA1= <user>
##$USERA2= <user>
##$USERA3= <user>
##$USERA4= <user>
##$USERA5= <user>
##$V9= 5
##$VALIST= <valist>
##$VCLIST= <CCCCCCCCCCCCCCC>
##$VD= 0
##$VDLIST= <DDDDDDDDDDDDDDD>
##$VPLIST= <PPPPPPPPPPPPPPP>
##$VTLIST= <TTTTTTTTTTTTTTT>
##$WBST= 2048
##$WBSW= 25
##$XGAIN= (0..3)
0 0 0 0
##$XL= 0
##$YL= 0
##$YMAX_a= 526517
##$YMIN_a= -611082
##$ZGOPTNS= <>
##$ZL1= 120
##$ZL2= 120
##$ZL3= 120
##$ZL4= 120
##$ABSF1= 14.98061
##$ABSF2= -5.57192
##$ABSG= 5
##$ABSL= 3
##$ALPHA= 0
##$AQORDER= 0
##$ASSFAC= 0
##$ASSFACI= 0
##$ASSFACX= 0
##$ASSWID= 0
##$AUNMP= <proc_prof1d_extract_pilot.lims>
##$AXLEFT= 0
##$AXNAME= <>
##$AXNUC= <1H>
##$AXRIGHT= 0
##$AXTYPE= 0
##$AXUNIT= <>
##$AZFE= 0.1
##$AZFW= 0.1
##$BCFW= 0
##$BC_mod= 0
##$BYTORDP= 0
##$COROFFS= 0
##$CY= 15
##$DATMOD= 1
##$DC= 0
##$DFILT= <>
##$DTYPP= 0
##$F1P= 0
##$F2P= 0
##$FCOR= 0.5
##$FTSIZE= 32768
##$FT_mod= 6
##$GAMMA= 0
##$GB= 0
##$INTBC= 1
##$INTSCL= 1
##$ISEN= 128
##$LB= 0
##$LEV0= 0
##$LPBIN= 0
##$MAXI= 10000
##$MC2= 0
##$MEAN= 0
##$ME_mod= 0
##$MI= 0
##$NCOEF= 0
##$NC_proc= -8
##$NLEV= 6
##$NOISF1= 0
##$NOISF2= 0
##$NSP= 0
##$NTH_PI= 0
##$NZP= 0
##$OFFSET= 14.98061
##$PC= 1
##$PHC0= 217.6062
##$PHC1= 0
##$PH_mod= 1
##$PKNL= yes
##$PPARMOD= 0
##$PPDIAG= 0
##$PPIPTYP= 0
##$PPMPNUM= 2147483647
##$PPRESOL= 1
##$PSCAL= 4
##$PSIGN= 0
##$PYNMP= <proc.py>
##$REVERSE= no
##$SF= 400.13
##$SI= 32768
##$SIGF1= 0
##$SIGF2= 0
##$SINO= 400
##$SIOLD= 32768
##$SPECTYP= <>
##$SREGLST= <1H.CDCl3>
##$SSB= 0
##$STSI= 32768
##$STSR= 0
##$SW_p= 8223.68421052632
##$SYMM= 0
##$S_DEV= 0
##$TDeff= 65536
##$TDoff= 0
##$TI= <>
##$TILT= no
##$TM1= 0
##$TM2= 0
##$TOPLEV= 0
##$USERP1= <user>
##$USERP2= <user>
##$USERP3= <user>
##$USERP4= <user>
##$USERP5= <user>
##$WDW= 1
##$XDIM= 32768
##$YMAX_p= 452919391
##$YMIN_p= -607710
##$CURPLOT= <Network HP LaserJet P1505>
##$CURPRIN= <$Network HP LaserJet P1505>
##$DFORMAT= <normdp>
##$LAYOUT= <+/1D_H.xwp>
##$LFORMAT= <normlp>
##$PFORMAT= <normpl>
##$SURQMSG= 1
$$ End of Bruker specific parameters
$$ ---------------------------------
##NTUPLES= NMR SPECTRUM
##VAR_NAME=  FREQUENCY,     SPECTRUM/REAL,   SPECTRUM/IMAG
##SYMBOL=    X,             R,               I
##VAR_TYPE=  INDEPENDENT,   DEPENDENT,       DEPENDENT
##VAR_FORM=  AFFN,          ASDF,            ASDF
##VAR_DIM=   32768,         32768,           32768
##UNITS=     HZ,            ARBITRARY UNITS, ARBITRARY UNITS
##FACTOR=    0.250966925370066, 1,           1
##FIRST=     8223.43324360095, -225779,      16819
##LAST=      0,             9172,            47387
##MIN=       0,             -607710,         0
##MAX=       8223.43324360095, 452919391,    0
$$ Real data points
##PAGE= N=1
##DATA TABLE= (X++(R..R)), XYDATA
$$ [...]
23852 69375 -50148 -28831 -28771 39606 -409715 90109 175205 149650 75104 193434 128482 -100872
23839 29951 -218227 -275868 -41899 -99984 245407 99090 110622 -71758 -39855 -496295 37907
23827 -270974 357822 -107027 -139857 359554 -177647 -123420 -87563 29816 331706 -464858
23816 234791 -167630 -245783 -249442 40503 10079 -100354 103110 -10638 97137 -44550 300658
23804 71664 -34844 -99138 37625 -17700 130167 140614 171461 -51724 -38968 -36018 -161557
23793 -161557 -202629 292833 35200 -1349 147038 37687 178266 -47279 134152 201433 -306761
23781 -269789 30364 -144586 -146817 -55709 213598 156489 -62902 201481 31245 201964 19281
23769 384776 -283130 171380 -69631 113583 200000 328558 -138417 47078 217645 -127417
23758 -144285 312667 125269 -3426 -167602 330494 21587 -58691 -61856 36258 -391717 -62976
23746 -73345 67765 90905 222225 114910 -38865 -266007 -140234 -120316 172966 109509 -207729
23734 -356277 38611 -121422 47673 -84635 29872 -49856 -147884 132246 135460 179785 -93636
23722 54751 -82914 -140746 176324 -138406 -203723 -146566 306732 -152984 -307098 -53242 -66639
23711 -66639 42167 -364 88935 -13391 -117804 -98991 177500 162434 -230533 102746 58846
23700 58846 -167734 -108439 111797 112270 129460 63317 241494 -82671 -45030 95231 175289
23689 175289 100204 -277088 -236302 -141200 4301 30285 1396 -9113 -77542 16909 -77921 -128564
23677 -128564 -143401 -235111 254398 447789 55330 -101672 213912 -39138 135369 -329817
23666 -252231 51747 115804 211156 43280 293897 115163 319139 -353714 -82388 -122500 -164377
23655 -164377 -582347 -82437 -4744 -125935 -230701 3392 -331005 -105194 -269396 289455
23644 -76373 81183 363697 33310 273130 10943 -197577 -212398 -171492 -26442 -85902 109023
23632 135554 -770 -108098 3518 -63522 -7934 45906 -214565 8427 -175822 26809 320270 -192673
23619 -101082 -73446 -36337 19232 98358 -126478 -107455 51756 -43427 161867 103252 4056
23607 149381 89245 150076 -265320 -9919 60754 56346 -80317 -255608 58035 -64861 325955
23595 61914 -135025 -79799 114155 41136 -42848 -274943 -187413 82460 -138171 65590 -227736
23583 -141609 81373 305796 -146266 433490 -98451 -165193 260192 100708 165068 -35734
23572 36215 24299 -96982 -43976 -236519 87218 152881 -23088 91545 185910 226510 -35393
23560 96009 214809 -68136 149869 -326611 -218211 -69085 57844 -201773 -27464 27223 -111194
23548 -349057 -110687 223940 -66433 -55829 57656 -67388 38952 -45906 -74704 -185032 -22021
23536 -9265 345332 126869 246009 218407 -206751 47435 16978 -349397 -151560 168938
23525 15943 -286453 -154162 123337 37730 380223 -89046 345291 -129407 -78176 331437
23514 -60133 -143949 -335488 -129910 -238552 -177623 -138849 98290 50743 272773 123636 -12215
23502 -19217 -321530 340564 -153368 -122296 51239 -134534 10313 -64062 -165863 50036 264100
23491 264100 -58497 -317715 -20731 -142040 175632 68761 291209 312498 -78061 357133
23480 -285767 46537 -178176 -64943 -206941 27130 -110969 82462 48724 -79392 183002 -67659
23468 -200938 -305669 -211652 -97154 -155958 -330778 62738 96788 165534 -30257 -240957 18613
23456 -242678 228370 -197909 33742 -50832 557 -99838 7608 -27512 77706 -358476 -21126
23444 -157133 -172867 -139005 -333927 -366561 -90030 106237 -285094 210068 -107663 -97646
23434 -97646 187228 157750 151032 199270 114103 -125904 237408 239120 121850 -131063 137546
23422 -49022 152402 -93279 149341 222408 128566 156187 -359986 7339 68958 -102708 21805
23410 -348312 196180 125067 -88003 294988 5138 -62698 -22518 150425 -5818 133785 -31541
23398 570 74854 166979 -49624 -176448 345130 18695 87756 100143 35008 -14608 -215167
23387 -215167 64724 -75152 -36184 215451 -22208 -210264 24673 90160 186408 -154395 159055
23375 -189780 -44090 222625 85332 246666 -36054 -6772 142668 93202 -95214 180201 -4774
23363 -24878 -288609 114285 16574 -22835 29665 103871 -337635 -171168 133451 -125151
23352 82813 46874 64311 64077 -136137 18376 46075 -503952 -121535 250319 -104001 42827
23340 -340879 79684 214918 -137322 89508 -74774 -194281 -154630 -196563 -33551 -68679 10641
23328 96820 168 -179629 322132 61757 314738 269154 -498423 -109167 239077 -112932 254575
23316 -7201 32838 -45424 59073 68721 -89056 -200943 -421376 -95864 -143186 249622 -343707
23304 79479 205533 165242 -117851 -227476 128292 -77588 282719 222360 -320022 72028
23293 32705 -198977 -136385 47131 -127853 121301 61507 -163492 -15731 -78960 -126863 204407
23281 334765 -228162 -50644 60133 -27709 201270 -196887 -143345 210169 186228 -15085 -123923
23270 -123923 -2592 -129913 -228226 -142776 -75791 -230780 80708 111499 75042 124437 -294315
23258 -60261 -170091 122645 -51247 -66186 108546 206902 158121 -247292 -461649 -6321 106299
23246 257108 -95608 -66624 -145156 -24260 -138184 208487 5895 -256081 -16629 -139200 -220678
23235 -220678 868 -231454 -85384 -171527 -285466 -97607 15967 346145 146680 -423003 -358858
23224 -358858 92020 37660 -234156 -32010 -73870 81904 -323437 -277615 -127762 -96060 -207686
23213 -207686 -77857 49482 -88453 -28527 361666 252924 93494 36289 176582 147439 78599
23202 78599 -51070 114904 -173218 -26768 -84925 61884 -68593 109993 -69653 -121419 -59448
23190 173961 82492 108236 323937 140081 -194949 51481 -100591 21365 64742 -173546
23179 -219982 -285989 -22251 502 -151401 -38059 -60903 -284528 41018 222731 12026 -53933
23167 -76046 21100 -88799 177837 230338 -26323 71594 33805 5568 1442 -152319 221609
23155 -156133 -76077 -61605 56087 8312 71181 -238596 -49906 84004 49712 -208697 -194546
23144 -194546 389040 103963 65145 216742 41221 38744 245623 -99648 291834 -237870
23133 -76028 191580 -80041 -205639 -122559 79126 111074 -96932 -230940 17750 -222068 90278
23121 -18870 -172236 -153134 -59283 247802 -31080 202265 236513 9184 148954 -211326 -49970
23109 183229 38366 -108911 -24300 125569 -150114 75988 -216840 -29639 103042 -181152
23098 339858 255680 -127212 241710 -129822 -193660 102090 47213 145540 69085 -149969
23087 51071 17091 -413939 -152941 -457917 233364 192927 -63616 19631 -177282 169527
23076 52176 -87790 -136849 3744 47859 -26823 -36893 82878 -130432 3287 157432 -73556 38252
23063 -68672 -497019 -117450 154161 -1232 73068 -68210 306677 142626 -288001 305675
23052 -78200 -1511 298086 -164977 -32527 166289 -279882 466288 146174 -39632 -149399
23042 -149399 69332 -6030 -228762 -120170 193191 96552 -8154 48018 238096 -246755 75077
23030 -1802 15538 -119548 27799 -12419 -8682 -122086 -188695 -386473 -145361 -111032 -140613
23019 -140613 -348353 -148248 -54702 238734 331196 337683 66543 -158868 9861 3522 51407
23008 51407 1744 -51962 171142 152848 -6311 -148685 53510 -968 -113895 134594 51279 -30309
22995 328792 25901 -21721 -27615 213027 80313 -370960 -196029 -223755 -102189 82848 120802
22984 120802 154295 37450 -230228 54279 5577 -7007 -65810 -99559 -3242 308096 -202947
22972 -107864 63242 -149369 340041 -230425 -150258 133530 119201 -184266 -210644 -75896
22961 8318 -159399 -22974 36693 -96655 -49106 114345 54793 4481 -50188 -5619 3573 -316643
22948 -116282 -49583 94171 -113850 340032 -92088 -105764 -52979 -305895 -66546 -31590 -138793
22937 -138793 104640 -140823 -6295 -111035 -165868 -10273 106336 -48326 29835 -329788 265296
22925 70135 -113619 67248 51997 -16733 -49864 -85393 -213598 -175423 230512 -120211 251858
22913 -31067 -95716 -316176 -23433 -350922 25206 125389 38773 -254797 45748 -145544 49676
22901 103704 -198025 190322 -114264 -29382 31059 -92554 152585 102285 99934 -221662 -53780
22889 51343 41153 -95786 4922 215902 -189662 75542 -150780 -384541 252833 -145426 -335391
22878 -335391 154058 -55349 66315 73322 -125921 -133124 8016 40063 301067 -242921 98825
22866 -115241 -153979 -26292 -220718 211732 83517 -22033 -258348 412750 -91256 -403956
22856 -403956 -180004 34706 -27507 -98486 58248 -96683 -30439 -151388 173920 62215 94736
22845 94736 248231 65493 -81356 146976 123065 83081 349351 47224 3088 -13572 74587
22833 -38084 -149404 24311 2258 10791 -275839 -253040 -168364 -339158 187289 -61445 12610
22821 -9114 -9586 -49122 -182176 -204521 -229794 384297 -246269 -351565 -233065 -128056 -43725
22809 87879 -310216 -140243 -190133 54276 -283610 -185952 -69198 -158085 18703 -137285 69183
22797 -26196 395800 -159873 -217130 121240 207073 9500 -144758 -185223 -399850 230967 -490857
22785 71792 126952 35235 246585 -205550 -132752 -136971 195357 232270 146410 31750 -222239
22773 -169964 127091 -75274 -155696 -178702 -129903 198092 223656 7418 268215 139881 -246894
22761 -132904 94641 28805 100913 12250 8092 -156738 66868 -151796 123279 60000 -232393
22749 146112 -301736 -401307 -231940 -176107 -80394 222153 273666 133382 110548 48352 172107
22738 172107 13204 49483 118766 21166 -508779 -345962 -122133 -1271 -116480 112370 159904
22727 159904 84029 -85374 209723 148111 141031 -103625 -108817 -188316 227335 -108372 80061
22715 102642 -6140 94218 39746 -8327 -303501 -56712 -307810 94122 -24930 5868 172604
22704 172604 -134877 -69906 44504 -169816 -120961 24914 305761 -355348 -38484 -129907 6093
22692 -298598 -315284 66661 -57108 -2905 29987 -201059 -161187 -99952 -233243 -44246 128795
22680 -109072 50748 342220 19699 188500 44176 -14817 -788 -228231 -210193 94830 -117416
22668 -109389 144424 242767 -77945 -88182 -158655 -190307 85026 -178160 -48409 -155754 15660
22656 -106957 96223 -6616 -139631 -182302 170486 28753 -177201 -359215 335501 -162810
22645 -276224 83827 -432100 32168 97375 -22601 86626 112653 40518 -17749 -121996 -60508
22633 -104942 136688 140447 173957 -5548 -169291 -291220 -186688 87186 -15460 90483 -215187
22621 131580 -267067 -89211 -77645 -223859 -261407 -277673 -13275 -81382 320727 6871 -164590
22609 -3463 126561 165655 326439 99719 16970 -184892 -195511 -3218 -89190 82187 38635
22597 226595 60807 308645 115039 140379 27976 121165 -171421 -25236 147577 303239
22587 303239 -165736 -68501 264776 43211 -47882 -146363 154642 -24019 -101726 -99032 -11016
22575 -323325 -272650 58997 -54742 47672 -146200 5002 -86239 -124534 -120458 -35059 -49733 93857
22562 -232609 57296 -15103 -52807 -55140 183894 247905 -300605 -1378 99144 -270062 -178484
22551 -178484 -176056 -33260 35741 132970 60451 -126198 -51747 -82680 85941 -84152 -116694
22540 -116694 2515 -43261 -179433 162079 -86317 -260808 210589 61897 -85236 4959 -67213
22528 -5402 -41491 -146861 15151 239845 -274071 169340 364126 -242553 96657 -45924 -115307
22517 -115307 51646 -72422 -61448 47007 56626 14541 219694 99297 290216 -162745 -101714
22506 -101714 135151 -77776 363239 -78273 84689 -132892 -296737 -425874 -110364 97201
22495 -177078 -252614 -241426 -156768 -313138 -301670 -100562 16433 15606 -116741 -64124 -182803
22484 -182803 19559 -42488 -231108 -247875 -44236 -68176 -67429 134495 25164 -190940 34840
22472 28074 -96827 -6310 -238832 -50918 100114 -31374 -11807 -144060 166784 -27464 55062
22460 3802 -268311 -426244 -215223 -103267 287425 297767 1683 79399 -177033 30498 -162432
22448 59255 -62600 -22382 -163273 -75560 -98859 -52486 -83364 5818 173235 -406390 -17809
22436 -366562 188921 288410 -121177 281616 155613 -111822 -53145 12000 36522 43522 -120154
22424 -7717 104722 194880 97477 -83231 -250647 -105060 125735 -349829 45914 17970 273658
22413 273658 108684 59341 -247541 97956 -145318 -101564 -68302 119488 -8707 -189859 -120724
22402 -120724 -17454 249104 -209253 103922 87860 42488 -259486 100424 -179897 -180194 -25792
22390 -301365 249429 3279 -57048 -33600 141918 22670 -60313 217566 60590 55303 -124141
22378 -45766 -14187 -283571 93134 114187 85466 -48127 -11000 67799 -14033 -135663 34630
22366 57965 -79739 -10436 -255729 170260 -208060 -29438 -168689 19878 -96203 182793 -224799
22354 -19162 -13842 171497 -199297 69573 99234 -252961 152662 234291 -240591 -318792 -127223
22342 386504 99650 -7058 -159213 185181 -180923 -43637 34224 64600 -122465 -106340 -471930
22331 -471930 -248751 -22554 -250118 208352 93741 -84825 189891 103605 24785 -167642
22320 -241675 -200891 -205826 343698 27778 99902 55557 -132946 11785 327367 35308 -66808
22308 -91320 -38692 -86478 -96599 17502 -145064 101698 118149 87946 -169360 81615 20857
22296 -39442 -107690 48891 109706 -292687 -33229 185099 316447 -218108 -247504 -86708 -156433
22285 -156433 21592 -123496 134701 -99237 372723 170088 -51831 -74872 51405 -139960
22274 105312 -393757 -141331 210770 48492 -17638 62878 -203505 -79044 -109282 -149169 -181741
22263 -181741 -279373 75310 -4668 -227213 -60541 44782 -94699 -65338 -194851 52298 90344
22252 90344 -150854 -423106 -126499 66794 54031 -254480 -132399 83722 -55467 -134804 -172771
22241 -172771 -107674 414993 -302577 -200844 -5794 53634 144334 -241414 -119759 -9741 -147000
22230 -147000 -78243 92277 -54206 -70842 -105958 208796 616 -8144 45744 129290 -119713 82015
22217 235277 101720 -31979 -948 155666 -102762 217912 220997 -41477 203243 34299 99332
22206 99332 -117669 117819 -55819 -24864 -99128 56886 -147855 -146913 -353169 450265 -51241
22194 -150672 -92145 -124718 -52269 45213 -69494 161273 25187 106904 -91790 -155280 390399
22182 165597 -32370 -412687 8945 -272010 -116670 215557 -1153 -308555 -74906 105001 -222189
22170 -358156 50020 -278980 -227771 64620 -2402 76322 -729 -6082 438450 31308 -56012 45072
22157 -172720 -44833 -325425 279672 186637 -71542 -268107 -117611 78578 -98876 -224372
22147 -224372 -41103 -355322 -68245 26414 174495 85827 32417 -183209 107315 175321 34302
22135 34258 103098 14445 -210291 -265952 155037 -195044 -220298 45066 18517 57482 47996
22124 47996 57416 -377646 -103142 -46579 31981 6831 -90505 -99049 -269195 14380 -195382
22112 -12160 313280 90875 395086 -144688 -143966 128729 -268 384067 -227517 -301353 203374
22100 -59217 144471 -20609 -349216 -156691 -115909 -293069 135212 -85889 -62284 166170
22089 -300117 -8299 69683 62953 -22133 -104320 194451 -62419 117577 -99781 -156357 -326797
22078 -326797 -230753 -58584 -242114 -169651 -220809 81023 -158131 -15730 185104 45055 -36863
22066 -112504 138714 -171464 77775 -79277 -316480 100578 -11559 -137754 10211 -462844
22055 214806 -217903 141765 -89555 -116249 50233 -74200 31407 -262995 24517 118053 -203621
22043 -343043 -15319 31183 148440 233498 246140 -61435 -202295 -39214 -159006 -196959 -13567
22031 190256 116988 -131127 71140 -76446 -255801 -384489 70939 68021 -141444 249115 146480
22020 146480 -199085 -91645 162301 182360 -378982 201824 -8770 323321 148456 -78913
22009 -219668 -48541 254955 74091 -442867 -238274 -147045 -142136 -120916 219002 -219226 79303
21997 -45501 240367 84633 91642 -76847 -154800 -278816 117507 -98250 239978 -236314 -164444
21986 -164444 -110001 108409 7705 -434733 298796 55196 85723 31904 213100 22815 -104823
21974 -328446 64252 -452495 -30732 -79737 -38542 -178063 225379 151293 30786 -289280 -34337
21962 -60307 62114 393804 -78624 -265932 -36824 -466573 -147554 -98403 -11231 -67267 -254378
21951 -254378 29236 -127184 151926 -226422 -120472 383478 140142 217297 -267218 -27838
21940 -277354 98348 262723 -228626 280905 -228090 -64627 -68050 -171850 77745 -49249 -214325
21929 -214325 -197602 -182868 103793 5592 -448825 -93640 -547650 -38804 -18536 -138984 168075
21917 -98811 -289561 -48999 -160214 -80133 104809 -197281 162850 -346918 -4296 75542 -368190
21905 -105297 -184986 -266729 83308 -69042 121764 282820 6383 -195309 -168356 82349 -227055
21893 -269517 45332 -122692 91738 -468905 -269304 131676 -81273 22531 -36447 -407374
21883 -407374 -89695 -546586 -14160 -215360 -94924 93178 37105 -345301 251183 -446523
21872 -236150 24422 -168063 -26960 -1726 -121683 -292230 191990 137508 238658 -244375
21861 115504 -158278 92067 -91275 -77191 141561 -241157 153068 -333886 -6598 -83186 -368570
21850 -368570 -105309 -123027 -68259 2667 62530 -52772 -301018 24353 71456 -210792 105006
21838 82799 206162 -60929 -93840 -156713 -126904 -344033 -345723 -129674 142558 3585 -314303
21826 -149134 165647 -259506 -175286 -139233 11347 -28277 -163816 24009 314515 -85184 -107452
21815 -107452 -250038 31124 53869 -150267 -84163 384887 -236815 45241 -68530 69346 57881
21804 57881 150545 141525 -215609 331892 244268 -119904 343114 367796 85119 -94304 -198411
21793 -198411 169473 -235302 82578 -92476 49069 -47812 -44406 130843 -83807 -66969 547558
21781 -72442 98854 -249421 68698 -95082 -13567 100264 89537 -249309 177317 -340630 -301629
21770 -301629 45017 -95506 -179623 71652 -52629 -152696 -111019 119859 -111613 -22738 28103
21758 -179458 -227230 -195301 -41057 139755 51094 -210897 1330 -219480 9174 -286330 145854
21746 100314 90924 -84992 -66476 -108204 -46934 69241 115100 63064 241923 157171 17490
21734 -14568 -346895 -211348 -239960 -31140 -133158 -21384 41580 -195519 -93365 358363 284754
21723 284754 -168702 -106701 -14160 -48424 -29750 -220081 -173490 60787 32346 -105761 -211178
21712 -211178 -336437 -155232 -121612 -322040 339446 332080 -9544 79161 94913 -417304 -136565
21700 -145173 -86614 -224492 -419187 -36992 -94686 -405474 42115 -399319 191952 41804
21689 -121980 107807 -402899 230147 -406195 -165865 -64091 148310 -221369 -75985 75709
21678 335793 -49024 -40276 114897 -138301 36274 -63824 -73174 -19808 280183 -204288 173398
21666 108877 -121620 -87561 -144117 61498 132582 52572 -185430 -94132 117916 106896 -135152
21654 304777 -20059 116656 -77541 87952 113299 104925 -141334 113045 -130741 -9374 -86253
21643 -86253 -67979 -90839 -7124 -51478 17092 -224104 -21256 -76377 4143 54006 -264087 38572
21630 56566 -185552 245705 -220784 -221609 -282972 89237 31876 401179 -7115 89563 216276
21619 216276 -79912 97590 361123 -44595 -45225 -82865 -7768 67982 43918 -54437 -346287 116563
21606 -423007 -452594 109604 -276883 286129 12047 -12156 147620 327981 85354 191267
21596 191267 11279 20136 -210423 98775 -54816 135667 -265796 -123254 -143416 25584 -82452
21584 184558 -169332 -87563 -189859 -68135 -237424 223979 -120709 -468828 -143326 15659
21573 92775 -300962 -5769 -96646 -230000 -53879 40576 -88699 50790 -114936 -331007 -10406
21561 -97664 -98319 52463 -137752 -36588 -338002 -179373 -273328 94359 23099 -250663 -89445
21549 60846 -158937 462705 -173927 -61692 -9567 156769 -178785 23441 -173286 167393
21538 323136 -292601 309045 -106454 101871 205890 277343 88171 -146468 -116793 -179602
21528 -179602 282936 218486 195090 -119110 89778 -189107 -124364 -60971 -175025 -23455 97388
21516 -94013 -310256 -327644 -148882 75091 1227 137867 -29664 13778 197923 -192201 -22779
21504 -364473 -187164 -258525 -29928 -70556 -17444 117066 -143609 -461418 99859 -139899
21493 -154054 219764 157577 -94678 46850 181017 -291057 96024 -285276 21177 20547 -20498
21481 -47957 -232513 -123576 -401941 -103561 -51484 -274986 -194355 -173924 -88616 51003 -172174
21469 171640 -97828 -149675 176895 -29912 41546 -63889 189268 119667 -500882 95901 40985
21457 -353537 -247763 -83549 30119 140747 -38405 -272912 -119075 8708 410162 126585
21446 -20929 137469 -495033 68047 -254596 -20512 128216 -200906 -86260 -52879 -254432
21436 -254432 -278717 -50971 -158433 -198703 -38634 -10485 28490 -130171 138418 127147 383079
21425 383079 385683 -106576 117767 -76781 41868 14928 -14514 429210 -189485 -206247 135064
21413 -215321 -194452 68784 -71480 105477 125562 -97729 -274791 -44728 -147951 -199544 -100364
21402 -100364 -33806 -88346 -265171 -166100 12181 -17361 110454 -171408 -132150 -134816 -193084
21391 -193084 -93952 -62009 -276782 34155 -178215 240205 -154711 203256 140431 -51914
21380 53039 125281 106752 284020 186588 64667 164863 102441 263269 -161140 194032 -123951
21368 -398948 401097 49763 101005 4590 -91432 175130 192499 -142889 -76012 -48757 89995
21356 208620 188286 -77533 -180164 1912 15154 -214597 -134797 128192 -20063 -57813 -153132
21345 -153132 32059 -320349 -18977 108926 -54412 -199015 -123521 73284 -48911 156354 29809
21333 -298900 -209916 173422 82050 -126494 193360 51126 -138981 -170787 -174620 204775 -317852
21321 145918 16978 142803 -219176 252239 -117748 -134995 -313166 -41882 -282172 422022
21310 6975 -370440 176806 -198623 -75680 -322966 -16239 -218446 -66389 -228970 -204945 -347319
21299 -347319 -28295 -65827 -168176 -7995 28015 -305276 -243238 -304120 -240728 -223737 20883
21287 232848 -204537 456379 105075 -100887 -321621 -24280 50805 48384 -88706 59613 -248022
21275 93577 -125391 -84280 -129172 117251 -70008 4457 -224359 101077 98323 95348 -114829
21263 -177665 -133839 -70869 -62555 68738 -229947 -59846 -190189 -18559 -234154 -220727 11956
21251 -103045 161838 -37367 -232200 71662 -129568 -91650 -357408 -457625 -370966 -90188
21240 276203 26750 44175 22127 229016 -218698 44096 -267099 -257531 -144191 6185 165392
21229 165392 276655 -119934 -18667 -230605 -7947 330068 -552625 90638 -337739 -225462
21219 -225462 -149383 -60577 -71186 96820 -288093 114142 132223 -30730 276106 -115736 61500
21207 91842 -179249 -40702 -96272 -95255 -95693 -263235 -52685 49980 -40525 -23754 -46148 -44991
21195 -44991 18531 -258024 -198671 -91610 251735 -381748 -158717 -135902 -207816 435908 -131044
21183 -368324 70117 44336 8422 -163538 30108 202097 -234510 48319 -105722 96969 120698
21172 120698 3892 -28193 28874 11795 -211106 -180382 -376986 262005 -182154 -69684 -282369
21161 -282369 -86835 106934 2071 103291 -63706 -257819 -160555 -44357 130923 -355881 109823
21149 -251470 204516 -85013 -81252 71576 8969 508427 6050 -275852 179667 88371 66765
21138 66765 -50943 418145 114038 -260272 6291 163183 -171948 25298 -88148 -77814 -122984
21127 -122984 -124914 -280344 287059 -159790 -445773 -247730 -84774 -19274 -26958 175283 -134745
21115 112933 -62313 158150 -463975 -215726 -87205 -96391 -189546 -231459 -59380 119100 -127722
21103 314883 -228333 -18255 -200355 -108921 42075 321101 -109366 -162969 -109902 118839
21092 10410 -12853 -65462 -293156 55591 -215523 -152502 -9984 -238915 -398418 -223799 -338624
21081 -338624 191173 -211651 170316 -54080 -53674 -219743 29268 31841 -203158 -84479 -221112
21070 -221112 -175824 18067 -17701 217069 -2079 17294 -122832 -86262 -57046 -71189 61252
21058 279239 80956 229347 102632 -75181 92740 -58972 -234588 65363 -161232 -7826 214946
21046 -112943 48973 -56023 -125307 -255043 76206 -61376 -276356 -2360 -43900 -189559 -46279
21034 48654 -2452 250281 300834 -60358 114664 -433081 -139941 -334718 -91026 22622 198880
21023 198880 17336 -244826 71638 -197477 -128467 -24607 77618 -266964 -4228 -437493 -166572
21011 -228388 318104 -277203 -94573 -244992 -4534 -23134 -39729 93329 -158994 -78630 127797
20999 54289 26029 -70200 -37446 -295581 -159 -103766 -71368 -327549 -57217 100234 215232
20988 215232 298087 27474 -161991 -298204 -64350 -25101 195189 -575559 -309006 141960
20977 -72616 -183611 59384 97716 7419 47398 -114863 -189659 27437 58365 79292 -82023
20965 88338 57605 323250 -75391 156045 -122549 -61137 35771 -182841 79755 -134851 -111481
20954 -111481 3536 -85943 -1656 239427 -93028 -335014 -428646 -274303 -8530 151742 -82410
20942 24104 -35972 149336 -61538 -93641 264419 -143353 -52554 -36667 76783 131285 46482
20930 -78262 -14673 147096 -72852 -2685 56429 108647 -157352 -186550 206297 -324786 -455154
20919 -455154 -310424 -178068 38766 -137866 159333 128634 195649 -8060 -20280 -111842 -58958
20908 -58958 37332 21315 -118434 -229637 -522 -46760 -189235 -30263 114262 246307 -25480
20896 -79643 52895 -50233 -165449 65822 -93604 164572 -5018 110223 -102351 125676 113382
20885 113382 -180144 -210831 -55514 -386705 -71375 -97542 317 -66631 210179 116258 144057
20874 144057 -409275 -155608 -109872 -574534 -67043 -22952 -112461 -36247 -116936 233219 38234
20862 -19179 -92527 315589 -47077 -90536 -295262 115963 -373910 -342224 -155188 384950
20851 -39736 -342852 -203760 -345486 -50483 94287 -26612 34971 -45429 -180757 181861 18249
20839 9250 -138205 -465882 -136433 1356 -295800 1354 -227911 -28760 149332 36771 -352673
20827 -178115 266513 -311287 218671 -112114 -6517 -435138 176253 -7991 -176948 25766
20816 68204 -321110 -84484 -145795 45922 -371173 188522 -390161 -179679 134608 -388727
20805 26651 -141360 79550 -134505 -18232 -133693 -149225 -127556 137908 39697 -392536 -92820
20793 51437 15248 28687 -11255 -195916 40285 -245613 111539 -155462 -132084 -58861 -269279
20782 -269279 -163292 104909 -21688 37401 -154917 502895 -61245 294699 273810 -109654
20771 -140180 61540 -237456 117834 42045 -139409 220073 -54592 -32746 -97349 -54553 469559
20759 -462917 -6435 -446387 -110900 -97293 63114 -101579 -54463 44734 -102421 -338684 112647
20747 -81181 30185 66987 177056 46720 -111444 272431 146441 26446 62092 -28537 -68222
20736 -68222 -40664 -15239 39404 -157330 24797 -276543 415904 -5866 -143395 -70904 -73898
20725 -73898 -320241 63296 9314 -219572 33810 168355 -332328 -166686 -136309 282952 111242
20713 25643 -38926 -10814 -135081 -271070 -14532 -363985 25501 -90522 -225435 -44420 52046
20701 238807 7838 -128742 34787 -183452 -369447 -45358 -113142 54406 -245485 92935 -79660
20689 178695 -142654 20758 -13051 -17358 95364 -7284 67912 -208330 390521 -219803 29725
20677 -69582 -300039 -119238 -414365 -233754 -220459 -292226 -99351 17743 -90967 -157876 632013
20665 -48830 -8626 168194 80406 68551 -184423 -14146 163796 -7417 221601 -207821 -80331
20653 -349904 151231 8821 -350496 -249871 -130229 -18463 -66426 -8236 -438644 -37921 -23540
20642 -23540 -163670 -1530 -110065 -117190 105858 -49400 52603 -21046 -325047 -27652 229875
20630 -20424 -174221 88841 -152456 -237981 105350 55945 31762 26754 45159 -284841 -418530
20619 -418530 13813 24598 -253027 -17185 249197 -1464 229123 137611 36829 -209304 -28412
20607 125229 -24877 176667 -424392 -306868 -385404 -15916 38816 -201188 -110381 155070
20596 -32650 630 -229224 -35181 -333948 196214 2476 -218942 173746 -197338 114638 -149100
20584 26118 -16341 -122434 -151996 -201145 -192394 -92508 118404 -202080 61491 281802 21153
20572 220939 -218542 176587 -164681 -15268 -170718 158565 -9594 -24916 -90775 10404 -88814
20560 163777 -61132 -50428 -69850 -152776 64610 149537 -21454 -112946 -81551 -5733 -270166
20549 -270166 -410132 300660 131099 -152698 -56104 -268772 161023 -240586 121008 52736
20538 -97296 -52231 4906 43328 -247478 -115580 -20410 -237597 -373058 158294 35289 -39925
20526 40501 -242670 -57845 -197962 -87569 -91419 174429 15401 -141383 209953 -171133 61981
20514 53693 -296622 -83769 154466 -94266 -165454 -232382 312499 14563 225267 -291779 -193113
20503 -193113 170610 -47652 8100 -169108 129967 29903 46703 121538 105023 -382960 -157650
20491 -240271 107336 298136 -232235 -87911 142889 -129950 -88201 3238 -172916 -23517
20480 136439 -319348 -103396 6676 178191 -55915 219495 -274569 -157412 36750 -77666
20469 -157739 -70107 199658 23302 -39001 14421 -40386 247396 107220 -67050 46544 69197
20458 69197 -165560 161845 -261746 -84340 196270 271446 -107938 -331331 -12101 -124664
20448 -124664 -28997 -72616 -85470 113187 -122346 -50134 302770 84484 145304 42448 -197731
20436 1161 -154953 8441 20030 278466 -261342 26165 123698 218414 -56551 -148582 -51407
20424 -284923 -11321 -175783 -155428 -46808 -263288 60408 -114306 243061 -159450 145764
20413 108971 180226 18580 97766 401449 18187 -101163 -247987 244335 373580 -275748
20402 -92858 -93636 -194775 -95283 159366 -127857 75104 -130574 -143621 -201061 -171062 -315965
20391 -315965 55933 -280510 102156 -230095 -3752 245440 136781 -3398 79790 -380772 -78790
20379 191646 212270 -79575 -5503 174600 206470 -186208 33804 -225113 48204 74347 189036
20368 189036 -106577 -188819 -49749 -169232 -215665 282710 -63183 -179730 -144231 -182571 62279
20356 -222346 -212847 -174983 -21430 -133477 -74514 -243609 293943 -168043 -63970 -249622 -217757
20345 -217757 213424 -5783 -290430 -108622 83285 -126702 -92834 -56769 337798 -119878
20334 309413 214531 -219012 -116417 141232 30800 150190 -74851 -163897 -230717 -92222 145082
20322 26554 158745 -70113 -172309 -152094 -65796 132693 -99943 199663 -12505 -247868 103669
20310 93740 -92996 -380575 -203848 -323148 -322318 -329811 2900 -31332 -154455 35708 -44737 -328938
20298 -328938 121611 61294 -322280 -529694 22812 131210 197711 -327766 215199 -108706
20287 -18207 9954 -29488 -189016 -38916 49517 73387 73768 66406 -128554 -59430 10468 442005
20275 442005 -87628 -274213 -349053 99478 80446 127389 -99395 -77860 71999 -17407 -13504
20264 -13504 99115 -364015 -50742 178363 -148602 -33198 -156387 -39704 -15973 27457 -12221
20252 148897 -94921 383285 -10161 -25233 -69678 -6893 -114089 -72879 -130288 139940 -221699
20240 -153758 -13133 -120839 95700 -28943 -144627 -279631 13866 218611 -109026 -266977
20230 -266977 -38287 225194 42370 69717 138575 -208863 177339 -224282 116953 -347882
20219 -303219 -61704 128693 34085 257367 -23113 155029 102447 -326237 -43539 -195411
20209 -195411 -112007 -350385 226621 -63134 -211846 -72002 -82132 193930 178484 61021 -315
20197 517693 -288453 -116274 125570 -93278 10051 -89823 -226619 -43912 -121015 23551 -239569
20185 -121506 -86081 289453 -20418 -12242 -177007 -237547 507409 -215342 364433 53649 -43479
20173 -125563 20303 -119416 240114 187487 129497 46708 -28909 -184764 -173889 -87621 118094
20161 -132609 153148 -175857 457645 -17352 -67268 -175145 284611 -95813 -233460 -252424
20151 -252424 8080 -141768 -55208 -76735 -272535 224373 -507182 -199206 -85860 -118192 -234287
20140 -234287 -195653 -156977 -197577 96723 -54668 -45668 -273841 -25854 -445712 -43961 206299
20128 128212 -61487 -100460 -285063 -259376 -4611 42993 -187511 -97542 197797 -346252 -54717
20116 -36742 4615 -96483 -135669 -316737 -5885 125520 163837 -44675 -200570 -106007 -274608
20105 -274608 117666 4048 -106356 -31554 -174838 -18296 -138188 -49625 -28260 51688 -221289
20093 -102481 -94476 60723 -93184 -290360 210923 -152415 9666 118033 -61940 -212117 83726
20081 -241877 -76494 -438916 -107613 -44882 -163502 260128 218157 -217714 -274673 191644
20070 61880 285152 -103930 -100703 -282033 -127436 6396 22457 -124480 -137682 157266 -99397
20058 -61861 24305 -174667 -41175 -15920 57987 182442 179453 239460 41064 -261524 -227538
20047 -227538 124633 196001 213011 -199740 -230037 -260640 47222 -170945 58556 -16008 -330589
20036 -330589 191679 -102244 -384545 -153987 -47482 152411 153419 -111263 -114044 -146950 -114028
20025 -114028 -272760 189335 108937 113681 -182385 10910 33288 214644 -101371 105702
20014 -43934 -395553 -180626 96240 -98464 72619 -142139 157974 74634 84650 1708 -295353
20002 -11072 67098 322150 -215724 -120382 82311 -51751 113883 -10511 -157774 147279 -94816
19990 27605 16093 -126041 190195 -149822 -136264 -17673 -350735 -164780 -132157 -456834
19980 -456834 -102251 165376 78553 -12751 -77170 -26616 -25198 28487 -232607 -65260 -245705
19969 -245705 10420 218090 170433 -9449 -192077 -169917 24330 36221 49039 99728 -16881
19957 -222579 -103862 -92305 68465 -51553 58362 -41388 19837 -22152 -240689 -486047 255109
19945 -182819 110023 -100547 -56904 149091 72568 50417 -55760 -260541 100769 -196856
19934 36861 -13035 147289 -12983 -143384 -225880 37551 100558 -263961 -7995 -163495 -25125
19922 -306836 -138268 97364 134712 118480 31630 108013 51768 192728 -182771 -84335 -111676
19911 -111676 -33719 193343 79699 -67367 -62314 -172113 -113883 -198678 -268641 -284347 -96592
19899 -224497 85735 -371969 67850 78841 38410 -54110 23237 -388846 -109355 165298 -66151
19887 191984 -206224 -170055 -977 -251487 180876 -271308 -5872 180118 106700 -306512 -290671
19876 -290671 120194 88317 100761 67824 -76300 -139421 -94773 -206797 101393 225701 -254078
19864 -74632 71994 -165380 -76649 -222758 -18398 233636 -102435 19356 -149139 232762
19853 -203327 -11192 -136063 -108539 280433 150058 -5663 150089 -395991 9030 -17749 96068
19841 -57897 304555 -140957 -52913 -309443 66527 -20049 -210531 -48608 -30509 38974 68138
19830 68138 12024 -231807 -66107 -133479 -140419 -64390 37529 -52699 108326 -207385 -310243
19819 -310243 -60641 288234 -99607 -205643 -163889 -287268 19561 257518 -28222 -122908 57141
19807 -271151 327504 -148597 67776 13016 -36775 268815 135298 252106 -1351 -117625
19797 -117625 357924 158245 -115556 -55608 -70219 -259754 -162800 -208755 -245673 95621 -40534
19785 -125651 201538 -87204 -140098 17881 -300992 11376 32137 -51463 -72913 60647 167673
19774 167673 -162271 -211896 131794 -122035 -300017 521916 -136424 128814 -133379 -172136
19764 -172136 12297 21338 -22469 -450237 -163602 -130667 156730 -24961 46513 165439 -267372
19752 -95297 -134765 128905 -278564 -167255 67004 22908 -68787 -100478 -70324 143369 61317
19740 -252450 14109 -109398 -134862 -212255 -183942 -206018 -48630 -19905 -18615 -105977 -186209
19729 -186209 82694 8728 -129185 -9371 -72826 -24105 240560 -206017 -148438 72767 -150350
19717 -141852 -67580 81204 -297404 416254 477449 226597 -116536 99661 -127152 120091
19706 -188017 -214005 -238872 -134875 32793 -158176 -235458 210180 -68383 91361 64119 -24944
19694 150311 -122087 -277776 110587 -41910 -95828 -282126 -123739 -131133 -23513 -192150
19684 -192150 -24649 -54019 -165042 162932 -35171 -10176 -99183 33289 -268086 98889 7959
19672 -180178 292475 -208200 -30257 53177 58359 -100503 -1064 129565 -183298 -204319 177362
19660 -241851 -56161 -240239 -59966 -466682 -318124 205229 108962 -121239 69344 -127153
19649 -460723 93458 -278982 -193549 -194407 129151 3473 -69830 -355840 122396 -140545 -156530
19638 -156530 73456 -239968 293405 -285747 -115775 -185189 -178292 -205992 -282635 289745 53626
19626 117793 250853 122033 -176202 -153503 -92097 -42297 -223328 -135146 83940 80829 97549
19615 97549 -104961 113060 137814 -13510 -307120 -256869 -202654 -19453 -78881 -36255 6739
19603 -336694 -343359 15259 -141283 -86694 99666 -153292 -247098 -112600 35408 22233 56234
19592 56234 -310479 -283353 -167343 -185537 -65494 -103618 19591 -37141 179827 -39588 201032
19580 -116584 194753 -8024 -12608 -193579 -46806 -213444 255273 -229628 61074 159531 -126001
19568 -270084 86279 -317089 -95362 -182265 94769 209824 -185469 -57714 253783 123592
19557 -15840 -1947 -271567 15026 27496 137883 158435 199455 -123071 -185974 317862 66632
19545 -103967 -79821 28255 -80249 -13260 -308788 -106294 -6166 305 -34152 34958 -7427 56467
19532 96979 -124445 -185063 -71157 -138750 330695 38193 -970 21290 -147130 55413 149089
19521 149089 -461462 -59931 243195 -93771 -349756 -192994 183695 -187790 62925 51916
19511 51916 -44860 -57171 -223751 203178 287004 145163 -157071 -400283 -65337 -159726 -86987
19500 -86987 -83613 108049 24082 -10318 -144498 131542 37963 -215560 -26577 -90575 20775
19488 152133 238871 28865 -340549 273637 97399 -69761 -110810 -43946 -28530 43741 115632
19477 115632 -366351 188015 219538 269056 399980 374233 -200684 37649 -347510 -6150 -22099
19466 -22099 473426 150599 -188938 95279 3671 -412565 310563 -229922 -101009 15356
19455 -143994 -93676 25088 -199593 239156 -107136 -12894 44425 -72408 -158502 -68726 -183228
19444 -183228 115657 -9630 16290 -359132 -96302 -300238 -84254 88682 13387 -422429 159159
19432 41759 13450 -42148 177235 -173646 -94750 80224 51415 -29632 -27041 282062 -69409
19420 -74553 -85373 -197124 60130 -388456 -264906 -185671 2400 -56431 -51489 -87362 376986
19408 91752 -190365 -66028 9203 -191074 -222361 111489 -207681 239392 413651 240307
19398 240307 79004 -108479 4798 -93554 -106908 -160685 139728 -214409 -351336 -59975 -16576
19386 -305292 -162354 -326112 -109801 -156209 -10006 73386 85151 -180340 80341 -87848 -265839
19375 -265839 -316642 -14698 -174286 297906 -358850 -137037 -55720 168013 -251360 -283100
19365 -283100 -195596 -11627 96516 -62621 247322 83068 1729 -215085 402764 -534267 -110217
19353 -30325 24465 211227 -127097 17535 -226697 -305715 -101872 -164910 -37046 -214086 369893
19341 -82542 8820 36130 -220383 -166086 219356 -75539 -104235 -87575 224779 195146 -417489
19329 -147048 -85358 -104538 -186679 -30316 29301 -58753 -260082 -159185 -155952 76830 -138552
19317 97853 228272 116242 124871 88321 -149985 44032 -121699 -241059 58411 -131531 223755
19305 -117738 -145440 -284283 -137212 -8093 -239331 55390 -117354 102969 -46719 -326863
19295 -326863 -348389 3129 122480 -397459 64783 -130253 113093 -140010 54189 -132796
19284 -117767 134123 3168 144997 35822 -186179 323887 96794 -157130 -78041 -291904
19274 -291904 55727 151668 -73674 -300879 112603 13647 -105940 -71230 -236291 -134511
19264 -134511 196111 -212904 -56790 -221844 -46209 -193032 -141830 70707 131292 295941
19254 295941 -156966 -158289 42538 -41268 -44610 15837 -12518 202410 14717 -394463 -311240
19243 -311240 -320720 -52489 -93818 -151269 401558 -31118 43586 191351 65492 33585 -173390
19231 -122584 215536 33977 -115834 3649 55230 -138302 131668 28036 -139118 68673 200881
19220 200881 -74204 307794 222525 -4399 360763 154187 -108011 -159101 -56709 -208215 137264
19208 -153996 160949 426510 -87559 -153571 34487 -264795 -17742 -392511 -57034 -207339
19198 -207339 99535 1055 -407094 331362 -67150 -251212 -159405 -73437 209220 -107083 -105698
19187 -105698 123766 140565 19928 -82812 -268227 102987 65341 -75412 116855 -352948
19176 -160104 -29800 13847 35599 3085 90032 171975 -145389 -140403 37184 272307 25998
19164 120177 91878 44693 231505 -313521 -103227 41110 -394078 -445833 -238100 126257
19153 -227118 -295014 176360 23625 5177 66835 -269748 181663 -68212 -16685 245251 -157599
19141 -178766 -52447 -51042 -114051 -7101 260063 161584 24509 22100 -244937 -272802 -146004
19130 -146004 -275823 -9955 -229120 -132513 -142006 84589 383867 -139402 3808 194694 -117013
19118 236840 -147884 -135142 97511 85632 -308922 12826 -229999 -84506 -52713 -397550 -355923
19107 -355923 -203186 -160177 -29958 76334 -184245 27401 -285548 25230 -315790 -5761 -197647
19096 -197647 56596 -131290 953 291105 36812 -349229 -299959 -291634 -27371 -79554 47648
19084 -152428 -123280 184791 296945 159371 -222130 -160479 80719 -257756 -501862 106399
19073 125043 -121540 -147611 -34767 17404 -12597 -144584 -402929 -205711 117812 -51880
19062 93825 -148202 277301 -210835 -107751 -30240 -345600 -34862 111863 -2795 -295350
19052 -295350 156783 239856 -83536 23669 200852 -86175 105599 -208567 -192069 -261108 15358
19040 -380834 -122091 -331757 -46070 61593 -247268 -23293 -108219 -277983 -79662 104453
19029 -85064 -266483 272018 159864 -23756 15778 259720 14826 -235083 57307 -173091
19018 -88535 -66509 19024 95743 -48965 177082 -50478 125581 33719 97330 -61805 -100551
19007 -100551 -113810 -198321 135732 24032 -261124 -181046 -123400 3502 -18466 89063 105347
18996 105347 -88226 8977 -121232 -107058 -121234 160044 -237241 248431 88900 23876 97481
18985 97481 -174592 91740 -75880 47101 -42939 219522 -5912 -138322 -115655 -23283 -368497
18974 -368497 -31909 -168141 -498343 -232150 -108738 32147 37967 113406 -37320 -173942 129991
18962 24698 -150582 -387239 -306659 -114326 -165984 21577 370279 -178029 272212 -98210
18951 -15476 -225989 -264075 -32823 32743 -224800 -127108 -422586 -207196 -188371 67673 -59896
18939 -34004 -331788 -67661 -150772 -188972 -61548 84907 256180 94984 -112127 103803 215497
18928 215497 109142 -67514 -80371 -232751 395239 -11920 239064 -38183 -39881 153031 194410
18917 194410 -170601 -61382 86283 139942 -295518 162159 115919 -302886 248794 -74072
18906 107070 39392 -378091 78995 -179482 -128851 -78071 38627 -149479 196837 111787 -257866
18894 25134 -190745 211304 -145280 -89699 -117364 -99551 -283834 -203646 -306125 218329
18883 75503 39769 -5693 -7734 -196138 -16969 -193905 -110456 -15615 -12842 -508926 -238292
18871 292334 80663 191411 -210658 -86271 -294002 -23587 262994 267754 -225539 -84403 -273652
18860 -273652 -505999 583446 57865 -68098 -17374 26595 -345454 -131263 -82735 -320183
18850 -320183 130393 241293 514008 -185287 96272 -313926 -161388 234743 -241965 135228
18839 -281809 82080 484826 128480 -179166 133437 -51368 -113384 194062 118421 31286
18828 293060 30613 -285723 5164 10975 -144865 -38490 -103204 60448 -31771 -1494 199471
18816 -93490 -15337 5843 -19641 131065 9285 -230430 -107174 -98211 -204811 28303 91901
18805 91901 189596 -80991 -21858 46223 -51792 150214 187291 -30831 40728 258205 -110299
18793 150814 -241222 172345 49344 -192656 13149 -17440 64866 -17440 -264762 -173536 73987
18781 118090 32259 119442 -474687 43547 -274927 64863 130410 -75895 -176488 -251444 179324
18769 -77620 127734 -26819 -83335 -161999 66584 107072 -108077 -331716 1527 305561 212937
18758 212937 -121583 -202790 -155186 -159386 -70681 -60171 -97268 -383669 -126861 -85553 -67682
18747 -67682 -61018 117600 -202305 -154712 163714 -140682 -328104 179754 -75753 -40793 -270619
18736 -270619 -363765 229643 67154 -231951 -238256 -156623 5277 -161045 100525 -88939 -112667
18725 -112667 108804 -106888 -159143 -434081 -113232 155352 75217 -258360 -85905 95230
18714 195512 -111274 -92316 35776 100546 34261 -33384 -200767 -123877 46390 -142290 -42964
18702 -134689 -61615 109006 -12940 -169762 92338 -91327 49811 -237009 -168395 50941 -46674
18690 -97911 163631 -177197 71982 -375703 109866 77326 -13228 -309375 -100908 -56018
18680 -56018 184740 -28356 -127295 216188 -124351 -227993 -46974 -27812 12259 12899 209959
18669 209959 -456042 -231934 83447 -28312 86016 -203964 10712 60726 -69454 288881 -227004
18657 103672 189141 -37950 -238857 -149488 -97632 -277800 -257620 35798 -151159 2036 -301095
18645 274220 -148613 67278 36180 -146489 113983 -464210 101076 177342 -184334 -10576
18634 248737 -85543 -249798 230716 -2131 -198958 106788 -196170 -119164 -236902 123371
18623 210586 27004 -45450 344248 -49186 227682 273627 -54085 -221290 -249405 -155782 -209731
18612 -209731 118733 113148 47394 235007 178864 10421 -79142 165118 114108 -153668 110971
18600 -110848 -278722 158569 -179468 -59703 4744 166454 158048 -8827 246576 -27177 -83295
18589 -83295 -55791 -218927 -191451 164947 -30685 -12374 -177317 -23387 -115440 -300952 158865
18577 204310 -104701 -106421 15095 -283687 98619 -175065 363210 -29146 -19375 28598 115812
18566 115812 155029 50732 -256436 348338 -118080 -164819 -228626 57733 151572 -251 37806
18554 74648 -173423 -106019 -136233 -84604 166293 -87297 114184 -223947 -44773 -207707 129205
18542 162521 -295027 -359535 43904 178953 -285337 4468 4369 -251137 -196473 205616 -146431
18530 225259 180888 189633 200854 -122516 160914 -34341 -400507 -229289 9651 -96646 79560
18518 -29676 -60481 -808 94374 16887 -158251 -58669 -127941 -52953 82393 -140000 372032
18506 -87723 -200000 -129170 -34665 -122697 357216 -128462 -89979 94803 -233375 -246560 77038
18494 -121831 188915 -68986 -54104 36341 -454026 77108 -172899 116714 -97994 -91953 -112837
18483 -112837 -240184 -43335 -191867 131774 -25239 -39453 -455973 -153053 -28617 -168493
18473 -168493 8277 307406 159794 491131 145659 137053 46749 31941 -6423 -290501 -255712
18462 -255712 -71644 -57923 24354 -153465 -188897 -218261 -49528 99872 80423 330771 -84230
18450 -277216 254195 -196360 -322212 -8990 -39003 -143966 -8588 269933 -183554 -122067 229309
18438 184105 -34399 134800 -311756 -146575 -179521 105073 -56137 69126 -72413 248050
18427 -95978 -141461 -121853 -255848 59999 -357652 -123972 139385 6630 -371012 -286438 355673
18415 -118795 -200261 116628 17027 -126356 -155113 -159444 -124405 -358115 -119108 -131739 -230268
18404 -230268 81163 192819 -12465 24234 -259117 -261962 -154503 20816 -59003 246215 144513
18393 144513 -79868 -36743 160056 -59302 277163 -1986 -110451 -171571 30135 -298053 108205
18381 -44096 255890 400585 85272 -70740 13806 -100705 177787 -201600 19939 -189214
18370 -297197 -171412 -123796 127122 -298824 -124192 -104776 -76678 166771 29704 -71555
18359 92614 -282521 -324698 134060 138896 162950 -153696 -92676 32036 155255 -63960 234625
18347 -323231 206973 -518311 -182018 -353156 214770 -100428 8309 9074 253936 125129
18336 144878 -419631 183948 -321024 -178846 111345 -318704 -64352 297617 6239 184965
18326 184965 116058 3173 -121538 22401 141093 185511 -261117 210016 -310466 -88332 71123
18314 -16190 -170580 -9158 -280614 84413 -309752 -37311 131843 -53706 53604 -72239 6454
18302 -381148 273944 -316455 174027 -179953 -48010 156448 -141855 -11901 -230775 142301
18291 -178854 73146 265462 -57927 123501 255454 -122621 -185233 93439 10557 -395922
18280 -94794 -205869 -211886 357098 -257937 30191 -169922 145641 372775 134886 -84166
18269 -27685 84426 5293 -468042 -93310 125981 41235 -241360 150193 85215 82376 -85304
18257 66803 353057 66285 19003 40514 -72350 -318117 -160648 -92867 14707 57055 -123020
18245 -234728 -107277 -247997 4635 -52010 -59507 -106705 82029 63566 -104835 -134910 -67370
18233 -27206 -112572 159623 -95607 25868 -86946 -19565 -193602 -57236 -57083 85530 -140352
18221 -99098 -99094 -95193 70905 130387 188110 79430 -170727 82100 -76476 -33983 -269156 17247
18208 -260447 -254441 32994 -321786 -33700 -289433 -63265 120097 288950 215593 -82049 -180795
18197 -180795 4813 -124758 133412 192764 48450 35036 161227 168158 -73027 -114891 163395
18185 -165429 -74410 -254127 241747 -100560 219372 23430 70041 -17177 204619 -8731 52664
18173 165551 -203422 398026 246699 89304 102666 394 15317 -97819 41126 24293 118299
18162 118299 -11918 14910 79884 81814 37116 51214 95022 -360588 57880 -306867 116925
18150 390758 273770 227836 -194916 65958 -92275 37458 283650 -192713 41900 -127370
18139 19323 163294 -9564 -227495 -174874 -164271 -81553 -24956 9246 -79048 -383403 63208
18127 -8313 63495 267441 58670 72328 128152 -39113 -161126 112251 -137080 -291269 200523
18115 -375685 119535 -152173 -19966 92819 97341 72975 279636 76832 86627 18752 122281
18104 122281 -37659 -387225 377786 -445759 45131 -143130 84026 -220948 -72519 -247707
18094 -247707 -52783 -11968 -330024 41340 86277 -114865 161230 103055 18520 -373466 35424
18082 -115180 -262415 141511 159379 -144051 -162229 -197148 -46856 8454 39627 -322243 -169135
18071 -169135 1905 192521 -192731 -31156 82653 38113 -297560 42959 86082 150538 -547160
18059 -11781 -297261 296858 -176131 7797 160975 370478 -177921 200341 -298971 -18717
18048 220517 -71106 -222513 228689 147301 -235331 -190968 -219785 -87273 41107 -136780 -83753
18037 -83753 -179002 -17588 -190487 -189957 -160801 -357436 75303 231638 165398 191270 107199
18026 107199 -267804 87782 -197226 -90558 60708 163387 -38213 -82465 -27374 -153797 420381
18014 -5928 -177850 135526 91048 193336 -440514 -109375 -178035 -137956 307542 20023 -112238
18002 -60473 19150 22080 -99466 136459 53847 3939 122505 -160621 -125431 191751 -225830
17990 -340031 -156082 -202293 63504 66269 -64116 -8491 218691 -1455 -274868 144211 -203415
17978 -28096 269856 -313586 -214944 -86571 -27875 58345 -97351 -155264 -282853 182621 37644
17966 -174376 -90992 -103928 -19805 -271283 -114191 -265165 -160980 54813 68125 -39016 -45201
17955 -45201 27688 -221751 89467 29950 -199464 -37561 28115 132763 89288 -125727 110709
17943 41916 38836 43073 69717 -147829 -111892 133048 -272073 42522 59254 108470 -18685
17931 362445 129680 -293770 81806 8579 73111 -83548 -241594 147669 196786 292501 95941
17919 -267800 114552 -27525 119890 269729 -63280 -134004 -400886 56162 -420037 158173
17908 -138131 -108509 202273 -52983 -41207 -63996 24215 40212 -28629 33396 181623 67183
17896 -231775 52180 -343780 42744 -119298 98704 -86957 -223438 -97346 -74116 -1445 116227
17884 4572 80654 -147438 -151078 41912 165371 57768 4432 -53148 344965 -103721 -39111
17872 -197412 -281382 28883 7578 35139 226774 -443459 -218275 -271241 -220290 -132318 110530
17860 28702 -181049 -292315 -99571 -80414 -172718 -40585 -66799 280882 328443 -94201 -3443
17848 27767 267625 -106587 221592 113944 -176229 -5019 -123968 205364 51957 -9375 -159826
17837 -159826 265997 85622 -16596 -244345 -195544 78196 -217777 -112721 301081 125540
17826 75229 42061 164466 114486 -23581 -50272 46458 119292 -159753 -160118 -28710 -182341
17815 -182341 -187153 197717 278009 -77156 68557 -20642 129091 252731 158394 -202154 134895
17803 -233936 -19748 -106947 -160334 215892 58748 -182238 64108 99152 -160875 36257 86419
17792 86419 109670 -12232 35188 -209811 145200 238999 -120424 -103176 258051 270672 -97168
17780 -296021 273598 -351840 218160 113370 -240833 -71688 21612 126738 -296279 -248324
17770 -248324 273700 -131399 -150436 213892 212863 91988 33914 -30936 -198337 190160 10170
17758 -144760 -198859 -216856 146932 -54537 55904 327579 -150010 -38849 192831 -75421 -8962
17746 133679 211907 -8339 -36770 -215229 23100 -82886 -189213 -29450 64329 82057 181845
17735 181845 2461 61158 -86461 -16914 -277098 128869 198189 -276621 97134 -166977 -47368
17723 150293 140924 139927 -38869 328795 30346 21148 155511 -219334 -292826 -12660 22848 -16826
17710 -24688 68353 -57659 -103704 13367 -261453 221114 -196833 10456 -221919 -94888 33124
17698 -332238 -170488 113030 26208 -13659 68965 -38378 -18634 180053 -249985 -284610 323761
17686 -70541 64269 29605 82652 203682 -300028 13014 153892 -63627 -166768 -97849 -108105
17675 -108105 279862 39103 -89958 -382057 -2871 205210 206433 -37576 -121227 -224381 157302
17663 243592 -222711 70513 149816 -171306 108511 -52053 -280360 -126309 387975 140238
17652 -19767 125009 263906 -29609 -100888 -65978 -327803 -179895 -125067 6031 114550 -59794
17640 -252012 -120278 -102975 -99704 225591 92630 30843 140059 204720 79158 -8572 -143315
17629 -143315 -172623 -216002 -146511 38833 -216530 54513 98884 221389 189625 96432 55782
17618 55782 275769 328349 -46208 112710 254004 -96376 274965 95116 -144193 -170256 -132446
17607 -132446 -13404 -107245 331534 -148455 149698 -21070 21964 197961 -106696 19777
17596 175010 -70781 78717 99977 57256 -181614 133018 176299 182367 -80313 326735 -14224
17584 -357950 274406 362168 423510 -68395 40737 -14584 -242352 229475 -110062 -116223 113259
17572 -85491 223078 -329247 6869 -12653 -4165 263720 244151 115383 53357 95848 -96826
17560 109321 -321038 -46136 7905 -287781 -172733 -93986 -170373 85859 42386 425419 36533
17548 -1476 -232122 140976 -276647 245661 176563 -98785 -26303 437355 47485 -263156 -65765
17536 -222305 177011 103814 -33411 260490 256722 41971 -216108 290948 285920 -129476 -66913
17525 -66913 7949 -68679 -29348 89732 -78169 -32535 -134614 6220 7218 224887 -111228 362409
17512 80896 316648 164409 363751 -20860 321665 225438 206345 84153 -39696 5737 -26642
17500 65081 75812 211326 -196280 19777 -46934 437177 -197927 4539 -37226 -9657 93781
17488 118290 -88839 124103 107278 193634 277154 120228 -96349 236992 79633 153808 -98431
17476 157124 -190109 224243 174143 30669 530498 272112 218090 70555 157204 49274 235109
17465 235109 473196 271550 -41785 54221 314668 224119 333898 192636 154588 -36191
17454 -153292 122669 199709 37693 -74009 394091 153699 -178506 171261 189599 92444
17443 104996 242975 99679 235884 165816 114072 91029 341451 361531 276758 116195 79298
17432 79298 253764 258758 130768 488950 462856 -222515 279916 187549 181278 111482 315449
17421 315449 -5548 288741 175134 225527 425814 490726 364763 219097 33065 29294 264061
17410 264061 185114 203685 119611 128282 -62461 13430 503903 149228 124020 138522 -121242
17398 538748 27858 358947 174657 249930 -228011 -155270 318152 21406 112245 223379
17388 223379 -127002 3805 -92102 261070 -40736 -8855 91191 -167005 -137606 187906 -26933
17376 63128 79123 23610 186014 -234286 349540 -5120 318112 275815 230935 146743 190909
17365 190909 226846 319624 60704 261877 433714 467470 -15428 138200 -192602 89496 221141
17354 221141 236020 208095 435079 61695 103015 -92759 159653 -14956 148632 495714 194351
17342 225904 -141111 158079 106295 169719 -87447 290141 -33364 251297 390778 -242219
17331 287525 -85431 244007 73704 172069 -5430 296890 441124 75153 301404 209070 252363
17320 252363 -20071 309822 94485 -261475 187511 -145783 264497 -165329 -131356 13508
17309 486459 62867 -34995 71681 268058 61871 110218 183683 280178 22846 356944 121528
17297 295871 -59614 311310 35206 139771 121944 255460 -63619 94985 533882 -74747 144052
17285 279875 292241 -58424 51470 283461 -5033 -40358 114630 237440 406547 53983 274539
17274 274539 84153 81919 66295 58739 882 304735 -234599 243759 168383 103227 60089 84018
17262 84018 194837 144649 -2732 176744 154391 36488 9528 100407 134812 105074 261261
17251 261261 228928 29464 367690 41575 102407 -63396 281366 262993 131215 178273 157991
17240 157991 375586 197531 257396 189799 107534 159076 -27857 72874 373144 172807 235626
17229 235626 271826 227176 -22538 253257 328381 236420 320784 108172 77539 570028 133307
17217 -172043 206246 11653 249954 135317 3383 287933 232961 121916 246428 271420
17207 271420 497449 228159 146955 205642 120978 293937 408421 152138 333348 251763
17197 251763 25040 60412 69472 -70277 135732 250634 178644 379580 369747 257101 402212
17186 402212 320772 466828 311921 118532 302591 -287785 178774 556738 240460 115618
17175 345771 252385 249031 140605 164064 395992 460507 489069 422555 142393 260039 456719
17164 456719 70878 236063 138045 335018 77984 679998 277231 337961 317076 261319 458636
17153 458636 81845 593024 258600 206868 268416 120032 317649 73155 139451 58568 296522
17142 296522 192176 202746 23281 403794 247495 283564 51589 206598 338533 -138931
17131 395628 262117 223392 589983 216391 28443 119135 301624 414953 325153 68745
17120 55760 588116 227192 343024 236937 198613 297092 321150 227408 108698 413013
17110 413013 172196 292741 289480 387259 309437 91971 -80990 462423 326110 407422 192275
17098 183531 575470 366260 391347 357174 262130 277046 240757 326701 437492 487986 326169
17087 326169 300889 418833 272243 425064 426937 539703 459995 514578 505669 523081 425394
17076 425394 179459 587832 303289 176405 592336 155094 458230 641629 670763 64546
17065 293697 633426 592261 316424 458401 409211 664703 344391 342161 154931 453148
17055 453148 196029 560039 429061 26151 207806 536560 443012 462408 246231 525006
17045 525006 410013 613705 78912 405632 524036 190851 434004 226881 410645 500855
17035 500855 410980 635285 209681 725582 538189 348633 501737 647136 373447 605939
17025 605939 813928 447773 424282 406476 561125 457961 420049 801906 592476 654104
17015 654104 261276 698287 573420 622306 683726 824645 810609 759234 603137 950417
17005 950417 763232 31470 530999 412357 774424 694585 583033 569717 602978 606709 806197
16994 806197 475225 732640 1011911 896885 828011 560441 544948 871933 301225 477817
16984 477817 523710 718218 858715 547341 1041325 814150 840873 650152 958128 852964
16974 852964 646960 946655 650887 642900 583413 762173 689632 604770 964397 1007308 719735
16963 719735 981805 607687 936506 882201 935611 850181 1108113 936334 797102 971894
16953 971894 579473 626490 906287 779446 1137078 985065 789892 856604 945368 1281332
16943 1281332 1329272 837753 899400 1100065 1084693 808836 927766 824177 945561 1238763
16933 1238763 1479591 1402289 1132952 1531324 1022719 1204406 1154746 1209231 1439370 1128334
16923 1128334 1160250 1378213 1133368 1660866 1067440 1152007 1259519 1186624 1215097 1238557
16913 1238557 1630014 1538121 1500387 1243499 1295602 1286642 1350973 1238063 1371476 1331492 1417728
16902 1417728 1362144 1289551 1410810 1311442 1379378 1619363 1448786 1848020 1391204 1821252
16892 1821252 1612861 1566768 1658540 1673868 1625316 1666484 1605000 1653201 1783446 1717904 1821777
16881 1821777 2016561 1496457 1740825 2324992 2017322 2007175 2022648 1939560 1901976 1934487
16871 1934487 2333311 1872576 2106890 2029673 2025052 2407159 1999421 2267389 2121347 2284589
16861 2284589 2373721 2257682 2605734 2430017 2530623 2551191 2428833 2523219 2728971 2648535
16851 2648535 2637544 3081319 2489850 2900220 2920856 2890183 2772437 2891794 2976204 2962345
16841 2962345 3112564 2986402 3130692 3208979 3160382 3103820 3343907 3032361 3591686 3330263
16831 3330263 3629354 3308695 3692071 3628736 3916360 3976687 3504400 3558703 3925600 4156317
16821 4156317 3966352 4458276 4015571 4171507 4566474 4767647 4766732 4652899 4736971 4942981
16811 4942981 5015222 5113263 5205184 5152883 5187359 5298699 5556266 5787329 5726840 5859352
16801 5859352 6034905 5904418 6047619 6214047 6444068 6429390 6493423 6695394 6901388 7348984
16791 7348984 7095883 7319995 7792207 7561642 8283970 8386720 8096341 8630126 8697387 9331636
16781 9331636 9230523 9606491 9715607 10230931 10413752 10385336 10613598 10696248 11339717 11331806
16771 11331806 11868077 12558355 12631335 12939968 13624480 13755435 14179949 14550742 14717247
16762 14717247 15426256 16007389 16345406 16865227 17414117 18144757 18639789 19507264 20222721
16753 20222721 20832679 21598724 22297712 23234449 24052850 24956476 26100014 27198586 27956221
16744 27956221 29290720 30756405 31972521 33223116 34883518 36459853 38286777 39972668
16736 39972668 41960136 43718100 46170323 48152582 50935716 53359424 56436651 59775695
16728 59775695 63078560 66505656 70200212 74101842 78553621 83043803 88039834 93229383
16720 93229383 98852306 104905944 111256692 117685679 124547139 131704588 138664150 146310869
16712 146310869 153325241 160501220 167379863 173986363 179563881 184513764 188640020 191463511
16704 191463511 193133240 193423280 193259961 190972047 187869869 183618324 178674379 173033465
16696 173033465 166477684 159403026 152461646 145135988 137712223 130743459 123665450 116758489
16688 116758489 110269674 103932375 97864373 92364924 87181784 82091645 77610919 72933964
16680 72933964 68819069 64514180 61349032 57979163 55154230 51875572 49496415 46879795
16672 46879795 44276343 42357517 39939035 38089911 36348292 34593406 32634338 31216294
16664 31216294 29911112 28551707 27358526 26162661 25167742 23956532 23096846 21901113
16656 21901113 21224784 20659964 19644688 18953950 18252292 17482977 17099107 15956283 15821482
16647 15821482 15041255 14784548 14501345 13749585 13471165 13194391 12462583 11918093 11839433
16638 11839433 11074185 11073826 10537418 10455032 10440199 9519966 10098228 8933125 9030452 8917576
16628 8917576 8415872 8338687 8160478 8139422 8069886 7711911 7563352 7279303 7065766 6949857
16618 6949857 6601557 6504720 6675053 6176423 6160304 5894467 5821748 5816488 5474407 5685476
16608 5685476 5475107 5266954 5101524 4841855 4757494 4742451 4282430 4500985 4618052 4537878
16598 4537878 4449371 4085863 3938825 3910191 3876035 4077027 3795453 3851890 3649542 3524718
16588 3524718 3492155 3675270 3356615 3220331 3277281 3147929 3336716 3117587 3053410 3027805
16578 3027805 3146531 3118403 2910390 2808110 2567893 2805819 3040355 2853630 2853070 2898433
16568 2898433 2610428 2362670 2883380 2575279 2345815 2440044 2443327 2357386 2258255 2521012
16558 2521012 2005562 2124582 2283802 2094599 2110015 2075742 1764993 2131982 2196913 2124440
16548 2124440 2029845 1662981 2195921 1974762 1674205 1473210 2108387 2026421 1953847 1311441
16538 1311441 1424715 1465731 1822843 1397878 1641159 1628930 1424068 1274186 1389352 1420411
16528 1420411 1442296 1500609 1382433 1541875 1521140 1268951 1294576 1282134 1083386 1485785
16518 1485785 1353179 1140585 1279369 1531438 1250161 1208888 1344175 1266110 1239729 1162815
16508 1162815 959144 928278 1119269 1477669 985503 1144199 1085016 893064 886849 1110731
16498 1110731 936537 1311558 1116767 637678 1095091 843385 1119216 929260 630830
16489 630830 1158022 636788 968462 934135 1004329 989860 839859 602343 991064 823657
16479 823657 832831 1002316 673984 915255 698607 780892 683016 1097439 709955 723244
16469 723244 1055378 769677 964032 739124 985165 959016 612699 845735 652035 432997
16459 432997 711235 323043 630589 549542 487100 830403 610296 843464 771026 588381
16449 588381 669627 718886 710872 506023 850057 901491 247267 352444 644247 467541
16439 467541 602159 540695 663712 540298 566534 592188 515829 320247 722332 674727
16429 674727 682240 162663 505928 152519 742583 430530 541513 561073 380765 573994
16419 573994 293337 662841 204842 688267 428783 286482 792060 303387 335590 659610
16409 659610 456845 232042 21318 276130 87581 293117 495491 470133 489685 529211
16399 529211 307795 220645 109138 563168 297998 505528 578774 167923 300185 551493
16389 551493 202782 215490 316516 159090 693886 287966 438171 506632 489414 282622
16379 282622 359776 687969 142588 270567 254443 331081 240946 297120 143350 269071
16369 269071 281686 342467 326686 142000 388408 481404 283680 386008 334809 506797
16359 506797 409958 59808 158195 480048 247159 470597 320260 78468 366716 269862
16349 269862 80537 277607 549967 111494 123772 316281 -13291 -106184 335484 396433
16339 396433 252583 269361 304498 464335 396092 421759 434202 452711 422185 269263 227419
16328 227419 272188 412181 128645 235097 735223 323341 84114 474664 177632 -96816
16317 205364 366895 322102 220021 6554 246137 350540 174545 504108 656175 307637
16306 216594 125456 -9452 273932 368886 409405 579330 299635 174573 477736 248411
16296 248411 112533 96125 414323 75385 40381 299084 43393 253569 120102 244160
16286 244160 284265 90331 120135 495423 -103250 199463 230823 39636 49192 216138 150442
16275 150442 403775 144277 -119944 209095 -109495 610752 361792 16236 -26774 23259
16264 257898 202484 489635 341183 43903 126715 171948 -46317 159743 493332 63990 298527
16253 298527 408064 203230 -164005 -13161 76232 176030 127946 40598 229974 -244599
16242 651 150814 -2109 -366257 77226 115242 200209 545976 4538 130222 -52674 33948 24249
16230 24249 45810 323606 229457 360902 62163 141140 67298 18451 365191 248206 -145028
16218 -150311 309622 171689 101295 116913 5122 169943 182697 -269920 -65354 -68002 -195326
16207 -195326 247127 142316 10155 336828 147028 -13603 110181 -18274 156872 123534
16197 123534 451986 -191713 355255 221263 -181365 -72334 -251229 -18186 -190197 -32703
16186 77128 62517 57258 258633 102009 232431 231794 -71890 163358 210657 -40361 255840
16174 -402587 69758 24772 183764 197010 116757 70708 -171622 323281 143398 -128379
16163 219954 -12035 -34756 323917 199495 62811 88447 31622 68759 -190178 -137452 134712
16151 61976 -264892 52961 -101059 215927 327849 149414 -104485 360826 331911 286800
16141 286800 81181 -22752 29434 165132 -63365 -130780 270879 350384 219648 282889 -133047
16129 238111 11196 -174758 275898 333908 301640 -161725 46178 100384 169365 -55550 -12803
16117 354771 172769 165838 74084 -49773 -103773 -82778 21001 190495 -174200 -169450 201215
16105 -322358 360697 226358 232830 240347 203350 -109865 -74669 -107060 -1961 50671 164257
16094 164257 -1093 216760 -52975 33868 -156384 28524 250030 143709 115393 195561 -59911
16082 -118057 271017 -49365 32908 64542 -253084 112708 221117 -8477 185972 -24963 -246452
16071 -246452 -157855 69011 -76973 196780 54473 -46691 39968 -47861 34505 139573 138930
16060 138930 69754 -93141 455 35464 225509 -399889 77390 -208519 -57774 124257 45814
16048 42707 4824 160217 -146422 33304 -78249 -40301 -75038 105755 -112043 59522 325941
16037 325941 -248206 185117 229015 112083 -219451 -118979 125441 -399406 12435 212944
16027 212944 191944 -277361 -162544 130022 -289321 46297 -125685 94595 66733 113749
16017 113749 232643 -1016 -128481 345823 -193015 -412818 45525 -264432 -136169 259710
16006 -75282 177574 139700 -28783 -114152 59496 -266473 -200841 -74718 -215584 295707 150107
15995 150107 3811 276748 -113508 -43557 -201494 80333 283804 -403037 -143347 -221132
15985 -221132 -25221 -188936 309365 -116835 -607710 270565 -94802 98661 -170330 -337502
15975 -337502 -138223 -217678 -33256 -10606 -339034 -197051 -54402 174763 225988 -228409
15964 80046 88132 -342564 -221433 -128502 90396 -225886 75139 -359868 -232951 -170000 -275650
15953 -275650 59272 -72564 -129664 -22242 -150337 387897 -290459 159 -229433 41071 -72116
15941 -151201 -252493 263816 -159041 -6904 -183321 -24592 8230 -121102 -30488 -79763 43841
15929 -88440 -45846 31497 -37928 72538 81316 -37814 -10885 94939 116003 -918 -249482 -71294
15916 -81358 124768 -29824 -53730 176701 -7977 -234967 59614 124220 -188484 -97205 289587
15904 126084 -69842 -235468 175403 -37729 245220 49089 -48734 -144516 28017 93688 75180
15893 75180 3650 118866 114080 -482274 311034 -71566 15360 6756 -399999 -514 94124 173056
15881 173056 -137838 124295 -265175 57955 -47440 83670 196534 193386 -174643 -184772 -116873
15870 -116873 -86960 -119357 275330 -342310 170455 -331368 -321170 -91402 -136300 116557
15859 -250679 -154380 -6450 -17273 -189313 -109773 -116322 -182270 175873 -107578 -281825 5816
15847 -292012 -50271 115403 18141 -167531 -83055 -157124 179801 -183160 -455940 -175222
15836 48715 -47258 -308623 13972 139597 170184 -237113 77716 226472 118939 101064 -175149
15824 -117033 -426034 -233350 140854 -12520 76512 -58515 -29100 -98485 -137614 36887 7047
15812 -339478 -208358 -212823 212 -58320 207126 197720 -115286 8797 -327759 -175799 -35007
15800 -158014 114876 62582 -189454 218299 5427 -131393 196395 -126925 131015 -356771
15789 40136 160902 132930 -54369 46566 -97825 201726 -23177 -166084 129992 -65628 40414
15777 -207775 429549 -13740 -340068 -169671 -97876 -116174 47198 -73299 39986 -23782 -194114
15766 -194114 -414489 -282641 -38798 57490 -339673 -181394 64454 -211245 60724 -132496
15755 116876 5810 -145050 -96482 -256989 15810 98462 3219 10361 -128495 163404 -166478
15743 20279 132789 136216 -23804 246424 -209434 -172993 -212995 31155 -168548 163860 139410
15732 139410 -56103 -229223 -79187 -46406 45875 244524 -78624 3620 135036 199779 -307129
15720 378811 86176 -110615 255903 -111771 -248286 -35507 98931 -135034 -139880 -22125 311497
15708 -355516 -78495 -79359 252080 94244 166212 -300039 -85163 -207783 336927 -204142 81898
15696 203535 -210322 -170693 155330 354798 -156487 -10445 -30800 -70934 -235887 -257189
15686 -257189 51865 -128978 75550 -242642 33974 121746 39381 -90825 50977 -91756 -186297
15675 -186297 -165742 -50398 177619 -50808 239169 220508 -118183 85040 -273834 -149910
15665 -149910 195796 -63211 110901 -70657 -92328 256917 275452 -79627 -271468 150126
15654 1480 -218539 -498 131956 42309 26451 -223927 36838 122221 -91612 -6941 -173279 13083
15641 223066 201275 -288987 -363210 -313656 131909 349279 36864 -193111 -226806 -61692 -6556
15629 -37690 116934 -44224 -84650 -22651 59519 -400933 -207827 137950 -152479 23424 141271
15618 141271 93453 37757 -314132 64012 -80491 -154131 47400 -27695 185896 -322658 96651
15606 76242 44412 -101246 69396 -117678 -309736 -149736 299638 -35538 -114207 -172173 134587
15594 63495 148820 -144738 29765 -118473 112005 138567 -20035 54343 92469 -295245 -365465
15583 -365465 125784 92623 225016 49584 -17195 -105807 -212750 -351627 142616 115127
15573 115127 -220306 70531 33659 43251 -213075 -142877 -6236 -191031 52152 -70575 29614
15561 91588 56678 263964 -220545 38765 -219782 -223005 -274569 408073 -86832 111225 -132705
15549 -98907 205938 -133654 230972 17358 -163155 -89819 63857 -86500 164194 208682 -52359
15537 -219544 -140606 242321 56704 129445 -289980 174581 50608 -33558 -49463 -148197 18639
15525 -45550 -227744 1265 -283053 153315 -149627 -250474 22162 15688 45635 -430232 110473
15513 29791 217589 -91083 -58461 -96348 13332 39608 94244 -123771 132425 70432 60679
15502 60679 75772 -112037 297552 -4205 -29246 -207552 -31859 244917 100743 200113 383664
15491 383664 -37946 57422 -60576 -124507 -8566 3981 270464 -196888 189045 -57233 -14082
15479 -42183 55465 -47135 24920 8680 33800 33669 -6878 -298383 249807 -166515 -12504 115677
15466 241958 112247 28537 -466254 169923 -53302 -18099 -244043 301793 23713 112708
15456 112708 -170166 137681 -36227 309135 78582 -285894 -15078 -37728 -110452 -30930 -77581
15445 -77581 221454 286282 -37416 -385759 -7652 154584 210084 71805 188327 -77258 -121163
15434 -121163 -327163 -74155 -135264 250683 -109463 123072 179365 119509 147940 -106442
15423 240986 96955 78063 -34134 208755 249398 -396827 -56009 86752 -224799 -65529 -290781
15412 -290781 -15951 -128701 -79502 -235963 217558 -189743 88535 15342 58039 99295 -81099
15400 -88427 36412 47615 48254 222045 -184548 -97120 -125636 4269 -104574 7745 -114929 -67784
15388 -67784 -53973 -134455 -6621 -220684 -58830 -149990 -30064 263808 -28936 -43396 -25321
15377 -25321 83264 240661 77876 311591 38389 121156 -109029 -78427 -48248 -58526 -389295
15366 -389295 185224 300737 -338168 49769 20106 464160 299105 40357 135588 143145 -364996
15354 -7851 343423 -72827 -33268 -251703 58883 -9112 -183416 -630 -71333 -100596 -92980 -59254
15342 -59254 -152510 189068 -98394 -20941 -66834 98020 174289 -247103 51356 180147 40447
15330 -148672 43381 -192412 -78143 -1184 224824 251393 194666 444502 -209075 24994 48121
15319 48121 135804 294104 -41786 144859 63953 151852 309963 261761 -32454 -230428 -65616
15307 103197 -96101 103295 322494 26599 -112765 92982 -96932 70099 44486 -61292 -168826
15296 -168826 286526 384350 2947 66937 10811 271412 -211574 -51360 -297509 -165382 -106906
15285 -106906 -91008 82054 142847 216925 79435 81995 -137420 47421 299468 -217435 196746
15273 -590 -164574 150945 455 68934 1769 110454 -226057 -117421 192059 151911 159959 -72083
15260 15785 225233 197787 -103263 -111198 9958 -132866 -43951 218828 133335 -184501 78455
15248 -98531 -54477 264908 -81940 96382 582622 111831 227554 36908 73822 62393 210553
15237 210553 536719 796965 957799 883149 850700 758576 538244 349717 -107079 5628
15226 -29205 9362 417972 422373 189525 242260 293590 59280 -83910 -86167 -23167 -37379 29549
15213 125370 -66399 -63398 -51902 184737 224717 -82306 7347 210999 48667 364836 -9636
15201 -75920 38389 -193407 110009 236085 -26684 140740 115002 163682 -166812 94094 -128515
15189 139403 172169 645923 112150 120411 -147943 39343 238153 -36293 369222 430241 140493
15177 303956 -383277 -263356 -89923 -55367 -20898 112400 232048 350666 121746 335808
15167 335808 169313 176084 222684 358186 40222 447649 117907 5937 -2628 -105441 337120
15155 149950 143430 44908 137739 185586 2941 -37634 199358 -37793 61463 305349 158968
15144 158968 -53006 53329 203503 -25732 -50322 -86389 142856 12292 305771 147124 -225971
15132 185235 65314 -116987 -183458 279988 -41443 93580 150271 -36231 37194 302944 403819
15121 403819 31175 -146941 43774 21895 228034 40733 837 585620 -64671 26161 2874
15109 205263 406521 380629 235950 467096 424443 39001 33259 -144519 291941 438738
15099 438738 130732 348194 38925 43102 259726 -117722 -57777 91376 6041 148961 -25957
15087 -74056 -52087 125866 25184 198422 97500 -110550 226942 343569 20923 448817
15077 448817 88424 36891 380560 -27278 286285 396443 338727 -86579 81504 227062 -8527
15065 273870 81601 205279 382080 52230 33720 310360 113368 129956 551573 149977
15054 48257 94894 63040 86012 66104 -106241 198296 181000 -92544 91363 116609 257241
15043 257241 132973 6016 329543 421573 251693 297016 299973 70046 365873 289949 -108941
15031 75967 197025 10120 -99914 196677 486963 -101391 121367 -71088 396665 247686
15021 247686 411362 96789 45031 706450 411904 332846 -11111 123637 -98607 -57804 125201
15009 48389 163393 487260 142115 319599 28596 58019 273939 293035 226488 -249543
14998 11242 278813 -238590 428114 169531 167766 262589 262905 180491 505739 142419 199115
14987 199115 -12310 188562 471859 279495 87184 376134 8953 234133 181784 404461
14977 404461 532869 241850 410965 191413 333089 30648 -92188 243595 235843 -53311
14966 509293 32554 462168 297278 457277 220485 314996 380076 307243 20849 275730
14956 275730 186664 381064 445301 436250 -14095 447455 77154 48121 470906 243101 456820
14945 456820 329098 116302 148260 360105 268565 207585 34802 448152 366048 250798
14935 250798 330048 -28402 491985 397904 380214 241479 71680 60215 -213472 165766 450606
14924 450606 630179 415769 345253 619281 133905 260209 -25779 380232 419577 13972
14913 403809 493092 406693 351517 358614 172636 340964 400325 208504 759911 317278 271001
14902 271001 435714 367414 607109 335789 38945 106344 102435 275501 383630 350187 440534
14891 440534 178346 402219 517662 290402 500381 282481 255235 512000 449192 246784
14881 246784 295645 368180 630353 295039 671991 657225 301315 292049 322220 375595 584501
14870 584501 474272 300595 429870 420308 440928 436317 472279 579033 371437 338083 562305
14859 562305 434917 519040 316360 455218 549907 562154 483109 173196 378647 188199
14848 383317 336195 443200 151957 301697 279949 442481 425372 336698 358153 601658
14838 601658 361499 467233 437100 229607 765271 640791 659935 430674 561986 602746
14828 602746 500682 514585 498645 288258 462829 853128 611590 381827 703483 337147
14817 837623 253240 597551 469439 342505 524996 647491 653845 371110 432363 171919
14806 448196 318836 598919 541425 485784 419569 240429 709510 306536 384927 670811
14796 670811 393958 415926 404102 566138 555922 811013 350345 488600 461928 712424
14786 712424 503718 227772 645205 425654 449796 446450 499719 376677 832206 416879
14776 416879 577970 635471 613045 446219 838889 580745 503169 803575 611957 574668
14766 574668 827969 669069 649699 489477 673291 650062 555505 602390 582916 510077 720247
14755 720247 659268 375742 777829 738304 884535 609491 805606 688338 831840 765066
14745 765066 764277 702670 845672 566052 828384 519660 517314 737689 623807 813633 578641
14734 578641 617161 806899 379243 931149 944205 843596 837426 797216 841145 779840 920758
14723 920758 699854 707776 604677 725474 913426 602740 964084 623102 1054622 573529
14713 573529 722794 842667 822509 974691 991783 661852 901369 1031250 1000089 1037590
14703 1037590 927012 874103 659808 1026969 1108808 927586 686762 1001769 723665 1010979
14693 1010979 1083406 865641 1164839 870807 888455 720807 848844 950707 801622 788711
14683 788711 1026133 891383 977019 1002532 1101574 943558 999571 835723 851923 1000463
14673 1000463 995703 1223850 895158 1108673 1091932 952998 905430 1026000 645135 786577
14663 786577 967273 1226028 1136159 1264675 767900 992414 1288152 947476 895872 1064627
14653 1064627 1121769 1060708 1253368 1019542 1219102 1076432 1122110 1334782 1044665 1045976
14643 1045976 1053339 1247242 1297638 1408711 1084172 1412966 1607812 1729782 1344423 1511431
14633 1511431 1296964 1038059 1388921 1359083 1207237 1072917 1239260 1256745 1550060 1711672
14623 1711672 1422265 1294073 1405209 1369210 1128056 1369742 1366134 1549318 1447595 1295142
14613 1295142 1335520 1553373 1801758 1652556 1571654 1265145 1945276 1666737 1602226 1663157
14603 1663157 1667838 1711023 1628072 1568173 1690411 1543144 1687961 1542426 1787496 1742878
14593 1742878 1515837 1651932 1736514 2006634 2002571 1799795 1919905 1830401 1711747 1843134
14583 1843134 1661341 1954215 2010167 1776886 1727307 2052400 1984251 2456032 2055297 1971524
14573 1971524 1864647 1875476 2145558 1987479 1786333 2095174 2264298 2558733 2472596 2060064
14563 2060064 2177379 2205130 2568102 2486695 2195005 2161993 2152256 2437662 2414679 2590983
14553 2590983 2393531 2052521 2698615 2542883 2649084 2959132 2719069 3166441 3081268 3223855
14543 3223855 3440150 3242212 3439725 3786095 4651992 4516586 5292949 6492966 7567257
14534 7567257 10197636 14105895 20906661 29729302 29477320 17909860 11079697 7496617
14526 7496617 5652157 4611055 3794685 3136103 2806450 2756181 2812776 2616238 2842254
14517 2842254 2347005 2742890 2576101 2654304 2470364 2427698 2751744 2826990 2777834 2629699
14507 2629699 2917439 2942202 2501129 2972516 2666675 2801826 2849020 3095912 2750298 3007724
14497 3007724 2987906 3222259 2979505 2973653 3201540 3092921 3284247 3332365 2859255 3544782
14487 3544782 3155075 3398482 3475114 3149899 3395920 3556510 3589136 3663100 3940462 3827078
14477 3827078 3579306 3518263 3810818 3951498 3812307 3810552 3874562 4106109 4302204 4078314
14467 4078314 3937343 4362219 4442481 4232819 4368379 4336457 4657625 4317146 4394947 4601028
14457 4601028 4860515 4625088 4621883 4665968 4852916 4875367 5026438 4966293 5152307 5097817
14447 5097817 4986088 4810962 5277061 5162851 5117239 5372998 5504831 5360954 5651891 5631721
14437 5631721 5747140 5605431 6141903 5952572 5946384 5833211 6225232 6324352 6252915 6480052
14427 6480052 6477926 6322052 6965173 6706851 6556417 6671449 6904285 6896645 7225661 7150542
14417 7150542 7257107 7450425 7423082 7435794 7520186 7639576 7928655 7689640 7997448 8379889
14407 8379889 7835240 8214841 8625082 8729391 8867922 9024618 9354852 9112360 9378002
14398 9378002 9472090 9302946 9663086 9654981 9842563 10058353 10224620 10083004 10260943 10732050
14388 10732050 11057761 10837795 11322115 11313471 11701302 11654934 11851816 12074741 12295048 12379223
14378 12379223 12722442 13182132 13095168 13290649 13513329 13392245 13820757 14177243 14365667
14369 14365667 14597604 14987890 15157618 15539162 15794964 16146786 16127671 16357074 16857868
14360 16857868 17012010 17683340 17599064 18444124 18420093 18865759 19639920 20043106 20109008 20813408
14350 20813408 20955009 21229623 21973584 22087214 22803749 23045001 24030975 24191180 24756463
14341 24756463 25142230 25422165 26498111 26980598 27675440 28413952 28925542 29904111 30454691
14332 30454691 31149989 31947978 33060868 33749283 34899249 35644624 36341015 37521557 38170463
14323 38170463 39404203 40733033 41651179 42737717 44056997 44951076 46700761 48253765
14315 48253765 49257872 51096552 52846505 54475208 56013219 58059989 59577892 61675198
14307 61675198 63425906 65707909 68209679 70807844 72741895 75453095 78480300 81164873
14299 81164873 84367846 87247839 90956905 94198365 98193779 101831138 106469379 110591818
14291 110591818 115295446 120349288 125597960 130922573 136463316 142643321 149040866 156145079
14283 156145079 163408443 170814772 178965881 187388518 196749127 206299595 216447369 226948720
14275 226948720 238421439 250252916 263079596 276047500 289472732 303274548 317510383
14268 317510383 332222193 347213827 362135380 376389468 390481830 402526050 412181070
14261 412181070 420735236 428552268 436783422 443589832 447690522 450263272 452919391 452268525
14253 452268525 447659334 441984498 435184879 427179852 418611466 408684302 396959444 384213147
14245 384213147 371247119 357731403 344679259 331176512 318009343 305416412 292192211
14238 292192211 279322737 266885677 254772237 242966405 231646092 221075398 210896567
14231 210896567 200827895 191128640 182620050 173966275 165897653 158389500 151120266 144265752
14223 144265752 137886074 131523040 125474517 119593596 114475530 109316562 104908100 100331168
14215 100331168 96193509 92320156 88317990 84909442 81887380 78572283 75735186 72892564
14207 72892564 70262938 67738413 65228121 63322780 61328590 59115266 57216914 55383803
14199 55383803 54058751 52263832 50392785 48881331 47286252 45922843 44722378 43875754
14191 43875754 42580487 41156081 39926506 38878944 37876266 36988376 36309357 35108414
14183 35108414 34151680 32753762 32102520 31445415 30797786 30124064 29097422 28561642 27710497
14174 27710497 26987146 26591627 25734148 25467140 24796590 24348873 23419871 23069361 22352185
14165 22352185 21871952 21500337 21037135 20956715 20749792 19856082 19525181 19004933 18723831
14156 18723831 18306300 17952003 17579065 17332684 17053828 16636393 16262765 16141515 15625355
14147 15625355 15496774 15235000 15168186 14682782 14559918 14243778 13705992 13911466 13423219
14138 13423219 13754588 12926978 12843225 12881153 12267913 12237732 12119711 11851524 11706878 11554555
14128 11554555 11319757 11192997 11138274 10466221 10843537 10459287 10569168 10214543 9932224
14119 9932224 9692044 9439900 9417343 9489253 9053423 8915480 8897157 8535230 8810127 8622884
14109 8622884 8614149 8321599 8249005 8324807 8234062 8102708 7948497 7466718 7930960 7754811
14099 7754811 7170554 7236898 7064416 7196402 6986447 7400763 6905264 6909332 6632724 6663338
14089 6663338 6528723 6229879 6595151 6181638 6073998 6241410 6268926 6229107 5849943 5835655
14079 5835655 5960991 5675791 5582442 5838119 5514642 5381897 5270644 5283457 5285675 5374057
14069 5374057 5450992 5103693 5353955 4679673 5091912 4702026 4826812 4732437 4862494 4577496
14059 4577496 4762867 4529885 4613433 4570269 4581550 4092090 4480220 4400799 4366640 4103384
14049 4103384 4067753 3820773 4108665 4514100 3941007 4178300 3930393 3587919 3924453 4107207
14039 4107207 4111588 3796727 3853623 3679753 3507440 3776261 3753353 3616788 3243881 3550830
14029 3550830 3627878 3550064 3391419 3644798 3301805 3095844 3061748 3147266 3172279 3591261
14019 3591261 3360680 2916207 3183748 3193336 3053573 2906956 2986504 2921332 2680783 2790199
14009 2790199 2965048 3091718 2796821 3111036 2441159 2664616 2776513 2539768 2401830
14000 2401830 2738255 2710073 2756887 2641471 2814224 2307597 2706901 2603651 2423030 2462028
13990 2462028 2596096 2589650 2150085 2296567 2328789 2377780 2342327 2229437 2540966 2486732
13980 2486732 2757724 2862431 3094565 3491613 4065307 4912328 6306297 9706628 15804777
13971 15804777 25395814 30507765 20193827 14117240 10276684 8336394 6203223 5473056
13963 5473056 4792399 4236344 3641627 3638324 3526251 3115098 2970179 2883277 3175202 2657041
13953 2657041 2436882 2565115 2335336 2279640 2299970 2255497 2391199 2262345 2248891 2258435
13943 2258435 2406785 2107451 1977212 1984055 2031868 2301449 1627417 1798254 2050402 1851838
13933 1851838 2298163 1779160 1860835 1975958 1921252 1982020 1877534 1832025 1903461 2019756
13923 2019756 1944405 1950323 1995111 1545596 1752235 1935829 1583944 1897348 1607419 1800312
13913 1800312 1712541 1424664 1799163 1885137 1628737 1508973 1713354 1812828 1493458 1544242
13903 1544242 1601619 1596463 1298548 1535525 1258768 1071722 1082557 1378187 1676398 1472795
13893 1472795 1358656 1355468 1484780 1274242 1352223 1361762 1298292 1329238 1262534 1487214 1458830
13882 1458830 1411594 1398768 1300725 1391373 1539254 1331001 1175328 1325649 1142682 1172536
13872 1172536 1272391 1459007 1357749 1331372 1406391 1284387 1504840 1511044 1254450 1358954
13862 1358954 1093641 1139664 1302014 1107713 1306027 1011285 1222434 1127297 1088299 1166213
13852 1166213 1348446 1065084 1151905 1104764 1281745 1102187 1402933 1224722 1020239 1080275
13842 1080275 1173657 1244881 1026790 1141344 703513 1170323 1395971 1262225 1193022 1083612
13832 1083612 723800 941264 951036 1291813 943792 1010137 1432459 1251172 1179673 902523
13822 902523 961212 1038000 1077024 977072 973798 880520 950943 871326 894301 811481 1182977
13811 1182977 669871 1117163 884156 780097 914799 1007369 1070300 634447 832055 1017325
13801 1017325 853027 1093170 816398 815623 1023444 998216 1006590 911252 865418 727318 931830
13790 931830 710748 708078 573093 885988 635274 695069 718636 1010682 1066904 744364
13780 744364 766911 724486 743896 939125 687973 683713 718896 690263 890152 700504 713155
13769 713155 823751 932303 814105 683983 507502 729347 534899 838534 756419 759935
13759 759935 360794 581472 774009 369982 1020847 807776 794648 551021 527294 750015
13749 750015 984363 684708 520633 947635 842165 654298 903399 753667 718250 269075
13738 690852 937372 392301 543626 611076 535078 497253 827643 816309 445871 950155
13728 950155 595644 584191 829813 662880 390271 373205 657914 355528 1023541 724193
13718 724193 551367 641811 540749 415723 444568 386725 760100 674010 585389 587493 350654
13707 350654 674496 420148 536164 494802 326053 202671 679707 505227 203239 618573
13697 618573 540197 797012 512421 660042 609268 598070 693140 729012 779111 821801 696669
13686 696669 782068 664311 591453 390880 689907 510695 635638 424492 418049 591774
13676 591774 233568 592407 487986 741356 189843 601018 601255 657205 264178 477046
13666 477046 445704 616893 648736 297229 261495 497111 216853 535585 511953 337296
13656 337296 881501 667307 697288 185429 673275 507564 479952 665843 610218 511633
13646 511633 267862 559705 549335 520430 360721 219620 643255 480437 110397 396104
13636 396104 276505 370732 729412 681224 400822 339069 395314 228105 30084 608044
13626 608044 340649 305095 246136 283430 456434 782897 640035 502571 463055 447644
13616 447644 347563 555728 513592 343318 493761 623927 393408 317429 408397 209742
13606 209742 254758 477813 176895 508141 702238 331484 342728 393856 364877 476446
13596 476446 474129 388262 196558 357516 398600 406513 670206 -9495 276486 445651 869471
13585 869471 396702 505443 548509 295044 312695 308917 54530 322466 724944 163453
13574 28781 459692 -185400 313240 518168 99902 287506 300272 210639 428762 505684
13564 505684 407890 467730 192343 480958 284628 265031 313115 79251 491067 392853 428497
13553 428497 188494 129505 438814 429133 113917 582522 243997 227824 261804 498594
13543 498594 196919 643597 -58051 135845 131815 277153 315268 261904 389437 -8987 381927
13531 438282 250456 408140 478427 388124 114997 300040 258959 298899 315754 237410 328291
13520 328291 467589 498505 220236 438331 291946 327073 34350 226441 199266 178071
13510 178071 43856 335682 108633 -82122 625005 108049 140697 288086 159400 515301
13500 515301 328647 59379 395308 280302 446877 373565 66786 319088 224243 386165
13490 386165 284278 575398 81164 201480 35859 100999 -11018 106865 307327 238123
13480 238123 19497 58436 453826 363027 182787 315579 438951 17243 598673 643448
13470 643448 267151 31596 359994 238940 63895 285997 2821 49659 247410 351650
13460 351650 -71781 738849 374628 511581 315673 61699 204804 316958 463809 189250
13449 209270 231669 154529 474285 332502 256210 43060 228073 144542 120492 150951 -212280
13437 -173147 350422 284820 356615 216528 200997 236992 145656 534654 91961 305415 246389
13426 246389 395691 376785 281787 472294 242668 170120 182731 323807 156807 603352
13416 603352 -1237 -3449 286353 399059 -44229 64291 174702 518302 236969 145419 189624
13405 189624 303826 37221 399856 179093 173392 502497 183570 -104463 243770 -136313
13394 280952 -109576 172513 68448 153229 145440 336705 520306 -86586 284749 2991 -98447
13382 183692 5599 368558 185470 -24300 338678 171450 153050 55606 -28926 -36499 420519
13370 282704 292339 137045 11682 -34467 192738 129884 170620 124719 134506 203482 -60396
13358 132537 267849 46403 24730 132908 205246 73526 178721 185977 479831 -15349 -17208
13347 -17208 130675 58738 287322 64327 92487 -79134 292995 33744 150765 71054 61443
13336 61443 158242 657344 139815 218172 316972 446973 176690 117647 269326 474800
13326 474800 336923 362880 444809 463064 485035 -178262 123233 565959 285655 59243
13315 -5553 129447 235474 328682 261089 385481 297844 349430 -105561 168313 1850 217301
13304 217301 -112721 200722 119580 155529 96141 167162 354265 202806 287087 464987
13294 464987 415772 153128 -23284 171419 -160424 112027 135836 183379 206445 422676
13284 422676 235396 47527 83872 244912 454042 -99005 73547 278077 28441 285864
13274 285864 -275244 179147 -50555 173379 442479 -38750 330292 163622 49934 147009
13264 147009 203732 175958 -6102 176782 247181 -66229 237486 117603 2229 252138 37291
13252 200517 28048 -72182 -78213 205104 494992 697617 256308 -37955 19110 -176896 191322
13240 -1177 67236 139869 348423 60450 85470 -150048 48303 161419 -9274 388453 5159
13228 -90541 10274 417891 269693 252076 194798 -61998 -56483 75025 -61972 -509 166027 176539
13216 176539 451941 17946 295557 123771 456854 142075 255129 129846 63237 147825
13206 147825 -97653 267390 140348 -55309 85156 254053 76129 368489 -81190 157019
13195 85167 -18439 49973 109564 -58841 25779 285984 118883 117673 -182690 298962 -292179
13183 340007 304680 -168421 -102625 -50051 17432 244988 394797 178408 286654 178111
13173 178111 367254 127938 -70742 47875 116570 145439 246061 377157 -57651 412223
13162 -38711 -71493 110453 79631 362798 191180 -88227 -28565 121425 110641 11417 110690
13151 110690 -23248 57969 -2924 -127730 18210 19306 71504 72462 236359 125674 63697 147713
13139 147713 264604 434872 168283 36248 61241 177259 305363 231012 113253 -175617
13128 -152372 1086 166171 47372 274664 259476 502485 -130960 15208 -12557 174562 106762
13117 106762 171787 154309 -43279 175817 136092 318558 -6904 123214 -76985 163659 -146866
13105 -270306 -112248 32479 -126576 434882 109541 250073 -119103 -12116 19873 -142403
13094 -76392 220069 -431238 16479 -21728 -89317 -57584 48902 -131778 127667 491693 4496
13082 -80301 33127 130444 -390102 345345 -20032 231387 316015 91674 313549 -28746 425578
13070 337792 183416 10270 84542 -5240 -1510 244519 474433 -83687 269715 219283 251823
13059 251823 -107304 418472 201803 177244 -3573 329196 8227 166565 -232982 190680
13048 -263364 -94631 347580 99660 206789 205167 86327 48417 -66453 120147 13593 -24087
13036 129316 -69936 215634 -179337 75357 218780 -12133 240534 159924 209107 158181 150853
13025 150853 169438 188267 -19864 -77581 -246831 90555 356953 350363 211240 5078 112899
13014 112899 236252 226377 -59898 145045 -169113 -206 78022 78892 -58149 238436 180435 52199
13001 190178 -55128 -190477 137782 257275 97400 240201 127687 229559 243510 132992
12991 132992 26546 -104091 173723 111235 -75939 334326 -401018 -103460 161543 207857
12981 207857 -273882 185743 135895 20272 -71369 38129 24575 42167 78985 227995 -296856
12969 -10819 279687 -107308 -44600 187697 295544 23801 26746 -155491 204057 -77880 150701
12957 74409 154774 26524 -74173 132786 -245686 517266 -103551 200734 -109181 364303
12946 -10536 168015 -80353 268540 -136384 48690 6516 -119739 -161139 125787 -127115 87265
12934 86186 -141927 -251336 149509 148598 98588 66718 111940 -113397 -11231 22796 -39793
12922 -144411 -256806 195709 -69298 -253032 158039 164309 -247854 21577 300114 24326
12911 175793 71087 124685 -61090 210694 -28805 43384 69797 85001 343021 492896 -45005
12899 143654 -178237 222204 -126499 5303 -220156 -87902 339966 258332 -18966 -241681
12889 -241681 -117343 -191442 139505 -335034 259419 -175200 26042 270882 85560 30631
12878 31547 281865 94404 210811 23741 111034 86994 70651 -88504 111450 -74211 -75635
12867 -75635 224710 118760 135902 212554 112726 243917 22924 -190491 -98171 -125910 121311
12855 -86563 -180837 68531 -102834 262530 42686 384665 -51527 56333 -84040 65258 -191333
12843 17446 173906 -234652 233578 -63072 -232378 75026 84934 87896 48038 -176608 236761
12831 -2227 54693 80351 -6478 3494 152090 -191201 -119209 -308985 -9304 171792 -180401
12819 -48296 -45095 207756 7954 139723 124042 -155567 -87372 75816 -163812 483425 -300382
12807 -109052 -103898 -265132 115532 -256690 111835 -221 320762 -164366 -169617 -273084 -114909
12795 -128492 60141 62148 16671 -99626 -14743 -116275 42478 178170 335650 274834 -170893
12783 54567 183781 105157 94172 -94316 153104 53330 -120853 253943 -117063 -306064
12773 -306064 -251868 103189 360920 -161498 335722 -37318 -292231 14564 -278429 -156980
12763 -156980 -14421 -170210 -280383 66416 -825 -2900 151839 -62717 -135931 -211987 -128899
12752 -128899 278730 134963 118635 44665 125277 -142905 245811 1129 125391 -217501
12741 -105561 -49196 -99916 -166656 181623 48759 -22885 -122573 137385 319903 -61649 -55540
12730 -55540 -9747 -88279 51363 -73077 -219122 -27774 214321 -117810 19088 532237 -96320
12718 253690 311292 308824 -60793 168025 -281169 68745 -287852 212226 -30374 157609 -256984
12706 -77276 181572 -59658 68985 13863 -144885 201080 122076 184962 296195 107371 35895
12694 22181 342999 -113108 35948 43295 33389 349025 121344 -76226 147837 -423125 -55505
12682 135450 -249758 -328569 -200173 73268 -328861 67206 19071 105608 -167239 19069 125386
12671 125386 -158240 10845 330879 -313354 275537 166449 298660 113676 -298698 60060
12660 80106 356102 -26876 87488 68881 172648 87374 35334 33114 210132 -78168 -92855
12649 -92855 570921 304153 6473 320219 117492 -320180 135166 182051 28027 129808
12639 129808 50297 -147146 353468 -61601 102542 69154 -145517 123565 204436 -124518
12628 -170011 -6046 103638 -40199 13889 260183 -227338 -134202 -53487 90251 19369 235831
12617 235831 137756 39404 176607 293155 90239 515415 -66061 167284 348664 -59004
12606 282185 37602 292668 307034 309097 175890 34521 46170 69883 -86429 -2785 173314
12594 -427033 175559 195345 63729 62934 -70044 9766 -46413 -53968 -295012 -143913 -181244 101190
12581 -260232 -73412 152449 -144996 565852 160273 267961 30993 209453 293909 18543
12570 42348 -50550 -157500 -279441 453201 195566 78330 75924 -504046 52875 -37287 -16018
12558 461264 -12985 4983 -37806 238806 -157813 -245729 -303173 -37727 -86913 273188 35054
12546 168551 208903 -213086 -25294 -54604 75498 -307099 -50115 31065 94854 -320791 293861
12534 -187041 172592 44380 -199026 262923 128303 72996 -54414 -346841 254412 317995
12524 317995 13223 -10103 217277 32243 -336706 141648 -123343 71153 10467 -31268 -24910
12513 -24910 245344 90034 -109739 127466 38406 -166441 57673 -93055 -43335 54910 -227262
12501 -327444 142512 204584 -136935 392709 -212992 275034 -292672 222211 -16533 -82126
12491 -82126 409267 -93524 -103293 231389 357123 115310 -114734 -39272 -45776 -103429 -129412
12480 -129412 52277 207553 -186765 199519 -100525 -82762 154802 -279774 -53544 -8692
12469 359939 -10676 37432 89090 -208542 59047 187843 84244 -210130 -67422 -284456 -25230
12457 -215247 -297827 194541 21842 56580 41897 -61163 20805 65424 -343410 -241595 13268
12445 -39734 250232 278115 -106779 25145 -237844 -11902 240506 -244833 304033 -75204
12434 153898 259302 -37313 -120606 118895 -209737 -37528 -248948 -198468 142790 -160685
12423 192550 166549 -267692 -8336 -53544 377625 28071 250986 30926 93188 268323 -272375
12411 4599 -37542 -67198 -158328 204444 234378 121054 -278995 226440 -50071 117712 125771
12400 125771 161324 73036 21502 -120422 -58890 -103640 317779 -6361 120361 132439 -25502
12388 187474 -243317 -106108 -168219 344177 -256194 -568055 85761 118509 34766 16991
12377 -182562 156775 44475 74685 46591 414946 -375357 -85508 13167 -383741 160102
12366 130588 93286 43579 -59629 -152585 207221 76971 190049 -31729 -106278 240960 -142373
12354 -98208 -112988 -150022 231714 185381 -49811 -218547 202318 87620 -179357 263118 112350
12342 -53608 330939 -225903 -155558 359835 -34623 89680 18910 115289 -131757 -102357 -89552
12331 -89552 -986 -116018 1757 371795 -47585 454832 -257465 -43652 -112278 -234781 -103147
12319 32275 -55164 98171 -15941 -221598 -49515 111121 56425 330360 -303457 -130104 209682
12307 270835 -62176 193569 244817 -145837 -76718 291313 165330 -20488 -295263 -138781
12296 -69678 -5136 114616 46517 119228 -142469 -173488 248942 -169287 -68038 95622 -206387
12284 -106991 174817 -347900 -184135 326977 -278247 -203308 188130 897 80052 -83270 -173814
12273 -173814 131313 61409 150899 34895 368237 -61854 -171117 -13153 64237 -65288 -66336
12262 -66336 184169 114305 43926 158876 286192 -8765 78318 191274 -146190 41608 296215
12251 296215 -169301 31326 417171 116433 -154139 -35854 46358 -36763 268585 82751
12240 115789 -4426 -68779 92147 314259 90410 -24473 74341 346905 -22586 -166321 11499
12228 97981 -98552 -44330 12513 139008 116503 135227 -185871 77822 -122857 397867 143882
12216 231931 248275 202868 255010 365178 128246 462925 31215 51657 350653 -31489 131193
12204 262783 605584 492349 224696 262759 54868 131392 273007 38060 87342 60116 -83779
12192 21550 -57889 88188 206551 28848 131498 192063 89540 74589 40010 213727 296367
12181 296367 -26201 343245 -265576 144527 694 55972 -101104 -120414 150848 372190 82895
12169 386602 20901 321740 14926 -56347 178741 240857 -29573 207306 181010 31294 -121231
12157 -33920 -78146 -3627 327368 229514 278535 33731 -34728 312437 -220767 -76688 -670 -34956
12145 -34956 84901 -128799 11442 -39567 -170600 236760 360579 -27618 -185873 32783 165940
12134 165940 -153975 372844 -294871 -64052 168089 -176012 73725 -249877 42794 -54195
12123 61787 71612 48815 214169 305263 -412666 200212 165414 -38553 -136593 78719 119279
12112 119279 -67292 -98765 -120495 -190311 -141720 276958 -21272 -126581 -250183 -78528 -194312
12101 -194312 172818 33466 -104975 -267147 417774 -215338 -70334 181022 45038 101351
12091 101351 50277 -122192 193768 -72732 352984 43294 -187091 237612 27894 -253408
12080 33341 -1279 192922 93352 166536 -15739 147896 151815 73660 -147683 305005 -210290
12068 -405371 -46559 13969 -1336 143887 39389 199142 -48662 230220 279397 400283 83962
12056 572765 1386008 631947 394023 337921 342374 127389 227517 311110 156487 153531 -148540
12044 462324 173071 -51997 373340 253131 -293493 -93841 320775 -4277 330378 -20584
12033 -68189 -42649 35363 -5780 -21698 79320 34279 62208 -107330 311298 27637 -423116
12021 107089 111103 78129 86696 41464 -21219 65932 -102117 109166 -75568 35731 143972
12010 143972 133584 -95229 -171830 143886 164272 -380919 -179013 -393731 44400 264920
12000 264920 -96704 93896 178037 -125685 260519 -197411 160656 181611 -48192 93812 282622
11989 282622 -5067 -242018 104706 -120938 -63231 192081 -158186 -270431 -174467 -485199
11979 -485199 -21252 113477 253490 -14946 -115712 -74780 -71581 -176172 -15936 42593 -237347
11967 -127967 2571 205025 16729 44005 -187221 -31047 -31214 32134 18422 -32359 -219090
11956 -219090 -31080 59778 -38512 -91799 -76566 -143468 -229315 123738 139337 350838 85831
11944 -272143 1981 -191953 32247 21636 18008 117329 -75336 -43812 -451895 -187586 163866
11932 131978 -170752 168387 -163122 137717 90935 57505 -240542 -22787 -158430 -75018
11921 131547 10437 -287442 -188874 -12051 148463 18559 -176865 -8841 182698 -43795 -255865
11910 -255865 -82030 -54753 -258775 -334678 -412225 -37999 -436563 71636 -348164 -189567 37205
11898 -172948 -17407 93726 -79385 18886 -331349 -281875 158237 -187922 -82937 -299932 3537
11886 158812 -2607 -86701 150589 -272440 -199385 93756 -66104 -112344 2267 -52732 333886
11874 95308 183165 69554 2816 -131882 26833 188717 126419 -116963 -197041 -25463 -21227
11863 -21227 159760 -224755 98781 207451 10732 -156795 -85005 174970 -238274 -90849
11852 91483 -29867 84923 -95267 146735 165709 -184647 -286982 -334570 -148124 323138 -136715
11840 -118620 -83093 248846 -119355 -388501 -241489 45021 78935 -38297 -246639 52307
11829 -137082 -212585 -7343 -147888 -243973 -33288 -163997 -64763 48181 17293 38889 56741
11818 56741 65279 5273 37291 25974 118863 -157840 133679 25015 4926 -48786 -112766 -308120
11806 -308120 68743 26170 -3961 -104651 -67994 219406 -199404 -3648 119619 45169 -112334
11794 21267 -193504 -333153 -62263 -232935 -135048 -117359 -85714 -10351 48337 -29866 -134729
11783 -134729 42355 -152759 -26588 -20203 -67114 -76934 -180858 37578 44857 173175 234411
11772 234411 -251311 -70966 -26209 262322 -30861 9905 -66454 67777 -94381 170928 -46410
11760 -133563 -173830 -130546 -264234 84249 -74588 333428 -56453 13594 177324 132289 -91622
11748 32820 62474 -145396 -20843 -172049 6138 -102168 106984 117829 70275 94088 -136713
11736 252533 -225867 137225 -250247 12300 -173471 92368 -18023 -36431 -266051 147423
11725 -84853 365120 60074 -421414 -285463 -49476 -69026 4664 248785 381912 -49265 196049
11713 167279 -73990 145546 -16587 52387 155167 -116748 296038 -250917 -49753 -30476
11703 -30476 -131774 -236129 -102003 -122595 -2400 -8520 211859 -55122 199268 328830 -256912
11691 58591 -46647 54108 399 -30220 125515 265330 19529 -98832 -4776 124414 211582 -121814
11678 -196705 84158 12326 236949 149958 -107020 -348602 -377977 -230915 174774 271111
11668 271111 -121188 51813 74022 192707 -193596 -320913 173230 -188051 -53202 76574
11657 150841 -171973 -250972 220636 173882 -68274 -93479 410298 183769 16641 -11510 -421188
11646 -421188 4217 170806 -119732 -370721 30898 221839 -176859 -295182 188881 78754
11635 85849 26764 -75024 248336 -34493 -130279 -273714 -68224 240875 28546 -47953 -175404
11624 -175404 -183808 -191326 152042 240350 131910 50292 296054 103061 312609 49986 -156188
11612 135307 82278 -196267 -206405 101735 -169951 213337 114655 -168025 137532 -181717
11601 83693 -30133 -29458 295196 -40177 -101712 266928 -314180 -121448 70956 223653 -9988
11589 -45291 37453 48382 67272 -108187 39356 101628 -124838 85142 -270563 175471 24029
11577 -170347 -153590 -240604 232148 -206820 -20727 -128631 70094 30391 74014 1573 -82120
11565 26889 88957 80462 117877 21268 141926 142891 -38506 123066 284514 -172904 48041
11553 43367 240805 87239 -225037 -24137 -122977 77863 60855 -194803 140668 300527 -240125
11541 -223929 109177 264894 -245602 -65871 -57223 -159154 -15119 120411 -95839 279546
11530 -92779 14573 -20810 -150031 156115 -219557 29871 -80734 203548 40042 263220 104140
11518 178709 -191092 198725 -188745 304692 -54754 131983 299159 112856 79246 -149873
11507 111596 399515 180351 -54597 198745 233957 223369 88323 82587 195513 187739 70316
11495 -62441 197789 243253 84608 214454 -185351 209614 423327 68932 48936 253614
11485 253614 83897 154582 118843 117133 19504 271261 48398 33541 269733 187217 320468
11474 320468 136479 511039 268732 45828 80316 198373 138999 162253 242530 89085 30250
11462 6729 268665 104508 -50307 -234859 187376 -119034 123896 446497 230796 -185642
11451 132940 344889 387045 17996 331697 -251801 -199297 412188 196768 -37070 42438
11440 154469 26944 417417 243401 35183 244115 316637 -310521 182626 114696 -68671
11429 308896 247479 -38908 -1073 43989 27849 155452 -63771 103297 131142 116178 -69243
11417 45193 73391 378010 -66040 -185918 -107373 -42170 13316 119502 21390 -290329 -137746
11405 -153512 -183088 -26794 -150123 398 309584 -198391 -63263 -38951 -32389 81853 327336
11394 327336 -280657 49600 -174801 61844 -132524 179584 282240 -103977 -17209 102605
11383 -158814 -207683 42744 -7738 -60706 -233760 -296178 94838 126528 255684 234070 135893
11372 135893 -80625 391921 -53003 150663 32681 190425 -156593 -41668 13970 135909
11362 135909 -33208 3765 -162062 -31611 175631 149011 -376869 -88695 -154949 -226521 121448
11350 125268 -76242 12864 -288889 -193887 -85223 -21212 -273519 -220065 -117424 -120661 -156039
11339 -156039 -222769 99394 32183 119698 -221305 -8567 354222 71313 -209058 -313215 200640
11327 -10387 76045 77133 -109396 -180139 161898 212843 106246 -49569 156215 -29710 -268888
11316 -268888 -35389 -145297 -142 324145 35784 206282 -77343 -72320 -58702 76021 -14192
11304 189267 214399 -40752 -21306 -74224 -13040 -64302 -112664 -42630 -103807 -230953 -73563
11292 70531 427239 42615 222798 -311223 -253734 133242 -314892 194115 -142230 -292351
11282 -292351 245777 17734 -56478 -183640 3935 -80389 -60429 222476 -288259 -480738 149135
11270 37762 211142 -28110 -62850 -74129 -85484 -150221 -215744 234970 -50025 223406 44367
11258 -169881 56608 69017 -205228 -66859 68447 220353 -359551 -304589 -103393 111286
11247 -10897 -74566 -26922 164856 124456 21897 36979 6234 -280383 -308223 60938 -118369
11235 -145485 -71891 40763 -144416 -195909 38880 -176378 -556327 -73859 -159083 -200329 -124773
11224 -124773 -50621 66903 -513005 -176969 241767 -158867 -65843 201829 -334873 21189
11213 -356058 -129377 -69025 -6419 -134966 -188237 -112367 80836 -78977 110194 59260 208059
11202 208059 -189167 23055 -197027 182423 20388 78088 107816 275414 -345681 266855
11191 -138282 165438 401468 -268937 -156879 -85230 42847 2703 194945 103649 -210011
11180 -130236 -214679 -247888 -326366 -44569 -164169 138311 320275 202234 -8096 -170467 -267365
11169 -267365 -3154 179018 45094 -161998 -13570 123226 -233071 -79438 -230879 -288119 -95916
11157 34919 -93680 -112418 -122370 -219758 -176521 -112950 96113 -197496 -111232 197475 49417
11145 100616 115617 32407 217601 125817 69369 -310354 217789 6288 -37789 -49328 -86072
11134 -86072 214804 -267990 140503 229572 -67185 57367 -11471 -161562 -52486 169024 23670
11122 -24777 26705 -292026 -94871 220482 -135589 -128540 193200 236029 214285 126609 54737
11110 265227 -145701 47336 230445 -44020 -162508 210100 -40777 286683 96671 90330 455508
11099 455508 79709 -224462 -3774 33364 46545 -80325 31746 144041 22660 124742 85201
11088 85201 -95234 401013 461720 -267508 76675 12252 -168423 187935 -3550 257874 208062
11077 208062 167816 106239 237219 363701 77458 -61403 247132 -13965 -4936 196896 284017
11066 284017 452843 105731 -9340 46969 543770 165812 168455 264965 333297 -3714 163259
11054 66431 399194 407601 599899 -89550 323416 300730 161446 424652 225810 260922 414600
11043 414600 521982 376880 373662 683989 789137 493346 675732 662408 430646 292140
11033 292140 761029 607884 889033 634602 405521 871915 381354 349932 725311 1065263
11023 1065263 580507 707182 689567 721801 687747 568137 428896 840325 656683 740113
11013 740113 666465 585551 624801 625965 627653 642057 252724 509801 394540 1246656 527669
11001 440470 380160 458720 665936 554526 738542 650341 377369 386046 170145 570241
10991 570241 740734 659828 721273 539727 693488 835708 691579 553816 629216 419482
10981 419482 358592 304209 427005 502965 365851 463205 808894 719671 802712 689136 788129
10970 788129 566849 726732 1124438 1245304 945799 1263903 1197675 1314710 1022766 1590955
10960 1590955 1572365 1947098 2317846 2335356 1985597 2456087 2203115 1996460 1787319 1825019
10950 1825019 1771153 1318575 1520350 1123975 1005611 1150204 1330843 1148414 1479383 1043535
10940 1043535 1007943 1275229 767563 825420 821993 510878 610099 492091 371617 503841
10930 503841 79410 553069 184101 226519 297170 349261 122240 97381 374703 116386
10919 43867 162462 303661 173222 -163268 109504 23154 17661 -138477 -117278 52774 -7807
10907 208663 235887 372737 113075 -156205 140786 -103740 -359654 -288881 -30907 166272
10896 274690 20238 -190542 49343 -338315 -26268 159699 174269 -65349 -111434 -44178 99451
10884 274773 -266490 18233 276392 -2912 115852 -164178 12382 -152801 -77106 -124302 -7100
10872 -318833 -274423 103868 99718 -351391 90126 -41913 20953 -22784 -5258 32078 -242256
10860 -319190 110287 -220359 210505 154190 -32960 41706 -66262 -83372 -389654 6348 -131381
10848 -394505 -152035 -405500 81454 -141207 -66812 -31477 -28968 118534 187695 -279236 -193961
10837 -193961 10471 -98824 -216991 173748 128572 56832 -170071 310182 107360 -52234
10826 -126613 214236 -36491 104132 82402 -248901 188441 -186586 90121 111615 -368083
10815 -196025 -171814 -345027 -132895 -129294 266348 119266 -210851 -32054 119862 -152189
10804 -206358 98060 106088 -35919 85205 -34235 74250 -88295 -446376 -298163 199615 -23271
10792 232405 -164336 7102 229567 223241 -191864 -109186 -290601 132909 -170437 -7642 99692
10780 162094 36341 27418 -24568 299066 177862 172239 -101162 -128088 -5605 -235538 -91724
10768 -320082 -75855 -135469 32295 173527 -162502 -141856 -160825 -92996 -40717 -180577 33739
10756 -100360 3650 38855 -48832 -192926 -256375 75184 -197222 23831 61664 -61332 -119008
10745 -119008 -197778 -236307 18377 121515 -114882 -295673 -166353 -227334 212424 -151843
10734 137628 62260 -235485 -433380 -115051 233743 110608 212593 -90373 117109 -307533
10723 159465 -468086 149343 66942 27890 -36997 77506 -37510 -235285 178168 -145286
10712 -54418 75032 43875 41431 -164477 -224636 -82044 119690 67241 -50566 -71609 -147524
10701 -147524 55847 137471 153924 55948 -164804 -342149 -319567 -198875 -82659 -6803 -349552
10690 -349552 123581 -84981 -121995 -56600 36643 195027 -14881 -25003 213315 -181364 201183
10678 -93101 287166 -72630 141531 166266 -97712 -509593 -229424 -238459 -155170 -202076 100655
10666 183466 -1942 -38200 1062 -219316 -311422 -319124 -45947 -88014 47608 163592 17442 -549606
10653 -84833 253223 -173796 -43669 201664 -122362 -78549 201953 57527 -268322 -149613
10643 -149613 -156024 -186115 -38610 -113222 161134 -205459 133240 -95729 106999 16640 -24534
10631 67964 46618 -8139 -118183 -13480 151746 -219878 -245836 2046 -95242 115473 21711
10619 217073 -69996 -234660 -173715 185548 -114926 -105032 163310 312173 -174245 28720
10608 -432830 67123 2905 42570 -203977 -8861 45407 -128280 -29578 -95290 220871 -32638
10596 -113115 190649 -150006 50953 18863 57572 -80167 487358 -81040 -287572 205522
10585 90887 -44412 -219501 26595 -16896 56427 -215392 33882 31305 183894 169376 51763
10573 -334409 -31999 -18099 -4559 248326 -23394 -33054 -44798 -198445 1836 18730 7962 20936
10561 20936 75019 -75000 -342567 -197561 90587 -166115 47581 -314342 241055 246576 -119788
10549 -135538 121820 225013 -163831 58586 -12749 -372376 -328665 43807 -127028 -23311
10538 88561 -13664 -2986 -134412 -121937 -179797 -252763 -363989 -5546 2850 -34364 150452 -86064
10525 1288 -211202 -48184 -194336 371267 -32595 -298133 -121573 -74147 -12603 -101331 -187411
10514 -187411 -218070 321727 -166263 12937 113205 -90295 -112173 49687 -147929 97388 145893
10503 145893 -236369 -326668 59286 -118781 -110917 -269315 -8879 -25421 -22868 -57587 105849
10491 -90711 -176482 58045 -367865 -272950 -196775 -334978 97613 -88087 -89162 -208801 40717
10479 1134 -94626 -52777 13752 65876 -95015 -229569 -76194 233515 76217 242497 99054
10467 231474 43968 200265 180557 -108679 78637 16851 310527 -164749 209094 33379
10456 -230551 78077 16878 -84876 -69157 60431 100393 -133846 -51408 -57976 -375006 64861
10444 -425842 108722 48867 -263673 -39617 -54551 -859 60353 212558 -66527 -142682 -59686
10432 63152 -84459 -59007 2104 69337 177700 -397386 -205785 176000 81845 -32582 77930
10420 47386 -58509 -121694 74708 -33172 105136 -159173 -2451 -201884 -190427 -87255 -534383
10409 -534383 23568 209072 91633 153747 -72621 -233300 37881 47125 -6285 -101023 49863
10397 314481 24572 -517339 -167662 119836 138719 -30219 -45633 88930 -3595 -116812 -13120
10385 118118 278541 -265415 -153481 60628 219797 269894 243520 -88465 114148 118022 96664
10374 96664 63734 153830 348937 7693 91232 -77657 -2203 -40075 345834 42942 103798 -161829
10361 99805 452842 214686 167888 520443 375038 238942 323360 125350 298018 223165
10351 223165 217964 139882 333657 255931 -7360 243483 382042 143600 83564 -81936 405414
10339 333906 175893 152150 253823 444909 202839 144191 500235 331796 431744 315562
10329 315562 341079 337546 178713 426010 185865 162973 97886 -84818 306356 459801 122565
10317 -1723 186769 -220375 272715 125351 -496602 -79747 -120190 -42305 286241 -17844 135519
10305 426736 -63106 193991 38647 -29817 -240807 128999 -98674 -196201 -24730 106007 -220559
10293 148726 234428 -190332 -61307 59353 152412 -335816 -69618 320776 24818 -42876 30877
10281 -140085 -7399 -57863 338185 -33019 167059 204732 -213840 218343 -138633 127586
10270 -44624 -230659 192883 100526 -96473 -65250 -8927 235030 111342 -45319 145608 152219
10259 152219 34208 72949 -193478 -75895 -365990 -311713 234848 -15567 447877 -83621 272136
10247 23342 292562 174212 -9515 250351 80791 105031 312546 32911 132015 -29635 -38596
10236 -38596 47915 -40303 -135809 116114 -9219 26971 110369 -379512 164661 -142567 -266659
10225 -266659 -2555 -14151 -190032 -242117 -17811 -263133 -82195 20532 402031 -101243 311754
10213 -50100 231772 -20235 -51649 -63601 -183380 -294032 214261 -241494 -234981 -243341 49617
10201 -81973 -83390 -8268 335547 -14505 124010 -140323 166063 -182362 -15474 200541 75708
10189 -156669 118989 -327214 388665 -123324 -40063 218532 -124865 -146953 -54620 12447
10178 35471 -17885 -122213 62142 -115203 -51375 70512 -148496 -221701 -99156 135986 78270
10167 78270 -256817 94525 -197822 27161 23768 225586 -12499 -111944 64489 -38356 295960
10155 148879 -11560 57396 -195540 22084 -74955 -46640 87129 -100893 -130766 -121428 -174131
10144 -174131 -211511 3983 53600 122455 -237984 124070 225776 64533 -293900 -19521 -275291
10133 -275291 8889 559 -138780 -1520 -1504 141548 233358 -295384 311061 275169 11237 3215
10120 280115 -4601 -295058 -159774 -51595 -119564 -23626 79190 -325019 65784 27003 -27996
10108 87170 -556527 20916 -173561 -214374 -60801 -65233 -309566 -19109 -82051 31678 -171159
10096 -115872 -248025 -153261 126852 -295787 -19485 -24084 -53953 -214788 -194476 255588 -328133
10084 -77242 183282 -183752 -148257 -55315 -48118 -315248 -65279 -661 99723 -209159 -137186
10073 -137186 34240 128114 -486084 95619 26731 187458 -112583 361544 -150038 -6903 34078
10061 -74342 180840 -115298 -243489 -259677 49885 15535 37222 85539 -10964 -17133 294901
10049 -116859 -63441 -141715 -153633 168978 66210 308094 -4195 -237981 -190909 9156 127337
10038 127337 -64614 -482314 19752 -202117 -179220 122398 120538 -294982 -86018 -29321 -294745
10027 -294745 49996 -473497 29062 -33149 -58975 -191993 76580 -84200 -44426 15740 -125953
10015 -136055 -77572 -218893 -249593 327950 25574 -261009 282922 -171937 -151134 -138759
10005 -138759 5998 -197646 84004 -78703 -99001 -168782 -296047 -91507 187081 16335 -190498
9993 76114 42569 -453781 -7469 193388 -360437 176604 28147 -137110 347856 -109987 -112051
9982 -112051 116476 -183544 94573 15104 132343 -210956 153332 -53032 -344631 -295791
9972 -295791 -130016 -192551 -273281 158817 -32928 -8529 -68256 78429 -68380 -182983 -282705
9961 -282705 12792 -78193 -210415 -144961 -200616 -31263 -212575 -67701 135777 -136811 137806
9949 21866 51659 -92416 -17722 149836 -132423 186028 -37311 -7011 -57530 60404 -349708
9937 71380 -47400 -361768 10693 150376 34568 -343562 196172 -297536 14802 -50443 50572
9925 -134154 -152068 154671 -381261 -101050 -380798 -191324 -26719 -99818 -111275 227965
9914 -281928 75248 -24394 51736 16304 5872 110041 -352329 -21950 -28376 212350 -453593
9902 -8080 -63180 479992 -71492 44820 3658 178676 -34016 -30307 -82093 -210841 -55645 -403845
9890 -403845 34516 -157975 475532 86461 -109616 -10174 111689 -35999 117424 37770 -121688
9878 -318604 -18057 -183109 -306891 206150 378301 -55397 28495 92088 -165212 -169797 9633
9866 -502229 -442227 -140765 46763 -196384 -94804 -234725 -184054 -78575 292646 -206505 167234
9854 -285260 -118284 -32478 -109230 47188 -261899 -37311 166393 34649 168343 215334 -233049
9842 -125868 107174 149188 -354398 16515 -28318 88359 -3304 94654 -294542 -98255 -49453
9831 -49453 -10594 124250 -301693 62458 12431 -68421 -41945 -476342 -124592 116963 164840
9820 164840 7240 39973 -79617 -188672 153985 -217152 102248 -55466 317064 -274646 15927
9808 60189 -30017 -460371 -305930 -111032 -24960 94866 -158979 -411806 -127557 -166034 270078
9796 183814 -81862 105041 143775 56474 -107889 224415 -272457 -67818 80508 -27542 -363204
9785 -363204 -102003 -276704 -22883 -222632 320974 -211493 -365696 -381374 2200 -222504
9774 -232918 -488820 36710 -31384 166452 43436 151028 107779 28567 174579 95472 14051
9762 90081 144906 -316852 78540 74327 140561 -223263 193036 72116 222121 88664 -219295
9750 -56205 179696 87899 -132758 -337324 320137 -298203 -194418 -346163 -240892 312958
9739 -290522 -137879 -215075 195248 -122463 110442 53382 -74264 -104775 83175 -143127 260759
9727 -229037 -291809 -114212 -80908 -107765 -140311 210632 -48883 -72442 -234017 -156816 392081
9715 272300 -244125 -92806 -73842 209631 -102222 200363 -42091 -143328 -287994 -40679
9704 -232446 -215323 67989 75628 -137826 16366 199196 440872 19507 212573 44590 -133290
9692 -386058 -204901 -197108 -204478 -124262 -48744 -28307 222167 193103 -93998 119165 24650
9680 -27011 121840 -18581 59375 110698 50170 76736 27372 -54572 -7492 -217777 -91362 -17236
9667 -322468 32827 -260261 -286807 -135184 -269730 -171836 -221226 -174588 -218345 -85777 240972
9655 -59906 112940 434215 -64636 -107064 27843 -31255 50029 -193237 -67395 -354785 -182303
9644 -182303 -106983 -285479 8098 -158118 -277052 -250566 -418729 75108 -133176 -285656 -334810
9633 -334810 -101919 31700 -347615 -206918 -45119 -85278 -327124 25426 57659 61572 -41351
9621 -177649 15636 -55590 -353861 244869 -384205 50111 198687 -33709 256767 -98508 -49946
9610 -49946 93447 -77690 -129125 -107430 -26259 31122 -48934 -248903 -205603 -349220 -161809
9598 -39871 -162150 17234 -473595 -106883 -3264 -189245 -48633 -102058 89571 -136948 -44422
9586 58960 -35779 136924 38626 -107879 14155 -152171 45077 -72766 -318033 -311550 -192563
9575 -192563 -224464 -64460 35254 -178865 -60024 162394 -5447 3715 -30872 -125154 31681 -28038
9562 -97531 105092 -51063 158740 45693 -221104 -173446 107207 -136752 -193938 180745 -170367
9550 -411703 248115 -23506 -257965 -137460 106005 94377 -208476 15764 -52084 -169365
9540 -169365 44328 -42868 -333290 -14407 -140477 -66210 -77681 -174810 -20568 -324156 -37909
9528 -145969 -307124 198802 -139272 -70494 -194731 182495 -385032 -221411 127719 6506
9517 -50325 -375040 176278 -229010 -67845 138591 -238302 202582 -94963 -262154 -55518
9506 -189418 140419 -11464 -126141 67458 -175815 -347365 -242653 57616 -207350 -157978
9496 -157978 -171525 -168938 249985 -139837 109646 -325359 97128 165768 -129581 -342863 -308046
9485 -308046 -119818 204718 -163146 121017 -207991 377410 -211803 -139945 -290335 67082
9474 336887 22171 37553 108309 -127934 223733 29189 90798 33187 -18522 324588 -146104
9462 -252066 184461 -291174 -66280 -137389 -138792 -117144 372809 61245 -312840 -140050 -197670
9451 -197670 -211131 -55740 21575 -327778 -59835 -430998 -170475 211960 222387 -191532 144181
9439 -142313 -219495 182302 -286007 3213 -58257 -53774 77262 62405 73505 107884 -12825 31744
9426 -189007 -103289 22258 -136293 215347 -43236 138296 4892 -14950 -6333 77791 -205971
9414 60059 -182322 133933 -92797 775 -92320 -133469 -193971 -187113 -75926 -263126 -37237 -25835
9402 -25835 254128 -168403 -157824 -86077 149261 40814 -125942 154064 -1629 173111 -15888
9390 -15557 -132918 -274886 333272 -123590 -198757 262451 -86199 72736 2687 -158260 -100428
9379 -100428 -286364 28435 172395 213101 -204289 -65117 78231 -4318 42047 -219110 -296359
9368 -296359 134421 92666 -279706 -238485 -218496 -90745 -95086 -45318 -241524 -122738 -42562
9356 152226 -208531 -44625 -201589 -27462 152174 -73290 73939 16924 165052 -113449 279099
9344 -66696 -41697 -161595 -99054 -62580 -178208 -235815 88758 -122813 -107437 -139633 -58000
9332 90313 -109042 -384059 -63472 -206857 6939 -67995 -49799 -80647 212433 366887 -150834
9320 -288637 -186162 149252 129531 294198 -280187 -502183 -166201 -3949 100708 -4354 18698
9308 -127031 -60961 -285758 83113 -4223 10972 -86645 16318 32842 -12679 206097 -65970
9296 37916 116615 114527 55300 26855 152765 158367 332641 9664 -263691 -198234 -141271 178294
9283 -326557 -90182 116642 -69654 -60872 232438 305931 -66048 -167610 -378559 28428 -43557
9271 175405 -28619 -173796 -64755 105585 -28278 314037 -169258 163272 99208 151225 205648
9260 205648 -292706 -237604 109227 -174819 -162277 -89388 157576 -56617 -268773 -180823 209536
9248 -145617 -284972 -370217 -191329 -141611 157700 38011 96309 -140690 63910 -23732 -350832
9237 -350832 -298484 -244564 -76325 -66131 -82688 92510 -134734 -173087 76173 -30853 7517 -251232
9224 -7931 -158914 -340540 -278703 -262991 -17585 131888 -76895 53403 -52151 -278281 -249327
9213 -249327 -84182 4524 -145548 152873 -195229 136200 13448 -67622 -322916 123660 247144
9202 247144 -268201 171028 -8143 -280313 -241112 -12060 -66362 -138861 -163963 -204783 15802
9190 31586 -125734 235921 190142 -50476 -112836 92074 -283632 64213 -19669 44386 16654
9178 -149037 -392057 41856 -120103 -102759 -27505 -207445 -48810 -51361 -100067 -322794 177574
9166 -314294 -51131 -28857 -224498 333514 88546 -61306 131760 227037 7907 -209922 188799
9154 115601 134022 -342175 32786 -343257 -251090 214069 -466814 -129519 132981 -48633
9143 42260 72135 1824 97811 -20142 4379 13998 89812 -246891 -52309 -115525 -209494 208611
9130 -98106 -76242 376223 -11498 -168903 104411 -96626 -189561 -192947 76165 8199 -70198 -132293
9118 -132293 82064 -268554 305291 207004 -106149 149830 56733 -286522 119537 335956
9108 335956 81657 -156927 -275410 -24538 -413412 -45079 265049 83517 -394010 15982 158959
9097 158959 -102971 -125081 -529750 -241664 -185785 -11385 -89129 491480 -289297 -144374
9086 15297 -141678 61351 -38474 -82527 -138584 -202579 -8752 150098 -52725 -19358 -72194 49551
9073 -46170 127781 -276917 -134266 64046 -65636 26710 76044 -241386 199039 -50665 -230313
9062 -230313 84843 -113520 -235817 112390 -148743 -116128 -80807 -219341 -187391 144113
9051 29033 140081 -85512 -13550 16436 -142142 -143381 -37053 -194370 -53162 133499 162414
9040 162414 -74708 -394827 -111305 80178 -80162 -31700 254962 52189 253516 -142036 106798
9028 -164824 49414 261619 12438 -277799 249163 -126781 -72946 -225124 185 -84849 -31691
9016 160965 -333419 -210954 255825 -172871 172131 -521971 -210219 131397 -59364 -245385
9006 -245385 248824 -542563 -267519 -160858 -15008 -32754 -124248 202908 43154 -349138
8995 -235372 78843 71253 -201386 -36434 -67120 138037 -94704 67948 -23118 -121314 -299148
8984 -299148 -50134 136715 -232993 121461 -253079 -189415 89746 30138 374903 2431 -189042
8972 -150248 273024 -134482 47337 -207792 -59687 176294 -226780 -304164 -161991 -51094
8961 211076 -21480 -127984 54775 274904 154286 -318391 -63732 -35682 205139 205045 115047
8950 115047 13057 69063 -2093 49885 -296282 -67737 -99705 -68903 14786 -487034 -53055
8938 24431 -103200 -154014 -293090 -465301 -233324 338895 -166905 -75205 -133149 81325 102773
8927 102773 -90130 -346515 -128267 -9217 -362159 166439 191882 145394 164987 -76477 88700
8915 -103993 -40136 171961 91963 509212 383829 910011 1407523 2658148 4653143 9948454
8905 9948454 8225749 3699570 2410181 1255802 1079964 688441 571271 357052 373344
8896 373344 359178 138274 10296 -119963 235713 104079 146117 131136 -49034 475537 40995
8884 -274242 -181739 68612 75280 -182925 108813 -112134 418684 -37754 -278057 -50747 -164310
8873 -164310 21143 -130015 -51157 -124033 -134481 -22738 143967 -220268 141405 -98030 -48586
8861 -7631 -140579 -153378 -86369 146529 125461 -64889 -54223 -222339 -188964 116954 -16806
8849 -206408 189637 41516 -108658 417300 -287941 68786 68637 -132408 -347868 57490 45399
8838 45399 -255527 215039 -157086 -75699 -191544 -587798 399926 15569 -131083 38663
8827 -7972 -315444 -339578 16966 -95172 89780 133394 -29795 -127306 -19832 88716 -49289 -62770
8815 -62770 -219334 -309619 -205694 179716 46329 3224 324694 -249217 -82455 -31294 -99981
8804 -99981 -51625 -19706 43758 -98142 -153260 214264 -115267 -97152 55289 166579 -143564
8792 -74290 214854 -100041 -240538 -134797 -184941 45309 -107321 -89169 -53846 -51101 20784
8780 -104693 -182179 51284 -53043 73152 -52662 -259750 -76657 -234615 -49719 77371 -64143
8768 -314874 -94773 1126 317172 -196437 225919 222698 203673 -166454 -182326 36789 -6861
8756 -239088 130183 223375 -54317 -119287 -105061 -79992 -234916 -74302 113627 64194 -225614
8744 -59926 -133074 -29525 -414157 -194855 135039 -428428 67959 34712 123056 -204768 203196
8732 -171370 174028 324077 15192 36209 -58971 199460 -468323 384 -150638 -158598 -12776
8720 10794 -3369 191890 -108217 -84980 82822 -106780 -59071 -220018 24915 -52369 47420
8708 -276029 13612 -151828 -128015 166941 -253853 -35633 -61230 64471 -75127 149592 -234750
8696 175417 -169596 18183 167212 -142009 74170 -257558 -13302 -312978 -156517 -370560
8686 -370560 20687 93160 -87245 315203 147153 74572 -513001 -67129 -190865 -291413 -116186
8674 -138033 -11856 -227893 -248221 -143564 25265 379791 62291 365899 260524 259895 -79343
8662 -126532 35929 -65686 -232873 63256 -331700 -25941 206290 131274 -171794 -59569 8259
8650 140885 -202447 -146332 -428831 -99651 56118 -34224 -88737 35350 -10772 207228 -281093
8638 -44881 18301 112091 -195480 80948 106770 -48058 15608 8686 59269 -283195 122289
8626 -132460 -97155 -401548 -103407 -37515 -4814 24166 -142928 -132663 8448 -122131 -20731
8614 -176352 63764 -23047 -359949 -55207 -78586 -364830 -152356 -87155 -10333 -303583 6 84157
8602 84157 -14859 218729 67360 99142 39087 -41230 -162482 333661 -94819 -20850 -131024
8591 -131024 -70695 -25949 -5734 -264324 72 -96930 -68187 -326292 80971 -101826 46368 47272
8579 47272 118113 -43273 92869 -16662 -143544 -357701 5689 29471 -333513 -116087 -97228
8568 -97228 -6897 23771 12081 50188 -160066 -67431 -123630 -219352 -187764 114891 224209
8557 224209 -44219 241095 -43587 -35763 230890 -138896 -164997 -79023 -265832 -67449 -111773
8546 -111773 -188299 -148775 72142 77322 -354398 -199350 36679 -69433 -115122 -256306 -160905
8535 -160905 194042 -72771 91897 46276 -110666 -189405 44385 207894 112833 -61027 2236
8523 71818 -59135 -37927 -7507 -18734 149311 147181 255403 110670 -412607 -224583 -245638
8512 -245638 -309352 128327 -166696 -28973 -188397 87146 191093 63830 181314 -135061
8501 -320337 -154605 91244 69058 237416 -197723 -59552 141613 -179519 189573 -229637
8490 -74662 111712 61525 -359567 -108858 -128618 -99441 -66157 24698 -31788 -80781 -116432
8479 -116432 131273 69538 105937 25431 57840 201447 -178273 -10090 -195798 161122 277966
8468 277966 97149 -354213 106233 -95436 94537 -32554 127007 -77580 -74309 286923 -48899
8456 139032 -467449 127282 -215147 -176172 93520 21513 228100 164866 -249443 -268910 -138951
8445 -138951 175532 183375 -140288 203839 -193787 -41058 9140 -39029 371487 12034 -21285
8433 10581 126758 139874 -242462 128291 -54229 185711 31576 -102734 102020 36821 -77586
8421 152195 -6821 30078 -224085 -137380 140402 -5131 -285722 -38054 92497 -12544 -126703
8410 -126703 -432590 -54588 -117646 270874 7523 24702 -102173 125767 241490 101547 -357121
8398 -113993 -146180 56406 70585 -15326 25442 164117 -81697 -134349 -88280 12945 -91308
8386 -159336 -268610 -24483 -181597 51280 -158891 5194 127001 39558 -357584 -148435 89777
8374 -180274 -36156 429910 -4004 360132 -265171 203206 -316903 -30691 163318 194479 -104928
8362 -52125 -180028 -143156 -43682 -219731 -116100 13106 -37701 -277975 -161812 -127588 -9712
8350 -86404 243526 -221618 -128976 -30633 -135004 -76903 139712 16638 65324 -29668 -41705
8339 -41705 237458 -36350 -270926 -954 -182992 -52148 -200281 -130092 -110662 234053 51784
8327 44868 -224899 -162819 -28362 114135 -177533 -82670 14976 -2456 -166755 -320787 154542
8315 -203714 -31492 -117568 58923 -7958 -193584 -95138 -190855 -322151 63621 104023 10268
8303 -99460 138086 128965 -364346 13952 22495 2267 -55943 309982 141892 154203 -92172 -259840
8291 -259840 338439 107735 135703 -23772 -28883 101965 44053 152653 -193847 104393 148935
8280 148935 33866 187145 248108 -251001 -260140 -271353 366784 -226783 -44587 -131743 -498152
8269 -498152 -238959 -161565 89466 -40635 -46608 19246 80179 -82926 170415 -77623 -123238
8258 -123238 -61613 -138243 -310062 18408 -48748 266400 19903 266327 -76817 -23361 180189
8246 -78254 -138537 65823 94974 152705 -153934 10897 -85594 -24672 -279116 153652 21795
8234 264686 -127865 -40780 81450 100722 33058 2177 -12642 -78772 -64840 -232426 -72457
8222 110010 62286 -155092 -125026 45755 35079 -68439 -454517 -268293 12409 250997 46481
8210 153344 -67918 -5832 -298970 41760 -130625 289848 -120106 -31002 -265726 310698 -362100
8198 -176057 -278935 -99564 170264 29644 -65954 110917 -208659 56851 -341242 85633 -150984
8186 119827 -125167 -222732 147723 -55863 379645 77713 -259522 67073 -316531 -202720
8176 -202720 -185956 13233 -26491 -52879 266964 90660 -127215 138726 231368 -39706 -179108
8165 -179108 316022 -100094 -27740 -99660 -285336 -94384 -428293 -1545 218182 168406 12076
8153 -237414 -97012 166619 -241647 -25509 42129 245408 99276 81372 215812 -84024 24144
8141 36923 240556 -136746 -249042 231136 26176 -271054 -56511 -408081 110438 124230
8131 124230 163370 -144119 56064 -4372 -125568 117983 -115978 187689 71187 -386713 132464
8119 -110738 -182379 27287 -130508 34673 -103441 -58134 158694 -100742 17577 -318129 8988
8107 29213 243888 -115171 -83034 7456 -98267 -17020 -59582 32569 60139 -106345 149864
8095 397584 -333733 -75973 303830 66308 -339026 166484 -195658 -107229 128267 19426
8084 120838 85061 -149866 -181827 -219578 -59720 133733 -341284 -103250 -248829 -33679 187506
8072 -18575 -88454 26813 148108 123679 -81320 -16146 -150129 -88975 52878 99389 -219404
8060 56858 -66294 -133690 -158651 27690 3894 2329 2767 -200871 75670 16163 -485735 138964
8047 54916 -170024 6180 -26153 -133371 117289 -256877 -131951 -8383 -168476 -481147 -15944
8035 -61046 -122973 30073 51756 -138110 -226376 162168 95971 12622 -87757 -35144 191616
8023 249550 -177729 -400670 -163542 -234089 -259429 46264 -149564 -30011 -126916 27631 -140362
8011 65584 -135713 -226006 369589 71282 235238 -68328 197783 166771 -56319 -340913 -178045
8000 -178045 2 202192 67696 287196 211646 -145393 269006 186486 -184415 -146053 -117382
7989 -117382 -267860 438 412183 56716 -80286 -29708 -109459 -149516 -311091 96702 53981
7978 53981 -136951 113877 -123530 -53030 148918 -94706 8894 -6211 118863 84195 204739
7967 204739 231219 -250584 -98744 -84336 -439628 327710 -72316 211803 -2439 309148 -182427
7955 -87130 -92572 5819 -278018 82044 -266884 -92183 -224632 163475 -182995 -367388 -3020
7943 60085 81955 -4976 53787 -117029 -512574 170393 70642 -59766 4780 -198069 -18520
7931 81557 -332802 18779 246399 -44598 77676 119923 81980 48892 -196882 -173776 -128522
7920 -128522 -61291 -337377 39057 -71818 28505 204451 -5394 94299 261239 -213543 -181698
7909 -181698 -111653 -150825 351362 -260403 279774 -56855 177486 173360 176717 -53271 11 -207071
7896 -220566 -61720 -39536 214126 -233145 -21973 86504 84 -115750 -121904 406884 -66443 -378247
7884 -378247 -85030 -65007 -115653 -132282 -174529 -96754 136339 -70033 -124580 -92463 50902
7872 -71257 -202556 -133109 207030 -187411 -29669 -32690 -51496 64866 72296 398088 119696
7860 -393272 -155640 -174895 -248122 200934 -51647 -136896 101174 165700 -26017 -131027 -242390
7849 -242390 54215 -283592 -129872 -107125 -15871 99540 332002 130607 -113654 133507
7838 -123381 59285 -135976 -263819 30403 -14998 -41740 172434 177249 60383 202438 306951
7827 306951 150381 123386 -231918 -79247 -100858 -81237 -8326 201280 211773 27389 -125762
7815 51915 -157090 140636 -452599 -148961 130857 349611 -408729 53946 -9616 94447 95983
7804 95983 -139351 13904 222365 -77769 115274 42102 371996 58979 35781 -97196 5441
7792 -32814 -4162 -176423 -471388 -180619 -44372 -12797 -159779 -142877 -159673 -235046 33106
7780 -15524 -76019 -75864 -336904 -14612 -140577 -344458 348066 22991 -174789 -213172 -265637
7769 -265637 121205 -75307 -246406 -168672 46519 204486 -117487 -486382 162594 14236
7758 83876 -53597 123980 -107263 236159 -216444 69508 124122 -39661 80443 -116894 -97539
7747 -97539 -220005 -108233 -314294 22852 43243 98233 -97136 -43245 287161 79552 -132163
7735 -54037 -170228 167108 102327 274473 70408 -71074 94139 111718 -254302 39976 1202
7723 -68795 -27975 183751 3341 -108345 -152886 -93564 -13530 264829 134186 -257885 14278
7711 -56896 106881 -133041 -17672 151946 38162 129583 -194611 -105364 -61330 -113304 62541
7699 -124683 -83721 -16047 -168173 53951 21357 -226955 239518 -81997 -250477 -253715 6517
7687 -370782 185763 -180545 -4440 -225480 -53440 -67545 -354045 259216 248124 -142722 -66772
7675 33673 186568 96333 -60497 191514 -152359 219578 89856 -35157 -68107 -85693 33493
7663 -239907 236091 14351 -111264 111551 86343 -253780 200767 -213887 136940 -140174
7652 44478 99586 151900 -45616 -27585 10989 -34353 128729 -162156 42570 -115876 117662
7640 -55783 -9232 -109490 -238920 -221911 -83289 353912 33387 66106 -68230 179847 4035
7628 62549 -281959 242135 -104865 79084 -61407 271471 46218 -204683 -104108 -13115 -166575
7617 -166575 -94734 -15110 -82698 51090 120215 -270536 31400 82352 -82706 -323733 28173
7605 -181953 -145573 222060 -113016 27487 -51605 101371 114984 177057 72487 3847 -158883
7593 910 -51057 -71003 -216262 57755 -77432 -52870 -243065 -172516 51841 9970 -96280 -129575
7581 -129575 35610 98129 -131400 231834 68136 -260691 -151730 -43920 41100 182008 172641
7570 172641 -146296 -24575 7068 166933 94762 -87096 -20400 376022 -27737 43977 153173
7559 153173 63974 224720 -199516 -154474 144138 -73809 -287987 -317921 -235832 -326333 -63567
7547 -235641 125256 -182828 149810 -100732 -129682 116693 -22640 -264654 11183 152626
7537 152626 34288 38624 -200583 -264440 131907 -18613 31768 191517 -158564 288010 -93419
7525 -36592 -196204 -9049 -219101 -111006 19329 -101754 -106816 -232210 -199167 -60920 -110673
7514 -110673 250901 347099 -132898 -47908 -216148 -331077 110485 46632 -116716 30889
7503 -192455 85241 338745 84532 -317583 72629 -511074 197468 -303991 122618 36561
7492 -2820 74132 127486 -135806 210680 -245407 -179804 -36510 46118 303239 170197 42753
7480 -91964 -287807 -58528 -61379 -153875 -153834 110411 -2918 -72299 127857 -84790 -281721 209027
7467 -177361 157954 69164 -145767 -204626 35362 -153514 352520 196295 25939 -86103 -39752
7455 109769 -70929 109840 -165546 270632 164409 -181655 337901 211614 -145932 -17437
7444 79889 143264 71768 -200549 -3543 -150654 241552 833 -129150 -234042 124247 -118655
7432 132378 202415 67442 96318 89223 -126261 -5562 78876 -50176 -127455 146882 -47443 -418032
7420 -418032 -67605 -6686 57167 -131944 5648 15106 140507 -2447 -13919 316853 30766 35704
7408 35704 -199191 -109009 -157467 -192635 -217994 19745 -297791 -170460 62252 -314671 -166691
7397 -166691 -164496 -34667 37360 -140747 -91357 -21432 121730 -139049 -83912 -67792 -487379
7386 -487379 57060 88651 -237179 -4822 -63603 -163405 -210865 59177 -240525 172227 23706
7374 -76878 -175884 -219948 128932 131684 -154872 -120711 -72756 -417424 -257398 230523 -115354
7362 -120227 26954 110462 -228696 90378 -6778 224022 -165140 -95998 43676 -104340 178725
7350 -106224 72662 -369726 -67611 119278 -231188 33863 -322657 342585 95207 66226 -18526
7338 16153 -89919 -196180 147980 -260476 -147728 162796 121578 -109399 -115925 -25352 207911
7326 -134400 -114533 -197149 -25748 -145388 153812 -261560 -90380 12182 90091 -78062 -2597
7314 124584 -199194 -75561 87574 -231846 -544611 357873 111517 -271886 19584 -94570
7303 -41014 145069 162907 339 -183165 -59493 -83210 -60023 281922 -54106 133063 69065
7292 69065 -153958 -142804 -390653 -210671 -166048 135014 -66561 62675 -158273 252643 43417
7280 -132484 422606 -231036 -28728 -208838 -80202 110414 -203296 -132688 87261 -755 66491
7268 -252579 75694 30889 -16804 -68138 -106961 -195679 95521 -270216 -463823 -211820 124645
7256 643 -239043 -19860 289350 -65010 105788 -65989 -215454 -68117 -55052 169902 -148947
7244 454812 -332221 -228029 -210304 -53538 -76547 -65554 -88605 363786 -39503 313148 -198293
7232 -236790 -122915 -33341 -257786 -400928 -733 250444 67515 -15719 -93706 -4165 -117471
7221 -117471 -1196 -346925 8688 13066 -83860 -174070 52002 -290905 111321 377541 53212
7209 67002 80485 47446 -171736 11676 275805 -236133 -163660 53830 268132 214327 42193
7197 123121 -12212 -154013 473974 47837 165268 -75392 97232 -2615 5222 171239 80911
7185 -22224 -99422 62703 -239563 -384101 -12811 -2182 333421 196500 -100299 248496 -186146
7173 73750 139379 139077 -39285 -24222 -293300 75016 -355515 -201105 59933 -141446 369265
7161 110059 -53363 159640 184860 242289 -169110 182226 -350309 107099 -504017 -91653
7150 -48279 54459 -20366 -1256 42592 -284922 118768 -214334 185267 -151223 76379 -373492
7138 -128709 -236518 113159 -156468 -29917 242585 -269021 11330 232754 -247992 -203931
7128 -203931 121036 -64166 -281671 -104635 215296 188221 -103850 239536 30282 -324720
7117 -38697 -135003 157547 77221 -65675 -133060 43276 136243 -198508 75159 -66092 -98752
7106 -98752 -181742 176996 -34044 412264 165327 19395 -125048 224152 -199775 85960 188965
7095 188965 -124036 49673 168528 235522 311045 -17462 -184278 195493 254373 -27411 -365929
7084 -365929 -135005 -231746 -217829 94560 204631 85130 -51506 -29335 52497 92022 -48585
7072 53195 -251894 -164199 -156947 -67204 -41398 204589 298943 -11114 -99461 306332 29005
7060 234942 -8651 -383389 15881 231805 -31741 127023 -48999 -166449 216414 50575 8877
7048 -15688 -195126 11425 -184110 198957 528488 -93371 -86000 -24490 -105257 141365 -153331
7036 -214006 -324908 -134291 53968 -4762 119646 -23894 202607 43637 -53402 -71272 -197822
7025 -197822 -170226 -29963 231850 -119232 81342 -254806 -82487 117036 127093 -446719 248493
7013 -73615 46616 24985 -98820 -1023 -198846 155307 -179488 -148434 -203565 -60840 -10474
7001 68930 -169542 244848 150884 -73766 183314 -15294 -429442 11811 -101523 3747 -11169
6989 -52012 -53389 57031 -30537 92903 -53783 -281384 -223349 -205779 106999 139383 -75701 179659
6976 -236369 -309518 242125 58325 -8333 -14629 -57153 49095 124270 -26805 -270559 -23584 209381
6963 -55787 -47338 48294 51393 219657 -279453 -65035 133256 -176226 -319778 -104970 230839
6951 252520 -230245 -235700 2877 -147407 87927 -311257 -161108 -94640 104637 -191188 -252033
6940 -252033 -139872 -33647 158615 16820 39736 295364 -4481 -41760 -124254 -328245 -23047
6928 233817 -105435 417153 164928 -31704 61462 81431 69754 -117618 -31761 -39254 -220021
6917 -220021 -224011 128058 70985 -58560 63668 -62416 -89162 -300740 -25629 42855 -330179
6905 414929 2134 40601 -112983 -101054 -70264 196363 -174531 -108271 -156949 -10504 70405
6893 134130 88179 118889 -213700 -140908 -146296 -194475 -249099 174537 3253 205055 109648
6882 109648 111913 -8969 -340825 278256 -120596 -270724 -69523 -36632 -239893 175502 216121
6871 216121 124690 -170603 -50516 -22869 207613 296014 -115905 -205325 -159937 -72133 255497
6859 52682 239165 174761 -239987 44737 -237251 127184 -193734 -54468 -407634 -97118 -214723
6848 -214723 -32703 -30195 -77393 154921 173034 214674 -103111 2764 201552 170633 -97909
6836 8925 -286635 -3977 198613 26841 82594 87481 305811 -40764 93257 -48880 147525 173375
6824 173375 -218158 59383 34073 -103863 -98129 109632 -142312 201062 197882 -48623 -137090
6813 -137090 226723 -4676 8604 34104 225569 -57848 -131233 280314 89436 45733 -193421
6801 88558 -113930 -53842 8730 247299 -140305 174951 39972 -102410 64192 250730 -308844
6789 -92533 13387 96999 67945 -72841 -272298 -22664 193598 -103276 92179 116115 111736
6778 111736 -36379 23960 -148842 -116494 11005 164154 212790 -221962 150551 -292759 210673
6766 169943 -2559 -202376 -379082 -100629 96687 -228530 256636 133080 110036 96369 -76963
6754 -134127 -51061 -139563 -179637 -25217 206593 47779 -28712 47198 -35355 477700 47107
6742 91037 199629 44344 93577 117988 -8234 -86954 -322711 94537 43908 174079 45449
6730 -57410 143500 -139718 -192168 -78492 29248 -74992 -68320 -165822 -168729 -212991 59237 -128208
6717 51890 -18634 -242078 49448 54457 -352776 -11376 100122 -78735 50314 -228075 -48340
6705 -9487 -39071 -133031 -317652 148784 220098 -56504 -334917 -132209 -25909 -259843 45483
6693 87331 11807 -12565 38949 56462 51830 142157 75397 164023 204472 -61756 213843 -28249
6680 46894 -199910 1516 205274 173136 -172924 -235573 -91010 23096 428383 -207233 106633
6668 -6715 163029 95735 -181761 67768 9633 -302050 -79230 229239 116825 -26358 -61849
6657 -61849 -42628 2275 -57651 377069 -218084 -355033 102735 -186836 15593 37618 209733
6646 209733 102263 -43108 60452 -119173 -359021 -373988 -150757 -389720 -28484 182151
6635 86930 -142338 107179 -187362 94606 -100392 153455 48145 -308335 -202834 -71806
6624 -165790 -55687 -143501 -114312 55030 -15797 -104205 -47290 -335672 58153 -259517 -146454
6613 -146454 -97907 5841 -19145 134907 -63477 254056 121559 -221494 126417 -255471 -171220
6602 -171220 -302861 -102978 317355 -106185 58537 -46550 -347063 121077 -92304 98768
6591 200346 -71151 -38178 -62984 38385 119771 -43225 226407 -133867 -207573 38400 172051
6580 172051 340358 106165 -47297 41505 102826 -44744 70870 -69172 -35590 -188571 -333691
6569 -333691 -323599 -183931 62759 -1468 26768 156210 -123525 -12883 146132 -103970 -50570
6557 -268343 127944 -13803 148545 211780 227650 133156 220671 -37695 -164738 -84623 -25312
6545 125552 -181448 -197538 -104346 36583 45153 371866 112300 -250735 185422 -377379 70253
6533 308273 -342454 -86077 -134659 -179031 -17265 -489226 49967 -138140 -34839 257385 -16613
6521 328460 -284457 -11332 -178218 81840 -60441 -68804 20816 -353943 -10213 -228356 759
6509 -116606 171086 141983 17114 -176059 42245 32656 -158267 123378 -200885 218119 152600
6498 152600 -132591 -99256 160905 -195674 147611 -61842 263474 -43007 107763 -104972
6487 62150 -176995 -109748 -235318 -171356 -190327 164708 -29682 70183 -137398 187607 34733
6475 -157966 67372 -276263 224018 51980 -135940 -62007 -287980 -60808 -106407 -4485 -76403
6464 -76403 90464 -200652 -92108 83829 202005 114198 -59194 71496 264755 445544 -100798
6452 250180 -64218 384433 -161516 -193329 16477 109370 -257445 -53060 20652 111891 -66942
6440 -415545 -34802 -379975 25221 -185229 -303314 89434 -116767 -44695 -29822 -130825 261039
6428 -23297 102472 -121803 39242 -718 -3416 -152397 310363 -205121 -10623 137315 -141281
6416 -25074 -85784 -35933 -118902 -234584 254853 342852 237322 -137814 112463 -6190 -139661
6405 -139661 -64751 -374932 50619 33035 350148 -2754 38070 192138 70940 30497 178957
6394 178957 -36714 185771 -228782 -52926 190706 -275358 322795 20837 -200528 -82382
6383 -150543 93390 -249367 -126098 14496 -83397 -9930 -7834 -103796 -29735 222573 -169765
6371 -142627 40721 104817 -82361 -60301 94553 -163565 30285 -210418 -150868 -115843 -166926
6360 -166926 38052 -57317 30555 -33098 263142 -100071 -79198 28976 78141 493198 21280
6348 357105 -92080 10195 -258781 -235202 24451 -379954 66547 227902 -174539 -4582 -179863
6337 -179863 -50786 -117454 -21590 114683 19091 41489 103636 296333 -8179 152076 -31451
6325 145326 -234104 -119910 301488 9866 22006 -214734 -29880 -54571 -35330 -48912 168143
6313 -152276 -97135 71347 -590676 120638 39591 -42343 -23051 229438 78500 -190188 -20379
6301 -167702 -24694 26802 -95846 128675 95848 -1199 101195 81389 -56420 364709 -301301
6289 -103149 -274450 -219668 16047 45878 186733 113514 36369 -412845 132656 -192178 68132
6277 147543 152443 193545 -220070 -229437 46231 -43022 -20793 -73891 57471 -157122 -45550 -337097
6265 -337097 -32408 -85555 165170 -346460 67922 106629 -11769 210549 63298 -88096 169665
6253 -150038 29922 -181871 -84927 182096 229361 163060 -219793 -184156 -150640 2621 1369
6242 1369 -64463 23952 464608 -245959 -221527 -203851 -80560 -124017 -245038 -71804 -187325
6231 -187325 -141891 -289105 143206 1274 -80801 -159759 -13602 -109264 -29019 121303 -415750
6219 163566 148699 -281866 -155964 222107 -73331 -133822 -105129 -188113 306306 107376 207389
6208 207389 -118706 -69386 65809 61290 153026 169074 120512 -459331 -61234 -45465 154680
6196 70935 -184974 -11908 -105871 -305792 -212326 34111 -461235 -13715 -22654 -204120 30355
6184 -101306 164278 -11260 -22887 18274 12165 -211285 192748 197836 -218052 -6940 29775
6172 -114569 -121539 -53793 -34673 48838 -33762 352079 -75347 273070 -77054 111237 246346
6161 246346 -323098 88284 -218901 -180870 -175012 136815 106549 40618 264019 -22813 -80136
6150 -80136 13529 -100507 -236858 -181653 101902 -93336 -40279 3654 88513 -75973 -357012
6139 -357012 72829 52759 112591 176640 -289698 -130142 -183803 169288 110464 -128632 113615
6127 -111468 36133 -83494 -291258 -155066 -86997 62901 80193 269492 151570 220192 -184787
6115 33505 -7387 -648 -138649 235173 127519 51959 -69107 -4595 106033 179501 -264481 -43595
6102 -92451 -72574 127454 -381115 -104637 -86749 -152880 -21928 -188155 -78995 -137644 81358
6090 131805 -82076 228096 868 98074 101265 219884 72129 100404 -299257 -122366 -83965
6079 -83965 -185957 371185 -233671 -28092 -104502 283201 -60063 -424434 -290845 -25770 -155580
6068 -155580 81297 -18361 98746 -137845 12566 -102399 -64229 41852 28856 -18795 367220
6056 -37370 82786 -187978 81570 142856 22865 88074 82791 220075 50633 -197282 148849
6044 -480648 146283 -44447 153713 -187940 -24961 11783 356529 -329424 136475 -93176
6033 -95816 67131 83349 -158403 -93237 198315 -173548 388666 2906 251764 -79316 -39300
6021 -53774 57415 -36666 -216686 30455 -164221 342820 -244928 -10451 65601 -64556 -16893
6009 -410279 209261 29049 118270 6973 70873 -112719 -240520 -246558 -130548 4274 44908
5998 44908 53249 143713 437050 108337 28742 -93745 -144606 37687 -78888 -24988 -155768
5987 -155768 -345713 251763 -387542 -32439 260805 -174112 -202665 306971 81962 -49627
5976 -49040 -246758 -121625 93920 -125449 -193960 288895 -215774 -230790 45471 -9053 48308
5964 -164295 -181906 -31459 -94673 124490 10883 137111 -59503 -121900 -144945 149567 -248908
5952 -97259 -95413 44102 -30675 289587 -87233 28667 -12945 87664 19036 -156245 83762 178144
5940 178144 308799 -64567 -241125 166718 -202126 223878 -84365 -32339 228000 49246
5929 -290027 -172191 -53820 -35808 -124727 -143426 159634 387350 -394923 149921 -71816 -86648
5918 -86648 3350 142114 -136824 148837 100650 65678 133828 -5822 -113065 35661 -127492
5906 -277495 -14011 76600 52794 -114789 -102637 -273253 -285610 -98183 24110 -106462 -68443
5895 -68443 40507 160451 28389 1133 18651 -279456 74566 -374092 -58680 -104492 119384
5883 2583 150549 297359 103160 -120110 -171536 -16726 -169816 -413705 -49715 119740 -153646
5871 -312887 222924 192275 -108878 -45084 73139 -121528 58336 -213692 -301278 -179103 -164206
5860 -164206 -144068 119287 123678 -225306 -349853 24017 -261504 438246 53266 114699 68952
5849 68952 213301 159408 -170997 243123 182570 -75493 9627 35493 159618 -124895 -184461
5838 -184461 7393 276375 -169089 -81266 -23189 -21918 -188234 -106579 46561 -120369 117830
5826 -252109 42578 303716 43139 21393 -167665 31119 -48732 48757 170987 -139125 -21974
5814 -178350 275371 34583 357006 101373 427963 63446 17169 -130686 113249 124281
5804 124281 -67720 -17712 40294 368223 -131256 -19167 -97256 299643 313715 106811 -47412
5792 -165061 -61906 -421237 -204586 -343150 -114699 -255864 124117 21518 -316322 272137
5781 -370717 35094 -11135 152171 37449 -214099 67883 34952 -107848 -146750 57044 -153279
5769 8466 -130482 187929 227211 -234909 -180431 24606 97843 -313721 183680 -129928 86194
5757 209540 104213 -176017 -45897 161520 -96977 47715 83874 430275 26828 -48178 175775
5745 385360 339838 6134 -152993 -57145 -281326 26010 411646 328115 17045 -300804 -142963
5733 157514 -82597 -204112 167654 372297 -145536 93260 238094 182397 -347101 -30340
5722 -1809 -72805 274419 123464 257039 103220 -27432 -196712 -204873 -120059 124635 195154
5711 195154 -132250 -202247 167647 -335001 -292157 -243215 59994 113384 -53435 296710 -125721
5699 123659 102584 6055 -7305 -207875 26421 -193149 -26561 13709 242944 -201849 -354817
5688 -354817 10426 -26683 3759 -137122 239895 -184446 -354270 -22638 -151974 87790 98554
5677 98554 6044 -92438 347264 64863 -337783 171313 55310 2372 144218 40567 -31739
5665 -61747 279667 65042 -63756 29355 -155580 78521 66951 -61190 321611 -207877 53320
5653 -53853 -124142 -52884 -156920 60130 11689 25607 -86601 21504 182842 213880 -306929
5641 115599 -36660 217549 -118837 62121 -33787 165709 150895 -128248 -62451 -34052 -32204
5630 -32204 156413 -128693 -150982 147191 362886 45720 -229293 59816 140626 -563500 -98209
5618 441363 -171418 109509 -222744 -64740 89788 -67412 -339499 -23226 266818 -249941
5607 235575 -47910 43365 365990 64448 -35396 -123708 133329 162330 135791 133031 5343 -133427
5594 -91992 -402124 192583 -34671 -23959 -291483 90042 -57171 -177056 -216326 50111 145825
5583 145825 -2020 310220 350080 1592 30591 189164 -67819 -15222 -133449 263250 193801
5572 193801 68665 -61643 -41512 -222391 15065 30123 67789 -34522 -91448 1522 108591
5561 108591 280522 230340 262874 -137622 238780 -388711 -88193 -96467 103929 149518 214160
5550 214160 -28971 -102902 -189525 -74568 -147046 -20312 272825 117354 96974 -32447 -279511
5539 -279511 281577 118423 208385 99862 119186 131085 19728 21827 -307057 -4685 -52999
5528 -52999 41938 -101150 -221193 -21199 24728 116767 29434 -272544 88346 88048 -85660 -497434
5516 -497434 10564 -113759 211495 -204154 -107748 -190084 -280419 46944 -129581 94439 169249
5505 169249 271030 113789 6456 146493 -217735 80884 189077 180883 -417880 -48189 182636
5493 83350 -137234 53394 200932 -201715 179122 -101348 181504 -85337 -66283 -160235 -74104
5481 -94501 149773 100410 -118100 10174 -225168 226081 -186640 -196672 -101924 75258 67695
5470 67695 109063 -296346 -30953 -127430 -32015 63245 66327 -176095 71967 -85379 168767
5458 -160919 -19580 -160403 -28895 60720 -275385 -252384 82500 73177 442166 146891 106978
5447 106978 19807 50996 -133108 41849 258279 -88024 -38833 187283 215266 -194589 -23090
5435 -133992 -124708 34000 -208886 106095 -151563 390790 107340 128520 121682 -213431 203267
5423 -128797 -35605 225288 -214293 213454 -172984 -51133 -54052 28711 277367 168040 37196
5411 191847 -189687 -229872 192279 -223262 -70437 48247 -36291 130456 550895 -149172
5400 260233 132920 199298 3250 -311195 -42993 240635 81891 -102221 -97891 5118 -106564
5388 222008 -111968 35094 -111487 144399 28943 184194 81965 230633 6210 101074 26917
5376 225411 249539 220207 -128437 -103194 -246273 111386 -122081 19216 -95214 -202161 -162648
5365 -162648 -240565 12412 -19898 -47437 15929 -286496 67799 137195 -46158 -204619 -96218
5353 -86514 110406 31714 368845 -191373 -49349 69474 63911 148775 -183362 -191938 -75293
5341 40319 4007 -48468 -104587 -106265 -99791 116751 315126 -147282 157628 -64415 -167130
5330 -167130 144798 141406 -61654 37309 -44932 -186314 -457492 -178114 75567 -48631 113229
5318 -79625 -139984 127190 102044 -249627 -246796 -404891 257750 -129836 71688 114705 -181379
5306 41885 -245369 -3722 -161825 39067 -27453 -37111 -102714 -75264 320831 -37208 -81607 -70993
5294 -70993 119659 -284750 -176884 -129214 108625 133085 238126 99100 -299837 436928
5283 94101 82203 -228514 143848 103314 -287778 -120016 -52870 83964 -84162 106226 -197668
5271 -144789 -18581 -5078 66380 -39315 145454 102037 -122642 134768 46285 155449 45618
5259 94990 -256656 -219447 156979 -29873 112474 -89240 -36523 240275 88781 229518 74642
5247 281214 135179 -136667 -300499 154562 -146617 14641 -227564 27812 -93566 85073
5236 62406 -72438 -145843 213822 123592 350531 -181485 -159741 -145251 261343 171687 -446440
5224 -104762 -13571 32934 -173135 -12859 -110430 -292318 -58981 21515 144883 10141 66098
5213 66098 -204488 -54037 168518 -280883 105725 116660 63760 -51387 -222072 -130084 139645
5201 124420 10669 -13278 -9426 289901 29812 -14777 73588 23311 -26585 -26079 144044 -64472
5188 98135 101037 -277796 353284 -104087 30128 386297 38842 125517 -21762 42766 -86852
5176 -48330 -86416 155999 -12543 111434 178966 -267143 -128687 -64627 -320733 -39213 -50379
5165 -50379 134777 87281 108059 -97275 -83179 148787 -74538 331080 112801 143234 -337792
5153 141993 -259502 110506 45342 33583 61596 -24617 -207669 71873 -267406 74623 48283
5142 48283 -160098 -79420 158961 -271713 -241696 162225 172667 334440 79137 -78143 -204176
5131 -204176 172345 -94463 262904 250859 -97025 78630 -408775 -254053 -163305 -73673 90310
5119 -156517 128041 -97048 -139029 68321 -427537 -110768 -445088 296424 361361 -270165
5108 176590 -51643 -67571 -85099 100063 448437 250975 209156 28562 109166 333867 -82326
5096 173976 329209 145169 82233 -93662 211146 195199 226934 93657 240210 -218711 -175278
5085 -175278 71526 -10888 -87007 115184 183288 -137312 -300801 35636 -36140 -16147 -8740
5074 -8740 -20584 -80768 152313 -286445 166854 -59704 -112887 20578 11573 116445 236704
5063 236704 -118308 20944 -117479 81895 104092 257372 40398 13869 123466 317464 28388
5051 55509 -212297 292999 102123 -58097 -164745 -284573 117161 -289112 218281 134505
5041 134505 -267677 89558 213819 -3912 88127 -129858 177932 46925 -93039 -35148 180006
5029 -137426 -42639 -106133 -9443 -64933 -9405 -124978 39898 79052 66759 267420 -118325
5017 170115 -107362 -3731 58830 271293 -212495 328350 29892 8978 -207409 -26151 223710
5005 195947 -68411 57572 154801 -26499 -173890 5901 77279 123947 -124612 -308105 142002
4993 -182924 -150757 318037 489518 83685 -104193 -88185 47049 154289 97317 230991 131061
4982 131061 -163389 87929 -14128 4278 44721 -4781 -5535 -194858 14072 -249209 -12745 -52068
4970 -52068 -116944 169230 -54831 113519 -151010 -262497 77099 34299 -92604 -96966 -95442
4959 -95442 103601 194124 -42360 196863 -144165 -99618 160936 20204 -77557 111329 164762
4948 164762 272131 176449 -70877 -360031 -231353 -147806 -103011 69633 -452053 187721 228379
4937 228379 180362 208145 -63429 -83555 23105 -109088 -145272 -154909 -15034 -235102 -76617
4925 -37201 -138508 -119711 52401 70096 312518 -81231 401298 156741 -25134 327842 -316969
4913 -8553 -129581 100566 12152 153316 272867 128469 120487 -272146 -49100 -44461 -82509
4902 -82509 272719 96570 36480 -190463 -73734 -197563 -131136 -62149 -22427 -307220 -77189
4890 -180943 301105 68233 96987 163985 -165699 158032 203796 396469 -230943 194960
4879 107365 -59005 -68402 142645 -257119 -191108 -45385 66383 -48303 3938 -19599 164357
4867 -66760 -57528 -124548 -261771 -164438 71896 -91467 2082 131804 60936 -192599 99117 -104586
4854 -204865 -110413 21657 29068 -70604 275149 -219123 -62964 19646 102026 -208141 107200
4842 -306659 149912 103644 39867 68313 55684 -167781 79758 -269112 242925 111994 143105
4831 143105 185092 -249708 -224595 178130 53783 270723 -249392 130266 273144 244549
4821 244549 -53057 135824 197129 34040 129979 69352 -90334 -20925 101488 191371 -134465
4809 129706 -340207 169420 253044 42960 311040 117532 -291057 -43832 -164902 167319
4798 108189 -101850 128671 -6963 115429 -125069 23320 165300 197691 -292323 -97514 -44716
4786 -39729 -135530 -212794 256068 355731 -161497 -188428 -196793 -208748 251307 -67029 -415404
4775 -415404 276150 -69075 -222944 -216392 50179 228100 -134321 -178421 43645 -7921 10144
4763 -4012 110712 37838 311171 -80139 221611 338850 -8222 -416960 -181868 96925 176275
4752 176275 53831 -131878 289675 -351386 -102564 -47985 70527 -201777 399124 90414
4741 252343 -33307 47936 22538 333108 234642 -101967 -1354 -80883 -64212 430049 -91150
4729 207567 -132908 -406424 -35652 -100271 -154027 347018 -149778 -223360 82986 117871 -212889
4717 -103674 -172275 42983 251855 -26169 9251 -7644 -252668 248167 -38250 -10297 -208312
4706 -208312 78153 90818 -215302 -259114 -70011 -155345 217963 104571 -110953 77949 115483
4695 115483 53243 50563 38857 -30163 -197497 335513 8733 17758 -17294 238418 -105753
4683 -43499 213050 -87859 30603 -148281 -323098 -55839 143551 268073 122317 5939 259489
4672 259489 88353 -56936 163681 -199541 -28795 -28083 202196 -109009 388716 102072 47759
4660 -116669 -81485 -234094 119561 -74406 -53065 526711 87165 -38217 -194966 37752 25073
4649 25073 -256420 115518 -14862 -188519 -134516 476649 84584 -47808 -284150 -81636 -173781
4638 -173781 -339493 100332 262415 -249856 -87250 -25483 153757 45583 -302712 -277460
4628 -277460 8249 -80613 45164 -14716 -182105 271583 -249757 167423 -61317 -27551 36463
4616 -62653 431743 72937 136944 263030 -100357 -307221 -128825 -102346 286367 20194 195433
4605 195433 -51630 74505 290996 175418 -134597 -33440 -185494 66932 119166 -143486 -205250
4594 -205250 83790 85618 -75840 -3969 298918 104388 -58952 -112980 -39088 110228 57622
4583 57622 -23582 -82470 66671 3027 -126026 45577 -43401 7855 -395014 -169151 67600 133289
4571 133289 136971 438221 -116037 -161997 -42183 -6627 -277778 -43645 88185 -260609 55982
4559 -273753 -104253 -252633 -17796 158841 -188790 -94160 -355463 -117851 -101326 196594
4548 165928 138793 -502963 -74761 232668 263594 -73543 68443 -113819 136471 -298741 108559
4536 356160 119302 -85327 72682 -47260 -73097 -25924 100562 175410 -79819 286814 383623
4525 383623 -122506 -189908 232321 109648 125808 -11646 -89073 33804 405392 156341 -84534
4513 187089 -178236 -152817 -367908 -248585 -197256 -113977 33305 230104 54479 128869 -245231
4501 359251 -97859 21096 -278587 424299 -41334 -253733 15861 -207294 159306 44516 183215
4490 183215 36767 -288056 -421568 10050 -243638 -108193 -133481 49566 230225 14106 -98638
4478 121938 -122083 -155727 338702 -72198 -336443 -212757 277623 147090 172970 1182 -111445
$$ [...]
##END NTUPLES=NMR SPECTRUM
##END=
