
##TITLE=UV1051_TOCA01-ROVE100D_6099954_pvEI1hl4MJ
##JCAMPDX= 6.0         $$ Bruker NMR JCAMP-DX V2.0
##DATA TYPE= NMR SPECTRUM
##DATA CLASS= NTUPLES
##ORIGIN= BRUKER
##OWNER= Administrator
$$ 1.72 TOPSPIN		Version 2.1
$$ 2012-05-12 19:13:56.906 -0500  Administrator@TOPSPIN
$$ Compression mode = diff/dup
##.OBSERVE FREQUENCY= 400.13188235
##.OBSERVE NUCLEUS= ^1H
##.ACQUISITION MODE= SIMULTANEOUS (DQD)
##.ACQUISITION SCHEME= undefined
##.AVERAGES= 64
##.DIGITISER RES= 22
##SPECTROMETER/DATA SYSTEM= spect
##.PULSE SEQUENCE= noesygpps1d.comp
##.SOLVENT NAME= COFFEE_meoh
##.SHIFT REFERENCE= INTERNAL, COFFEE_meoh, 1, 14.96669
##AUDIT TRAIL= $$ (NUMBER, WHEN, WHO, WHERE, PROCESS, VERSION, WHAT)
$$ ##TITLE= Audit trail, TOPSPIN		Version 2.1
$$ ##JCAMPDX= 5.01
$$ ##ORIGIN= Bruker BioSpin GmbH
$$ ##OWNER= Administrator
$$ $$ C:\Bruker\TOPSPIN/data/COFFEE/nmr/UV1051_TOCA01-ROVE100D_6099954_pvEI1hl4MJ/12/pdata/1/auditp.txt
$$ ##AUDIT TRAIL=  $$ (NUMBER, WHEN, WHO, WHERE, PROCESS, VERSION, WHAT)
(   1,<2012-05-12 19:13:52.078 -0500>,<Administrator>,<TOPSPIN>,<go>,<TOPSPIN 2.1>,
      <created by zg
	started at 2012-05-12 19:02:21.859 -0500,
	POWCHK enabled, PULCHK disabled,
       configuration hash MD5:
       AF F2 23 6B 01 CD 40 DD E5 A1 38 A0 06 EA F7 77
       data hash MD5: 64K
       D2 D7 CF BF E8 C1 63 54 A8 D3 74 F0 EE 46 6E F3>)
(   2,<2012-05-12 19:13:55.000 -0500>,<Administrator>,<TOPSPIN>,<proc1d>,<TOPSPIN 2.1>,
      <Start of raw data processing
       efp LB = 0.3 FT_mod = 6 PKNL = 1 PHC0 = 0 PHC1 = 0 SI = 128K 
       data hash MD5: 128K
       FC 64 84 4E 98 F5 EA 6A 78 F8 59 51 28 95 A8 F8>)
(   3,<2012-05-12 19:13:56.156 -0500>,<Administrator>,<TOPSPIN>,<proc1d>,<TOPSPIN 2.1>,
      <pk PHC0 = 40.02869 PHC1 = 0 
       data hash MD5: 128K
       6D 1E 96 3B 3D 0D FD 66 7E 15 9E 4B A4 41 D5 0C>)
(   4,<2012-05-12 19:13:56.375 -0500>,<Administrator>,<TOPSPIN>,<proc1d>,<TOPSPIN 2.1>,
      <abs ABSG = 1 
       data hash MD5: 128K
       29 25 2F 78 F3 12 C6 EC 93 6B 75 75 95 9E 69 11>)
(   5,<2012-05-12 19:13:56.453 -0500>,<Administrator>,<TOPSPIN>,<proc1d>,<TOPSPIN 2.1>,
      <abs ABSG = 2 
       data hash MD5: 128K
       99 32 43 D0 A0 EF 0E 92 92 41 F3 C0 B2 52 B2 68>)
(   6,<2012-05-12 19:13:56.578 -0500>,<Administrator>,<TOPSPIN>,<proc1d>,<TOPSPIN 2.1>,
      <abs ABSG = 3 
       data hash MD5: 128K
       B8 D4 2C 08 84 7E DB 97 51 C4 9C A2 BE 5C 36 E5>)
(   7,<2012-05-12 19:13:56.765 -0500>,<Administrator>,<TOPSPIN>,<proc1d>,<TOPSPIN 2.1>,
      <abs ABSG = 4 
       data hash MD5: 128K
       18 2B EE 91 0F 71 F6 3B 9A 20 75 F3 21 41 0D A9>)
(   8,<2012-05-12 19:13:56.812 -0500>,<Administrator>,<TOPSPIN>,<proc1d>,<TOPSPIN 2.1>,
      <abs ABSG = 5 
       data hash MD5: 128K
       7A 9C FB 62 16 C1 DF DD 60 5D E9 49 3B D0 CA 3C>)
$$ ##END=
$$ 
$$ $$ hash MD5
$$ $$ 32 7A 21 EE 1C B1 41 48 32 F6 F9 4D 03 9E E7 58
##$RELAX= 
##$RELAX= 
##$RELAX= 
##$RELAX= 
##$RELAX= 
##$RELAX= 
##$RELAX= 
##$RELAX= 
$$ [...]
##$TP07= 0
##$TPNAME0= <>
##$TPNAME1= <>
##$TPNAME2= <>
##$TPNAME3= <>
##$TPNAME4= <>
##$TPNAME5= <>
##$TPNAME6= <>
##$TPNAME7= <>
##$TPOAL= (0..7)
0.5 0.5 0.5 0.5 0.5 0.5 0.5 0.5
##$TPOFFS= (0..7)
0 0 0 0 0 0 0 0
##$TUNHIN= 0
##$TUNHOUT= 0
##$TUNXOUT= 0
##$USERA1= <user>
##$USERA2= <user>
##$USERA3= <user>
##$USERA4= <user>
##$USERA5= <user>
##$V9= 5
##$VALIST= <valist>
##$VCLIST= <CCCCCCCCCCCCCCC>
##$VD= 0
##$VDLIST= <DDDDDDDDDDDDDDD>
##$VPLIST= <PPPPPPPPPPPPPPP>
##$VTLIST= <TTTTTTTTTTTTTTT>
##$WBST= 2048
##$WBSW= 25
##$XGAIN= (0..3)
0 0 0 0
##$XL= 0
##$YL= 0
##$YMAX_a= 11471741
##$YMIN_a= -5402985
##$ZGOPTNS= <>
##$ZL1= 120
##$ZL2= 120
##$ZL3= 120
##$ZL4= 120
##$ABSF1= 14.96669
##$ABSF2= -5.58584
##$ABSG= 5
##$ABSL= 3
##$ALPHA= 0
##$AQORDER= 0
##$ASSFAC= 0
##$ASSFACI= 0
##$ASSFACX= 0
##$ASSWID= 0
##$AUNMP= <proc_prof1d_extract.lims>
##$AXLEFT= 0
##$AXNAME= <>
##$AXNUC= <1H>
##$AXRIGHT= 0
##$AXTYPE= 0
##$AXUNIT= <>
##$AZFE= 0.1
##$AZFW= 0.1
##$BCFW= 0
##$BC_mod= 0
##$BYTORDP= 0
##$COROFFS= 0
##$CY= 15
##$DATMOD= 1
##$DC= 0
##$DFILT= <>
##$DTYPP= 0
##$F1P= 0
##$F2P= 0
##$FCOR= 0.5
##$FTSIZE= 131072
##$FT_mod= 6
##$GAMMA= 0
##$GB= 0
##$INTBC= 1
##$INTSCL= 1
##$ISEN= 128
##$LB= 0.3
##$LEV0= 0
##$LPBIN= 0
##$MAXI= 10000
##$MC2= 0
##$MEAN= 0
##$ME_mod= 0
##$MI= 0
##$NCOEF= 0
##$NC_proc= -3
##$NLEV= 6
##$NOISF1= 0
##$NOISF2= 0
##$NSP= 0
##$NTH_PI= 0
##$NZP= 0
##$OFFSET= 14.96669
##$PC= 1
##$PHC0= 40.02869
##$PHC1= 0
##$PH_mod= 1
##$PKNL= yes
##$PPARMOD= 0
##$PPDIAG= 0
##$PPIPTYP= 0
##$PPMPNUM= 2147483647
##$PPRESOL= 1
##$PSCAL= 4
##$PSIGN= 0
##$PYNMP= <proc.py>
##$REVERSE= no
##$SF= 400.130005568939
##$SI= 131072
##$SIGF1= 0
##$SIGF2= 0
##$SINO= 400
##$SIOLD= 131072
##$SPECTYP= <>
##$SREGLST= <1H.CDCl3>
##$SSB= 0
##$STSI= 131072
##$STSR= 0
##$SW_p= 8223.68421052632
##$SYMM= 0
##$S_DEV= 0
##$TDeff= 65536
##$TDoff= 0
##$TI= <>
##$TILT= no
##$TM1= 0
##$TM2= 0
##$TOPLEV= 0
##$USERP1= <user>
##$USERP2= <user>
##$USERP3= <user>
##$USERP4= <user>
##$USERP5= <user>
##$WDW= 1
##$XDIM= 131072
##$YMAX_p= 430143574
##$YMIN_p= -28620
##$CURPLOT= <Network HP LaserJet P1505>
##$CURPRIN= <$Network HP LaserJet P1505>
##$DFORMAT= <normdp>
##$LAYOUT= <+/1D_H.xwp>
##$LFORMAT= <normlp>
##$PFORMAT= <normpl>
##$SURQMSG= 1
$$ End of Bruker specific parameters
$$ ---------------------------------
##NTUPLES= NMR SPECTRUM
##VAR_NAME=  FREQUENCY,     SPECTRUM/REAL,   SPECTRUM/IMAG
##SYMBOL=    X,             R,               I
##VAR_TYPE=  INDEPENDENT,   DEPENDENT,       DEPENDENT
##VAR_FORM=  AFFN,          ASDF,            ASDF
##VAR_DIM=   131072,        131072,          131072
##UNITS=     HZ,            ARBITRARY UNITS, ARBITRARY UNITS
##FACTOR=    0.0627417313425165, 1,          1
##FIRST=     8223.62146879498, 1122,         -105985
##LAST=      0,             1896,            -108015
##MIN=       0,             -28620,          0
##MAX=       8223.62146879498, 430143574,    0
$$ Real data points
##PAGE= N=1
##DATA TABLE= (X++(R..R)), XYDATA
$$ [...]
63657D48605N287L094J612N32p93j858j735q67p60j765k502j826m15J80o51k132
63641D44006k970k421j019k60r20j756q97J526L372L530L412M591O324O778N765
63626D69061M720M485M589M497M184L563K561J779J772J718J52k634m342l492
63612D92613j270J97M40M92R56J435J601J679J795J605Q86mn63p71j104j900k952
63595D95135l783m264m619m736l999k297o10J51N29J666L287L898L229K987M428
63580D91002O577P779P950P953P835P318P417R645J3523J6637J7475J6911J6451
63567F34473J6472J6831J7889J9843K1902K3155K3822K4840K6581K8820L1541
63556H86169L4972L8907M2624M5512M7455M8741M9870N1177N2324N2469N1115
$$ y = [448605, 453892, 456986, 458598, 459130, 458337, 456479, 454744, 453877, 453117, 451352, 448850, 447024, 446609, 446789, 446138, 444006, 441036, 438615, 437596, 437336, 436416, 434660, 433763, 435289, 438661, 442191, 445603, 450194, 456518, 463296, 469061, 473781, 478266, 482855, 487352, 491536, 495099, 497660, 499439, 501211, 502929, 503081, 500447, 496105, 492613, 491343, 491540, 491980, 492472, 493428, 494863, 496464, 498143, 499938, 501543, 502429, 502425, 501862, 501091, 499987, 498087, 495135, 491352, 487088, 482469, 477733, 473734, 471437, 470827, 470978, 471507, 473173, 476460, 480358, 483587, 486574, 491002, 497579, 505358, 513308, 521261, 529096, 536414, 543831, 553476, 566999, 583636, 601111, 618022, 634473, 650945, 667776, 685665, 705508, 727410, 750565, 774387, 799227, 825808, 854628, 886169, 921141, 960048, 1002672, 1048184, 1095639, 1144380, 1194250, 1245427, 1297751, 1350220, 1401335]
63545A401335M8322M3821L6797K7276J7059Q291J490m089q610j1441j2664j3478
63533A534109j4804j6545j8595k1504k5602l0202l4269l7296l9131l9756l9677
63522A216728l9560l8885l5946l0220k3948k0038j8790j7978j5836j2631r343
63511I53553o344l753j766K5K548N772Q313R414J0444J3350J8159K3016K6300
63498A059031K7737K7928K8001K9495L3208L7989M1856M4529M7630N1888N5589
63487A484881N6636N5089N2351M8547M2266L2839K1637J0774J396o391j2664j7265
63475A770096j9972k0804k0289j9467j9344k0442k3018k7387l3354l9613m4601
63464A481805m8034n0862n3575n5378n5292n3191m9496m4752m0074l7050l6214
$$ y = [1401335, 1449657, 1493478, 1530275, 1557551, 1574610, 1582901, 1584391, 1580302, 1571692, 1560251, 1547587, 1534109, 1519305, 1502760, 1484165, 1462661, 1437059, 1406857, 1372588, 1335292, 1296161, 1256405, 1216728, 1177168, 1138283, 1102337, 1072117, 1048169, 1028131, 1009341, 991363, 975527, 962896, 953553, 947209, 943456, 941690, 941715, 944263, 950035, 958348, 967762, 978206, 991556, 1009715, 1032731, 1059031, 1086768, 1114696, 1142697, 1172192, 1205400, 1243389, 1285245, 1329774, 1377404, 1429292, 1484881, 1541517, 1596606, 1648957, 1697504, 1739770, 1772609, 1794246, 1805020, 1806416, 1800025, 1787361, 1770096, 1750124, 1729320, 1709031, 1689564, 1670220, 1649778, 1626760, 1599373, 1566019, 1526406, 1481805, 1433771, 1382909, 1329334, 1273956, 1218664, 1165473, 1115977, 1071225, 1031151, 994101, 957887]
63453I57887l6190l5197l2844k9745k6078k1822j7921j5639j4751j3718j2006
63442G01976j0831j1089j1778j1486j0387r593r135p970n830l884l239l642m041
63429E99071l780k894j659m06M90Q41P51M15l4j75P52K852M713M440K059M7N48
63412F08031K496K763K18k784l532k312j409j720k076j614j063j105j089k48Q59
63397E95415J237J141J795L761O407Q752J0146J0429J0184J0610J2313J4404J5638
63384G02232J6257J7711K0535K3636K6062K8423L1846L6224M0274M2899M3857
63373A029956M3334M1566L8768L5095L0880K7184K5532K6528K9233L2625L7085
63362A397786M3298N0104N5043N7314N8614O0376O1688O0929N8062N3643M6709
$$ y = [957887, 921697, 886500, 853656, 823911, 797833, 776011, 758090, 742451, 727700, 713982, 701976, 691145, 680056, 668278, 656792, 646405, 636812, 627677, 619707, 613877, 609993, 606754, 603112, 599071, 595291, 592397, 590738, 590332, 590822, 591663, 592414, 592829, 592795, 592620, 593372, 596224, 600937, 605377, 607436, 607483, 608031, 610527, 613290, 613508, 610724, 607192, 604880, 603471, 601751, 599675, 598061, 596998, 595893, 594804, 594556, 595415, 596652, 597793, 599588, 603349, 609756, 618508, 628654, 639083, 649267, 659877, 672190, 686594, 702232, 718489, 736200, 756735, 780371, 806433, 834856, 866702, 902926, 943200, 986099, 1029956, 1073290, 1114856, 1153624, 1188719, 1219599, 1246783, 1272315, 1298843, 1328076, 1360701, 1397786, 1441084, 1491188, 1546231, 1603545, 1662159, 1722535, 1784223, 1845152, 1903214, 1956857, 2003566]
63351B003566L5877K2314R555k4o846j1981j5424j7341j9142k1921k5096k8004
63339A925533l1555l6649m2076m5912m8343n1099n4455n6836n7261n6176n3758
63328A391413m9488m3947l9039l5599l2396k8397k4336k1010j7676j3471r183
63317A076871o068l903j612J044L883P611J3059J9472K5105K9279L2510L4903
63305A232154L6024L6466L8089M2032M7423N2404N5907N8129N9796O1132O1294
63294A780850N8975N3768M6625L8523K9377J8955Q211j230q510j3636j6789j8561
63282A976558k0341k3202k6792l0431l4662m0145m5582m8810m9983n1643n4997
63271A549970n8015n8076n5011n0591m6227m2325l8838l5348l1295k6980k3784
$$ y = [2003566, 2039443, 2061757, 2071312, 2071288, 2064442, 2052461, 2037037, 2019696, 2000554, 1978633, 1953537, 1925533, 1893978, 1857329, 1815253, 1769341, 1720998, 1669899, 1615444, 1558608, 1501347, 1445171, 1391413, 1341925, 1297978, 1258939, 1223340, 1190944, 1162547, 1138211, 1117201, 1099525, 1086054, 1076871, 1070803, 1066900, 1065288, 1066332, 1070215, 1077826, 1090885, 1110357, 1135462, 1164741, 1197251, 1232154, 1268178, 1304644, 1342733, 1384765, 1432188, 1484592, 1540499, 1598628, 1658424, 1719556, 1780850, 1839825, 1893593, 1940218, 1978741, 2008118, 2027073, 2035284, 2034054, 2025544, 2011908, 1995119, 1976558, 1956217, 1933015, 1906223, 1875792, 1841130, 1800985, 1755403, 1706593, 1656610, 1604967, 1549970, 1491955, 1433879, 1378868, 1328277, 1282050, 1239725, 1200887, 1165539, 1134244, 1107264, 1083480]
63260A083480k2594k2785k3365k4430k6453k8843l0229k9972k8630k7052k5607
63249G93520k4133k2227j9709j7016j4886j3551j2681j2111j1931j1776j0960
63238F22539r603q592q065o985m919l189l234m625n666n561m888m384m182m152
63224E44494m122l787k939j811q76m68o86j321j728j407q82j263k548l330k615
63209E14711j100pM67P85J098J558K718M539N727N238L947L733N254P605R631
63194E65904J0554R931Q229P062P612R096R981J0335J1541J3899J6066J7078J7620
63181G14908J8789K0637K2384K3431K3881K4553K6249K8574K9913K9365K8075
63170I90759K7559K7480K6580K5192K4766K5163K4629K2841K1684K2241K3034
$$ y = [1083480, 1060886, 1038101, 1014736, 990306, 963853, 935010, 904781, 874809, 846179, 819127, 793520, 769387, 747160, 727451, 710435, 695549, 681998, 669317, 657206, 645275, 633499, 622539, 612936, 604344, 596279, 589294, 584375, 581186, 577952, 573327, 567661, 562100, 557212, 552828, 548646, 544494, 540372, 536585, 533646, 531835, 530959, 530491, 529805, 528484, 526756, 525349, 524467, 523204, 520656, 517326, 514711, 513611, 513604, 514071, 514856, 515954, 517512, 520230, 524769, 530496, 535734, 539681, 543414, 548668, 556273, 565904, 576458, 586389, 594618, 601680, 609292, 618388, 628369, 638704, 650245, 664144, 680210, 697288, 714908, 733697, 754334, 776718, 800149, 824030, 848583, 874832, 903406, 933319, 962684, 990759, 1018318, 1045798, 1072378, 1097570, 1122336, 1147499, 1172128, 1194969, 1216653, 1238894, 1261928]
63159A261928K2471K1171K0335J9335J6691J2455P835L081k466q541j3795j7520
63147A342980k0274k2678k4628k5884k6499k6400k5163k2563j8963j5159j2037
63136A102732j0049q671o671l529k03K232M208O943J0336J2881J3962J4945J7220
63123A156336K0069K1582K1261K0577K0861K1563K1191J9262J6689J4489J2830
63112A366710J1398J0048Q582O398K849j932o961j1238j4515j7323k0465k4360
63100A309191k8593l2034l3700l3723l3396l4119l6041l7576l6508l2096k6126
63089I45279k1361j8834j7279j5415j3772j3540j4391j4635j3293j0953q649o867
63077G76290n741n253m925m073k674j464j011j116j225q64K74K037L583M083L676
$$ y = [1261928, 1284399, 1305570, 1325905, 1345240, 1361931, 1374386, 1382221, 1385302, 1382836, 1374295, 1360500, 1342980, 1322706, 1300028, 1275400, 1249516, 1223017, 1196617, 1171454, 1148891, 1129928, 1114769, 1102732, 1092683, 1084012, 1077341, 1073812, 1073609, 1075841, 1080049, 1086992, 1097328, 1110209, 1124171, 1139116, 1156336, 1176405, 1197987, 1219248, 1239825, 1260686, 1282249, 1303440, 1322702, 1339391, 1353880, 1366710, 1378108, 1388156, 1396738, 1403136, 1405985, 1404053, 1397092, 1385854, 1371339, 1354016, 1333551, 1309191, 1280598, 1248564, 1214864, 1181141, 1147745, 1113626, 1077585, 1040009, 1003501, 971405, 945279, 923918, 905084, 887805, 872390, 858618, 845078, 830687, 816052, 802759, 791806, 783157, 776290, 770549, 765296, 760371, 756298, 753624, 752160, 751149, 750033, 748808, 747944, 748218, 750255, 753838, 757921, 761597]
63062G61597L156K825K510K589L852O057P724P864P089O533O376N998M980L508
63048H32658K241K039L209M902N886N962N746N124L394J158M14J772L141K491
63034H80137O66q0N85J157J122J592K938L746K903J395J044K221L840N136O448
63019I14850Q241J0051J0993J0992J0947J1483J2186J2650J3706J6502K0410K3171
63007A076182K3576K2996K3604K6092K9897L4476L9176M2570M3601M3187M3535
62996A448892M5919N0016N5088O0461O4849O6796O6368O5455O5636O6459O6413
62985B122352O5064O3516O2940O3304O3565O2736O0622N7787N5069N3058N1563
62974B781576M9254M4365L6389K6874J7602Q242k935j5823k7628l6145m2482m9112
$$ y = [761597, 764753, 767578, 770088, 772677, 776529, 782586, 790310, 798174, 805263, 811796, 818172, 824170, 829150, 832658, 834899, 836938, 840147, 845049, 850935, 856897, 862643, 867767, 871161, 872319, 872733, 874505, 877646, 880137, 880803, 880723, 881308, 882465, 883587, 885179, 888117, 891863, 894766, 896161, 897205, 899426, 903266, 908402, 914850, 923091, 933142, 944135, 955127, 966074, 977557, 989743, 1002393, 1016099, 1032601, 1053011, 1076182, 1099758, 1122754, 1146358, 1172450, 1202347, 1236823, 1275999, 1318569, 1362170, 1405357, 1448892, 1494811, 1544827, 1599915, 1660376, 1725225, 1792021, 1858389, 1923844, 1989480, 2055939, 2122352, 2187416, 2250932, 2313872, 2377176, 2440741, 2503477, 2564099, 2621886, 2676955, 2730013, 2781576, 2830830, 2875195, 2911584, 2938458, 2956060, 2964302, 2961367, 2945544, 2917916, 2881771, 2839289, 2790177]
62962B790177n6241o1815o4496o4831o3555o0580n6019n0851m5842m0724l4849
62951B190374k7980k0265j2229n014L71M480R232J5731K2675K7571K9264K8990
62939B263200K9068L0721L3112L4627L4870L4867L5159L4684L2259K8256K3774
62928B614597J8904J3046O323p99q760j7990k7122l4113l9311m5224n2753n9697
62916B367101o4014o6592o9303p1812p2124o9505o5281o1241n8362n6646n5050
62905A657171n2025m7087m1629l7382l4649l2773l1627l1406l1403l0333k7917
62894A258940k5154k3028k1767k1294k1497k1963k2051k1448k0305j8962j7836
62883A023635j7248j6916j6054j4536j3442j3684j4473j4161j2344j0283r181
$$ y = [2790177, 2733936, 2672121, 2607625, 2542794, 2479239, 2418659, 2362640, 2311789, 2265947, 2225223, 2190374, 2162394, 2142129, 2129900, 2124886, 2125257, 2129737, 2138969, 2154700, 2177375, 2204946, 2234210, 2263200, 2292268, 2322989, 2356101, 2390728, 2425598, 2460465, 2495624, 2530308, 2562567, 2590823, 2614597, 2633501, 2646547, 2652870, 2652071, 2643311, 2625321, 2598199, 2564086, 2524775, 2479551, 2426798, 2367101, 2303087, 2236495, 2167192, 2095380, 2023256, 1953751, 1888470, 1827229, 1768867, 1712221, 1657171, 1605146, 1558059, 1516430, 1479048, 1444399, 1411626, 1379999, 1348593, 1317190, 1286857, 1258940, 1233786, 1210758, 1188991, 1167697, 1146200, 1124237, 1102186, 1080738, 1060433, 1041471, 1023635, 1006387, 989471, 973417, 958881, 945439, 931755, 917282, 903121, 890777, 880494, 871313]
62872H71313q944q699p849o432n050m560n329o623p095o028l926k042j529k647
62858G94560m307m836l686k153j845k827l879m195m058m124m752n811o461n576
62844G36050l230j237j143k161k333j417r25j437j771j254r51j716k569k132n25
62829G11249J309K910L764K641o88l890m094j441J071J351K90k21K23P87R22P17
62813G16900L51o3m24q79j651k289j826k45Q95J56j867l251l083k237j774j583
62797F97130r56K63J675K915L640L325J865K63j06R13K010K142J752J695J573
62782G20099K80j945l223k322k67J048J059N23J0l21J36J872L712L444P53j807
62766G23051j810J70J917K817M008N716O526N700M522M503N454O355P168Q505
$$ y = [871313, 862369, 853670, 845821, 839389, 834339, 829779, 824450, 817827, 810732, 804704, 800778, 798736, 797207, 794560, 790253, 785417, 781731, 779578, 777733, 774906, 771027, 766832, 762774, 758650, 753898, 748087, 741626, 736050, 732820, 731583, 730440, 728279, 725946, 724529, 723604, 722167, 720396, 719142, 718191, 716475, 713906, 711774, 711249, 712558, 715468, 719232, 721873, 721185, 717295, 713201, 711760, 712831, 714182, 714472, 714251, 714474, 715261, 716183, 716900, 717251, 717188, 716764, 715885, 714234, 711945, 710119, 709874, 710769, 710925, 709058, 705807, 702724, 700487, 698713, 697130, 696174, 696437, 698112, 701027, 704667, 707992, 709857, 710120, 710014, 710927, 712937, 715079, 716831, 718526, 720099, 720379, 718434, 715211, 712889, 712622, 713670, 714729, 715252, 715262, 714941, 715077, 716949, 720661, 724105, 724858, 723051, 721241, 721411, 723328, 726145, 730153, 735869, 742395, 748095, 752617, 757120, 762574, 768929, 776097, 784602]
62752G84602R970J0176Q601O637O362Q505J1750J3945J4177J3721J4664J7571
62740I20681K0924K2995K3632K3834K4246K4818K5547K6811K9000L2283L6544
62729A211315M1239M5681M9896N4759O0730O6952P2243P6644Q1106Q5980R0523
62718A937068R3764R5039R3924R0492Q5446P9230P1251O0915M9037L7006K4730
62707B717902J0784n183k1615l6825n0314o1763p0366p6022q0108q3850q6733
62696B155907q7531q6238q3937q1275p8147p4685p1459o8665o5617o1367n5610
62685A341376m9234m3906m0669l8816l6683l3558l0043k6549k2675j8499j5213
62674I85531j3646j3138j2685j2080j1105q854n170j749k90k95n7R80K464M758
$$ y = [784602, 794572, 804748, 813349, 819986, 826348, 834853, 846603, 860548, 874725, 888446, 903110, 920681, 941605, 964600, 988232, 1012066, 1036312, 1061130, 1086677, 1113488, 1142488, 1174771, 1211315, 1252554, 1298235, 1348131, 1402890, 1463620, 1530572, 1602815, 1679459, 1760565, 1846545, 1937068, 2030832, 2125871, 2219795, 2310287, 2395733, 2474963, 2546214, 2607129, 2656166, 2693172, 2717902, 2728686, 2723503, 2701888, 2665063, 2614749, 2552986, 2482620, 2406598, 2326490, 2242640, 2155907, 2068376, 1982138, 1898201, 1816926, 1738779, 1664094, 1592635, 1523970, 1458353, 1396986, 1341376, 1292142, 1248236, 1207567, 1168751, 1132068, 1098510, 1068467, 1041918, 1019243, 1000744, 985531, 971885, 958747, 946062, 933982, 922877, 914023, 908853, 907104, 906814, 906519, 906462, 907442, 909906, 914664]
62660I14664Q313J1815J3213J2739J2856J4996J8216K1514K5277K9627L3253L5396
62648A151879L7550M1599M7097N1831N4666N6708N9829O4836P0865P6080P9164
62637A792104Q0434Q1042Q1052P9154P4605O8247O0994N2406M1759K9627J7183
62626B458607M613q542k1930l4552m6081n6634o5456p1266p4202p6107p8195p9501
62614A850754p8445p5236p1769o9339o7378o4544o0448n5905n1753m7945m3933
62603A164059l9728l6142l3902l2759l1601k9412k6154k2808k0467j9190j7909
62592H53987j5809j3606j2782j3494j4097j3159j1188r656q908q072o896o397
62580G19923p214q161p370m754k427k332l919m781l427o82J720L072L616L364
$$ y = [914664, 922977, 934792, 948005, 960744, 973600, 988596, 1006812, 1028326, 1053603, 1083230, 1116483, 1151879, 1189429, 1231028, 1278125, 1329956, 1384622, 1441330, 1501159, 1565995, 1636860, 1712940, 1792104, 1872538, 1953580, 2034632, 2113786, 2188391, 2256638, 2317632, 2370038, 2411797, 2441424, 2458607, 2463220, 2454678, 2432748, 2398196, 2352115, 2295481, 2230025, 2158759, 2084557, 2008450, 1930255, 1850754, 1772309, 1697073, 1625304, 1555965, 1488587, 1424043, 1363595, 1307690, 1255937, 1207992, 1164059, 1124331, 1088189, 1054287, 1021528, 989927, 960515, 934361, 911553, 891086, 871896, 853987, 838178, 824572, 811790, 798296, 784199, 771040, 759852, 750196, 741288, 733216, 726320, 719923, 712709, 704548, 697178, 692424, 689997, 687665, 683746, 678965, 675538, 674856, 676576, 679648, 683264, 686628]
62566F86628K251J138J301K620L503L204L053M464O633P454O413N259N754P743
62552G47418R768J0857J1234J1708J2831J4570J6566J8559K0522K2504K4595K7043
62540I48175L0034L3179L5665L7179L8337L9902M1847M3426M3726M2012L8202
62529A371684L3422K9256K5699K0583J2189J998o492j1643j5182j9676k5645l1629
62517A384564l6141l8722l9772m0060m0240m0303l9631l7860l5407l2974l0789
62506I72665k8675k6519k4296k1906j9425j7400j6454j6395j6004j4117j1001
62495G60473q314p375p578p144n499m114m478n937o488n308l339j512L72K579
62481F96338M437N198N215N428O004O291O044N892O435P353P818P666P729Q835
$$ y = [686628, 688879, 690017, 691318, 693938, 697441, 700645, 703698, 708162, 714795, 722249, 728662, 733921, 739675, 747418, 757186, 768043, 779277, 790985, 803816, 818386, 834952, 853511, 874033, 896537, 921132, 948175, 978209, 1011388, 1047053, 1084232, 1122569, 1162471, 1204318, 1247744, 1291470, 1333482, 1371684, 1405106, 1434362, 1460061, 1480644, 1492833, 1494831, 1488339, 1476696, 1461514, 1441838, 1416193, 1384564, 1348423, 1309701, 1269929, 1229869, 1189629, 1149326, 1109695, 1071835, 1036428, 1003454, 972665, 943990, 917471, 893175, 871269, 851844, 834444, 817990, 801595, 785591, 771474, 760473, 752159, 744784, 737206, 730062, 724563, 720449, 715971, 710034, 703546, 698238, 694899, 693387, 693759, 696338, 700775, 705973, 711188, 716616, 722620, 728911, 734955, 740847, 747282, 754635, 762453, 770119, 777848, 786683]
62467G86683J0777J2715J4546J7045K0374K3286K4774K5884K8690L3540L8535
62456A036849M1845M3388M4031M4341M4680M5348M5903M5195M2776L9383L5308
62445A509047K9443K1097J1774L788k277p383j1909j5380j7948k0423k2637k3396
62433A453796k2386k0619j8501j5083j0119n366k441l97L046Q310J3455J6789
62421A400484J8709K0706K3455K6381K8439K8993K8212K6806K5096K2319J7301
62410A666901R993J876n406j1595j7662k4260l0728l5709l8602m0216m1932m4409
62398A388251m7152m9135m9539m8031m4866m0809l6573l2075k6810k1190j6873
62387I75198j5027j4718j4055j2578j1358j0676r111n711j837M36R63J174J559
$$ y = [786683, 797460, 810175, 824721, 841766, 862140, 885426, 910200, 936084, 964774, 998314, 1036849, 1078694, 1122082, 1166113, 1210454, 1255134, 1300482, 1346385, 1391580, 1434356, 1473739, 1509047, 1538490, 1559587, 1571361, 1575149, 1572872, 1565489, 1553580, 1538200, 1520252, 1499829, 1477192, 1453796, 1431410, 1410791, 1392290, 1377207, 1367088, 1361722, 1359281, 1358884, 1361930, 1370240, 1383695, 1400484, 1419193, 1439899, 1463354, 1489735, 1518174, 1547167, 1575379, 1602185, 1627281, 1649600, 1666901, 1676894, 1678770, 1673364, 1661769, 1644107, 1619847, 1589119, 1553410, 1514808, 1474592, 1432660, 1388251, 1341099, 1291964, 1242425, 1194394, 1149528, 1108719, 1072146, 1040071, 1013261, 992071, 975198, 960171, 945453, 931398, 918820, 907462, 896786, 887675, 881964, 880127, 880563, 881526, 882700, 884259]
62374H84259J211j66j563k585m374p521j0427j1275j0673j0616j1425j1547j0308
62361G92990q873q147p545o596o138o924q284r227r656r475p848m795k379k445
62347F94658m007m703m150l649l156j269J582K792J495L21J640M037M597L148
62333F93336J952K063K392K173K183L198M873O612Q237R447R839R933J1030J3413
62319G80681J5653J6378J6028J6168J7622J9901K2129K3902K5444K7362L0199
62308A011467L3848L7511M0511M3103M6329N1033N7061O3381O9015P3852P8435
62297A605546Q3028Q7196R0353R2168R2136Q9339Q3228P4307O3504N1305L8073
62286B450183K4682J1928l99j2845k4933l5519m4441n2670o0607o7328p1827p3999
$$ y = [884259, 885470, 885304, 883741, 881156, 876782, 869261, 858834, 847559, 836886, 826270, 814845, 803298, 792990, 784117, 775970, 768425, 761829, 755691, 748767, 740483, 731256, 721600, 712125, 704277, 699482, 697103, 694658, 690651, 685948, 681798, 678149, 674993, 673724, 675306, 678098, 679593, 679914, 681554, 685591, 690188, 693336, 695288, 697351, 699743, 701916, 704099, 707297, 712170, 718782, 727019, 736466, 746305, 756238, 767268, 780681, 796334, 812712, 828740, 844908, 862530, 882431, 904560, 928462, 953906, 981268, 1011467, 1045315, 1082826, 1123337, 1166440, 1212769, 1263802, 1320863, 1384244, 1453259, 1527111, 1605546, 1688574, 1775770, 1866123, 1958291, 2050427, 2139766, 2222994, 2297301, 2360805, 2412110, 2450183, 2474865, 2486793, 2486394, 2473549, 2448616, 2413097, 2368656, 2315986, 2255379, 2188051, 2116224, 2042225]
62274B042225p3997p1736o7664o3151n9302n5961n2338m8132m3554l9006l5249
62263A432135l3145l2549l2115l0886k9468k8930k9221k9500k9487k9442k9123
62252A098269k7870k5644k3232k1336k0012j8887j7461j5362j2836j0659r095
62241H95875p414n150l297l265m815o113n878m587l406k830k528j828o6K778N503
62226H52979O402N130L444L681O539J0544J3536J4513J4187J3923J4284J4893
62214I74055J5606J7022J9471K2161K4109K5482K7210K9642L2566L6213M1096
62203A264633M6771N1963N6234O0562O5859P1764P7441Q2825Q8349R3694R7258
62192B057353R6976R1756Q2515P1533O0266M8102L4026J9005N339o273j7344k8894
$$ y = [2042225, 1968228, 1896492, 1828828, 1765677, 1706375, 1650414, 1598076, 1549944, 1506390, 1467384, 1432135, 1398990, 1366441, 1334326, 1303440, 1273972, 1245042, 1215821, 1186321, 1156834, 1127392, 1098269, 1070399, 1044755, 1021523, 1000187, 980175, 961288, 943827, 928465, 915629, 904970, 895875, 888461, 883311, 880014, 876749, 871934, 865821, 859943, 855356, 851950, 849120, 846592, 844764, 844698, 847476, 852979, 859381, 864511, 867955, 871636, 878175, 888719, 902255, 916768, 930955, 944878, 959162, 974055, 989661, 1006683, 1026154, 1048315, 1072424, 1097906, 1125116, 1154758, 1187324, 1223537, 1264633, 1311404, 1363367, 1419601, 1480163, 1546022, 1617786, 1695227, 1778052, 1866401, 1960095, 2057353, 2154329, 2246085, 2328600, 2400133, 2460399, 2508501, 2542527, 2561532, 2566871, 2560598, 2543254, 2514360]
62180B514360l9882m9269n7971o7182p5841q1579q3651q3270q1301p7471p2107
62169A744836o6931o3204o0102n5876n0058m3731l7972l2839k7924k3320j9726
62158A263153j7645j6655j5737j4351j3014j2509j2736j2753j1986j0948j0642
62147A114177j1373j2367j2518j1484r991r028q744q404p471o284n393m596l146
62134A003378p62K057M715P036Q965J0250J0764J0983J1818J3811J6544J8865
62122A118424J9817J9416J8548J8069J8160J8567J9285K0684K3081K6415L0404
62111A350870L4798L9363M3803M7913N1823N5910O0260O4325O7246O8520O8060
62100A952891O5613O0481N2149M1101K8859J7302P766K31o840j5204k4836l3735
$$ y = [2514360, 2474478, 2425209, 2367238, 2300056, 2224215, 2142636, 2058985, 1975715, 1894414, 1816943, 1744836, 1677905, 1614701, 1554599, 1498723, 1448665, 1404934, 1366962, 1334123, 1306199, 1282879, 1263153, 1245508, 1228853, 1213116, 1198765, 1185751, 1173242, 1160506, 1147753, 1135767, 1124819, 1114177, 1102804, 1090437, 1077919, 1066435, 1056444, 1047416, 1038672, 1030268, 1022797, 1016513, 1011120, 1006524, 1003378, 1002616, 1004673, 1009388, 1016424, 1025389, 1035639, 1046403, 1057386, 1069204, 1083015, 1099559, 1118424, 1138241, 1157657, 1176205, 1194274, 1212434, 1231001, 1250286, 1270970, 1294051, 1320466, 1350870, 1385668, 1425031, 1468834, 1516747, 1568570, 1624480, 1684740, 1749065, 1816311, 1884831, 1952891, 2018504, 2078985, 2131134, 2172235, 2201094, 2218396, 2226162, 2226393, 2219553, 2204349, 2179513, 2145778]
62088B145778m0339m5490n1018n6780o0471o0440n7472n3437m9328m5161m0853
62077A584989l6479l2172k8222k4718k1043j6580j2130r371q569q042o551m750
62065A376362l404j805M33J488o00m658p384p355o025m859l740k570k305l429
62051A330149n071o545q339j0540j1820j1258r992r626r857r124o955m214j435
62038A225373J648M957P740R474J0175R859Q785Q118R188J1726J3903J4488J4170
62025A349604J4353J5521J7281J9183K0741K1367K1103K1129K2739K5943K9591
62014A578555L2678L5011L6795L8272L9730M1316M2879M4399M6297M8727N0850
62003B035509N1652N1317N0689M9390M5717L8902L0177K0885J0841k24j0688j8354
$$ y = [2145778, 2105439, 2059949, 2008931, 1952151, 1891680, 1831240, 1773768, 1720331, 1671003, 1625842, 1584989, 1548510, 1516338, 1488116, 1463398, 1442355, 1425775, 1413645, 1404274, 1395705, 1387663, 1381112, 1376362, 1372958, 1371153, 1371586, 1373074, 1372474, 1367816, 1360432, 1353077, 1347052, 1342193, 1338453, 1335883, 1333578, 1330149, 1325078, 1318533, 1310194, 1299654, 1287834, 1276576, 1266584, 1256958, 1247101, 1237977, 1231022, 1226808, 1225373, 1227021, 1231978, 1239718, 1249192, 1259367, 1269226, 1278011, 1286129, 1295317, 1307043, 1320946, 1335434, 1349604, 1363957, 1379478, 1396759, 1415942, 1436683, 1458050, 1479153, 1500282, 1523021, 1548964, 1578555, 1611233, 1646244, 1683039, 1721311, 1761041, 1802357, 1845236, 1889635, 1935932, 1984659, 2035509, 2087161, 2138478, 2189167, 2238557, 2284274, 2323176, 2353353, 2374238, 2385079, 2384855, 2374167, 2355813]
61991B355813k3387k8316l5075m3437n2289o0724o7442p0858p0884o9520o8613
61980A765268o7810o5668o1886n7376n2817m8456m4870m2580m0910l8303l4096
61969A210496k9254k5274k2926k2099k2095k1881k0490j7739j4464j2013j1296
61958I90965j2039j2865j2433j0668q471o403m432k959k753l310k690j86K074
61945I13830J857K44L67K949N221M668K084J05O8J247K219K057O90j244l098m989
61929I28275p322r634j0771j0381r318q386p641p237p719q872r422q811q194q740
61915H05827r784r861q884p931p295o098l978j921j049j397k305l225l737l308
61901G35054j719L53J685J660Q94N63J107J872K191K475L672N743P466P982Q001
$$ y = [2355813, 2332426, 2304110, 2269035, 2225598, 2173309, 2112585, 2045143, 1974285, 1903401, 1833881, 1765268, 1697458, 1631790, 1569904, 1512528, 1459711, 1411255, 1366385, 1323805, 1282895, 1244592, 1210496, 1181242, 1155968, 1133042, 1110943, 1088848, 1066967, 1046477, 1028738, 1014274, 1002261, 990965, 978926, 966061, 953628, 942960, 934489, 928086, 923654, 920695, 917942, 914632, 911942, 911756, 913830, 915687, 915931, 916298, 919247, 924468, 929136, 931220, 931325, 931393, 932640, 934859, 936916, 937606, 936362, 933264, 928275, 920953, 911319, 900548, 890167, 880849, 872463, 864822, 857585, 849866, 840994, 831572, 822761, 814567, 805827, 796043, 786182, 777298, 769367, 762072, 755974, 751996, 750075, 749026, 747629, 745324, 742099, 738362, 735054, 733335, 733688, 735373, 737033, 737927, 738490, 739597, 741469, 743660, 746135, 749807, 755550, 763016, 770998, 778999]
61886G78999Q909J1076J3533J5104J5373J4808J4420J5207J7254J9342J9899J8612
61874I62536J6702J5376J4488J3208J1656J0938J1366J1570J0132P475N101L290
61862A093838R12k310m841n401m879n008n919o163m729j930J338M239O149P223
61848A072519Q574J0912J3285J4176J3521J2557J2031J1706J1154R705O164K82
61836A196586n786r396j0623j1584j2839j2979j2043j2276j4458j6193j5530j3759
61824A049120j2671j1430q721o187o623r673j2130j2199j0921r637q390p040n899
61811I27599m802l178j332k76j07J15Q61J806L041N119P741R772J0704J1044J1280
61796I79387J1768J3399J6791K0787K3436K4607K5986K8160K9627K9348K8377
$$ y = [778999, 787908, 798984, 812517, 827621, 842994, 857802, 872222, 887429, 904683, 924025, 943924, 962536, 979238, 994614, 1009102, 1022310, 1033966, 1044904, 1056270, 1067840, 1077972, 1085447, 1090548, 1093838, 1094750, 1092440, 1087599, 1082198, 1077319, 1072311, 1066392, 1060229, 1055500, 1053570, 1054908, 1059147, 1065296, 1072519, 1081093, 1092005, 1105290, 1119466, 1132987, 1145544, 1157575, 1169281, 1180435, 1190140, 1196304, 1196586, 1190800, 1181404, 1170781, 1159197, 1146358, 1133379, 1121336, 1109060, 1094602, 1078409, 1062879, 1049120, 1036449, 1025019, 1016298, 1010111, 1003488, 993815, 981685, 969486, 958565, 948928, 940538, 933498, 927599, 922797, 919619, 918287, 918011, 917904, 918019, 918880, 920686, 923727, 928846, 936587, 946359, 957063, 968107, 979387, 991155, 1004554, 1021345, 1042132, 1065568, 1090175, 1116161, 1144321, 1173948, 1203296, 1231673]
61785A231673K7917K7343K5469K2601J9825J7047J3165P858K151k682o020p863
61773A378484q664r075r441r441q406n945k298J687N017P303Q784R359Q194N103
61759A370661J624o02k215n374j0597j5917j9582k2006k4444k7103k9498l1420
61747A183527l2584l2274l0480k8594k7862k7665k6279k3158j9612j7364j6908
61736I00747j7107j6239j3715j0802r087q466p624o358n865o411o467n107l675
61723G83824l742m691m867m124l519l202k424j384j301k443l544l508k659j998
61709G40418k043k638l137k695j045R43K056K004J384N83l34q63j49J846L914
61694G40244M633L483J049j403k724k851k830l399l924l445k321j840k317k705
$$ y = [1231673, 1259590, 1286933, 1312402, 1335003, 1354828, 1371875, 1385040, 1392898, 1395049, 1392367, 1386347, 1378484, 1369820, 1360745, 1351304, 1341863, 1333457, 1327512, 1325214, 1326901, 1331918, 1339221, 1348005, 1357364, 1365558, 1370661, 1372285, 1371683, 1369468, 1364094, 1353497, 1337580, 1317998, 1295992, 1271548, 1244445, 1214947, 1183527, 1150943, 1118669, 1088189, 1059595, 1031733, 1004068, 977789, 954631, 935019, 917655, 900747, 883640, 867401, 853686, 842884, 833797, 825331, 817707, 811349, 805484, 799073, 792606, 787499, 783824, 780082, 775391, 770524, 766400, 762881, 759679, 757255, 755871, 754570, 752127, 748583, 745075, 742416, 740418, 738375, 735737, 732600, 729905, 728860, 729803, 731859, 733863, 735247, 735830, 735496, 734633, 734484, 736330, 740244, 744877, 748360, 749409, 748006, 745282, 742431, 739601, 736202, 732278, 728833, 726512, 724672, 722355, 719650]
61680G19650k161j027m3N50Q47R49J061J311J405J011M89N16J066J660K377L505
61664G33166M237L238Q32q86p74jK42P92K775N144N857M873L907L484K326m0k067
61647G67105k483k193k688l668l677k405j092q04j441k398l293l971m494n205
61633G27293o289p241p332o512n378m410l858m045m831n015l469j061q5j275k703
61618F63789k464j241r44j773k227j575p02n49j054j851k790l472l337k582k053
61603F35175j938j470l04P14O51l18j269j458p33L96Q81J67p26k26J534K673K297
61586F36046J887K963M727N348M662L982L811L404K457J687J499J365Q90M50K18
61571F75396n35k424m681n589m350k190j375k849n121n849m503k606j403n75K57
$$ y = [719650, 717489, 716462, 716419, 716969, 717816, 718765, 719826, 721137, 722542, 723553, 724042, 724558, 725624, 727284, 729661, 733166, 737403, 740641, 741473, 740587, 739813, 739812, 740054, 740846, 743621, 748765, 754622, 759495, 763402, 766886, 769212, 769172, 767105, 764622, 762429, 759741, 756073, 752396, 749991, 748899, 748095, 746654, 744256, 740963, 736992, 732498, 727293, 721004, 713763, 706431, 699919, 694541, 690131, 686273, 682228, 677397, 672382, 668913, 667852, 667767, 666492, 663789, 661325, 660084, 659140, 657367, 655140, 653565, 652863, 652314, 651260, 649409, 646619, 643147, 639810, 637228, 635175, 633237, 631767, 631463, 632177, 632828, 632510, 631241, 629783, 629050, 629446, 630327, 630494, 629768, 629542, 631076, 633749, 636046, 637933, 640896, 645623, 650971, 655633, 659615, 663426, 666830, 669287, 670974, 672473, 673838, 674728, 675178, 675396, 674861, 672437, 667756, 662167, 657817, 655627, 654252, 651403, 646282, 640433, 635930, 633324, 631921, 631346, 631603]
61556F31603J65j605l783m437l681l339l993m210l093j915k368m254n929o339
61542E82822n903n668o185o936o778n272l572l364m887o696p442p066o166n236
61528E01651m787n146n655n064l382k266k814l935l961l019k525k911l290l134
61514D49762k828k479j526P4J413J936K181K584K389P43j690l178k844j348K02
61499D45391J175J289N28m83p12J26J212J840K321L001L122J826P1K1K163M218
61483D67109L793J253j028j686j436j336j284o60L46R10P61O32J285K439K972
61468D74070K223P87k65o54q62j031o97K18R20O81k82j269j884j951j329l57J18
61451D68436k74r05j126j064q82j61J119J898J518J055J718K664K120K09j219
$$ y = [631603, 631768, 630163, 626380, 621943, 618262, 614923, 610930, 606720, 603627, 601712, 599344, 595090, 589161, 582822, 576919, 571251, 565066, 558130, 551352, 546080, 542508, 539144, 534257, 527561, 520119, 513053, 506887, 501651, 496864, 491718, 486063, 480999, 477617, 475351, 472537, 468602, 464641, 461622, 459097, 456186, 452896, 449762, 446934, 444455, 442929, 443003, 444416, 446352, 448533, 451117, 453506, 454249, 452559, 449381, 446537, 445189, 445391, 446566, 447855, 448383, 447900, 447188, 447314, 448526, 450366, 452687, 455688, 458810, 460636, 460707, 460728, 462891, 467109, 470902, 472155, 471127, 469441, 468005, 466669, 465385, 464725, 465071, 465981, 466742, 467374, 468659, 471098, 474070, 476293, 477080, 476815, 476161, 475299, 474268, 473571, 473789, 474709, 475390, 475108, 473839, 471955, 470004, 468675, 468318, 468436, 468162, 467257, 466131, 465067, 464185, 464024, 465143, 467041, 468559, 469614, 471332, 473996, 476116, 476325, 475106]
61436D75106j400j336j532j145P0R38Q25O52J021J027J19m43M69J865K178J710
61420D80124J654J607K08k035k704o97K139L272K267O30k70l54k90m36m40J94
61404D84869J280K005J919J391Q43N7j271k801l827l837k429N17L909N633M665
61389D92923K495J265J192J037N46P08J751K621K752K761K881K264P53l1J425
61374E17343M336O463O614N456M270L774L892L951L261K046J417J909K434J575
61360E68741m63j905j401P73L348N058N024L093K51j920k598k323k004j888j741
61345E70045j542j401j074k77N84N49p23k310k898k134q37L5L36M72N22Q5r14
61328E58518j729j546n83N0k14o74l65N74J133Q41L82O21J515K257K208J531J047
$$ y = [475106, 473706, 472370, 470838, 469693, 469763, 470701, 471526, 472178, 473199, 474226, 474345, 473902, 474371, 476236, 478414, 480124, 481778, 483385, 483593, 481558, 478854, 478157, 480296, 483568, 485835, 486465, 486195, 485841, 485551, 485115, 484675, 484869, 486149, 488154, 490073, 491464, 492307, 492364, 491093, 488292, 484465, 480628, 478199, 478716, 482625, 488258, 492923, 495418, 496683, 497875, 498912, 499458, 500166, 501917, 504538, 507290, 510051, 512932, 515196, 515949, 515918, 517343, 521679, 528142, 534756, 540212, 544482, 548256, 552148, 556099, 559360, 561406, 562823, 564732, 567166, 568741, 568278, 566373, 564972, 565745, 569093, 574151, 579175, 582268, 582519, 580599, 578001, 575678, 573674, 571786, 570045, 568503, 567102, 566028, 565751, 566335, 566884, 566161, 563851, 560953, 558819, 557982, 558017, 558353, 558825, 559347, 559432, 558518, 556789, 555243, 554660, 554710, 554496, 553822, 553457, 554031, 555164, 556005, 556387, 557008, 558523, 560780, 562988, 564519, 565566]
61311E65566J552K988M298M447L632K950K895K835K300J923K447L452L940L805
61297F09030L769M130M498M722N137N784O303O698P403Q292Q567P925P127O887
61283F96272O929O655O146N939O169O482O455N793M559L446L242L717L708K764
61269G68276J869J903K215J737Q06N93J041Q52l59j286p58P34K032K980M102N245
61253G91982N627N246N237O360P837Q351P854P603Q375R539J0194J0400J0558
61240H95163J0168Q384N585L288K169J189q21l605o053p631q530q953r026r157
61226H72170r661j0169r844q251n726l150j529j387k212k785k312r30R69L210
61212H18393N335O401N950M633L386K575K344L041M559N993O755P315Q131Q648
$$ y = [565566, 567118, 570106, 574404, 578851, 582483, 585433, 588328, 591163, 593463, 595386, 597833, 601285, 605225, 609030, 612799, 616929, 621427, 626149, 631286, 637070, 643373, 650071, 657474, 665766, 674333, 682258, 689385, 696272, 703201, 709856, 716002, 721941, 728110, 734592, 741047, 746840, 751399, 754845, 758087, 761804, 765512, 768276, 770145, 772048, 774263, 776000, 776806, 777399, 778440, 779292, 778933, 777647, 776889, 777623, 779655, 782635, 786737, 791982, 797609, 802855, 808092, 814452, 822289, 830640, 838494, 846097, 854472, 864011, 874205, 884605, 895163, 905331, 913715, 919300, 922588, 924757, 925946, 925125, 921520, 915467, 907836, 899306, 890353, 881327, 872170, 862509, 852340, 842496, 834245, 828519, 825369, 823840, 822453, 820241, 817456, 815144, 814214, 815183, 818393, 823728, 830129, 836079, 840712, 844098, 846673, 849017, 852058, 856617, 862610, 869365, 876680, 884811, 893459]
61198H93459Q397Q174Q850R680R284P821O662O211N632M679M043L827L222K076
61184I82017J252R55J28j799l824m681m275l232k121j640k364l702m127l149k027
61169I47411j754j463J38K763N023O162O235N381M095L607M750O695P922Q147
61155A005112Q284Q764Q989Q381P084N597M506M411N294O114N950N367N700P089
61141A096642Q336Q775R022R523R657R084Q985J0799J4167J7083J7895J6448J3406
61128A249822R517N770L412L062L987M658M064K371M98o86r14n92m44r04j837
61113A281784k984m465o461q464r461r111q294q026q222q155p853q254r777j1479
61099A170778j2208j2136j2399j3262j3488j2000r609q130p894p356n662m276
$$ y = [893459, 901856, 910030, 918880, 928560, 937844, 945665, 952327, 958538, 964170, 968849, 972892, 976719, 979941, 982017, 983269, 984224, 984352, 982553, 978729, 974048, 969773, 966541, 964420, 962780, 960416, 956714, 952587, 949438, 947411, 945657, 944194, 944332, 947095, 952118, 958280, 964515, 969896, 973991, 977598, 982348, 989043, 996965, 1005112, 1013396, 1022160, 1031149, 1039530, 1046614, 1052211, 1056717, 1061128, 1066422, 1072536, 1078486, 1083853, 1089553, 1096642, 1104978, 1113753, 1122775, 1132298, 1141955, 1151039, 1160024, 1170823, 1184990, 1202073, 1219968, 1236416, 1249822, 1259339, 1265109, 1268521, 1271583, 1275570, 1280228, 1284292, 1286663, 1287161, 1286475, 1285561, 1284969, 1284525, 1283621, 1281784, 1278800, 1274335, 1267874, 1259410, 1249949, 1240838, 1232544, 1224518, 1216296, 1208141, 1200288, 1192034, 1182257, 1170778, 1158570, 1146434, 1134035, 1120773, 1107285, 1095285, 1085676, 1077546, 1069652, 1062296, 1056634, 1052358]
61087A052358m828o270o161m463l811n488p556q193q584j0314j1759j0032n780
61074I59119k825k868l450j980Q15K902M295O441R548J2281J3615J3708J3448
61061A025049J4053J6440J9971K2567K3141K3258K5116K8433L0798L0868K9814
61050A289508K9339K9611K9782K9578K9379K9016K7540K4540K1116J8728J7186
61039A575323J4737J0509N915K689M76k352o053r399j1945j4484j7085j8673j9213
61026A510445k0295k2437k3641k2213j9603j8646j9855k1168k0850j9113j7187
61015A285437j5988j5516j4664j2156q406n622n073n206l758p67K030M000N974
61002A210285Q322J0539J2680J5359J8174J9737J9671J9300J9943K1646K3877
$$ y = [1052358, 1047530, 1041260, 1035099, 1030636, 1026825, 1021337, 1013781, 1005588, 997004, 986690, 974931, 964899, 959119, 956294, 953426, 949976, 947996, 948811, 951713, 956008, 962449, 971997, 984278, 997893, 1011601, 1025049, 1039102, 1055542, 1075513, 1098080, 1121221, 1144479, 1169595, 1198028, 1228826, 1259694, 1289508, 1318847, 1348458, 1378240, 1407818, 1437197, 1466213, 1493753, 1518293, 1539409, 1558137, 1575323, 1590060, 1600569, 1606484, 1609173, 1609649, 1607297, 1601244, 1591845, 1579900, 1565416, 1548331, 1529658, 1510445, 1490150, 1467713, 1444072, 1421859, 1402256, 1383610, 1363755, 1342587, 1321737, 1302624, 1285437, 1269449, 1253933, 1239269, 1227113, 1218707, 1213085, 1208012, 1202806, 1199048, 1198281, 1200311, 1204311, 1210285, 1218607, 1229146, 1241826, 1257185, 1275359, 1295096, 1314767, 1334067, 1354010, 1375656, 1399533]
60991A399533K6499K9659L3355L7329M1027M3989M6695N0449N5746O1561O7166
60980A893008P3500Q1453Q9903R7348J04556J13382J23420J32258J39037J45533
60970B993398J53480J62963J73848J86733K01835K18697K37274K57622K78468
60961D864318K98485L19463L45950L81279M26337M82401N51642O33519P24478
60952I027872Q23720R35963J065564J211682J373754J557521J764965J973016
60944A9734057K125777K153776K006295J675368J205047O87940K43552k6306q7104
60935B9718402R766J56154K39302J78173o5553m81277r99888j504117j876613
60926B5374349k058324k067294j965386j811443j640891j471597j312659j166804
$$ y = [1399533, 1426032, 1455691, 1489046, 1526375, 1567402, 1611391, 1658086, 1708535, 1764281, 1825842, 1893008, 1966508, 2047961, 2137864, 2235212, 2339768, 2453150, 2576570, 2708828, 2847865, 2993398, 3146878, 3309841, 3483689, 3670422, 3872257, 4090954, 4328228, 4585850, 4864318, 5162803, 5482266, 5828216, 6209495, 6635832, 7118233, 7669875, 8303394, 9027872, 9851592, 10787555, 11853119, 13064801, 14438555, 15996076, 17761041, 19734057, 21859834, 24013610, 26019905, 27695273, 28900320, 29588260, 29831812, 29805506, 29718402, 29728168, 29884322, 30123624, 30301797, 30236244, 29754967, 28755079, 27250962, 25374349, 23316025, 21248731, 19283345, 17471902, 15831011, 14359414, 13046755, 11879951]
60918A1879951j033266r12356q05482p11514o27299n52161m88334m36399l93370
60909E919770l55951l22720k92326k62726k33625k07113j84528j64576j45767
60900C750438j28486j13324r9542q6888p6957p0724o6080o0031n2368m5283m0071
60889B910684l6094l2602k9617k7011k4279k1587j9905j9848k1097k3161k5990
60878B629493k9692l4092l8621m2355m4614m5908m7885n1505n5560n7705n6981
60867B124575n4633n2578n1761n1963n2459n2481n1534m9625m7150m4589m2380
60856A573422m0821l9720l8326l6021l3007k9925k7100k4595k2822k2142k1830
60845A237113k0248j6672j2478r858r543j0259j0361r519q679q714r378r559q567
$$ y = [11879951, 10846685, 9934329, 9128847, 8417333, 7790034, 7237873, 6749539, 6313140, 5919770, 5563819, 5241099, 4948773, 4686047, 4452422, 4245309, 4060781, 3896205, 3750438, 3621952, 3508628, 3409086, 3322198, 3245241, 3174517, 3108437, 3048406, 2996038, 2950755, 2910684, 2874590, 2841988, 2812371, 2785360, 2761081, 2739494, 2719589, 2699741, 2678644, 2655483, 2629493, 2599801, 2565709, 2527088, 2484733, 2440119, 2394211, 2346326, 2294821, 2239261, 2181556, 2124575, 2069942, 2017364, 1965603, 1913640, 1861181, 1808700, 1757166, 1707541, 1660391, 1615802, 1573422, 1532601, 1492881, 1454555, 1418534, 1385527, 1355602, 1328502, 1303907, 1281085, 1258943, 1237113, 1216865, 1200193, 1187715, 1177857, 1168314, 1158055, 1147694, 1138175, 1129496, 1120782, 1111404, 1101845, 1093278]
60832A093278p052o392p017p813p665p160p887j0101j2144j2567j1817j1184j0946
60819I73533j0573j0077r974j0307j0706j1163j1540j0804q249n254m042m507
60807H66337m387k999k571m649p350q090p324p207p769p072m806l139l746o009
60793G89219q504j0316j0523q423n147l361m276o090o381m904l140k160k061k674
60779G11259l660m265l981l206k704k689k906l166l327l128k495j638o42M49J073
60764F74974N63m10OK367M448L582P6k869k711j48K053K041L84j086j420j396
60748F80454k207l685m374l365j441j51k91j510k838l306k633j692j730k814l699
60733F44718l561l115l387m229m842n106n403n578n095m063l183k712k221j449
$$ y = [1093278, 1086226, 1079834, 1072817, 1065004, 1057339, 1050179, 1042292, 1032191, 1020047, 1007480, 995663, 984479, 973533, 962960, 952883, 942909, 932602, 921896, 910733, 899193, 888389, 880140, 874886, 870844, 866337, 861950, 858951, 856380, 851731, 844381, 836291, 828967, 821760, 813991, 806919, 802113, 798974, 795228, 789219, 780715, 770399, 759876, 751453, 746306, 742945, 738669, 732579, 726198, 721294, 718154, 715994, 713933, 711259, 707599, 703334, 699353, 696147, 693443, 690754, 687848, 684682, 681355, 678227, 675732, 674094, 673452, 673901, 674974, 675537, 675127, 675133, 677500, 681948, 685530, 685606, 682737, 680026, 679878, 681931, 683972, 684356, 683270, 681850, 680454, 678247, 674562, 670188, 666823, 665382, 665231, 664940, 663430, 660592, 657286, 654653, 652961, 651231, 648417, 644718, 641157, 638042, 634655, 630426, 625584, 620478, 615075, 609497, 604402, 600339, 597156, 594444, 592223, 590774]
60719E90774o90l23m74j148k211l169l470k983j953o39O07J147N13q97j988j905
60703E71191o80R04J978K382K858M083N425N444L971K746L231M557M702L309K083
60688F18184K501M150N505N455L894J473r08k777m289n543o049n538m900n372
60674F05786o797p715p313o436o290o875p177o505n207m342m700n964o907o669
60660E16889n633m664l887k940k007j492r37N39K505L245K029K88j89O62J695
60645E06103K381L016L526L149J515n08j388l28J772K960K290J067J377L379N033
60630E35344M821L528K723K680K864L400M557N381M567K652J683K498L818M472
60616E84988M932N835O412N746M626M541N269N015L003M79j128j841k343k634
$$ y = [590774, 590084, 589761, 589287, 588139, 585928, 582759, 579289, 576306, 574353, 573714, 574321, 575468, 575981, 575084, 573096, 571191, 570511, 571415, 573393, 575775, 578633, 582716, 588141, 593585, 597556, 600302, 603533, 608090, 612792, 616101, 618184, 620685, 624835, 630340, 635795, 639689, 641162, 640254, 637477, 633188, 627645, 621596, 616058, 611158, 605786, 598989, 591274, 583961, 577525, 571235, 564360, 557183, 550678, 545471, 541129, 536429, 530465, 523558, 516889, 511256, 506592, 502705, 499765, 497758, 496266, 495329, 495868, 498373, 501618, 503647, 503935, 503746, 504408, 506103, 508484, 511500, 515026, 518175, 519690, 519182, 517794, 517466, 519238, 522198, 524488, 525555, 526932, 530311, 535344, 540165, 543693, 546416, 549096, 551960, 555360, 559917, 565298, 569865, 572517, 574200, 576698, 580516, 584988, 589920, 595755, 602167, 607913, 612539, 617080, 622349, 627364, 630367, 630846, 629718, 627877, 625534, 622900]
60602F22900k407k091k477l510m154l630k242j017p87j535k367k264j154RM26
60587E93700L70N12Q88J053Q33J44j437l886n814n657l823k450k735l764m312
60572E63622m436m528m153k949j716j344j399q97Q6P94J194J669J914J465J080
60557E50402J958L640M308L368K185J819J556N76l92k57M85M30m81p61M50K025
60541E71311K209P85p43j059m02K54P65J649K561K310P86l37J65J267J365P97
60525E83683J069K245K982K931L011L374L143K600L377N655P327P139O776Q219
60511F43531J0667J2005J2069J2374J3352J3866J3213J1762R662O513K529j229
60499G60314l889n179n007l734k585k483k578j223J621M280N693O440P268Q103
$$ y = [622900, 620493, 618402, 615925, 612415, 608261, 604631, 602389, 601372, 600585, 599050, 596683, 594419, 593265, 593274, 593700, 594070, 594582, 595470, 596523, 597356, 597500, 596063, 592177, 586363, 580706, 576883, 574433, 571698, 567934, 563622, 559186, 554658, 550505, 547556, 545840, 544496, 543097, 542200, 542286, 543080, 544274, 545943, 547857, 549322, 550402, 552360, 556000, 560308, 563676, 565861, 567680, 569236, 569812, 569420, 569163, 569648, 570078, 569597, 568836, 569286, 571311, 573520, 574305, 573562, 572503, 572101, 572355, 573120, 574769, 577330, 579640, 580426, 580089, 580254, 581521, 582886, 583683, 584752, 586997, 589979, 592910, 595921, 599295, 602438, 605038, 608415, 614070, 621397, 628536, 635312, 643531, 654198, 666203, 678272, 690646, 703998, 717864, 731077, 742839, 752501, 759014, 761543, 760314, 756425, 751246, 746239, 742505, 739920, 737437, 734859, 733636, 735257, 739537, 745230, 751670, 758938, 767041]
60485G67041R017J0760J3459J5947J7238J7751J8183J7947J5891J2132Q148N162
60473I28676L208J693J91j440l188m880o240p061p158o317m575k498r67m90p27
60458H88227p09L37K296M257N383N658N738O359P999J0842J4609J8489K1691K4161
60444A015337K6565K9522L3096L6998M0916M4461M7023M8085M7776M6876M5830
60433A462485M3709L8732L0209J9591Q795k024j3920k6551l7697m5768n1207n4595
60421A371759n5004n1861m7201m3966m2509m0750l7667l4639l3013l2131l0602
60410I22416k8115k5197k2270j9728j8038j6994j5616j3437j1252j0036r788r871
60398G22074r759r133q018p266p894r335r407o932l543j788k163l124l409l087
$$ y = [767041, 776058, 786818, 800277, 816224, 833462, 851213, 869396, 887343, 903234, 915366, 923514, 928676, 931884, 933577, 933768, 932328, 929140, 924260, 918020, 910959, 903801, 897484, 892909, 890411, 889444, 888954, 888227, 887518, 887855, 890151, 894408, 899791, 905449, 911187, 917546, 925545, 936387, 950996, 969485, 991176, 1015337, 1041902, 1071424, 1104520, 1141518, 1182434, 1226895, 1273918, 1322003, 1369779, 1416655, 1462485, 1506194, 1544926, 1575135, 1594726, 1603521, 1601497, 1587577, 1561026, 1523329, 1477561, 1426354, 1371759, 1316755, 1264894, 1217693, 1173727, 1131218, 1090468, 1052801, 1018162, 985149, 953018, 922416, 894301, 869104, 846834, 827106, 809068, 792074, 776458, 763021, 751769, 741733, 731945, 722074, 712315, 703182, 695164, 687898, 680004, 670669, 661262, 654330, 650787, 648999, 646836, 643712, 640303, 637216]
60384F37216k647k358k590l588m675m584k992j083k92r23k195l134l195k354r54
60369E99652N44J734K236J729K73j426k367j950m27J239K028J634P53L35O05J080
60353F07672J417J669J790J544J106J089J669K340K808L377M062M115L105J850
60339F39613J524K313L433M030L572K076O58J043L553O162O619N073L502K953
60325F86124K704K029J411J647K786M284N486N749M901L741L336L654L672K980
60311G34504K433K880M078N237N886N916N380M788M940N968O918O852N990N380
60297H07150N683O665P730Q587R397J0351J1123J0945R433P177N091L355J438
60284I04125j002l697o084p443p069n103l104k826m308n902o308n638m527l313
$$ y = [637216, 634569, 632211, 629621, 626033, 621358, 616774, 613782, 612699, 612407, 611484, 609289, 606155, 602960, 600606, 599652, 600196, 601930, 604166, 605895, 606168, 604742, 602375, 600425, 599998, 601237, 603265, 604899, 605652, 605987, 606592, 607672, 609089, 610758, 612548, 614092, 615198, 616287, 617956, 620296, 623104, 626481, 630543, 634658, 637763, 639613, 641137, 643450, 646883, 650913, 654485, 656561, 657219, 658262, 661815, 667977, 674596, 679669, 683171, 686124, 688828, 690857, 692268, 693915, 696701, 700985, 706471, 712220, 717121, 720862, 724198, 727852, 731524, 734504, 736937, 739817, 743895, 749132, 755018, 760934, 766314, 771102, 776042, 782010, 788928, 795780, 801770, 807150, 812833, 819498, 827228, 835815, 845212, 855563, 866686, 877631, 887064, 894241, 899332, 902687, 904125, 903123, 899426, 893342, 885899, 878830, 873727, 870623, 867797, 863489, 857587, 851279, 845641, 841114, 837801]
60270H37801k531k987m578n888n728m568l731l689l772l097j183J841M998O904
60256H09792P095O659P028Q467J0170J1445J2214J2772J3581J5084J7177J9071
60244I50555J9919J9155J6224J0898M298j411n308q826j3605j8895k2338k2828
60232I27838k1230j8648j5428j1977r059o938n197l741l002k948k917k846l547
60219H20360n146o257n469l087p35L61R9r01j804k007j709j754k522l302l214
60204G82913k321j319n76j70n44k133m317n586n136l756k664j962q48Q29J997
60189G54407J724O30K86J302K714L424L523L628L547K543Q14l67k26N19O96J01
60173G79265m98l16Q87K710M142M102K564R20O58J794L067L506L276L026L035
$$ y = [837801, 835270, 832283, 827705, 821817, 816089, 811521, 807790, 804101, 800329, 797232, 796049, 797890, 802888, 809792, 816887, 823546, 830574, 839041, 849211, 860656, 872870, 885642, 899223, 914307, 931484, 950555, 970474, 989629, 1005853, 1016751, 1021049, 1019638, 1014330, 1005504, 991899, 973004, 950666, 927838, 906608, 887960, 872532, 860555, 851496, 844558, 839361, 835620, 832618, 829670, 826753, 823907, 820360, 815214, 808957, 803488, 800401, 799666, 800027, 800126, 799225, 797421, 795414, 793705, 791951, 789429, 786127, 782913, 780592, 779273, 778697, 778527, 777983, 775850, 771533, 765947, 760811, 757055, 754391, 752429, 751581, 752410, 754407, 756131, 756761, 757047, 758349, 761063, 764487, 768010, 771638, 775185, 777728, 778542, 778175, 777949, 778468, 779164, 779265, 778767, 778451, 779338, 782048, 786190, 790292, 792856, 793776, 794434, 796228, 799295, 802801, 806077, 809103, 812138]
60158H12138L162L223L193L289L906N196O574P088O582O253P532J0340J2850J3280
60144I04606J1793J0237R905J0058R051O654M561M444O094P858Q380P424N336
60131A006401K650L23m97L88J667J659K5k086l494m102m426m701m932n447o576
60116I76852p777p866o516m946m597n512o589p046o863n955l986j354L96q7k389
60101I05765m529m758l030r11j07r02j947j755l03J210J988K313K435J846L27
60086H97642j052r88K23R87N48l3O45K578M485N272M944M333M291N055O149O852
60070I41931O814O178N226M200L481L559M511N655O020N225L794K577J988J859
60056A003018J967K385L171L984M341M143L541K357J81k651m767m992l562j746
$$ y = [812138, 815300, 818523, 821716, 825005, 828911, 834107, 840681, 847769, 854351, 860604, 868136, 878476, 891326, 904606, 916399, 926636, 936541, 946599, 955650, 962304, 966865, 971309, 977403, 985261, 993641, 1001065, 1006401, 1009051, 1009374, 1008877, 1009265, 1010932, 1012591, 1012616, 1010530, 1007036, 1002934, 998508, 993807, 988875, 983428, 976852, 969075, 961209, 954693, 949747, 945150, 939638, 933049, 926003, 919140, 913185, 909199, 907845, 908241, 908154, 905765, 901236, 896478, 893448, 892537, 892430, 891528, 889581, 887826, 887523, 888733, 890721, 893034, 895469, 897315, 897642, 896590, 895602, 895825, 896812, 897360, 897327, 897972, 900550, 905035, 910307, 915251, 919584, 923875, 928930, 935079, 941931, 948745, 954923, 960149, 964349, 967830, 971389, 975900, 981555, 987575, 992800, 996594, 999171, 1001159, 1003018, 1004985, 1007370, 1010541, 1014525, 1018866, 1023009, 1026550, 1028907, 1029088, 1026437, 1021670, 1016678, 1013116, 1011370]
60042A011370n07l5k38j054k187l165l790m209m577m985n599o318o426n201l048
60027I60031j352r34j115p40K75Q39Rj925l646m037l173k113j685j802k163l026
60011I33443m581o014o318n940o383p847q682p875o788p140q318q283o699n360
59997H37215n466o078n816m701l580k747j983j307p57%J066J727J383P18J004
59982H10678K373L673M106M102M387M906N130M813M102L379L283M229N444N171
59968H69776K610q10l060l992n063o685p384o142m332m110n657p209p590p457
59954H02895p961r144j0077r923q553o581n056m657m999n120m680m201m001l665
59940G14277k808j728q87l62k62r79k312k978j913J65J407R74k14p86j77J433
$$ y = [1011370, 1010863, 1010828, 1010590, 1009536, 1007349, 1004184, 1000394, 996185, 991608, 986623, 981024, 974706, 968280, 963079, 960031, 958679, 957745, 956630, 955890, 956165, 957004, 957013, 955088, 951442, 947405, 944232, 942119, 940434, 938632, 936469, 933443, 928862, 922848, 916530, 910590, 904207, 896360, 887678, 879803, 873015, 865875, 857557, 849274, 842575, 837215, 831749, 825671, 819855, 815154, 811574, 808827, 806844, 805537, 804780, 804780, 805846, 807573, 808956, 809674, 810678, 813051, 816724, 820830, 824932, 829319, 834225, 839355, 844168, 848270, 851649, 854932, 859161, 864605, 869776, 872386, 871576, 868516, 864524, 859461, 852776, 845392, 839250, 834918, 830808, 825151, 817942, 810352, 802895, 794934, 785790, 775713, 765790, 757237, 750656, 745600, 740943, 735944, 730824, 726144, 721943, 717942, 714277, 711469, 709741, 708854, 708492, 708230, 707251, 704939, 701961, 700048, 700213, 701620, 702594, 702380, 701594, 701417, 702850]
59924G02850L508N201N653M846L695L034K833K612K197J655Q91j68j220j933k533
59909G33121l551m867n502m689k951j699j653k063j741o18J72k31j420k340k537
59894F97431k268j703o54Q67K226K553J574N5o40K11J763K386J586O51R29K049
59878G09016K625K306K053K469K952K751J887P03o47j766j899q89L28R15J285
59863G24089K365M128N613O275O544P014P670Q086P998P559P087O645N866M409
59849H11348K589J214N90K32k44m78r6L87J61o13q07L24K225L607L644K664J819
59832H28566J963K782L307L308L595M639N712N954N545N068M413L509L480N438
59818H87279Q231R078O959L976K524K401J786J16j366j626j066n83m09k19O6P5
$$ y = [702850, 706358, 711559, 717212, 722058, 725753, 728787, 731620, 734232, 736429, 738084, 738975, 738807, 737587, 735654, 733121, 729570, 724703, 719201, 714512, 711561, 709862, 708209, 706146, 704405, 703787, 703959, 703728, 702308, 699968, 697431, 695163, 693460, 692806, 693673, 695899, 698452, 700026, 700081, 699441, 699652, 701415, 703801, 705387, 706038, 706967, 709016, 711641, 713947, 716000, 718469, 721421, 724172, 726059, 726762, 726115, 724349, 722450, 721561, 721889, 722804, 724089, 726454, 730582, 736195, 742470, 749014, 756028, 763698, 771784, 779782, 787341, 794428, 801073, 806939, 811348, 813937, 815151, 815741, 815973, 815729, 815251, 815155, 815542, 815703, 815090, 814283, 814607, 816832, 820439, 824083, 826747, 828566, 830529, 833311, 836618, 839926, 843521, 848160, 853872, 859826, 865371, 870439, 874852, 878361, 881841, 887279, 895510, 904588, 911547, 915523, 918047, 920448, 922234, 922350, 920984, 919358, 918292, 917709, 917300, 917081, 917147, 917222]
59802I17222n03j336j503l28J837M013N887Q055J0620J2193J1155P727L944J432
59788I80415l2j442k829l326k753k245k969m758o623q282j0317j2590j3469j1575
59774H97205p895n145m866o016o584n745m013k112n48J92o4p94j287j484j785
59759H49059k222k390k098j532q99m15n34j421k273j975p21j79j513l854n293
59744H21740n056l986l159k717k135j068K41J064O27j227l609n130n068l838k228
59729G84451o24P81J445Q76m84j484j641j739k643l875m023k406J57K210K839
59714G73840K033M59r40j511j336q46k7J545L700N272N191L717K201J790K638
59699G97726M026M918M650L646L267M423O457P871P992P387O660N721M491L612
$$ y = [917222, 916719, 915383, 913880, 913552, 915389, 919402, 925289, 933344, 943964, 956157, 967312, 975039, 978983, 980415, 980383, 978941, 976112, 972786, 970033, 967788, 964819, 960061, 953438, 945156, 934839, 922249, 908780, 897205, 889310, 884165, 879299, 873283, 866699, 860954, 856941, 854829, 854281, 854473, 854409, 853615, 852328, 850844, 849059, 846837, 844447, 842349, 840817, 839918, 839503, 838969, 837548, 835275, 833300, 832579, 832400, 830887, 827033, 821740, 816684, 812698, 809539, 806822, 804687, 803619, 803860, 804924, 805551, 804324, 800715, 795585, 790517, 786679, 784451, 783827, 784608, 786053, 786929, 786445, 784961, 783320, 781581, 778938, 775063, 771040, 768634, 768791, 771001, 773840, 775873, 776332, 775392, 773881, 772545, 771699, 771672, 773217, 776917, 782189, 787380, 791097, 793298, 795088, 797726, 801752, 806670, 811320, 814966, 818233, 822656, 829113, 836984, 844976, 852363, 859023, 864744, 869235, 872847]
59685H72847L697M307M387L655K869K552K175J107m7R4J771L367L035P26j916
59670I04626l312l097j668M20K391L250K544Q46p93j770k098k080k073k231k168
59655H92787j339j2O32m7j099j144k50K24m61j548j905j227R0J483K292J994Q80
59638H91350J22N62J724K411K038J050J43l96n92m39N7O21P98M16j57n01o95j046
59620H97466j384j290j136k017m052n598n119l273k063k250k920l427m220n455
59606H53262o211n797m688l461j927j51O77l30k122k760j724j23J098J934K501
59591H30178K628K481K673L385M005L888L020J842R27P58J245J423K90j921l847
59576H52975m444l881k939k131j631j517j797k392l130l587l217k131j427j915
$$ y = [872847, 876544, 880851, 885238, 888893, 891762, 894314, 896489, 897596, 897549, 897643, 899414, 902781, 905816, 906542, 904626, 901314, 898217, 896549, 896969, 899360, 902610, 905154, 906000, 905207, 903437, 901339, 899259, 897186, 894955, 892787, 891448, 891436, 892068, 892021, 890922, 889778, 889528, 889752, 889291, 887743, 885838, 884611, 884701, 886184, 888476, 890470, 891350, 891472, 892034, 893758, 896169, 898207, 899257, 899400, 899004, 898412, 897973, 898030, 898651, 899449, 899865, 899708, 899207, 898512, 897466, 896082, 894792, 893656, 891639, 887587, 881989, 876870, 873597, 871534, 869284, 866364, 862937, 858717, 853262, 847051, 841254, 836566, 833105, 831178, 831027, 831704, 831374, 829252, 826492, 824768, 824645, 825743, 827677, 830178, 832806, 835287, 837960, 841345, 845350, 849238, 852258, 854100, 855027, 855785, 857030, 858453, 858743, 856822, 852975, 848531, 844650, 841711, 839580, 837949, 836432, 834635, 832243, 829113, 825526, 822309, 820178, 818751, 816836]
59562H16836k806k726j909j932k958k920n29K255K464J28j790j363Q9L63o56j369
59546H01177q88J94J090J720K175K193J565O42Q7L08J301K657L549L107J375l54
59530H21898p35J11Q11N81J52N41J540K055J549L67j127k812m128m189l034j964
59514H11616j980k417k033r67n83j319j820p71J191K293J956J429K023L445M315
59499H16378L784K289Q60K21M31J112J930K953M400N869O242M941L126K862M868
59484H62266P733R662J0439J1191J2793J5186J7838J9987K0485J8224J3069O031
59472A024904j345p401j0506r899o812l984l363m389m932l680j252P31J219M11
59458I69702o99j229j002l93K06N88N56j83j829m245o812q566q844q123p778q440
$$ y = [816836, 814030, 811304, 809395, 807463, 804505, 801585, 801056, 803311, 805775, 805903, 804113, 802750, 802839, 803202, 802546, 801177, 800289, 800483, 801573, 803293, 805468, 807661, 809226, 809868, 809955, 810263, 811564, 814221, 817770, 820877, 822252, 821898, 821163, 821274, 822085, 822666, 822818, 823359, 824899, 826954, 828503, 828870, 827743, 824931, 820803, 816614, 813580, 811616, 809636, 807219, 805186, 804219, 803636, 802317, 800497, 799726, 800917, 803210, 805166, 806595, 808618, 812063, 816378, 820162, 822451, 823311, 823532, 823963, 825075, 827005, 829958, 834358, 840227, 846469, 851410, 854536, 857398, 862266, 869999, 879661, 890100, 901291, 914084, 929270, 947108, 967095, 987580, 1005804, 1018873, 1024904, 1023559, 1016158, 1005652, 995753, 988941, 984957, 981594, 977205, 972273, 968593, 967341, 968072, 969291, 969702, 969003, 967774, 966772, 966379, 966585, 967173, 967729, 967546, 965717, 961472, 954660, 946094, 937250, 929127, 921349, 912909]
59442I12909q966p836n371l493l213l555l278k502j903j443r38r93k158l625m053
59427H59582l284k105o62J344L149L347K185J685K777L889L452K406K697M313
59413H84775N525N543N114M654L662K340K046L315M737M792L811L075K867K664
59399I38920K646L552N182O266O089N272M796N058O010P327Q259Q227P783Q009
59385A023396Q658Q000N132J324j757l976n814o630n598l814l446m705n422m107
59371A001241j881o48o37p35j83J048K864M973O651P529Q329J0155J3203J6680
59357A068589J9656K1585K2585K3767K6582L0986L4676L4920L0709K2641J1797
59346A348493O2r315j3569j3086j0677q038m460N09M891N882K537m100j2500k1051
$$ y = [912909, 903943, 896107, 890736, 887243, 884030, 880475, 877197, 874695, 872792, 871349, 870411, 869418, 867260, 863635, 859582, 856298, 854193, 853531, 854875, 858024, 861371, 863556, 865241, 868018, 871907, 875359, 877765, 880462, 884775, 890300, 895843, 900957, 905611, 909273, 911613, 913659, 916974, 921711, 926503, 930314, 933389, 936256, 938920, 941566, 945118, 950300, 956566, 962655, 967927, 972723, 977781, 983791, 991118, 999377, 1007604, 1015387, 1023396, 1032054, 1040054, 1045186, 1046510, 1044753, 1040777, 1034963, 1028333, 1022735, 1018921, 1015475, 1010770, 1005348, 1001241, 999360, 998712, 998075, 997340, 997157, 998205, 1001069, 1006042, 1012693, 1020222, 1028551, 1038706, 1051909, 1068589, 1088245, 1109830, 1132415, 1156182, 1182764, 1213750, 1248426, 1283346, 1314055, 1336696, 1348493, 1348555, 1339240, 1325671, 1312585, 1301908, 1293870, 1289410, 1289919, 1294810, 1300692, 1303229, 1299129, 1286629, 1265578]
59332A265578k7788l1230l1437k9493k6195k2066j8128j5371j3451j0988p450
59321A031981l924j780j240j490j544p81P53K208K646K164J831K312L111L571
59307A039818L964N009O669Q063Q353P319N382L662L589N638Q409R765R049P563
59293A132252O833P094P796Q753J0076J1487J2452J2851J2919J2703J2124J1530
59281A258870J1495J2019J2438J2193J1278R859P918N472K724q8k702m727n969
59268A330780o896q233r987j1456j2271j2662j2556j1383r285p529o870o364m850
59255A210438k959k229k607k302k49K677N203P150Q704R357Q424N919K198k601
59241A247123p958j2481j4905j5384j5039j4586j4019j3258j2228j0635q532o913
$$ y = [1265578, 1237790, 1206560, 1175123, 1145630, 1119435, 1097369, 1079241, 1063870, 1050419, 1039431, 1031981, 1028057, 1026277, 1025037, 1023547, 1022003, 1021222, 1021975, 1024183, 1026829, 1028993, 1030824, 1033136, 1036247, 1039818, 1043782, 1048791, 1055460, 1063523, 1071876, 1079195, 1084577, 1088239, 1091828, 1097466, 1105875, 1115640, 1124689, 1132252, 1139085, 1146179, 1153975, 1162728, 1172804, 1184291, 1196743, 1209594, 1222513, 1235216, 1247340, 1258870, 1270365, 1282384, 1294822, 1307015, 1318293, 1328152, 1336070, 1341542, 1344266, 1344178, 1341476, 1336749, 1330780, 1323884, 1315651, 1305664, 1294208, 1281937, 1269275, 1256719, 1245336, 1236051, 1228522, 1221652, 1215288, 1210438, 1207479, 1205250, 1202643, 1200341, 1200092, 1202769, 1207972, 1215122, 1223826, 1233183, 1241607, 1247526, 1249724, 1247123, 1239165, 1226684, 1211779, 1196395, 1181356, 1166770, 1152751, 1139493, 1127265, 1116630, 1108098, 1101185]
59229A101185o725p370p320o257n429n499n306l625j193J60r7q24r35m12M63J817
59213A052633L773O052Q367J0645J2602J3665J3734J3425J3144J2451J0895Q986
59201A180372P636O927O098M553K286m58l129m791n025m801n406o449o228m424
59187A167161k964l292m092l214j042j10j481l240l058r35J449L116M467N952
59173A158717P102P197O362N601N592N760M984L221J730J345J282M44p95j288
59159A207254j193j810l389m652m914n116n909o284n342m158m252n049m729l229
59145A147228k406l054l646k821j492j263j820j346P85L011L368J467j447l726
59131A132838m338l204j050J108K602L397L814L984L673K622J195M71J347L415
$$ y = [1101185, 1094460, 1087090, 1079770, 1073513, 1068084, 1062585, 1057279, 1053654, 1052461, 1052621, 1052524, 1051700, 1050765, 1050353, 1050816, 1052633, 1056406, 1062458, 1070825, 1081470, 1094072, 1107737, 1121471, 1134896, 1148040, 1160491, 1171386, 1180372, 1188008, 1194935, 1201033, 1205586, 1207872, 1207414, 1204285, 1199494, 1194469, 1189668, 1184262, 1177813, 1171585, 1167161, 1164197, 1160905, 1156813, 1153599, 1152557, 1152447, 1150966, 1147726, 1144668, 1143733, 1145182, 1148298, 1152765, 1158717, 1165819, 1173016, 1179378, 1184979, 1190571, 1196331, 1201315, 1204536, 1206266, 1207611, 1208893, 1209337, 1208542, 1207254, 1206061, 1204251, 1200862, 1196210, 1191296, 1186180, 1180271, 1173987, 1168645, 1164487, 1160235, 1155186, 1150457, 1147228, 1144822, 1141768, 1138122, 1135301, 1133809, 1132546, 1130726, 1129380, 1130165, 1133176, 1136544, 1138011, 1136564, 1132838, 1128500, 1125296, 1124246, 1125354, 1127956, 1131353, 1135167, 1139151, 1142824, 1145446, 1146641, 1147112, 1148459, 1151874]
59117A151874N169N603N317N565O486O996O494N795N906O543O725O363O289O714
59103A237839O900O708P242R048J0523R495O109K803J293P19p13l294n751o962
59089A281959o968o605o804q019r801j0970j0705r400q159p588p436p234o908
59076A175362o760p123p922q447p802o003m346m181n332o172n273k709K11K149
59062A105652K740K721L213M632O314P359P675P884Q291Q499Q132P564P610Q639
59048A196925J0218J1534J2028J1641J0596R199P762O509N336L821J821j50j429
59035A285811j996k169j765m45J077J293p0j357j158l45p71k577m220m855n190
59020A261263n848o411o704p608r578j1271j0882q509o208n633o382o846o064
$$ y = [1151874, 1157043, 1162646, 1167963, 1173528, 1180014, 1187010, 1193504, 1199299, 1205205, 1211748, 1218473, 1224836, 1231125, 1237839, 1244739, 1251447, 1258689, 1267737, 1278260, 1287755, 1293864, 1296667, 1297960, 1298679, 1297966, 1294672, 1288921, 1281959, 1274991, 1268386, 1261582, 1253563, 1243762, 1232792, 1222087, 1212687, 1204528, 1196940, 1189504, 1182270, 1175362, 1168602, 1161479, 1153557, 1145110, 1137308, 1131305, 1126959, 1122778, 1117446, 1111274, 1106001, 1103292, 1103503, 1105652, 1108392, 1111113, 1114326, 1118958, 1125272, 1132631, 1140306, 1148190, 1156481, 1164980, 1173112, 1180676, 1188286, 1196925, 1207143, 1218677, 1230705, 1242346, 1252942, 1262141, 1269903, 1276412, 1281748, 1285569, 1287390, 1287240, 1285811, 1283815, 1281646, 1279881, 1279436, 1280513, 1281806, 1281736, 1280379, 1279221, 1278876, 1278105, 1275528, 1271308, 1266453, 1261263, 1255415, 1249004, 1242300, 1234692, 1225114, 1213843, 1202961, 1194452, 1188244, 1182611, 1176229, 1169383, 1163319]
59007A163319m505l368l421m429n556o123o041n560m860l892k521p80Q80J801
58993A114944J801J449J335J175J84j619l030k863j187Q95K376K983K949K557
58979A123949J908J109N51Q91K445M631O374P106P137P080P275P764Q455R131
58965A195806R588R913J0336J0899J1565J2564J4087J5556J5815J4363J1984R929
58953A342405Q851Q580Q425P546N703L849L227L674L735K985K970M852P104P235
58939A421141N331M188N646Q469J0374J0914J1244J2013J2643J2541J1993J1755
58927A538252J2247J3260J4171J4382J3722J2445J1003J0043J0389J2329J4853
58916A677096J6393J6656J6910J8030J9151J9182J8829J9741K2056K4192K5018
$$ y = [1163319, 1158814, 1155446, 1152025, 1147596, 1142040, 1135917, 1129876, 1124316, 1119456, 1115564, 1113043, 1112263, 1113143, 1114944, 1116745, 1118194, 1119529, 1120704, 1120888, 1119269, 1116239, 1113376, 1112189, 1113084, 1115460, 1118443, 1121392, 1123949, 1125857, 1126966, 1127517, 1128408, 1130853, 1135484, 1141858, 1148964, 1156101, 1163181, 1170456, 1178220, 1186675, 1195806, 1205394, 1215307, 1225643, 1236542, 1248107, 1260671, 1274758, 1290314, 1306129, 1320492, 1332476, 1342405, 1351256, 1359836, 1368261, 1375807, 1381510, 1385359, 1388586, 1392260, 1395995, 1398980, 1401950, 1406802, 1413906, 1421141, 1426472, 1430660, 1436306, 1444775, 1455149, 1466063, 1477307, 1489320, 1501963, 1514504, 1526497, 1538252, 1550499, 1563759, 1577930, 1592312, 1606034, 1618479, 1629482, 1639525, 1649914, 1662243, 1677096, 1693489, 1710145, 1727055, 1745085, 1764236, 1783418, 1802247, 1821988, 1844044, 1868236, 1893254]
58905A893254K4827K4074K2638K0931K0227K0892K1451K0633J9385J9421K0401
58894B128134K0059J7092J2530Q162M756K072l36k689m673n505m911l975m057
58881B166659n039n701n772o296p797r501j0889j2587j5002j7297j8683j9500
58869B032595k0066j9572j7397j4632j2981j2749j3009j3064j2531j0807p886
58858A877901n190m112m148l825k967k384j794K4K981N465O716P752R490J1570
58844A897479J3543J5671J7828J9001J8730J7882J7256J6524J5316J4117J3243
58833B076590J1974R721P156N297M351M271N462P788R700R587P524M764K042o43
58819B165584l117n151p088r410j1938j4283j6732j9684k2539k4226k4675k4799
$$ y = [1893254, 1918081, 1942155, 1964793, 1985724, 2005951, 2026843, 2048294, 2068927, 2088312, 2107733, 2128134, 2148193, 2165285, 2177815, 2185977, 2190733, 2192805, 2192469, 2189780, 2185107, 2179602, 2174691, 2170716, 2166659, 2161620, 2155919, 2150147, 2143851, 2136054, 2126553, 2115664, 2103077, 2088075, 2070778, 2052095, 2032595, 2012529, 1992957, 1975560, 1960928, 1947947, 1935198, 1922189, 1909125, 1896594, 1885787, 1877901, 1872711, 1868599, 1864451, 1860626, 1857659, 1855275, 1853481, 1853505, 1856486, 1861951, 1868667, 1876419, 1885909, 1897479, 1911022, 1926693, 1944521, 1963522, 1982252, 2000134, 2017390, 2033914, 2049230, 2063347, 2076590, 2088564, 2098285, 2105441, 2110738, 2115089, 2119360, 2124822, 2132610, 2142310, 2151897, 2159421, 2164185, 2166227, 2165584, 2162467, 2157316, 2150228, 2140818, 2128880, 2114597, 2097865, 2078181, 2055642, 2031416, 2006741, 1981942]
58807A981942k5058k4982k4185k3002k1942k1142k0489j9765j8650j7054j5414
58796A750259j4285j3747j3577j3754j4271j4713j4655j4382j4524j5043j5161
58785A592147j4364j2970j1613j0571r763r103q752q947r521r775r156q007p092
58772A462513o477n605m534m080m439m742m547m548n070n031l604j892j378j435
58758A405131j37K697N023N279M113L032K526K096J241o5j390k054j869j662k466
58743A421495m224n913o873p236p316p493q473j0531j2437j2352j0134p670o563
58730A314280o519o501o332o312o092m920k825p73L14L82J85N80J694K728K824
58715A282713J959O53q89k674m185m750m662m937n671n737m567l246l050l733
$$ y = [1981942, 1956884, 1931902, 1907717, 1884715, 1862773, 1841631, 1821142, 1801377, 1782727, 1765673, 1750259, 1735974, 1722227, 1708650, 1694896, 1680625, 1665912, 1651257, 1636875, 1622351, 1607308, 1592147, 1577783, 1564813, 1553200, 1542629, 1532866, 1523763, 1515011, 1506064, 1496543, 1486768, 1477612, 1469605, 1462513, 1456036, 1450431, 1445897, 1441817, 1437378, 1432636, 1428089, 1423541, 1418471, 1413440, 1409836, 1407944, 1406566, 1405131, 1404994, 1407691, 1412714, 1417993, 1422106, 1425138, 1427664, 1429760, 1431001, 1430936, 1429546, 1427492, 1425623, 1423961, 1421495, 1417271, 1411358, 1404485, 1397249, 1389933, 1382440, 1373967, 1363436, 1350999, 1338647, 1328513, 1320843, 1314280, 1307761, 1301260, 1294928, 1288616, 1282524, 1277604, 1274779, 1274006, 1274320, 1274702, 1274887, 1275467, 1277161, 1279889, 1282713, 1284672, 1285325, 1284436, 1281762, 1277577, 1272827, 1268165, 1263228, 1257557, 1251820, 1247253, 1244007, 1240957, 1237224]
58701A237224m132l864l433k985k023m05J157J836J448M50l67j50J368L312M286
58686A233722L982L736M850O688P308O116M820N164O613P389P252P724R560J1552
58672A326476J2347J2078J1375J0049P957O194N989O906P360O599N229M068L592
58659A426219M141N529O605O313M991L863L518L801M686N996O720N995M511L566
58645A496454L044J779k99k208l998o810j0591j3685j5248j6249j7360j7696j6674
58632A380459j5448j5222j5414j4749j3137j1317r682q428p975q154p874o632
58620A246427n417n109n065m420l772m146n102n290m288k455K81L868O857P557
58606A219926O516O128P525R296R784R251Q967R110Q605O608L391j09l002m687
$$ y = [1237224, 1233092, 1229228, 1225795, 1222810, 1220787, 1220382, 1221539, 1223375, 1224823, 1225273, 1224906, 1224756, 1226124, 1229436, 1233722, 1237704, 1241440, 1246290, 1252978, 1260286, 1266402, 1271222, 1276386, 1282999, 1290388, 1297640, 1305364, 1314924, 1326476, 1338823, 1350901, 1362276, 1372325, 1380282, 1386476, 1392465, 1399371, 1406731, 1413330, 1418559, 1422627, 1426219, 1430360, 1435889, 1442494, 1448807, 1453798, 1457661, 1461179, 1464980, 1469666, 1475662, 1482382, 1488377, 1492888, 1496454, 1499498, 1501277, 1500978, 1498770, 1494772, 1487962, 1477371, 1463686, 1448438, 1432189, 1414829, 1397133, 1380459, 1365011, 1349789, 1334375, 1319626, 1306489, 1295172, 1285490, 1277062, 1269087, 1260933, 1253059, 1246427, 1241010, 1235901, 1230836, 1226416, 1222644, 1218498, 1213396, 1208106, 1203818, 1201363, 1201644, 1205512, 1212369, 1219926, 1226442, 1232570, 1240095, 1249391, 1259175, 1268426, 1277393, 1286503, 1295108, 1301716, 1305107, 1304998, 1301996, 1297309]
58592A297309m917m018k988k865l592l890k805j218r53k396l966m282l797l603
58578A252019l548k566m54J613K333J398l98j860k377k411k697k923k035q7J272
58563A237279Q54l80o54L97J782K833L604L940L439K383J802K410L989N772O956
58548A276406O978N955M766M210M154L939L298K441J568Q53O05Q62J114R44O19
58533A318712N45N36K88J48P38K076L817N978Q584J0851J1711J1264J0886J1688
58519A397822J3291J4345J3955J2536J1459J1696J2801J3559J3588J3618J4117
58508A542787J4612J4969J6151J8671K1214K2087K1600K1681K3417K6162K8870
58497A772221L0886L1387K9571K5920K2222J9597J7317J4101R875N555J720j575
$$ y = [1297309, 1292392, 1288374, 1285386, 1282521, 1278929, 1275039, 1272234, 1271016, 1270063, 1267667, 1263701, 1259419, 1255622, 1252019, 1248471, 1245905, 1245451, 1247064, 1249397, 1250795, 1250397, 1248537, 1246160, 1243749, 1241052, 1238129, 1236094, 1236007, 1237279, 1238133, 1237753, 1237099, 1237496, 1239278, 1242111, 1245715, 1249655, 1253094, 1255477, 1257279, 1259689, 1263678, 1269450, 1276406, 1283384, 1289339, 1294105, 1298315, 1302469, 1306408, 1309706, 1312147, 1313715, 1314568, 1315173, 1316035, 1317149, 1318093, 1318712, 1319257, 1319793, 1320081, 1320229, 1320967, 1323043, 1326860, 1332838, 1341422, 1352273, 1363984, 1375248, 1386134, 1397822, 1411113, 1425458, 1439413, 1451949, 1463408, 1475104, 1487905, 1501464, 1515052, 1528670, 1542787, 1557399, 1572368, 1588519, 1607190, 1628404, 1650491, 1672091, 1693772, 1717189, 1743351, 1772221, 1803107, 1834494, 1864065, 1889985, 1912207, 1931804, 1949121, 1963222, 1973097, 1978652, 1980372, 1978797]
58485A978797l955m647l695k720l839p692j2793j6979j9310k0388k1129k1744
58473A839906k1843k1091j9613j7999j6849j6120j5164j3753j2607j2227j1743
58462A660897r973p284n198m241l499k441j674j655j998k502l420m256l794k123
58448A606839j034j615k805l335l475l658k969o98J796K592J712O34K9l98m92
58433A593123L21J923L606M910N459M804L546L618O044R322J1417J2400J3525
58420A674018J4799J5431J5831J6873J7688J6569J4024J2651J3612J5163J5107
58409A841766J3166J0441P879N820M019J871o33k404k595k021j969k115j058J326
58395A873493L663N068N884O520P000P717R060J0245R817P547M706K403O21j179
$$ y = [1978797, 1974842, 1970195, 1966500, 1963780, 1959941, 1952249, 1939456, 1922477, 1903167, 1882779, 1861650, 1839906, 1818063, 1796972, 1777359, 1759360, 1742511, 1726391, 1711227, 1697474, 1684867, 1672640, 1660897, 1650924, 1643640, 1638442, 1634201, 1630702, 1628261, 1626587, 1624932, 1622934, 1620432, 1617012, 1612756, 1608962, 1606839, 1605805, 1604190, 1601385, 1598050, 1594575, 1590917, 1587948, 1587250, 1589046, 1591638, 1593350, 1593984, 1594013, 1593615, 1593123, 1593444, 1595367, 1598973, 1603883, 1609342, 1614146, 1617692, 1621310, 1627354, 1636676, 1648093, 1660493, 1674018, 1688817, 1704248, 1720079, 1736952, 1754640, 1771209, 1785233, 1797884, 1811496, 1826659, 1841766, 1854932, 1865373, 1873252, 1879072, 1883091, 1884962, 1884329, 1881925, 1879330, 1877309, 1875340, 1873225, 1872167, 1873493, 1877156, 1882224, 1888108, 1894628, 1901628, 1909345, 1918405, 1928650, 1938467, 1946014, 1950720, 1953123, 1953744, 1952565]
58381A952565l523o651r787j1075r519o581m587m020l642k642j105J007L726O176
58367A900342P420P785Q076Q175P920Q381J0370J2557J3164J2569J2003J0736
58355B019498P399L392J720K538K962J470m97j698k775m071m579m056l658l662
58341B013983k777n91J492K535L207M085M960O211Q470J0461R794O606L911L650
58327B075997M960O903R922J3377J4809J3319J1301J1154J2397J3437J3934J3989
58315B215499J3074J1325J0048R641Q897P436O708P554Q881R865J1102J2547J2837
58302B345414J1991J2141J4097J5788J5733J5437J6461J7729J7774J7323J7536
58291B517424J7753J7031J5948J4951J3063J0178Q516R680J2361J4668J6622J8480
$$ y = [1952565, 1949042, 1942391, 1932604, 1921529, 1912010, 1905429, 1900842, 1896822, 1893180, 1890538, 1889433, 1890440, 1894166, 1900342, 1907762, 1915547, 1923623, 1931798, 1939718, 1948099, 1958469, 1971026, 1984190, 1996759, 2008762, 2019498, 2026897, 2030289, 2032009, 2034547, 2037509, 2038979, 2038482, 2036784, 2034009, 2029938, 2025359, 2021303, 2017645, 2013983, 2011206, 2010615, 2012107, 2014642, 2017849, 2021934, 2026894, 2033105, 2041575, 2052036, 2061830, 2068436, 2072347, 2075997, 2080957, 2087860, 2097782, 2111159, 2125968, 2139287, 2150588, 2161742, 2174139, 2187576, 2201510, 2215499, 2228573, 2239898, 2249946, 2259587, 2268484, 2275920, 2282628, 2290182, 2299063, 2308928, 2320030, 2332577, 2345414, 2357405, 2369546, 2383643, 2399431, 2415164, 2430601, 2447062, 2464791, 2482565, 2499888, 2517424, 2535177, 2552208, 2568156, 2583107, 2596170, 2606348, 2614864, 2624544, 2636905, 2651573, 2668195, 2686675]
58279B686675J9174J8689J9486K2931K6539K7491K6748K6915K7989K8317K8009
58268B958963K8343K9014K8870K8302K8287K8181K6817K4843K3650K3087K2283
58257C250640K1458K1019K0314J9334J9784K2371K4828K5157K4950K6818L0182
58246C506855L2581L3648L4845L6369L7257L7701L8560L9352L9116L8513L8958
58235C913755M0457M2180M4009M5811M6630M6448M7189N0053N3535N5873N7516
58224D443456N9352O0794O1743O3923O7882P1172P2060P2542P5023P8758Q2442
58213E209147Q7330R4320J00780J04089J05882J09031J12959J15910J19273J25138
58203F283859J31692J35631J37543J40626J45550J50787J56312J62799J68561
$$ y = [2686675, 2705849, 2724538, 2744024, 2766955, 2793494, 2820985, 2847733, 2874648, 2902637, 2930954, 2958963, 2987306, 3016320, 3045190, 3073492, 3101779, 3129960, 3156777, 3181620, 3205270, 3228357, 3250640, 3272098, 3293117, 3313431, 3332765, 3352549, 3374920, 3399748, 3424905, 3449855, 3476673, 3506855, 3539436, 3573084, 3607929, 3644298, 3681555, 3719256, 3757816, 3797168, 3836284, 3874797, 3913755, 3954212, 3996392, 4040401, 4086212, 4132842, 4179290, 4226479, 4276532, 4330067, 4385940, 4443456, 4502808, 4563602, 4625345, 4689268, 4757150, 4828322, 4900382, 4972924, 5047947, 5126705, 5209147, 5296477, 5390797, 5491577, 5595666, 5701548, 5810579, 5923538, 6039448, 6158721, 6283859, 6415551, 6551182, 6688725, 6829351, 6974901, 7125688, 7282000, 7444799, 7613360]
58194G613360J71586J73500J77742J85038J93916K03838K14562K24713K34600
58185I392855K47806K66130K85828L02903L19054L37963L59174L80501M03118
58176A2295332M28871M55981M82993N13353N50158N89929O28217O67869P14900
58167A7327603P69571Q28717Q93612R67992J051520J142922J246360J366786J502101
58158B7097184J647664J804340J973645K149709K326092K506395K698021K900245
58150D5103295L109851L333827L583950L863459M172321M521299M927192N400291
58142G8015485N952875O613989P416478Q373378R486606J0773262J2259332J3949664
58134A52841069J5826379J7869499K0049737K2308303K4574767K6771426K8695130
$$ y = [7613360, 7784946, 7958446, 8136188, 8321226, 8515142, 8718980, 8933542, 9158255, 9392855, 9640661, 9906791, 10192619, 10495522, 10814576, 11152539, 11511713, 11892214, 12295332, 12724203, 13180184, 13663177, 14176530, 14726688, 15316617, 15944834, 16612703, 17327603, 18097174, 18925891, 19819503, 20787495, 21839015, 22981937, 24228297, 25595083, 27097184, 28744848, 30549188, 32522833, 34672542, 36998634, 39505029, 42203050, 45103295, 48213146, 51546973, 55130923, 58994382, 63166703, 67688002, 72615194, 78015485, 83968360, 90582349, 97998827, 106372205, 115858811, 126632073, 138891405, 152841069, 168667448, 186536947, 206586684, 228894987, 253469754, 280241180, 308936310]
58127C08936310K9836371K9378153K6494068K0758882J2403527K336263q027542
58120D22116032j7134471k3812597k7668021k9059359k8699820k7257438k5213860
58113B43270466k2905621k0565226j8330161j6274598j4448054j2873801j1532468
58106A26340537j0380277r381674q510471p734459p023418o367303n768937n223984
58098F5950014m722713m264341l853419l486387l155250k859944k604056k382199
58090C8621705k183740k005334j848684j709767j581287j462628j357225j263174
58082B5209866j175844j096150j026789r63923r02107q43950p95140p53184p11119
58073A6941660o69471o34152o04517n73961n41418n12185m87445m62580m36475
$$ y = [308936310, 338772681, 368150834, 394644902, 415403784, 427807311, 430143574, 422116032, 404981561, 381168964, 353500943, 324441584, 295741764, 268484326, 243270466, 220364845, 199799619, 181469458, 165194860, 150746806, 137873005, 126340537, 115960260, 106578586, 98068115, 90333656, 83310238, 76942935, 71173998, 65950014, 61227301, 56962960, 53109541, 49623154, 46467904, 43607960, 41003904, 38621705, 36437965, 34432631, 32583947, 30874180, 29292893, 27830265, 26473040, 25209866, 24034022, 22937872, 21911083, 20947160, 20045053, 19201103, 18405963, 17652779, 16941660, 16272189, 15638037, 15033520, 14459559, 13918141, 13405956, 12918511, 12455931, 12019456]
58064A2019456m13638l95833l79306l61784l45212l30311l14929k99080k85737
58055H893626k75331k64836k53116k42267k32979k23507k13657k05122j97488
58046F785323j88610j79115j71948j67260j62185j55693j49277j42982j35493
58037E332760j28037j23410j20871j16743j10460j05294j02593r9967r5985r2136
58027D237264q9090q5272q0387p6420p3925p0949o6920o4147o4053o4961o4926
58016C436214o4033o2909o1453n9916n8945n7997n5957n3423n1972n1178m9097
58005B809334m5714m3066m1862m0825l9542l9006l9049l8139l6214l5060l5408
57994B375449l6036l5992l5290l3454l0006k6477k5220k6012k6420k5492k4500
$$ y = [12019456, 11605818, 11209985, 10830679, 10468895, 10123683, 9793372, 9478443, 9179363, 8893626, 8618295, 8353459, 8100343, 7858076, 7625097, 7401590, 7187933, 6982811, 6785323, 6596713, 6417598, 6245650, 6078390, 5916205, 5760512, 5611235, 5468253, 5332760, 5204723, 5081313, 4960442, 4843699, 4733239, 4627945, 4525352, 4425385, 4329400, 4237264, 4148174, 4062902, 3982515, 3906095, 3832170, 3761221, 3694301, 3630154, 3566101, 3501140, 3436214, 3372181, 3309272, 3247819, 3187903, 3128958, 3070961, 3015004, 2961581, 2909609, 2858431, 2809334, 2763620, 2720554, 2678692, 2637867, 2598325, 2559319, 2520270, 2482131, 2445917, 2410857, 2375449, 2339413, 2303421, 2268131, 2234677, 2204671, 2178194, 2152974, 2126962, 2100542, 2075050, 2050550]
57983B050550k4009k3246k2427k2749k3639k2908k0215j7715j6789j6557j6015
57972A824281j5123j3598j1238r588j0470j2648j2884j0641q786r080j0032r975
57960A690218r380r044q687q278q407q518p250n140m405n303n500l946k556k919
57946A600885l907m031l714l803l909l595l323l079j984l55l7j562k844j939P08
57931A563511L795O903R491J0043P917M807K960K893L541L718K863J413P05J373
57917A625933K076J353J89M84J451M72k349l782k409p43j040j967j270P87K591
57902A621776L794M793N305N101M855M838M307L207K836L663M328L869L178L012
57888A678862K612J570J051J686K261K135K916N826R180J0588J0205R803R934
$$ y = [2050550, 2026541, 2003295, 1980868, 1958119, 1934480, 1911572, 1891357, 1873642, 1856853, 1840296, 1824281, 1809158, 1795560, 1784322, 1774734, 1764264, 1751616, 1738732, 1728091, 1719305, 1710225, 1700193, 1690218, 1680838, 1671794, 1663107, 1654829, 1646422, 1637904, 1630654, 1625514, 1621109, 1615806, 1610306, 1606360, 1603804, 1600885, 1596978, 1592947, 1589233, 1585430, 1581521, 1577926, 1574603, 1571524, 1569540, 1569185, 1569148, 1567586, 1564742, 1562803, 1563511, 1567306, 1574209, 1583700, 1593743, 1601660, 1606467, 1609427, 1612320, 1615861, 1619579, 1622442, 1623855, 1624560, 1625933, 1628009, 1629362, 1629551, 1630035, 1631486, 1631958, 1629609, 1625827, 1623418, 1622675, 1621635, 1619668, 1618398, 1619185, 1621776, 1625570, 1630363, 1635668, 1640769, 1645624, 1650462, 1654769, 1657976, 1660812, 1664475, 1668803, 1672672, 1675850, 1678862, 1681474, 1683044, 1684095, 1685781, 1688042, 1690177, 1693093, 1698919, 1708099, 1718687, 1728892, 1738695, 1748629]
57875A748629R892R490R054Q489P825P695Q048P606N857M205L802L761L022K338
57861A839713K638K928J838rj138j566j997j839k26J819K420J548Q09J072K036
57846A850046L557N548P068P221O554N983N060K997P89K48J290K172K244K526
57832A903303L431L874K997J374J4n69r8J553L818N667O531O408N337L565J998
57817A949203J478J739J875J650J516J590J543J326J217J335J779K957M943O844
57803A980995P555P051O278O110O870Q432J0214J1422J1744J1467J0756R568Q358
57790B096820P726P070N135K451J425K974M857M784L518L034L214K651J614J545
57776B148818K237K063Q79L48J210K286K550K376K383K718L689N501P125P128
$$ y = [1748629, 1758521, 1768011, 1777065, 1785554, 1793379, 1801074, 1809122, 1816728, 1822585, 1826790, 1830592, 1834353, 1837375, 1839713, 1842351, 1845279, 1847117, 1847108, 1845970, 1844404, 1842407, 1840568, 1840342, 1842161, 1844581, 1846129, 1846938, 1848010, 1850046, 1853603, 1859151, 1866219, 1873440, 1879994, 1885977, 1891037, 1894034, 1894823, 1895071, 1896361, 1898533, 1900777, 1903303, 1906734, 1910608, 1913605, 1914979, 1914993, 1914424, 1914326, 1915879, 1919697, 1925364, 1931895, 1938303, 1943640, 1947205, 1949203, 1950681, 1952420, 1954295, 1955945, 1957461, 1959051, 1960594, 1961920, 1963137, 1964472, 1966251, 1969208, 1974151, 1980995, 1988550, 1995601, 2001879, 2007989, 2014859, 2023291, 2033505, 2044927, 2056671, 2068138, 2078894, 2088462, 2096820, 2104546, 2111616, 2116751, 2119202, 2120627, 2123601, 2128458, 2133242, 2136760, 2139794, 2143008, 2145659, 2147273, 2148818, 2151055, 2153118, 2153997, 2154345, 2155555, 2157841, 2160391, 2162767, 2165150, 2167868, 2171557, 2177058, 2184183, 2191311]
57762B191311N976N788P232Q331P211M599K587K052K397K927L324L269K580J703
57748B251287J417K024L061L802L968L965M373N220O085O918P982Q776Q104N876
57734B322858L923L927N350O590P294Q124Q899Q734P863P627Q649J0310J1897
57721B422045J2928J2573J0589Q687R064J1266J2446J1259R544R318J0066J0134
57709B549919R181P713N641K983J058J143K440K980K342J999L037M883O507P686
57695B609512Q635R352R821J0283J0784J0903J0399R875J0221J1463J2512J2260
57683B736020J0785R286Q855R355R671Q906P354O215O400P661Q938R519R632R719
57669B858316R579Q698P268O126N719N861O527P938R451R530P651N456M956O170
$$ y = [2191311, 2197287, 2203075, 2210307, 2218638, 2225849, 2230448, 2233035, 2235087, 2237484, 2240411, 2243735, 2247004, 2249584, 2251287, 2252704, 2254728, 2257789, 2261591, 2265559, 2269524, 2273897, 2279117, 2285202, 2292120, 2300102, 2308878, 2316982, 2322858, 2326781, 2330708, 2336058, 2342648, 2349942, 2358066, 2366965, 2375699, 2383562, 2391189, 2399838, 2410148, 2422045, 2434973, 2447546, 2458135, 2466822, 2475886, 2487152, 2499598, 2510857, 2520401, 2529719, 2539785, 2549919, 2559100, 2566813, 2572454, 2575437, 2576495, 2577638, 2580078, 2583058, 2585400, 2587399, 2590436, 2595319, 2601826, 2609512, 2618147, 2627499, 2637320, 2647603, 2658387, 2669290, 2679689, 2689564, 2699785, 2711248, 2723760, 2736020, 2746805, 2756091, 2764946, 2774301, 2783972, 2792878, 2800232, 2806447, 2812847, 2820508, 2829446, 2838965, 2848597, 2858316, 2867895, 2876593, 2883861, 2889987, 2895706, 2901567, 2908094, 2916032, 2925483, 2935013, 2942664, 2948120, 2953076, 2959246]
57655B959246P503Q011Q033P880P268O239N457N250N198M980M814M786M583M333
57641C043581M849O451Q162Q823Q566Q528R276J0202J0440R809Q790Q002P866
57628C153345Q493R529J0301J0429J0283J0562J1411J2298J2920J3740J5283J7342
57616C295936J9489K1897K4840K7718K9671L1171L3802L8164M3076M7047M9143
57605C661954M7903M1120K8268J2226k719j4050k1290k4314k3311j9977j6762
57594C669048j4545j2365r629p234o100n789n207l865j907L71K572M197N044N302
57580C619893N149M684M236M238M747N539O686Q379J0178J1132J0858J0042R617
57567C715378R898J0503J0815J0398R390Q483Q190Q330Q582R163J0254J1138J0805
$$ y = [2959246, 2966749, 2974760, 2982793, 2990673, 2997941, 3004180, 3009637, 3014887, 3020085, 3025065, 3029879, 3034665, 3039248, 3043581, 3048430, 3054881, 3063043, 3071866, 3080432, 3088960, 3098236, 3108438, 3118878, 3128687, 3137477, 3145479, 3153345, 3161838, 3171367, 3181668, 3192097, 3202380, 3212942, 3224353, 3236651, 3249571, 3263311, 3278594, 3295936, 3315425, 3337322, 3362162, 3389880, 3419551, 3450722, 3484524, 3522688, 3565764, 3612811, 3661954, 3709857, 3750977, 3779245, 3791471, 3788752, 3774702, 3753412, 3729098, 3705787, 3685810, 3669048, 3654503, 3642138, 3632509, 3625275, 3619175, 3613386, 3608179, 3604314, 3602407, 3602778, 3605350, 3609547, 3614591, 3619893, 3625042, 3629726, 3633962, 3638200, 3642947, 3648486, 3655172, 3663551, 3673729, 3684861, 3695719, 3705761, 3715378, 3725276, 3735779, 3746594, 3756992, 3766382, 3774865, 3783055, 3791385, 3799967, 3809130, 3819384, 3830522, 3841327]
57554C841327R491Q579Q747R071Q563P816Q385J0606J2827J3125J1522R930R782
57541C969771J0320R909Q590Q139R472J1313J2027J1626J1016J0348R309Q361
57529D090201Q224Q523Q320P821Q239R921J1679J2206J1338R816Q560Q134Q346
57516D211328Q430Q115Q179R274J0783J1646J1801J1814J1652J1027J0459J0722
57504D335230J1546J2191J2799J3753J4188J3014J1165J0778J2003J2612J1341
57493D470620R658R503J0890J2667J4225J5363J5698J5178J4389J3695J2937J2459
57481D627282J3147J4859J5981J5404J3909J2857J2456J2168J1810J1400J0772
57470D772045J0115J0157J1174J2555J3823J5022J5638J4485J1514Q540P166P063
$$ y = [3841327, 3850818, 3859397, 3868144, 3877215, 3885778, 3893594, 3901979, 3912585, 3925412, 3938537, 3950059, 3959989, 3969771, 3980091, 3990000, 3998590, 4006729, 4016201, 4027514, 4039541, 4051167, 4062183, 4072531, 4081840, 4090201, 4098425, 4106948, 4115268, 4123089, 4131328, 4141249, 4152928, 4165134, 4176472, 4186288, 4194848, 4202982, 4211328, 4219758, 4227873, 4236052, 4245326, 4256109, 4267755, 4279556, 4291370, 4303022, 4314049, 4324508, 4335230, 4346776, 4358967, 4371766, 4385519, 4399707, 4412721, 4423886, 4434664, 4446667, 4459279, 4470620, 4480278, 4489781, 4500671, 4513338, 4527563, 4542926, 4558624, 4573802, 4588191, 4601886, 4614823, 4627282, 4640429, 4655288, 4671269, 4686673, 4700582, 4713439, 4725895, 4738063, 4749873, 4761273, 4772045, 4782160, 4792317, 4803491, 4816046, 4829869, 4844891, 4860529, 4875014, 4886528, 4895068, 4902234, 4909297]
57458D909297P170P393P951Q268P979P981R006J0040R828R220J0060J2176J3404
57445E029773J2692J1477J1479J2558J3410J3385J2957J3004J3946J5232J5648
57434E175561J4603J3048J2434J2938J3450J3261J2859J2915J3301J3464J3098
57423E320932J2195J1018J0355J1189J3481J5574J5603J3622J1840J2256J4314
57412E462379J5514J4392J2222J1157J1498J1757J1122J0495J0841J1748J2212
57401E595337J1944J1273J0483R931J0142J1060J1751J1563J1069J1138J1559
57390E717250J1389J0367R239Q813R231J0014J0481J0397J0471J1676J3705J4822
57378E847855J3918J2029J0973J1028J0956J0038Q892Q315Q315Q523Q849R303
$$ y = [4909297, 4916467, 4923860, 4931811, 4940079, 4948058, 4956039, 4965045, 4975085, 4984913, 4994133, 5004193, 5016369, 5029773, 5042465, 5053942, 5065421, 5077979, 5091389, 5104774, 5117731, 5130735, 5144681, 5159913, 5175561, 5190164, 5203212, 5215646, 5228584, 5242034, 5255295, 5268154, 5281069, 5294370, 5307834, 5320932, 5333127, 5344145, 5354500, 5365689, 5379170, 5394744, 5410347, 5423969, 5435809, 5448065, 5462379, 5477893, 5492285, 5504507, 5515664, 5527162, 5538919, 5550041, 5560536, 5571377, 5583125, 5595337, 5607281, 5618554, 5629037, 5638968, 5649110, 5660170, 5671921, 5683484, 5694553, 5705691, 5717250, 5728639, 5739006, 5748245, 5757058, 5766289, 5776303, 5786784, 5797181, 5807652, 5819328, 5833033, 5847855, 5861773, 5873802, 5884775, 5895803, 5906759, 5916797, 5925689, 5934004, 5942319, 5950842, 5959691, 5968994]
57366E968994R713R951J0273J1120J2516J3709J3678J2236J0477R574R285Q429
57354F099955O894O102P039Q870J0242J1004J1664J1965J1325J0265J0120J1207
57342F216652J2351J2388J1338R877Q431P153O308O176O652P259P574P660P906
57329F327725Q355Q436P689O540N887O091O899Q085R421J0279J0321J0298J0982
57316F437008J1499J0289P792O263O537P089P000P560R541J1213J1049J0440J1343
57303F554623J2859J2931J2122J2651J4418J5265J4899J5183J6169J5377J2032
57292F708529Q923Q316Q693P663O002O270Q737J1083J1610J0759R692R035Q919
57279F824231R016Q567P443O834P899J0030J1619J2155J2267J1900J0115P154
$$ y = [5968994, 5978707, 5988658, 5998931, 6010051, 6022567, 6036276, 6049954, 6062190, 6072667, 6082241, 6091526, 6099955, 6106849, 6112951, 6119990, 6128860, 6139102, 6150106, 6161770, 6173735, 6185060, 6195325, 6205445, 6216652, 6229003, 6241391, 6252729, 6262606, 6271037, 6278190, 6284498, 6290674, 6297326, 6304585, 6312159, 6319819, 6327725, 6336080, 6344516, 6352205, 6358745, 6364632, 6370723, 6377622, 6385707, 6395128, 6405407, 6415728, 6426026, 6437008, 6448507, 6458796, 6466588, 6472851, 6479388, 6486477, 6493477, 6501037, 6510578, 6521791, 6532840, 6543280, 6554623, 6567482, 6580413, 6592535, 6605186, 6619604, 6634869, 6649768, 6664951, 6681120, 6696497, 6708529, 6717452, 6725768, 6734461, 6742124, 6748126, 6754396, 6763133, 6774216, 6785826, 6796585, 6806277, 6815312, 6824231, 6833247, 6841814, 6849257, 6856091, 6863990, 6874020, 6885639, 6897794, 6910061, 6921961, 6932076, 6939230]
57267F939230N156N788Q033R449R133Q292Q079Q077P362O117N334N368N700N953
57253G037071O282O630O424N410M142L310L154L761N095O206N453K486n63j045
57239G093816J340M466O230O087M607K811J973K808M479N308M715L712L467M183
57225G150002N425O594O919N981M517L809M002L991L130K029J332R54J085K518
57211G202288N046O699N963M054L519M983O597O674N541M468L958L736L588L462
57197G270576L090K331J669J706K003J189j235l665l834j469J254K182J347K78
57183G277422q2J34P41J849L244M344N095O107P576Q640Q233O275L780J974J380
57168G336712J566J615R66j75j163j498j109n11o33j866l149l101k251k818n506
$$ y = [6939230, 6944386, 6950174, 6958207, 6967656, 6976789, 6985081, 6993160, 7001237, 7008599, 7014716, 7020050, 7025418, 7031118, 7037071, 7043353, 7049983, 7056407, 7061817, 7065959, 7069269, 7072423, 7076184, 7081279, 7087485, 7092938, 7095424, 7094861, 7093816, 7095156, 7099622, 7105852, 7111939, 7116546, 7119357, 7121330, 7124138, 7128617, 7133925, 7138640, 7142352, 7145819, 7150002, 7155427, 7162021, 7168940, 7174921, 7179438, 7183247, 7187249, 7191240, 7194370, 7196399, 7197731, 7198685, 7199770, 7202288, 7207334, 7214033, 7219996, 7224050, 7227569, 7232552, 7239149, 7245823, 7251364, 7255832, 7259790, 7263526, 7267114, 7270576, 7273666, 7275997, 7277666, 7279372, 7281375, 7282564, 7281329, 7277664, 7273830, 7272361, 7273615, 7275797, 7277144, 7277422, 7277340, 7277474, 7278215, 7280064, 7283308, 7287652, 7292747, 7298854, 7306430, 7315070, 7323303, 7329578, 7333358, 7335332, 7336712, 7338278, 7339893, 7340859, 7340684, 7339521, 7338023, 7336914, 7336403, 7335770, 7333904, 7330755, 7327654, 7325403, 7322585, 7317079]
57153G317079q033q193p004o910q076q859r212j0651j2864j3374j1517r968j0920
57140G191498j2998j3750j3226j3037j3350j2994j1712j0341r301q577q674r990
57128G053548j1606j2232j1986j1875j1911j1451j1109j2483j5699j8803k0123
57117F904270j9938j9331j8573j7486j6400j5913j6004j6143j6033j5793j5475
57106F717181j4737j3193j1022r025p801o973n770m380l945m858n889n644m232
57093F619712k819k223k834n141r109j3365j6165j7210j7519j7809j8164j9177
57081F478177k1999k6842l2430l7483m2015m6686n1539n5950n9555o2854o6793
57070E974031p1656p6458p9937q2401q5708r0840r6398j00601j03902j08133j13617
$$ y = [7317079, 7309046, 7300853, 7293849, 7286939, 7278863, 7270004, 7260792, 7250141, 7237277, 7223903, 7212386, 7202418, 7191498, 7178500, 7164750, 7151524, 7138487, 7125137, 7112143, 7100431, 7090090, 7080789, 7072212, 7063538, 7053548, 7041942, 7029710, 7017724, 7005849, 6993938, 6982487, 6971378, 6958895, 6943196, 6924393, 6904270, 6884332, 6865001, 6846428, 6828942, 6812542, 6796629, 6780625, 6764482, 6748449, 6732656, 6717181, 6702444, 6689251, 6678229, 6669204, 6661403, 6654430, 6648660, 6644280, 6640335, 6635477, 6629588, 6623944, 6619712, 6616893, 6614670, 6611836, 6606695, 6597586, 6584221, 6568056, 6550846, 6533327, 6515518, 6497354, 6478177, 6456178, 6429336, 6396906, 6359423, 6317408, 6270722, 6219183, 6163233, 6103678, 6040824, 5974031, 5902375, 5825917, 5745980, 5663579, 5577871, 5487031, 5390633, 5290032, 5186130, 5077997, 4964380]
57059D964380j19017j23925j29699j37370j46505j56945j70050j87145k07728
57050C585996k29992k52163k72624k89776l02632l10952l14302l11581l01323
57041A000651k80920k45243j87665j03072J1376J57936L37244N44349P69217J003567
57031C007440J244223J487364J724149J947352K157116K347486K482588K495156
57023A8892874K321308J943533J402621P71020J15028n22646j110221j600117
57015B2213400j918390j989792j783332j336661p35548p1833N77938J143996J554008
57006A7653786J745869J691541J408188R51345M00642j55593o37525r89628j187842
56997B0880783j236911j163119j005931q08356o07731m30447k91000j92878j30836
$$ y = [4964380, 4845363, 4721438, 4591739, 4454369, 4307864, 4150919, 3980869, 3793724, 3585996, 3356004, 3103841, 2831217, 2541441, 2238809, 1927857, 1613555, 1301974, 1000651, 719731, 474488, 286823, 183751, 195127, 353063, 690307, 1234656, 2003873, 3007440, 4251663, 5739027, 7463176, 9410528, 11567644, 13915130, 16397718, 18892874, 21214182, 23157715, 24560336, 25331356, 25446384, 24923738, 23813517, 22213400, 20295010, 18305218, 16521886, 15185225, 14449677, 14377844, 14955782, 16099778, 17653786, 19399655, 21091196, 22499384, 23450729, 23851371, 23695778, 23058253, 22068625, 20880783, 19643872, 18480753, 17474822, 16666466, 16058735, 15628288, 15337288, 15144410, 15013574]
56988A5013574r5531p8426p3254p4544p7176p7939p6268p2760o7719o1077n2700
56977A4206180m2219k9455j5493k993M757M859m685k4391n2706q6214j20316j49934
56965A3687390j70856j82059j86540j88565j89930j89608j86641j81802j76382
56956A2035007j70854j65456j60888j57644j55343j53404j51801j50725j50025
56947A0618867j49269j47963j45654j42443j39348j37286j35751j33478j30431
56938I357244j27877j26325j24948j23515j23220j24441j25150j23236j19609
56929H238923j17284j17575j18630j17879j14782j10773j07236j04244j01192
56920G229328r8234r6519r6634r7363r6950r5392r4137r3435r1787q8794q6758
$$ y = [15013574, 14918043, 14839617, 14766363, 14691819, 14614643, 14536704, 14460436, 14387676, 14319957, 14258880, 14206180, 14163961, 14134506, 14119013, 14116020, 14120777, 14125636, 14120951, 14096560, 14043854, 13957640, 13837324, 13687390, 13516534, 13334475, 13147935, 12959370, 12769440, 12579832, 12393191, 12211389, 12035007, 11864153, 11698697, 11537809, 11380165, 11224822, 11071418, 10919617, 10768892, 10618867, 10469598, 10321635, 10175981, 10033538, 9894190, 9756904, 9621153, 9487675, 9357244, 9229367, 9103042, 8978094, 8854579, 8731359, 8606918, 8481768, 8358532, 8238923, 8121639, 8004064, 7885434, 7767555, 7652773, 7542000, 7434764, 7330520, 7229328, 7131094, 7034575, 6937941, 6840578, 6743628, 6648236, 6554099, 6460664, 6368877, 6280083, 6193325]
56909F193325q7845r0857r2764r2702r2380r2863r3179r2485r1596r1406r1307
56898E183941r0372q9088q8779r0014r2665r6943j03082j10059j15821j19252
56888D187866j21189j23197j25806j28278j29643j29468j27938j25749j23831
56879C052767j22609j21343j18748j14454j09534j05332j02165r9414r6389r2796
56869A969983q8875q5719q4842q6543q8874q9116q6229q1199p5296o9054o2858
56858A071378n7289n2468m7938m3560l9617l5922l1774k7237k3380k0724j8498
56847F72971j6043j3961j2992j2688j2126j1269j0636j0158r342q117o694n004
56835E43941l128j830j704k039j502J76K073L527M930O930R262J0660R813O660
$$ y = [6193325, 6105480, 6014623, 5921859, 5829157, 5736777, 5643914, 5550735, 5458250, 5366654, 5275248, 5183941, 5093569, 5004481, 4915702, 4825688, 4733023, 4636080, 4532998, 4422939, 4307118, 4187866, 4066677, 3943480, 3817674, 3689396, 3559753, 3430285, 3302347, 3176598, 3052767, 2930158, 2808815, 2690067, 2575613, 2466079, 2360747, 2258582, 2159168, 2062779, 1969983, 1881108, 1795389, 1710547, 1624004, 1535130, 1446014, 1359785, 1278586, 1203290, 1134236, 1071378, 1014089, 961621, 913683, 870123, 830506, 794584, 762810, 735573, 712193, 691469, 672971, 656928, 642967, 629975, 617287, 605161, 593892, 583256, 573098, 563756, 555639, 548945, 543941, 540813, 538983, 537279, 535240, 533738, 533914, 535987, 539514, 544444, 551374, 560636, 571296, 581109, 587769]
56821E87769K705l71k322l892n028m893l890l824n105n409k683J845N384P242
56807E67528Q922J1393J4508J8573K4022K9357L1785L0615K8183K6599K5169K1883
56795H38537J5939P913j102r425j4999j7078j7055j6547j5333j2242p497k837
56783G48274P50M251R147J5398K1498K6500L1236L6991M3198M7545M8656M7411
56771A080855M4501L7963K5203P238j1148k5804l5884m1805m3073l9762l4443
56760I63841l0279k7770k5070k1069j6477j1972p132j680L625Q060J2136J6909
56748H63122K2483K7525L0087K8640K2684J2833M20j2841k4900l3681l8022l8464
56736H59886l6695l4120l1278k8325k5404k2326j8513j3803r063n507l500k336
$$ y = [587769, 590474, 590103, 587781, 583889, 578861, 573968, 570078, 566254, 561149, 555740, 553057, 554902, 560286, 567528, 576450, 587843, 602351, 620924, 644946, 674303, 706088, 736703, 764886, 791485, 816654, 838537, 854476, 862389, 861287, 851862, 836863, 819785, 802730, 786183, 770850, 758608, 751111, 748274, 749024, 753275, 762422, 777820, 799318, 825818, 857054, 894045, 937243, 984788, 1033444, 1080855, 1125356, 1163319, 1188522, 1195760, 1184612, 1158808, 1122924, 1081119, 1038046, 998284, 963841, 933562, 905792, 880722, 859653, 843176, 831204, 824072, 822392, 826017, 834077, 846213, 863122, 885605, 913130, 943217, 971857, 994541, 1007374, 1007794, 994953, 970053, 936372, 898350, 859886, 823191, 789071, 757793, 729468, 704064, 681738, 663225, 649422, 640359, 634852, 631352, 629016]
56724F29016j082P53L233O144Q780R908Q394L921k873j0679j7830k2770k4806
56711E90109k4479k2960k1305k0288k0288k0663j9823j7031j3830j2392j2589
56700C84461j2225j0422q924r097r477p955n039l042k850l489m393n786o866o023
56686B88873l528j947k770m300m225k888k354l110l479k271n06p3j448l237l688
56671B49049k352l51Q82R09J53j004k372l319k966j371K65R77R42P22L89K2K36
56654B40811J343K471K450J334K03l94q40j264r61N52K425L174K316Q66J11K88
56638B54885P05Q82R85J094P77j14o83k2J193J118r15l292l960k780j354r89j542
56621B45988k116k060j228PP27P7j617k779k259p84j33q92j950k336k496l131
$$ y = [629016, 627934, 628687, 631920, 638064, 646844, 656752, 665146, 669067, 666194, 655515, 637685, 614915, 590109, 565630, 542670, 521365, 501077, 480789, 460126, 440303, 423272, 409442, 397050, 384461, 372236, 361814, 352890, 343793, 334316, 326361, 321322, 318280, 315430, 311941, 307548, 301762, 294896, 288873, 285345, 283398, 280628, 276328, 272103, 269215, 266861, 263751, 260272, 258001, 257495, 257422, 255974, 252737, 249049, 246697, 246346, 247228, 248137, 248290, 247286, 244914, 241595, 238629, 237258, 237523, 238500, 239442, 240164, 240553, 240575, 240811, 242154, 244625, 247075, 248409, 248612, 248218, 247378, 246114, 245153, 245705, 248130, 251304, 253620, 254486, 254597, 254885, 255590, 256472, 257457, 258551, 259328, 259214, 258531, 258509, 259702, 260820, 259905, 256613, 252653, 249873, 248519, 247530, 245988, 243872, 241812, 240584, 240591, 241318, 241395, 239778, 236999, 234740, 233956, 233823, 232931, 230981, 228645, 226149, 223018]
56605B23018l649l102k030j878k627k725j704j139k133l399l203k042j616k003
56591A89768j737l71R01J407K126M038O577Q314Q476P265N409L776L030L260M113
56576B46352N192O036O138N546N007M902M541L368K146J899K268K250J980K205
56562B99830K437J536Nl42P76J578R57j84r88j992l457m221l493k261j620j037
56546B87524L06J718K021J385O88j41j596l116l574k893j900r76k9O33O22L99
56530B81071O97J238J108L59J21J027K315K734J806J22j264j704j401q93j85J057
56514B88208K460L023K545K057K381L111L515L608L643L479L098K990L411M065
56500C31594M944O424P996Q279P134O237O421O054L631N33q24m89l81r83j043
$$ y = [223018, 219369, 216267, 214237, 212359, 209732, 207007, 205303, 204164, 202031, 198632, 195429, 193387, 191771, 189768, 188031, 187660, 188561, 189968, 192094, 196132, 202709, 211023, 219499, 226764, 232173, 235949, 238979, 242239, 246352, 251544, 257580, 263718, 269264, 274271, 279173, 283714, 287082, 289228, 291127, 293395, 295645, 297625, 299830, 302267, 303803, 303808, 303466, 304242, 305820, 306777, 306593, 305605, 303613, 300156, 295935, 292442, 290181, 288561, 287524, 287830, 289548, 291569, 292954, 293642, 293501, 291905, 288789, 285215, 282322, 280422, 279446, 279417, 280050, 280672, 281071, 281768, 283006, 284114, 284473, 284594, 285621, 287936, 290670, 292476, 292598, 291334, 289630, 288229, 287336, 287151, 288208, 290668, 293691, 296236, 298293, 300674, 303785, 307300, 310908, 314551, 318030, 321128, 324118, 327529, 331594, 336538, 342962, 350958, 359237, 366371, 372608, 379029, 385083, 388714, 389247, 388423, 387934, 387553, 386570, 385527]
56485C85527l20k12j339k512k671k082j224j08O55j26k290l811l260j721j115
56470C63391j567j701j016n17r28j483j145k85j87r76j124L64K159K104J80j482
56454C55787j585j118j393k169k593k598k248j019R53K049J169m37r25n89r91
56439C42293k160k654k029j170l85P41J602R14q46j531n19J60j005k478j824P93
56423C29902K806K504Q14p8Q33K444K808J271q35j874j655r34J59J915L613L876
56407C47569K577J135N62N25N31O73P80K52n60j82J804L548L036O55j344j460
56391C60101r0J346J594L11j445j879m36J148P06j577l224k477k18J557K303K946
56375C60666L744L581J912J68M2R77R77l90j501j444j330j913j810K96L002L768
$$ y = [385527, 385207, 384995, 383656, 381144, 378473, 376391, 375167, 375059, 375714, 375588, 373298, 369487, 366227, 364506, 363391, 361824, 360123, 359107, 358590, 357662, 356179, 355034, 354749, 354562, 353586, 352462, 352826, 354985, 357089, 357269, 355787, 354202, 353084, 351691, 349522, 346929, 344331, 342083, 341064, 342017, 344066, 345235, 344798, 343873, 343284, 342293, 340133, 337479, 335450, 334280, 333895, 334636, 336238, 337152, 336306, 334775, 334256, 334416, 333411, 330933, 329109, 329902, 332708, 335212, 336026, 335948, 336781, 339225, 342033, 343304, 342469, 340595, 338940, 338006, 338165, 340080, 343693, 347569, 350146, 351281, 351843, 352368, 352899, 353572, 354352, 354604, 354044, 353862, 355666, 359214, 362250, 362905, 361561, 360101, 360011, 361357, 362951, 363262, 361817, 359938, 359502, 360650, 361356, 359779, 356555, 354078, 353860, 355417, 357720, 360666, 364410, 367991, 369903, 370071, 370113, 371090, 372067, 371677, 370176, 368732, 367402, 365489, 363679, 363975, 366977, 370745]
56359C70745K456J282J584K471K704K242J677J376J530J977J936R21k76n67k41
56344C91817m01r30n93Q47K118K257J636J003P84J376K744L648K704N03p60r4
56328D08659J260J858J682J385J216J196J207P04m15o50J712N786Q406P865N704
56313D47575M175L634L255K745K164J303K39m10n41q24j361j332n03K38N32J285
56297D62174K873M093L850K707J731J039M28K67P22J194J402J941K933L358K732
56282D93444K191K807L899M175L465K414J396P43R68J886K604L056M170N723N861
56267E38802L902J947K108L694M685M586M069L285K419K584M018M618K568n15
56253E82770j468Q5J747K173K323K972L501L569L893M771N471N655N883O328O359
$$ y = [370745, 373201, 374483, 376067, 378538, 381242, 383484, 385161, 386537, 388067, 390044, 391980, 392901, 392625, 392058, 391817, 391416, 390486, 389893, 390740, 392858, 395115, 396751, 397754, 398538, 399914, 402658, 406306, 409010, 409513, 408753, 408659, 409919, 411777, 413459, 414844, 416060, 417256, 418463, 419167, 418752, 418102, 419814, 425600, 434006, 441871, 447575, 451750, 455384, 458639, 461384, 463548, 464851, 465090, 464680, 464139, 463315, 461954, 460622, 460119, 460357, 460889, 462174, 465047, 469140, 472990, 475697, 477428, 478467, 478895, 479162, 479884, 481078, 482480, 484421, 487354, 490712, 493444, 495635, 498442, 502341, 506516, 509981, 512395, 513791, 514534, 515502, 517388, 519992, 523048, 527218, 532941, 538802, 542704, 544651, 546759, 550453, 555138, 559724, 563793, 567078, 569497, 572081, 576099, 580717, 583285, 582770, 581302, 581387, 583134, 585307, 587630, 590602, 594103, 597672, 601565, 606336, 611807, 617462, 623345, 629673, 636032]
56238F36032N819N484N790O266O541O915P589Q248Q699R158R720J0238J0739J1336
56224G48574J1788J1798J1541J1333J1197J1338J2514J4932J7438J8796J9276
56213I00525J9791K0215J9972J9842K1450K4989K8894L1932L4291L6575L8973
56202A197449M1713M5202M9310N3394N7150O0909O5020O9673P5053Q1026Q7008
56191A882907R2955R9910J08528J17558J25071J30831J36114J41456J45964J48713
56181C130007J49392J47541J42509J34329J23397J09269R1146O9789M7584K6272
56171D171235N682j4995l5730n5841p4502r0535j02686j10894j16724j21911j26684
56160C326415j29880j30357j28003j23576j17873j11355j04588r8657r4289r0699
$$ y = [636032, 641851, 647335, 653125, 659391, 665932, 672847, 680436, 688684, 697383, 706541, 716261, 726499, 737238, 748574, 760362, 772160, 783701, 795034, 806231, 817569, 830083, 845015, 862453, 881249, 900525, 920316, 940531, 960503, 980345, 1001795, 1026784, 1055678, 1087610, 1121901, 1158476, 1197449, 1239162, 1284364, 1333674, 1387068, 1444218, 1505127, 1570147, 1639820, 1714873, 1795899, 1882907, 1975862, 2075772, 2184300, 2301858, 2426929, 2557760, 2693874, 2835330, 2981294, 3130007, 3279399, 3426940, 3569449, 3703778, 3827175, 3936444, 4027590, 4097379, 4144963, 4171235, 4176917, 4161922, 4126192, 4070351, 3995849, 3905314, 3802628, 3691734, 3575010, 3453099, 3326415, 3196535, 3066178, 2938175, 2814599, 2696726, 2585371, 2480783, 2382126, 2287837, 2197138]
56150B197138q6236q0468p4565o9408o4571n9753n5633n2337m8602m3825l9542
56139A522198l7190l5646l2876k9133k6468k5529k4857k3022j9876j5973j2308
56128A239320j0189r898r981r285q765r551j0278q722n248k189l43J157J965O65
56114A158658j909k596p7L466N723O873P800Q140P532O907P130P856Q835J0821
56100A235159J4050J7147J8683J8654J7776J6690J6556J8798K3190K7548L0333
56089A454584L2362L5173L9015M3462M8575N4404O0455O6650P3715Q1508Q8017
56078B077920R1043R0225Q6534Q0771P3431O5315N7350N0234M4704M1359L9708
56067B798594L8150L5338L0993K5266J8403J1218M650j597q838j7372k5893l3445
$$ y = [2197138, 2110902, 2030434, 1955869, 1886461, 1821890, 1762137, 1706504, 1654167, 1605565, 1561740, 1522198, 1485008, 1449362, 1416486, 1387353, 1360885, 1335356, 1310499, 1287477, 1267601, 1251628, 1239320, 1229131, 1219233, 1209252, 1199967, 1191202, 1181651, 1171373, 1162651, 1157403, 1155214, 1154871, 1156028, 1157993, 1158658, 1156749, 1154153, 1154076, 1157542, 1163265, 1170138, 1177938, 1186078, 1193610, 1200517, 1207647, 1215503, 1224338, 1235159, 1249209, 1266356, 1285039, 1303693, 1321469, 1338159, 1354715, 1373513, 1396703, 1424251, 1454584, 1486946, 1522119, 1561134, 1604596, 1653171, 1707575, 1768030, 1834680, 1908395, 1989903, 2077920, 2168963, 2259188, 2345722, 2426493, 2499924, 2565239, 2622589, 2672823, 2717527, 2758886, 2798594, 2836744, 2872082, 2903075, 2928341, 2946744, 2957962, 2962612, 2961015, 2952177, 2934805, 2908912, 2875467]
56055B875467m0834m9246n8352o6384p1443p2407o9433o4048n8089n2374m6786
56044B226071m1350l6206l0925k5154j9749j5856j3082j0031o443l266p83J509
56032B024735L288L708L507M683P689J0702J2186J2486J2611J3095J4347J6432
56020B139469J8275J8700J8327J8723J9999K1198K2561K4821K6713K6281K4626
56009B379693K4965K7608K9495K9451L0052L2834L5438L5635L4874L5397L6635
55998B732077L7051L7111L7917L8812L8794L8692L9774M1626M3218M4638M6225
55987C175935M7540M8543N0105N2172N3390N3724N5206N8721O2411O4710O6608
55976C789065O9334P2214P4493P6885P9712Q1909Q3491Q6288R0595R4008R5490
$$ y = [2875467, 2834633, 2785387, 2727035, 2660651, 2589208, 2516801, 2447368, 2383320, 2325231, 2272857, 2226071, 2184721, 2148515, 2117590, 2092436, 2072687, 2056831, 2043749, 2033718, 2027275, 2024009, 2023226, 2024735, 2028023, 2031731, 2035238, 2039921, 2047610, 2058312, 2070498, 2082984, 2095595, 2108690, 2123037, 2139469, 2157744, 2176444, 2194771, 2213494, 2233493, 2254691, 2277252, 2302073, 2328786, 2355067, 2379693, 2404658, 2432266, 2461761, 2491212, 2521264, 2554098, 2589536, 2625171, 2660045, 2695442, 2732077, 2769128, 2806239, 2844156, 2882968, 2921762, 2960454, 3000228, 3041854, 3085072, 3129710, 3175935, 3223475, 3272018, 3322123, 3374295, 3427685, 3481409, 3536615, 3595336, 3657747, 3722457, 3789065, 3858399, 3930613, 4005106, 4081991, 4161703, 4243612, 4327103, 4413391, 4503986, 4597994, 4693484]
55965D693484R7600J02379J08071J12412J16235J21071J25979J29750J33766J39681
55955E880428J46403J52114J57317J63326J70043J77482J87034J98839K10550
55946G443536K21129K33082K48333K64892K80196K94772L09942L25292L41332
55937I962506L61160L86170M13453M40511M68942N00350N32802N65134O00748
55928A4231776O43014O90718P42049P98941Q63442R34281J011560J100120J203468
55919B2219369J319185J444946J583312J734990J893504K053255K217206K390095
55911C6855862K570897K759816K965906L198558L457755L742314M061459M428515
55903F4041082M850945N339079N918202O618642P458485Q446915R596424J0919117
$$ y = [4693484, 4791084, 4893463, 5001534, 5113946, 5230181, 5351252, 5477231, 5606981, 5740747, 5880428, 6026831, 6178945, 6336262, 6499588, 6669631, 6847113, 7034147, 7232986, 7443536, 7664665, 7897747, 8146080, 8410972, 8691168, 8985940, 9295882, 9621174, 9962506, 10323666, 10709836, 11123289, 11563800, 12032742, 12533092, 13065894, 13631028, 14231776, 14874790, 15565508, 16307557, 17106498, 17969940, 18904221, 19915781, 21015901, 22219369, 23538554, 24983500, 26566812, 28301802, 30195306, 32248561, 34465767, 36855862, 39426759, 42186575, 45152481, 48351039, 51808794, 55551108, 59612567, 64041082, 68892027, 74231106, 80149308, 86767950, 94226435, 102673350, 112269774, 123188891]
55895A23188891J2421775J4119427J6037022J8170629K0455050K2788538K5053153
55888B52234485K7032830K8281451K8120908K5842531K0993144J3610026M361192
55881D00476567n479621j4356233k1008514k4950175k6486791k6320520k5127777
55874B56746936k3387272k1406093j9374332j7397905j5538314j3844891j2349808
55867A33448321j1052264r930050q961700q126549p395612o740000o144337n601500
55859F9496309n101053m633507m199465l803455l443379l114776k819816k562362
55851C9818496k338266k139222j962377j808058j671718j546277j429879j324318
55843B5598381j228622j140653j062190r95595r37643q82720q30094p82536p39934
$$ y = [123188891, 135610666, 149730093, 165767115, 183937744, 204392794, 227181332, 252234485, 279267315, 307548766, 335669674, 361512205, 382505349, 396115375, 400476567, 394996946, 380640713, 359632199, 334682024, 308195233, 281874713, 256746936, 233359664, 211953571, 192579239, 175181334, 159643020, 145798129, 133448321, 122396057, 112466007, 103504307, 95377758, 87982146, 81242146, 75097809, 69496309, 64395256, 59761749, 55562284, 51758829, 48315450, 45200674, 42380858, 39818496, 37480230, 35341008, 33378631, 31570573, 29898855, 28352578, 26922699, 25598381, 24369759, 23229106, 22166916, 21171321, 20233678, 19350958, 18520864, 17738328, 16998394]
55834A6998394o99676o61348o25884n92049n58549n27601n01756m79201m56648
55825A1895682m34671m15610l98459l80547l62277l45556l29588l12862k97392
55816H618720k86072k77443k67860k57392k48791k41903k34060k25116k17332
55807F362751k10685k02792j93304j84299j76490j68700j60782j53655j46774
55798D765270j38980j31223j25288j20563j15436j10834j08696j07850j05303
55789C701097j00974r7204r4182r0117q5695q3894q4975q5663q3970q1081p7962
55778B735380p3978o9685o7211o6622o5264o2076n9200n7998n6617n3434m9982
55767B053313m8321m7736m6243m3743m1738m1076m1470m2353m3067m3087m2798
$$ y = [16998394, 16298718, 15637370, 15011486, 14419437, 13860888, 13333287, 12831531, 12352330, 11895682, 11461011, 11045401, 10646942, 10266395, 9904118, 9558562, 9228974, 8916112, 8618720, 8332648, 8055205, 7787345, 7529953, 7281162, 7039259, 6805199, 6580083, 6362751, 6152066, 5949274, 5755970, 5571671, 5395181, 5226481, 5065699, 4912044, 4765270, 4626290, 4495067, 4369779, 4249216, 4133780, 4022946, 3914250, 3806400, 3701097, 3600123, 3502919, 3408737, 3318620, 3232925, 3149031, 3064056, 2978393, 2894423, 2813342, 2735380, 2661402, 2591717, 2524506, 2457884, 2392620, 2330544, 2271344, 2213346, 2156729, 2103295, 2053313, 2004992, 1957256, 1911013, 1867270, 1825532, 1784456, 1742986, 1700633, 1657566, 1614479, 1571681]
55756A571681m3114m3807m3432m1326l8441l5815l3465l1355k9909k9040k7923
55745A174054k6352k5078k4321k3180k1152j9065j7834j7294j6765j5879j4450
55734I52684j2438j0434r272q795q013o666n642n495n505m867m076m605p368j1692
55720H47816j5671j7804j8526j9474k0895k0873j7945j3500j0233r072r012r337
55708F65474j0230j1603j2857j3697j3954j2990j0665q271p129o796o187n740
55696E45355o595q239r007q637q192p826o743n262m665m990n135n138n965p016
55682D51945o395m077k315k237k587k512l036m606n699n282m553m724n109m914
55668C93899m981n978o631n719m408m535n650n799m568l510l764m681m695k768
$$ y = [1571681, 1528567, 1484760, 1441328, 1400002, 1361561, 1325746, 1292281, 1260926, 1231017, 1201977, 1174054, 1147702, 1122624, 1098303, 1075123, 1053971, 1034906, 1017072, 999778, 983013, 967134, 952684, 940246, 929812, 920540, 911745, 903732, 897066, 891424, 885929, 880424, 875557, 871481, 866876, 859508, 847816, 832145, 814341, 795815, 776341, 755446, 734573, 716628, 703128, 692895, 683823, 674811, 665474, 655244, 643641, 630784, 617087, 603133, 590143, 579478, 571207, 564078, 557282, 551095, 545355, 538760, 530521, 521514, 512877, 504685, 496859, 490116, 484854, 480189, 475199, 470064, 464926, 458961, 451945, 445550, 441473, 439158, 436921, 434334, 431822, 428786, 424180, 418481, 413199, 408646, 403922, 398813, 393899, 388918, 382940, 376309, 370590, 366182, 361647, 355997, 350198, 345630, 342120, 338356, 333675, 328980, 326212]
55654C26212O68L590M012K422J533K855M702M645K682N70q49k001k973l276l061
55639C41731l216m166n382n998n432l903k718l232m953n694m312k166r57m22N12
55624B89692J565J739J271J141J223O34l98p54k81P3r2l25n22r83j301p36K04
55607B92150J48r58j506n55Q76J428J054L76n04j672k719l212l221k719j189J384
55591B79161L685M134K635O02o12q10o94j048k074l129l219k102o85J8R4K27K78
55574B76461o75k679m279m285l522l797n433o878o875n878m963m307l545k850
55560B16495k682k894k817k055o33J123K249J421j372m063m633l595l013l547
55546A89984m116m145m153l946k440N1J360M03j291k075k436l212l477k188o49
$$ y = [326212, 326880, 330470, 334482, 336904, 338437, 341292, 345994, 350639, 353321, 353891, 353042, 351041, 348068, 344792, 341731, 338515, 334349, 328967, 322969, 317537, 313634, 310916, 307684, 302731, 297037, 292725, 290559, 289602, 289180, 289692, 291257, 292996, 294267, 295408, 296631, 297265, 296867, 296113, 295832, 295905, 295813, 295488, 294966, 293983, 292682, 291946, 292150, 292298, 291340, 289834, 289279, 290155, 291583, 292637, 293013, 292509, 290837, 288118, 284906, 281685, 278966, 277777, 279161, 282846, 286980, 289615, 290217, 289605, 288795, 288101, 287053, 284979, 281850, 278631, 276529, 275844, 275862, 275956, 276183, 276461, 275786, 273107, 268828, 264543, 261021, 257224, 251791, 244913, 238038, 232160, 227197, 222890, 219345, 216495, 213813, 210919, 208102, 206047, 205414, 206537, 208786, 210207, 208835, 204772, 200139, 196544, 193531, 189984, 185868, 181723, 177570, 173624, 171184, 171235, 172595, 172998, 171707, 169632, 167196, 163984, 160507, 158319, 157670]
55531A57670q93k371k606q70J001J573J516J938K828L730M491M732L907K418J605
55516A80669J983K718L261M176N580O044M315J313q14j212q40p48r71j164j337
55501B02973j606j746j502j124j211j980k909l299l195l347m043m361l164p76
55487A68710J015P94j058k984l803l360k113o93K34J46r20k202k647j785k46P83
55471A49871P62K21j65m06o45k77J400L724M910M087K283R58L04l11r26j030o95
55454A64065o04r15j005o76o85j492k173j398O58K221J860k6j888k684k540k209
55438A50509k264k727l121k933k183j391q51k87M51P92J51r97j496r92k56P3K69
55421A32747O60Q47L94j72N9J084J979K167K011K055K283K382K312K102J362m99
$$ y = [157670, 156777, 154406, 151800, 150930, 151931, 153504, 155020, 156958, 159786, 163516, 168007, 172739, 176646, 179064, 180669, 182652, 185370, 188631, 192807, 198387, 204431, 208746, 210059, 209245, 208033, 207193, 206445, 205474, 204310, 202973, 201367, 199621, 198119, 196995, 195784, 193804, 190895, 187596, 184401, 181054, 177011, 172650, 169486, 168710, 169725, 170519, 169461, 166477, 162674, 159314, 157201, 156508, 156742, 156888, 155968, 153766, 151119, 149334, 149088, 149871, 150633, 150854, 150689, 150283, 149638, 149361, 150761, 154485, 159395, 163482, 165765, 166723, 167027, 166716, 165790, 164760, 164065, 163461, 162546, 161541, 160865, 160180, 158688, 156515, 155117, 155775, 157996, 159856, 159830, 157942, 155258, 152718, 150509, 148245, 145518, 142397, 139464, 137281, 135890, 135039, 134752, 135203, 135995, 136146, 135149, 133653, 132661, 132405, 132478, 132747, 133407, 134254, 134648, 134476, 134535, 135619, 137598, 139765, 141776, 143831, 146114, 148496, 150808, 152910, 154272, 153773]
55405A53773l314n765o333m828k620j201p52m74L2L82K56j24n82j311k237k609
55389A22293j755J46K368M303N318M595K006j033k495j710J11J373J560J108N31
55374A38719J09NJ66K11j63o64o95k50p2o69j459j443n65K54N03P28J360J743
55356A37818J093j00p33q23j368k483k928j917l08N48L02n13j272j321j60J686
55340A27521K740K295J306Q10L28j036k557k509o58J259J767J237P39K75r61k955
55324A29601m223l190j01K761L198J322q68j945k222k225j466L48J905J628k7
55309A24496r63n1J740K778K323P10j014j667j058m61r94j762r20J445L022K309
55293A29933M97m42l62n88j749k949k838q81K095M209L867J291j616l237l548
$$ y = [153773, 150459, 144694, 138361, 133533, 130913, 129712, 128960, 128486, 128518, 128900, 129156, 129032, 128450, 127139, 124902, 122293, 120538, 120684, 123052, 127355, 132673, 137268, 139274, 138241, 135746, 134036, 134147, 135520, 137080, 138188, 138719, 138828, 138833, 138999, 139210, 139047, 138383, 137688, 137438, 137366, 136697, 135238, 133795, 133230, 133484, 133987, 134715, 136075, 137818, 138911, 138811, 138078, 137255, 135887, 133404, 130476, 128559, 128251, 128799, 129101, 128588, 127316, 125995, 125835, 127521, 130261, 132556, 133862, 134672, 135000, 133964, 131407, 128898, 128240, 129499, 131266, 132503, 133242, 133517, 132556, 129601, 125378, 122188, 122087, 124848, 128046, 129368, 128500, 126555, 124333, 122108, 120642, 120990, 122895, 124523, 124496, 123533, 123482, 125222, 128000, 130323, 131033, 130019, 128352, 127294, 126833, 125839, 124077, 123157, 124602, 127624, 129933, 130430, 129988, 129626, 129038, 127289, 124340, 121502, 120621, 122716, 126925, 130792, 132083, 130467, 127230, 123682]
55278A23682l301k755j798o61K52Q19J041Q23M78P53J678K072J042n11r30j6Q87
55261A23555R18N57L95K81J16L72J054J060m03k310k850j741m55j53l92k45L39
55244A20098Q57J136J034l2k253m344m416k175N44J690Q32r27k106j667M97L192
55228A11960M572L760J667K2k00O76J522J320J30p31j87R08O56j102k253j425
55212A21295o9k24j364j270O24K580L139K655J961J037l88j871k533j828M6K035
55196A25825K625J239r03k060j938j438p74O77K573L262J957Q4m49M49J257Q25
55180A33211o73k333l365l346k131M3K278L112J703q43k163j350m2J0n62j43R62
55163A24368J048P9l9J431K824K625J522R38J007R62M34m57j445j997j851j716
$$ y = [123682, 120381, 117626, 115828, 115167, 115419, 116238, 117279, 118102, 118580, 119333, 121011, 123083, 124125, 123614, 122684, 122668, 123555, 124473, 125030, 125425, 125706, 125822, 126194, 127248, 128308, 127905, 125595, 122745, 121004, 120549, 120396, 120004, 119759, 120098, 120955, 122091, 123125, 123093, 120840, 116496, 112080, 109905, 110449, 112139, 112971, 112044, 109938, 108271, 108768, 111960, 116532, 120292, 121959, 121981, 121781, 122457, 123979, 125299, 125429, 124698, 124511, 125419, 126075, 124973, 122720, 121295, 121226, 121002, 119638, 118368, 118992, 121572, 124711, 127366, 129327, 130364, 129976, 128105, 125572, 123744, 123790, 125825, 128450, 129689, 128786, 126726, 124788, 123350, 122576, 123253, 125826, 129088, 131045, 131129, 130680, 131129, 132386, 133211, 132538, 130205, 126840, 123494, 121363, 121406, 123684, 126796, 128499, 127656, 125493, 124143, 124101, 124111, 123549, 123406, 124368, 125416, 125495, 125456, 126887, 129711, 132336, 133858, 134796, 135803, 136765, 137199, 136742, 135297, 133300, 131449, 129733]
55147A29733k314k693j379O87P87j259k077M04L560L804J713O27J487K130J272
55132A36482L08P67K172L092K831J604J80l74L03J085M85j394l034l413k773j775
55116A36546r97j048k025k892k476r30P07K071L323L820K522j01k016j964q61
55101A33679m42j260k264j850N16L239L683J135j947k784j619p10p44l79P39J062
55085A30054j26j159m53J130J635P28l22m87K02J198J799J502O22J37L55M81J7
55068A37313k50N12J638J722N28q94j767k334k939l157k321n72R93J328N36k93
55052A30043l30J40L79L02L75P68J331K187L405M148L232R09r56r86J41Q09M34
55035A46331l43r03j210j423j584j706j683j226k06R60J646J761J890K578L499
$$ y = [129733, 127419, 124726, 123347, 124034, 124821, 123562, 121485, 121889, 125449, 129253, 130966, 131593, 133080, 135210, 136482, 136790, 137557, 139729, 142821, 145652, 147256, 147436, 147062, 147365, 148450, 148935, 147541, 144507, 141094, 138321, 136546, 135549, 134501, 132476, 129584, 127108, 126178, 126885, 128956, 132279, 136099, 138621, 138520, 136504, 134540, 133679, 133237, 131977, 129713, 127863, 128379, 131618, 135301, 136436, 134489, 131705, 130086, 129376, 128632, 128253, 128992, 130054, 129928, 128769, 128316, 129446, 131081, 131809, 131487, 131000, 131202, 132400, 134199, 135701, 136323, 136460, 136815, 137296, 137313, 137063, 137575, 139213, 140935, 141463, 140569, 138802, 136468, 133529, 130372, 128051, 127479, 128472, 129800, 130336, 130043, 129713, 129853, 130232, 130534, 130909, 131677, 133008, 135195, 138600, 142748, 145980, 146889, 145933, 144947, 145088, 145897, 146331, 145988, 145085, 143875, 142452, 140868, 139162, 137479, 136253, 136047, 137007, 138653, 140414, 142304, 144882, 148381]
55020A48381L532J947n79k373k430j285p2P85J502K006J808O93r51k400k979k536
55004A45049j779j560j529l89J894L319K383M03k75N33J181J140J373J968J728
54989A55439M97k25J94L91o62j949k160j593j044j63J552L120K993J057j364k979
54973A53104l182j943l8J184J124N34J96j28q27j438j400r28k68R65K758L916
54957A53629L447J979P17j98j176j871j711j224j402k168k538j959n83J165K399
54942A48506J943o9j549o65J871L962M731M637L845K239N22m69j054j793j958
54927A64699q07L34m06k197k309j61J975K593K591K713K006J16j300r84jK76K29
54910A69367N00K34j272k658k353j174r62j534j180L06J400J519J792K838L604
$$ y = [148381, 151913, 153860, 153281, 150908, 148478, 147193, 147121, 147906, 149408, 151414, 153222, 153915, 152964, 150564, 147585, 145049, 143270, 141710, 140181, 139792, 141686, 145005, 147388, 147791, 147516, 148049, 149230, 150370, 151743, 153711, 155439, 155936, 155711, 155905, 156296, 155634, 153685, 151525, 149932, 148888, 148725, 150277, 153397, 156390, 157447, 156083, 153104, 149922, 147979, 147941, 149125, 150249, 150783, 150979, 150851, 150024, 148586, 147186, 146258, 145990, 146955, 149713, 153629, 157076, 159055, 159772, 159574, 158398, 156527, 154816, 153592, 152190, 150022, 147484, 145525, 144942, 146107, 148506, 150449, 150380, 148831, 148166, 150037, 153999, 158730, 163367, 167212, 169451, 169973, 169504, 168450, 166657, 164699, 163892, 164226, 163820, 161623, 159314, 159153, 161128, 163721, 166312, 169025, 171031, 171147, 169847, 168863, 168862, 169138, 169367, 169867, 170101, 168829, 166171, 163818, 162644, 161682, 160148, 158968, 159274, 160674, 162193, 163985, 166823, 170427]
54895A70427K995J335m21j777k491k244j123J58J005J458J774J974K007J853J411
54880A78341P16K13L60R48J365J365J056L13r72k116k041n89J248K529K996K492
54864A88224Q01j405k481j515M54J745K178K968M725O552P310O976O308N739N165
54849B33744M477L708K736J417M7q84j568k834m781o023n128k585n26m47j924
54834B19429l621m646m732m015l131k749k498j229J069K605K061O49N82J960K807
54819B04541J959M87m4P18K216L812M699M185K725J884K570M095N330N868N467
54804B50512L533K12k893m293m344m353m482l883k545j614j781k521l208l806
54790B14534m181l760k535j685k361m128n264m607k780j469j571k316k300j257
$$ y = [170427, 173422, 174757, 174336, 172559, 170068, 167824, 166701, 166859, 167864, 169322, 171096, 173070, 175077, 176930, 178341, 179057, 179270, 179630, 180578, 181943, 183308, 184364, 184677, 183705, 181589, 179548, 178959, 180207, 182736, 185732, 188224, 189025, 187620, 185139, 183624, 184078, 185823, 188001, 190969, 195694, 202246, 209556, 216532, 222840, 228579, 233744, 238221, 241929, 244665, 246082, 246129, 245245, 243677, 240843, 236062, 230039, 224911, 222326, 221800, 221353, 219429, 215808, 211162, 206430, 202415, 199284, 196535, 194037, 192808, 193877, 196482, 198543, 199192, 199774, 201734, 204541, 206500, 206987, 206943, 207661, 209877, 213689, 218388, 222573, 225298, 227182, 229752, 233847, 239177, 245045, 250512, 254045, 254257, 251364, 247071, 242727, 238374, 233892, 230009, 227464, 225850, 224069, 221548, 218340, 214534, 210353, 206593, 204058, 202373, 200012, 195884, 190620, 186013, 183233, 181764, 180193, 177877, 175577, 174320]
54776A74320k16O7J8K05J82p50k192k986k551j117Q49K591K973J638j65j136j740
54759A69990k913l636j999J348L360K815J818K034J993M6k288k427p12M14K92
54744A70135L97J214J477P31K05O38J159J031P44O47J37r56j605j090j41K54J50
54727A75127J5k11n60m97L28J446K332L070L588L235J841M35O8N01Q39Q44Q35
54710A93236R58J347K460M323N893O106N296M717M885N202N071M615M242M137
54696B52488M260M417M260L534K314Q19q02k462m115n802p274p648o221l843k579
54681B31346l438n123n694m780l436k483j869j338q32l13J76M22M52O71J188J459
54665B06408J202J101J879L066L583L224K777K831L191L337K895J851Q52R26K260
$$ y = [174320, 174104, 174171, 174189, 174394, 174576, 173826, 171634, 168648, 166097, 164980, 165829, 168420, 171393, 173031, 172866, 171730, 169990, 167077, 163441, 161442, 162790, 166150, 168965, 170783, 172817, 174810, 174856, 172568, 170141, 169429, 169843, 170135, 170532, 171746, 173223, 173954, 174159, 174797, 175956, 176987, 177731, 178378, 178515, 177559, 175954, 174864, 174723, 174977, 175127, 175142, 174931, 174371, 173874, 174202, 175648, 177980, 181050, 184638, 187873, 189714, 190149, 190217, 190718, 191557, 192401, 193236, 194194, 195541, 198001, 202324, 208217, 214323, 219619, 224336, 229221, 234423, 239494, 244109, 248351, 252488, 256748, 261165, 265425, 268959, 271273, 272092, 271290, 268828, 264713, 258911, 251637, 243989, 237768, 233925, 231346, 227908, 222785, 217091, 212311, 208875, 206392, 204523, 203185, 202353, 202040, 202216, 202638, 203090, 203761, 204949, 206408, 207610, 208711, 210590, 213656, 217239, 220463, 223240, 226071, 229262, 232599, 235494, 237345, 238197, 239123, 241383]
54650B41383L578L473K018K91j248k936m648n489m942l630k674k787l821m808
54636B13760m591l066j471j038j642k288k360j646j1J924K501P88j718k688j931
54621A94523j171j157r20j89l32k005l568l244j650q51j671l114l891l383j465
54606A65912J513M390N550L959J01l892n348l338J6J578O96l85O1J035Q91J2j81
54589A72570J92o6p35k41J603K857K153O10M5N05P33L03l8R0J15l23o59k96L44
54570A79762L91k60q04n43M29J460J911J526O79K81R27K089K567J862N86n47j409
54553A90907j872j522n97l43j494k911k824j085Q12J747J869J639J153N87K36
54538A86302j06q60j664j635q27l38o74j131j089q31n86K9Q70P78p86k510k679
$$ y = [241383, 244961, 248434, 250452, 250743, 249495, 246559, 241911, 236422, 231480, 227850, 225176, 222389, 218568, 213760, 209169, 206103, 204632, 203594, 201952, 199664, 197304, 195658, 195647, 197571, 200072, 200860, 199142, 196454, 194523, 193352, 192195, 191275, 191086, 190754, 188749, 185181, 181937, 180287, 179436, 177765, 174651, 170760, 167377, 165912, 167425, 171815, 177365, 181324, 181425, 177533, 172185, 168847, 168863, 170441, 171137, 170752, 170813, 171848, 172739, 172751, 172570, 172762, 172696, 171961, 171720, 173323, 176180, 178333, 178943, 178988, 179493, 180226, 180529, 180491, 180581, 180696, 180373, 179714, 179418, 179762, 180153, 179893, 179089, 178546, 178975, 180435, 182346, 183872, 184551, 184832, 185759, 187848, 190415, 192277, 192863, 192316, 190907, 189035, 187513, 186916, 186573, 185079, 182168, 179344, 178259, 179071, 180818, 182687, 184326, 185479, 186066, 186302, 186196, 185336, 183672, 182037, 181210, 180872, 180198, 179067, 177978, 177147, 176561, 176590, 177460, 178238, 177452, 174942, 172263]
54521A72263j204P14K267L262L315K076J97j056j156o29j30J53K20J76L11Q18
54505A81597J401J564J106J59r24j410n74J221K456K122Q92j6l61m02J49J333
54489A90313J919P93r59j185J81J090P84J003K813M299L190M53q69J87J483R44
54473B06439j016k611k878k023o26O41J100O01l03j090j831k606k909k200q08
54458A87880M53J326K122K819K894K156J077J12p28j327j168m5J346K012J568
54443B02497L44j037j820j530o69m92j444k392k098q85R5O67J342J769J105o0
54427A95392M4J579K305O36j864k459p84J089J573J025M77L53O83J349J751J193
54411B04342O4j37J409L532M254K909O06j253k162k271j639l32J079J763J463
$$ y = [172263, 171059, 171773, 174040, 177302, 180617, 182693, 182890, 181834, 180678, 180049, 179919, 180072, 180292, 180468, 180779, 181597, 182998, 184562, 185668, 185827, 184903, 183493, 182919, 184140, 186596, 188718, 189610, 189594, 189233, 188831, 188980, 190313, 192232, 193025, 192066, 190881, 191062, 192152, 192936, 193939, 196752, 201051, 204241, 204694, 203825, 204012, 205495, 206439, 205423, 202812, 199934, 197911, 197285, 197926, 199026, 199627, 199324, 198234, 196403, 193797, 190888, 188688, 187880, 188333, 189659, 191781, 194600, 197494, 199650, 200727, 200839, 200111, 198784, 197616, 197571, 198917, 200929, 202497, 202841, 201804, 199984, 198454, 197785, 197293, 195849, 193457, 191359, 190474, 190569, 191236, 192578, 194347, 195452, 195392, 195436, 197015, 199320, 199956, 198092, 195633, 194849, 195938, 197511, 198536, 199013, 199366, 200049, 201398, 203149, 204342, 204406, 204269, 205678, 209210, 213464, 216373, 216979, 215726, 213564, 211293, 209654, 209322, 210401, 212164, 213627]
54396B13627O81j06r08j688j957j466q30p06o39L73K141L132K342N26q26j048
54380B12648m33M84J183J196M97k48k76M96J459J935J706J146Q72R78Q44O9p41
54363B23815q13n48r31j769j744m50R57J547J683J784J403N21L35J467K468J648
54347B31373l67j476j032l07k34k60L16J128J380Q87J32k97j78J25J37P9O67J733
54329B33806J961Q30k07L19J547J457j56j577j862j773j816j116Q81K922L240
54314B38456J662k43q44J17J452J726Q45K62J118K538K729J398l5n25l44J44J144
54297B51600K432K971K287J273R60J255J604J985K494K531J355p68k627l177k436
54282B63739j446j399k424l280k786j401o74j193k115k676l009l111k362p53N13
$$ y = [213627, 214308, 214202, 213294, 211606, 209649, 208183, 207353, 206647, 206008, 206381, 208522, 211654, 213996, 214522, 213696, 212648, 212215, 212699, 213882, 215078, 215575, 215327, 215051, 215547, 217006, 218941, 220647, 221793, 222665, 223643, 224487, 224556, 223815, 223002, 222454, 221523, 219754, 218010, 217560, 218517, 220064, 221747, 223531, 224934, 225455, 225790, 227257, 229725, 231373, 231006, 229530, 228498, 228191, 227957, 227697, 228013, 229141, 230521, 231408, 231540, 231243, 231065, 231190, 231327, 231406, 232073, 233806, 235767, 236597, 236390, 236709, 238256, 239713, 239557, 237980, 236118, 234345, 232529, 231413, 232294, 235216, 238456, 240118, 239875, 239031, 239148, 240600, 242326, 243171, 243433, 244551, 247089, 249818, 251216, 251181, 250656, 250312, 250456, 251600, 254032, 257003, 259290, 260563, 261523, 262778, 264382, 266367, 268861, 271392, 272747, 271979, 269352, 266175, 263739, 262293, 260894, 258470, 255190, 252404, 251003, 250329, 249136, 247021, 244345, 241336, 238225, 235863, 235110, 235623]
54267B35623N52J2j19p9o56j583j776r23K05Q60R45N62k76j412k560l552m235
54250B21588m221l161j265P48K133K500J960J078M48J36q1k6O62J558J593O25
54234B26275K6Q96K412K852J890P66M21M71J88l76o51m13J03O69J321K016K332
54217B41198J653j12k161l410l423k552j362l91k14q91j362l60J752L065K448
54202B33878R49J44J27N7j30J35P03Q66P13J039J850K227J890J691K043J985N88
54185B50755j555l117l713l871l780l104k003j235r69l82R85K113J664k7r97J3
54169B30777J975K822J862L56k15K70Q21O89Lp49j425k180k878k899j770N1J341
54152B28851J236J6j264j754j352n71p0p7j54K00P19O86J76J58R13J306M39o96
$$ y = [235623, 236175, 236187, 236068, 235989, 235333, 233750, 231974, 231051, 231256, 232116, 233061, 233623, 233347, 231935, 229375, 225823, 221588, 217367, 214206, 212941, 213689, 215822, 218322, 220282, 221360, 221808, 221944, 221863, 221837, 222499, 224057, 225650, 226275, 226301, 227197, 229609, 232461, 234351, 235117, 235538, 236009, 236197, 235821, 235170, 234757, 234860, 235529, 236850, 238866, 241198, 242851, 242739, 240578, 237168, 233745, 231193, 229831, 229440, 229226, 228335, 226973, 226613, 228365, 231430, 233878, 234827, 234971, 235098, 235155, 235025, 235160, 235863, 236729, 237442, 238481, 240331, 242558, 244448, 246139, 248182, 250167, 250755, 249200, 246083, 242370, 238499, 234719, 231615, 229612, 228377, 227408, 227026, 228011, 230124, 231788, 231761, 230764, 230777, 232752, 235574, 237436, 237792, 237577, 237847, 238668, 239357, 239360, 238611, 237186, 235006, 232128, 229229, 227459, 227510, 228851, 230087, 230103, 228839, 227085, 225733, 225162, 225092, 225015, 224861, 225061, 225780, 226466, 226642, 226800, 227713, 229019, 229458, 228762]
54134B28762m76R11J648Q87j64j08Q08J292O59o09j505j373n01R3j37n30l30n1
54116B29276o48j676j694n80K61K50N30J680K350J344l39j005p02n90o70O1J580
54099B29428K541K014L00j940m008m734l095K69L185M108L439K441J610O26o10
54084B35574j499j266J87J857K258Q93r63j425r4J421J262p02k734k920q12K354
54068B33391M798N389M036J396j413l260l651k903j390Q55L225L945J822j624
54054B44616l353k390o56K30J071K865M250L157J55j891j288R24K783L280K412
54039B56165P26p11r84l23J82L4k17j7N05J000J363J445J023K45k78o2Q41J994
54021B62931K878L128K758K060J285P03Q87K149L597L821K911K589L628M593M134
$$ y = [228762, 228286, 229197, 230845, 231732, 231568, 231460, 232268, 233560, 234219, 233610, 232105, 230732, 230231, 230324, 230187, 229657, 229327, 229276, 228628, 226952, 225258, 224678, 224939, 225189, 225719, 227399, 229749, 231093, 230754, 229749, 229047, 228457, 227787, 227848, 229428, 231969, 233983, 234283, 232343, 228335, 223601, 220506, 220775, 223960, 228068, 231507, 233948, 235558, 236184, 235574, 234075, 232809, 232996, 234853, 237111, 238004, 237041, 235616, 235522, 236943, 238205, 237503, 234769, 231849, 231037, 233391, 238189, 243578, 247614, 249010, 247597, 244337, 240686, 237783, 236393, 237248, 240473, 244418, 246240, 244616, 241263, 238873, 238217, 238447, 239518, 242383, 246633, 249790, 249945, 248054, 246766, 247690, 250473, 253753, 256165, 256891, 256180, 255196, 254873, 255055, 255089, 254872, 254855, 255360, 256360, 257723, 259168, 260191, 260436, 260158, 260096, 260937, 262931, 265809, 268937, 271695, 273755, 275040, 275743, 276630, 278779, 282376, 286197, 289108, 291697, 295325, 299918, 304052]
54006C04052L069K626J990k21k952l729k307r54r64j296j039q59j187j125j52
53991B94952Q32J278J993L178L315J629J15J128L904N615N328M816N520O577O440
53976C46620N077L815L668M527N558O047N908N530N152M532L435K189J454J532
53962D05044J967J754J65k235l583k488O5J367q1k902m528l921k268j461k340
53947C84555l988m470k812m37J10j812m082m469l141j814j373j493j918k754l620
53932C46482l707k801j480l49K82J97m70r43p03n09j505l226l716k162l54o62
53916C24374k983m756l969j384N92O87k84j028j372j651j399M4J841K117O83j50
53900C11362J424M017M858L570K330K488K912K272J246J361K729M107M690M723
$$ y = [304052, 307121, 309747, 311737, 311516, 308564, 304835, 302528, 301574, 300610, 299314, 298275, 297416, 296229, 295104, 294952, 295784, 297062, 299055, 302233, 305548, 307177, 307292, 308420, 312324, 317939, 323267, 328083, 333603, 340180, 346620, 351697, 355512, 359180, 363707, 369265, 375312, 381220, 386750, 391902, 396434, 399869, 402058, 403512, 405044, 407011, 408765, 408930, 406695, 403112, 400624, 400689, 402056, 401975, 399073, 394545, 390624, 388356, 386895, 384555, 380567, 376097, 373285, 372848, 372958, 371146, 367064, 362595, 359454, 357640, 356267, 354774, 352856, 350102, 346482, 342775, 339974, 338494, 338145, 338427, 338624, 338154, 337211, 336508, 335999, 334494, 331268, 327552, 325390, 325036, 324374, 321391, 316635, 312666, 311282, 311874, 312561, 312277, 311249, 309877, 308226, 306827, 306871, 308712, 310829, 311512, 311362, 312786, 316803, 321661, 325231, 327561, 330049, 332961, 335233, 336479, 337840, 340569, 344676, 349366, 354089]
53886C54089M655M596M569M596M567M564N177O926R441J1691J3040J3543J3431
53873D54885J2924J2581J3017J4070J4799J4508J3141J0580O525J669j991l084
53861E63624k620k650l452l359j473Q74J955J817J691K047K349K342K394K505
53847E68044J946K76j798k988k741j837j671k927m878o144o177n700n636o089
53833E21680o642p100p499p770p945q344q981r142q174o529n343n121n430n646
53819D22014n476m959m652n400p109q003o390l098r78j579l467m353l910l581
53805C59059m254n185n106l757k134j434j810k182j459J31J309J165p9j596k648
53790C30020k796k167j571j638j874j290j03L00n99j518j179q7M27J88O9L48M64
$$ y = [354089, 358744, 363340, 367909, 372505, 377072, 381636, 386813, 393739, 403180, 414871, 427911, 441454, 454885, 467809, 480390, 493407, 507477, 522276, 536784, 549925, 560505, 567030, 568699, 566708, 563624, 561004, 558354, 554902, 551543, 550070, 550944, 552899, 554716, 556407, 558454, 560803, 563145, 565539, 568044, 569990, 570266, 568468, 565480, 562739, 560902, 559231, 556304, 551426, 545282, 539105, 533405, 527769, 521680, 515038, 507938, 500439, 492669, 484724, 476380, 467399, 458257, 450083, 443554, 438211, 433090, 427660, 422014, 416538, 411579, 406927, 401527, 394418, 386415, 380025, 376927, 375949, 374370, 370903, 366550, 362640, 359059, 354805, 349620, 344514, 340757, 338623, 337189, 335379, 333197, 331738, 331869, 333178, 334343, 334264, 332668, 330020, 327224, 325057, 323486, 321848, 319974, 318684, 318581, 318881, 318282, 316764, 315585, 315498, 315925, 316113, 316182, 316530, 316994]
53773C16994L11O27J618K141R86j458l415l581k294q17O6M70P64J079J455J986
53757C16932K608L121L549M067M459M304L925M375N850O972O479M992M085M188
53743C79906M605N113O007O719N977L657J273K77R01K653M721N773M801K648J404
53728D36435J858K773K986K698K127O15j910m068m816m893n315n649n180m603
53714D13058n040o143o725o581o261n656m406l220l194l963l968k567o76N94P89
53699C56041k09k055l496l328j964r87j044j236p70j71l82j391k207j862l20J313
53683C35932J719Q21p0R5R23J525J823K005J578L18n65K45K024K819K199J544
53667C54935J621J712J469J786L100M310M357L708L339L215K684J631L84p69j228
$$ y = [316994, 317305, 317932, 319550, 321691, 322677, 321219, 317804, 314223, 311929, 311112, 311178, 311648, 312412, 313491, 314946, 316932, 319540, 322661, 326210, 330277, 334736, 339040, 342965, 347340, 353190, 360162, 366641, 371633, 375718, 379906, 384511, 389624, 395631, 402350, 408327, 411984, 413257, 413534, 414435, 417088, 421809, 427582, 432383, 435031, 436435, 438293, 441066, 444052, 446750, 448877, 449492, 447582, 443514, 438698, 433805, 428490, 422841, 417661, 413058, 408018, 401875, 395150, 388569, 382308, 376652, 372246, 369026, 365832, 361869, 357901, 355334, 354658, 355252, 356041, 355832, 353777, 350281, 346953, 344989, 344002, 342958, 341722, 340952, 340781, 340399, 339008, 336801, 334939, 334619, 335932, 337651, 338472, 338402, 338497, 339420, 340945, 342768, 344773, 346351, 346669, 346104, 346349, 348373, 351192, 353391, 354935, 356556, 358268, 359737, 361523, 364623, 368933, 373290, 376998, 380337, 383552, 386236, 387867, 388251, 387482, 386254]
53652C86254r0K599N131N801M967M545N496O654O237M054J821J417K950M804N523
53637D48163N249M934M713L922K556J579J626K219K553K317J510K68p77q30j64
53622D79838k50j914l995m552l023n88J308J967J317l94k473l826l558j744M06
53607D58519J399R23K18M93J182O79j136k327j440M59J311Q63N56J001J090k3
53591D63767j401j601o06M89J206J991K897L073K069Q86R22K302L924M913N182
53576D90013M729L370J557N41J012K136K684K718L355M988O574O955O275N747
53562E42654O231P432Q444Q890R138R414R139P740N792M590M635N326O177P257
53548F42859Q159P769N757L371J964J560J505J573J568R49j05l56N40R20m22j855
$$ y = [386254, 386164, 388763, 393894, 399695, 404662, 409207, 414703, 421357, 427594, 431648, 433469, 434886, 437836, 442640, 448163, 453412, 458346, 463059, 466981, 469537, 471116, 472742, 474961, 477514, 479831, 481341, 481609, 480832, 480002, 479838, 479588, 477674, 473679, 469127, 466104, 465516, 466824, 468791, 470108, 469714, 467241, 463415, 459857, 458113, 458519, 459918, 460841, 461059, 461552, 462734, 463413, 462277, 459950, 458510, 458969, 460280, 461143, 461699, 462700, 463790, 463767, 462366, 460765, 460159, 460648, 461854, 463845, 466742, 469815, 471884, 472770, 473692, 475994, 479918, 484831, 490013, 494742, 498112, 499669, 500210, 501222, 503358, 506042, 508760, 512115, 517103, 523677, 530632, 536907, 542654, 548885, 556317, 564761, 573651, 582789, 592203, 601342, 609082, 614874, 619464, 624099, 629425, 635602, 642859, 651018, 658787, 664544, 667915, 669879, 671439, 672944, 674517, 676085, 677034, 676929, 676573, 677113, 678033, 677611, 675756]
53532F75756j117Q94J153r79k947l061k725l593m788m567l107j974j818k000k059
53517F43068k263k959l962m392l124j84K383K244k91k345j944o1J289J540J355
53502F30354J309J842L305N084N741N031M433M732M587K895J083J129K527L376
53488F77428L644M859O941P836O683N197N203O515Q028R548J1492J3831J6067
53475G83272J7660J8074J7216J6260J6973J9597K2147K2588K1133J9770J9974
53464I94664K1597K3633K5269K6167K6420K6577K7476K9669L2813L5790L7754
53453A307829L8999M0385M1861M2310M1303M0180M0492M1841M2434M1549M0247
53442A759430L9438L8571L6877L4892L3761L3541L3194L2198L1351L1626L2732
$$ y = [675756, 674639, 675533, 676686, 675707, 672760, 669699, 666974, 663381, 658593, 654026, 650919, 648945, 647127, 645127, 643068, 640805, 637846, 633884, 629492, 626368, 626184, 628567, 630811, 630520, 628175, 626231, 626170, 627459, 628999, 630354, 631663, 633505, 636810, 641894, 647635, 652666, 657099, 661831, 666418, 669313, 670396, 671525, 674052, 677428, 681072, 685931, 692872, 700708, 707391, 712588, 717791, 724306, 732334, 741882, 753374, 767205, 783272, 800932, 819006, 836222, 852482, 869455, 889052, 911199, 933787, 954920, 974690, 994664, 1016261, 1039894, 1065163, 1091330, 1117750, 1144327, 1171803, 1201472, 1234285, 1270075, 1307829, 1346828, 1387213, 1429074, 1471384, 1512687, 1552867, 1593359, 1635200, 1677634, 1719183, 1759430, 1798868, 1837439, 1874316, 1909208, 1942969, 1976510, 2009704, 2041902, 2073253, 2104879, 2137611]
53431B137611L3295L2432L0773K9574K9001K7990K5972K3980K3260K3224K1977
53420B439089J8961J5940J4697J4567J3281R861N626K195o21m295r421j4815j8887
53407B486178k1355k3224k5168k6496k6094k4261k3069k4453k8050l1392l2474
53396B200142l1813l1550l2726l4119l3942l1947k9375k7258k5570k3911k2278
53385A875653k0950j9982j9058j7640j5288j2111q759n692k660O69L823N959P004
53372A770968P702Q608R818J1687J4761J8617K1747K3197K3787K5188K8126L1883
53360A996089L5204L7415L9082M1519M5176M8629N0181N0409N1776N5316N9240
53349B510036O1767O3841O7536P2715P7090P9184P9763Q0404Q1971Q4449Q7055
$$ y = [2137611, 2170906, 2203338, 2234111, 2263685, 2292686, 2320676, 2346648, 2370628, 2393888, 2417112, 2439089, 2458050, 2473990, 2488687, 2503254, 2516535, 2526396, 2532022, 2534217, 2533596, 2529301, 2519880, 2505065, 2486178, 2464823, 2441599, 2416431, 2389935, 2363841, 2339580, 2316511, 2292058, 2264008, 2232616, 2200142, 2168329, 2136779, 2104053, 2069934, 2035992, 2004045, 1974670, 1947412, 1921842, 1897931, 1875653, 1854703, 1834721, 1815663, 1798023, 1782735, 1770624, 1761865, 1756173, 1753513, 1754182, 1758005, 1763964, 1770968, 1778670, 1787278, 1797096, 1808783, 1823544, 1842161, 1863908, 1887105, 1910892, 1936080, 1964206, 1996089, 2031293, 2068708, 2107790, 2149309, 2194485, 2243114, 2293295, 2343704, 2395480, 2450796, 2510036, 2571803, 2635644, 2703180, 2775895, 2852985, 2932169, 3011932, 3092336, 3174307, 3258756, 3345811]
53338C345811Q8533Q8420Q7969Q8715R0257R0745Q9571Q7977Q6660Q4478Q0496
53327D309632P5879P2348O9485O5152N8352N0508M3658L8293L3283K7343K0110
53316D864043J2103M003l913j1715j9390k6841l4388m2809n2339o1749o9127p3858
53304D484020p7357q1410q6050q9573r0607q9493q7586q5833q4538q3867q3762
53293C543944q3416q1754p8683p5356p2915p1382p0057o8549o7018o5505o3506
53282B745803o0364n6164n2005m9025m7019m4540m0736l6468l3008l0274k7394
53271B268806k4499k2589k1776k1117k0328k0116k0436j9969j8061j5741j3902
53260B050272j1839q757n555l615k663j278J023L556N884Q123J0118J1486J2505
$$ y = [3345811, 3434344, 3522764, 3610733, 3699448, 3789705, 3880450, 3970021, 4057998, 4144658, 4229136, 4309632, 4385511, 4457859, 4527344, 4592496, 4650848, 4701356, 4745014, 4783307, 4816590, 4843933, 4864043, 4876146, 4880149, 4876236, 4864521, 4845131, 4818290, 4783902, 4741093, 4688754, 4627005, 4557878, 4484020, 4406663, 4325253, 4239203, 4149630, 4059023, 3969530, 3881944, 3796111, 3711573, 3627706, 3543944, 3460528, 3378774, 3300091, 3224735, 3151820, 3080438, 3010381, 2941832, 2874814, 2809309, 2745803, 2685439, 2629275, 2577270, 2528245, 2481226, 2436686, 2395950, 2359482, 2326474, 2296200, 2268806, 2244307, 2221718, 2199942, 2178825, 2158497, 2138381, 2117945, 2097976, 2079915, 2064174, 2050272, 2038433, 2029676, 2024121, 2020506, 2017843, 2016565, 2017588, 2021144, 2027028, 2035151, 2045269, 2056755, 2069260]
53247B069260J4050J6712K0429K4536K7718K8924K9088L0766L4719L8098L7899
53236B372199L5277L4174L6017L8294L8615L7705L7470L7999L7865L6078L2663
53225B774356K8110K3276J9081J5552J1722O920J473m187j0107j5930k0448k2961
53213B806857k4514k6918l0867l5505l9551m2245m3525m3821m3806m4127m5212
53202B386766m7050m8913m9774m9514m9246m9758n0279m9815m9039m9374n0419
53191A843585n0248m8420m6868m7035m7775m7147m4981m2459m0177l7870l5496
53180A355109l3414l1778l0406k8946k6828k3764k0705j9348k0048k1056k0574
53169A078242j8792j7167j6650j7382j9154k0991k1250j9422j7261j6770j7581
$$ y = [2069260, 2083310, 2100022, 2120451, 2144987, 2172705, 2201629, 2230717, 2261483, 2296202, 2334300, 2372199, 2407476, 2441650, 2477667, 2515961, 2554576, 2592281, 2629751, 2667750, 2705615, 2741693, 2774356, 2802466, 2825742, 2844823, 2860375, 2872097, 2879017, 2880490, 2876303, 2866196, 2850266, 2829818, 2806857, 2782343, 2755425, 2724558, 2689053, 2649502, 2607257, 2563732, 2519911, 2476105, 2431978, 2386766, 2339716, 2290803, 2241029, 2191515, 2142269, 2092511, 2042232, 1992417, 1943378, 1894004, 1843585, 1793337, 1744917, 1698049, 1651014, 1603239, 1556092, 1511111, 1468652, 1428475, 1390605, 1355109, 1321695, 1289917, 1259511, 1230565, 1203737, 1179973, 1159268, 1139920, 1119872, 1098816, 1078242, 1059450, 1042283, 1025633, 1008251, 989097, 968106, 946856, 927434, 910173, 893403, 875822]
53158H75822j7810j6958j6392j6965j7808j7810j6933j5609j3962j2236j1046
53147G02293j0583j0216r464q810r089j0414j2126j3339j3377j2187j0696j0143
53135E71849j0590j0557q717n685l496l451m980o658p678q147q371q270p421n558
53121D72270l136j362j336k818m243m338l535l263l986m643m169k771j342l24
53107D31004K83L35k66j059j451j450j422j413j374j719k748l630l034r41J033
53092D12148J433M26p72j283j126q75j085j674j837j064r1j48j213j860j054O77
53076D00602K118K717K733K618K600K439J579K7j143r93k30m11j633k424k056
53061D08543j555j775j987j311k47K29P2l15r77j659j308L61J736J265k05o61
$$ y = [875822, 858012, 841054, 824662, 807697, 789889, 772079, 755146, 739537, 725575, 713339, 702293, 691710, 681494, 672030, 663220, 654131, 643717, 631591, 618252, 604875, 592688, 581992, 571849, 561259, 550702, 541985, 536300, 532804, 529353, 524373, 517715, 510037, 501890, 493519, 485249, 477828, 472270, 469134, 467772, 466436, 463618, 459375, 455037, 451502, 448239, 444253, 439610, 435441, 432670, 431328, 431004, 431287, 431622, 431356, 430297, 428846, 427396, 425974, 424561, 423187, 421468, 418720, 415090, 412056, 411115, 412148, 413581, 414007, 413235, 411952, 410826, 409951, 408866, 407192, 405355, 404291, 404200, 404052, 402839, 400979, 399925, 400602, 402720, 405437, 408170, 410788, 413388, 415827, 417406, 417433, 416290, 415297, 415067, 414656, 413023, 410599, 408543, 406988, 405213, 403226, 401915, 401668, 401897, 401969, 401654, 400677, 399018, 397710, 398071, 399807, 401072, 400867, 400206]
53045D00206J55Q01P17O39N09q45l261m434k812K2J239K09j296j829j704j658
53029C86658j484p46K5k05j294j745n53J359K218J541M82K35R46K156L257L283
53013C96133J345j966m478m630l174j901j326p46p1k32j592l181l873l587k842
52998C63879j849n97N16Q98N35J14J30J94l78j368j683q62L6k60j510k362k167
52981C53266j327j47J265J926O15j844k655m83K625M029L849L852M135L101M14
52966C72621k115k894k203j135j61P45J532K110K343J955J001L87R46K133K556
52951C79821J758N23n08j410k055j885r72l08m16o08j43N98O91J6o03m08M39R70
52933C75500M61n28m92J158L057L362J917O6j202j766j354L68K438K926J335m57
$$ y = [400206, 400361, 401162, 401879, 402518, 403027, 402182, 398921, 394487, 391675, 391697, 392936, 393145, 391849, 390020, 388316, 386658, 385174, 384428, 384453, 384248, 382954, 381209, 380656, 382015, 384233, 385774, 386256, 386491, 387437, 389593, 392850, 396133, 397478, 395512, 391034, 386404, 383230, 381329, 380003, 379257, 379186, 378954, 377362, 374181, 370308, 366721, 363879, 362030, 361433, 361949, 362847, 363382, 363496, 363626, 363820, 363442, 362074, 360391, 359529, 359565, 359305, 357795, 355433, 353266, 351939, 351792, 353057, 354983, 355598, 353754, 351099, 350616, 353241, 357270, 361119, 364971, 369106, 372207, 372621, 370506, 367612, 365409, 364274, 364113, 364858, 366390, 368500, 370843, 372798, 373799, 374186, 375132, 377265, 379821, 381579, 382102, 381594, 380184, 378129, 376244, 375272, 374964, 374548, 373940, 373797, 374395, 375086, 375102, 374499, 374091, 374530, 375500, 375961, 375433, 374941, 376099, 379156, 382518, 384435, 384501, 383299, 381533, 380179, 380547, 382985, 385911, 387246, 386789]
52917C86789n51O17J193M72m70l59Q51K213K907K996L106L394L160J938N36Q5
52901D08877L59J28q13j339j068j224k617l992l633j815l89l76j147j714j767
52886C87470j459j081j073j619k127j818q71l80r31j785j849j066m82j047k549
52871C67333l744l496j889j86L81j88p44k50J163K409K580J713M99n01j109j309
52855C62662j128p13m9J184K904L819K509l44j996q66J233J439l45j616r72J73
52839C67894l8j455k640k842k298j303rJ176J707J453R03R15K041L622L955K178
52823C75259k28j004MR27Q69R52J795J973L94j393j107J032K788L044K519J847
52807C89671Q04l46n56M23J409J422Q63N96P86J111J350J226M50n98j044q74j335
$$ y = [386789, 386238, 386855, 388048, 388520, 388050, 387691, 388542, 390755, 393662, 396658, 399764, 403158, 406318, 408256, 408792, 408877, 409236, 409364, 408551, 407212, 406144, 404920, 402303, 398311, 394678, 392863, 392474, 392098, 390951, 389237, 387470, 386011, 384930, 383857, 382238, 380111, 378293, 377422, 377042, 376111, 374326, 372477, 371411, 370929, 369882, 367333, 363589, 360093, 358204, 358018, 358399, 358211, 357467, 357217, 358380, 360789, 363369, 365082, 365581, 365080, 363971, 362662, 361534, 360821, 360772, 361956, 364860, 368679, 371188, 370844, 368848, 367982, 369215, 370654, 370309, 368693, 367721, 367894, 367856, 366401, 363761, 360919, 358621, 357318, 357309, 358485, 360192, 361645, 362548, 363463, 365504, 369126, 373081, 375259, 375031, 374027, 374031, 374958, 375827, 376779, 378574, 380547, 380941, 379548, 378441, 379473, 382261, 385305, 387824, 389671, 390475, 390129, 389573, 389996, 391405, 392827, 393690, 394286, 395072, 396183, 397533, 398759, 399209, 398611, 397567, 396693, 395358]
52790C95358l130m962m908k924r41m68j119j735k040k499l149l402k996k343j746
52775C56996r03L92J396J038o46k182k116m91J224J511Pk268l680l257j569k20
52759C45232k44j090j373m52R09J407M92j048j765q83Q97K128K211J922K227L006
52743C53576L354K801J690M76o75j586j985k002k252k960l432k873j558n47k79
52728C41748j59K17J85r05k187j920K76K648L271K235J282J534K227J723n06l034
52712C48635l726j996M11J408J054J149K327K957J639n73j755j871k163k488j416
52697C43592R23K218R87j389k597k096q27N21J656K025J456J068K047L730M173
52682C57487K760J097R37K199L531M109M052L586K638J399M89K14Q9m02q39l83
$$ y = [395358, 392228, 387266, 382358, 379434, 378493, 378025, 376906, 375171, 373131, 370632, 367483, 364081, 361085, 358742, 356996, 356093, 356485, 357881, 358919, 358273, 356091, 353975, 353484, 354708, 356219, 356226, 353958, 350278, 347021, 345452, 345232, 344988, 343898, 342525, 342073, 342982, 344389, 344881, 343833, 342068, 341185, 342082, 344210, 346421, 348343, 350570, 353576, 356930, 359731, 361421, 361897, 361222, 359636, 357651, 355649, 353397, 350437, 347005, 344132, 342574, 342027, 341748, 341589, 341806, 341991, 341086, 338899, 336979, 337255, 339903, 343174, 345409, 346691, 348225, 350452, 352175, 351669, 348635, 344909, 342913, 343324, 344732, 345786, 346935, 349262, 352219, 353858, 353285, 351530, 349659, 347496, 345008, 343592, 344515, 346733, 347720, 346331, 343734, 341638, 340811, 341332, 342988, 345013, 346469, 347537, 349584, 353314, 357487, 360247, 361344, 362281, 364480, 368011, 372120, 376172, 379758, 382396, 383795, 384284, 384498, 384587, 384185, 383346, 382963]
52666C82963Q23J598J374R71J175J380P00m35j036j476k933m965n400l285m12
52651C71042R57O95J80N3j05n08p74o31k14K10L11j41p36n63N03J328J006J73
52633C72786o1J51j77j007j204l46N32L55o13j241q71J73J101J425J289J125J022
52616C74439O56p1p15q04l55L06P98O03o06k098k348q49R68J444P90M54Q57J011
52598C74480L24m26k86N90J301J175J75j152j857j332j62L34k33o53K96J966K391
52581C76931Q46r24o76J497L200K756J216O05J050R80j33q71o6J572K752L289
52565C94024L525L160J896M85j95n38j400k453k639k072j985k740l291k821j723
52550C81233o16N17J703K439K321J601P04j35o02l93J54K74p8k4Q27J601J355
$$ y = [382963, 383786, 385384, 386758, 387729, 388904, 390284, 390984, 390549, 389513, 388037, 385104, 380139, 374739, 371454, 371042, 371999, 372694, 372874, 372927, 372822, 372314, 371540, 370909, 370695, 370905, 371216, 371075, 370339, 369776, 370279, 371607, 372613, 372786, 372725, 372876, 372699, 371692, 370488, 370142, 370674, 371029, 370416, 369175, 368304, 368477, 369578, 371003, 372292, 373417, 374439, 375095, 375024, 374309, 373505, 373150, 373456, 374254, 374857, 374251, 372153, 369805, 368956, 369924, 371368, 372158, 372612, 373469, 374480, 374804, 374378, 374092, 374682, 375983, 377158, 377333, 376181, 374324, 372992, 372830, 373164, 372931, 372278, 372574, 374540, 376931, 377777, 376853, 376177, 377674, 380874, 383630, 384846, 385451, 386501, 387481, 387348, 386477, 386411, 387983, 390735, 394024, 397549, 400709, 402605, 403090, 402895, 402357, 400957, 398504, 395865, 393793, 391808, 389068, 385777, 382956, 381233, 380617, 381134, 382837, 385276, 387597, 389198, 389902, 389767, 389165, 388772, 388926, 389200, 389122, 389098, 389925, 391526, 392881]
52533C92881M03k25j68J26L06M23N60P06Q99J046O58n90k042k384j029J113K504
52516C95187K471J583P36K48p3l27l84k53k03l72m90k15L33N69P2p87j028j07
52498C96960J291J894J352N42J59j72q16j028j97N43m58k658l602k171M9J166
52482C92854J168R57P55N28O82J147Q79n26j810j876j464j646j788p63O94Q70
52466C90661r8k72J245L140L777K898J345K22L31J433K220J816R03M17l7j079
52450D08922j757o66J613L071K992K392K038J908K252L168L348J564q13j208J42
52435D28966K79j916m114m345l560l060k125j13J391Q05o92r04K02J032J128J349
52419D14323J995K431K179J113p48k604k884j138R65J697J360J222J427J431J467
$$ y = [392881, 393284, 393059, 392891, 393017, 393323, 393746, 394306, 395012, 395911, 396957, 397615, 397025, 394983, 392599, 391570, 392683, 395187, 397658, 399241, 399977, 400225, 400152, 399825, 399441, 399188, 398985, 398613, 398123, 397908, 398241, 398810, 398882, 398095, 397067, 396960, 398251, 400145, 401497, 402039, 402198, 402026, 401210, 400182, 399985, 400528, 400070, 397412, 393810, 391639, 391688, 392854, 394022, 394979, 395734, 396262, 396944, 398091, 398970, 398444, 396634, 394758, 393294, 391648, 389860, 389097, 389791, 390661, 390563, 390291, 391536, 394676, 398453, 401351, 402696, 402918, 403249, 404682, 406902, 408718, 409621, 410038, 410001, 408922, 407165, 406499, 408112, 411183, 414175, 416567, 418605, 420513, 422765, 425933, 429281, 430845, 430032, 428824, 428966, 429245, 427329, 423215, 418870, 415310, 412250, 410125, 410012, 411403, 412208, 411516, 410612, 410814, 411846, 412974, 414323, 416318, 418749, 420928, 422041, 421293, 418689, 415805, 414667, 415632, 417329, 418689, 419911, 421338, 422769, 424236]
52404D24236K111L067L693L989L990L313K420K901M923N931L901N60j042j012
52390D62981j825l775m431k813j116j395k810l375k682j731j256j225j244q83
52376D32420k03k0q62j991k374k158j881r94J043K739K040k40j013O79K381K204
$$ y = [424236, 426347, 429414, 433107, 437096, 441086, 444399, 446819, 449720, 454643, 460574, 464475, 465035, 463993, 462981, 461156, 457381, 452950, 450137, 449021, 447626, 444816, 441441, 438759, 437028, 435772, 434547, 433303, 432420, 432217, 432197, 431335, 429344, 426970, 424812, 422931, 421937, 422980, 425719, 427759, 427519, 426506, 427185, 429566, 431770]
$$ [...]
##END NTUPLES=NMR SPECTRUM
##END=
