
##TITLE=UV1052_TOCA01-ROVE100D_6099822_WiqZB8QMC7
##JCAMPDX= 6.0         $$ Bruker NMR JCAMP-DX V2.0
##DATA TYPE= NMR SPECTRUM
##DATA CLASS= NTUPLES
##ORIGIN= BRUKER
##OWNER= Administrator
$$ 1.72 TOPSPIN		Version 2.1
$$ 2012-05-12 21:48:16.546 -0500  Administrator@TOPSPIN
$$ Compression mode = diff/dup
##.OBSERVE FREQUENCY= 400.13188235
##.OBSERVE NUCLEUS= ^1H
##.ACQUISITION MODE= SIMULTANEOUS (DQD)
##.ACQUISITION SCHEME= undefined
##.AVERAGES= 8
##.DIGITISER RES= 22
##SPECTROMETER/DATA SYSTEM= spect
##.PULSE SEQUENCE= zg30
##.SOLVENT NAME= COFFEE_meoh
##.SHIFT REFERENCE= INTERNAL, COFFEE_meoh, 1, 14.98061
##AUDIT TRAIL= $$ (NUMBER, WHEN, WHO, WHERE, PROCESS, VERSION, WHAT)
$$ ##TITLE= Audit trail, TOPSPIN		Version 2.1
$$ ##JCAMPDX= 5.01
$$ ##ORIGIN= Bruker BioSpin GmbH
$$ ##OWNER= Administrator
$$ $$ C:\Bruker\TOPSPIN/data/COFFEE/nmr/UV1052_TOCA01-ROVE100D_6099822_WiqZB8QMC7/10/pdata/1/auditp.txt
$$ ##AUDIT TRAIL=  $$ (NUMBER, WHEN, WHO, WHERE, PROCESS, VERSION, WHAT)
(   1,<2012-05-12 21:48:09.453 -0500>,<Administrator>,<TOPSPIN>,<go>,<TOPSPIN 2.1>,
      <created by zg
	started at 2012-05-12 21:47:02.781 -0500,
	POWCHK enabled, PULCHK disabled,
       configuration hash MD5:
       AF F2 23 6B 01 CD 40 DD E5 A1 38 A0 06 EA F7 77
       data hash MD5: 64K
       B6 B4 81 CF 74 7C 95 2F D8 8B 50 BC 12 82 51 4F>)
(   2,<2012-05-12 21:48:12.093 -0500>,<Administrator>,<TOPSPIN>,<proc1d>,<TOPSPIN 2.1>,
      <Start of raw data processing
       efp LB = 0 FT_mod = 6 PKNL = 1 PHC0 = 0 PHC1 = 0 SI = 32K 
       data hash MD5: 32K
       33 86 21 C9 FB AD D9 4E 67 86 0C 54 EB 8A 50 2C>)
(   3,<2012-05-12 21:48:12.546 -0500>,<Administrator>,<TOPSPIN>,<proc1d>,<TOPSPIN 2.1>,
      <pk PHC0 = 214.8322 PHC1 = 0 
       data hash MD5: 32K
       2C E1 7C F9 32 32 9C 83 02 8F 47 C9 A9 1D 77 9D>)
(   4,<2012-05-12 21:48:12.656 -0500>,<Administrator>,<TOPSPIN>,<proc1d>,<TOPSPIN 2.1>,
      <abs ABSG = 1 
       data hash MD5: 32K
       7F 8A E4 4F B4 3A 81 0E E4 20 01 04 4A D6 49 D2>)
(   5,<2012-05-12 21:48:12.687 -0500>,<Administrator>,<TOPSPIN>,<proc1d>,<TOPSPIN 2.1>,
      <abs ABSG = 2 
       data hash MD5: 32K
       EB 4C E4 59 B9 0A 02 D7 EF B2 59 7B 45 D1 24 DC>)
(   6,<2012-05-12 21:48:12.718 -0500>,<Administrator>,<TOPSPIN>,<proc1d>,<TOPSPIN 2.1>,
      <abs ABSG = 3 
       data hash MD5: 32K
       D1 EE 7C 9B EF 8B BE EF FA C8 E5 24 2C 5C 62 B1>)
(   7,<2012-05-12 21:48:12.750 -0500>,<Administrator>,<TOPSPIN>,<proc1d>,<TOPSPIN 2.1>,
      <abs ABSG = 4 
       data hash MD5: 32K
       89 EA CF 2A 31 75 FE 3D 11 56 E9 90 BE A3 27 27>)
(   8,<2012-05-12 21:48:12.765 -0500>,<Administrator>,<TOPSPIN>,<proc1d>,<TOPSPIN 2.1>,
      <abs ABSG = 5 
       data hash MD5: 32K
       8F 1E 99 27 4C 90 B9 BD 0A CC 04 FF E4 C8 AA BC>)
$$ ##END=
$$ 
$$ $$ hash MD5
$$ $$ 95 80 59 DC AB 73 69 B3 34 1C 58 0D 53 DD 10 38
##$RELAX= 
##$RELAX= 
##$RELAX= 
##$RELAX= 
##$RELAX= 
##$RELAX= 
##$RELAX= 
$$ Bruker specific parameters
$$ --------------------------
$$ [...]
150 150 150 150 150 150 150 150
##$TP07= 0
##$TPNAME0= <>
##$TPNAME1= <>
##$TPNAME2= <>
##$TPNAME3= <>
##$TPNAME4= <>
##$TPNAME5= <>
##$TPNAME6= <>
##$TPNAME7= <>
##$TPOAL= (0..7)
0.5 0.5 0.5 0.5 0.5 0.5 0.5 0.5
##$TPOFFS= (0..7)
0 0 0 0 0 0 0 0
##$TUNHIN= 0
##$TUNHOUT= 0
##$TUNXOUT= 0
##$USERA1= <user>
##$USERA2= <user>
##$USERA3= <user>
##$USERA4= <user>
##$USERA5= <user>
##$V9= 5
##$VALIST= <valist>
##$VCLIST= <CCCCCCCCCCCCCCC>
##$VD= 0
##$VDLIST= <DDDDDDDDDDDDDDD>
##$VPLIST= <PPPPPPPPPPPPPPP>
##$VTLIST= <TTTTTTTTTTTTTTT>
##$WBST= 2048
##$WBSW= 25
##$XGAIN= (0..3)
0 0 0 0
##$XL= 0
##$YL= 0
##$YMAX_a= 538430
##$YMIN_a= -636842
##$ZGOPTNS= <>
##$ZL1= 120
##$ZL2= 120
##$ZL3= 120
##$ZL4= 120
##$ABSF1= 14.98061
##$ABSF2= -5.57192
##$ABSG= 5
##$ABSL= 3
##$ALPHA= 0
##$AQORDER= 0
##$ASSFAC= 0
##$ASSFACI= 0
##$ASSFACX= 0
##$ASSWID= 0
##$AUNMP= <proc_prof1d_extract_pilot.lims>
##$AXLEFT= 0
##$AXNAME= <>
##$AXNUC= <1H>
##$AXRIGHT= 0
##$AXTYPE= 0
##$AXUNIT= <>
##$AZFE= 0.1
##$AZFW= 0.1
##$BCFW= 0
##$BC_mod= 0
##$BYTORDP= 0
##$COROFFS= 0
##$CY= 15
##$DATMOD= 1
##$DC= 0
##$DFILT= <>
##$DTYPP= 0
##$F1P= 0
##$F2P= 0
##$FCOR= 0.5
##$FTSIZE= 32768
##$FT_mod= 6
##$GAMMA= 0
##$GB= 0
##$INTBC= 1
##$INTSCL= 1
##$ISEN= 128
##$LB= 0
##$LEV0= 0
##$LPBIN= 0
##$MAXI= 10000
##$MC2= 0
##$MEAN= 0
##$ME_mod= 0
##$MI= 0
##$NCOEF= 0
##$NC_proc= -8
##$NLEV= 6
##$NOISF1= 0
##$NOISF2= 0
##$NSP= 0
##$NTH_PI= 0
##$NZP= 0
##$OFFSET= 14.98061
##$PC= 1
##$PHC0= 214.8322
##$PHC1= 0
##$PH_mod= 1
##$PKNL= yes
##$PPARMOD= 0
##$PPDIAG= 0
##$PPIPTYP= 0
##$PPMPNUM= 2147483647
##$PPRESOL= 1
##$PSCAL= 4
##$PSIGN= 0
##$PYNMP= <proc.py>
##$REVERSE= no
##$SF= 400.13
##$SI= 32768
##$SIGF1= 0
##$SIGF2= 0
##$SINO= 400
##$SIOLD= 32768
##$SPECTYP= <>
##$SREGLST= <1H.CDCl3>
##$SSB= 0
##$STSI= 32768
##$STSR= 0
##$SW_p= 8223.68421052632
##$SYMM= 0
##$S_DEV= 0
##$TDeff= 65536
##$TDoff= 0
##$TI= <>
##$TILT= no
##$TM1= 0
##$TM2= 0
##$TOPLEV= 0
##$USERP1= <user>
##$USERP2= <user>
##$USERP3= <user>
##$USERP4= <user>
##$USERP5= <user>
##$WDW= 1
##$XDIM= 32768
##$YMAX_p= 455472855
##$YMIN_p= -671755
##$CURPLOT= <Network HP LaserJet P1505>
##$CURPRIN= <$Network HP LaserJet P1505>
##$DFORMAT= <normdp>
##$LAYOUT= <+/1D_H.xwp>
##$LFORMAT= <normlp>
##$PFORMAT= <normpl>
##$SURQMSG= 1
$$ End of Bruker specific parameters
$$ ---------------------------------
##NTUPLES= NMR SPECTRUM
##VAR_NAME=  FREQUENCY,     SPECTRUM/REAL,   SPECTRUM/IMAG
##SYMBOL=    X,             R,               I
##VAR_TYPE=  INDEPENDENT,   DEPENDENT,       DEPENDENT
##VAR_FORM=  AFFN,          ASDF,            ASDF
##VAR_DIM=   32768,         32768,           32768
##UNITS=     HZ,            ARBITRARY UNITS, ARBITRARY UNITS
##FACTOR=    0.250966925370066, 1,           1
##FIRST=     8223.43324360095, -160078,      -263618
##LAST=      0,             79374,           -25357
##MIN=       0,             -671755,         0
##MAX=       8223.43324360095, 455472855,    0
$$ Real data points
##PAGE= N=1
##DATA TABLE= (X++(R..R)), XYDATA
$$ [...]
$$ plain form
19526 181983 -123702 -5242 -57248 -14433 191436 36293 171870 -236608 -242656 -173451 -100200
19515 -100200 -396646 -51884 -91135 -323999 -150349 392778 -115904 -193117 -151875 -4576 36303
19503 116527 -6814 -69573 178324 107856 -14819 76389 -102602 -126194 -196350 72681 -70898
19491 -168071 211402 19993 -68567 -164899 -44650 -166476 -131926 -53329 -106114 26616 147059
19480 147059 -138673 -299564 -111296 17490 -79625 -9961 11515 145526 -163212 172693
19469 196902 47991 -46442 -37425 64867 -397316 -325208 -86897 21116 76941 -114269 -272730
19458 -272730 -103692 288572 -119945 -123849 -79373 -13434 -369230 34645 -107862 3868 -88666
19446 142303 7418 125971 -260790 -49097 -164725 -229188 308268 119054 35937 -142010
$$ packed form
19526A81983a23702e242n2006a4433A91436C6293J35577b36608o048O9205P3251
19515a00200k96446e1884l9251k32864a50349C92778a15904p7213M1242d576C6303
19503A16527f814o2759A78324p0468a4819G6389a02602k3592p0156G2681g0898
19491a68071B11402A9993f8567r6332d4650j21826L4550e3329n2785B6616J20443
19480A47059a38673j60891a11296A7490g9625i961A1515J34011a63212A72693
19469A96902D7991d6442R017F4867c97316P2108h6897B1116N5825a14269j58461
19458b72730a03692B88572a19945l904M4476a3434l55796C4645a07862C868h8666
19446A42303G418J18553b60790d9097j15628o4463C08268A19054C5937a42010
$$ plain form
19435 -53815 221345 -52628 -145282 -249839 -208372 -86280 -365687 158736 -254307 -226131 -285316
19424 -285316 121055 -107889 86451 -314873 92790 -411001 -101789 200801 128339 -122128
19413 -17700 -119963 186639 166135 -122420 74137 -233013 21247 -160666 -26855 114493
19402 449 -188624 -77256 -216924 -204716 -21034 -172080 220599 -29551 -224185 -443911 -108580
19390 43746 70161 180212 13849 -8567 -126330 -31050 58403 -192040 -204948 -86148 -196191
19379 -196191 -189904 -72560 -140376 -157452 -345476 -160427 -172179 -96992 87411 -182221 124338
19367 162191 121863 -195812 -301535 -30161 61940 -86819 -33351 -81408 -248146 -53332 -281687
19356 -281687 50185 -179253 65434 76999 -281638 -932 60681 7814 16192 -299646 -108038
$$ packed form
19435e3815B21345e2628r2654j04557M1467h6280k79407A58736b54307K8176n9185
19424b85316A21055a07889H6451c14873I2790d11001a01789B00801p2462a22128
19413a7700j02263A86639k0504a22420G4137b33013B1247a60666b6855A14493
19402D49a88624g7256j39668J2208b1034j51046B20599b9551j94634k19726a08580
19390D3746K6415J10051A3849h567j17763c1050E8403a92040j2908h6148j10043
19379a96191O287g2560o7816j7076j88024a60427j1752P5187H7411a82221A24338
19367A62191m0328a95812j05723c0161F1940h6819c3351m8057j66738e3332k28355
19356b81687E0185a79253F5434J1565b81638i32F0681G814Q378b99646a08038
$$ plain form
19344 -90766 -117426 -176432 -299911 194827 143874 -113880 -207392 25130 266229 -121648 145398
19332 127376 -132603 -78223 -44687 -130158 -112384 -175539 422647 -2853 67119 27961 29732
19321 29732 -205207 197222 -57209 182331 -48000 -9092 -161000 39946 290546 77478 152356
19310 152356 -68553 -161284 1744 163577 -436718 -38463 -74892 -181026 -159430 46069 113110
19299 113110 -115035 -138979 277663 -6519 126195 -126540 82139 -79358 -103782 -8406 -251920
19288 -251920 9362 320658 284054 -120419 -179102 -136847 -103196 -176129 -366166 -116317 -413822
19277 -413822 59518 36091 -24724 -4506 -49749 -132519 -173776 90302 -286158 -347967 -397195
19266 -397195 8735 -122740 -277178 -32526 -147720 77503 -60970 -22269 -52924 -17771 -45056
$$ packed form
19344i0766k6660n9006j23479A94827n0953a13880r3512B5130K41099a21648A45398
19332A27376a32603N4380L3536q5471J7774o3155D22647b853F7119B7961J771
19321B9732b05207A97222e7209A82331d8000i092j51908C9946K50600G7478P4878
19310A52356f8553r2731A744J61833d36718c8463l6429j06134K1596D6069O7041
19299A13110a15035k3944B77663f519A26195a26540H2139g9358k4424h406k43514
19288b51920I362L11296l6604a20419n8683M2255L3651p2933j90037a16317k97505
19277d13822E9518k3427b4724d506m5243q2770m1257I0302b86158o1809m9228
19266c97195H735a22740j54438c2526j15194G7503f0970b2269l0655a7771k7285
$$ plain form
19255 -45056 -105118 110455 100212 148264 -31343 -174971 138389 -111806 84515 -281774 -17789
19243 -36021 -226429 19901 -216372 -255680 -251509 -71768 -192725 -50885 243742 -52925 -134268
19232 -134268 -31472 54077 -90523 278367 -200622 -240353 78718 -458853 -205797 5051 -203112
19220 -51311 -244332 -214202 -10305 -112183 -111844 -138471 -84860 130108 -40926 -50053 -7854 202334
19207 194721 160302 31164 232217 109386 -41634 180737 -266742 -49038 -128149 -70224 32656
19195 110678 -349972 -12691 -376010 -76335 -102318 268829 -145001 -101707 -282300 -218453
19185 -218453 132841 -148334 -23401 130173 -580874 -105463 148972 -456269 -778 -293149
19175 -293149 118210 130170 12821 -343567 -122503 78167 -115293 -41910 -108088 -273465
$$ packed form
19255d5056o0062A10455j0243M8052c1343j43628A38389a11806H4515b81774a7789
19243c6021j90408A9901b16372l9308M171g1768j20957e0885B43742e2925q1343
19232a34268c1472E4077i0523B78367b00622l9731G8718d58853b05797E051b03112
19220e1311j93021L0130a0305j01878L39k6627N3611A30108d0926r127g854B02334
19207A94721l4419C1164K01053A09386d1634A80737b66742d9038p9111N7925C2656
19195A10678c49972a2691l63319g6335k5983B68829a45001M3294j80593O3847
19185b18453A32841a48334b3401A30173e80874a05463A48972d56269g78k92371
19175b93149A18210J1960A2821c43567a22503G8167a15293d1910o6178j65377
$$ plain form
19165 -273465 346189 -24239 313785 5112 212938 -283700 -71402 -194087 334748 -79801
19154 -331205 -128850 -136927 174750 1006 17839 -57903 -251466 128693 -36175 323490 -74775
19142 -301451 75441 -136465 -51784 -149572 200191 50171 -160324 -63232 -67115 -74769 -131431
19131 -131431 67338 52479 -280854 -271064 -198038 -139670 63279 -313438 104232 -181637 91890
19119 238005 62957 37659 -218945 -162029 -252054 -220656 -83896 -174040 -116437 -37486 -87852
19108 -87852 11302 111679 195395 84881 252272 -66797 -81219 86292 133538 174204 -211036
19096 98259 -555430 -270764 153005 -122501 -177850 160934 -85210 -101241 40783 123417 -100455
19084 -104977 -105931 -47780 198559 -59023 54985 75719 -149478 15607 -19612 -338295 149667
$$ packed form
19165b73465C46189b4239C13785E112K07826b83700g1402j22685C34748g9801
19154c31205a28850q077A74750A006J6833e7903j93563A28693c6175C23490g4775
19142c01451G5441a36465e1784r7788B00191E0171a60324f3232l883p654n6662
19131a31431F7338j4859b80854R790P3026N8368F3279c13438A04232a81637I1890
19119B38005F2957k5298b18945N6916r0025L1398h3896r0144N7603c7486n0366
19108h7852A1302J00377Q3716H4881J67391f6797j4422H6292M7246M0666b11036
19096I8259e55430b70764A53005a22501n5349A60934h5210j6031D0783Q2634a00455
19084a04977r54d7780A98559e9023E4985K0734a49478A5607a9612l18683A49667
$$ plain form
19072 76010 60248 -238555 37840 47499 -77904 53434 -403348 -272662 36720 -339590 67380
19060 -221443 -127767 -184477 462 -283190 -251639 36227 -17117 -183308 204634 -47494 -61137
19049 -61137 -337108 -27062 183325 -113016 82623 191938 -156124 213761 -167178 105557
19038 160476 -41392 -98759 -44606 -97153 67343 -137139 -154159 -126122 -49329 9270 251488
19027 251488 101049 -206216 -102247 -150834 -148748 -233733 375 27304 228720 -30262 193646
19015 -124406 292908 220354 -49909 -58373 -244045 -343625 -266679 -213766 251280 58439 -193391
19003 125975 -127849 68326 -312925 -172634 -169280 18638 125259 208749 13841 45082 -126138
18991 217175 222937 47203 -308822 81298 -54260 -155686 31835 149385 64519 -325500 207636
$$ packed form
19072G6010j5762b38555C7840R659g7904E3434d03348J30686C6720c39590F7380
19060b21443R3676n6710D62b83190L1551C6227a7117j66191B04634d7494j3643
19049f1137k75971b7062A83325a13016H2623J09315a56124B13761a67178A05557
19038A60476d1392n7367d4606n2547F7343a37139j7020K8037d9329I270K42218
19027B51488A01049b06216a02247m8587K086q4985C75K6929K01416c0262A93646
19015a24406B92908p2554d9909q464j85672r9580P6946N2913B51280E8439a93391
19003A25975a27849F8326c12925J40291L354A8638J06621Q3490A3841L1241a26138
18991B17175N762D7203c08822H1298e4260j01426C1835J17550F4519c25500B07636
$$ plain form
18979 -38809 147236 22141 157273 34370 78363 90976 -63975 66195 -255078 377251 -52849
18967 102342 -213869 -137307 3526 -79962 -157255 -311044 -127344 -104285 -163785 -209110 56122
18955 156173 -18504 -148643 -305775 -264632 238259 -93880 -229697 2699 -176068 52501 465614
18944 465614 -35495 422 112034 99268 -273550 -95351 86614 118717 261619 88017 183687
18933 183687 -224071 -263415 54651 -46066 -79433 40422 -193252 -199403 71412 -27226 -153161
18922 -153161 103080 115644 -580 -16130 -75029 -288863 -58141 -163251 -61479 49097 107482
18911 107482 -6209 83420 88004 -450260 -274611 -47166 46371 196744 162370 -338273 153525
18899 -258472 65541 32832 81650 -110018 -338165 -181810 114145 -285097 -225446 -183506
$$ packed form
18979c8809A47236B2141J35132C4370M3993J2613f3975F6195b55078C77251e2849
18967A02342b13869P6562C526g9962p7293j53789a27344K3059n9500m5325E6122
18955A56173a8504j30139j57132M1143B38259i3880j35817B699a76068E2501M13113
18944D65614c5495D22J11612j2766b73550i5351H6614L2103J42902H8017R5670
18933A83687b24071l9344E4651d6066l3367D0422a93252o151G1412b7226j25935
18922a53161A03080J2564e80j5550n8899k13834e8141j05110f1479D9097N8385
18911A07482f209H3420M584d50260J75649d7166D6371J50373l4374c38273A53525
18899b58472F5541l2709M8818a10018k28147J56355A14145b85097N9651M1940
$$ plain form
18889 -183506 31816 411837 98079 -37462 -89124 -130688 -303570 39520 -189290 -146881 275279
18877 191289 -15120 124216 84210 -28836 -190429 -257512 66992 -246491 15973 -172376 -67871
18865 -261861 -158035 18128 63058 181517 -17300 154458 -39964 -90348 199326 79644 -35361
18853 -59456 -57576 36318 200761 -79549 -107132 -29686 -185444 -122165 -3111 4036 -421121 54255
18840 -77923 -53658 146566 -44619 -122984 39250 -164541 146393 -83494 -399518 -41315 -67683
18829 -67683 70614 -253783 -152006 -23768 -169204 -65668 174094 -25760 76856 -35181 -57419
18818 -57419 -123937 -94064 73337 50315 -207346 286876 -131003 -28823 -16673 -207722 11934
18806 82109 223058 -195268 5299 42973 354612 264928 407147 210315 284955 -46169 68411
$$ packed form
18889a83506C1816L80021I8079c7462n1662m1564j72882C9520a89290M2409B75279
18877A91289a5120A24216m0006b8836j61593o7083F6992b46491A5973a72376f7871
18865b61861J03826A8128M4930J18459a7300A54458c9964n0384A99326G9644c5361
18853e9456J880C6318J64443g9549k7583b9686j55758O3279c111D036d21121E4255
18840g7923K4265A46566d4619p8365C9250a64541A46393h3494l16024d1315k6368
18829f7683G0614b53783J01777b3768j45436f5668A74094b5760G6856c5181k2238
18818e7419o6518K9873G3337k3022b07346B86876a31003b8823J2150j91049A1934
18806H2109J40949a95268E299L7674L11639q9684J42219j96832P4640d6169F8411
$$ plain form
18794 -10654 -11390 -22565 -265199 -15606 -299224 -322903 -126440 171793 35023 21900 4489
18782 -60448 -194469 -282118 173680 107483 -306176 -29340 -59699 -297269 -166414 138742
18771 -151208 -88144 -143371 17588 -60623 -131937 306553 -112011 43727 -182444 -198499 -212587
18760 -212587 -194214 -65087 -2914 -71189 -104428 -156757 86244 -70126 207496 47657 -390550
18748 -71420 83205 -85236 -88298 -89850 -158958 102836 102918 -274474 -109436 -55408 52418 -276336
18735 -446948 20509 -329699 4279 155507 261852 -281287 -171856 262504 -149776 13720
18724 -264882 -90273 -164471 28757 -115463 -289755 -346678 -276965 -145650 -116304 243677 -39085
18712 -238381 145623 193643 -9939 315808 160861 -397881 -325132 -308923 64613 190762 -124388
$$ packed form
18794a0654p36j1175k42634a5606k83618k3679a26440A71793C5023j3123D489
18782f0448j34021q7649A73680o6197c06176b9340l0359k37570J30855A38742
18771a51208O3064n5227A7588f0623p1314C06553a12011D3727a82444j6055j4088
18760b12587J8373f5087b914o8275l3239n2329H6244g0126B07496D7657c90550
18748g1420H3205h5236l062j552o9108A02836Q2b74474a09436N4028E2418b76336
18735d46948B0509c29699D279J51228J06345b81287J09431B62504a49776A3720
18724b64882i0273p4198B8757a15463j74292n6923O9713J31315K9346B43677c9085
18712b38381A45623M8020i939C15808j54947c97881P2749J6209F4613J26149a24388
$$ plain form
18700 117293 -218712 26943 161289 1668 -267052 -64428 -101508 -478982 -54426 -155580 -256106
18689 -256106 44025 -100596 221739 -143087 13182 57210 212176 -308631 236655 -249550
18678 -1574 -268308 -219165 -568751 -171535 31892 -72082 244719 41655 -291715 -306181 205159
18666 133350 86638 -233011 -47968 79836 -76888 282666 -9247 -223790 25442 -347865 -246872
18655 -246872 83529 -95868 33525 165127 -785 -169279 26166 -2881 -85374 -294614 31399
18643 54337 -386521 37637 91285 7943 -297749 -230291 -177968 130089 -201854 -151738 -240136
18632 -240136 28985 -28551 -139960 -54793 113918 -221719 235268 128892 -251406 -367853
18622 -367853 -238430 -188326 -84556 163091 -64088 25446 -91865 -122 22866 -197693 20375
$$ packed form
18700A17293b18712B6943J34346A668b67052f4428l7080l77474e4426j01154j00526
18689b56106D4025a00596B21739a43087A3182M4028J54966c08631B36655b49550
18678a574k66734M9143l49586a71535C1892g2082B44719D1655b91715j4466B05159
18666A33350m6712b33011d7968G9836g6888B82666i247k14543B5442c47865J00993
18655b46872H3529i5868C3525J31602g85j68494B6166b881q2493k09240C1399
18643E4337c86521C7637N3648G943b97749O7458N2323A30089b01854N0116q8398
18632b40136B8985b8551j11409e4793A13918b21719B35268j06376b51406j16447
18622c67853J29423N0104h4556A63091f4088B5446i1865a22B2866a97693B0375
$$ plain form
18610 -340441 -330448 33366 -63551 297624 -49657 80584 -258014 -195897 -212288 30035 -258831
18598 40732 -182357 -74388 22001 -239110 99155 143677 65060 -42215 7570 -234658 -112404
18586 -73396 56871 -296721 -233798 -270208 -126120 -44067 -149668 -30596 -204127 -225210 -84478
18574 -57725 -340462 -252981 157499 248294 -90115 -188047 58763 20263 21141 17979 57115 -456510
18561 117454 195334 -73509 -142787 -161102 264829 -472905 15580 -316650 -68714 173741 -291016
18549 -77588 15565 -103045 -36780 -137931 -95184 -109901 244101 186425 -52958 132099 -113789
18537 -185550 376409 -48858 -360908 -99934 15460 90852 -54142 -46076 22224 -48544 105628
18525 46350 -226451 -361881 -169922 23823 -215610 -44812 -190434 -169939 86282 -181224
$$ packed form
18610c40441R993C3366f3551B97624d9657H0584b58014O2117j6391C0035b58831
18598D0732a82357g4388B2001b39110I9155M4522F5060d2215G570b34658a12404
18586g3396E6871b96721O2923l6410a26120d4067j05601c0596j73531k1083h4478
18574e7725k82737Q7481A57499R0795i0115r7932E8763B0263Q78l162L9136d56510
18561A17454P7880g3509o9278j8315B64829d72905A5580c16650f8714A73741b91016
18549g7588A5565a03045c6780j01151M2747j4717B44101n7676e2958A32099a13789
18537a85550C76409d8858l12050i9934A5460P5392e4142Q066B2224d8544A05628
18525D6350b26451j35430a69922B3823b15610d4812j45622K0495H6282a81224
$$ plain form
18514 -322379 -105335 -20645 89613 212589 177981 -142322 -203519 2243 86242 117290 -176105
18502 -106282 52702 30832 11405 142877 -181459 -167287 157571 74589 55041 106233 -79038
18490 117598 -31067 -265617 -93097 -166269 -143096 25476 -109609 47904 -455552 -234467 -267689
18479 -267689 96967 238324 195822 131971 348559 82507 -27636 -308497 -107170 141290
18468 -132762 325757 198740 -304454 -120152 -52064 270829 -260168 334611 -48302 64648
18457 -213597 -8165 148148 -2357 -5622 -90552 -226594 204877 -244746 10050 35833 -40456
18445 425755 -151668 -136675 -313145 -32444 -176708 44816 49557 -25153 -39496 166668 -89640
18433 -168034 -103650 -72811 -171442 -254468 175484 9231 -41047 -226484 207273 -181576 88084
$$ packed form
18514c22379a05335b0645H9613J22976l4608a42322o1197B243Q3999L1048a76105
18502a06282E2702k1870A1405J31472a81459J4172A57571G4589j9548N1192g9038
18490A17598c1067k34550i3097p3172K3173B5476a09609D7904d55552K21085l3222
18479b67689I6967J41357m2502o3851K16588H2507b7636k80861a07170A41290
18468a32762C25757j27017c04454a20152e2064B70829b60168C34611d8302F4648
18457b13597h165A48148b357l265q4930j36042B04877b44746A0050K5783d0456
18445D25755a51668J4993j76470c2444j44264D4816M741b5153j4343A66668h9640
18433a68034O4384L0839r8631q3026A75484I231d1047j85437B07273a81576H8084
$$ plain form
18421 1742 166690 92169 -216179 239283 274409 -16387 -16863 -208861 -359968 -61190 -70575
18410 -70575 -89380 -121269 65379 616634 -53408 -126559 156856 -12210 -138221 359360 -60870
18398 168737 -150353 -282826 63724 260294 -201924 -84435 323335 101274 56505 80429
18388 80429 -218447 -148984 90400 107675 -227140 -81931 114491 69001 125378 -257919 -38452
18376 -267114 -224160 -226959 48599 -67524 -13533 -268391 35643 -133073 -288929 -164129 -275911
18365 -275911 -321519 265164 129965 -29413 27105 -63521 -76802 224791 58334 -271625 -96725
18353 -146863 140520 166372 139086 295829 -238468 131205 -34946 -13174 -219346 66738
18342 146013 -179623 -273490 -362331 179296 -129228 -105507 289157 136251 -226197 -170329
$$ packed form
18421A742J64948p4521b16179B39283L5126a6387m76j91998j51107f1190r385
18410g0575j8805l1889F5379N51255e3408p3151A56856a2210j26011C59360f0870
18398A68737a50353j32473F3724J96570b01924h4435C23335A01274m4769K3924
18388H0429b18447O9463I0400J7275b27140h1931A14491m5490N6377b57919c8452
18376b67114M2954k799D8599f7524a3533k54858C5643a33073j55856J24800j11782
18365b75911m5608B65164A29965b9413B7105f3521j3281B24791E8334b71625i6725
18353a46863A40520K5852k7286J56743b38468A31205c4946a3174k06172F6738
18342A46013a79623r3867q8841A79296a29228K3721B89157A36251b26197N5868
$$ plain form
18332 -170329 -334791 4554 19513 -64901 -221773 23864 -140737 -193398 -100032 318948 -116002
18320 -389491 -157057 -249546 -187150 -9311 83860 -33057 155235 113385 -329609 44553 -99573
18308 -94272 -153434 -11305 153502 -75245 -5458 67543 78885 -74003 49252 -65948 85452 123200
18296 123200 158899 75107 -165484 -188519 30419 79272 -239593 -109588 -12400 39892 217894
18285 217894 -16637 -147472 -154555 62453 -29474 314744 23711 -244218 146793 146975 40038
18273 -135901 18510 35847 19187 16780 -120087 -74574 61555 33159 -47668 -218215 211649
18261 -69406 5519 230355 -137806 233478 49678 -271669 235087 155775 -8665 -35040 -174609
18250 -174609 50226 -112196 -160695 -12945 -311807 -143013 -2015 -438823 -18514 -117854 70182
$$ packed form
18332a70329j64462D554J4959f4901j56872B3864a40737n2661R3366C18948a16002
18320c89491a57057r2489O2396i311H3860c3057A55235m1850c29609D4553i9573
18308i4272n9162a1305A53502g5245e458F7543J1342g4003D9252f5948H5452L7748
18296A23200L5699G5107a65484k3035C0419M8853b39593a09588a2400C9892J78002
18285B17894a6637j30835p083F2453b9474C14744B3711b44218A46793J82D0038
18273a35901A8510J7337j6660k407a20087M5513F1555k8396d7668j70547B11649
18261f9406E519K24836a37806B33478D9678b71669B35087p9312h665k6375j39569
18250a74609E0226a12196m8499a2945k98862a43013b015m36808a8514r9340G0182
$$ plain form
18238 -328940 -240862 39451 -198284 -112154 216895 -405254 -8158 67484 6942 -66390 -424885
18227 -424885 -5825 209638 -203156 -292831 -244101 -164635 -403706 84913 122166 274951 165617
18216 165617 -335593 -72374 -84747 -160292 -218034 -83856 -44792 50841 -274892 -16024 -79418
18205 -79418 20005 -226007 -97209 -188491 -314560 224124 -21222 -369493 -145052 87269 193997
18194 193997 137059 -30991 -50358 -96614 -163255 -10882 -7016 -46410 427848 208877 -30186
18182 13075 114057 43759 -110864 -420224 95630 69932 -179003 -169406 -172973 -427957 -157964
18170 -434008 -263748 -64732 -37312 222097 -282723 114030 -213404 -79501 213022 -375856
18159 176493 68041 110840 -71453 145635 90289 137820 -276907 -176706 -146526 -84801 -107941
$$ packed form
18238c28940Q8078C9451a98284Q6130B16895d05254h158F7484F942f6390l58495
18227d24885e825B09638b03156q9675M8730P9466k39071H4913L7253J52785j09334
18216A65617c35593g2374j2373p5545n7742h3856L9064E0841b74892a6024o3394
18205g9418B0005b26007i7209r1282j26069B24124b1222l48271a45052H7269J06728
18194A93997n6938c0991j9367m6256o6641a0882L866l9394D27848B08877c0186
18182A3075J00982D3759a10864l09360I5630k5698a79003R597l567k54984a57964
18170d34008J70260f4732K7420B22097b82723A14030b13404g9501B13022c75856
18159A76493F8041M2799g1453A45635n5346M7531b76907J00201L0180O1725k3140
$$ plain form
18148 -107941 57941 283861 225106 -141584 -200702 -28731 -176326 -203235 -1599 -105330 17546
18136 21151 54041 121203 -121310 111150 221655 11498 7037 139131 176111 -131122 47222
18124 125797 -252705 -5056 -44540 232141 132929 -322981 -101763 -125619 -203629 -37430 -304846
18113 -304846 253028 -10461 70413 -23621 118575 -13942 -94367 -219996 -111187 -187 71933
18101 26526 9671 79242 94384 -384983 230545 120607 53416 98121 -184456 47221 -272235
18089 -39178 -69588 -248101 141490 23749 98322 89960 -139008 -298718 -24870 193953 -152196
18077 -192024 20054 227271 139290 -105904 -190452 -260645 103374 -285582 -30265 158032
18066 20930 -121175 -15373 86800 -289462 -60514 139255 -88504 -59119 235635 -54821 30653
$$ packed form
18148a07941E7941K25920n8755a41584n9118b8731j47595k6909a599j03731A7546
18136B1151L2890O7162a21310A11150J10505A1498m461J32094L6980a31122D7222
18124A25797b52705e056l9484B32141r9212c22981a01763k3856p8010c7430k67416
18113c04846B53028a0461G0413b3621A18575a3942q0425j25629J08809a87G1933
18101B6526I671O9571J5142c84983B30545j09938E3416M4705a84456D7221b72235
18089c9178l0410j78513A41490B3749P4573q362a39008j59710b4870A93953a52196
18077a92024B0054K07217q7981a05904q4548p0193A03374b85582c0265A58032
18066B0930a21175a5373H6800b89462f0514A39255h8504K9385B35635e4821C0653
$$ plain form
18054 -122322 -76808 -146856 83293 -119024 116024 -183727 -133781 130498 -50584 -140122 237923
18042 -429919 -137484 114011 149367 103844 213173 -8065 23508 -475402 74819 113498 275532
18031 275532 -187017 144016 114203 156800 -81090 -141129 -287187 -213804 26457 -26891 16431
18019 -351882 -126408 25312 -6770 -416855 -309583 130133 116764 64682 -46151 254994 140165
18008 140165 -132939 -146045 277369 -276930 -436998 161959 40891 -52585 131691 -141098
17997 227633 24564 131950 181931 -30055 -66466 -181312 220286 -52537 192855 156040 112599
17986 112599 22331 204910 40319 315797 -203902 74044 56574 -264413 74263 61791 46765
17975 46765 -162439 -116701 -60414 -70077 -172624 5889 98496 -59667 320209 -12219 -156520
$$ packed form
18054a22322M5514p0048H3293a19024A16024a83727M9946A30498e0584q9538B37923
18042d29919a37484A14011L5356m5523J09329h065B3508d75402G4819L8679J62034
18031B75532a87017A44016k9813M2597h1090o0039j46058P3383B6457b6891A6431
18019c51882a26408B5312f770m10085J07272A30133j3369n2082d6151B54994j14829
18008A40165a32939j3106B77369b76930j60068A61959D0891e2585A31691a41098
17997B27633B4564J07386M9981c0055l6411j14846B20286e2537A92855l6815m3441
17986A12599B2331J82579D0319K75478b03902G4044j7470b64413G4263j2472j5026
17975D6765a62439M5738N6287r663j02547E889R2607e9667C20209a2219j44301
$$ plain form
17964 -156520 214749 207071 -136309 115274 -82609 -65709 -133547 -99859 202683 -31366 -131857
17953 -131857 100817 -90476 8302 -139340 324968 -214097 -522214 155765 -19170 -105173
17943 -105173 -233263 317529 -148235 -197690 123202 -368976 276488 -154798 -139012 -102849
17933 -102849 -178092 -221780 -55190 234571 131355 -13304 -150391 -85506 -96436 -44652 -224244
17922 -224244 111581 -330959 25407 235892 -3991 -255091 -229733 71955 -412558 -243039
17912 -243039 -198650 97892 -127938 192553 -212408 23310 -123686 -69709 -285067 -17355
17901 266249 -141668 131593 -72647 -118546 289818 49767 254077 -192653 -394748 195421
17890 -379847 238968 30215 58962 9090 80610 225428 -84564 317445 -27689 81305 -34940
$$ packed form
17964a56520B14749p678a36309A15274h2609J6900o7838L3688B02683c1366j00491
17953a31857A00817i0476H302a39340C24968b14097l08117A55765a9170q6003
17943a05173j28090C17529a48235m9455A23202c68976B76488a54798J5786L6163
17933a02849p5243m3688e5190B34571j03216a3304j37087O4885j0930d4652j79592
17922b24244A11581c30959B5407K10485c991k51100K5358G1955d12558J69519
17912b43039M4389I7892a27938A92553b12408B3310a23686N3977k15358a7355
17901B66249a41668A31593g2647m5899B89818D9767K04310a92653k02095A95421
17890c79847B38968C0215K8747I090P1520J44818h4564C17445b7689H1305c4940
$$ plain form
17878 -485722 19548 -51394 -213778 57396 -358861 8192 -259257 54389 22225 72588 123402
17867 123402 -265498 303518 17494 73094 190777 17637 -204160 -254397 144771 53631
17856 -10614 310269 133647 -296509 186224 -138715 -35713 -89769 60989 47853 53071 71505
17845 71505 77345 99404 153357 -10779 22117 -159280 17478 97132 -355916 46249 -80419
17833 107218 87136 183327 90057 -135801 -104210 195414 81116 66422 190016 -204477 56649
17821 76662 -85119 -75621 -183854 -11889 81151 246137 -239226 487479 -79630 86266 164521
17810 164521 -61919 19071 52057 119991 21557 -451021 -175198 -335297 -229207 -21990 -56632
17799 -56632 150136 -56541 181768 -75885 116281 -21492 109106 306824 -16882 71198 165224
$$ packed form
17878d85722A9548e1394j62384E7396c58861H192b59257E4389B2225N0363N0814
17867A23402b65498C03518A7494N5600J17683A7637b04160n0237A44771E3631
17856a0614C10269A33647b96509A86224a38715c5713n4056F0989j3136N218J8434
17845G1505N840K2059N3953a0779B2117a59280A7478P9654c55916D6249h0419
17833A07218k0082R6191I0057a35801L1591A95414H1116j4694J23594b04477E6649
17821G6662h5119R498j08233a1889H1151J64986b39226D87479g9630H6266P8255
17810A64521f1919A9071L2986O7934B1557d51021a75198j60099J06090b1990l4642
17799e6632A50136e6541A81768g5885A16281b1492A09106J97718a6882G1198R4026
$$ plain form
17788 165224 -1090 254297 283769 302915 160500 -77947 -164790 -135952 -113754 -2309 212592
17776 263669 -123150 160852 363931 -291375 184108 -38807 -65719 66211 90203 -182589
17765 126 -15621 139592 49306 148205 -148063 -211 -234478 -218082 247995 8072 257497 -7463
17752 -41979 15041 -75889 65733 41335 66308 328327 221605 183809 307916 -207835 200623
17740 -85794 137007 -130592 -177030 -134202 26206 -52469 187163 -56682 131262 44569 78750
17729 78750 -54951 146941 -184228 -181004 -50800 -243062 -29264 10556 -53176 201885 68385
17717 131189 264471 79161 -450640 -99526 190172 -10974 -67859 -409870 484229 -24408
17706 172852 50478 -34801 146200 -75888 164115 -328769 -222077 -38681 14232 34107 4389
$$ packed form
17788A65224a090B54297K9472J9146j42415g7947q6843K8838K2198b309B12592
17776B63669a23150A60852K03079b91375A84108c8807k6912F6211K3992a82589
17765A26a5621A39592D9306R8899a48063b11k34267J6396B47995H072K49425g463
17752d1979A5041g5889F5733k4398K4973K62019j06722l7796J24107b07835B00623
17740h5794A37007a30592m6438M2828B6206e2469A87163e6682A31262D4569L4181
17729G8750e4951A46941a84228L224e0800j92262b9264A0556e3176B01885F8385
17717A31189J33282G9161d50640i9526A90172a0974n6885l42011D84229b4408
17706A72852E0478c4801A46200g5888A64115c28769J06692c8681A4232J9875D389
$$ plain form
17694 -176536 359296 50095 -73556 -208852 -49112 -224705 56868 182334 181353 39945 5922
17682 -16990 212716 164816 -104895 -100062 27439 119545 146553 -121005 76457 84171 152866
17671 152866 169048 -153929 -124023 82189 -116088 206685 -3837 -50008 -344012 -267149 40298
17659 -44724 163854 -247972 -32184 -301307 -265011 -96981 146883 172608 22655 -209978 -93510
17647 142723 -87655 241214 -2892 299456 -216828 11847 68992 336934 6202 -26380 49918
17635 -185183 -5760 106464 155349 69032 232533 -27520 110891 108203 139725 225629 270691
17624 270691 313800 157231 -236195 -128747 -116030 128112 324343 216852 89587 1743
17613 -110390 220757 47104 -13454 -135003 82100 -10776 -148950 -192310 339665 -33953 274281
$$ packed form
17694a76536C59296E0095g3556j35296d9112j75593E6868J25466r81C9945E922
17682a6990B12716m7900a04895M833B7439R2106K7008a21005G6457P714O8695
17671A52866J6182a53929K9906H2189a16088B06685c837m6171k94004P6863D0298
17659d4724A63854b47972c2184k69123L6296i6981A46883K5725B2655b09978i3510
17647A42723h7655B41214b892B99456b16828A1847N7145K67942F202b6380D9918
17635a85183e760A06464M8885F9032J63501b7520A10891k688L1522Q5904M5062
17624B70691M3109j56569b36195J07448J2717A28112J96231j07491H9587A743
17613a10390B20757D7104a3454j21549H2100a0776j38174m3360C39665c3953B74281
$$ plain form
17601 -183190 -264191 -83336 51028 274320 18416 -186704 -74617 73970 4669 166922 350824
17590 350824 28890 113042 -118226 148044 -107038 28679 225579 -264163 34705 44369 -268078
17578 -165618 -27712 -146085 132570 -16641 71641 160175 139962 39382 38425 430660 88518
17566 448703 -278987 281568 -82993 77740 130841 -16856 117 222309 6851 87238 14567
17554 181346 228188 -71224 99194 166117 188491 -358715 55272 97152 -55525 -4676 204549
17542 72428 203968 -139018 58780 52265 184001 133321 170812 -159849 260953 31772 99823
17531 99823 206873 -247551 92240 -306290 146791 -54291 100850 -18975 -144192 35831
17520 -11064 -190355 210181 -89823 122454 -103153 135814 -137842 164622 162966 89476
$$ packed form
17601a83190q1001h3336E1028K23292A8416a86704g4617G3970D669J62253J83902
17590C50824B8890Q4152a18226A48044a07038B8679J96900b64163C4705R664b68078
17578a65618b7712j18373A32570a6641G1641Q8534k0213C9382r57L92235H8518
17566D48703b78987B81568h2993G7740N3101a6856A17K22192F851Q0387A4567
17554A81346M6842g1224I9194O6923K2374c58715E5272M1880e5525d676B04549
17542G2428J31540a39018E8780o515J31736n0680L7491a59849B60953C1772O8051
17531I9823J07050b47551I2240c06290A46791e4291A00850a8975j25217C5831
17520a1064j79291B10181h9823A22454a03153A35814a37842A64622j656p3490
$$ plain form
17510 89476 -231083 259700 173036 209398 -103899 168797 -195624 115278 -321834 -61953
17499 110212 -80293 -75556 -206298 58666 -26342 -219354 -4882 -34641 -20362 100462 -179286
17487 -113545 248241 212973 -143417 62621 260902 -85631 72609 -44146 155659 159660 341367
17476 341367 48913 41981 76538 73681 205940 54255 254746 176920 66633 216980 114405
17465 114405 149274 -71189 256667 124427 57443 34338 -405603 8506 129797 88743 281400
17454 281400 267558 189715 88115 475289 58325 -18048 93667 181369 167463 -18023 -339184
17443 -339184 211045 82779 -25348 99959 150317 40830 358015 158401 484731 169907
17432 170714 95607 341955 28624 413427 67587 203554 242939 145612 246517 5458 229269
$$ packed form
17510H9476b31083B59700q6664L6362a03899A68797a95624A15278c21834f1953
17499A10212h0293M737j30742E8666b6342j93012d882k9759J4279A00462a79286
17487a13545B48241l5268a43417F2621J98281h5631G2609d4146A55659M001J81707
17476C41367D8913o932L4557k857J32259E4255K00491p7826F6633J50347j02575
17465A14405L4869g1189B56667A24427E7443k3105d05603H506J21291m1054J92657
17454B81400j3842p7843H8115L87174E8325a8048I3667Q7702j3906a8023l21161
17443c39184B11045H2779b5348I9959N0358D0830L17185A58401L26330A69907
17432A70714p5107K46348B8624L84803F7587J35967L9385r7327J00905E458K23811
$$ plain form
17421 229269 -51069 -35765 219438 305869 414354 216511 409591 380488 425360 497116 124142
17409 62752 281549 153769 30912 162818 95180 235070 79153 45207 141383 245192 201174
17398 201174 312209 431430 360431 -101148 561070 -60346 357964 87071 274539 303800
17388 303800 134578 -336231 -3671 134425 371406 371520 63125 -113595 389025 46755 -81932
17376 -26291 -120182 2887 288258 195706 232912 195382 171979 74294 238948 212933 39347
17364 123053 210321 -91118 68404 -143859 405257 109694 -20309 70647 387439 63353 387524
17353 387524 53165 68863 387780 210057 157696 235542 -42690 18897 -177157 -117790 -239893
17342 -239893 -37148 444105 34199 205303 142779 10848 308306 242667 134896 310275
$$ packed form
17421B29269e1069J5304B19438Q6431J08485j97843J93080k9103M4872P1756A24142
17409F2752K18797j27780C0912J31906o7638J39890G9153l3946R6176J03809m4018
17398B01174J11035J19221p0999a01148E61070f0346C57964H7071J87468K9261
17388C03800A34578c36231c671A34425K36981J14F3125a13595C89025D6755h1932
17376b6291r3891B887K85371r2552L7206l7530k3403G4294J64654k6015C9347
17364A23053Q7268i1118F8404a43859D05257A09694b0309G0647L16792F3353L24171
17353C87524E3165J5698L18917j77723n2361P7846d2690A8897a77157N9367j22103
17342b39893c7148D44105C4199J71104o2524A0848K97458o5639j07771J75379
$$ plain form
17332 310275 53500 489106 17201 148855 274683 -142567 37735 157657 88321 -28161
17321 -12032 249609 156220 210497 -99627 178666 216575 159437 113590 -62486 238747 -41140
17309 355941 -38810 -81680 35782 -99634 205079 128676 375683 93454 -95646 6250 -90145
17297 75031 423150 -43188 40322 302877 235115 110035 569580 345827 -53445 -158021
17287 -158021 25223 335485 -177232 -31994 204844 59695 135974 80233 247844 416583
17277 416583 43600 63600 166287 447178 -49179 74625 216932 127695 44988 52275 209263
17266 209263 -15074 578235 -59606 202581 514543 101636 340132 91770 204882 -64123
17255 304052 185922 323622 422679 232147 75396 250664 -62800 179192 384386 -114241
$$ packed form
17332C10275E3500M35606A7201J31654J25828a42567C7735J19922o9336b8161
17321a2032B49609r3389N4277i9627A78666L7909n7138m5847f2486B38747d1140
17309C55941c8810m2870C5782i9634B05079p6403K47007I3454i5646F250i0145
17297G5031L48119d3188D0322K62555o7762A10035M59545k23753e3445j04576
17287a58021B5223L10262a77232c1994B04844E9695P6279n5741J67611J68739
17277D16583D3600K0000J02687K80891d9179G4625J42307q9237D4988P287J56988
17266B09263a5074E78235e9606B02581L11962A01636K38496I1770J13112f4123
17255C04052j18130J37700R9057j90532G5396J75268f2800A79192K05194a14241
$$ plain form
17244 408581 259896 275792 115026 -52977 99684 243374 -47732 4035 319646 144805 149941
17233 149941 100834 12635 120378 93594 -50464 273957 271955 253245 128928 62102 97270
17222 97270 151004 304277 178681 125895 184951 191894 258779 49342 238879 154675 469331
17211 469331 152160 50866 222500 129536 89227 20342 316189 297053 147332 284740
17201 284740 -13468 140969 -92819 270280 320832 133810 245675 241181 257023 -122325 130733
17189 255779 279588 87984 -98714 25382 157244 387016 328370 225658 295581 139242 210585
17178 210585 -35021 522274 196276 33747 457532 -108 229806 441544 317153 380354 375936
17167 375936 264657 175049 24725 285872 275892 308918 267588 214721 201523 524453 27097
$$ packed form
17244D08581j48685J5896A15026e2977I9684J43690d7732D035L15611A44805N136
17233A49941m9107A2635J07743k6784e0464B73957k002j8710j24317F2102L5168
17222I7270N3734J53273j25596n2786N9056O943O6885D9342J89537q4204L14656
17211D69331A52160E0866J71634r2964m0309B0342K95847j9136A47332J37408
17201B84740a3468A40969i2819B70280N0552A33810J11865m494J5842a22325A30733
17189B55779K3809H7984i8714B5382J31862K29772n8646j02712O9923A39242P1343
17178B10585c5021E22274A96276C3747M23785a08B29806K11738j24391O3201m418
17167C75936j11279q9608B4725K61147r980L3026m1330n2867j3198L22930B7097
$$ plain form
17155 114416 90585 310418 281160 289673 106603 61242 182064 381923 425915 214171 121044
17144 121044 285593 302390 122915 261198 -36876 162589 341105 444244 179996 92551
17134 92551 550764 434465 224203 338417 225084 228380 296733 314024 315339 167286 271174
17123 271174 511250 201876 232491 280569 358027 426924 493559 497007 415009 310983 257982
17112 257982 406960 132358 729336 397436 682491 388090 206099 750164 407818 412629
17102 412629 126359 641678 584331 468435 607457 30717 303644 260452 178445 505149
17092 505149 54606 134967 341127 729356 282839 377591 601014 543982 599019 165102
17081 712853 175415 309027 337948 390388 449032 338874 523605 222105 128649 489697
$$ packed form
17155A14416k3831K19833k9258Q513A06603m5361J20822J99859M3992k11744r3127
17144A21044J64549J6797A22915J38283c6876A62589J78516J03139A79996q7445
17134I2551M58213j16299k10262J14214j13333L296O8353J7291J315j48053J03888
17123B71174K40076B01876L0615M8078P7458O8897O6635L448q1998j04026n3001
17112B57982J48978A32358N96978l31900K85055k94401j81991N44065l42346M811
17102D12629A26359N15319n7347j15896J39022C0717K72927m3192q2007L26704
17092E05149E4606Q0361K06160L88229B82839R4752K23423n7032N5037A65102
17081G12853A75415J33612K8921N2440N8644j10158J84731B22105r3456L61048
$$ plain form
17071 489697 347562 300743 428121 53556 282344 300722 468648 199374 79114 335652
17061 335652 461449 526946 606588 549180 442989 691963 462446 377557 477564 398201
17051 398201 782552 181336 480565 511736 530545 427722 435245 174192 493811 541104
17041 541104 534429 648590 574407 473426 518776 714503 450685 567756 529918 432130 246451
17030 246451 474297 551678 300890 408330 -7060 315610 553128 305770 752862 495586
17020 495586 640659 623563 592400 785594 580382 188416 538965 492543 636141 1108237
17010 1108237 713123 895485 679667 925545 440509 585141 808156 426887 387293 691810
17000 691810 732886 878402 387305 1003389 537153 636200 522421 438464 1036489 721132
$$ packed form
17071D89697j42135m6819J27378E3556K28788J8378J67926A99374G9114K56538
17061C35652J25797O5497P9642n7408j06191K48974k29517q4889J00007p9363
17051C98201L84351A81336K99229L1171J8809j02823P523A74192L19619M7293
17041E41104o675J14161p4183j00981M5350J95727k63818J17071l7838r7788j85679
17030B46451K27846P7381k50788J07440g060C15610K37518k47358M47092k57276
17020D95586J45073j7096l1163J93194k05212A88416L50549m6422J43598M72096
17010A108237l95114J82362k15818K45878D40509J44632K23015l81269l9594L04517
17000F91810M1076J45516C87305O16084m66236R9047j13779q3957N98025l15357
$$ plain form
16990 721132 786344 748576 583579 543304 692456 483680 818636 389754 683181 364264
16980 364264 565696 525482 595772 606350 627362 852917 639926 692828 741453 956596 662811
16969 662811 419528 590331 1125101 1124431 899300 927958 807839 1153418 770552 1010523
16959 1010523 728466 849536 869484 349421 872206 954208 814942 800508 635045 884584
16949 884584 985240 1092563 711556 968525 1135610 908449 787601 1074688 1038650 860688
16939 860688 934886 1003607 982001 909590 1055217 1131707 1370107 1251276 1070141 1060654 1326478
16928 1326478 1124260 1051821 1107489 1663418 1391402 1039799 1316855 1154714 1020698 1429926
16918 1429926 1201504 1207159 1397270 1387048 1468936 1318621 1187686 1258658 1439987 1113399
$$ packed form
16990G21132O5212l7768j64997m0275J49152k08776L34956C89754K93427l18917
16980C64264K01432m0214P0290J0578K1012K25555k12991N2902M8625K15143k93785
16969F62811k43283J70803N34770o70k25131K8658j20119L45579l82866K39971
16959A010523k82057J21070J9948C49421N22785Q2002j39266j4434j65463K49539
16949H84584J00656J07323l81007K56969J67085k27161j20848K87087l6038j77962
16939H60688P4198O8721k1606p2411J45627P6490K38400j18831j81135r487K65824
16928A326478k02218p2439N5668N55929k72016l51603K77056j62141j34016M09228
16918A429926k28422N655J90111j0222Q1888j50315j30935P0972J81329l26588
$$ plain form
16908 1113399 1336175 1321904 1577687 1572779 1155303 1593633 1352677 1453484 1650399 1493976
16898 1493976 1566305 1338257 1411195 1761681 1504376 1457234 1775009 1701125 1821584 1818734
16888 1818734 1657731 1659679 1544024 1377853 1443571 1620683 1787964 1664067 1775840 2204342
16878 2204342 1795796 1774822 1887261 2293086 1960187 1628876 2227518 2097778 2125781 1901312
16868 1901312 2399503 2387117 1919126 2321025 2466263 2227634 2179478 2508710 2489669 2652768
16858 2652768 2383215 2402676 2525961 2773048 2453350 2346391 2245356 2898050 2677421 3139397
16848 3139397 2617343 2810492 2657182 2535419 2443385 3098666 2985095 3053928 3094947 3372968
16838 3372968 3165875 3050438 3107017 3054881 3448040 3269066 3536506 3422291 3761774 3826918
$$ packed form
16908A113399K22776j4271K55783m908m17476M38330k40956J00807J96915j56423
16898A493976P2329k28048P2938L50486k57305m7142L17775p3884J20459k850
16888A818734j61003J948j15655j66171O5718J77112J67281j23897J11773M28502
16878B204342m08546k0974J12439M05825l32899l31311N98642j29740K8003k24469
16868A901312M98191j2386m67991M01899J45238k38629m8156L29232j9041J63099
16858B652768k69553J9461J23285K47087l19698j06959j01035O52694k20629M61976
16848C139397n22054J93149j53310j21763r2034O55281j13571O8833M1019K78021
16838C372968k07093j15437N6579n2136L93159j78974K67440j14215L39483O5144
$$ plain form
16828 3826918 4002384 3650753 3880632 3807427 3856294 4190964 3932849 4089279 4281264 4547290
16818 4547290 4469508 4160428 4598966 4783930 4617049 4902382 5005370 5145230 5354855 5242529
16808 5242529 5390879 5522688 5567050 5486369 5713059 5703756 5855071 5900815 6171199 6357690
16798 6357690 6240744 6538012 6534654 6766145 6949613 6935678 7069956 7304366 7560440 7553199
16788 7553199 7918293 8202016 8365255 8457438 8743456 8690208 9080777 9406576 9518085 9754749
16778 9754749 10052107 10194237 10452652 10435580 11447592 11251413 11687131 11781934 12350479 12821150
16768 12821150 13420962 13531408 14099598 14701041 14892312 14866155 15846256 16206060 16907321
16759 16907321 17262704 17755865 18173788 19106555 19761167 20620480 21170566 21780398 22766675
$$ packed form
16828C826918J75466l51631K29879p3205M8867L34670k58115J56430J91985K66026
16818D547290p7782l09080M38538J84964j66881K85333J02988J39860K09625j12326
16808E242529J48350J31809M4362q0681K26690r303J51315M5744K70384J86491
16798F357690j16946K97268l358K31491J83468j3935J34278K34410K56074p241
16788G553199L65094K83723J63239R2183K86018n3248L90569L25799J11509K36664
16778I754749K97358J42130K58415j7072J012012j96179M35718R4803N68545M70671
16768A2821150N99812J10446N68190O01443J91271k6157R80101L59804P01261
16759A6907321L55383M93161M17923R32767O54612Q59313N50086O09832R86277
$$ plain form
16750 22766675 23666445 24919384 25651316 26996881 28141310 28818139 30011647 31788957
16742 31788957 32910727 34185225 35788391 37570322 39076860 41150494 43006221 45177531
16734 45177531 47367040 50047612 52668506 55259987 58308819 61538812 65011968 68594115
16726 68594115 72722271 76598181 80984741 85740010 90535160 96141440 101785375 107681087
16718 107681087 113958200 120683758 127250150 134429957 141316915 148419352 155515615 162074960
16710 162074960 168830011 174591689 180253859 185354535 189100535 192039679 193936407 194598313
16702 194598313 194085532 192395745 189562336 185744164 180873443 175346079 169175722 162592051
16694 162592051 155739283 148728540 141463439 134261972 127564031 120552035 114146389 107860329
$$ packed form
16750B2766675Q99770J252939P31932J345565J144429O76829J193508J777310
16742C1788957J121770J274498J603166J781931J506538K073634J855727K171310
16734D5177531K189509K680572K620894K591481L048832L229993L473156L582147
16726F8594115M128156L875910M386560M755269M795150N606280N643935N895712
16718A07681087O277113O725558O566392P179807O886958P102437P096263O559345
16710A62074960O755051N761678N662170N100676L746000K939144J896728O61906
16702A94598313n12781j689787k833409l818172m870721n527364o170357o583671
16694A62592051o852768p010743p265101p201467o697941p011996o405646o286060
$$ plain form
16686 107860329 101804841 96124859 90436815 85678709 80579898 76094498 71747697 67979617
16678 67979617 63963375 60600468 57408225 54521635 51419062 49039531 46217335 44000051
16670 44000051 41472315 39811114 37789376 36339057 34171981 32657018 31156911 29573380
16662 29573380 28433327 27536159 26413487 25272476 24269520 23234971 22065894 21428190
16654 21428190 20650189 19639106 19531636 18586906 17790331 17296017 16752079 16059381 15623268
16645 15623268 14847942 14529572 13882921 13581710 12888316 12721576 12260223 12111838 11515863
16636 11515863 11211431 11093792 10792103 10273043 9992733 10139988 9727389 9074996 9278983
16627 9278983 8868253 8561571 8181600 8540018 7874717 7929599 7514897 7305399 7385794 7070309
$$ packed form
16686A07860329o055488n679982n688044m758106n098811m485400m346801l768080
16678F7979617m016242l362907l192243k886590l102573k379531k822196k217284
16670D4000051k527736j661201k021738j450319k167076j514963j500107j583531
16662B9573380j140053q97168j122672j141011j002956j034549j169077o37704
16654B1428190p78001j011083j07470r44730p96575m94314n43938o92698m36113
16645A5623268p75326l18370o46651l01211o93394j66740m61353j48385n95975
16636A1515863l04432j17639l01689n19060k80310J47255m12599o52393K03987
16627I278983m10730l06682l79971L58418o65301N4882m14702k09498Q0395l15485
$$ plain form
16617 7070309 7142772 6669725 6665349 6543709 6230111 5985396 6098057 6002986 5732500 5531811
16607 5531811 5473506 5780384 5373925 5097773 4500038 5033880 4781193 4910209 4551197 4545628
16597 4545628 4169742 4347507 3954765 4102795 4158554 4176297 3828498 3936524 3319972 3855861
16587 3855861 3833725 3519845 3750051 3584809 3532560 3494506 3482540 3455411 3337727 3404932
16577 3404932 3295587 3052387 2859480 3145419 2729522 2773051 3358343 2917562 2727345 2978063
16567 2978063 2661263 2662693 2659788 2580121 2465898 2342025 2462423 2390680 2172904 2388903
16557 2388903 2203986 2274426 2242699 2334096 1939749 2016505 1812344 1850597 1920696 1741550
16547 1741550 2090308 1891667 1979370 1936122 1545165 1741493 1928149 2283997 1688008 1744745
$$ packed form
16617G070309P2463m73047m376j21640l13598k44715J12661r5071k70486k00689
16607E531811n8305L06878m06459k76152n97735N33842k52687J29016l59012n569
16597D545628l75886J77765l92742J48030N5759J7743l47799J08026o16552N35889
16587C855861k2136l13880K30206j65242n2249l8054j1966k7129j17684O7205
16577C404932j09345k43200j92907K85939m15897M3529N85292m40781j90217K50718
16567B978063l16800J430k905p9667j14223j23873J20398p1743k17776K15999
16557B388903j84917P0440l1727R1397l94347P6756k04161L8253P0099j79146
16547A741550L48758j98641Q7703m3248l90957J96328J86656L55848n95989N6737
$$ plain form
16537 1744745 1892981 1346259 1722987 2068037 1834599 1552853 1495147 1696809 1744371 1802524
16527 1802524 1437409 1758276 1298220 1424601 1476324 1266668 1507173 1867696 1383195 1431904
16517 1431904 1014600 899282 1345078 1186186 1233361 1232870 1429241 849583 1259282 1125305
16507 1125305 1492083 1044387 1168736 1333974 1128043 1091603 1310167 931663 1205793 1268369
16497 1268369 1050736 951904 875370 812430 1103470 1035162 1125878 960313 1010450 1039296 934200
16486 934200 764787 1094679 1113802 990152 702085 1145466 632839 982851 794477 943360
16476 943360 757550 950845 971496 896274 761629 677464 599407 631123 943384 986866 1063476
16465 1063476 573491 352530 657920 755848 966959 922761 327208 762579 767960 682832
$$ packed form
16537A744745J48236n46722L76728L45050k33438k81746n7706K01662M7562N8153
16527A802524l65115L20867m60056J26381N1723k09656K40505L60523m84501M8709
16517A431904m17304j15318M45796j58892M7175m91J96371n79658M09699j33977
16507A125305L66778m47696J24349J65238k05931l6440K18564l78504K74130O2576
16497A268369k17633r8832p6534o2940K91040o8308R0716j65565N0137K8846j05096
16486I34200j69413L29892J9123j23650k88067M43381n12627L50012j88374J48883
16476I43360j85810J93295K0651p5222j34645q4165p8057L1716L12261M3482P6610
16465A063476m89985k20961L05390R7928K11111m4198C27208M35371N381q5128
$$ plain form
16455 682832 774461 644951 975306 889114 440598 365465 626993 733503 559400 260934
16444 934250 1056402 731285 784729 340835 488751 950290 1021713 864560 517657 757861
16434 757861 798402 477760 561117 894129 657217 442887 595852 485240 560562 511009
16424 511009 511217 715551 493942 655037 571673 307343 435060 652403 556650 720279
16414 720279 371819 231513 480161 511546 501660 174278 580641 860303 555384 751805
16404 751805 461748 503267 477538 667117 297668 316420 191273 576224 457636 400032
16394 400032 598782 456795 772921 723672 389011 319768 314618 186635 390019 284324
16384 284324 704299 346100 415816 115392 586467 644097 485398 364823 739034 298993
$$ packed form
16455F82832R1629j29510L30355q6192D40598p5133K61528J06510j74103B60934
16444I34250J22152l25117N3444C40835J47916M61539P1423j57153l46903K40204
16434G57861M0541l20642Q3357L33012k36912k14330J52965j10612P5322m9553
16424E11009K08K04334k21609J61095q3364k64330J27717K17343r5753J63629
16414G20279l48460j40306K48648L1385r886A74278M06363K79662l04919J96421
16404G51805k90057M1519k5729J89579B97668J8752j25147L84951j18588n7604
16394D00032J98750j41987L16126m9249l34661o9243n150j27983K03384j05695
16384B84324M19975C46100O9716A15392M71075N7630j58699j20575L74211B98993
$$ plain form
16373 266815 126513 434647 481389 378880 341048 321906 215503 229033 315449 558562
16363 558562 4324 53771 336588 349817 154034 54770 338864 380532 -61069 436390 366173
16352 366173 191693 231839 99054 129441 369674 401444 384122 274443 377796 242818
16342 242818 401443 305309 412250 320451 273581 336795 409778 397509 -130281 -2959 69017
16330 385840 374074 143153 413378 197581 348594 242876 418341 341163 349485 596677
16320 596677 319065 313543 138185 196515 199435 -51903 571145 254036 399808 206245 133054
16309 133054 353164 229935 264868 112558 120339 141462 32876 19323 32169 167523 221209
16298 221209 239303 383655 327391 313139 437643 -3830 450822 164691 201262 -42610 201628
$$ packed form
16373B66815A26513L08134M6742j02509l7832j9142j06403J3530Q6416K43113
16363E58562D324M9447K82817J3229A54034E4770K84094M1668f1069D36390p0217
16352C66173j74480M0146I9054L0387K40233L1770j7322j09679J03353j34978
16342B42818J58625r6134J06941r1799m6870O3214P2983j2269a30281b959F9017
16330C85840j1766A43153K70225A97581J51013j05718J75465p7178Q322K47192
16320E96677k77612n522A38185N8330K920e1903E71145B54036J45772j93563p3191
16309A33054K20110j23229L4933A12558P781K1123C2876j3553J2846J35354N3686
16298B21209J8094J44352n6264j4252J24504c830D50822A64691L6571d2610B01628
$$ plain form
16286 469462 362183 297121 320497 16531 167364 377836 269708 43343 -13334 290816
16275 75279 -72324 106997 -187473 308809 155147 74276 309289 12291 164440 168413 202484
16264 202484 -15854 211954 228688 137862 359647 72145 219605 149238 357002 135050
16253 373996 -117538 386644 472328 66004 189362 137978 219569 280847 266674 28864 384259
16242 384259 231016 123532 -23629 168625 396747 -213909 -226087 71247 5509 30332 -49442
16230 215120 -72100 329003 257021 126094 -385 241522 185890 147410 105666 -156438 288649
16218 -162155 359867 -257157 234221 -9030 125919 -89839 316941 210141 -32172 223592
16207 211443 132560 -157968 135095 415332 135307 8515 -76722 338862 291418 322600 245680
$$ packed form
16286D69462j07279o5062K3376A6531J50833K10472j08128D3343a3334B90816
16275G5279g2324A06997a87473C08809j53662G4276K35013A2291J52149L973L4071
16264B02484a5854B11954J6734r0826K21785G2145J47460p0367K07764A35050
16253C73996a17538C86644Q5684F6004J23358n1384Q1591O1278j4173B8864L55395
16242C84259j53243j07484b3629A68625K28122b13909j2178G1247E509K4823d9442
16230B15120g2100C29003p1982A26094c85B41522n5632l8480m1744a56438B88649
16218a62155C59867b57157B34221i030A25919h9839C16941j06800c2172B23592
16207B11443p8883a57968A35095K80237A35307H515g6722C38862m7444L1182p6920
$$ plain form
16196 245680 207117 159875 -100822 207946 313791 -102883 359530 -93471 211777 77811
16185 25397 29071 12628 302124 104331 105334 -102565 -59630 225043 -6449 -172307 45304
16173 66839 -115120 62072 -2206 -54308 168066 -18905 134490 388385 102112 -290447 -462
16161 -316794 -8460 -39999 223686 520973 250896 -164881 323937 291426 -208863 404089
16150 23241 32561 455079 -122383 -161256 -56811 -406796 296911 -37265 57865 302193 168486
16139 168486 115932 -153470 126971 -245227 -31040 136789 -105957 180224 219716 -204103
16128 -73241 68714 -57916 101179 121882 -59636 50873 137304 -88236 142335 -99488 226082
16116 -35212 -147960 108184 -125392 -204216 26982 25021 -25802 415131 -71415 96461 9769
$$ packed form
16196B45680l8563m7242a00822B07946J05845a02883C59530i3471B11777G7811
16185B5397L674A2628K89496A04331J003a02565M2935B25043f449j65858D5304
16173F6839a15120F2072b206n2102A68066a8905A34490K53895A02112b90447d62
16161c16794h460l1539B23686K97287B50896a64881C23937l2511b08863D04089
16150B3241R320M22518a22383l8873e6811l49985B96911c7265E7865K44328j33707
16139A68486n2554a53470A26971b45227c1040A36789a05957A80224L9492b04103
16128g3241F8714e7916A01179K0703e9636E0873Q6431h8236A42335i9488B26082
16116c5212j12748A08184a25392p8824B6982j961b5802D15131g1415I6461I769
$$ plain form
16104 69100 39338 -310582 85882 -466021 27189 -80319 -455521 187784 36783 67303 -36973
16092 -107173 294610 100472 -192694 53800 55643 -33393 9022 141004 -22890 127861 -102174
16080 33956 312965 181481 326624 -268755 23358 149469 -32823 126426 -310906 231983
16069 -78452 -10290 100635 226745 -55143 52858 -81108 -146270 183748 353456 -144535 -363402
16058 -363402 -226107 -171154 115524 -43324 -172844 -129401 -40580 143060 -333716 -275229
16048 -275229 -264788 -67958 177654 -11420 -69889 357709 -164706 -280738 -22847 320210
16037 -128717 -35343 266846 -337287 -255840 95119 179091 -243948 -429675 261584 106382
16026 -157585 -29218 180127 278569 -3075 -88754 -83477 221836 -24070 -157093 74416 55402
$$ packed form
16104F9100k9762c10582H5882d66021B7189h0319l75202A87784C6783L0520c6973
16092a07173B94610A00472a92694E3800J843c3393I022J31982b2890A27861a02174
16080C3956K79009j31484J45143b68755B3358J26111c2823A26426c10906B31983
16069g8452a0290A00635J26110e5143E2858h1108o5162A83748J69708a44535k18867
16058c63402J37295N4953A15524d3324j29520M3443d0580A43060c33716N8487
16048b75229J0441f7958A77654a1420n8469C57709a64706j16032b2847C20210
16037a28717c5343B66846c37287Q1447I5119Q3972b43948j85727B61584A06382
16026a57585b9218A80127R8442c075q5679N277B21836b4070j33023G4416j9014
$$ plain form
16015 55402 165642 -88907 -409653 85208 -202167 210824 1199 28513 -41613 -44255 68057
16003 -102275 -122437 -103972 -215219 -265667 -156539 -320425 140198 -65195 -81542 -52792 -133911
15992 -133911 132574 -149056 26653 22636 -335233 -150725 -390091 120016 2385 75110 -231760
15980 -246140 163119 -201899 163265 -85100 136436 -135349 -158298 53243 1866 -112342
15969 127808 -69772 160027 -159019 183070 99562 158859 61005 87576 17862 179766 -101534
15957 18973 293430 -195878 -74753 7627 81536 102005 177799 -110146 47058 33760 -149014
15945 193147 18763 -105452 -31922 -203695 -207070 -248725 76871 -215561 -319056 -137718 -281059
15934 -281059 -67531 -33722 71169 -329477 -192474 -56001 -75328 -3653 300901 137419 -89087
$$ packed form
16015E5402J10240h8907l20746H5208b02167B10824A199K7314d1613k642F8057
16003a02275k0162J8465j11247n0448J09128j63886A40198f5195j6347K8750q1119
15992a33911A32574a49056B6653m017c35233a50725k39366A20016B385P2725b31760
15980b46140A63119b01899A63265h5100A36436a35349k2949E3243A866a12342
15969A27808f9772A60027a59019A83070q3508N9297F1005K6571A7862J61904a01534
15957A8973K74457a95878g4753G627P3909K0469P5794a10146D7058j3298a49014
15945A93147A8763a05452c1922j71773l375m1655G6871b15561j03495a37718j43341
15934b81059f7531c3722G1169c29477J37003e6001j9327c653C00901A37419h9087
$$ plain form
15922 -141606 -45962 186571 88493 209793 93420 -86724 1811 -24134 16312 69469 -68077
15910 -300315 40752 -154248 -62076 -194771 183424 -269616 91148 -80791 -13112 252372
15899 138305 192237 203322 178639 -217337 -42494 40002 -80647 -8254 -130455 -116367 -117045 250076
15886 131048 -49426 -279924 14179 110985 -151783 -19615 220647 -104766 113005 135617
15876 135617 -211937 -184669 -67929 -1134 25112 -95989 -285457 -144863 -263799 67851 68272
15865 68272 -46852 -285636 -64553 -174804 23404 23093 -109666 -261687 -117158 71041 -60544
15853 88149 -31666 122518 238769 217668 -73101 -252175 -94679 371186 -267150 9203 -31850
15841 -194199 -110679 -112392 146146 -264172 140936 -132450 -236540 102386 -65391 -206262
$$ packed form
15922a41606d5962A86571H8493J21300I3420h6724A811b4134A6312N3157f8077
15910c00315D0752a54248f2076j32695A83424b69616I1148h0791a3112B52372
15899A38305N3932J1085k4683b17337d2494D0002h0647h254j22201J4088o78B50076
15886A31048d9426k30498A4179R6806a51783a9615B20647a04766A13005K2612
15876A35617b11937K7268f7929a134B5112i5989j89468J40594j18936F7851M21
15865F8272d6852k38784f4553j10251B3404l11a09666j52021a17158G1041f0544
15853H8149c1666A22518J16251k1101g3101j79074i4679C71186b67150I203c1850
15841a94199Q3520j713A46146b64172A40936a32450j04090A02386f5391j40871
$$ plain form
15831 -206262 18950 104006 28220 -438654 -166357 -331365 -2060 -63627 -44822 -6043 -10279
15820 -10279 -248090 -177050 28088 13079 161193 -92912 27444 -140840 174608 -227229 -2005
15808 51819 -146091 -53223 32515 217045 33933 -195856 165454 -26180 -105207 133240 -76042
15796 -181530 -245029 -377901 -45900 -109048 6694 677 -188725 112328 200448 -92519 50300
15784 -206858 176128 -102754 348166 -28830 -179962 -293239 302657 277987 -68457 164294
15773 -3209 -286649 173015 -27216 78178 -46823 19237 -171148 -207106 12198 -98122 119113
15761 35658 -377483 -65291 233083 112967 66110 -326207 -220071 166795 26779 55817
15751 55817 -196970 -49140 -94709 -321146 51459 53752 -276435 58035 -219407 84922 183490
$$ packed form
15831b06262A8950Q5056B8220d38654a66357j65008b060o1567J8805f043m236
15820a0279k37811P1040B8088A3079J48114i2912B7444a40840A74608b27229b005
15808E1819a46091e3223C2515J84530C3933a95856A65454b6180p9027A33240g6042
15796a81530o3499j32872d5900o3148F694F77a88725A12328Q8120i2519E0300
15784b06858A76128a02754C48166b8830j51132j13277C02657k4670f8457A64294
15773c209k83440A73015b7216G8178d6823A9237a71148l5958A2198i8122A19113
15761C5658c77483f5291B33083A12967m6857c26207J06136A66795B6779K9038
15751E5817a96970d9140m5569k26437E1459K293b76435E8035b19407H4922R8568
$$ plain form
15740 183490 -1492 101760 111284 129597 159452 -123273 27618 133461 -175941 -431123 143046
15728 -101672 80332 -59603 -24283 -44973 309450 -99383 56616 -99105 -53305 -203896 -7710
15716 -111717 -277634 57068 12310 -91969 -47330 205311 63896 -194632 39010 -100010 74152
15704 -188409 -65220 -95620 163573 206690 -58738 72634 -248380 192399 -167493 178674
15693 -343502 38657 -141904 214560 -31041 -87276 -156720 4443 -280140 -68514 -48429 -40875
15682 -40875 77679 -164210 78071 -99200 -264179 220894 -83714 72503 -91182 242755 -274370
15670 36467 -284416 -4815 105983 115784 -41765 163908 203025 -273930 -149361 167502 -219017
15658 -88549 173776 114523 -102937 58523 -304909 -315469 187880 -148911 52513 -9757 -43169
$$ packed form
15740A83490a492A01760R524J8313K9855a23273B7618J05843a75941k55182A43046
15728a01672H0332e9603b4283k0690C09450i9383E6616i9105M5800j50591g710
15716a11717j65917E7068A2310i1969M4639B05311F3896a94632C9010a00010G4152
15704a88409f5220l0400A63573M3117e8738G2634b48380A92399a67493A78674
15693c43502C8657a41904B14560c1041n6235o9444D443b80140f8514K0085P554
15682d0875G7679a64210G8071i9200j64979B20894h3714G2503i1182B42755b74370
15670C6467b84416d815A05983R801d1765A63908L9117b73930J24569A67502b19017
15658h8549A73776n9253a02937E8523c04909j0560A87880a48911E2513i757l3412
$$ plain form
15647 -43169 118872 122346 -73901 -568337 120029 98767 62428 -39494 -94416 -57579 -205189
15636 -205189 150962 -6874 152770 -28394 -147858 -102398 -62546 -273694 -266681 100062 45025
15624 40161 274186 -44190 -184189 -150190 143470 -116649 46849 102566 -51456 -31741 -305485
15613 -305485 -223660 92523 -3130 -306800 -154294 -43650 -18050 -117035 -145305 36363 25900
15602 25900 -300459 102006 -148664 43331 351209 -35352 16396 -68573 -249541 2013 -134216
15590 -96004 29873 -58936 -137539 84971 61549 73677 -169971 -347921 -137813 110451 89368
15579 89368 128878 -216936 -39116 73600 89049 157228 281749 37592 -46877 -135312 83393
15567 205579 123552 181846 -38249 206725 -236040 141254 175043 -135929 61699 63559 -117123
$$ packed form
15647d3169A18872L474g3901m94436A20029k1262l6339c9494n4922L6837j47610
15636b05189A50962f874A52770b8394j19464M5460L9852k11148P013A00062D5025
15624D0161K34025d4190j39999L3999A43470a16649D6849N5717e1456J9715k73744
15613c05485Q1825I2523c130l03670J52506d3650a8050r8985k8270C6363j0463
15602B5900c00459A02006a48664D3331L07878c5352A6396f8573j80968B013a34216
15590i6004B9873e8936p8603H4971k3422J2128a69971j77950a37813A10451k1083
15579H9368L9510b16936c9116G3600J5449O8179J24521C7592d6877q8435H3393
15567B05579q2027N8294c8249B06725b36040A41254L3789a35929F1699J860a17123
$$ plain form
15555 228874 -37198 -1378 118333 31385 -30248 -89814 -112026 163577 -284319 -129746 29555
15543 169239 -23635 -109369 325639 -340802 -23103 73910 31580 9041 103118 -80619 136949
15531 -52164 130110 304585 -297577 105548 100751 -56382 2710 136132 79991 -287448 -44048
15519 14661 146540 93003 -182968 -281492 25756 -42387 301122 -187947 102325 -175401
15508 89222 219798 -183858 295890 -309339 16361 109922 150112 -211216 90940 -110585
15497 -8714 -67126 194993 -109403 33272 -217680 57484 -181754 161555 -28055 117517 -123687
15485 -90735 -59897 85895 -21702 8203 -78229 -189113 -134330 161665 -192269 -71002 -61640
15474 -61640 76104 -233636 87607 -101087 29377 83460 112876 234436 17807 -395451 -115608
$$ packed form
15555B28874c7198a378A18333C1385c0248n9566k2212A63577b84319a29746B9555
15543A69239b3635q5734C25639c40802b3103G3910C1580I041R4077h0619A36949
15531e2164A30110J74475b97577A05548m797e6382B710J33422n6141b87448d4048
15519A4661J31879n3537a82968r8524B5756d2387C01122a87947A02325a75401
15508H9222J30576a83858B95890c09339A6361R3561M0190b11216I0940a10585
15497h714n8412A94993a09403C3272b17680E7484a81754A61555b8055A17517a23687
15485i0735L0838H5895b1702H203g8229j10884N4783A61665a92269g1002R362
15474f1640G6104b33636H7607a01087B9377N4083K9416J21560A7807c95451a15608
$$ plain form
15462 -68887 -136972 -184474 -208915 -65928 103288 -363479 67095 64496 -130909 35987 -169366
15450 -31931 -253110 -331826 28592 101145 -178700 -58623 108139 -189972 77040 74025 175215
15439 175215 -28455 -298768 263000 -167859 72809 -234264 -227612 304138 -95262 358255
15428 265954 237283 291854 71922 -29766 155475 11716 -174624 359318 -379784 276186
15417 -280450 -137736 226796 36884 -432604 -198403 211089 -149174 -22809 -38207 -84290
15407 -84290 122597 -60261 48332 -509971 33077 233424 -103179 -178361 -152140 -303396 141902
15395 400349 -192012 11914 -122567 131303 133322 -316841 310582 -146103 -66937 219781
15384 -66910 194226 29875 -164129 21773 33438 -143368 269291 -104457 169303 89501
$$ packed form
15462f8887o8085m7502k4441f5928A03288c63479F7095k599a30909C5987a69366
15450c1931k21179p8716B8592P2553a78700e8623A08139a89972G7040l015J01190
15439A75215b8455k70313B63000a67859G2809b34264O652C04138i5262C58255
15428B65954k8671N4571G1922b9766A55475A1716a74624C59318c79784B76186
15417b80450a37736B26796C6884d32604a98403B11089a49174b2809j5398m6083
15407h4290A22597f0261D8332e09971C3077K00347a03179p5182K6221j51256A41902
15395D00349a92012A1914a22567A31303K019c16841C10582a46103f6937B19781
15384f6910A94226B9875a64129B1773J1665a43368B69291a04457A69303p9802
$$ plain form
15374 89501 -4349 34747 -134392 277459 6334 -18224 -24277 131207 229351 248142 -101923
15362 -78078 42444 129161 71768 -341749 -230165 125760 -119578 -82087 206429 157109 -21645
15350 81363 -19927 179171 50094 206469 20781 -140175 397891 -257887 -113122 -84148
15340 -84148 74101 23401 -50601 218993 167297 199493 -48275 -116761 51259 -125877 -124419
15329 -124419 93777 -315271 154432 -30644 -191824 -293894 116711 221129 144551 86962
15319 86962 -3830 -207820 32658 122161 -15658 164152 199773 -292510 147294 143720 -148020
15307 -99137 -140022 430014 17637 36317 -262530 151370 311324 320946 -231936 -27175 -60261
15296 -60261 -162861 96003 206056 -68690 113434 -35414 232641 306773 -81156 -216868 -68423
$$ packed form
15374H9501d349C4747a34392B77459F334a8224o053A31207R8144J8791a01923
15362g8078D2444Q6717n7393c41749J11584A25760a19578L7491B06429m9320b1645
15350H1363a9927A79171E0094J56375B0781a40175C97891b57887a13122K8974
15340h4148G4101B3401e0601B18993n1696L2196d8275o8486E1259a25877J458
15329a24419I3777c15271A54432c0644j61180j02070A16711J04418p6578n7589
15319H6962c830k03990C2658Q9503a5658A64152L5621b92510A47294l574a48020
15307i9137m0885D30014A7637J8680b62530A51370J59954R622b31936b7175l3086
15296f0261j02600I6003J10053f8690A13434c5414B32641P4132h1156j35712f8423
$$ plain form
15284 43236 -98540 166686 115889 67664 -21484 -7394 48546 69874 41696 -81688 -49636 -82948
15272 -82948 2016 -369109 246056 -5013 36640 -191522 312355 -202971 130772 -49853 215602
15260 -94296 -85946 32395 117397 -271473 -61067 143170 120604 101391 117480 117976 -132976 -127027
15248 -127027 -128203 56942 239231 130759 129155 154177 27277 261650 29066 98441 405904
15237 405904 30705 403181 570881 1179348 912799 995516 633074 570457 136075 300685
15227 300685 -93008 301720 130067 -285398 294260 56800 29057 37844 -73848 106567 383881
15216 383881 -23541 147765 -242 -7969 434460 41972 -98937 279875 116485 -123879 88948
15204 301456 -249121 260053 -8184 66886 55553 34161 70696 -75324 15577 249475 -38301
$$ packed form
15284D3236i8540A66686n0797m8225b1484g394D8546K1328k8178h1688L2052l3312
15272h2948B016c69109B46056e013C6640a91522C12355b02971A30772d9853B15602
15260i4296Q350C2395Q5002b71473f1067A43170k2566j9213J6089M96a32976N949
15248a27027j176E6942J82289j08472j604K5022B7277K34373B9066O9375L07463
15237D05904C0705L72476J67700O08467k66549Q2717l62442o2617A36075J64610
15227C00685i3008C01720A30067b85398B94260E6800k7743Q787g3848A06567K77314
15216C83881b3541A47765b42p727D34460D1972i8937B79875A16485a23879H8948
15204C01456b49121B60053h184F6886j1333k1392L6535g5324A5577K33898c8301
$$ plain form
15192 365292 -34950 -121900 -30536 246696 437532 139243 -73079 228100 -99756 203733
15181 -49367 -84964 -57516 -36243 217950 -11488 -224300 111036 75647 190153 -44453 124459
15169 519251 58301 157123 144356 49960 212376 282275 178445 303473 -112180 220135
15158 339095 525 261610 -195705 98009 354358 -72822 -59577 316473 -294393 293068 -211624
15146 11776 -133448 -123440 502731 -13360 240267 11503 89962 271089 137378 276811
15136 276811 28725 158675 -248352 -70634 31598 152959 212407 -151734 -180478 -115172 268276
15124 -147308 41306 231317 276787 62953 105291 -79181 110173 45650 67469 36733 109697
15113 109697 352608 -52664 106835 220517 157652 187953 284874 285330 273292 132094 102258
$$ packed form
15192C65292c4950q6950c0536B46696J90836A39243g3079B28100i9756B03733
15181d9367l5597K7448K1273B17950a1488k12812A11036l5389J14506d4453A24459
15169E19251E8301R8822j2767D9960J62416O9899j03830J25028a12180B20135
15158C39095E25K61085a95705I8009K56349g2822J3245C16473b94393B93068b11624
15146A1776a33448J0008E02731a3360B40267A1503P8459J81127j33711J39433
15136B76811B8725J29950b48352g0634C1598J21361N9448a51734k8744O5306B68276
15124a47308D1306J90011M5470F2953M2338g9181A10173D5650K1819l0736P2964
15113A09697K42911e2664A06835J13682o2865L0301R6921M56j2038A32094k9836
$$ plain form
15102 102258 35701 18217 -81451 225388 64327 184030 73539 32193 321496 153380 91038
15091 91038 -9440 82416 164834 141199 256756 51266 223954 27138 309722 -82218 32796
15079 -53963 107954 139397 27932 233414 -209448 -41224 92925 173155 119300 -43279 196812
15067 131257 -261286 121402 183257 181887 30107 272779 -82226 173712 63364 132277 281869
15056 281869 -26388 256504 54492 130528 -30948 192217 115463 25233 -30402 234792 120915
15045 120915 508992 393725 18343 -347379 109628 45894 377174 -107900 -79750 262449
15034 74170 198283 -20775 124483 106621 98973 244316 60652 323993 -377171 250302 67148
15022 134447 116056 253811 166476 28659 -37170 114654 223125 65532 34037 246814 122398
$$ packed form
15102A02258C5701j7484h1451B25388F4327J19703G3539C2193K89303A53380o2342
15091I1038i440H2416Q2418k3635J15557E1266J72688B7138K82584h2218C2796
15079e3963A07954L1443B7932K05482b09448d1224I2925Q0230n3855d3279A96812
15067A31257b61286A21402O1855j370C0107K42672h2226A73712F3364O8913J49592
15056B81869b6388B56504E4492P6036c0948A92217p6754B5233c0402B34792j13877
15045A20915L88077j15267A8343c47379A09628D5894L31280a07900K8150B62449
15034G4170J24113b0775A24483j7862p648J45343F0652K63341c77171B50302F7148
15022A34447j8391J37755q7335B8659c7170A14654J08471F5532l1495K12777A22398
$$ plain form
15010 23333 238402 252458 77817 329714 63799 71614 410913 385763 446659 217573 26814
14998 87913 414917 -45618 158042 340998 264397 -31543 302579 409535 52427 -3067 213584
14986 212160 267193 453498 31125 362392 555078 315503 488431 303327 282823 13810
14975 83263 206524 454111 80924 498844 576181 166777 316162 191809 131723 172615
14965 172615 88730 91465 227496 -59683 274122 158752 269976 177000 60692 -172890 167696
14953 319830 166904 392249 5747 359938 203292 261579 129859 124319 -23873 73147 127405
14942 127405 18981 224042 279359 516917 149456 72428 42195 422096 485645 201722
14931 304865 43862 163732 -124290 466675 -52700 268516 343433 231359 583386 139058
$$ packed form
15010B3333K15069J4056G7817K51897F3799P815L39299k5150O0896B17573B6814
14998H7913L27004d5618A58042J82956p6601c1543C02579J06956E2427c067B13584
14986B12160N5033J86305C1125L31267J92686k39575J72928j85104k0504A3810
14975H3263J23261K47587H0924M17920P7337A66777J49385j24353o0086M0892
14965A72615q3885K735J36031e9683B74122j15370J11224r2976F0692a72890A67696
14953C19830j52926K25345E747L54191j56646N8287A29859n540b3873G3147N4258
14942A27405A8981K05061N5317K37558A49456G2428l0233L79901O3549B01722
14931C04865D3862J19870a24290D66675e2700B68516P4917j12074L52027A39058
$$ plain form
14920 190810 329798 129813 273500 355918 -124729 402858 597147 87949 127309 118149
14910 118149 522208 264210 117705 266023 190040 260304 342721 268521 170204 601814
14900 601814 374903 172353 235928 283013 247676 439265 344323 412217 122605 411896
14890 411896 409942 262430 607587 23546 102400 358139 381802 435864 210252 424518 208798
14878 499058 319162 405545 114277 350567 214627 239450 476683 263254 363331 460592
14868 460592 531199 283659 287317 472502 297942 406817 340590 401658 368445 124349 573039
14857 573039 165990 445417 330862 377989 612587 479629 343995 414457 422800 341789
14847 341789 455700 61570 726728 483789 175404 425903 450866 483970 456495 249484
$$ packed form
14920A90810J38988A29813J43687Q2418a24729D02858J94289H7949L9360r160
14910A18149M04059k57998A17705J48318p5983P0264Q2417p4200r8317M31610
14900F01814k26911A72353O3575M7085l5337J91589r4942O7894A22605K89291
14890D11896j954j47512L45157B3546P8854K55739K3663N4062B10252K14266B08798
14878D99058j79896Q6383A14277K36290j35940K4823K37233k13429J00077R7261
14868D60592P0607k47540L658J85185j74560J08875o6227O1068l3213A24349M48690
14857E73039A65990K79427j14555M7127K34598j32958j35634P0462Q343q1011
14847C41789J13911F1570O65158k42939A75404K50499K4963L3104k7475k07011
$$ plain form
14837 249484 431710 566028 345005 530991 74363 427426 590828 452767 442619 482348
14827 482348 366451 121516 155499 630570 279505 444702 364279 418607 302389 431621
14817 431621 585421 731668 414061 549502 365655 357621 519677 491218 447906 383270
14807 383270 537442 481788 527138 588159 400235 560972 569961 471860 382216 164393 490724
14796 490724 408809 437403 555624 774865 645064 363188 522487 387729 534681 614752
14786 614752 342486 390563 725777 203766 455522 496671 722139 673264 673786 326159 536845
14775 536845 514587 539161 445166 851492 318859 632240 715065 467918 517830 592145 747388
14764 747388 528095 644682 785230 717790 530830 396584 394457 599372 685522 521560
$$ packed form
14837B49484J82226J34318k21023J85986G4363L53063J63402j38061j0148L9729
14827D82348j15897A21516L3983M75071B79505J65197q0423N4328j16218J29232
14817D31621J53800J46247l17607J35441j83847q034J62056k8459m3312o4636
14807C83270J54172n5654M5350O1021j87924J60737Q989r8101q9644A64393L26331
14796D90724q1915K8594J18221K19241j29801k81876J59299j34758J46952Q0071
14786F14752k72266M8077L35214B03766K51756M1149K25468m8875N22C26159K10686
14775E36845k2258K4574r3995M06326C18859L13381Q2825k47147M9912P4315J55243
14764G47388k19293J16587J40548o7440j86960j34246k127K04915Q6150j63962
$$ plain form
14754 521560 843876 691191 821470 613881 501897 775855 592628 835872 567703 547774
14744 547774 480901 530349 715964 812672 541734 792935 588389 532703 877230 681528
14734 681528 816507 521261 530732 554568 680137 559742 646803 656866 788131 804819 747692
14723 747692 735813 687797 673138 656712 840825 775478 544384 693604 919963 395205
14712 1017365 716373 821112 794835 782895 1102677 800958 947906 942691 635617 930385
14702 930385 826582 788380 805587 984971 641268 708033 1098239 823408 610592 878948
14692 878948 1011896 543081 927913 805341 1027855 1063643 450787 972899 1013947 1132743
14682 1132743 717889 1142538 1145211 824628 920078 994783 836859 1261421 1052362 936757
$$ packed form
14754E21560L22316j52685J30279k07589j11984K73958j83227K43244k68169j9929
14744E47774o6873M9448J85615R6708k70938K51201k04546n5686L44527j95702
14734F81528J34979k95246R471K3836J25569j20395Q7061J0063J31265J6688n7127
14723G47692j1879m8016j4659j6426J84113o5347k31094J49220K26359C95205
14712A017365l00992J04739k6277j1940L19782l01719J46948n215l07074K94768
14702I30385j03803l8202J7207J79384l43703O6765L90206k74831k12816K68356
14692H78948J32948m68815L84832j22572K22514L5788D50787N22112M1048J18796
14682A132743m14854M24649K673l20583R5450P4705j57924M24562k09059j15605
$$ plain form
14672 936757 1065281 907180 837044 860102 1135920 816461 931223 1288042 1172656 797782
14662 797782 762576 1286847 877744 868821 1073875 1078969 1253510 1310150 945778 1276293 1254420
14651 1254420 1017858 1376012 1035322 1226458 927517 1190826 1279214 1310229 1232790 1103269
14641 1103269 1281619 1376784 1129233 1084578 1045536 1196072 1118728 1311904 1367483 1301201
14631 1301201 1255148 1382194 1467593 1355751 1189128 1423424 1250864 1604113 1338001 1216630
14621 1216630 1483496 1284442 1220955 1034713 1700751 1466752 957503 1125669 1477292 1730944
14611 1730944 1305587 1372892 1260753 1153286 1299307 1472247 1527894 1750557 1721914 1668047
14601 1668047 1631968 1524624 1419458 1321815 1605746 1626649 1826256 1507081 1269691 1465470
$$ packed form
14672I36757J28524j58101p0136K3058K75818l19459J14762L56819j15386l74874
14662G97782l5206N24271m09103q923K05054N094J74541N6640l64372L30515k1873
14651A254420k36562L58154l40690J91136k98941K63309Q8388L1015p7439j29521
14641A103269J78350R5165k47551m4655l9042J50536p7344J93176N5579o6282
14631A301201m6053J27046Q5399j11842j66623K34296j72560L53249k66112j21371
14621A216630K66866j99054o3487j86242O66038k33999n09249J68166L51623K53652
14611A730944m25357O7305j12139j07467J46021J72940N5647K22663k8643n3867
14601A668047l6079j07344j05166r7643K83931K0903J99607l19175k37390J95779
$$ plain form
14591 1465470 1643020 1923323 1481918 1619044 1796682 1768158 1245048 1551478 1669631 1700404
14581 1700404 1725059 1754182 1961644 1729661 1834357 2196170 2137895 1740229 1955494 2036296
14571 2036296 2193384 1806402 2117538 2015537 2215217 1729399 2076807 1936375 1925649 2062614
14561 2062614 2148885 1944949 2274050 2219513 2502000 2116113 2165777 2241109 2474161 2916495
14551 2916495 2101916 2489467 2449892 2518511 3075895 3298363 3068023 3128136 3359793 3364640
14541 3364640 3874881 4245019 4587095 5040982 5885849 6503466 7889099 10403750 14992584
14532 14992584 21626014 31426829 30579236 18120964 10988730 7465948 5132286 4194589
14524 4194589 3580741 3054396 3147974 2642668 2681062 2714807 2453614 2511508 2591421 2133805
$$ packed form
14591A465470J77550K80303m41405J37126J77638k8524n23110L06430J18153L0773
14581A700404K4655K9123K07462k31983J04696L61813n8275l97666K15265Q0802
14571B036296J57088l86982L11136j02001J99680m85818L47408j40432j0726J36965
14561B062614Q6271k03936L29101n4537K82487l85887M9664P5332K33052M42334
14551B916495q14579L87551l9575O8619N57384K22468k30340O0113K31657M847
14541C364640N10241L70138L42076M53887Q44867O17617J385633K514651M588834
14532A4992584O633430R800815q47593j2458272p132234l522782k333662r37697
14524D194589o13848n26345R3578n05306L8394L3745k61193N7894P9913m57616
$$ plain form
14514 2133805 2556167 2430709 2679879 2677031 2812970 2870900 2422850 2604601 2698971 2418399
14504 2418399 2855358 2801588 2640674 2821527 2920698 3149496 2757742 2650727 2925952 2953173
14494 2953173 2844769 3093653 2930984 3141669 3095266 3086507 3061086 3299583 3125676 3347099
14484 3347099 3099285 3221967 3448221 3368520 3459416 3687317 3888983 3502536 3557525 3856155
14474 3856155 3564883 3504005 4020962 4137685 3885405 3987494 3842693 4224998 4100578 3931136
14464 3931136 4095463 4368768 4096615 4301237 4585961 4630189 4327908 4708960 4858751 4851925
14454 4851925 4791888 4772971 4821373 4672497 4587141 4908501 4800706 4541644 5225810 5249403
14444 5249403 4957377 5280935 5113883 5247573 5264250 5481461 5645696 5619949 5516836 5625041
$$ packed form
14514B133805M22362j25458K49170k848J35939N7930m48050J81751R4370k80572
14504B418399M36959n3770j60914J80853R9171K28798l91754j07015K75225K7221
14494B953173j08404K48884j62669K10685m6403q759k5421K38497j73907K21423
14484C347099k47814J22682K26254p9701R0896K27901K01666l86447N4989K98630
14474C856155k91272o0878N16957J16723k52280J02089j44801L82305j24420j69442
14464C931136J64327K73305k72153K04622K84724M4228l02281L81052J49791o826
14454D851925o0037j8917M8402j48876q5356L21360j07795k59062O84166K3593
14444E249403k92026L23558j67052J33690J6677K17211J64235k5747j03113J08205
$$ plain form
14434 5625041 6006738 5632098 5959858 6438954 6165029 6338838 6400904 6433338 6353379 6447245
14424 6447245 6749325 6670697 6726822 6988695 6865629 7090238 7111958 6964486 7342811 7445277
14414 7445277 7400018 7301493 7691124 7557188 7811099 8021693 8274916 8134412 8533654 8521645
14404 8521645 8527539 8711178 8823801 8650847 9147659 9165001 8909706 9666049 10047848 9691182
14394 9691182 10055409 9793956 10018681 10356102 10030403 10396372 10715038 11054274 11261554
14385 11261554 11316007 11729521 11781030 12037069 12138078 12616192 12286713 12725476 12960869 13301570
14375 13301570 13135013 13305664 13496393 14191785 14306270 14673609 14713834 15110822 15480716
14366 15480716 16114129 16084679 16544262 16286335 17219668 17318023 17547909 17734253 18329312 18526129
$$ packed form
14434E625041L81697l74640L27760M79096k73925J73809O2066L2434p9959R3866
14424F447245L02080p8628N6125K61873j23066K24609K1720j47472L78325J02466
14414G445277m5259r8525L89631j33936K53911K10594K53223j40504L99242j2009
14404H521645N894J83639J12623j72954M96812J7342k55295P56343L81799l56666
14394I691182L64227k61453K24725L37421l25699L65969L18666L39236K07280
14385A1261554N4453M13514N1509K56039J01009M78114l29479M38763K35393L40701
14375A3301570j66557J70651J90729O95392J14485L67339M0225L96988L69894
14366A5480716O33413k9450M59583k57927R33333R8355K29886J86344N95059J96817
$$ plain form
14356 18526129 18798019 19244703 19819234 19941336 20497748 20690335 21599603 21790156 22148522
14347 22148522 22698568 23285109 23632037 24039994 24497064 25193772 25841198 26504538 26973199
14338 26973199 27582246 28407405 29111484 29780152 30491313 30992185 32257181 32488669 33975630
14329 33975630 34394368 35427243 36561210 37286279 38208839 39308616 40449589 41752349
14321 41752349 42554690 44182286 45262957 46632400 48045946 49421638 51113872 52957677
14313 52957677 54535132 55905622 58165404 59874374 62105367 63793303 66260998 68510310
14305 68510310 71041127 73362834 76211658 78970132 81889725 85012599 88567818 91823512
14297 91823512 95336303 99422113 103518205 107439395 112150843 117230850 122248421 127471866
$$ packed form
14356A8526129K71890M46684N74531J22102N56412J92587R09268J90553L58366
14347B2148522N50046N86541L46928M07957M57070O96708O47426O63340M68661
14338B6973199O09047Q25159P04079O68668P11161N00872J264996K31488J486961
14329C3975630M18738J032875J133967P25069R22560J099777J140973J302760
14321D1752349Q02341J627596J080671J369443J413546J375692J692234J843805
14313E2957677J577455J370490K259782J708970K230993J687936K467695K249312
14305F8510310K530817K321707K848824K758474K919593L122874L555219L255694
14297I1823512L512791M085810M096092L921190M711448N080007N017571N223445
$$ plain form
14289 127471866 133248437 139035858 145371848 152122802 159294140 166884498 174853614 183260072
14281 183260072 191823907 201099386 211259487 221485646 232500171 244254655 256100347
14274 256100347 269084472 282161775 295886555 309892593 323407116 337418950 350917468
14267 350917468 364666226 377648625 390064575 401383815 411465629 420760232 429768092
14260 429768092 437502086 443625571 447766143 450673848 453005107 455472855 454196483 448766473
14252 448766473 443919486 437050166 427905692 417627596 406417012 394463911 381907868
14245 381907868 369602138 356446247 343216943 330119411 317263264 304032806 291496659
14238 291496659 278918340 266941579 254561843 243346536 232501627 221659390 211220665
$$ packed form
14289A27471866N776571N787421O335990O750954P171338P590358P969116Q406458
14281A83260072Q563835R275479J0160101J0226159J1014525J1754484J1845692
14274B56100347J2984125J3077303J3724780J4006038J3514523J4011834J3498518
14267C50917468J3748758J2982399J2415950J1319240J0081814R294603R007860
14260D29768092P733994O123485M140572K907705K331259K467748j276372n430010
14252D48766473m846987o869320r144474j0278096j1210584j1953101j2556043
14245C81907868j2305730j3155891j3229304j3097532j2856147j3230458j2536147
14238B91496659j2578319j1976761j2379736j1215307j0844909j0842237j0438725
$$ plain form
14231 211220665 201198123 191197482 181802439 172919365 164718499 156581032 149027829 142329967
14223 142329967 136339188 130130254 124399366 118860830 114072129 109435461 104620268 101019371
14215 101019371 96870117 92956428 89163525 85665933 82734428 79516439 76512126 73715052
14207 73715052 71355052 68609204 66277614 64140524 62148811 60137338 58362701 56112804
14199 56112804 54558948 53122457 51383757 49964277 48514682 46782489 45667768 44580304
14191 44580304 43312558 41961313 40639401 39678786 38935540 37519253 36768086 35785629 34958909
14182 34958909 33735172 32848618 32159575 31418006 30730702 29853645 29466780 28501706 27583340
14173 27583340 27040076 26534682 25877658 25340725 24461732 24380365 23692585 23194928 22524901
$$ packed form
14231B11220665j0022542j0000641r395043q883074q200866q137467p553203o697862
14223A42329967n990779o208934n730888n538536m788701m636668m815193l600897
14215A01019371m149254l913689l792903l497592k931505l217989l004313k797074
14207G3715052k360000k745848k331590k137090j991713k011473j774637k249897
14199E6112804j553856j436491j738700j419480j449595j732193j114721j087464
14191D4580304j267746j351245j321912r60615p43246j416287p51167r82457q26720
14182C4958909j223737q86554o89043p41569o87304q77057l86865r65074r18366
14173B7583340n43264n05394o57024n36933q78993q1367o87780m97657o70027
$$ plain form
14164 22524901 22137010 21757835 21178556 20835095 20528509 20103523 19329326 19396163 18507463
14155 18507463 18597012 18227114 18057320 17259944 17233068 16905418 16580909 16196574 15958853 15913164
14145 15913164 15377867 14835270 15002563 14491461 14027342 14185861 13962298 13677806 13457573
14136 13457573 13242774 12862505 12656587 12645273 12485460 12194524 12158613 11573509 11554423 11283023
14126 11283023 11380858 10975494 10912956 10906618 10706344 10339796 10422789 10189022 10216744 9810046
14116 9810046 9899013 9944265 9245604 9636371 9090037 9215632 9088689 9074480 8923379 8675155
14106 8675155 8513863 8291053 8178674 8186202 7886349 8328664 7758398 7721570 7907743 7462383
14096 7462383 7172391 7225365 7573457 7230777 7335572 6998525 7276257 7011211 6824531 6696700
$$ packed form
14164B2524901l87891l79175n79279l43461l06586m24986p74197O6837q88700
14155A8507463Q9549l69898j69794p97376k6876l27650l24509l84335k37721m5689
14145A5913164n35297n42597J67293n11102m64119J58519k23563k84492k20233
14136A3457573k14799l80269k05918j1314j59813k90936l5911n85104j9086k71400
14126A1283023R7835m05364o2538o338k00274l66548Q2993k33767K7722m06698
14116I810046Q8967M5252o98661L90767n46334J25595j26943j4209j51101k48224
14106H675155j61292k22810j12379P528k99853M42315n70266l6828J86173m45360
14096G462383k89992N2974L48092l42680J04795l37047K77732k65046j86680j27831
$$ plain form
14086 6696700 6695901 6284771 6603793 6126437 6198156 6221259 6044808 6043914 6208273 5691808 5873725
14075 5873725 5780267 6071086 5585729 5633451 5293522 5338493 5265855 5270616 5168245 5366497
14065 5366497 5288176 5400750 5155307 4937607 5060431 5005626 4898291 4810891 4537692 4784111
14055 4784111 5063423 4887451 4458887 4391700 4242372 4663433 4254702 4274823 4717568 4522514
14045 4522514 4546343 4346102 4266622 4411639 4084425 4560785 3936803 3915397 3942559 3741380
14035 3741380 3907420 3888812 3856046 3890258 3615304 3343555 3350882 3754047 3390495 3468349
14025 3468349 3780563 3691324 3464511 3699617 3327574 3047309 3341579 3133562 3506917 2975666
14015 2975666 3260764 3441515 2928098 2879583 2957777 3182582 2814745 3075890 2776551 2863544
$$ packed form
14086F696700p99m11130L19022m77356P1719K3103j76451q94J64359n16465J81917
14075E873725r3458K90819m85357M7722l39929M4971p2638M761j02371J98252
14065E366497p8321J12574k45443k17700J22824n4805j07335q7400k73199K46419
14055D784111K79312j75972m28564o7187j49328M21061m08731K0121M42745j95054
14045D522514K3829k00241p9480J45017l27214M76360o23982k1406K7162k01179
14035C741380J66040j8608l2766L4212k74954k71749P327M03165l63552P7854
14025C468349L12214q9239k26813K35106l72043k80265K94270k08017L73355n31251
14015B975666K85098J80751n13417m8515P8194K24805l67837K61145k99339Q6993
$$ plain form
14005 2863544 3043413 2552317 2787917 2852228 2929091 2967401 2574753 2732210 2950038 2525702
13995 2525702 2609081 2800302 2553308 2646200 2378182 2485759 2216466 2594915 2297141 2244817
13985 2244817 2553693 2522243 2454699 2460126 2394175 2685801 2835384 3073611 3876948 3947664
13975 3947664 5047378 7250633 10663236 16130717 26609329 31308556 21368880 14654977
13967 14654977 10234062 7705216 6509381 5390628 4700236 4837620 3972250 3816123 3245765
13958 3245765 3491565 3239069 2953471 2771510 2979111 2759148 2388901 2864063 2728344
13949 2728344 2846947 2448159 2394763 2111198 2342526 2507544 2392213 2593838 2021784 2160574
13939 2160574 1965391 2252728 2073956 2116955 2387467 1937314 2157010 2073041 2158386 2157145
$$ packed form
14005B863544J79869m91096K35600O4311P6863L8310l92648J57457K17828m24336
13995B525702Q3379J91221k46994R2892k68018J07577k69293L78449k97774n2324
13985B244817L08876l1450o7544N427o5951K91626J49583K38227Q03337P0716
13975C947664J099714K203255L412603N467481J0478612M699227r939676o713903
13967A4654977m420915k528846j195835j118753o90392J37384q65370j56127n70358
13958C245765K45800k52496k85598j81961K07601k19963l70247M75162j35719
13949B728344J18603l98788n3396k83565K31328J65018j15331K01625n72054J38790
13939B160574j95183K87337j78772M2999K70512m50153K19696q3969Q5345j241
$$ plain form
13929 2157145 2088597 1967669 2199226 1961965 2015536 2122916 2266317 1938690 1798631 2105557
13919 2105557 2089092 1817681 2037533 1834689 1646607 1372356 1998719 1632823 1621524 1867409
13909 1867409 1695234 1739603 1561295 1592099 1407282 1231228 1494928 1442440 1700774 1409308
13899 1409308 1705848 1579180 1811523 1542875 1569729 1398099 1473632 1606471 1604936 1519476
13889 1519476 1650544 1543089 1538262 1317777 1373866 1500536 1296378 1411709 1561179 1384995
13879 1384995 1357101 1272006 1331456 1427650 1727284 1137380 1268642 1547718 1347421 1378437
13869 1378437 1228572 1281038 1391588 1481764 1131557 1326511 1576693 1330066 1336410 1029901
13859 1029901 1142844 1006184 895503 1143410 1473531 1415653 1305038 1195092 1218553 1138033
$$ packed form
13929B157145o8548j20928K31557k37261N3571J07380J43401l27627j40059L06926
13919B105557j6465k71411K19852k02844j88082k74251O26363l65896j1299K45885
13909A867409j72175M4369j78308L0804j84817j76054K63700n2488K58334k91466
13899A409308K96540j26668K32343k68648K6854j71630P5533J32839j535q5460
13889A519476J31068j07455m827k20485N6089J26670k04158J15331J49470j76184
13879A384995k7894q5095N9450R6194K99634n89904J31262K79076k00297L1016
13869A378437j49865N2466J10550R0176l50207J94954K50182k46627O344l06509
13859A029901J12943j36660j10681K47907L30121n7878j10615j09946K3461q0520
$$ plain form
13849 1138033 1101608 1036416 1244666 1337089 1235126 1243133 843161 1133056 1050559 1161722
13839 1161722 1217629 1254816 890701 1025837 958966 1070828 1146575 792685 912315 1308459
13829 1308459 1099344 912716 990919 876837 1231043 1350154 863777 887940 1063061 846873
13819 846873 1085992 1168663 1013039 1007405 1036276 1088894 1113136 1097466 1094918 1070454 926715
13808 926715 854319 1020128 955013 966544 793432 1048180 1094194 724570 877563 848573
13798 848573 722730 745837 1065316 1050487 774913 948584 671285 532475 907891 984782
13788 984782 1046508 878639 1022646 821752 1059828 1222967 1133966 763437 1213983 1300082
13778 1300082 973395 940163 636595 946044 863020 1085377 678477 1071122 847047 667976
$$ packed form
13849A138033l6425o5192K08250R2423j01963Q007l99972K89895q2497J11163
13839A161722N5907L7187l64115J35136o6871J11862P5747l53890J19630L96144
13829A308459k09115j86628P8203j14082L54206J19111m86377K4163J75121k16188
13819H46873K39119Q2671j55624n634K8871N2618K4242j5670k548k4464j43739
13808I26715p2396J65809o5115J1531j73112K54748M6014l69624J52993k8990
13798H48573j25843K3107L19479j4829k75574J73671k77299j38810L75416P6891
13788I84782O1726j67869J44007k00894K38076J63139q9001l70529M50546Q6099
13778A300082l26687l3232l03568L09449q3024K22357m06900L92645k24075j79071
$$ plain form
13768 667976 994064 1186829 657006 820131 848050 994611 846609 942806 295863 904938
13758 904938 742508 754873 930135 515383 528256 977177 584949 654514 913699 852778
13748 852778 627382 570851 872800 908810 840146 878502 747101 1000317 614102 760199
13738 760199 805003 996947 691212 912725 451531 773032 676113 786910 995232 767008
13728 767008 634433 600175 779949 611319 794914 523832 772593 458593 475382 1032268
13718 1032268 480514 670129 721067 618687 632290 355187 686654 695169 819007 604535
13708 604535 562427 608937 694460 472343 575742 420536 756769 605555 798848 543184
13698 543184 607943 583534 915765 417691 759024 538488 441312 727702 614431 601538
$$ packed form
13768F67976L26088J92765n29823J63125K7919J46561j48002R6197B95863O09075
13758I04938j62430J2365J75262m14752J2873M48921l92228O9565K59185o0921
13748H52778k25396n6531L01949L6010o8664L8356j31401K53216l86215J46097
13738G60199M4804J91944l05735K21513D51531L21501r6919J10797K08322k28224
13728G67008j32575l4258J79774j68630J83595k71082K48761l14000J6789N56886
13718A032268D80514J89615N0938j02380J3603k77103L31467Q515J23838k14472
13708F04535m2108M6510Q5523k22117J03399j55206L36233j51214J93293k55664
13698E43184O4759k4409L32231D17691L41333k20536r7176K86390j13271j2893
$$ plain form
13688 601538 596692 816444 622291 970587 630239 486586 583359 336344 134553 619725
13678 619725 789149 429569 699426 596025 543497 336999 399132 522585 713672 441045
13668 441045 339671 724293 662730 381307 275883 118267 448378 408913 329566 583153
13658 583153 961510 556162 954693 904965 729280 135062 555927 562023 619464 203362
13647 617108 497654 614849 545238 470855 698959 562441 651461 632215 424675 279928
13637 279928 676363 358605 426263 684483 705685 556181 717352 473368 334222 384204
13627 384204 -3268 404645 383765 667008 518710 379489 600933 394275 337173 406972
13617 406972 477140 126009 278292 377091 543902 507217 444906 483011 483422 114344 359820
$$ packed form
13688F01538m846K19752j94153L48296l40348j43653R6773k47015A34553M85172
13678F19725J69424l59580K69857j03401n2528k06498O2133J23453J91087k72627
13668D41045j01374L84622o1563k81423j05424A18267L30111l9465p9347K53587
13658E83153L78357m05348L98531m9728j75685A35062M20865O096N7441B03362
13647F17108j19454J17195o9611p4383K28104j36518Q9020j9246k07540j44747
13637B79928L96435l17758O7658K58220K1202j49504J61171k43984j39146M9982
13627C84204c268D04645k0880K83243j48298j39221K21444k06658n7102O9799
13617D06972P0168A26009J52283R8799J66811l6685o2311L8105M11A14344K45476
$$ plain form
13606 359820 358917 745484 812957 346765 327734 346982 254378 446668 610723 408198 666119
13595 666119 450141 438770 304150 327512 599502 98024 428352 432725 331715 102400
13584 114744 253865 570971 617894 371676 80062 449834 633932 619526 349383 439918
13574 439918 73845 207213 375875 310267 416337 541519 539387 394425 382106 565288
13564 565288 316943 783849 -224759 335025 378409 484200 510222 183522 336085 162577
13553 165279 467477 653317 441208 486739 182179 183898 318395 487836 80217 500534
13543 500534 793985 314421 495790 597905 228410 320347 429010 469020 278623 530421
13533 530421 395959 467571 234520 460177 356432 55285 591609 170053 279435 617867
$$ packed form
13606C59820r03L86567O7473C46765j9031J9248r2604J92290J64055k02525K57921
13595F66119k15978j1371j34620K3362K71990I8024L30328M373j01010A02400
13584A14744J39121L17106M6923k46218H0062L69772J84098j4406k70143R0535
13574D39918G3845J33368J68662o5608J06070J25182k132j44962j2319J83182
13564E65288k48345M66906b24759C35025M3384J05791K6022A83522J52563A62577
13553A65279L02198J85840k12109M5531A82179J719J34497J69441H0217M20317
13543E00534K93451C14421J81369J02115B28410R1937J08663M0010j90397K51798
13533E30421j34462P1612k33051K25657j03745E5285N36324A70053J09382L38432
$$ plain form
13523 617867 12468 661164 220932 385288 186705 208217 213130 186903 126521 231398 526784
13512 526784 377898 219181 369065 342283 269214 494040 174323 404298 443635 282631
13502 282631 346404 198335 -147858 189899 120064 210986 482797 307770 147044 84548
13492 84548 464427 330579 258695 615199 364524 241296 218934 265954 406681 631041
13482 631041 321982 -30419 150122 50289 455993 705060 250147 312991 331081 366957
13472 366957 389125 198316 424796 67427 306177 514733 326274 404067 72217 600709
13462 600709 274130 475182 317617 84005 125908 418895 341512 225927 69337 283167
13452 283167 428560 129786 75622 298909 226548 170535 -16136 349272 134130 514765
$$ packed form
13523F17867A2468O48696B20932J64356A86705K1512M913k6227o0382J04877K95386
13512E26784j48886j58717J49884k6782p3069K24826A74323K29975L9337j61004
13502B82631O3773j48069a47858A89899o9835R0922K71811j75027A47044o2496
13492H4548L79879j33848p1884L56504k50675j23228k2362M7020J40727K24360
13482F31041l09059c0419A50122E0289M05704K49067B50147O2844J8090L5876
13472C66957K2168j90809K26480F7427K38750K08556j88459P7793G2217N28492
13462F00709B74130K01052j57565H4005M1903K92987p7383j15585F9337K13830
13452B83167J45393A29786n4164K23287p2361n6013a6136C49272A34130L80635
$$ plain form
13442 514765 -128666 277142 347880 388682 -23715 229633 63497 608381 161028 457469
13432 457469 388872 343731 -13860 -52375 489229 763568 318400 258624 303771 224390 320822
13421 320822 226833 363192 382612 501147 347289 33638 254952 175427 86323 508040
13411 508040 385275 156767 403831 166819 232097 284911 210375 88696 176948 141331 207544
13400 207544 328561 474905 372655 130925 623628 404248 361652 374299 258692 460565
13390 460565 145336 55812 266577 346752 290804 112986 298630 234906 33519 264078
13380 264078 159450 226591 -3790 238264 218674 152238 153815 -99863 305532 -44059 152096
13368 188430 100303 345841 244327 287318 62459 103516 460139 77681 41588 122194 163430
$$ packed form
13442E14765a28666B77142P0738M0802b3715B29633F3497N44884A61028K96441
13432D57469o8597m5141a3860l8515D89229K74339C18400n9776M5147p9381R6432
13421C20822r3989J36359J9420J18535j53858C3638K21314p9525H6323M21717
13411E08040j22765A56767K47064A66819O5278N2814p4536H8696Q8252l5617O6213
13400B07544J21017J46344j02250A30925M92703k19380m2596J2647j15607K01873
13390D60565A45336E5812K10765Q0175n5948A12986J85644o3724C3519K30559
13380B64078j04628O7141c790B38264j9590o6436J577i9863C05532d4059A52096
13368A88430q8127K45538j01514M2991F2459M1057L56623G7681l6093Q0606M1236
$$ plain form
13357 163430 259166 -45557 309992 124609 229752 141107 424887 -81530 452026 134862
13346 314622 368997 184103 129052 432694 102524 155444 141528 582865 71354 -19506 317309
13334 457198 494148 680241 -100867 350129 444545 186732 345854 217885 178444 270948
13324 270948 345959 344555 365988 361721 220839 308105 203876 89668 161136 362241 86329
13312 380323 -16562 239187 276243 -217956 380029 258267 395144 472055 494542 251403
13302 251403 112163 -44006 252908 279532 456896 275593 33370 160105 -200755 -55698
13291 -56831 149655 288448 145071 15328 130928 125268 289676 241384 445313 62640 356696
13280 356696 194910 96990 22934 178361 28672 76258 267956 155987 278616 -55464
$$ packed form
13357A63430R5736d5557C09992A24609J05143q8645K83780h1530D52026A34862
13346C14622N4375A84103n5051L03642A02524N2920j3916M41337G1354a9506C17309
13334D57198L6950J86093a00867C50129R4416A86732J59122j27969l9441R2504
13324B70948P5011j404K1433m267j40882Q7266j04229H9668P1468K01105H6329
13312C80323a6562B39187L7056b17956C80029j21762J36877P6911K2487k43139
13302B51403A12163d4006B52908K6624J77364j81303C3370J26735b00755e5698
13291e6831A49655J38793j43377A5328J15600n660J64408m8292K03929F2640K94056
13280C56696j61786I6990B2934J55427B8672M7586J91698j11969J22629e5464
$$ plain form
13269 291691 46916 145338 211225 122654 209987 57275 138512 467739 -52308 102043 262969
13258 262969 305602 239536 124478 470682 -246003 202284 455279 125287 44402 249097
13248 249097 83602 212205 -85925 59662 328558 210559 346490 261746 32478 279266
13238 279266 98979 211459 156707 500469 174789 45539 -170972 2240 76522 155838 -87779
13226 345691 -138664 -229043 -172786 -214697 -81808 222458 281573 86251 427763 150412 429791
13215 429791 380871 411252 326745 423696 211256 -104288 -23973 177143 246105 335836 148253
13203 302691 266112 83019 48459 344801 209308 53255 67155 7561 -243989 335257 265431
13192 265431 52819 158526 241460 -259761 25285 -67947 11951 8328 -949 106517 -59935
$$ packed form
13269B91691D6916R8422O5887q8571Q7333E7275Q1237L29227e2308A02043J60926
13258B62969M2633o6066j15058L46204b46003B02284K52995A25287D4402K04695
13248B49097H3602J28603h5925E9662K68896j17999J35931q4744C2478K46788
13238B79266I8979J12480n4752L43762A74789D5539a70972B240P4282P9316h7779
13226C45691a38664r0379N6257m1911h1808B22458N9115H6251L41512A50412K79379
13215D29791m8920L0381q4507R6951B11256a04288b3973A77143O8962Q9731A48253
13203C02691l6579H3019l4560K96342j35493E3255J3900G561b43989C35257o9826
13192B65431E2819J05707Q2934b59761B5285f7947A1951l623i49A06517e9935
$$ plain form
13180 176828 -85409 -49087 65962 45473 189199 165654 -104014 -21293 181735 104655 -35116
13168 395056 108494 -104726 244138 51610 164041 -85348 76850 140561 232750 -203781
13157 -331551 28034 -218837 291257 75108 191977 -176292 185753 283931 -43802 -94397
13147 -94397 104097 39558 397433 233960 237852 141867 16695 319679 424498 290570 132365
13135 45855 32058 66601 7053 317293 39588 218324 74155 61790 394705 378908 103503
13123 -50502 -101107 89825 -86211 20923 -207848 -243943 70310 66714 -24449 130318 161626
13112 161626 258176 219681 80405 66943 206824 446527 69096 154057 62857 334202 27464
13100 103055 272423 -65369 -55790 169745 -167210 116356 -38809 57830 170134 51606 -59638
$$ packed form
13180A76828h5409L6322F5962k0489J43726k3545a04014b1293A81735p7080c5116
13168C95056A08494a04726B44138E1610J12431h5348G6850O3711R2189b03781
13157c31551B8034b18837B91257G5108J16869a76292A85753R8178d3802n0595
13147i4397A04097C9558L57875j63473L892r5985A6695L02984J04819j33928A32365
13135D5855j3797L4543G053L10240C9588J78736G4155j2365L32915j5797A03503
13123e0502n0605H9825h6211B0923b07848l6095G0310l596b4449A30318L1308
13112A61626R6550l8495H0405j3462J39881K39703F9096Q4961F2857K71345B7464
13100A03055J69368f5369R579A69745a67210A16356c8809E7830J12304E1606e9638
$$ plain form
13088 329861 344196 151480 -185795 294563 -99861 82731 -117617 -49547 77808 244546
13078 244546 -8170 3700 226398 77675 251658 140979 61571 157179 -28444 -191337 141901
13066 40826 183468 177674 170314 170918 133548 56669 277386 164138 -15982 174879 -38843 -92272
13054 -92272 188717 101692 101507 114643 164188 21133 215196 133895 299948 175308 166348
13043 166348 157347 367860 426856 -164855 -175024 85305 -277669 -78764 -156933 166611 -192182
13031 86611 359158 -224797 -52557 23114 241392 156519 263675 163732 121506 132561 143240
13020 143240 616354 110862 -22540 63051 -126391 255340 120015 22406 172730 119037
13010 119037 -33352 -46032 245442 285249 312229 -122756 138667 345327 221566 -217302
$$ packed form
13088C29861J4335A51480a85795B94563i9861H2731a17617d9547G7808J66738
13078B44546h170C700K22698G7675J73983j10679F1571R5608b8444j62893A41901
13066D0826J42642n794p360O04l7370E6669K20717j13248a5982A74879c8843n3429
13054i2272A88717q7025j85J3136M9545B1133J94063q1301J66053j24640q960
13043A66348r001K10513N8996a64855j0169H5305b77669g8764p8169A66611a92182
13031H6611K72547b24797e2557B3114K18278q4873J07156r9943m2226J1055J0679
13020A43240M73114A10862b2540F3051a26391B55340A20015B2406J50324n3693
13010A19037c3352j2680B45442L9807K6980a22756A38667K06660j23761b17302
$$ plain form
12999 -149466 -15462 31260 106461 -49867 154176 177274 -164769 248679 85980 158014 -144202
12987 172525 222994 112514 -280236 -199651 129553 50927 195155 -91577 85348 127064 51723
12975 -51215 25713 138661 202114 -10840 119448 283251 7496 435829 163470 168381 295733
12964 295733 122856 29850 43924 439846 133170 67777 186992 -54592 -193388 206604
12953 179269 316516 174909 249255 265482 8358 167210 2849 226893 74694 71498 -172793
12941 -36540 34784 284978 174093 -77360 30398 171079 47823 187061 157780 -99590 -76566
12930 -76566 389241 82284 134082 146397 258617 1213 71930 71050 93208 -141040 387785
12918 -153303 302723 115632 160281 241624 207930 82955 67476 -214272 332002 -153879
$$ packed form
12999a49466a5462C1260P5201d9867A54176K3098a64769B48679H5980P2034a44202
12987A72525N0469j10480b80236Q0585A29553E0927J44228i1577H5348M1716E1723
12975e1215B5713J12948O3453a0840A19448J63803G496M28333A63470M911J27352
12964B95733A22856B9850J4074L95922A33170o5393J19215e4592j38796B06604
12953A79269J37247j41607P4346J6227H358J58852B849K24044G4694l196a72793
12941c6540C4784K50194j10885g7360C0398J40681D7823J39238k9281i9590K3024
12930g6566C89241H2284N1798J2315J12220A213P0717q80K2158a41040C87785
12918a53303C02723A15632M4649Q1343l3694H2955j5479b14272C32002a53879
$$ plain form
12907 73326 143454 33076 -126708 320444 393855 -54318 -239106 343492 -102784 -99984 82475
12895 130577 96491 237645 -136751 -280793 -102085 17181 100169 163336 -91740 111516
12884 148013 233639 -25789 68292 -122732 45413 5959 423261 74072 6504 119911 -192252
12872 188403 -172343 85691 -3513 -78362 -149585 47979 -240909 6218 235541 16210 -205272
12860 187962 -132324 -121180 -86970 30465 54175 -98172 134109 122549 88775 103550 116674
12849 116674 -326311 204778 62535 124968 -132320 147885 -59835 46551 -165251 77149
12838 36599 173970 -158583 141985 -165535 -15117 -68499 -109537 30032 203218 -32581 -108832
12827 -108832 6597 -156195 -87058 24217 109512 123153 -52723 -300899 148730 34858 -315423
$$ packed form
12907G3326P0128C3076a26708C20444P3411e4318j84788C43492a02784K800H2475
12895A30577l4086J41154a36751j44042a02085A7181Q2988O3167i1740A11516
12884A48013Q5626b5789F8292a22732D5413E959M17302G4072F504J13407a92252
12872A88403a72343H5691c513p4849p1223D7979b40909F218K29323A6210b05272
12860A87962a32324J1144L4210C0465K3710i8172A34109j1560l3774J4775J3124
12849A16674c26311B04778F2535O2433a32320A47885e9835D6551a65251G7149
12838C6599J37371a58583A41985a65535a5117n3382m1038C0032J73186c2581p6251
12827a08832F597a56195O9137B4217Q5295J3641e2723k48176A48730C4858c15423
$$ plain form
12815 82281 105291 -788 304492 306609 79376 69951 338786 12639 88299 -41716 14043 -114380
12802 -6884 206434 172312 219300 321684 -501718 1487 212635 16225 -72998 253804 -111066
12790 190606 134057 -26821 -97820 145792 -6187 -29129 -71177 -34925 -89754 -329065 -39322
12778 102988 -180768 -77096 360779 -268937 139809 51118 29499 167957 -112795 -53607
12767 -55674 247625 19551 -105157 49770 -62728 101975 4246 153093 -293346 278436 35790
12755 156892 -70482 102908 335769 -192453 -324571 -141344 256188 246176 23164 32078
12745 32078 -87059 22394 372501 -110857 -77967 36293 -169829 -68546 24686 -98953 41822
12733 363122 -28564 -139150 -32108 138805 385847 283794 274352 151396 40941 319923
$$ packed form
12815H2281K3010g88C04492K117G9376r425K68835A2639P5660d1716A4043a14380
12802f884B06434l4122M6988J02384e01718A487K11148A6225g2998B53804a11066
12790A90606n6549b6821p0999A45792f187k2942m2048c4925n4829k39311c9322
12778A02988a80768g7096C60779b68937A39809E1118k1619J38458a12795e3607
12767e5674B47625A9551a05157D9770f2728A01975D246J48847b93346B78436C5790
12755A56892g0482A02908K32861a92453j32118a41344B56188j0012B3164Q914
12745C2078h7059B2394L50107a10857L2890C6293a69829f8546B4686i8953D1822
12733C63122b8564j10586c2108A38805K47042j02053r442j22956D0941K78982
$$ plain form
12723 319923 416166 410879 -170274 123774 389498 -199043 -339393 147918 162592 174399
12713 174399 -63322 334810 111137 -72449 183460 257458 71683 328927 50631 -203227
12702 6184 2507 49692 -126632 -219679 74241 -253567 206970 195475 120976 37885 387684
12691 387684 90724 413097 -86795 521523 14852 198513 -56570 160742 130685 -81006 20894
12679 -11620 350109 39093 9692 -37465 164116 -28703 98934 276637 143940 -186978 102413
12667 -180327 -123586 197919 -79721 241325 207306 -76902 -144059 -366020 495366 -17771 205164
12655 245930 334102 -23386 286067 2858 -16372 220106 7220 193983 -15007 43680 170034
12644 170034 283697 -42504 203362 195894 38267 173399 188540 29227 -34901 229067 263638
$$ packed form
12723C19923R6243n287a70274A23774K65724a99043j40350A47918J4674J1807
12713A74399f3322C34810A11137g2449A83460P3998G1683K57244E0631b03227
12702F184B507M7185a26632r3047G4241b53567B06970j1495p4499C7885L49799
12691C87684I0724L22373h6795E21523A4852J83661e6570A60742l0057h1006B0894
12679a1620C50109C9093I692c7465A64116b8703I8934J77703j32697a86978A02413
12667a80327N6741A97919g9721B41325l4019g6902o7157k21961D95366a7771B05164
12655B45930Q8172b3386B86067B858a6372B20106G220J86763a5007D3680J26354
12644A70034J13663d2504B03362p468C8267J35132J5141B9227c4901B29067L4571
$$ plain form
12633 263638 -219025 188356 326715 306139 -104437 56680 -172326 11887 -97300 180840
12622 146063 -182852 46877 104224 -122060 214307 -8598 -167195 395987 387481 171334 451601
12611 451601 123426 234192 120491 18794 355706 -122343 9360 202761 -56220 -84840
12601 -84840 307959 211781 135016 242706 -270915 231754 104692 -44065 -14047 93268 354082
12590 354082 129653 158199 193555 -4727 -118437 -22997 75933 162793 201803 268128 271901
12579 271901 41081 69208 18883 -40777 219916 237639 -112010 161974 215564 171008 -270044
12567 129202 148474 -119226 25167 160075 -402829 16360 -81306 92272 2172 173586 92666
12556 92666 355831 219946 125534 83473 -2107 -15979 44054 -13159 -10852 -125667 34769
$$ packed form
12633B63638b19025A88356J38359k0576a04437E6680a72326A1887i7300A80840
12622A46063a82852D6877N7347a22060B14307h598j58597C95987q506A71334K80267
12611D51601A23426J10766j13701A8794L36912a22343I360J93401e6220k8620
12601h4840C07959r6178p6765J07690b70915B31754A04692d4065a4047I3268K60814
12590C54082A29653K8546L5356d727j13710b2997G5933Q6860L9010O6325L773
12579B71901D1081K8127A8883d0777B19916J7723a12010A61974N3590m4556b70044
12567A29202J9272a19226B5167J34908d02829A6360h1306I2272B172J71414q0920
12556I2666K63165j35885r4412m2061b107j3872D4054a3159K307j14815C4769
$$ plain form
12544 -147426 -143126 -157066 -217318 194606 -59117 152442 39903 -57903 127168 -44848 -86407
12533 -86407 239346 -13712 419568 -388205 -63326 48086 -219861 -21321 28010 -62798 -255712
12522 -255712 -161123 12954 213856 455922 -68160 -36922 -48924 442397 125128 -171838
12511 -41490 -75062 116576 -79693 218621 -113823 84648 75793 134305 134938 -188741 -90295
12499 -209358 -125739 388256 -340100 37404 11696 -47182 170375 194267 33563 272732 68800
12487 6997 -225819 39630 -165851 -139518 287969 212376 -307428 201661 -145276 93323 205657
12476 205657 -12209 189228 -77295 62860 -92927 104453 -17500 -393798 -99592 162719 -16914
12464 -23389 170272 237993 -212233 -230303 84326 194814 -310401 251928 -77893 36097 -120462
$$ packed form
12544a47426M300j3940o0252A94606e9117A52442C9903e7903A27168d4848m1559
12533h6407B39346a3712D19568c88205f3326D8086b19861b1321B8010f2798j92914
12522b55712R4589A2954K00902K42066f8160L1238j2002D42397A25128a71838
12511d1490l3572A16576g9693B18621a13823H4648q855N8512O33a88741i0295
12499b09358Q3619C88256c40100C7404A1696d7182A70375K3892C3563K39169F8800
12487F997b25819C9630a65851K6333B87969p5593c07428B01661a45276I3323J12334
12476B05657a2209A89228g7295F2860i2927A04453a7500l76298i9592A62719a6914
12464b3389A70272O7721b12233j8070H4326J10488c10401B51928g7893C6097a20462
$$ plain form
12452 -5386 11885 8432 -184584 200886 206694 386902 256601 77487 -19495 24783 46932
12441 46932 -313892 117336 185740 75467 -119633 -98070 -18422 -84987 180781 306067 -54781
12429 437025 42857 195414 -93371 16600 -250357 -394981 186563 2960 6300 -271568 -70119
12417 178296 88385 -429073 -25954 71700 -154000 -211965 43829 55984 314566 -209671 26481
12405 -79173 235994 34771 -37872 -265175 -212260 -14723 -139772 -13006 -49093 52236 206887
12394 206887 136376 163437 356851 3233 -61228 -54964 74808 -324711 261471 -40722 -238319
12383 -238319 -24737 -354469 -67674 -197999 -252524 8538 227879 -61128 -8945 9842 -112618
12371 -55025 -163603 66562 381142 -325350 19713 109155 90457 111219 -252714 43855 157625
$$ packed form
12452e386A1885l453a84584B00886N808J80208j30301G7487a9495B4783K2149
12441D6932c13892A17336O8404G5467a19633K1563a8422o6565A80781J25286e4781
12429D37025D2857J52557i3371A6600b50357j44624A86563B960L340b71568g0119
12417A78296H8385d29073b5954G1700a54000n7965D3829J2155K58582b09671B6481
12405g9173B35994C4771c7872k27303N2915a4723j25049a3006l6087E2236J54651
12394B06887p0511K7061J93414C233f1228O264G4808c24711B61471d0722j97597
12383b38319b4737l29732f7674j30325n4525H538K19341f1128h945I842a12618
12371e5025j08578F6562L14580c25350A9713Q9442j8698K0762b52714D3855J13770
$$ plain form
12360 157625 148441 -284082 64483 300378 107673 62610 -189221 167275 -108932 102278
12349 116759 106395 76575 320520 172093 31702 -149208 -112911 233582 -781 3585 -237094
12337 -80879 16684 -40208 12864 -247787 31287 456211 113423 -9019 -211067 226039 113339
12326 113339 -97274 -216880 -131402 -64245 245285 101129 291131 -123133 -100573 -92431 -97439
12315 -97439 100366 -7080 253555 -221131 214753 -162810 3412 -126581 -22707 -130390 -219497
12304 -219497 176574 252044 -164457 276016 -126255 4298 -85355 1369 -176787 -14514 141754
12292 -50208 -231416 188996 -238116 276347 -55044 21626 -327313 -57411 68031 240409
12282 240409 296694 -47877 188292 175791 -73152 225417 6861 366240 112146 -31859 -134254
$$ packed form
12360A57625r184b84082F4483K35895A07673m5063a89221A67275a08932A02278
12349A16759j0364k9820K43945j48427C1702a49208L6297B33582g81C585b37094
12337h0879A6684d0208A2864b47787C1287M24924A13423i019k02048B26039j12700
12326A13339i7274j19606Q5478f4245B45285A01129J90002a23133K2560Q142n008
12315i7439A00366g080B53555b21131B14753a62810C412a26581b2707j07683q9107
12304b19497A76574P5470a64457B76016a26255D298h5355A369a76787a4514A41754
12292e0208j81208A88996b38116B76347e5044B1626c27313e7411F8031J72378
12282B40409N6285d7877A88292j2501g3152B25417F861L59379A12146c1859j02395
$$ plain form
12271 -134254 79634 119228 56850 -165902 -55998 -91261 208653 67665 277381 -120807 -72087
12260 -72087 256884 -134848 -183602 86937 73737 143459 284562 -38336 -122 -199495 5872
12248 -22753 95326 85297 531287 424289 -72685 -28113 -27281 380566 50396 -124674 -12647
12236 114417 -6139 -165105 -41796 158315 25614 -24607 53923 -132706 249386 19068 93936
12225 93936 -119031 -6060 388822 163865 -257576 341333 205668 58364 -218790 -30189
12214 -70762 185602 184445 336281 56317 227859 49506 484584 72474 167196 -151548 -143334
12203 -143334 108758 276149 77014 152504 -239620 14883 120377 362912 161065 146694
12193 146694 -24459 245378 95725 295381 -29783 351376 -10061 278204 14455 196807
$$ packed form
12271a34254G9634L9594E6850a65902e5998l5263B08653F7665K09716a20807M8720
12260g2087B56884a34848m8754H6937j3200O9722J41103c8336a22j99373E872
12248b2753I5326j0029M45990j06998g2685b8113Q32C80566E0396a24674a2647
12236A14417f139j58966d1796A58315B5614b4607E3923a32706B49386A9068P4868
12225I3936a19031f060C88822A63865b57576C41333j35665E8364b18790c0189
12214g0762A85602j157J51836E6317J71542D9506M35078G2474R4722a51548Q214
12203a43334A08758J67391G7014P5490b39620A4883J05494K42535A61065j4371
12193A46694b4459B45378I5725J99656b9783C51376a0061B78204A4455J82352
$$ plain form
12183 196807 189859 282313 363716 188948 403137 107896 52882 -7102 209308 67515 27647
12171 -22885 190594 108969 141315 71428 375824 56751 440403 23337 -22559 90178 -79103
12159 313845 20876 217103 119356 160647 84412 176289 -55354 -47538 123215 173404 78590
12147 35844 412500 -245078 -133393 33891 898 -180065 -42562 89720 847 678125 8160 158252
12135 158252 -87363 -1181 61387 -73639 16410 329515 276376 113716 318913 95333 36891
12123 -410811 218443 262207 318025 -167686 -87012 24391 -282814 168885 -140337 -251576
12113 -251576 144671 -75646 193659 -410700 -203359 133557 -62140 -27324 -185087 -38466
12102 99759 251034 168212 -32431 252420 216057 74693 639991 -177650 10980 123924 -17327
$$ packed form
12183A96807o948R2454Q1403j74768K14189A07896E2882g102B09308F7515B7647
12171b2885A90594q1625L2346o9887L04396E6751L83652B3337b2559I0178g9103
12159C13845B0876J96227r7747M1291p6235R1877e5354P816A23215N0189G8590
12147C5844L76656b45078J11685C3891H98a80065d2562H9720H47O77278H160J50092
12135A58252h7363a181F1387g3639A6410L13105n3139A13716K05197I5333C6891
12123d10811B18443M3764N5818a67686Q0674B4391b82814A68885a40337j11239
12113b51576A44671g5646A93659d10700b03359A33557f2140b7324j57763c8466
12102I9759J51275q2822c2431B52420l6363G4693N65298a77650A0980J12944a7327
$$ plain form
12090 -53325 128380 -88382 -35572 80598 85890 151960 -343483 -17335 -311373 79352 224491
12079 224491 253965 -230448 -83134 -55696 163793 56942 -38573 161874 53170 119100 -18502
12067 -165657 169260 -19605 -121714 162484 96577 38175 166282 545605 195460 572172
12057 572172 1133590 539368 -8762 128567 305001 162248 86709 321460 273297 99689
12046 13111 -68599 6496 -288832 -170418 -8270 -152949 221880 -177235 74368 -277898 179541
12034 -69264 -180991 -31878 -90613 -354777 -475764 48633 -172032 -103855 59793 162419 19610
12022 -92657 -49061 220325 -158967 80687 203822 -40827 154777 -6576 21523 -222791 161243
12010 -22953 -47299 -132780 -51484 -185317 162452 -159726 195356 103944 -223392 -47229 -8263
$$ packed form
12090e3325A28380h8382c5572H0598N292O6070c43483a7335k94038G9352J45139
12079B24491K9474b30448h3134K7438A63793E6942c8573A61874E3170O5930a8502
12067a65657A69260a9605j02109A62484o5907C8175J28107L79323A95460L76712
12057E72172N61418E39368h762A28567J76434j42753p5539K34751m8163I9689
12046A3111f8599F496b88832J18414h270j44679B21880a77235G4368b77898A79541
12034f9264j11727c1878n8735k64164j20987D8633a72032O8177E9793J02626A9610
12022i2657M3596B20325a58967H0687J23135d0827A54777f576B1523b22791A61243
12010b2953k4346q5481e1484j33833A62452a59726A95356r1412b23392d7229h263
$$ plain form
11998 102791 -144310 -383764 132861 121124 -71488 -238039 187584 -36965 -527703 -88074
11987 -148949 -77555 -276611 -81715 -65784 718 -121434 228986 296586 307108 -105217 247151
11975 -69322 -337933 102396 -99746 -281225 -120467 127558 257958 13649 64784 66838 234103
11964 234103 112820 278039 227697 253261 -90138 -190434 42268 -290515 344103 -139022
11953 -112725 20612 -278522 -19203 55795 -26570 -18488 -40932 -260438 26435 126284 -144792
11941 95912 156382 59921 -36571 122888 -347012 -228546 132510 225093 106125 92028 -107942
11929 421766 -104476 353314 46990 244288 98583 -304430 -67411 -199022 -106264 -134400
11919 -134400 79254 235571 -83270 -70872 66124 -289812 96247 20263 -218755 -13620 71468
$$ packed form
11998A02791a44310k39454A32861j1737g1488j66551A87584c6965m90738h8074
11987a48949P1394j99056h1715J5931G18a21434B28986O7600J0522a05217B47151
11975f9322k68611A02396i9746j81479a20467A27558J30400A3649N1135K054J67265
11964B34103A12820J65219n0342K5564i0138j00296D2268b90515C44103a39022
11953a12725B0612b78522a9203E5795b6570Q082k2444k19506B6435R9849a44792
11941I5912O0470E9921c6571A22888c47012J18466A32510R2583A06125j4097a07942
11929D21766a04476C53314D6990J97298I8583c04430f7411j31611R2758k8136
11919a34400G9254J56317h3270J2398F6124b89812I6247B0263b18755a3620G1468
$$ plain form
11907 18920 330576 287133 -303635 -57496 131339 410625 -236015 -275330 -237261 -302257 -83823
11895 64565 113078 7234 -2085 -137936 138365 -40999 25111 -241502 -21428 51297 5379 -167613
11882 31736 -92985 -127369 -74762 218059 179857 -73554 33675 56307 117837 -74046 17723
11870 83690 50403 -407899 -250976 -201004 -243647 -123000 -115678 42395 35185 -32092 -246738
11859 -246738 -164626 10925 4205 -286692 13173 -458 -188894 -219729 32691 -88824 -407492
11848 -407492 100746 -102396 -59853 -36859 -166993 -212143 -58056 -175415 -48090 -318372
11838 -318372 -104658 153922 283447 -5801 38601 -89794 38256 -294019 -144858 104570
11827 140514 18276 -109366 -22622 258020 -104102 4221 102395 -231062 31507 167999 -6341
$$ packed form
11907A8920L11656m3443c03635e7496A31339K79286b36015l9315L8069o4996h3823
11895F4565M8513G234b085j35851A38365d0999B5111b41502b1428E1297E379a67613
11882C1736i2985l4384N2607B18059l8202g3554C3675K2632O1530g4046A7723
11870H3690l3287d07899J56923M9972m2643J20647P322D2395p210c2092k14646
11859b46738Q2112A0925D205b86692A3173d58j88436l0835C2691h8824l18668
11848d07492A00746a02396M2543K2994j30134m5150e8056j17359d8090k70282
11838c18372a04658A53922J29525e801C8601h9794C8256b94019a44858A04570
11827A40514A8276a09366b2622B58020a04102D221R8174b31062C1507J36492f341
$$ plain form
11815 -285660 -97862 157625 -367456 63581 23432 76223 -151213 47566 -188595 -15899 16426
11803 61329 -258318 -2953 -25172 -222176 66548 25207 86427 -44450 -40920 -325712 8433 65758
11791 65758 372783 -214696 -46348 -140663 -179819 -40086 -112495 -184347 159277 -89247 -55633
11780 -55633 -116854 125992 -133000 193892 -56860 -79513 -241674 75647 185814 180577 -201100
11768 13759 -70073 -239874 -3331 10763 194123 -146028 95077 -131568 383461 -210062 196610
11756 95994 -222359 -111820 -303595 53390 106930 63851 -181570 -248079 -21079 -75965 16836
11744 -71571 -35448 -77148 -35538 106521 301689 -10462 183416 -43871 286782 334442 -55101
11732 -85259 -94137 -58362 -57965 39998 -87207 103332 -322345 -243237 -31057 -259071 -66073 229848
$$ packed form
11815b85660i7862A57625c67456F3581B3432N2791a51213D7566a88595a5899A6426
11803F1329b58318b953k2219j97004F6548B5207O1220d4450L530k84792H433N7325
11791F5758L07025b14696d6348r4315l9156d0086p2409p1852A59277h9247L3614
11780e5633o1221A25992a33000A93892e6860k2653j62161G5647J10167n237b01100
11768A3759g0073j69801c331A0763J83360a46028I5077a31568C83461b10062A96610
11756I5994b22359J10539j91775E3390N3540m3079a81570o6509b1079n4886A6836
11744g1571c5448m1700c5538A06521J95168a0462A83416d3871B86782M7660e5101
11732h5259q878L5775L97C9998h7207A03332c22345P9108c1057k28014f6073B29848
$$ plain form
11719 -301012 41593 35915 172007 345967 168286 273821 -30055 107537 144109 -1037 211748
11707 -72681 264874 -99150 -120835 -246028 -262937 -49044 -11870 184995 237221 71928 -130466
11695 145184 -17807 239086 396326 78949 102714 61335 -27316 -9138 108193 155075 -102172
11683 -465685 -121090 10761 -223984 61924 -121670 162504 230031 218625 96176 -168138
11672 -97714 134435 -163232 154239 -374236 -108596 236326 85176 189030 -127605 -56716
11661 265561 -228804 184658 -24075 346907 -199891 -177967 -168194 -192039 8833 -11748 47786
11649 -16197 174428 313806 -41083 -268169 -50369 84753 209377 -83454 56630 -315792 -130189
11637 -77837 14045 127222 -60556 -165699 -102134 -10543 -156444 -70617 18512 148282 4836
$$ packed form
11719c01012D1593n678J36092J73960A68286J05535c0055A07537L6572a037B11748
11707g2681B64874i9150k1685j25193j6909d9044a1870A84995N2226G1928a30466
11695A45184a7807B39086J57240G8949K3765m1379b7316i138A08193M6882a02172
11683d65685a21090A0761b23984F1924a21670A62504O7527j1406I6176a68138
11672i7714A34435a63232A54239c74236a08596B36326H5176J03854a27605e6716
11661B65561b28804A84658b4075C46907a99891K1924R773k3845H833a1748D7786
11649a6197A74428J39378d1083k27086e0369H4753J24624h3454E6630c15792a30189
11637g7837A4045J13177f0556j05143O3565a0543j45901g0617A8512J29770D836
$$ plain form
11625 -163341 -138083 -237378 65253 -28613 46378 -46575 -132255 -15140 -97697 375927 346943
11614 346943 42233 189517 355745 90946 197870 172138 -125496 191606 -124492 -66071
11604 -66071 -76640 267713 135480 220966 139890 -162463 -52320 -142960 109125 -215111 203409
11592 156932 -316608 364588 -79935 36267 -179111 34054 -279577 303697 70790 71839 141124
11581 141124 152291 -208091 -93500 307552 -93141 113824 -268209 203426 103543 94878 -104872
11569 198557 -13708 103245 -18243 399771 79552 -158336 -110014 -330084 -332903 -92427 -293589
11558 -293589 451681 463229 -91487 -44523 282202 42014 -196470 154540 -847 -139454 -179797
11547 -179797 -213343 454109 172215 -138513 262178 110040 -74078 229014 -3394 -10546 -75968
$$ packed form
11625a63341K5258r9295F5253b8613D6378d6575q5680a5140q2557C75927k8984
11614C46943D2233J47284J66228I0946J06924k5732a25496A91606a24492N8421
11604f6071j0569B67713j32233Q5486q1076a62463e2320r0640A09125b15111B03409
11592A56932c16608C64588g9935C6267a79111C4054b79577C03697G0790J049O9285
11581A41124J1167b08091i3500C07552i3141A13824b68209B03426r9883q665a04872
11569A98557a3708A03245a8243C99771G9552a58336M8322k20070k819i2427k01162
11558b93589D51681J1548i1487d4523B82202D2014a96470A54540h47j38607m0343
11547a79797l3546D54109A72215a38513B62178A10040g4078B29014c394p152o5422
$$ plain form
11536 -75968 230380 -37842 -7595 209616 -140331 101141 68114 173514 -297682 391446
11525 -161437 81574 -135267 -99923 -91053 -234770 8431 187923 -85061 -21483 -211622 50495
11513 -66197 95060 128009 -151974 -31249 151723 -129655 339280 -71512 39586 -113222 324768
11501 195514 -44707 58362 60157 375750 55841 -144506 130183 141470 95476 190412 -146083
11489 -108700 -164429 -32024 -4427 307438 21892 210575 169980 43227 226417 -51495 166211
11477 111194 -54005 26887 -22780 251769 173219 107458 466425 230113 213232 -25206 257429
11465 291400 -208204 214784 206608 165109 -94613 126678 148382 210012 206805 94551 -40538
11453 27539 161132 73048 55656 55750 -236173 351652 74636 60469 293033 57077 -276599
$$ packed form
11536g5968B30380c7842g595B09616a40331A01141l3027J05400b97682C91446
11525a61437H1574a35267L5344Q870j43717H431J79492h5061b1483j90139E0495
11513f6197I5060L2949a51974c1249A51723a29655C39280g1512C9586a13222C24768
11501A95514d4707E8362J795L15593E5841a44506A30183J1287m5994R4936a46083
11489a08700n5729c2024d427C07438B1892J88683m0595D3227J83190e1495A66211
11477A11194e4005B6887b2780B51769p8550o5761L58967B30113j6881b5206B57429
11465B91400b08204B14784q176m1499i4613A26678K1704O1630l207I4551d0538
11453B7539J33593G3048j7392R4b36173C51652G4636j4167K32564E7077b76599
$$ plain form
11441 155849 156066 227352 14692 -224574 224787 -35319 168780 444793 56671 301367 -104473
11429 6020 123244 148336 34885 249649 179672 152995 55505 290284 -6906 388033 -257605
11417 -27989 37031 141461 151746 286149 -268814 27137 -161206 150625 -58084 -139278 -39458
11405 -15537 -40148 -199382 51626 -154718 218140 -452955 -193787 108690 96344 104454 -299576
11393 -297924 299067 -442084 39557 -38938 -72140 -3578 355664 -121768 8136 -39798 30390
11381 17197 -43989 256027 -255132 237656 183589 -32199 -238032 -68035 -221125 -349226
11371 -349226 -37923 140668 5417 -302438 105934 -4267 -232418 -242957 222892 -182567 -282821
11360 -282821 -12796 39194 548318 363731 138763 231108 209726 -379364 -34267 273922
$$ packed form
11441A55849K17P1286A4692b24574B24787c5319A68780K76013E6671K44696a04473
11429F020J17224K5092C4885K14764o9977k6677E5505K34779f906C88033b57605
11417b7989C7031J04430J0285J34403b68814B7137a61206A50625e8084q1194c9458
11405a5537k4611j59234E1626a54718B18140d52955a93787A08690j2346Q110b99576
11393b97924B99067d42084C9557c8938l3202c578C55664a21768H136c9798C0390
11381A7197d3989B56027b55132B37656n4067c2199k05833f8035j53090j28101
11371c49226c7923A40668E417c02438A05934d267k28151j0539B22892a82567j00254
11360b82821a2796C9194N09124j84587A38763R2345k1382c79364c4267B73922
$$ plain form
11349 79998 109455 -210141 148045 -155239 -272900 18198 86379 -45164 -420696 -52962 -48466
11338 -48466 -58716 -36866 -95837 -51956 69924 -132628 -236715 52963 -229578 -75761 -206828
11327 -206828 -141968 42115 -92135 -213504 -118344 -116646 56861 -5284 -25117 -77038 -71355 -106758
11315 -106758 18883 -111866 213154 -194860 -82873 -88237 -148199 398214 47692 214932 -289303
11303 -382042 77308 -169596 322445 182956 40272 138125 -407873 -74820 -415061 -47403
11292 121712 68612 -198167 23422 -237650 -192704 5718 -47176 80819 88194 22768 64885
11281 64885 -79872 116035 89925 86990 -106183 -189513 -29574 306738 -199191 201517 -18919
11269 -22868 -117592 -10236 -36219 116414 325954 -257708 27816 -117127 -29140 -261137 -82788
$$ packed form
11349G9998K9457b10141A48045a55239j17661A8198O8181d5164l75532e2962M496
11338d8466j0250K1850n8971M3881F9924a32628j04087E2963b29578g5761j31067
11327b06828O4860D2115i2135j21369R5160J698E6861e284j9833n1921N683l5403
11315a06758A8883a11866B13154a94860h2873n364n9962C98214D7692J67240b89303
11303c82042G7308a69596C22445j39489D0272R7853d07873g4820l40241d7403
11292A21712n3100a98167B3422b37650M4946E718d7176H0819P375B2768M2117
11281F4885g9872A16035k6110k935a06183q3330b9574C06738a99191B01517a8919
11269b2868r4724a0236k5983A16414K09540b57708B7816a17127b9140k31997h2788
$$ plain form
11257 -282131 304880 -103304 79216 -136106 -15503 -295200 -393946 -154116 -196056 84700
11246 -95749 -72609 -97589 172961 -13508 -173289 -106981 189323 175838 -96818 -298250 -49468
11234 -146268 -93895 -177086 -213751 68654 -78150 -513740 -86260 -66236 -10268 -142068 -96018
11223 -96018 -106108 -160486 -119630 179846 -303800 -196129 -146879 123773 49738 -139231 -178215
11212 -178215 -71826 -294947 -331412 78854 -163677 115435 -100073 301258 168878 187135
11202 187135 9594 -164288 61736 41510 -111703 -9074 -275236 222072 -6122 -22764 186579
11190 62743 28837 -117394 39383 241133 -182929 -154669 154233 237785 -25749 -325801 -96990
11178 135738 -43607 35010 35669 135217 -195672 133165 -134662 221616 113537 -269655 -100109
$$ packed form
11257b82131C04880a03304G9216a36106a5503k79697r8746a54116m1940H4700
11246i5749K3140k4980A72961a3508j59781O6308A89323j3485i6818k01432d9468
11234a46268N2373q3191l6665F8654g8150m35590h6260K0024a0268j31800M6050
11223i6018j0090n4378M0856A79846c03800J07671M9250A23773D9738a39231l8984
11212a78215g1826k23121l6465G8854a63677A15435a00073C01258j32380J8257
11202A87135I594a64288F1736k0226a11703i074k66162B22072f122j6642A86579
11190F2743B8837a17394C9383K01750a82929K8260A54233Q3552b5749l00052i6990
11178A35738d3607C5010O59R9548a95672A33165a34662B21616j08079b69655a00109
$$ plain form
11166 -275477 110434 -97827 355284 41986 24890 106201 -234555 -162791 -314322 54553 207838
11155 207838 7741 -150562 -232497 166736 246749 50877 123134 -17386 31618 450258 -71655
11143 -138393 2075 81668 -54047 11840 102417 13593 143763 262993 67516 -63088 -62574 65122
11130 -54113 -151750 88199 -127769 196169 -305185 75493 155767 294549 -55824 -160775 -248842
11119 -248842 106782 182164 39222 -7513 69799 48864 145373 -19561 184774 269839 259232
11108 259232 250788 179227 -262530 -11557 -126630 42863 -40445 -100330 -95267 -215565 427341
11096 -65002 -215028 -341170 97588 2141 240789 279144 62659 6992 228034 338201 143501
11084 457950 66672 345047 8474 126706 308082 239755 30826 363432 -169540 36780 -54683
$$ packed form
11166b75477A10434i7827C55284D1986j7096Q1311b34555P1764j51531E4553J53285
11155B07838G741a50562q1935A66736Q0013E0877P2257a7386C1618M18640g1655
11143a38393B075P9593e4047A1840R0577A3593J30170J19230F7516f3088N14F5122
11130e4113r7637H8199a27769A96169c05185G5493Q0274J38782e5824j04951q8067
11119b48842A06782P5382C9222g513F9799k0935R6509a9561A84774Q5065j0607
11108B59232q444p1561b62530a1557j15073D2863d0445n9885N063j20298D27341
11096f5002j50026j26142I7588B141K38648L8355F2659F992K21042J10167A43501
11084D57950F6672K78375H474J18232J81376o8327C0826L32606a69540C6780e4683
$$ plain form
11072 114203 429108 27150 232689 -42950 78494 206221 193593 -3081 117648 11402 406307
11061 406307 432129 194015 -204874 118576 188016 142221 247599 43797 260202 342754
11051 342754 57010 181747 466846 196802 407484 425166 392221 431981 476712 523631 702996
11040 702996 358849 375114 553782 628432 763312 611720 564421 483704 370002 367178 806637
11029 806637 628694 645071 647832 502517 811883 1083701 543361 466789 507267 623279
11019 623279 652911 720870 524694 836493 323821 708198 515256 813206 689031 371623
11009 371623 693523 404509 618049 951832 546424 511979 858262 739517 365772 472457
10999 472457 714558 491785 828635 488410 550740 728785 493269 568735 682989 648171
$$ packed form
11072A14203L14905B7150K05539d2950G8494J27727j2628c081A17648A1402L94905
11061D06307K5822A94015b04874A18576O9440m5795J05378D3797K16405Q2552
11051C42754E7010J24737K85099A96802K10682J7682l2945L9760M4731M6919J79365
11040G02996l44147J6265J78668P4650J34880j51592m7299q0717j13702k824M39459
11029H06637j77943J6377K761j45315L09366K71818n40340p6572M0478J16012
11019F23279K9632O7959j96176L11799C23821L84377j92942K97950j24175l17408
11009C71623L21900k89014K13540L33783m05408l4445L46283j18745C65772J06685
10999D72457K42101k22773L36850l40225O2330J78045k35516P5466J14254l4818
$$ plain form
10989 648171 558299 705052 228981 461073 471180 609632 732496 632344 708596 530332
10979 530332 470865 789708 944750 873266 834509 996201 836245 439748 459881 965509
10969 965509 853859 885687 911556 1117877 1639018 1283145 1384065 1501420 1865852 1914673
10959 1914673 2373584 2443362 2629715 2863405 2597036 2351932 2235033 1983440 1667103 1539384
10949 1539384 1451321 1231324 1458074 1626461 1386242 1377529 1412854 1078668 1149441 1259371
10939 1259371 1274076 785175 1130748 884038 674097 505788 515362 437785 446601 76252 13349
10927 361197 60467 371670 189051 453026 97749 423015 10967 184412 320483 55089
10916 4399 -206726 -12148 -100504 56257 280865 147855 -144407 -13939 153599 326761 112230
$$ packed form
10989F48171q9872J46753B28981K32092J0107J38452J22864j00152P6252j78264
10979E30332n9467L18843J55042p1484l8757J61692j59956l96497K0133N05628
10969I65509j11650L1828K5869K06321N21141l55873J00920J17355L64432M8821
10959A914673M58911O9778J86353K33690k66369k45104j16899k51593l16337j27719
10949A539384q8063k19997K26750J68387k40219q713L5325l34186P0773J09930
10939A259371J4705m88901L45573k46710k09941j68309R574p7577Q816G6252A3349
10927C61197F0467L11203j82619K63975I7749L25266A0967J73445J36071E5089
10916D399b06726a2148q8356E6257K24608j33010a44407a3939A53599J73162A12230
$$ plain form
10904 -221149 60793 -6214 367800 -86541 -99829 -115606 -143665 12984 369564 98297 -68316
10892 -178190 -181408 15537 2180 174774 95028 -31867 310912 -122197 76705 63570 90904
10881 90904 131184 -110927 -84499 -104474 144621 -236719 70218 -118073 149204 -41434 86076
10869 110660 302631 128872 -79467 98531 -51322 -421559 -28177 -121599 26558 83008 119415
10858 119415 3331 109262 143432 -161398 55322 159692 -82616 98034 -390251 -26531 -255518
10847 -255518 -199813 -101157 -72656 19306 -389699 375647 348862 -10178 14787 71655 -41177
10835 -152983 206437 161848 -84207 -203198 4523 234381 2966 106185 -148936 275139 5870
10823 -85945 -83289 74535 -92483 -103584 -105738 7900 28233 -18495 -162432 38838 773 12789
$$ packed form
10904b21149F0793f214C67800h6541j3288j5777k8059A2984L56580I8297f8316
10892a78190l218A5537B180J72594p9746c1867C10912a22197G6705j3135K7334
10881I0904M0280a10927K6428j9975A44621b36719G0218a18073A49204d1434H6076
10869A10660J91971A28872g9467I8531e1322l70237b8177r3422B6558N6450L6407
10858A19415C331J05931L4170a61398E5322J04370h2616I8034c90251b6531k28987
10847b55518N5705R8656K8501A9306c89699C75647k6785a0178A4787N6868d1177
10835a52983B06437m4589h4207j18991D523K29858B966J03219a48936B75139E870
10823h5945K656G4535i2483j1101k154G900K0333a8495j43937C8838G73J2016
$$ plain form
10811 12789 -161465 286056 -26116 298281 -270074 -268057 182308 -134972 -130036 194040 135134
10800 135134 91105 -101505 51231 256845 -62337 -81975 -39129 179212 -127086 -286962
10790 -286962 -23052 89611 -64320 -279930 -39585 -244238 -67006 147371 -31071 -60532 66877
10778 -150843 240232 61718 -255675 152435 -165828 26581 -39920 -226967 70405 -440117
10767 -246298 -105555 31049 61823 212538 -36697 -118835 -213226 -46092 163878 113414 -123308
10755 -145805 -80128 -35809 199064 108949 28549 -83 6843 71119 70327 36380 14788 -196689
10742 142028 -345345 -180541 -123693 -165714 -276893 39591 140588 -12523 -46745 82200 -79939
10730 45774 -127702 -74737 -77052 -41277 -91212 105512 168847 -245985 257985 143888 -290509
$$ packed form
10811A2789a61465B86056b6116B98281b70074K017A82308a34972M936A94040n8906
10800A35134m4029a01505E1231K05614f2337j9638c9129A79212a27086j59876
10790b86962b3052H9611f4320k15610c9585k04653f7006A47371c1071k9461F6877
10778a50843B40232F1718b55675A52435a65828B6581c9920j87047G0405d40117
10767b46298a05555C1049L0774J50715c6697q2138r4391d6092A63878n0464a23308
10755a45805O5677c5809A99064r0115B8549h3F843O4276p92l3947A4788a96689
10742A42028c45345J64804N6848m2021j11179C9591J00997a2523l4222H2200g9939
10730D5774a27702N2965k315L5775m9935A05512O3335b45985B57985j14097b90509
$$ plain form
10718 5280 -133484 -121342 72518 57841 102669 217137 99459 304433 -288413 145425 31936
10706 -173037 -114937 -250059 156590 -79111 -157104 -137313 -163436 14346 99593 -71194 -182611
10695 -182611 -587939 -446347 -265877 325751 28969 -157435 -101708 5625 116623 -142640
10684 171990 204384 26140 121943 -444762 -177620 -36408 -54942 -116129 -69298 -19698 65125
10672 -294263 -169648 -94920 -45590 -514558 10760 -214726 -130 -278148 -134431 -125255 190264
10660 107780 -126834 -105779 -60591 -334959 -134074 -184180 -178177 231590 23772 -122532 59947
10648 -128039 -236522 135253 -117995 219783 414893 -122473 33491 -30586 256492 69111
10637 -367236 146133 -199592 -102913 -10365 133146 -9845 -56439 -36106 15294 -54672 -4998
$$ packed form
10718E280a33484J2142G2518j4677M4828J14468I9459K04974b88413A45425C1936
10706a73037N8100j35122A56590g9111p7993J9791k6123A4346Q5247g1194j11417
10695a82611m05328J41592J80470C25751B8969a57435N5727E625J10998a42640
10684A71990L2394B6140R5803d44762a77620c6408j8534o1187M6831a9698F5125
10672b94263J24615P4728d5590m68968A0760b14726a30k78018a34431R176A90264
10660A07780a26834K1055M5188k74368a34074n0106O003B31590B3772a22532E9947
10648a28039j08483A35253a17995B19783J95110a22473C3491c0586B56492F9111
10637c67236A46133a99592R6679a0365A33146i845m6594K0333A5294e4672d998
$$ plain form
10625 80124 -271084 -196221 49014 56974 7963 -238215 -102758 347110 23218 -7062 -159515
10614 -159515 278845 -188115 -98427 228840 78336 -262462 1292 -98923 -240576 -246251 144780
10602 -212368 45862 -47354 -196044 131259 -114498 -105542 -126593 -35611 -158693 -1943 -111405
10591 -111405 -17304 -281669 -4647 -41198 -211969 -117918 -11546 -34544 -216519 -218490 -333549
10580 -333549 -3537 -265089 -126752 -88701 119419 -114720 34760 -23408 -435163 126836
10569 -95127 2567 255316 -26462 -239968 9900 -73789 10444 53076 241038 -140239 21582
10557 125218 -117539 -214562 -14354 -15153 -66082 236638 -61461 -161674 -63009 -225541 -287630
10546 -287630 -20873 -39219 15529 -47327 -37562 105240 254361 -112894 -175808 152162 182627
$$ packed form
10625H0124b71084P4863D9014P960G963b38215a02758C47110B3218g062j52453
10614a59515B78845a88115Q9688B28840G8336b62462A292i8923j41653n675A44780
10602b12368D5862d7354j48690A31259a14498Q956k1051c5611j23082a943j09462
10591a11405a7304k64365d647l6551j70771R4051a1546k2998j81975j971j15059
10580c33549c537k61552a26752L8051A19419a14720C4760b3408m11755A26836
10569i5127B567K52749b6462k13506I900g3789A0444M2632J87962a40239B1582
10557A25218a17539r7023a4354p99n0929B36638f1461j00213f3009j62532o2089
10546b87630b0873j8346A5529d7327R765A05240J49121a12894o2914A52162L0465
$$ plain form
10535 182627 120624 -19099 252654 -264439 -57248 53209 154011 -384617 -82215 -167022 -93892
10524 -93892 41746 -359294 14742 -53175 -28921 -112562 -156222 -177600 -227827 -107122 -100491
10513 -100491 -71059 -298801 -186777 90524 -131895 -173853 28545 -117793 158385 549304
10503 549304 -222947 12315 -12579 -3549 140740 256845 209515 217881 44437 121958 -276476
10491 108528 -340247 84145 104772 94292 -547 -28111 117944 -46857 -93455 -406969 -42743
10479 9248 -35770 -246770 -262924 -164416 -122526 -50476 -152158 97758 131663 136653 20246 85172
10467 85172 190994 371802 586869 511538 131748 -7632 248538 169094 48479 113219 290076
10456 290076 -170963 84640 114171 31869 218584 93684 -242039 67125 -259063 102729
$$ packed form
10535A82627o2003a9099B52654b64439e7248E3209J00802c84617h2215q4807P3130
10524i3892D1746c59294A4742e3175K4254q3641m3660k1378n0227a07122O631
10513a00491K9432k27742J12024I0524a31895m1958B8545a17793A58385L90919
10503E49304b22947A2315a2579c549A40740J16105m7330Q366D4437P7521b76476
10491A08528c40247H4145K0627j0480e47k7564A17944d6857m6598l13514d2743
10479I248c5770k11000j6154R8508M1890e0476j01682I7758L3905M990B0246O4926
10467H5172J05822J80808K15067p5331A31748g632B48538p9444D8479O4740J76857
10456B90076a70963H4640K9531C1869J86715I3684b42039F7125b59063A02729
$$ plain form
10445 -29068 29081 -19211 -27584 -188114 -201564 122158 -268696 -25435 -59154 11771 32688
10434 32688 83924 -106236 -221700 -264731 -120432 80860 83185 180344 -210212 -71465 48032
10422 -107546 -425091 53038 -306794 144591 -128245 147047 -238245 -150787 15020 -2447
10411 243645 -428238 86318 59736 -190565 -50559 -51249 -72215 80378 -246298 52231 -158387
10399 102343 -30643 -59285 63916 -235710 -115817 -161606 -207340 267853 237320 176188 -81320
10387 299716 -161951 -25397 55228 -25030 89613 162523 -4031 -5804 164700 321621 176014
10376 176014 487050 -213213 183483 -89326 63143 -23215 293338 -90431 209904 187228
10366 187228 149906 65137 350422 222588 220675 9016 2969 180799 275774 93686 40886
$$ packed form
10445b9068B9081a9211q373j60530j3450A22158b68696b5435l3719A1771K0917
10434C2688N1236a06236j15464m3031a20432H0860K325R7159b10212g1465D8032
10422a07546l17545E3038c06794A44591a28245A47047b38245Q7458A5020b447
10411B43645d28238H6318k6582a90565e0559o90k0966H0378b46298E2231a58387
10399A02343c0643k8642F3916b35710a15817m5789m5734B67853l0533o1132h1320
10387B99716a61951b5397E5228b5030H9613P2910d031j773A64700J56921j45607
10376A76014L11036b13213A83483h9326F3143b3215B93338i0431B09904k2676
10366A87228l7322F5137K85285j27834j913I016B969J77830R4975I3686D0886
$$ plain form
10354 425410 422813 551862 330769 175341 372288 234216 279922 119596 237230 287085
10344 287085 41783 153740 336194 -39958 206020 39119 534410 426356 472679 235581
10333 510010 290795 338085 268679 198598 50081 355731 234779 520157 160074 69487
10322 164699 152204 -112418 100969 -174741 -218357 183110 -15868 145318 -326524 -120133
10311 -274642 106312 108987 182558 -146346 -25333 132584 287374 -147944 65162 37401 -10764
10299 18522 6754 272473 96267 -176220 382317 -218958 100691 -82485 -305989 96838 -351699
10287 -81156 -14049 -90808 20682 -117058 32112 -62085 -21266 121841 -250664 -191911 -7158
10275 -177775 -9540 -213179 218159 -198444 22686 -267014 -4591 -217209 165414 -142847
$$ packed form
10354D25410k597J29049k21093j55428J96947j38072M5706A19596J17634M9855
10344B87085D1783J11957J82454c9958B06020C9119M95291j08054M6323B35581
10333E10010k19215M7290o9406p0081E0081L05650j20952K85378A60074F9487
10322A64699j2495a12418A00969a74741m3616A83110a5868A45318c26524a20133
10311b74642A06312K675P3571a46346b5333A32584J54790a47944F5162k7761a0764
10299A8522F754K65719I6267a76220C82317b18958A00691h2485k23504I6838c51699
10287h1156a4049p6759B0682a17058C2112f2085b1266A21841b50664N8753g158
10275a77775i540k03639B18159a98444B2686b67014d591k12618A65414a42847
$$ plain form
10264 54289 -83019 78465 -94043 -45728 -218398 -34032 9476 245685 -17685 -10657 140255
10252 -37689 -132283 -96971 -57617 -196891 165563 -179325 -90905 237892 162982 104445 -33776
10240 -2098 20352 115154 291913 -144647 113621 176944 -101057 163918 5066 -30866 -106552
10229 -106552 224586 75053 -43518 -128609 70197 -80199 -177526 -187853 -41623 -102782 299405
10217 260314 -271185 -110063 1049 182500 92053 -12378 -43467 -154076 167332 -30898 -191144
10206 -191144 -259235 218891 -285159 -141767 49399 126452 -105024 23476 90137 9606 -52944
10194 66178 -76719 62179 -31551 -9574 16434 -274731 283995 160566 -55956 355599 -45438
10182 60158 -120507 12234 127922 105121 -12856 -172375 214902 -370760 150478 -77568
$$ packed form
10264E4289h3019G8465i4043d5728j72670c4032I476K36209a7685P028A40255
10252c7689r4594L5312L9354j39274A65563a79325Q8420B37892p4910n8537c3776
10240b098B0352R4802J76759a44647A13621O3323a01057A63918E066c0866p5686
10229a06552B24586G5053d3518q5091G0197h0199r7327j0327d1623o1159B99405
10217B60314b71185a10063A049J81451r0447a2378l1089j10609A67332c0898j60246
10206a91144o8091B18891b85159a41767D9399P7053a05024B3476O6661I606e2944
10194F6178g6719F2179c1551i574A6434b74731B83995j23429e5956C55599d5438
10182F0158a20507A2234J15688k2801a2856j59519B14902c70760A50478g7568
$$ plain form
10171 -196787 -150433 -193056 359974 -85594 224113 -274664 144586 71938 -212066 -468227
10161 -468227 44228 -194222 216560 82045 -2070 -136887 -537055 -105574 -132809 200172
10150 -167961 133593 64000 207535 -183879 199275 -183996 76004 -148836 -310790 -202109
10140 -202109 194624 -58995 -171570 -52468 -52752 137714 -129018 -205472 198835 -75924 -39074
10129 -39074 -396348 -267499 -90031 -61947 206408 -325392 100753 175902 -123673 44603
10118 -114166 -8419 -73722 -50470 30256 -51666 -49266 -154746 -290350 -21773 -190971 -120354
10107 -120354 -191447 -242542 4219 83711 -226434 -259126 -60849 -232368 192993 -108022 -131438
10096 -131438 -477116 -2260 -351401 -112588 6762 50896 -14550 -26786 158081 35140 -55022
$$ packed form
10171a96787M6354m2623C59974h5594B24113b74664A44586G1938b12066k56161
10161d68227D4228a94222B16560H2045b070j34817m00168a05574k7235B00172
10150a67961A33593F4000J43535a83879A99275a83996G6004a48836j61954J08681
10140b02109A94624e8995j12575e2468k84A37714a29018p6454A98835g5924L6850
10129c9074l57274J28849i0031K8084B06408c25392A00753P5149a23673D4603
10118a14166h419o5303K3252C0256e1666K400j05480j35604b1773j69198P0617
10107a20354p1093n1095D219P9492b26434l2692f0849j71519A92993a08022k3416
10096a31438l45678b260l49141a12588F762M4134a4550j2236A58081C5140e5022
$$ plain form
10084 -159172 40879 -138849 90197 -157620 146591 -114100 -8760 19548 -217206 -244679 -14375
10072 -210592 30903 80160 30345 40127 -228407 142987 -103415 -312182 228091 -117358
10061 -231473 -104856 72715 -444336 -85208 263086 -146201 252215 -124894 236094 11997
10050 -155225 81742 -208003 83694 -309530 228709 -377414 114098 -121794 -163909 -57835
10039 -9584 25720 -67571 134099 42313 53970 17369 -173064 -204838 -170081 4235 92715 -58723
10026 -158922 -111697 4733 66268 -40545 -354752 53180 -250284 12136 -127444 63249 -207370
10014 -207878 76026 -150923 -95463 80486 -376509 -7001 -161242 331265 -76714 -145693 -359030
10003 -359030 80002 283386 -220003 -18568 76912 -343045 -53572 -20562 -73220 73280 -113298
$$ packed form
10084a59172D0879a38849I0197a57620A46591a14100h760A9548b17206k7473a4375
10072b10592C0903M9257C0345R782b28407A42987a03415k08767B28091a17358
10061b31473a04856G2715d44336h5208B63086a46201B52215a24894B36094A1997
10050a55225H1742b08003H3694c09530B28709c77414A14098a21794m2115e7835
10039i584B5720f7571A34099D2313J1657A7369a73064l1774L4757D235Q8480e8723
10026a58922M7225D733O1535d0545l14207E3180b50284A2136a27444F3249b07370
10014b07878G6026a50923N5460H0486c76509g001j54241C31265g6714o8979k13337
10003c59030H0002K03384b20003a8568G6912c43045e3572b0562n2658G3280a13298
$$ plain form
9991 -157328 -108849 -50278 232071 17951 -53523 -78646 -74583 43399 184469 -314769 -270716
9980 -270716 -235754 -21873 89866 -230874 -47188 68106 -59533 -235418 -126495 13869 -16029
9968 -66137 23881 45813 -130867 61533 -212321 -340721 -6802 82101 10131 138160 -46378
9956 279468 -81259 -81601 -266064 18186 -137749 -41799 128331 -77598 -297721 -41531 -158397
9945 -158397 -117460 -201517 -143245 -94170 217534 -30058 -54744 59831 -300530 124968 23940
9933 232794 -505435 4808 -112978 -217087 -85801 128713 -120779 -53910 33800 85795 176571
9922 176571 -40445 -269330 289482 -61872 163167 207248 -202291 -115656 -7636 102329 50562
9910 -515151 173921 9584 -133823 -184166 -137386 19779 -61042 35714 -167728 -343527 -108627
$$ packed form
9991a57328M8479e0278B32071A7951e3523k5123M063D3399J41070c14769M4053
9980b70716L4962b1873H9866b30874d7188F8106e9533j75885J08923A3869a6029
9968f6137B3881K1932a30867F1533b12321j28400f802H2101A0131J28029d6378
9956B79468h1259l42j84463A8186a37749d1799A28331g7598k20123d1531j16866
9945a58397M0937q4057N8272M9075B17534c0058k4686E9831c00530A24968B3940
9933B32794e05435D808a12978j04109h5801A28713a20779e3910C3800N1995R0776
9922A76571d0445k28885B89482f1872A63167M4081b02291Q6635g636A02329E0562
9910e15151A73921I584a33823n0343M6780A9779f1042C5714a67728j75799a08627
$$ plain form
9898 8608 171168 55979 -176734 -54231 -182292 371550 -328789 153011 -371973 -226292
9888 -226292 -80707 99794 -81045 -15080 -112985 -512084 -146782 80190 -243256 293769 -88801
9876 -80850 -138042 -469877 -237304 245029 -100736 -241213 118229 -73389 -135642 13361 244616
9865 244616 20779 -9680 337358 59027 -252254 -40762 -108953 115510 180331 -85367 -276281
9854 -276281 -351591 27826 -190249 28068 -185733 -164734 -135621 -10259 -3529 -74920 -218058
9843 -218058 23663 -96754 -193502 150662 -106979 37166 104813 -105953 -231532 81874 -92550
9831 -93053 45317 -91299 429575 -11786 134146 -174012 -407059 -221942 -176633 134216 12140
9819 -157262 -88728 -333 87749 9477 -57487 -43947 137244 34432 -83877 67638 243958 -375139
$$ packed form
9898H608J62560E5979a76734e4231j28061C71550c28789A53011c71973J45681
9888b26292h0707I9794h1045a5080r7905l99099a46782H0190b43256B93769h8801
9876h0850n7192l31835K32573B45029a00736j40477A18229g3389o2253A3361K31255
9865B44616B0779i680C37358E9027b52254d0762o8191A15510O4821h5367j90914
9854b76281p5310B7826a90249B8068a85733K0999K9113a0259c529p1391j43138
9843b18058B3663i6754r6748A50662a06979C7166O7647a05953j25579H1874i2550
9831i3053D5317i1299D29575a1786A34146a74012k33047J85117M5309A34216A2140
9819a57262O8534c33H7749I477e7487J3540A37244C4432h3877F7638J76320c75139
$$ plain form
9806 90203 -95611 410262 -38829 -175220 89179 29342 108171 295445 -157014 -33931 -130394
9795 -130394 -245985 -201403 177907 -205473 -85661 125386 -85499 20203 -186278 -62781 -203945
9784 -203945 -75875 -246100 -293105 -34609 -32339 70305 -45073 -199464 143617 -201994 -131774
9773 -131774 -150048 -239644 -3908 -287766 -80298 94154 -3553 137832 -26161 119933 -501324
9761 187911 219252 127495 21663 3912 -223895 -115778 -21910 -23695 -259577 -72479 -95386
9750 -95386 -415909 58289 -162760 -568736 40405 -23532 -65940 153844 -143172 -17647 -113985
9739 -113985 186859 143262 105983 -13632 82587 54485 -252619 -28331 -415359 -315022 -15538
9727 -434856 -151366 -314100 -462186 325178 -1146 54013 138057 8001 -26931 126346 95229
$$ packed form
9806I0203i5611D10262c8829j36391H9179B9342P8829J87274a57014c3931r6463
9795a30394j15591M4582A77907b05473h5661A25386h5499B0203a86278f2781j41164
9784b03945g5875j70225m7005c4609K270G0305d5073j54391A43617b01994P0220
9773a31774j8274q9596c908k83858h0298I4154c553A37832b6161A19933e01324
9761A87911L1341r1757B1663C912b23895J08117b1910j785k35882g2479k2907
9750i5386l20523E8289a62760m05976D0405b3532m2408A53844a43172a7647r6338
9739a13985A86859m3597l7279a3632H2587k8102b52619b8331l87028J00337a5538
9727d34856a51366j62734j48086C25178a146E4013Q4044H001b6931A26346l1117
$$ plain form
9716 95229 -3215 34894 -502956 51519 -282705 318514 -113731 -253189 -45641 21610 -30586
9704 -80017 -9782 51493 197745 266292 -327719 -53769 -61225 127020 131309 -304281 43797 -113394
9691 -102565 -108638 -158472 -21592 -230267 -63370 -97445 -163724 -143181 -191726 -11930 -347287
9680 -347287 86053 -201043 -91929 -239482 -89592 207937 -110344 -143518 -231468 -268694 80253
9668 142893 98653 14246 312170 -256965 -257429 -49572 -26721 -475798 253203 -52332 -103352
9657 -103352 -165131 -326375 10051 -218568 -164999 167474 -130056 -171113 -209755 -138239 -137311
9646 -137311 107325 79012 -148271 -83722 159723 110063 -47514 212825 -79937 31559 -215022
9634 18451 -51829 -26535 -251094 -148470 -116902 -71894 214065 -26788 -133745 104064 111706
$$ packed form
9716I5229c215C4894e02956E1519b82705C18514a13731j39458d5641B1610c0586
9704h0017i782E1493J46252O8547c27719e3769p456A27020M289c04281D3797a13394
9691a02565o073m9834b1592k08675f3370l4075o6279K0543m8545a1930l35357
9680c47287H6053b01043i1929j47553h9592B07937a10344l3174q7950l7226H0253
9668A42893m4240A4246K97924b56965m64d9572K2851m49077B53203e2332n1020
9657a03352o1779j61244A0051b18568N3569A67474a30056m1057l8642P1516R28
9646a37311A07325k8313a48271O4549A59723m9660d7514B12825g9937C1559b15022
9634A8451e1829K5294k24559J02624L1568M5008B14065b6788j06957A04064P642
$$ plain form
9623 111706 -64681 117350 -138562 -151442 -24157 526917 -269367 22303 290785 -243571
9612 -95265 41158 -35616 213848 180389 -169041 -172147 200454 113114 -219224 -304955 -250592
9601 -250592 57904 -13073 226249 -213281 68350 -182457 -82216 90094 119027 166760 212629
9590 212629 -160647 26042 -96646 -17844 -179701 -122152 203063 -201651 -151030 -191795 -276461
9579 -276461 -76642 -301398 -135143 170511 116194 -377124 14811 125953 184324 -218055
9568 -71335 -168176 -236083 -26843 36643 -72116 -25828 -25123 -233097 60699 -126894 -194327 190871
9555 -212396 113876 -20697 43729 -150949 -52241 125855 161336 -363373 -44061 196000 -215624
9543 36955 -38114 -177295 41321 54988 11670 14935 -143310 -42813 62850 72536 19375 -10079
$$ packed form
9623A11706f4681A17350a38562j2880b4157E26917b69367B2303K68482b43571
9612i5265D1158c5616B13848l3459a69041l106B00454q7340b19224q5731N4363
9601b50592E7904a3073B26249b13281F8350a82457h2216I0094K8933M7733M5869
9590B12629a60647B6042i6646a7844j61857N7549B03063b01651N0621m0765q4666
9579b76461g6642k24756a35143A70511n4317c77124A4811J11142N8371b18055
9568g1335r6841o7907b6843C6643g2116b5828P05k07974F0699a26894o7433A90871
9555b12396A13876b0697D3729a50949e2241A25855L5481c63373d4061A96000b15624
9543C6955c8114j39181D1321J3667A1670L265a43310d2813F2850R686A9375a0079
$$ plain form
9530 6837 288959 -197295 380887 79853 185293 60451 159479 -228008 -92410 -96516 79025
9518 121001 72286 -198769 -129641 30498 -233354 177735 -221419 -127865 165671 -323789
9507 245042 -174910 -129368 145423 -213050 -143511 15178 -123720 -345666 -204835 -300549
9497 -300549 82556 -154407 -463545 -58437 -468432 -79556 -67194 17896 188657 -174459 -135673
9486 -135673 164893 -384872 43059 -64053 -119352 143742 -314646 227958 -368695 -170140
9475 -280026 -61312 -109479 -40930 -284694 -10497 -56512 174305 1738 312239 -196529 94986
9463 -3236 -21332 -304913 -272062 -80286 -226744 -90912 -418601 -184111 -34572 -204875 -59205
9451 -11096 -142620 -159560 -65399 -263484 21464 -104924 238582 -224955 -13079 290940 -343773
$$ packed form
9530F837K82122a97295C80887G9853J05440F0451R9028b28008i2410m106G9025
9518A21001m8715a98769O9128C0498b33354A77735b21419R3554A65671c23789
9507B45042a74910M5542A45423b13050O9539A5178a23720k21946J40831r5714
9497c00549H2556a54407l09138e8437m09995g9556J2362A7896J70761a74459L8786
9486a35673A64893c84872D3059f4053n5299A43742c14646B27958c68695a70140
9475b80026f1312m8167d0930k43764a0497m6015A74305A738L10501a96529I4986
9463c236j8096k83581L2851h0286j46458i0912l27689a84111c4572j70303e9205
9451a1096j31524j6940f5399j98085B1464a04924B38582b24955a3079B90940c43773
$$ plain form
9439 -67095 -265121 101251 -186177 -227357 -67085 -18856 -176195 42344 60828 106069 13015
9427 104170 18942 -26559 67692 40610 220973 -238055 106131 69543 28102 -183587 -57418
9415 -102118 40345 -176841 24997 -245793 -48884 118535 52868 99890 -19667 -355787 -230288
9404 -230288 10149 -95789 -122632 -333173 -88258 -125404 -276145 -101945 -62081 148641 -359987
9392 -106456 158880 -77422 -311582 -309002 172845 -33160 -286124 -80045 -132139 69709 12956
9380 -138771 129778 50521 -36727 194993 -214413 187339 -20801 166399 20973 -168719
9369 -176941 115032 -195589 103587 -25057 -206514 149609 -205394 459768 -103943 125112
9358 40143 -67757 -91427 72861 43283 51971 -149559 69480 -89811 128392 -33441 -33269 176645
$$ packed form
9439f7095j98026A01251a86177m1180f7085a8856j57339D2344J8484M5241A3015
9427A04170A8942b6559F7692k7082J80363b38055A06131l6588B8102a83587e7418
9415a02118D0345a76841B4997b45793d8884A18535E2868M7022a9667l36120J25499
9404b30288A0149i5789k6843k10541h8258l7146j50741a01945L9864A48641c59987
9392a06456A58880g7422k34160K580A72845c3160k52964h0045n2094F9709A2956
9380a38771A29778E0521c6727A94993b14413A87339b0801A66399B0973a68719
9369a76941A15032a95589A03587b5057j81457A49609b05394D59768a03943A25112
9358D0143f7757k3670G2861k9578Q688a49559F9480h9811A28392c3441J72A76645
$$ plain form
9345 95103 2835 -276092 -93643 35018 -101566 -13743 152857 -297806 112028 5492 -188218
9333 -177938 -267755 -316189 -340772 240669 -317757 -208421 147584 215268 70366 31568 -393652
9321 -55609 -28890 81854 49454 851 14310 -392990 -192253 85820 63067 -73789 38235 210438
9309 210438 -153475 -140326 142559 63261 248782 -47188 -78687 -172228 -154463 114815 52367
9297 -139372 146851 104581 24763 -267249 -134204 -51838 -71777 -301062 -151127 -113964 -151010
9286 -151010 20122 88932 -44746 96523 -66346 -306741 -98124 -12679 -155838 -78580 65696
9274 -217067 120814 -66320 -246778 -395720 139904 -162821 -84342 -131767 -194861 86438 -460302
9262 36649 40750 -35866 -305256 -317526 -30427 2548 -39537 -334024 -114757 -296379 -27427
$$ packed form
9345I5103B835b76092i3643C5018a01566a3743A52857b97806A12028E492a88218
9333a77938q9817m8434k4583B40669c17757J09336A47584O7684G0366C1568c93652
9321e5609K6719H1854l2400H51J3459c92990a92253H5820k2753g3789C8235J72203
9309B10438a53475J3149A42559F3261J85521d7188l1499r3541J7765A14815E2367
9297a39372A46851m2270B4763b67249J33045e1838j9939k29285J49935L7163l7046
9286a51010B0122O8810d4746I6523f6346k40395i8124a2679j43159P7258F5696
9274b17067A20814f6320j80458j48942A39904a62821P8479m7425o3094H6438d60302
9262C6649M101c5866k69390j2270c0427B548c9537k94487a14757j81622b7427
$$ plain form
9250 -20708 -16092 -165765 171217 -163301 -324418 -38261 -13903 -102306 -375018 207363 -270999
9238 244599 -100446 7142 363749 -388864 -37788 275259 160375 -292490 205119 -135835
9227 -16983 178795 6989 -4742 30815 -33887 -103928 277292 189091 106766 -75568 32153 -163417
9214 -158371 -111673 49515 -133937 -368452 15232 -148490 267909 -120140 -140147 -84144 291060
9202 -79617 77199 -222052 196081 -302214 -75600 -200098 -19604 17105 -162026 -295779 95489
9190 9500 -433785 190063 -220986 74660 13915 -74339 -23370 -52735 -138276 -136167 -49958 70419
9177 -30296 -322428 -162613 -13268 71703 79050 -162344 90554 -190794 -66615 -206652 -182677
9166 -182677 7811 -116972 -187368 125632 48836 -101207 181608 -9656 -106716 305712 -126809
$$ packed form
9250b0708M616j49673A71217a63301j61117c8261a3903q8403k72712B07363b70999
9238B44599a00446G142L56607c88864c7788B75259j14884b92490B05119a35835
9227a6983A78795F989d742C0815c3887p0041B77292q8201q2325g5568C2153a63417
9214a58371M6698D9515a33937k34515A5232a48490B67909a20140k0007N6003B91060
9202g9617G7199b22052A96081c02214g5600j24498a9604A7105a62026j33753I5489
9190I500d33785A90063b20986G4660A3915g4339b3370k9365q5541K109d9958G0419
9177c0296k92132J59815a3268G1703P347a62344I0554a90794f6615j40037K3975
9166a82677G811a16972p0396A25632D8836a01207A81608i656r7060C05712a26809
$$ plain form
9154 -346524 -106333 1956 -44067 -61344 -334485 -132723 -33363 -52634 -324899 -201902 127482
9142 143412 144152 -104557 155451 -297724 -215112 -217514 -135636 -189579 -51461 33438 -137615
9130 -78658 -323258 -453377 98983 88768 -196401 -332368 255603 -48020 215393 -91296 376160
9118 -89900 9189 199795 -182840 -75150 37399 67283 -298708 137318 -284882 30182 109264
9107 109264 210712 258441 222081 -199542 24515 103091 112225 -52961 -133449 247470 -104954
9095 -102456 -369977 -33949 -107299 -285394 246861 -173240 -18813 -44090 -137387 -142 45381
9083 156560 91113 -71253 128706 143032 147772 44816 -179828 -6120 452129 -86960 -73308
9072 -73308 -55051 -42036 57527 -90346 -267118 -164470 -190659 -257674 95741 -164241 -98176
$$ packed form
9154c46524a06333A956d4067j7277k73141a32723c3363j9271k72265J22997A27482
9142A43412P40a04557A55451b97724Q2612k402Q1878n3943e1461C3438a37615
9130g8658k44600j30119I8983j0215a96401j35967B55603d8020B15393i1296C76160
9118h9900I189J90606a82840g5150C7399K9884b98708A37318b84882C0182P9082
9107A09264J01448M7729l6360a99542B4515P8576R134e2961q0488B47470a04954
9095a02456k67521c3949p3350j78095B46861a73240a8813k5277r3297a42D5381
9083A56560o5447g1253A28706J4326M740D4816a79828f120D52129h6960J3652
9072g3308J8257J3015E7527i0346j76772J02648k6189o7015I5741a64241O6065
$$ plain form
9061 -98176 14302 17797 -90268 141025 -20945 -110689 9500 -180104 -12137 18315 -8708 -128572
9049 -128572 167761 52877 -451309 -60677 -131432 -147504 -93434 182835 58371 -31254 -145789
9038 -145789 49045 -104789 -141413 48461 22444 275311 -437940 -193098 -279648 -70720 99365
9026 -22887 -163171 -105095 86485 49367 -304531 172084 42563 -111164 -234004 -125496 -50896
9014 -76330 243525 -60156 323927 -222334 248702 42023 -207589 -295612 -149958 203094
9003 -77013 -145278 -15426 37053 145978 -36226 -115088 -42005 177422 -94147 -225748 -359974
8992 -359974 -395220 -68236 92030 14103 400546 83213 178491 31700 -216915 -133586 421607
8980 -183340 -47605 -320999 -120607 -105370 49578 123583 124356 221669 -52767 -133966 -37751 -72977
$$ packed form
9061i8176A4302L495i0268A41025b0945q9744I500a80104a2137A8315h708j19864
9049a28572A67761E2877d51309f0677p0755j6072N4070A82835E8371c1254j14535
9038a45789D9045a04789l6624D8461B2444K52867d37940a93098q6550g0720I9365
9026b2887j40284N8076H6485l7118c04531A72084D2563a11164j22840J08508e0896
9014g6330B43525f0156C23927b22334B48702D2023b07589q8023J45654B03094
9003g7013o8265a5426C7053J08925c6226p8862d2005A77422i4147j31601j34226
8992c59974l5246f8236I2030A4103L86443H3213R5278C1700b16915Q3329D21607
8980a83340d7605k73394a20607J5237D9578P4005P73R7313e2767q1199c7751l5226
$$ plain form
8968 -72977 -62652 -51723 -179989 269580 59558 26214 -146596 26586 -138233 -81491 -140848
8957 -140848 40676 134140 -29882 5378 -5332 37416 -99778 -33355 73254 -106691 -44059 -322702
8945 -322702 98114 -174410 -218681 -193470 -150948 261592 -60702 -16550 31824 -37595 164564
8933 -163128 53559 267032 -112345 -123132 -204481 -17726 -192476 135432 -13704 -312828 151991
8921 -30304 51846 -121022 353087 302590 190987 137025 193304 310278 426594 416254 667350
8910 667350 1121367 1279836 2413556 4190560 8983885 9809925 4305958 2222298 1136465
8901 1136465 860156 680168 441456 378775 114688 555557 262368 -42546 -138421 183244
8890 233443 -70120 -83526 -68872 -48827 53150 -84028 -133115 21677 -147285 -49246 68622
$$ packed form
8968g2977J0325J0929j28266B69580E9558B6214a46596B6586a38233N6742n9357
8957a40848D0676R3464b9882E378e332C7416i9778c3355G3254a06691d4059k78643
8945c22702I8114a74410m4271K5211M2522B61592f0702a6550C1824c7595A64564
8933a63128E3559K13473a12345j0787q1349a7726j74750A35432a3704k99124A51991
8921c0304E1846a21022C53087n0497j11603n3962N6279J16974J16316j0340K51096
8910F67350M54017J58469J133720J777004M793325Q26040D305958k083660j085833
8901A136465k76309j79988k38712o2681A14688M40869B62368d2546r5875A83244
8890B33443g0120j3406J4654K0045E3150h4028m9087B1677a47285d9246F8622
$$ plain form
8878 243626 -146436 -114068 -281559 -181939 -469271 -73331 82466 -211488 -274562 -97401 -420467
8867 -420467 -116847 -276344 15832 -35510 -16094 23137 -17044 -98288 221339 -60309 -336470
8856 -336470 -181296 3850 -202172 -288035 -209113 -55327 -359352 84378 35246 128953 -142379
8844 -25337 -74607 -107032 -236441 30285 -83849 -9535 -88748 -169911 259556 -90809 -53906 398109
$$ packed form
8878B43626a46436L2368j67491R9620k87332g3331H2466b11488o3074i7401l23066
8867d20467a16847j59497A5832c5510a6094B3137a7044q1244B21339f0309k76161
8856c36470J55174C850b02172q5863P8922e5327l04025H4378C5246R3707a42379
8844b5337m9270l2425j29409C0285h3849i535p9213q1163B59556i0809L6903C98109
$$ [...]
##END NTUPLES=NMR SPECTRUM
##END=
