
##TITLE=UV1052_TOCA01-ROVE100D_6099822_WiqZB8QMC7
##JCAMPDX= 6.0         $$ Bruker NMR JCAMP-DX V2.0
##DATA TYPE= NMR SPECTRUM
##DATA CLASS= NTUPLES
##ORIGIN= BRUKER
##OWNER= Administrator
$$ 1.72 TOPSPIN		Version 2.1
$$ 2012-05-12 22:01:20.796 -0500  Administrator@TOPSPIN
$$ Compression mode = diff/dup
##.OBSERVE FREQUENCY= 400.13188235
##.OBSERVE NUCLEUS= ^1H
##.ACQUISITION MODE= SIMULTANEOUS (DQD)
##.ACQUISITION SCHEME= undefined
##.AVERAGES= 64
##.DIGITISER RES= 22
##SPECTROMETER/DATA SYSTEM= spect
##.PULSE SEQUENCE= noesygpps1d.comp
##.SOLVENT NAME= COFFEE_meoh
##.SHIFT REFERENCE= INTERNAL, COFFEE_meoh, 1, 14.96681
##AUDIT TRAIL= $$ (NUMBER, WHEN, WHO, WHERE, PROCESS, VERSION, WHAT)
$$ ##TITLE= Audit trail, TOPSPIN		Version 2.1
$$ ##JCAMPDX= 5.01
$$ ##ORIGIN= Bruker BioSpin GmbH
$$ ##OWNER= Administrator
$$ $$ C:\Bruker\TOPSPIN/data/COFFEE/nmr/UV1052_TOCA01-ROVE100D_6099822_WiqZB8QMC7/12/pdata/1/auditp.txt
$$ ##AUDIT TRAIL=  $$ (NUMBER, WHEN, WHO, WHERE, PROCESS, VERSION, WHAT)
(   1,<2012-05-12 22:01:16.078 -0500>,<Administrator>,<TOPSPIN>,<go>,<TOPSPIN 2.1>,
      <created by zg
	started at 2012-05-12 21:49:45.687 -0500,
	POWCHK enabled, PULCHK disabled,
       configuration hash MD5:
       AF F2 23 6B 01 CD 40 DD E5 A1 38 A0 06 EA F7 77
       data hash MD5: 64K
       77 07 E3 43 48 BF D9 D8 5A 62 9D 5A 3A 8B 2F 34>)
(   2,<2012-05-12 22:01:18.812 -0500>,<Administrator>,<TOPSPIN>,<proc1d>,<TOPSPIN 2.1>,
      <Start of raw data processing
       efp LB = 0.3 FT_mod = 6 PKNL = 1 PHC0 = 0 PHC1 = 0 SI = 128K 
       data hash MD5: 128K
       18 AF CA 28 72 CD F4 BA CB DA 06 CD A7 AF 31 5E>)
(   3,<2012-05-12 22:01:20.031 -0500>,<Administrator>,<TOPSPIN>,<proc1d>,<TOPSPIN 2.1>,
      <pk PHC0 = 37.09534 PHC1 = 0 
       data hash MD5: 128K
       36 6E 46 9E C4 7E C1 90 C5 71 20 A7 81 2E C1 C3>)
(   4,<2012-05-12 22:01:20.265 -0500>,<Administrator>,<TOPSPIN>,<proc1d>,<TOPSPIN 2.1>,
      <abs ABSG = 1 
       data hash MD5: 128K
       59 0D 33 2E 34 5F 93 4C C1 75 4E 33 79 01 CB 4C>)
(   5,<2012-05-12 22:01:20.328 -0500>,<Administrator>,<TOPSPIN>,<proc1d>,<TOPSPIN 2.1>,
      <abs ABSG = 2 
       data hash MD5: 128K
       C7 56 0A A1 5D BC D9 5C B0 2D 53 27 B4 61 FE 07>)
(   6,<2012-05-12 22:01:20.484 -0500>,<Administrator>,<TOPSPIN>,<proc1d>,<TOPSPIN 2.1>,
      <abs ABSG = 3 
       data hash MD5: 128K
       D3 13 57 40 23 68 93 41 21 D4 F6 95 E1 8F D3 78>)
(   7,<2012-05-12 22:01:20.640 -0500>,<Administrator>,<TOPSPIN>,<proc1d>,<TOPSPIN 2.1>,
      <abs ABSG = 4 
       data hash MD5: 128K
       9D 80 A3 A1 27 B5 22 1B 4F 23 0E E9 D4 04 8D 02>)
(   8,<2012-05-12 22:01:20.687 -0500>,<Administrator>,<TOPSPIN>,<proc1d>,<TOPSPIN 2.1>,
      <abs ABSG = 5 
       data hash MD5: 128K
       06 AE AE 10 82 DC 35 1E A4 FA 9F 42 F9 74 7C 59>)
$$ ##END=
$$ 
$$ $$ hash MD5
$$ $$ C6 6C F1 07 C3 6C 82 86 B8 3A 6D 2D A0 F6 01 68
##$RELAX= 
##$RELAX= 
##$RELAX= 
##$RELAX= 
##$RELAX= 
##$RELAX= 
##$RELAX= 
##$RELAX= 
$$ [...]
##$TP07= 0
##$TPNAME0= <>
##$TPNAME1= <>
##$TPNAME2= <>
##$TPNAME3= <>
##$TPNAME4= <>
##$TPNAME5= <>
##$TPNAME6= <>
##$TPNAME7= <>
##$TPOAL= (0..7)
0.5 0.5 0.5 0.5 0.5 0.5 0.5 0.5
##$TPOFFS= (0..7)
0 0 0 0 0 0 0 0
##$TUNHIN= 0
##$TUNHOUT= 0
##$TUNXOUT= 0
##$USERA1= <user>
##$USERA2= <user>
##$USERA3= <user>
##$USERA4= <user>
##$USERA5= <user>
##$V9= 5
##$VALIST= <valist>
##$VCLIST= <CCCCCCCCCCCCCCC>
##$VD= 0
##$VDLIST= <DDDDDDDDDDDDDDD>
##$VPLIST= <PPPPPPPPPPPPPPP>
##$VTLIST= <TTTTTTTTTTTTTTT>
##$WBST= 2048
##$WBSW= 25
##$XGAIN= (0..3)
0 0 0 0
##$XL= 0
##$YL= 0
##$YMAX_a= 11184627
##$YMIN_a= -5717188
##$ZGOPTNS= <>
##$ZL1= 120
##$ZL2= 120
##$ZL3= 120
##$ZL4= 120
##$ABSF1= 14.96681
##$ABSF2= -5.58572
##$ABSG= 5
##$ABSL= 3
##$ALPHA= 0
##$AQORDER= 0
##$ASSFAC= 0
##$ASSFACI= 0
##$ASSFACX= 0
##$ASSWID= 0
##$AUNMP= <proc_prof1d_extract.lims>
##$AXLEFT= 0
##$AXNAME= <>
##$AXNUC= <1H>
##$AXRIGHT= 0
##$AXTYPE= 0
##$AXUNIT= <>
##$AZFE= 0.1
##$AZFW= 0.1
##$BCFW= 0
##$BC_mod= 0
##$BYTORDP= 0
##$COROFFS= 0
##$CY= 15
##$DATMOD= 1
##$DC= 0
##$DFILT= <>
##$DTYPP= 0
##$F1P= 0
##$F2P= 0
##$FCOR= 0.5
##$FTSIZE= 131072
##$FT_mod= 6
##$GAMMA= 0
##$GB= 0
##$INTBC= 1
##$INTSCL= 1
##$ISEN= 128
##$LB= 0.3
##$LEV0= 0
##$LPBIN= 0
##$MAXI= 10000
##$MC2= 0
##$MEAN= 0
##$ME_mod= 0
##$MI= 0
##$NCOEF= 0
##$NC_proc= -3
##$NLEV= 6
##$NOISF1= 0
##$NOISF2= 0
##$NSP= 0
##$NTH_PI= 0
##$NZP= 0
##$OFFSET= 14.96681
##$PC= 1
##$PHC0= 37.09534
##$PHC1= 0
##$PH_mod= 1
##$PKNL= yes
##$PPARMOD= 0
##$PPDIAG= 0
##$PPIPTYP= 0
##$PPMPNUM= 2147483647
##$PPRESOL= 1
##$PSCAL= 4
##$PSIGN= 0
##$PYNMP= <proc.py>
##$REVERSE= no
##$SF= 400.130005524334
##$SI= 131072
##$SIGF1= 0
##$SIGF2= 0
##$SINO= 400
##$SIOLD= 131072
##$SPECTYP= <>
##$SREGLST= <1H.CDCl3>
##$SSB= 0
##$STSI= 131072
##$STSR= 0
##$SW_p= 8223.68421052632
##$SYMM= 0
##$S_DEV= 0
##$TDeff= 65536
##$TDoff= 0
##$TI= <>
##$TILT= no
##$TM1= 0
##$TM2= 0
##$TOPLEV= 0
##$USERP1= <user>
##$USERP2= <user>
##$USERP3= <user>
##$USERP4= <user>
##$USERP5= <user>
##$WDW= 1
##$XDIM= 131072
##$YMAX_p= 461568294
##$YMIN_p= -39202466
##$CURPLOT= <Network HP LaserJet P1505>
##$CURPRIN= <$Network HP LaserJet P1505>
##$DFORMAT= <normdp>
##$LAYOUT= <+/1D_H.xwp>
##$LFORMAT= <normlp>
##$PFORMAT= <normpl>
##$SURQMSG= 1
$$ End of Bruker specific parameters
$$ ---------------------------------
##NTUPLES= NMR SPECTRUM
##VAR_NAME=  FREQUENCY,     SPECTRUM/REAL,   SPECTRUM/IMAG
##SYMBOL=    X,             R,               I
##VAR_TYPE=  INDEPENDENT,   DEPENDENT,       DEPENDENT
##VAR_FORM=  AFFN,          ASDF,            ASDF
##VAR_DIM=   131072,        131072,          131072
##UNITS=     HZ,            ARBITRARY UNITS, ARBITRARY UNITS
##FACTOR=    0.0627417313425165, 1,          1
##FIRST=     8223.62146879498, 7259,         -108914
##LAST=      0,             8910,            -108913
##MIN=       0,             -39202466,       0
##MAX=       8223.62146879498, 461568294,    0
$$ Real data points
##PAGE= N=1
##DATA TABLE= (X++(R..R)), XYDATA
$$ [...]
64758 295489 300914 308799 317314 324286 328950 332317 336079 341403 348549 357141 366632 376816 388042 400646
64744 400646 413903 425763 434100 438328 439545 439053 437153 433666 429140 424833 421412 418228 414141 408685
64730 408685 402208 395327 388686 382984 378686 375679 373584 372319 371977 372117 371686 369983 367573 366049 366849
64715 366849 370205 375076 380120 384786 389405 394301 399257 404170 409731 416806 425300 434290 443236 452299
64701 452299 461466 470274 478720 487522 496836 505477 512335 518007 523941 530186 535219 538194 540210 542680
64687 542680 545313 546596 545760 543235 539252 533106 524315 513797 503214 493440 484280 475481 467216 459492
64673 459492 451847 444135 436983 430884 425304 419563 414379 411494 411523 413095 414559 415731 417194 418565 418597
64658 418597 416975 414998 414212 415012 416919 419641 423210 427315 431072 433641 434887 435262 435097 434135 431792
64643 431792 427769 422277 415750 408736 402076 396656 392518 388624 384130 379647 376505 374801 373039 370006
64629 370006 366195 362860 360352 358166 356277 355539 356775 360134 365412 372316 380104 387542 393687 398659
64615 398659 403437 409070 416077 424238 432651 440266 446699 452470 458290 464343 470409 476205 481018 483290
64601 483290 481516 475962 468896 462609 457467 452239 445950 438860 431997 426465 423076 421745 421043 419319
64587 419319 416722 415396 416920 420297 423467 426351 431024 438732 448077 456835 464652 473015 483055 494438
64573 494438 506316 518441 530958 543525 555114 564643 571718 576660 579759 580583 578335 572924 565322
64560 565322 556657 547325 537236 526517 515588 504905 495112 486968 480492 474522 467910 460989 455032
64547 455032 450446 446490 442818 440175 439191 439513 440670 442775 445649 448189 449631 450725 452493 454313 454588
64532 454588 453143 451564 450992 450934 450773 451207 453148 456001 458202 459264 460303 462467 465546 468385 470172
64517 470172 471053 471855 473488 476342 479904 482983 484619 484854 484395 483446 481217 476923 470998 464719 458592
64502 458592 451781 443472 434166 425073 416700 408779 401248 394449 388469 383137 378714 375668 373636 371543
64488 371543 369105 367292 366766 366685 365767 363838 361589 359441 357531 356277 355913 355820 355319 354834 355162 355799 355384
64471 355384 353907 353066 353925 355430 356052 355802 355660 355850 355931 356073 356912 358152 358519 357465 356039 355643 356556
64454 356556 358166 360122 362689 366130 370274 374781 379542 384718 390418 396409 402146 407152 411435 415579
64440 415579 420490 426940 435109 444417 453874 462664 470257 476041 479341 480112 479306 478092 476901 475548 474083
64425 474083 472928 472234 471636 470730 469422 467803 466139 464971 464584 464238 462597 459260 455332 451983 448908
64410 448908 444794 439107 432903 427952 425415 425285 426728 428950 431794 435382 439196 442104 443555 444222 444994
64395 444994 445871 446533 447561 450174 454777 460428 465751 469882 472854 475855 480978 489688 501322 513798
64381 513798 525892 538048 551049 565012 580036 596588 614639 633431 652927 674658 700180
64370 700180 729379 761226 795617 833361 874790 919698 968571 1022849 1083738 1151487 1225773
64359 1225773 1305967 1390906 1479072 1569123 1659639 1748466 1833079 1911592 1982726 2044880 2096173
64348 2096173 2135493 2162523 2176671 2177135 2164486 2140996 2108594 2067354 2016677 1956985 1889014 1812298
64336 1812298 1726157 1632510 1536415 1443088 1354894 1271565 1192534 1118203 1049254 985774 927618
64325 927618 875162 829048 789119 754104 722554 693767 667612 644002 623074 605446 591331
64314 591331 579414 567455 554267 540485 527189 514609 502627 491762 482701 475176 468099 460854
64302 460854 453939 448228 443906 440153 435696 429883 423519 418500 416173 416059 416441 416208 415813 416458 418740
64287 418740 422344 426888 432593 439798 447847 454893 459138 460141 458714 455824 452047 447863 443784 440060
64273 440060 436748 434215 433061 433350 434251 434643 433859 431936 429575 427733 426745 425885 424415 422773 421904 421652
64257 421652 421098 420507 421296 423480 424772 423340 420228 417701 416132 414082 410808 407063 403548 399899 395310
64242 395310 389241 381780 374232 368938 367280 368026 368822 368946 369264 369768 369034 366487 363561 361903 361729 362655
64226 362655 364906 368676 373229 377712 382351 387981 394742 401902 408733 415098 421387 428169 435630 443244
64212 443244 450402 457281 464427 471555 477725 482768 487427 491734 494550 495330 495042 494537 493316 491121 489474
64197 489474 489898 491340 491193 488616 485096 481743 477818 472326 465494 457979 449965 441932 435189 430491 426795
64182 426795 422438 417180 412172 408208 404957 401809 398639 395651 393080 391099 389512 387616 384983 382430
64168 382430 381481 382708 385198 387787 390043 391721 392268 391706 391350 392516 394724 396138 395649 393611 390640
64153 390640 386932 383029 380031 378345 377040 375145 372805 370560 368321 366022 364572 365094 367581 371243
64139 371243 375677 380564 384694 386866 387907 390398 395918 403607 411869 420464 430199 441389 453480 465875
64125 465875 478484 491553 505158 518622 530441 539224 544748 547502 547246 542959 534516 523586 512320
64112 512320 501749 491813 482145 472207 461352 449554 437620 426082 414487 402606 391837 384255
64100 384255 380261 378133 376100 374099 373072 373129 373085 371810 369625 368203 369118 372639 377759 383084 387497
64085 387497 390443 392114 393341 394901 396938 399295 402115 405564 409226 412474 415237 417563 418606 417253
64071 417253 413982 410909 409491 409239 409345 410439 413685 418825 424207 428445 431266 433244 435577 439790 446636
64056 446636 455417 465030 475457 487461 501139 515712 530590 545620 560214 573122 583394 590950
64044 590950 596077 599171 601276 604079 608710 614941 622128 630516 640706 651839 661289 666883 669059 670107
64030 670107 671398 672142 670858 666901 660092 649993 636763 621982 607262 592396 576287 559514 544293
64017 544293 531727 520764 510455 501533 494812 489451 484110 478810 474442 471206 468750 467284 467419 469264
64003 469264 472436 476375 479916 481486 480872 480160 481655 485289 489137 492013 494365 497128 500961 506344 513144
63988 513144 520149 526085 531092 536429 543083 551369 561269 572058 582193 590930 599617 609995 621524
63975 621524 631807 639412 644777 648597 650990 652309 653105 652945 650752 646704 642479 639351 637330 636325
63961 636325 636610 637746 638571 638832 639339 639874 638505 633930 627228 620228 613271 605658 597442 589556 582702
63946 582702 577022 572386 568305 564087 559756 556363 554827 554965 556096 557968 560589 563797 567601 572411
63932 572411 578459 585512 593435 602310 611725 620854 629757 639706 651673 665302 679906 695525 712378
63919 712378 730217 748934 768829 789538 809781 829203 849466 872297 897390 923580 951306
63908 951306 982298 1017236 1055342 1096067 1139564 1185457 1232846 1282166 1335807 1396156 1463824
63897 1463824 1538232 1619050 1706381 1800546 1902877 2016420 2144648 2289055 2448650 2622208
63887 2622208 2810479 3015410 3237398 3474222 3722983 3982189 4251085 4527524 4807604
63878 4807604 5087022 5361400 5625017 5870600 6091359 6282717 6441663 6565318 6651037 6697469
63868 6697469 6704696 6673412 6604321 6498089 6355500 6178100 5969154 5733945 5478999 5211049
63858 5211049 4936284 4659503 4383725 4111320 3845803 3591777 3352980 3131180 2927078
63849 2927078 2741038 2572455 2419624 2281083 2156240 2044199 1943171 1851862 1770186 1697635
63839 1697635 1632164 1572036 1517580 1469554 1426625 1386300 1347847 1312414 1280376 1250346 1221065
63828 1221065 1192882 1166850 1143332 1121817 1101520 1082229 1065214 1052921 1046750 1045335 1045931 1047193
63816 1047193 1049648 1054107 1061137 1071803 1086960 1105400 1124164 1141389 1157811 1175181 1194305 1214980
63804 1214980 1236580 1258049 1278154 1296262 1312176 1325137 1334207 1339906 1344050 1347177 1347284 1342074 1331548
63791 1331548 1317450 1301031 1282457 1261745 1239032 1214063 1186413 1156223 1124098 1090501 1055877
63780 1055877 1021178 987416 954623 921880 888615 855488 823755 794038 766033 739303 714050
63769 714050 690784 669334 648676 628019 607730 588838 571995 557363 545006 534522 524611 514098
63757 514098 503425 494108 486584 479648 472325 465150 459008 453752 448874 444766 442234 441110 440244 438684
63743 438684 436235 433215 430253 428001 426259 423681 419128 413186 407542 402976 398812 394362 389908 385896
63729 385896 382055 378001 374202 371600 370390 369735 368654 366788 364263 361309 358298 355819 354253 353251
63715 353251 352007 350250 348783 348752 350389 352741 354707 355950 356611 356431 354867 352244 350223 350528 353274
63700 353274 356994 360210 362404 363495 363316 362239 361646 362881 365897 369542 372884 375469 376716 376257 374986
63685 374986 374572 375608 377253 379037 381773 386083 391174 395960 400343 404411 407405 408844 409930 412330
63671 412330 415992 419544 422544 425830 429735 433487 436614 439682 443397 448021 453767 460494 466744 470487
63657 470487 471460 471709 473091 475129 475972 474681 471912 469033 467210 466836 467235 467341 467014 467152 468231 469512
63641 469512 470187 470535 471293 472493 473663 474710 475858 477032 477918 478525 479204 480349 482408 485846 490664 496140
63625 496140 501421 506215 510794 515584 520789 525859 529314 529912 528401 527284 528205 530227 531424 531521 531911
63610 531911 533387 535025 535592 535205 535057 535811 536763 536681 535193 533042 530915 528472 524990 520655 516460 512876
63594 512876 509506 506328 504438 505026 508063 512446 516947 520698 523327 525201 527269 530260 534272 539240
63580 539240 545282 552293 559897 568142 577631 588474 599797 610905 622397 635456 650497 667156
63568 667156 685207 704809 726109 749128 773746 799393 825311 851630 879646 910395 943550
63557 943550 978507 1015894 1056937 1101660 1148827 1197653 1248551 1302052 1357773 1414540 1470824
63546 1470824 1524862 1574871 1619315 1656676 1685259 1703825 1712432 1712291 1705003 1692405 1676577 1659041
63534 1659041 1640006 1619079 1596485 1572689 1547074 1518108 1485012 1448348 1408892 1367014 1323628
63523 1323628 1280821 1240808 1204578 1171799 1141509 1112755 1085381 1060691 1040724 1026340 1016364
63512 1016364 1008960 1003433 1000370 1000661 1004888 1013170 1024879 1038762 1053982 1070925 1090515 1112805 1136779
63499 1136779 1161516 1187111 1214366 1243987 1276352 1311850 1350973 1393852 1439847 1488061 1538460
63488 1538460 1592091 1649677 1710010 1769928 1825437 1872328 1906467 1925235 1929443 1922951 1909697 1891701
63476 1891701 1870273 1847693 1826072 1805133 1782750 1757737 1730587 1701306 1668212 1629796 1586496
63465 1586496 1539526 1488922 1434220 1376506 1318394 1262064 1208478 1158362 1112457 1070528 1031394
63454 1031394 994425 959955 927811 896832 866718 839166 815916 796490 779089 763020 748775
63443 748775 736122 723815 711285 699191 688010 677280 666656 656766 648652 643117 640610 640637 641133
63430 641133 639696 635888 631194 626511 621271 615677 611923 611689 613746 615826 617865 621435 626490 630877
63416 630877 633313 634994 637521 640647 642863 643283 642120 640039 637810 636201 635568 635675 636215 637238 638794
63401 638794 640554 642225 644134 646973 650919 655312 659369 663206 668021 675157 685041 697143 710722 725242
63387 725242 740319 756131 774025 795716 821229 848462 875641 903536 934166 967944 1003673
63376 1003673 1041268 1082646 1128999 1178265 1226376 1270555 1310605 1347479 1381829 1414229 1446047
63365 1446047 1479362 1516011 1556936 1602393 1652416 1706867 1765285 1827053 1891611 1958026 2024194
63354 2024194 2086848 2142497 2188211 2221757 2241973 2249495 2246486 2235225 2217461 2195308 2171426 2147138
63342 2147138 2121043 2090827 2056117 2018348 1978067 1933841 1884069 1828677 1768741 1705669 1641440
63331 1641440 1578747 1520061 1466673 1418671 1375253 1335077 1297336 1262967 1234001 1211275 1193525
63320 1193525 1179151 1167989 1160659 1157030 1156315 1158202 1163017 1171091 1182817 1199000 1220216 1245955 1275255
63307 1275255 1308187 1345771 1388179 1433880 1481062 1529409 1579953 1633545 1690063 1748938 1809819
63296 1809819 1872367 1935588 1997468 2055161 2105444 2145318 2172834 2187809 2191809 2187155 2175665 2158231
63284 2158231 2135472 2108512 2078859 2047444 2013950 1977258 1936486 1891449 1842222 1788829 1731698
63273 1731698 1672070 1611414 1550548 1489805 1430074 1373129 1320747 1273837 1232449 1196128 1164190
63262 1164190 1136136 1111825 1090654 1070530 1048572 1023317 995650 967259 939034 911445 885400
63251 885400 861632 839757 818963 799208 780745 762937 744816 726765 710472 696982 685671
63240 685671 675382 665723 656890 648890 641379 633987 626666 619970 614870 611789 609779 607088 602630 596683
63226 596683 590331 584574 579743 575440 571264 567695 565605 564551 562586 558630 554185 551487 550728 550446 550074
63211 550074 550427 551920 554004 556366 559139 561841 563801 565812 569620 575287 580742 584617 587954 592311
63197 592311 597752 603666 610160 617440 624958 632352 640276 649371 659431 670585 684064 700528 718687
63184 718687 736964 755607 775702 797020 818661 841223 866376 894319 923442 952647 982449
63173 982449 1013392 1044874 1076141 1107341 1138920 1170817 1202858 1235172 1267532 1298934 1328580
63162 1328580 1357028 1385690 1415263 1445121 1474141 1501477 1526230 1546886 1561949 1571284 1576146 1577329
63150 1577329 1573801 1563859 1547242 1525191 1498753 1468323 1434967 1400730 1367004 1333712 1300785 1269367
63138 1269367 1240578 1214108 1189163 1166253 1146883 1131872 1120908 1113374 1108663 1106081 1105448 1107621
63126 1107621 1113616 1123436 1136337 1151629 1168327 1184688 1199469 1213354 1227906 1243250 1257978 1271236
63114 1271236 1283534 1295368 1306445 1316701 1326771 1336637 1344585 1348286 1346573 1339852 1329310 1316090
63102 1316090 1300664 1282521 1260716 1235029 1206381 1176124 1145304 1114668 1084787 1055938 1028290
63091 1028290 1002381 978957 958164 939256 921294 903865 887076 871343 857343 845743 836650
63080 836650 829453 823324 817701 812267 806820 801399 796550 793370 792968 795335 798679 800621 800588 800518 802705
63065 802705 807454 813456 819648 825538 830246 832919 834366 836920 841998 848667 855241 861477 868504 877019
63051 877019 886284 894692 900937 904831 907383 909977 913345 917392 921919 927001 932623 938492 944424 950440
63037 950440 956244 961168 965069 968858 973529 978731 982777 984186 983078 981120 980282 981624 984978 989478
63023 989478 994327 999318 1004982 1012240 1021569 1032394 1043618 1054873 1066829 1080165 1094723 1110035
63011 1110035 1126138 1143431 1162254 1183191 1207302 1235177 1265962 1298053 1330745 1364755 1401395
63000 1401395 1441806 1486650 1535733 1588029 1642779 1700396 1761723 1826735 1894890 1966262 2041047
62989 2041047 2118033 2194980 2270913 2346786 2423357 2499572 2573878 2646251 2717921 2789583 2860776
62978 2860776 2930813 2999568 3067189 3133348 3196815 3255639 3307742 3351274 3384274 3404416 3409791
62967 3409791 3399993 3375894 3338408 3288132 3226137 3154333 3074859 2989834 2901861 2813945 2728371
62956 2728371 2646143 2567731 2493871 2425505 2363633 2309384 2263465 2225303 2193607 2168201 2150401
62945 2150401 2141033 2138830 2141481 2147597 2156876 2168982 2183219 2199159 2216821 2236269 2257421 2280016
62933 2280016 2303387 2326522 2348777 2370146 2390419 2408383 2422282 2430805 2433390 2430029 2421202 2407468
62921 2407468 2388494 2362868 2329436 2288575 2241666 2189727 2133214 2072887 2010228 1947086 1885282
62910 1885282 1826213 1770203 1716510 1664526 1614794 1568313 1525204 1484834 1447056 1412405 1381000
62899 1381000 1352030 1324593 1298455 1273679 1249976 1226807 1203937 1181634 1160375 1140316 1120940
62888 1120940 1101420 1081585 1062369 1044904 1029239 1014393 999567 984808 970452 956588 943344
62877 943344 931176 920333 910190 899606 888065 876292 865695 857370 851575 847805 845034 841999
62865 841999 837731 832174 826223 820971 817001 814432 813208 812861 812299 810589 808023 805680 803720 800889 796282
62850 796282 790999 787215 785762 785318 783930 780713 775983 770462 764859 759897 756211 754073 753364 753740 754752
62835 754752 755963 757229 758745 760465 761559 761034 759179 757726 757911 758827 758712 757544 756997 757605 757566 755394
62819 755394 752442 751257 752108 752869 752111 750665 749938 750159 750720 751005 750347 748260 745351 743069 741924 740851
62803 740851 738926 736892 736224 737276 738939 739622 738252 735226 732954 734442 740346 748029 754294 758363 761369
62788 761369 763848 765162 764988 764000 762966 762219 762105 763054 764990 767295 769533 771702 773801 775616 776941
62773 776941 777631 777652 777484 778065 779666 781197 781497 781206 782456 786611 792988 799879 806105 811491 816622 822528
62757 822528 830089 839250 849080 858768 868297 878039 888115 898422 909010 920156 932167 945285 959697
62744 959697 975540 992862 1011691 1032162 1054516 1078790 1104502 1131001 1158411 1187874 1220389
62733 1220389 1255790 1293544 1334201 1378873 1427400 1478448 1531951 1590171 1655488 1728153 1807055
62722 1807055 1891661 1981969 2077324 2176673 2279619 2385925 2494061 2601316 2705315 2804484
62712 2804484 2897074 2980564 3052097 3108986 3149007 3170889 3174374 3159490 3126405 3076588 3013149
62701 3013149 2938939 2855019 2762143 2662876 2560578 2456924 2352307 2248296 2147472 2050668
62691 2050668 1956641 1865143 1778266 1697799 1622995 1552243 1485458 1423537 1366704 1314822 1268354
62680 1268354 1227428 1190638 1156312 1124655 1097253 1074598 1055230 1037268 1019779 1002748 986881
62669 986881 973664 964628 959884 957686 955737 952784 949187 946449 946289 949551 955556 962722 970144 978577
62655 978577 989680 1004229 1021353 1039804 1059795 1082960 1110373 1141280 1174305 1209216 1246729
62644 1246729 1287248 1331021 1379172 1432970 1491746 1552833 1614209 1676160 1739732 1804526 1868811
62633 1868811 1930951 1989694 2043550 2090822 2130186 2160778 2182024 2193688 2195640 2187299 2167967 2138057
62621 2138057 2099185 2052515 1997932 1935635 1867705 1797077 1725565 1653953 1583407 1515529 1451234
62610 1451234 1390672 1334099 1281778 1233190 1187507 1144897 1106286 1071684 1039840 1009888 982289
62599 982289 957566 934895 912741 890627 869701 851561 836687 824032 812149 800746 790782 782914
62587 782914 776414 770090 763645 757253 750374 742326 733955 727354 723547 721521 720014 719167 719759 721692 724036
62572 724036 725922 726779 726486 726099 727589 731663 736408 739380 740832 743406 748519 754551 759266 762773 767045
62557 767045 773358 781509 791240 802981 816808 831596 845938 859591 873619 889331 907309 927249
62545 927249 948481 970839 995136 1022497 1053178 1086518 1122258 1161079 1203247 1247480 1292305
62534 1292305 1338076 1386192 1436240 1485412 1531308 1573977 1614232 1651112 1682276 1706008 1721370
62523 1721370 1726976 1721578 1706054 1683127 1654524 1619794 1578634 1532963 1485477 1437121 1387393 1336700
62511 1336700 1286869 1239305 1193950 1150476 1109432 1071580 1036726 1003982 972901 943932 917892
62500 917892 895353 876271 859877 845020 831042 818274 807409 798444 790497 782606 774534 766869
62488 766869 760572 756320 753967 752657 751704 751305 752117 754222 756862 759147 760587 761065 760927 761256 763263 766878
62472 766878 770492 772766 774412 777595 783801 792899 804086 816955 831529 847915 866206 886413 908409
62459 908409 932308 958784 988508 1021307 1056448 1093707 1133314 1174598 1215541 1254308 1290697
62448 1290697 1325614 1359547 1392006 1421941 1448049 1469019 1484189 1493812 1498244 1497220 1490629 1479653
62436 1479653 1466197 1451153 1434165 1415460 1397186 1382343 1372677 1368023 1367419 1370372 1377042 1387610
62424 1387610 1401780 1419005 1439126 1462516 1489349 1518829 1549432 1579877 1609480 1637508 1662515
62413 1662515 1682605 1696316 1703208 1703665 1698057 1686037 1666794 1640184 1607403 1570108 1529051 1484131
62401 1484131 1435859 1386017 1336530 1288224 1241305 1196638 1155708 1119241 1086537 1056533 1029140
62390 1029140 1005191 985319 969291 956346 945667 936407 927758 919628 913130 909690 909275 909965 909938 909673
62376 909673 911363 915990 921750 925832 927105 926276 923903 919429 912304 903012 892398 880744 868253 856004
62362 856004 845422 836673 828294 818739 807933 797085 787312 778777 771079 764067 758030 753064 748497
62349 748497 743337 737328 731196 725684 720857 716842 714697 715528 718742 722195 724495 726381 729342 733542
62335 733542 737891 741753 745747 750857 757391 764918 772788 780525 787937 795051 802119 809832 819314 831351
62321 831351 845510 860639 876418 893684 912868 933087 953595 975228 999301 1025683 1053433
62310 1053433 1082993 1116083 1153236 1193083 1234735 1279470 1329146 1384019 1443289 1507033 1576314
62299 1576314 1651683 1732619 1818421 1908677 2002752 2099420 2197060 2293541 2385749 2469824 2542335
62288 2542335 2601170 2645325 2674239 2687720 2686408 2671942 2646244 2610496 2564892 2509569 2445558
62277 2445558 2374582 2298245 2218009 2135898 2054457 1975682 1900504 1829523 1763643 1703546 1649099
62266 1649099 1599815 1555534 1516083 1480587 1447630 1415953 1384573 1352649 1319948 1287264 1255567
62255 1255567 1224678 1193475 1161688 1130865 1103026 1078613 1056270 1034641 1013969 995684 980676
62244 980676 968277 957006 946021 935714 927194 921344 918049 915870 912895 908573 904540 902856 903427
62231 903427 904129 903706 903529 905921 911607 919664 929263 940258 952215 964004 974733 984507 994107 1004420
62217 1004420 1016403 1031061 1048947 1069645 1091907 1114392 1136522 1158983 1183549 1212234 1246253
62206 1246253 1285421 1328555 1374788 1424773 1480261 1542174 1609508 1680859 1756729 1839247 1929469
62195 1929469 2025938 2126165 2228372 2330944 2430965 2524390 2607523 2677886 2734210 2776427
62185 2776427 2805437 2822150 2826618 2818350 2797184 2763480 2717851 2661164 2594609 2519489 2437330 2350416
62173 2350416 2261592 2173106 2086175 2001833 1921326 1845105 1772455 1702940 1637418 1576735 1520384
62162 1520384 1467623 1419111 1376023 1338103 1303980 1272924 1244853 1219049 1194550 1171599 1151002
62151 1151002 1132169 1113683 1095953 1081203 1070119 1060421 1049902 1039342 1031103 1026031 1023224 1022016
62139 1022016 1022594 1024980 1028784 1033996 1041015 1049751 1059434 1069573 1080691 1093832 1109420 1126608 1143771
62126 1143771 1159877 1175414 1191909 1210617 1231866 1255210 1279503 1303021 1324484 1344372 1364810
62115 1364810 1388021 1415175 1446392 1481094 1518514 1558770 1603410 1654043 1710501 1771313 1835706
62104 1835706 1903793 1974793 2046625 2117545 2186495 2251234 2307910 2353585 2387935 2411502 2423863
62093 2423863 2424878 2416324 2400273 2376561 2343580 2301239 2251602 2196822 2137921 2075632 2011292 1946796
62081 1946796 1884383 1826114 1772733 1723574 1678604 1639763 1608778 1584124 1561947 1540080 1519626
62070 1519626 1502523 1489172 1478869 1471018 1465127 1460726 1458045 1457911 1460346 1463947 1467037 1468693 1468421 1465912
62056 1465912 1461745 1457460 1454173 1451736 1449675 1448007 1446361 1443121 1436522 1426334 1413761 1399990 1385577
62043 1385577 1371058 1357324 1345264 1335361 1327633 1321706 1317087 1313657 1311768 1311744 1313523 1316906 1321814 1328058
62029 1328058 1335205 1343005 1351713 1361787 1373498 1386882 1401714 1417437 1433557 1450220 1468015 1487287
62017 1487287 1508388 1532497 1561042 1593882 1629222 1666066 1705605 1749151 1795765 1843480 1892234
62006 1892234 1943839 1999115 2056674 2114791 2172945 2230831 2286964 2338994 2384629 2421694 2448256
61995 2448256 2463507 2468010 2462458 2446857 2421576 2388360 2349122 2303981 2251607 2191602 2125753 2056713
61983 2056713 1986173 1914697 1842905 1772230 1704443 1640631 1580895 1525181 1474133 1428622 1388427
61972 1388427 1352014 1317953 1286087 1257070 1231264 1208453 1187978 1168672 1149350 1130030 1111939
61961 1111939 1095487 1079138 1061546 1044107 1029554 1018174 1007328 995043 982215 970503 959900
61950 959900 949733 940617 933622 928278 923069 917631 912864 908970 904926 900257 896044 893438 891900 889709
61936 889709 886026 881859 878833 877158 875245 871638 866934 862868 859560 855028 848141 840740 835402 831883
61922 831883 827392 820164 811217 802518 794967 788586 783352 778949 774504 769359 763722 758210 753144 748540
61908 748540 744389 740726 737721 735608 734162 732621 730785 729791 730760 732978 734660 735429 736572 738705 740776
61893 740776 741981 743134 745295 748401 752320 758100 766872 778212 790721 803581 816589 829406 842075
61880 842075 855767 871736 889779 908774 928450 949383 971246 992283 1010895 1027024 1041768
61869 1041768 1056120 1070230 1083434 1094955 1104803 1113709 1121728 1127336 1128725 1125990 1121466 1117769 1115829
61856 1115829 1114728 1113107 1110795 1109254 1110215 1113871 1118945 1124695 1131974 1141751 1153430 1165404 1176634
61843 1176634 1186798 1195512 1202459 1207863 1211877 1213808 1212893 1209395 1203886 1195857 1184377 1170023 1154923
61830 1154923 1140758 1127760 1115629 1104243 1093174 1081595 1069080 1055903 1042518 1029463 1017551
61819 1017551 1007064 996752 984823 971158 957404 944741 932859 921520 911718 904386 898990 894371
61807 894371 890309 887460 886368 887263 890412 895935 903554 912917 923811 935894 948821 962977 979376
61794 979376 998441 1019604 1042488 1067683 1095703 1125916 1157177 1188821 1220305 1250543 1278527
61783 1278527 1304111 1327300 1347195 1362647 1373685 1381254 1385562 1385724 1381336 1373579 1364349 1354756 1344973
61770 1344973 1335386 1327415 1322942 1322950 1326918 1333627 1342158 1351703 1360791 1367736 1372052 1374567 1375713 1374404 1369105
61755 1369105 1359358 1345691 1328636 1308457 1285384 1259488 1230824 1200292 1169813 1140910 1113551
61744 1113551 1087066 1061629 1037898 1015781 994825 975662 959749 947377 936979 926778 916389
61733 916389 906513 897809 890404 883802 876919 868780 859682 851196 844596 839543 834674 829229 823784 819505
61719 819505 816789 814639 811534 807177 803073 800863 800315 799721 798112 796107 794449 792948 791492 790966 792042
61704 792042 793752 794540 794494 795290 797828 801075 803604 805296 806834 808347 809470 810403 811931 814273 816543
61689 816543 817636 817229 815717 813529 810863 807841 804469 800435 795332 789407 783902 780234 778612 777675 775777
61674 775777 772597 769212 766703 765226 764526 764618 765344 765840 765437 764995 766295 769818 774053 777418 780041 782970
61658 782970 786420 789716 792506 795053 797510 799702 801487 802557 802160 799955 796973 794656 792981 790721
61644 790721 787674 785162 783724 781717 777268 770701 763964 758380 754136 751311 749882 748776 746358 742277
61630 742277 737822 733993 730098 724847 718230 711561 705876 700979 696118 691206 687035 684371 683056 682111
61616 682111 680625 678314 675391 672224 669228 666681 664536 662721 661682 661975 663081 663393 662039 660129 659283
61601 659283 659243 658171 655413 652834 652768 655294 658285 659889 660292 661003 662960 665672 668023 669450 670118 670297
61585 670297 670192 670458 672075 675180 678467 680490 681357 682413 684286 686039 686471 685612 684533 684162 684706 685868
61569 685868 687037 687273 685525 681227 674761 667344 660320 654366 649280 644461 639498 634323 629167 624521
61555 624521 620794 617737 614555 610935 607537 604937 602548 599329 595190 590712 585660 579061 571003 563182
61541 563182 556965 551918 546970 542155 538148 534720 530913 526564 522576 519578 517197 514722 511800 508387
61527 508387 504858 502276 501613 502285 502291 500433 497752 496052 495515 494633 492252 488750 485197 482292 480437 480087
61511 480087 481333 483370 484903 485057 483708 481239 478411 476289 475691 476448 477524 478079 478247 478680 479606 480707
61495 480707 481841 483454 486009 489205 492120 494107 495250 495893 496093 495867 495734 496464 498211 500322 502162
61480 502162 503803 505670 507817 509807 511075 511142 509788 507427 505185 504209 504897 506890 509427 511411 511678
61465 511678 510044 507863 506769 506857 506838 505945 504733 503807 502778 501030 498810 496946 496005 496208 497526 499263
61449 499263 500168 499699 498726 498282 498166 497706 497344 498173 499939 500817 499629 497371 495986 496240 497413 498663 500005
61432 500005 501904 504352 506683 508408 509934 511972 514226 515462 515306 515164 516419 518340 519081 518545 518848
61417 518848 521594 525943 529905 532528 534098 535106 535954 537116 538628 539725 539722 539056 538831 539587 541009 542602
61401 542602 543977 544646 544282 543202 542026 540812 539025 536514 534074 532811 533198 534849 537033 539257 541386
61386 541386 543308 544743 545689 546970 549755 554245 559241 563388 566446 569021 571548 574254 577698 582389
61372 582389 587793 592487 595581 597480 598970 600052 600052 598585 596076 593432 591478 590682 591234 593134 595978
61357 595978 598730 600277 600646 601305 603623 607076 609551 609415 606769 602809 598757 595578 593874 593433 593276
61342 593276 592614 591433 589882 587706 584869 582242 580854 580643 580704 580716 581275 582623 583845 583835 582565 580824
61326 580824 579056 577132 575350 574954 577185 581880 587377 591847 594688 596606 598609 601057 603664 606206
61312 606206 609137 613402 619492 626606 633014 637538 640588 643472 646841 650226 653031 655376 657844 661051
61298 661051 665710 672335 680266 687576 692863 696874 701542 707627 714296 720972 728326 736917 745916 754000
61284 754000 760910 767256 773216 778412 782965 787772 793415 799324 804329 807785 810003 811720 813250 814185
61270 814185 813994 812876 811671 810764 809595 807636 805418 804030 803875 804541 805538 806396 806288 804644 802333 801257
61254 801257 802391 805050 808515 813500 821187 831370 842578 853941 866159 880482 897055 914342
61242 914342 930031 942720 953007 962651 972411 981026 986678 988945 988776 987027 983918 979649 974405 967567
61228 967567 957997 945755 932904 921913 913560 906799 900313 893581 886724 880054 874017 869192 866147
61215 866147 865317 866879 870456 875055 879669 884051 888655 893784 899045 903769 907726 911284 915068 919671
61201 919671 925512 932706 941045 950233 960065 970242 980115 988847 995851 1000948 1004279 1006377 1008171 1010322
61187 1010322 1012373 1013112 1012085 1010199 1008353 1006014 1002053 996783 992178 989826 989371 989273 988437 986743 984618
61172 984618 982697 981564 981291 981465 981971 983420 986374 990580 995424 1000813 1007020 1014004 1021521 1029610 1038269
61157 1038269 1046867 1054762 1062413 1070903 1080220 1088967 1096094 1102043 1107677 1112967 1117508 1121617 1125875 1130008
61143 1130008 1133379 1136612 1141678 1149922 1160703 1172361 1184020 1195994 1209020 1223670 1240164 1257936
61131 1257936 1275321 1290383 1302404 1312320 1321532 1330589 1339120 1346570 1352568 1356912 1359749 1361720 1363475
61118 1363475 1364922 1365269 1363860 1360703 1356179 1350597 1344141 1336989 1329245 1320828 1311480 1300904 1289145 1276998
61104 1276998 1265619 1255107 1243740 1229507 1212519 1195100 1179319 1165302 1152320 1140361 1129711
61093 1129711 1119833 1109888 1100055 1091291 1084018 1077993 1073229 1069839 1066943 1062887 1056866 1049420 1041205 1032394
61079 1032394 1023718 1016816 1012512 1009534 1006081 1002320 1000261 1001241 1004402 1007825 1010481 1012768 1015719 1020289
61065 1020289 1027356 1037951 1052881 1071843 1093194 1115250 1137946 1162635 1189999 1218812 1247349
61054 1247349 1275505 1304615 1335369 1366897 1398149 1429293 1461096 1493412 1525055 1555124 1583729
61043 1583729 1611130 1636559 1658374 1675305 1687230 1694659 1697845 1696767 1691786 1683794 1673454 1660569
61031 1660569 1644511 1625137 1602941 1578450 1552003 1524353 1497021 1471431 1447705 1424737 1401546
61020 1401546 1378234 1355509 1333741 1312918 1293336 1275940 1261865 1251709 1245065 1240702 1237548 1235776
61008 1235776 1236460 1239799 1244285 1248483 1253296 1261360 1274111 1290422 1308292 1326857 1346406 1367610 1391455
60995 1391455 1419059 1450568 1484749 1520416 1557770 1597722 1640585 1686313 1735390 1788461 1845536
60984 1845536 1906661 1973062 2046357 2126656 2212471 2302731 2398108 2500229 2610197 2727834 2851859
60973 2851859 2980884 3114780 3254753 3401655 3554948 3714288 3881420 4059283 4249811
60964 4249811 4454020 4673811 4911918 5170043 5448595 5748487 6072260 6424288 6812008
60955 6812008 7246742 7740896 8303880 8942584 9665523 10483980 11409839 12456982 13646179
60946 13646179 15004377 16557298 18326080 20326163 22544638 24888812 27152558 29064049
60938 29064049 30410651 31148824 31408894 31403813 31332373 31339197 31506045 31822395 32147384 32231440
60928 32231440 31825150 30807852 29237145 27292591 25176477 23047068 21003901 19099208
60920 19099208 17352304 15763528 14327163 13037584 11888012 10869088 9970865 9184002
60912 9184002 8497633 7897956 7370485 6902912 6485421 6109949 5770284 5461873 5180614
60903 5180614 4922524 4684816 4466075 4264816 4078953 3906989 3748302 3601423 3463247
60894 3463247 3330991 3204094 3083363 2969059 2860617 2757467 2659313 2566175 2478704 2397710
60884 2397710 2322826 2252423 2185396 2122031 2062369 2004824 1947584 1890684 1835563 1783148 1733427
60873 1733427 1686309 1641708 1599081 1558011 1519090 1483150 1449677 1416953 1383928 1351239 1320354
60862 1320354 1292226 1266693 1242664 1218945 1195384 1173009 1152763 1134644 1118520 1104931 1093991
60851 1093991 1084228 1073929 1063374 1054256 1046941 1039866 1032034 1024580 1019141 1015879 1014003 1013137 1013043 1012818
60837 1012818 1011636 1009921 1008699 1008012 1007039 1005606 1004361 1003242 1000823 995792 988344 979615 970212 959895
60823 959895 948388 935895 922987 910379 898673 887889 877378 866642 856179 847073 839674 833097
60811 833097 826057 817843 808580 799188 791226 786015 783373 781624 779407 776969 775055 773030 769262 763467
60797 763467 757671 754301 753855 754971 756245 757280 758089 758199 756789 753640 749635 746041 743278 740699 737812
60782 737812 735302 734274 734654 735090 734540 733219 731742 730118 728092 725882 723888 722160 720773 720259 720789
60767 720789 721246 720256 718230 717328 719024 722444 725590 727397 727940 727273 725102 721476 716992 712287 707929
60752 707929 704739 703328 703050 702142 699416 695344 691135 687293 683633 680128 676839 673294 668886 663963 659641
60737 659641 656263 652753 647873 641552 634670 628078 622178 616924 611741 605921 599642 594146 590390 587925
60723 587925 585642 583142 580723 578474 576339 574881 575025 576899 579561 581911 583316 583558 583010 582876 584341
60708 584341 587227 590247 592780 595594 599461 603932 608053 611685 615508 620180 626020 633002 640373 646549
60694 646549 650200 651504 651905 652509 652970 652016 648968 644749 641340 640062 640392 640725 640120 638785 636909 633864
60678 633864 629012 622642 615525 607996 600107 592323 585242 578695 571875 564618 557971 553081 549876 547269
60664 547269 544582 542197 540653 539638 538450 537180 536558 536582 536291 535419 535180 536414 537809 537437 535603 534498
60648 534498 535059 535985 536339 537269 540062 543891 546905 548649 550087 551917 554213 557327 561748 567046 571959
60633 571959 575552 577694 578754 579649 581823 586137 591944 598043 604156 610435 615942 619139 620069 620774 623232
60618 623232 627880 634224 641491 648085 651820 651872 649840 647902 646345 643725 639101 633238 627748 623748 621371
60603 621371 619944 618391 615766 611630 606145 600098 594906 592064 592153 594431 597587 600717 603492 605855 607964
60588 607964 610194 612637 614630 615193 614047 611934 609781 607699 605034 601416 597515 594467 592454 590238
60574 590238 586483 581421 576734 573768 572389 571740 571528 572026 573138 574235 575053 576169 578183 580706 582656
60559 582656 583553 584037 584895 585963 586383 585794 584817 584319 584614 585433 586234 586482 586044 585496 585620 586421 587162 587572
60541 587572 588352 590093 592358 594504 596804 599912 603722 607683 611884 616673 621303 624204 624903 624705 625128
60526 625128 626459 628167 629867 631351 632381 633102 634232 636442 639926 644771 651219 659211 668358 678754
60512 678754 691188 706022 722506 739661 757233 775075 792259 807693 821188 833042 842781 849238
60500 849238 851853 851138 847923 842818 836458 829662 823228 817961 814701 813703 814183 815340 817868 823578 833232
60485 833232 845464 858309 871278 885468 901998 920838 941038 961762 982988 1005195 1028243
60474 1028243 1050656 1070261 1085414 1095340 1099677 1098608 1093602 1087194 1081404 1076554 1071755 1066055 1059000
60461 1059000 1050815 1042640 1036164 1032447 1031275 1031882 1033887 1037219 1041748 1047608 1055381 1065226 1076270 1087793
60447 1087793 1100812 1117555 1139372 1166040 1197133 1232938 1273570 1318067 1365139 1414425 1466424
60436 1466424 1521415 1578778 1636994 1693853 1746781 1793306 1831325 1859170 1875931 1881681 1876703 1860291
60424 1860291 1831153 1789493 1737981 1679961 1617270 1550675 1481863 1413844 1349209 1288810 1232293
60413 1232293 1179273 1129813 1084293 1043122 1006372 973666 944571 918822 895893 874803 854965
60402 854965 836809 820712 805690 790248 774520 760442 749525 741401 734796 728870 723112 716966
60390 716966 710351 703940 698270 693095 688011 683020 677935 672152 665817 660482 657555 656488 655396 653171
60376 653171 650204 647422 645452 644371 643407 641228 637529 634072 633071 634639 636897 638384 639113 639163 637712
60361 637712 634185 629419 625023 622152 621323 622558 625053 627373 628714 629651 631201 633536 636083 638394 640299
60346 640299 641659 642699 644371 647668 652466 657423 661050 662741 663030 663196 664425 666904 669752 672111 674138
60331 674138 676642 679990 683851 687806 691634 695020 697582 699394 701015 702694 704021 704830 706118 709343
60317 709343 714669 720539 725387 729372 733864 739425 745085 749795 753799 757957 762154 765131 765919 764941 763704
60302 763704 763876 766557 771747 778226 784386 789535 794296 799747 806469 814441 823258 832169 840295 847297
60288 847297 853610 859713 865279 869377 871398 871418 869753 866598 862428 858454 856147 855932 856540 856115 854099
60273 854099 851670 850082 849004 847004 843444 839269 835906 833849 832410 830484 827485 823936 821220 820386
60259 820386 821126 822278 823330 825007 828325 833490 839841 846495 853049 860122 869195 881372 896231 912443
60245 912443 929415 947393 965713 982051 994120 1001379 1004475 1003831 999714 992943 984247 973093 958382
60232 958382 940544 922048 905562 892193 881627 873215 866549 861502 858113 856118 854483 851910 848172
60219 848172 844579 842662 842502 842560 840989 836996 831215 825145 820160 816714 814283 812024 809452 806618 803876
60204 803876 801555 799627 797541 794613 790842 787170 784616 783190 781979 780298 778356 776626 775144 773986
60190 773986 774088 776618 781263 785970 788979 790655 792565 795116 797089 797570 797422 798320 800848 803984 806194
60175 806194 806733 806127 805709 806489 808322 810279 811817 813186 814748 816491 818451 820933 823848 826351 827773
60160 827773 828672 830504 834428 840791 849352 859435 870110 880844 891917 903705 915714 926903 936833
60147 936833 945839 954079 961132 966869 972213 978569 986572 995629 1004507 1012258 1018595 1023632 1027567 1030870
60133 1030870 1034428 1038909 1043846 1047997 1050875 1053199 1055335 1056027 1053620 1048087 1040911 1033228 1025153 1016810
60119 1016810 1008766 1001149 993360 985212 977556 971257 966123 961303 956194 950607 944676 939161 935241 933298
60105 933298 932120 929859 925639 920082 914721 911213 910500 912045 914213 915846 917137 918589 919858 920462 921047
60090 921047 922788 925598 927997 928932 928893 929057 930057 931868 934223 936893 940106 944768 951601 959893 967924
60075 967924 974972 982012 989899 997783 1004224 1009269 1014340 1020326 1026750 1032714 1037757 1041789 1045031 1048180
60061 1048180 1051899 1055933 1059449 1062458 1066041 1070725 1075347 1078314 1079548 1080442 1081993 1083659 1084137 1082786
60047 1082786 1080113 1077222 1075004 1073689 1072842 1071679 1069414 1065628 1060591 1055253 1050607 1046932 1043744 1040456
60033 1040456 1036868 1033101 1029447 1026419 1024489 1023611 1023227 1022827 1022169 1020962 1018953 1016513 1014451 1012868 1010846
60018 1010846 1007781 1004414 1001832 999914 997519 993797 988494 981299 971968 961143 950163 939862 930121
60005 930121 920585 911171 901877 892779 884235 876377 868452 859550 850140 842101 836971 834806 834751 835836 837010
59990 837010 837375 836912 836299 835807 835237 835106 836680 840275 844686 849146 854701 862442 871305 879006 884632 888882
59974 888882 892060 893404 892596 890640 888774 887372 886312 885536 884717 882955 879499 874655 869552 864985 860591
59959 860591 855261 848472 841080 834297 827847 819893 809356 797576 786834 777715 769060 760283 752518
59946 752518 747160 744231 742590 741099 739229 737040 734976 733347 731904 730291 728823 728178 728274 728188 727447 726705
59930 726705 726857 728099 730202 733026 736337 739681 742874 746052 748813 750106 749759 749490 751260 754829 757974
59915 757974 759240 759365 759589 759471 757418 753067 748192 745039 744235 744690 745119 745073 744570 743440 741613 739791
59899 739791 739125 739948 741197 741538 740929 740720 742127 744953 747968 750244 751682 752383 752117 750846 749389 748959
59883 748959 749942 751475 752304 751816 750277 748533 747579 747944 749202 750418 751254 752420 754853 758856 764107 769972
59867 769972 775452 779458 781775 783434 785673 788888 793103 798886 806838 816333 825649 833475 839694 844726
59853 844726 848843 852250 855200 857722 859616 860818 861440 861651 862044 863860 867972 873612 878974 883256 887241
59838 887241 891676 896180 900272 904452 909292 914122 917618 919399 920241 921050 922619 926170 932852 942244 952127
59823 952127 960290 966126 970151 972741 974187 975605 978557 983284 988000 990653 991126 991066 991670 992414 992163 990735
59807 990735 988737 986342 983123 979146 975544 973642 973827 975590 978526 982965 989418 997449 1005491 1012234
59793 1012234 1018163 1025102 1033961 1043463 1051439 1056735 1059265 1058904 1055568 1050376 1045573 1042742 1041481 1040026
59779 1040026 1036688 1030630 1022004 1011883 1001746 992583 984382 976426 967933 958602 948969 940207 933210
59766 933210 927862 923519 919922 917076 914505 911545 908353 905757 903862 901644 898261 893954 889277 884253
59752 884253 878971 874336 871307 869566 867699 864761 861238 858437 857218 857333 857762 857539 856265 854006 851121
59737 851121 848350 846475 845252 843128 838960 833835 830166 828976 829188 829633 830340 831278 831275 829429 826675 824658
59721 824658 823517 822088 820117 818949 819662 821292 821520 819002 814893 812013 812255 814785 817162 818219 819130
59706 819130 821545 825685 830898 836944 843511 849288 853099 855931 860346 867493 875794 883043 888874 894470
59692 894470 900634 907074 913363 919700 926536 933939 941700 949823 958512 967656 976752 985519 994158 1002527
59678 1002527 1009472 1013787 1015782 1017012 1018323 1019156 1019127 1019194 1020323 1021732 1021514 1018770 1014358 1009929 1006881
59663 1006881 1005829 1006061 1005609 1002826 998083 993370 990227 988552 987220 985129 981740 977326 972806 968872
59649 968872 965379 962032 959295 957901 957763 958252 959281 961082 963143 964613 965883 968388 972437 976543 979646
59634 979646 982881 988080 995196 1002272 1007569 1010862 1012866 1014217 1015079 1015214 1014449 1013296 1012774 1013115 1012975 1010619
59618 1010619 1005799 999901 994313 989234 984053 978211 971452 963834 956001 949200 944520 942003 940614 939052
59604 939052 936525 932927 928643 924352 920806 918508 917492 917462 918158 919556 921742 924778 928682 933311 938192
59589 938192 942658 946336 949314 951651 952901 952430 950185 946930 943642 940702 937595 933442 928092 922689
59575 922689 918788 916649 914898 912176 908635 905144 901460 896332 889546 882830 878073 875198 872456 868552
59561 868552 863929 860085 858097 857684 857208 854574 848784 841033 834032 829852 828377 827967 827417 826823 826633 826563
59545 826563 825927 824627 823134 821641 819955 818266 817317 817518 818527 820046 822339 825439 828437 830379 831494
59530 831494 832689 834060 834875 835047 835571 837051 838609 838856 837539 835575 833743 831994 830037 827966 825891
59515 825891 823271 819261 813990 809132 806593 806582 807439 807567 806975 806608 806798 807156 807639 808688 810173 811109 810956
59498 810956 810706 812089 815822 820900 825562 828837 831351 834777 840322 847532 854606 859942 863379 866122
59484 866122 869838 875870 884773 896127 908951 922853 938952 959096 983399 1008364 1028092 1038175
59472 1038175 1038685 1033301 1025819 1017991 1010217 1003028 997202 993160 990938 990363 990740 990909 990354 989883 990483 991813
59456 991813 992557 992035 990684 989069 987219 984812 981215 975520 967603 959165 952583 948294 944246 938391 930861
59441 930861 923185 916284 910111 904636 900083 896318 892781 889174 885722 882729 880251 878280 877036 876985 878601
59426 878601 881973 886541 891365 895752 899504 902626 905301 908245 912530 918528 925283 931413 936572 941679
59412 941679 947669 954297 960248 964325 966486 967766 969197 970911 972415 973534 974757 976652 979391 982892
59398 982892 987053 991659 996506 1001903 1008620 1016978 1026274 1035659 1045367 1056430 1069050 1081746 1092479
59385 1092479 1100372 1106053 1110541 1114230 1116924 1118341 1118235 1116279 1112181 1105827 1097176 1086337 1074226 1062872
59371 1062872 1054346 1049210 1046482 1045119 1044870 1045662 1047231 1049901 1055020 1063804 1076048 1090471 1105932 1121967
59357 1121967 1138732 1157010 1177752 1201276 1227690 1258356 1295113 1336311 1374665 1401294 1412155
59346 1412155 1409504 1398021 1381752 1364439 1349729 1339629 1334375 1334593 1341443 1353172 1363427 1365227
59334 1365227 1355996 1337443 1311897 1281054 1247686 1215821 1188274 1165338 1146429 1131763 1121618
59323 1121618 1114984 1109998 1105477 1101431 1098183 1095473 1092546 1089031 1085618 1083643 1083948 1086296 1089958 1094503
59309 1094503 1099822 1105803 1112370 1119439 1126448 1132235 1135984 1138173 1140223 1143390 1148257 1154821 1162366 1169515
59295 1169515 1175174 1179577 1184008 1189631 1197019 1206533 1218303 1231686 1245472 1258995 1272595 1286746
59283 1286746 1301226 1315703 1330777 1347689 1366761 1386423 1404109 1418084 1428257 1435313 1439438 1440091
59271 1440091 1436840 1430138 1421198 1411190 1400465 1388564 1375186 1361076 1347463 1334442 1320690 1305384
59259 1305384 1289729 1275651 1263526 1252446 1242426 1234701 1229529 1225210 1220163 1214912 1211222 1210121 1211582
59246 1211582 1215291 1220707 1226879 1233003 1238609 1242510 1242302 1235965 1223604 1206967 1187886 1168023 1149172
59233 1149172 1132307 1116685 1101140 1086034 1072634 1060940 1049737 1038848 1029654 1022984 1018004 1013897
59221 1013897 1011257 1010870 1012251 1014469 1017670 1022637 1029337 1037005 1045411 1055013 1065855 1077146 1088112
59208 1088112 1098745 1109700 1121895 1136043 1151897 1167874 1182020 1193589 1203208 1211365 1217360 1220225
59196 1220225 1220128 1218197 1215097 1210499 1204002 1196008 1187465 1179302 1172418 1167697 1165414 1164847 1165012 1165672 1167128
59181 1167128 1169232 1171268 1172924 1174798 1177708 1181938 1187275 1193364 1199858 1206575 1213618 1220957 1227918 1233599
59167 1233599 1237801 1240880 1242665 1242423 1240178 1237030 1233488 1228467 1220875 1211576 1202702 1195357 1189021 1182919
59153 1182919 1176888 1170861 1164574 1158064 1151610 1144934 1137226 1128444 1119959 1113323 1108746 1105316 1102423 1100294
59139 1100294 1098981 1097513 1094694 1090760 1087610 1086974 1088654 1091106 1093477 1096284 1100055 1104241 1107941 1110978
59125 1110978 1113639 1115931 1117839 1120016 1123480 1128675 1135260 1142626 1150221 1157656 1164946 1172375 1179728 1186065
59111 1186065 1190818 1194813 1199594 1205984 1213764 1222308 1230765 1238029 1243526 1247987 1252564 1257171 1260487 1261628
59097 1261628 1260874 1258598 1254416 1247887 1239348 1229464 1218433 1206263 1193589 1181554 1170745 1160583 1149982
59084 1149982 1138493 1126638 1115127 1104114 1093541 1083891 1075827 1069001 1062018 1054065 1046020 1039333 1034255
59071 1034255 1029734 1024751 1019124 1013289 1007955 1003933 1001830 1001923 1004403 1009276 1015786 1022785 1030283 1039723
59057 1039723 1051679 1063993 1073693 1080562 1087399 1096581 1107653 1118632 1128461 1137495 1146358 1155102 1163178
59044 1163178 1169820 1174816 1179047 1183770 1189120 1193797 1196541 1197499 1197748 1197789 1196887 1194009 1189277 1184305 1180758
59029 1180758 1178550 1175976 1171865 1166993 1162927 1160145 1157999 1155892 1153462 1149974 1144734 1138079 1131068 1124177
59015 1124177 1117139 1109844 1102428 1094544 1085740 1076715 1069099 1063642 1059466 1055397 1051168 1047061 1043272 1040038
59001 1040038 1037656 1035929 1034196 1032152 1030013 1027763 1025097 1022419 1021023 1021691 1023614 1025155 1025336 1024428 1023603
58986 1023603 1024178 1026609 1030019 1033051 1035158 1036522 1037066 1036561 1035719 1036036 1038292 1042086 1047032 1053287 1060536
58971 1060536 1067574 1073599 1079181 1085461 1093067 1102214 1112959 1124794 1136686 1148161 1159814 1172415
58959 1172415 1186114 1200836 1216628 1233140 1249367 1264327 1277434 1288112 1295911 1301191 1304739 1306477
58947 1306477 1305783 1303396 1301568 1301608 1302618 1303551 1305241 1309170 1315413 1323078 1331835 1341503 1350903 1358848 1366049
58932 1366049 1374665 1385952 1399385 1413739 1427829 1440366 1450527 1458985 1467463 1476982 1487200 1497499
58920 1497499 1507975 1519234 1531806 1545844 1560923 1576147 1590951 1605791 1621635 1638964 1657647
58909 1657647 1677486 1698329 1719896 1741986 1764563 1787167 1808674 1828417 1847272 1866743 1887051
58898 1887051 1906817 1924652 1940379 1954567 1967396 1978219 1985980 1990047 1990789 1989297 1986518 1982926 1978964
58885 1978964 1975140 1971372 1966829 1960837 1953484 1945204 1936507 1928415 1922024 1916861 1910622 1901436 1889665 1876662
58871 1876662 1862763 1847711 1832074 1816636 1800991 1784495 1768304 1754650 1743997 1734534 1724694 1714617
58859 1714617 1704869 1695461 1686929 1680815 1677932 1677108 1676703 1676638 1677875 1680566 1683848 1687316 1691791 1698516 1708131
58844 1708131 1720431 1734722 1750330 1766958 1784647 1803439 1823259 1843885 1864570 1883855 1900426
58833 1900426 1914313 1926689 1938399 1949388 1959721 1970081 1980626 1990108 1997117 2001851 2005812 2009927
58821 2009927 2013764 2016427 2017297 2015756 2011051 2002886 1991593 1977335 1959699 1938643 1915393 1891696 1868329
58808 1868329 1844959 1821352 1798024 1775668 1754642 1735143 1717129 1699814 1682119 1664131 1647318
58797 1647318 1632537 1618518 1603210 1586071 1568053 1549939 1532014 1514933 1499309 1484387 1468674
58786 1468674 1452212 1436795 1423535 1411771 1400916 1391677 1384241 1376757 1367241 1356070 1345097 1334947
58774 1334947 1324828 1314549 1305025 1296621 1288374 1279224 1269203 1259367 1251368 1246991 1247000 1250038 1253340 1254867
58760 1254867 1254389 1252740 1250845 1249547 1249456 1250398 1251388 1251571 1251122 1251079 1252288 1254403 1255914 1255506 1253486 1251374
58744 1251374 1249913 1248101 1244544 1238941 1231636 1222493 1211284 1198822 1186701 1175935 1166465 1157813 1149658
58731 1149658 1142065 1135632 1130960 1127460 1123482 1118384 1113701 1111127 1110142 1109050 1107804 1108032 1110351 1113401
58717 1113401 1115816 1117622 1119242 1120514 1121320 1121965 1122211 1120944 1117611 1113031 1107986 1101823 1093514 1083676 1074559
58702 1074559 1068060 1064298 1061938 1059279 1055073 1049045 1042181 1036373 1033252 1032852 1033474 1033304 1032271 1031841 1032927
58687 1032927 1034869 1036902 1039638 1044087 1049872 1055617 1060741 1065717 1070791 1075789 1081214 1088152 1096705 1105644
58673 1105644 1114093 1122606 1132015 1141920 1150899 1157839 1162899 1167690 1174432 1183970 1194339 1202221 1206290 1208431
58659 1208431 1211293 1215579 1220356 1225176 1230790 1237990 1246500 1255088 1262416 1267968 1272481 1277233 1282475 1286694
58645 1286694 1287862 1285424 1280717 1275286 1269086 1260774 1249684 1236837 1223471 1209136 1192311 1172820
58633 1172820 1152413 1132647 1113503 1094728 1077170 1061612 1047506 1034291 1022936 1014395 1007287 999287
58621 999287 990500 983218 978174 973353 967240 961154 957128 955140 953847 952811 952425 952378 951785 950689 950334
58606 950334 951964 956030 962376 970559 979998 990228 1000871 1011097 1019421 1024484 1026003 1024837 1022228
58593 1022228 1018894 1014521 1008234 999962 991175 983710 978057 973450 969381 966023 963233 960366 957350 954901
58579 954901 953207 951307 948342 944716 941568 939630 938896 938725 938112 936627 935325 935785 937959 940012 940737
58564 940737 940946 941688 942260 941213 938717 936532 935763 935699 935144 934205 934373 937062 942330 949073 956329 964002
58548 964002 972062 979538 985077 988357 990323 992024 993817 995494 996429 995794 993649 991734 992093 994729 997624
58533 997624 999185 999579 999555 999400 999664 1001679 1006374 1013254 1021161 1029415 1037785 1046261 1055408 1066073 1078119
58518 1078119 1090145 1101064 1111208 1121354 1131585 1141879 1152995 1165787 1180171 1195549 1211907
58507 1211907 1229752 1249310 1270314 1292301 1314748 1337403 1361030 1387330 1417456 1450618 1484328
58496 1484328 1515890 1543732 1567839 1589046 1607590 1622488 1632808 1639053 1642363 1642752 1639511 1633213
58484 1633213 1625736 1618010 1609251 1598848 1587409 1575215 1561127 1543976 1523768 1500707 1474468 1445664
58472 1445664 1416825 1390403 1366558 1344113 1322989 1304352 1288853 1275997 1264985 1255098 1245377 1234970
58460 1234970 1224050 1214006 1206580 1202657 1201285 1200008 1197068 1193445 1191592 1191881 1191678 1188578 1183254 1178148
58446 1178148 1174478 1171664 1168802 1165489 1161821 1158675 1157544 1159141 1162486 1165905 1168440 1169848 1170087 1169545
58432 1169545 1169091 1169264 1169986 1171479 1174554 1179469 1185455 1191877 1198918 1206722 1215176 1225069 1237898 1253559
58418 1253559 1269725 1284650 1299242 1315146 1332253 1349579 1367132 1384942 1401251 1413711 1421905
58407 1421905 1426987 1429312 1428223 1424008 1418295 1412295 1405944 1399050 1392354 1387231 1384854 1385537 1388546 1392858
58393 1392858 1398405 1405925 1415343 1425307 1434755 1443689 1451662 1456755 1457211 1453193 1446142 1437452 1428488 1420405
58379 1420405 1412743 1403548 1392300 1381503 1373957 1369578 1366478 1363999 1362875 1363194 1364099 1365131 1366522 1368562
58365 1368562 1371753 1376838 1383639 1390766 1397461 1404589 1412713 1420571 1426817 1431704 1435398 1436284 1433136 1427698
58351 1427698 1422785 1418701 1413700 1407105 1399657 1391473 1382091 1372273 1363696 1357029 1352013 1348891 1348000 1348485
58337 1348485 1349235 1350541 1353102 1356080 1358077 1359382 1361416 1364580 1368420 1373067 1378559 1383735 1387852 1392320
58323 1392320 1398613 1405649 1411713 1417846 1426290 1436426 1445543 1453262 1461907 1472404 1483000 1492407 1501372
58310 1501372 1510730 1520573 1531779 1545610 1561162 1575683 1588079 1599919 1612518 1625423 1638353 1652277
58298 1652277 1667678 1683662 1699399 1714751 1729219 1742245 1754828 1768718 1783536 1796627 1806237
58287 1806237 1813095 1818701 1824060 1830351 1838745 1848955 1859597 1870236 1881676 1894422 1908589 1924889
58275 1924889 1943649 1963191 1981440 1998875 2017623 2038075 2058964 2080420 2103967 2129388 2154486
58264 2154486 2178252 2201611 2224741 2246384 2266264 2285638 2304966 2323370 2340684 2357780 2374746
58253 2374746 2391164 2408117 2427407 2448912 2471285 2494881 2520991 2548555 2575093 2600890 2628791
58242 2628791 2659591 2691014 2721518 2751641 2781339 2809642 2837529 2867624 2900449 2934278 2968923
58231 2968923 3006030 3045494 3085623 3127278 3173512 3224431 3276850 3330002 3386942 3448918 3512897
58220 3512897 3576502 3641231 3708969 3779321 3852213 3929218 4010462 4093926 4179425 4269485 4364825
58209 4364825 4463086 4563513 4668696 4780183 4896833 5019059 5149759 5289093 5433377 5581546
58199 5581546 5737740 5904852 6080384 6261721 6450799 6650358 6859994 7079053 7309201
58190 7309201 7551128 7802977 8065036 8341782 8636533 8948440 9277337 9626539 9997832
58181 9997832 10388732 10798078 11229433 11685730 12165727 12669410 13202011 13769216 14373385
58172 14373385 15017725 15708621 16450134 17241729 18085098 18987630 19955709 20990719 22095328
58163 22095328 23277029 24541479 25889175 27322825 28850886 30479971 32211944 34053230
58155 34053230 36018539 38120596 40365601 42764692 45340790 48118659 51118728 54367030
58147 54367030 57900320 61755095 65964570 70575252 75655760 81284965 87549526 94562744
58139 94562744 102467736 111410939 121531317 132985225 145955496 160619128 177129558
58132 177129558 195642240 216330259 239390746 265121612 293955752 326064711 360408673
58125 360408673 393919955 421857612 439519620 444211514 436105191 417642743 392239422
58118 392239422 363177048 333018835 303449197 275387870 249248749 225185631 203224829
58111 203224829 183316740 165374169 149298106 134971463 122248563 110970289 100983818
58104 100983818 92141221 84295439 77314434 71093534 65545395 60586709 56142660 52153632
58096 52153632 48566426 45325523 42380969 39697195 37245607 34995195 32918205 30998266
58088 30998266 29224433 27582158 26056803 24640222 23325938 22101892 20954695 19877526
58080 19877526 18868057 17922140 17034770 16203352 15424598 14691419 13997634 13342467 12726218
58071 12726218 12145218 11595515 11077819 10593899 10141066 9714462 9311812 8931760 8570468
58062 8570468 8224090 7892139 7574897 7270365 6977294 6698148 6435162 6186306 5948824
58053 5948824 5723801 5513086 5314434 5124097 4942193 4771168 4610409 4456326 4306742
58044 4306742 4161922 4022394 3888604 3761405 3640193 3521975 3404769 3290373 3181400
58035 3181400 3077443 2976630 2878850 2784491 2691892 2599342 2508335 2421930 2340931 2264252 2191840
58024 2191840 2124603 2062397 2004352 1950158 1899071 1849045 1798974 1750442 1705160 1662248 1620173
58013 1620173 1579653 1542085 1506565 1471154 1435924 1402235 1370104 1338779 1308938 1281781 1256653
58002 1256653 1231944 1207718 1185391 1165410 1147106 1130078 1113891 1097270 1079363 1061058 1043524
57991 1043524 1026656 1010412 996083 984237 973013 960716 948616 938668 929926 920038 909144 899234
57979 899234 890409 880964 870780 861475 853114 843840 833181 822893 813671 803563 790842 776504 762601
57966 762601 749572 736517 723184 710507 699542 690470 682466 674340 665521 656418 647766 639963 633129
57953 633129 627063 620726 612714 602995 593418 585838 580459 576553 573686 571405 568861 565894 563546 562491
57939 562491 561938 561116 560720 561625 563254 564585 565880 568020 570947 573979 576781 578719 578301 574815 569642
57924 569642 564500 559283 553212 547157 542946 540949 540015 539260 538343 536634 533779 530591 527901 525281 522440
57909 522440 520895 522058 524274 524062 520282 515082 510843 508092 506448 505594 504949 503989 503132 502904 502271 499552
57893 499552 495152 491608 490413 490203 488630 484819 479629 474731 471897 471994 474094 476215 477299 477897 478987
57878 478987 480923 483511 486319 488996 491927 496231 502290 508716 513670 516681 518215 518367 517380 516701 517624
57863 517624 519126 518798 515864 511663 507322 502831 498476 495193 492881 490014 485694 480908 477185 475086
57849 475086 474493 475304 477275 479862 482549 484865 486326 487192 488797 491933 495267 496756 496346 495635 495166 494003
57833 494003 492133 491138 491817 492867 492769 491544 489945 488258 486629 485248 483542 480453 476161 472252 469464
57818 469464 466586 462436 457617 453351 449716 446084 442380 438926 435743 432717 429679 425941 420926 415873
57804 415873 413384 414305 416365 417126 416924 417497 419098 421005 424010 429993 438936 448316 455882 461554 466210
57789 466210 470162 473666 477704 483016 488768 493143 495097 494920 493246 490319 486361 482019 477801 473332
57775 473332 467743 460868 453625 447107 441767 437644 434762 432846 431170 429277 427477 426076 424671 423015
57761 423015 422106 423259 426090 428457 428567 426408 423008 419119 414929 410384 405501 400569 395888 390941 384392
57746 384392 375777 366794 359794 355279 352013 349247 347218 345530 342969 339559 337154 337023 338062 338385 337671
57731 337671 336948 336887 337271 337700 338127 339124 341843 346900 353035 357999 361265 364705 369949 376402 382685 388613
57715 388613 394519 399942 404553 409387 415401 421509 425889 428753 431892 435586 437974 437795 435907 433424
57701 433424 430064 425531 421239 419100 419029 418949 417237 414178 410880 407707 404390 401114 398577 397002 395832
57686 395832 394759 394387 395203 396411 396713 396027 395466 395673 396330 397449 399722 402957 405549 406649 407759 410651
57670 410651 414354 415938 414261 411456 410274 411177 412573 413014 412386 411457 410952 410987 411087 410753 410073 409606 409730
57653 409730 410347 411138 411659 411169 408927 404974 400353 396196 392663 389008 384565 379507 374623 370552 367415
57638 367415 365080 363525 362716 362299 361725 360702 359305 357744 356337 355570 355633 355755 354578 351587 347922 345402
57622 345402 344858 345653 346751 348053 350626 355613 363026 371983 382297 395262 412310 433405 457647
57609 457647 485027 516216 550458 584928 616701 644134 665668 678560 680331 671149 653687 630685
57597 630685 603477 572888 540733 509890 482813 459914 439628 420547 403361 389962 380699 373690
57585 373690 367179 361257 356508 352263 347533 342708 338869 335902 332840 329802 328036 327964 328509 328689 328729 329174
57569 329174 329896 330374 330270 329313 327284 324447 321476 318772 316385 314720 314480 315537 316432 315568 312719 309181
57553 309181 306698 306236 307311 308318 307872 305996 303796 302116 301021 300486 300785 301861 302890 302920 301698 299639
57537 299639 297281 294995 292959 291126 289292 287302 285094 282664 280254 278553 278285 279399 280866 281491 280885
57522 280885 279748 279176 279483 279592 277963 274396 270558 268296 267781 267825 267586 267135 266527 265368 263702 262631
57506 262631 263416 266039 268961 270387 269870 268752 268894 270960 274225 277949 282041 285989 288249 287883 286289
57491 286289 286056 288247 291900 295929 300035 303526 304829 303163 299873 297288 296608 297355 298274 298285 297042 295135
57475 295135 293471 292240 290958 289700 289451 290688 292284 292642 291624 290694 291268 293512 296716 300277 304025
57460 304025 307803 311155 313782 316363 320422 326909 335179 343841 352312 360918 369835 378825 387687 395849
57446 395849 401718 403967 403773 404213 406688 409371 410130 409629 410127 412221 414424 415445 415289 414283 412553 410670
57430 410670 409546 409386 409566 409762 410378 411797 413967 416819 420235 423584 426150 428195 430636 433503 435729
57415 435729 436908 438239 441038 445067 449114 452666 456207 460207 464567 468802 472190 474031 474529 475256 477852
57400 477852 482136 486229 488880 490998 494336 499148 504005 507938 511826 516955 522693 526693 527796 527882 529994
57385 529994 534980 540916 545778 549604 553618 558310 563298 568452 573983 579582 584580 589141 594359 600763
57371 600763 607395 612872 616789 619723 622533 626240 631860 639332 646892 652593 656511 660560 665980 671999
57357 671999 677293 681875 686824 692837 699810 707424 715309 722756 729024 734080 738608 743334 748647 754766
57343 754766 761731 769209 776692 783879 790630 796778 802476 808551 815810 823983 832020 839579 847582 856978
57329 856978 867556 878446 889314 900381 911466 921727 930645 938861 947667 957681 968321 978623
57317 978623 988261 997539 1006703 1015778 1025006 1034637 1044081 1052022 1058007 1063416 1070220 1079143 1089596 1100849
57303 1100849 1112331 1123135 1132458 1140652 1148918 1157880 1167315 1177222 1188043 1199535 1210528 1220337 1229566
57290 1229566 1239107 1249270 1260337 1272869 1286593 1299902 1311477 1321763 1331884 1341868 1351183 1360644
57278 1360644 1372276 1386991 1403359 1419057 1432904 1445356 1457656 1470837 1485145 1500104 1515166
57267 1515166 1530209 1545268 1560033 1574001 1586930 1598809 1609687 1620029 1630904 1643152 1656501
57256 1656501 1670110 1683830 1698076 1712497 1725813 1737589 1749492 1763946 1781591 1800641 1818858
57245 1818858 1835772 1852684 1870781 1889717 1908169 1925307 1941351 1957011 1972975 1989774 2007351
57234 2007351 2024640 2040325 2054411 2068479 2083990 2100905 2118355 2136024 2154230 2173047 2192004
57223 2192004 2210505 2228245 2245607 2263904 2284566 2307650 2331784 2356052 2381076 2407542 2434674
57212 2434674 2461314 2487648 2514464 2541277 2566855 2591383 2616461 2642835 2669700 2696443 2723520
57201 2723520 2751129 2778547 2805586 2833333 2862444 2891806 2920031 2947442 2975297 3003572 3030779
57190 3030779 3055940 3079740 3103616 3128299 3153395 3178030 3201856 3225588 3250310 3276117 3301763
57179 3301763 3325884 3348164 3369041 3388871 3407930 3426728 3445574 3463974 3481177 3497332 3513616
57168 3513616 3531153 3550199 3570383 3591459 3613724 3637888 3664461 3693164 3723156 3754137 3787034
57157 3787034 3823130 3862462 3903370 3943773 3982721 4020576 4057933 4094675 4130182 4164070 4196322
57146 4196322 4226822 4255422 4282652 4309735 4337330 4364643 4390387 4414152 4436071 4455584 4471857
57135 4471857 4485570 4499055 4514010 4529945 4545560 4560893 4577211 4595268 4614714 4635284 4657773
57124 4657773 4683440 4712560 4743678 4774231 4802121 4826893 4849386 4870258 4889055 4904632 4915916
57113 4915916 4921989 4921835 4914603 4900203 4879497 4853855 4824372 4791148 4753194 4709394 4659954 4607035
57101 4607035 4553958 4503701 4457888 4416907 4380918 4350611 4326583 4307889 4291980 4276797 4262693
57090 4262693 4251785 4245887 4245627 4250761 4259903 4269955 4277128 4279124 4275817 4267838 4255247 4237689 4215022
57077 4215022 4187483 4155475 4118819 4075798 4023781 3961938 3892655 3818992 3741499 3659113 3572178
57066 3572178 3481991 3387759 3286923 3178849 3065265 2946341 2819401 2682838 2538289 2386874
57056 2386874 2225831 2051227 1861979 1658819 1441189 1207894 959619 698499 426393
57047 426393 145829 -138359 -420146 -693389 -949412 -1174412 -1351100 -1461520 -1487133 -1409521
57037 -1409521 -1214937 -897467 -456674 103805 771558 1522021 2322676 3136095 3916273
57028 3916273 4609940 5162337 5491533 5413900 4593008 2625653 -730814 -5351069 -10735307
57019 -10735307 -16219552 -21246846 -25530007 -29049840 -31938462 -34335418 -36295675 -37788748
57011 -37788748 -38762802 -39202466 -39132242 -38582175 -37562948 -36071221 -34111038 -31712811 -28943113
57002 -28943113 -25902951 -22713749 -19497644 -16362239 -13392567 -10646813 -8155553 -5927241
56994 -5927241 -3957317 -2234142 -740063 547795 1654377 2603359 3415803 4109982 4701730
56985 4701730 5205425 5634548 6000757 6313223 6580228 6811095 7015292 7200026 7370260
56976 7370260 7531034 7688095 7845768 8005433 8166082 8324250 8472003 8596474 8684109 8727176
56966 8727176 8727228 8693369 8637530 8569964 8497041 8421770 8345806 8270609 8196660 8122320 8044422 7960442
56954 7960442 7869984 7774191 7674156 7570349 7463424 7354861 7246275 7138300 7030719 6923489
56944 6923489 6816839 6710079 6601141 6487874 6369411 6245873 6117478 5984730 5848811
56935 5848811 5710445 5568367 5419984 5263742 5099884 4928789 4749861 4562784 4368901
56926 4368901 4170489 3969484 3768047 3569825 3378914 3196994 3022275 2851911 2685184
56917 2685184 2524081 2371162 2227358 2091912 1964135 1844754 1735084 1635061 1542905 1457277
56907 1457277 1379126 1310502 1251850 1201494 1157646 1119710 1087345 1059635 1036144 1017793 1005341
56896 1005341 997214 989883 980368 967612 951578 932219 909762 885155 859543 833599 807785 782982
56884 782982 760367 740725 724121 710275 699185 691363 687416 687331 690435 696233 705022 717391 733392
56871 733392 752509 773830 795255 812863 822405 822023 812917 797276 776530 751919 725459 699210
56859 699210 674187 650899 630384 613639 600263 588568 576987 564744 551578 537826 524711
56848 524711 513522 504327 496099 488078 480280 472846 465857 459792 455070 451030 446546 442009 439335 439250
56834 439250 439787 438710 436621 436342 439678 446144 454632 464866 476884 490283 504463 518643 531098
56821 531098 539423 542579 542248 541244 540779 540001 538011 535327 533125 531945 531908 533794 539083 548753 562476
56806 562476 579208 598315 619950 644680 673102 705628 741967 780343 817384 849189 872770
56795 872770 886655 890599 885328 872692 855526 836730 818342 801506 787131 776141 769006 765428
56783 765428 764863 767418 774195 786732 806102 832378 864901 903011 946297 993911 1043714 1092421
56771 1092421 1136452 1172195 1195594 1202809 1192496 1167438 1133093 1094297 1053596 1012363 972338
56760 972338 935558 903478 876896 856418 842329 834081 830538 830986 835699 845433 860571 880689 904646
56747 904646 930836 957428 982412 1003362 1017243 1020954 1012763 993576 966558 935073 900966 865074
56735 865074 829010 795473 766362 741410 719489 700704 686177 675990 668669 663127 660206 661702
56723 661702 668345 679188 692442 706440 720027 732268 741609 745523 741804 730410 713283 692156
56711 692156 667601 640659 613953 589854 568242 547471 527162 508816 493834 482177 472918 464935
56699 464935 456996 448290 439151 430293 421290 410948 399480 389047 381510 376594 372868 369533 366438
56686 366438 363224 359531 355532 351393 346702 341391 336690 334010 333103 332458 331403 330543 330016 328704 325924
56671 325924 322810 321008 320559 320027 318358 315686 312530 309223 306256 304302 303510 303351 303364 303550 303809 303776 303546
56654 303546 303740 304173 303305 300034 295551 292283 291334 292130 294258 297869 302005 304365 303894 302354 302125 303369
56638 303369 304670 305694 307572 310926 315047 319155 323105 326595 328948 330276 331893 334859 338725 342266
56624 342266 344921 347034 349170 351810 355282 359318 362834 364722 365009 364930 365795 367943 370779 373583 376124
56609 376124 378588 381232 384341 388273 392996 397612 401039 403549 406991 412845 420515 428250 435374 442673
56595 442673 450738 459015 466756 474072 481553 489221 496220 501368 503998 504491 503855 502452 499384 493679 485829
56580 485829 477472 469671 462301 455030 447981 441287 434849 428795 423373 418113 411937 404564 397163 391110
56566 391110 386668 383278 380514 378170 375944 373739 372060 371552 372198 373290 374178 374768 375263 375542 374993 373280
56550 373280 371248 370435 371274 372387 372322 371342 370602 370276 369809 369536 370343 371753 372180 371448 371235 372311 373051 371707
56532 371707 368705 365522 362656 360169 359067 360345 363172 365573 366690 367190 367755 368380 368917 369172 368574 366794
56516 366794 364702 363811 364729 366740 368732 369910 369981 369454 369599 371406 374793 379279 384876 391603 398753 405671
56500 405671 412792 420908 429670 437800 444436 449377 452423 453613 453788 453857 453779 453327 453381 455001 457379 458249
56484 458249 456502 453134 449548 446245 443382 441205 439512 437841 436520 436342 436866 436357 433963 430799 428297
56469 428297 426639 425358 424253 422854 420205 416258 412647 410978 410996 411322 411225 410639 409071 405865 401396 397022
56453 397022 393808 391962 391265 391279 391229 390445 388944 387119 385074 382836 380980 380238 380542 381098 381391 381501 381456
56436 381456 381043 380487 380615 381873 383549 384511 384559 384569 385212 385868 385218 382938 380422 379440 380138 380787 379629 376683
56418 376683 373546 371739 371577 372500 374030 376158 378878 381627 383513 384213 384380 384822 385416 385260 383901 382136
56402 382136 381462 382890 386144 389706 391837 392076 391726 392402 394163 395731 396482 397216 398571 399659 399185 397387
56386 397387 395836 395450 395643 395579 395379 395588 396051 396111 395801 396021 397167 398158 397612 395788 394402 394251 394029 392371
56368 392371 390274 390161 392661 395741 397308 397428 397348 397537 397780 398432 400223 403063 406165 409351 413144 417328
56352 417328 420388 420961 419231 416421 413451 410768 409099 409387 411679 414645 416591 416823 415824 414467 413525
56337 413525 413725 415475 418191 420437 421291 421350 421917 423350 424790 425362 424931 423611 421365 418630 416647 416371
56321 416371 417227 417680 417023 415992 415461 415184 414268 412553 410965 410602 412010 415401 420963 428386 436287 442765
56305 442765 446809 448992 450673 452754 455286 457923 460394 462602 464534 466112 467119 467439 467519 468373 470917
56290 470917 475233 480516 485510 488935 489913 488495 485806 483417 482487 483473 486428 491248 497573 504571 510971
56275 510971 515581 518163 519826 522203 526121 531223 536731 541957 546122 548558 549626 550895 553868 558847
56261 558847 565195 571990 577956 581711 583033 583445 584647 586723 588663 590221 592182 595093 598794 603078
56247 603078 607675 611660 614081 615532 617999 622759 629324 636841 645430 655323 665478 674180 680877 686678
56233 686678 692997 700267 708050 715985 724312 733587 744113 755678 767693 779446 790522 801376 813319
56220 813319 827304 842753 858374 874175 891589 911210 931722 952068 973448 997719 1024621
56209 1024621 1052333 1080395 1110307 1143232 1178785 1216389 1256216 1298301 1342228 1388486 1438978
56198 1438978 1495247 1557005 1623218 1693989 1770541 1853756 1943371 2038535 2138971 2245849 2361447
56187 2361447 2487440 2623558 2768276 2920233 3077896 3238257 3397515 3553231 3704352
56178 3704352 3848742 3982264 4100967 4202700 4285644 4346819 4383640 4396077 4385785 4353554
56168 4353554 4299208 4224023 4131919 4027618 3914023 3791750 3661046 3523954 3384376 3245834
56158 3245834 3109534 2975168 2843366 2716418 2596590 2484637 2380063 2281805 2188399 2098674
56148 2098674 2012972 1932937 1859548 1792112 1729557 1671766 1618945 1570533 1525617 1483919 1445722
56137 1445722 1411237 1380439 1353013 1328115 1304768 1282841 1262990 1245429 1229505 1214673 1200922
56126 1200922 1188016 1175527 1164136 1155592 1150531 1147357 1144121 1140548 1137495 1135503 1134837 1135866 1138234
56113 1138234 1140545 1142070 1143975 1147593 1152262 1156309 1159731 1164379 1171607 1180975 1191316 1201991 1212967
56100 1212967 1224552 1237307 1251649 1267474 1284554 1303118 1323496 1345287 1367561 1390061 1414027
56089 1414027 1441585 1474245 1511873 1553443 1599005 1650347 1708986 1774276 1844850 1921501 2006687
56078 2006687 2100912 2201287 2304081 2406722 2506406 2598852 2680400 2750626 2811796 2866681 2917848
56067 2917848 2967595 3016574 3062724 3102710 3134279 3156720 3170085 3175030 3172755 3163898 3147703 3122685
56055 3122685 3087348 3040027 2979427 2906414 2824346 2736837 2646238 2554928 2466541 2384568 2310672
56044 2310672 2245280 2188521 2139564 2096501 2058304 2025640 1998587 1975244 1954288 1937344 1926669
56033 1926669 1921648 1919723 1919791 1922365 1927050 1932307 1937710 1944471 1953592 1964975 1978289 1993318 2009477
56020 2009477 2026177 2043592 2062141 2081586 2101429 2121558 2141761 2161579 2181640 2203996 2229847
56009 2229847 2257898 2286222 2314663 2344068 2374290 2404543 2434833 2465671 2497232 2529843 2564018
55998 2564018 2598864 2632198 2663806 2696805 2733887 2773859 2813923 2853662 2894482 2936685 2979800
55987 2979800 3024590 3072189 3122130 3173443 3226634 3282417 3339807 3397781 3457402 3520021 3585002
55976 3585002 3651857 3722905 3800639 3883887 3969775 4058204 4151081 4248381 4348649 4452617 4562801
55965 4562801 4679926 4802813 4931105 5065130 5203999 5347098 5496580 5655139 5822348
55956 5822348 5996577 6179359 6374190 6581994 6801512 7033307 7279462 7540080 7813753
55947 7813753 8100705 8402008 8717120 9046188 9393253 9762675 10153719 10563223 10992141
55938 10992141 11444534 11921704 12423099 12951983 13514440 14113457 14749667 15427060 16152021
55929 16152021 16927566 17754840 18639519 19589913 20609100 21695845 22853115 24088751 25407938
55920 25407938 26812398 28307154 29900844 31599491 33407771 35336616 37401875 39615822
55912 39615822 41988500 44537416 47287666 50263984 53493158 57013831 60873034 65113848
55904 65113848 69779454 74931091 80652139 87037887 94197135 102262939 111383889 121703382
55896 121703382 133365217 146541865 161444213 178315255 197444669 219179541 243864977
55889 243864977 271730752 302779959 336587134 371850229 405892203 434745155 454232875
55882 454232875 461568294 456374130 440480834 416864187 388567176 358101585 327285926
55875 327285926 297305913 268872851 242400852 218122914 196132536 176408005 158850473
55868 158850473 143312122 129605240 117518917 106849494 97417255 89061723 81639354
55861 81639354 75031110 69140873 63881890 59172103 54942212 51136872 47704818 44595808
55853 44595808 41768218 39190367 36831844 34661134 32653504 30793676 29068468 27463116
55845 27463116 25966226 24571539 23272407 22059543 20925288 19864897 18872670 17941797
55837 17941797 17068443 16250757 15483482 14758827 14073218 13428065 12823438 12256148 11724271
55828 11724271 11227958 10764697 10328717 9915971 9525030 9152644 8793705 8446796 8115111
55819 8115111 7800706 7502070 7217866 6948242 6691480 6444102 6205561 5978346 5762291
55810 5762291 5553298 5348975 5150933 4959994 4773835 4591496 4415963 4249914 4092496
55801 4092496 3942445 3800762 3667879 3541320 3418618 3299953 3185883 3075084 2966270
55792 2966270 2860022 2756928 2656246 2557940 2463684 2374370 2288972 2207239 2130888 2060508 1993855
55781 1993855 1929170 1867985 1812594 1762450 1714931 1668259 1622230 1577441 1535035 1495861 1458950
55770 1458950 1422332 1386163 1353374 1326296 1304157 1284470 1264984 1243667 1219071 1192066 1165547
55759 1165547 1141315 1118619 1096331 1074662 1053988 1033953 1014842 998060 984232 972295 961174
55748 961174 950814 941083 931548 922853 916251 911110 905142 897833 891326 886919 883151 878685 874642 872424
55734 872424 871345 870340 870260 872389 875978 878984 880284 879752 877324 873295 868453 862691 854580 843483 830900
55719 830900 818465 805676 790858 773504 754669 736020 719423 706498 697574 691687 687981 686064
55707 686064 684714 681784 676087 668108 658487 647491 636370 627146 620028 612916 604556 596292 589603 583846
55693 583846 577995 572739 569036 565938 561553 555096 546766 536961 527013 519204 514404 510867 506729 502335
55679 502335 498656 495047 490477 485580 481339 476809 470413 462788 456226 451679 448137 444560 440581 435576
55665 435576 428873 420954 413119 405949 399213 393010 387892 384076 381471 380093 379596 378982 377830 377222 378448
55650 378448 381402 385191 389444 393740 396558 396374 393508 389656 385891 382101 377816 372494 365502 356987
55636 356987 348348 340938 334877 329897 326357 324260 322323 319479 316378 313980 311625 308343 305254 304597
55622 304597 306651 309500 311711 313526 315505 317578 319467 320659 320307 318516 317275 318272 320133 319844 316805
55607 316805 313370 311296 309938 308499 307763 308514 310067 311606 313559 316412 319291 320971 321412 321277 320754
55592 320754 319864 319270 319698 320914 322008 322372 321838 320475 318954 318594 320129 322609 324141 323578 321018 316971
55576 316971 311790 305938 300232 295434 291594 287856 282981 276346 268566 261032 254817 250117 246603 243907
55562 243907 241658 239433 237054 234993 234302 235894 239529 243475 245579 245013 242820 240596 238933 237388 235518
55547 235518 233304 230730 227545 223617 219295 215386 212713 211391 210433 208561 205740 203489 203192 204396 205264
55532 205264 204483 202285 199761 197614 195659 193428 191227 190295 191371 193317 194171 193701 193833 196052 199576
55517 199576 202857 205817 209493 214349 220188 227079 235033 243193 250699 257925 265521 272474 276675 277466
55503 277466 276252 274459 272277 269632 266835 263590 258652 251443 243175 235548 228986 222943 217334 212744
55489 212744 209541 207549 206459 205871 204953 202780 199414 196253 194788 194874 194620 192386 188777 186143 186018 187629
55473 187629 189172 189939 190599 191778 193131 193822 193496 192804 193060 195045 197896 199713 199533 198191 196855 195526
55457 195526 193660 191447 189438 187495 185294 183509 183238 184300 185216 184899 183440 181276 178667 176175 174580
55442 174580 173890 173183 171756 169873 168224 167166 166588 165917 164252 161065 156837 152537 148661 145387 143276
55427 143276 142799 143354 143806 144076 145139 147380 150042 152469 154728 156658 157399 156492 154545 152291 149816 147261
55411 147261 145422 144858 145087 145414 146074 147842 150792 154055 156635 158102 158700 159047 159503 159658 158859 157323
55395 157323 156176 156062 156228 155363 152925 149365 145619 142810 141969 143336 145906 148056 148763 148227 147450 147232
55379 147232 147404 147103 145929 144565 143861 143550 142559 140514 138331 137173 137357 138352 139468 140491 141985 144747
55363 144747 148539 151810 153418 154265 156212 159540 162485 163232 161329 157346 152541 148950 148176 149438 150104
55348 150104 148840 147043 146555 147266 147942 148148 148065 147355 145688 143934 143499 144624 146347 147947 149499 151194
55332 151194 153011 154997 157110 158768 159219 158331 156581 154463 152371 150738 149725 149043 148554 148575 149055 149048 147910
55315 147910 146512 146158 146585 146223 144449 142363 141089 140466 139885 139355 138997 138283 136785 135155 134349 134027 132789
55298 132789 130287 128214 128544 131229 134341 136170 136452 135640 134086 132385 131621 132360 133807 134774 135118 135414
55282 135414 135565 134976 134088 134410 136475 138800 139646 139147 138997 140366 142732 144496 144413 142719 141088 141108 142625
55265 142625 144027 144136 143117 141578 139900 138852 139623 142300 145195 146632 146742 146585 146356 145635 144853 145048
55249 145048 146276 147448 147800 147557 147141 146688 146366 146265 145822 144283 141944 140088 139490 139727 140140 140629 141179
55232 141179 141494 141652 142481 144589 147414 149773 151087 151609 151725 151606 151407 151255 150861 149614 147391 145105
55216 145105 144085 144776 146293 147428 147839 147944 147907 147424 146560 146073 146525 147580 148630 149645 150869 152077
55200 152077 152696 152478 151519 149917 147965 146416 145798 145585 144741 143101 141566 140913 141094 141833 143248 145525
55184 145525 148380 151144 153120 153817 153203 151874 150595 149528 148273 146800 145853 146076 147066 147719 147465 146865
55168 146865 147053 148750 151677 154529 155496 153375 148786 144209 142065 142347 142621 140892 138035 136632 137792
55153 137792 140225 142409 144290 146406 148652 150910 153898 158177 162876 166558 168867 170219 170360 168668
55139 168668 165774 163413 162365 161728 160569 159162 158122 157401 156862 156872 157423 157317 155210 151297 147261 144763
55123 144763 144535 146704 151016 156418 160929 162571 160719 156641 152715 150872 151491 153538 155610 156892 157413
55108 157413 157702 158171 158670 158743 158423 158556 159996 162636 165500 167598 168379 167629 165526 162795 160334 158535
55092 158535 157253 156340 155898 156090 157017 158627 160418 161565 161829 161974 162589 162742 160719 156084 150274 145191
55076 145191 142028 141334 142978 145551 146828 145608 142711 139826 137953 137290 137872 139605 142076 144786 147240
55061 147240 148593 147979 145698 143565 143361 145214 147895 150194 151560 151998 152097 152849 154747 157186 159230 160656
55045 160656 161845 163047 164374 166077 168151 169944 170868 171271 171919 172895 173783 174656 175906 177140 177403 176739
55029 176739 176518 177644 179229 179639 178400 176483 175109 174875 175719 177120 178255 178399 177306 175113 172177
55014 172177 169209 167229 166839 167639 168761 169945 171594 173726 175460 175918 175261 174482 174359 175008 176159 177326
54998 177326 177728 176711 174579 172664 172260 173635 176144 178873 180932 181586 180713 179021 177419 176224 175198
54983 175198 174107 172838 171295 169632 168402 167924 167735 167260 166768 166911 167507 167734 167475 167425 167688 167404 166202
54966 166202 164945 164400 164114 163419 162666 162557 163021 163766 165261 167914 170708 172010 171688 171218 171674 172700 173531
54949 173531 173994 174281 174784 176364 179655 183661 186137 185987 184435 183202 182515 181797 181382 182127 183648 184360
54933 184360 183504 182225 182250 184120 187021 189777 191596 192177 191629 190351 188936 188063 188228 189294 190395 190617
54917 190617 189812 188534 187325 186421 186095 186717 188287 190350 192574 194986 197351 198846 199009 198749 199603 201839
54901 201839 203874 203801 201143 196949 192833 190346 190687 193978 198728 202631 204170 203216 200269 195867 190956
54886 190956 187065 185409 186034 188191 191224 194640 197787 200137 201776 202979 203516 203051 202073 201531 201442 200820
54870 200820 199401 198518 199565 202225 204976 206869 208045 208894 209668 210788 212659 215200 218330 222795 229349
54855 229349 236930 242946 246194 248585 252981 259907 267382 273435 277481 279320 278330 274372 268627 262712
54841 262712 257316 252189 247058 242048 237384 233172 229422 226023 222881 220303 218923 218942 219665 220132 219998
54826 219998 219493 218890 218454 218546 219108 219286 218411 217358 218111 221569 226344 230076 231567 231434 231228 232405 235796
54809 235796 241474 248998 257815 267102 275168 279814 280023 277063 273279 269861 266356 262186 257694 253364
54795 253364 248775 243189 236994 231776 228704 227178 225363 221843 216593 210600 205075 201030 199046 198930
54781 198930 199649 199867 198609 195522 190924 185946 182157 180361 179785 179140 178439 179018 181527 184720 186830 187504
54765 187504 187720 188146 188471 188248 187649 187166 186989 186919 186686 186259 185933 185989 186250 186276 186198 186799 188251 189299 188527
54746 188527 186219 184155 183618 184564 186743 190446 195561 200818 204754 206988 207893 207587 205992 203570 201170
54731 201170 199240 197874 197511 198838 201816 205345 208094 209360 209161 208050 207031 207119 208629 211054 213765
54716 213765 216486 218947 220629 221326 221685 222642 224395 226412 228526 231464 236006 241891 248031 253658 258889
54701 258889 264147 269482 274770 280164 285824 291257 295425 297670 298225 297582 295713 292266 287443 282252 277820
54686 277820 274496 271689 268525 264690 260615 256660 252250 246214 238225 229607 222442 217997 216196 216252 217344
54671 217344 218845 220405 221904 223158 223863 224112 224668 226222 228616 231399 234868 239666 245379 250544 254334
54656 254334 257352 260398 263447 266548 270757 277028 284450 290475 292762 290338 283637 274540 265972 260103
54642 260103 256540 253129 248524 243108 237488 231559 225636 221172 219288 219298 219706 220051 220693 221225 220520 218509
54626 218509 216738 216585 217661 218580 218753 218671 218613 217925 215933 213122 210809 209736 209374 208798 207765 206622 205632
54609 205632 205033 205448 207317 209773 211047 210493 209516 209804 211174 211956 211226 209782 208872 208725 208651 208100 207233
54592 207233 206510 205917 204799 202730 200538 199869 201282 203203 203447 201616 199353 198287 198437 198810 198872 198905 199167
54575 199167 199316 198894 198224 198287 199326 199909 198284 194804 192030 191910 193782 195953 198073 200554 202467 202154
54559 202154 200012 198756 200175 203052 205033 205279 204415 203145 202165 202485 204428 206742 207911 208027 208367 209426
54543 209426 210479 210967 211165 211410 211564 211484 211362 211358 211288 210702 209034 206017 202431 199940 199407 199793 199626 199179
54525 199179 200009 202546 205509 207822 209595 210787 210405 208121 205623 205093 206787 208998 210054 209557 208109
54510 208109 206786 206693 208098 209965 211014 211192 211449 212179 212720 212533 212067 212069 212542 212776 212134 210575 208669 207317
54492 207317 207215 208409 210444 212915 215616 218262 220550 222507 224296 225646 226106 226045 226586 228081 229429
54477 229429 229696 229720 230971 233197 234578 234390 234081 235016 236275 235808 233133 229747 227129 225478 224501 224474 225928
54460 225928 228635 231199 231639 228689 223101 217573 214710 214862 216289 217225 217115 216083 214395 212849 212645
54445 212645 214127 216294 218169 219907 221846 223208 222914 221225 219430 218117 216993 216445 217850 221618 225914
54430 225914 228282 228200 227272 227050 227293 226470 223582 219289 215386 213347 213442 215099 217759 221093 224701 228089
54414 228089 231036 233646 235964 237781 238905 239552 240454 242513 245944 249570 251458 250756 248590 246696 245677
54399 245677 245250 245530 246716 247728 246749 243606 240375 239004 239376 240351 241552 243068 244374 244880 245012 245503
54383 245503 245949 245369 244017 243266 243490 243382 241876 239716 238467 238652 239561 240384 240827 240820 240258 239167 238003
54366 238003 237772 239568 243492 247866 250146 249060 245768 242816 242213 244409 248343 251996 253425 252089 249210
54351 249210 246534 244830 243834 243367 243901 245921 249120 252346 254253 254138 252553 251143 251537 254041 257483
54336 257483 260436 262540 264510 266951 269525 271493 272831 274219 275809 276655 275932 274315 273296 273211 272854
54321 272854 271207 268664 266081 263505 260660 258124 257091 258095 260575 263445 265497 265721 264237 262845
54307 262845 263628 266799 270660 273690 275795 277462 278854 280312 282688 286324 290270 293307 295323 297035
54293 297035 298808 300454 301726 302202 301049 297868 293632 289866 286888 283756 279994 276381 273642 271287
54279 271287 268447 265346 263148 262460 262606 262462 261589 260333 259060 257712 256259 255289 255607 257153 258860 259832
54263 259832 260167 260211 259678 258244 256579 255834 256262 257258 258557 260171 261082 259507 255171 250262 247219 246329
54247 246329 246301 246388 246800 247510 247976 248078 248327 248926 249344 249027 248045 246962 246477 247105 248684 250158 250367 249077
54229 249077 246895 244403 242076 240876 241853 244759 247800 249432 249945 250738 252419 254320 255779 257110 258920
54214 258920 260877 261744 260761 258633 256872 256304 256641 257400 258660 260594 262770 264508 265714 266812 267960
54199 267960 268907 269727 271146 273855 277619 281235 283249 282863 280497 277520 275182 273735 272733 272007 271892
54184 271892 272440 272932 272458 270867 268916 267520 266882 266354 265181 263409 261844 261034 260672 260293 260204 261173 263386
54167 263386 266238 269064 271538 273401 274333 274219 273129 271140 268635 266499 265186 263606 260016 254501 249658
54152 249658 248042 249387 251169 251592 251154 251295 252388 253610 254349 255043 256381 258137 259311 259425 259061 258788
54136 258788 258198 256747 255207 255125 256643 257850 257028 254967 254159 255784 258180 258635 256339 253166 251494 251798
54120 251798 252917 254366 257154 261720 266228 268320 268070 267706 268415 269023 268238 266590 265215 264005 262242
54105 262242 260236 259016 258805 259032 259696 261511 264602 267868 269908 270092 268676 266341 263708 261070 258691
54090 258691 257387 258191 260910 263605 264305 262944 260983 259539 258816 258999 260447 262742 264514 264707 263522
54075 263522 261936 260815 260628 261368 262410 262914 262740 262769 264086 266923 270344 272716 272680 270145 266392 262969
54059 262969 260628 259560 260116 262488 265857 268797 270654 271880 273004 274092 275346 277341 280196 283159
54045 283159 285361 286490 286560 285833 285283 286266 288961 291849 293474 294169 295145 296394 296675 295563 294408 294858
54029 294858 297238 300829 305082 309839 314725 319048 322435 325166 327799 330757 334320 338667 343653 348667
54015 348667 352923 355759 356657 355301 351984 347661 343118 338266 332792 327378 323419 321380 320181 318573
54001 318573 316394 314101 311912 310054 309070 308987 308948 308674 309650 313377 318829 323253 325605 327539 330572 333919
53985 333919 336092 337430 339693 343791 349043 354402 359509 364762 371085 379435 389825 400883 410780 418543
53971 418543 424274 428692 432974 438398 445226 452119 457496 461394 465232 469799 474311 477535 478944 478354
53957 478354 475253 469419 461999 455101 449877 445303 439390 431584 423504 417056 412312 407883 402991 398183
53943 398183 393894 389403 383859 377525 371259 365347 359788 355304 352902 352340 351974 350447 348004 345946 345314
53928 345314 346292 348273 350073 350429 348788 345682 342235 339312 337128 335456 334104 333207 333019 333382 333654 333349
53912 333349 332684 332217 332138 332269 332634 333683 335825 338901 342051 344072 344272 343316 343042 345098 349713 355803
53896 355803 361780 366127 368018 368223 368968 371998 376832 381629 385529 389289 393839 399310 405625 412991 421468
53881 421468 430908 441581 453996 467738 481323 493475 503513 510166 511602 507898 502337 498572 496961
53868 496961 495113 491725 488188 486336 486341 487605 490326 494961 500811 506333 510828 515106 520527 527879 537098
53853 537098 547424 557532 565920 571639 574942 577137 579504 582003 583202 581937 579070 577001 577077 577913
53839 577913 576883 573075 568107 563913 560397 555777 548896 540462 531956 523981 516208 508446 500959 493656
53825 493656 485899 477574 469689 463137 457285 450695 443116 435811 429818 424872 420472 416948 414661 412786
53811 412786 409979 406058 402099 398899 396117 393029 389376 385262 380912 376860 373806 371807 370039 367767
53797 367767 365252 363229 361785 360248 358078 355325 352198 348675 344823 341259 338894 338129 338443 338905 339049
53782 339049 339135 339594 340513 341778 343342 344966 345994 345968 345422 345449 346378 347490 348157 348621 349362 350456 351969
53765 351969 354263 357176 359513 360246 359899 359864 360623 361601 362634 364487 367632 371382 374562 376400 376605 375433
53749 375433 374049 374083 376270 379982 384388 389367 394871 400222 404850 409209 414159 419770 425452 430966 436530
53734 436530 442143 447562 452880 458317 463422 467166 468971 469160 468416 467361 466690 466951 467855 468282 467307 464995
53718 464995 462035 458895 455380 450849 445009 438784 433922 430913 427600 421078 411251 401311 394258 390108
53704 390108 387258 385189 384252 383651 381751 378470 375627 374338 373532 371835 369601 367830 366013 362624 357584
53689 357584 352869 350475 350748 352886 356026 359318 361755 362819 363053 363435 364385 365655 366908 367951 368705
53674 368705 369401 370575 372329 373948 374937 376244 379495 384791 390080 393237 394162 394274 394595 395244 396590 399708
53658 399708 405142 411766 417495 421056 422802 424012 425905 429235 434166 439990 445169 448344 449566 450329
53644 450329 452170 455426 459480 463839 468539 473672 478990 484039 488387 491788 494442 496959 499581 501553
53630 501553 501881 500795 499749 499720 500198 500253 499881 499586 499201 498076 496170 494037 491670 488286 483596 478704
53614 478704 475322 474317 475154 476433 476869 476190 475351 475623 477295 479470 481091 481749 481421 480099 478159 476631
53598 476631 476350 476930 477141 476410 475552 475829 477621 480213 482664 484656 486614 489167 492417 495618 497755 498677
53582 498677 499474 501281 503735 505248 505157 505077 507455 513013 520275 527483 534066 540114 545434 549855 553834
53567 553834 557952 562174 566363 571209 577687 585587 593472 600277 606293 612308 618511 624714 631150 638442
53553 638442 646895 656117 665223 673203 679314 683476 686271 688510 690844 693733 697355 701316 704665 706487
53539 706487 706453 704862 702483 700413 699622 700197 701190 701506 700803 699356 697367 694907 692476 691009 690959 691623 691783
53522 691783 690989 689797 688555 686420 682248 676378 670718 666662 663611 660250 656751 654657 654694 655835 656832
53507 656832 657703 659099 660972 662677 663972 665202 666653 668313 670144 672081 673917 675682 678009 681559
53493 681559 686063 690386 693592 695598 696872 698072 700161 704238 710701 718722 727045 735419 744855 756190
53479 756190 768526 779688 788540 796549 806555 820095 836480 854424 873655 894496 916582 938936
53467 938936 961116 983643 1007329 1032666 1059781 1088306 1117279 1145815 1174088 1203227 1234053
53456 1234053 1266413 1299885 1334610 1370971 1408868 1447883 1487992 1529516 1572260 1615163 1657160
53445 1657160 1698203 1739021 1779803 1819521 1856910 1892058 1926573 1961951 1998059 2033460 2066936
53434 2066936 2098270 2127792 2155836 2182841 2209470 2236218 2263150 2290213 2317514 2344893 2371552
53423 2371552 2396674 2420407 2443662 2466709 2488413 2507064 2521622 2531892 2538138 2541231 2542698 2543370
53411 2543370 2541829 2535343 2523029 2507220 2490775 2473797 2454186 2430924 2405201 2378173 2349393 2318359
53399 2318359 2286317 2255131 2224876 2193954 2161565 2128913 2097550 2067291 2036514 2004455 1972682
53388 1972682 1943932 1919483 1898014 1877338 1856869 1837836 1821499 1808248 1798462 1792810 1790962 1791139
53376 1791139 1791977 1794009 1798324 1804564 1811688 1820149 1831643 1846704 1863985 1882145 1901130 1921321 1942749
53363 1942749 1965783 1991467 2020446 2052400 2087218 2125868 2169280 2216857 2266885 2318098 2370343
53352 2370343 2424182 2480457 2539877 2602434 2667300 2733684 2801627 2871885 2945327 3022440 3102746
53341 3102746 3184550 3266157 3347799 3431552 3518678 3607697 3695861 3782047 3867449 3953805 4041584
53330 4041584 4129601 4215682 4297862 4375414 4448519 4516961 4580052 4638212 4693281 4745985 4793944
53319 4793944 4833700 4864306 4887433 4904226 4913740 4914681 4907015 4891191 4866967 4833807 4791730 4741200
53307 4741200 4682810 4617414 4545874 4468437 4385092 4296797 4205400 4111964 4016247 3918580 3821309
53296 3821309 3727410 3638145 3552759 3469935 3388770 3308956 3231081 3156462 3085826 3018194 2951785
53285 2951785 2885915 2821415 2759491 2701007 2646775 2597440 2552595 2510551 2469557 2429222 2390734
53274 2390734 2355822 2325485 2299418 2276553 2256018 2237382 2220023 2202971 2185810 2169281 2154446
53263 2154446 2141511 2129936 2119279 2109323 2099848 2091187 2084685 2081447 2080581 2079891 2078800 2079596 2085006 2095077
53249 2095077 2107191 2118897 2130010 2142100 2156641 2174024 2194049 2216810 2242647 2271270 2301617
53238 2301617 2333069 2366402 2402715 2441567 2481124 2520288 2559730 2600297 2641250 2680815 2717929
53227 2717929 2752625 2784982 2814432 2840040 2860928 2876503 2886710 2891958 2892420 2887662 2877435 2862498
53215 2862498 2843968 2822023 2796071 2766247 2733846 2699826 2663504 2623323 2578721 2530896 2481881
53204 2481881 2433140 2384889 2336473 2287296 2237453 2187495 2137778 2088258 2038779 1989239 1939465
53193 1939465 1889374 1839297 1789798 1741103 1693102 1646037 1600691 1557625 1516691 1477599 1440502
53182 1440502 1405507 1371997 1339162 1307138 1277056 1249920 1225824 1204199 1184148 1164420 1143845
53171 1143845 1122442 1101675 1083007 1066236 1049785 1032592 1015164 998662 983421 968698 953531
53160 953531 937375 920119 902007 883633 865623 848101 830666 813043 795561 778848 763248
53149 763248 748721 735121 722296 709994 697984 686349 675379 665096 655036 644687 634027
53138 634027 623458 613198 602981 592580 582480 573587 566080 558979 551349 543624 536985 531490 525812
53125 525812 519187 512641 507481 503295 498587 493095 488187 484807 482120 478675 474159 469464 465554 462717
53111 462717 460519 458046 454543 450211 446193 443642 442986 443932 445495 446008 444123 440369 437064 436012 436778
53096 436778 437599 437243 435447 432445 429118 426978 426847 427759 428110 427555 426849 426222 425190 423861 423094 423216 423742
53079 423742 424508 425953 427931 429390 429671 429157 428360 427487 427258 428820 431945 434471 434506 432425 429837 427540
53063 427540 425563 424272 424026 424266 424320 424779 426707 429726 432310 433982 435762 438093 439689 439182 436993 434825
53047 434825 433812 433715 433552 432554 430751 428830 427300 425855 423942 421730 419869 418463 417080 415758 415001
53032 415001 414594 413491 411340 409200 408093 407679 407127 406529 406487 406742 406256 404536 402071 399510 397101 394950
53016 394950 393209 391864 390788 390103 390047 390408 390426 389491 387813 386353 386067 387059 388420 389110 389006 388726 388410
52999 388410 387437 385794 384956 386464 389859 392908 393878 392989 391628 390936 391317 392628 394336 395720 396180 395354
52983 395354 393095 389742 386336 384098 383463 383803 384074 383515 381997 380203 379418 380577 383429 386850 389743
52968 389743 391182 390242 386844 382751 380610 381547 384432 387724 390930 393789 395366 395186 394541 395347 397887
52953 397887 400669 402344 402821 402581 401958 401233 400546 399435 397202 394103 391589 390997 392393 394821 397125 398378
52937 398378 398218 397338 397225 398826 401580 404052 405376 405819 406163 406848 407630 407862 407220 406224 405864 406605 408005
52920 408005 409364 410421 411247 411956 412911 414800 417986 421921 425646 428763 431563 434354 437121 439738 441960
52905 441960 443195 442826 440991 438725 437145 436674 436984 437233 436330 433622 429751 426311 424092 421973 418302
52890 418302 413290 409205 407892 408720 409503 408983 407705 406602 405686 404555 403611 403907 405736 407929 408870 407973
52874 407973 405961 403966 402740 402561 403356 404600 405460 405448 404889 404448 404238 403707 402459 400795 399221 397789
52858 397789 396353 395328 395613 397583 400483 403062 404591 405072 404634 403071 400108 396088 392302 390356 390867
52843 390867 392819 394600 395661 396703 398111 399009 398395 396735 395614 396020 397587 399388 400714 401137 400644
52828 400644 399910 399772 400251 400675 400880 401529 402959 404541 405672 406611 407735 408646 408868 408917 409762 411443 413018
52811 413018 413775 413869 413897 414362 415388 416492 417059 417507 419286 422773 425964 426701 425723 425695 427196 427737 425442
52794 425442 421762 419283 418353 417444 415728 413589 411275 408854 407075 406479 405688 402406 396508 390678 387452
52779 387452 386893 387626 388707 389578 389460 388127 386480 385144 383078 378912 373340 368807 366750 366352 366311 366655
52763 366655 368098 370355 372012 371974 370599 369506 370421 373771 378004 380599 380265 378112 376362 376111 376837 377865
52747 377865 379483 382285 386060 389839 392712 393974 392798 388750 382968 378069 376089 376568 377186 376164 373619
52732 373619 370738 368372 366700 365612 364810 363776 362207 360444 359111 358391 357969 357603 357349 357245 357315 357864
52716 357864 359218 360939 361923 361774 361596 362708 364755 365764 364180 360364 356035 352811 351444 351872 353486
52701 353486 355597 357972 360785 363798 366001 366419 365171 363430 362530 363336 366008 369746 372983 374561 374846
52686 374846 375206 376436 378202 379952 381553 382902 383751 384406 385866 388669 392089 394970 396834 397627 397080
52671 397080 395278 393401 392699 392835 392342 390860 389811 390495 392507 394647 396488 398211 399474 399448 397938 395831
52655 395831 394327 393989 394321 393993 391897 388500 385820 385431 386698 387623 387260 386520 386554 387280 387894 388150 388495
52638 388495 389268 390358 391641 393274 395455 398052 400604 402673 404139 405056 405240 404263 402189 400130 399521
52623 399521 400642 402278 403087 402992 402895 403263 403423 402338 399873 397272 396353 397987 401152 403614 403720 401644
52607 401644 398920 397002 396347 396515 396855 397144 397749 399072 400853 402360 403367 404414 405738 406497 405806 404229
52591 404229 403415 404238 406099 408120 410143 412135 413419 413268 411946 410531 409881 410065 410541 410461 409227 407286
52575 407286 406172 407169 410098 413825 417598 421130 423759 424747 424620 425114 427156 429708 431337 432369 434546
52560 434546 438721 443636 447051 447615 445658 442686 440230 438805 437681 435749 432641 429082 426370 425596 426941
52545 426941 429309 430838 430246 427687 424223 420848 418322 417363 418095 419417 419842 419123 418446 418908 420543 422954
52529 422954 425978 429199 431641 432646 432646 432448 432215 431817 431674 432355 433512 434124 433843 433355 433328 433736 434410 435512
52511 435512 437042 438433 439110 439161 439029 438801 438229 437372 436840 437243 438419 439295 438686 436485 433928 432391 431959
52494 431959 431613 430680 429474 428348 426927 424862 422818 421876 422174 422867 423411 424054 424779 424589 422605 419572
52478 419572 417489 417528 418851 419819 419964 420252 421519 423315 424549 424794 424526 424406 424870 426225 428513 431088
52462 431088 432860 433173 432253 430774 429443 428977 429758 431201 432133 432367 433330 436377 440774 444215 445329 445059
52446 445059 445497 447980 452446 457927 463211 467363 470073 471560 472151 472052 471372 470008 467546 463752 459265
52431 459265 455348 452828 451582 451063 450692 449568 446673 442163 437962 436239 437208 439000 439712 439141 438614 439596
52415 439596 442475 446135 448676 449163 448864 450098 453486 456968 458247 457686 457833 460218 463719 466485 468431
52400 468431 470926 474560 478363 481238 483144 484526 485357 485388 484789 483855 482327 479680 475943 471639 467048
52385 467048 462211 457678 454388 452481 450863 448472 445510 442940 441135 439665 438192 436920 436122 435735 435496
52370 435496 434992 433497 430444 426625 424518 426470 432224 438734 442919 444438 445312 447078 449187 450453 451171
52355 451171 452808 455996 459918 463731 467553 471639 475633 479488 484524 492467 503390 515227 525388
52342 525388 532438 536355 537805 537445 535644 532611 528724 524488 520083 515352 510624 507083 505695 505982 506510
52327 506510 506453 506082 505883 506030 506737 508213 509969 510890 510463 509428 508987 509879 512363 516309 520962 525403 529792
52310 529792 535430 542961 551267 558971 566264 574104 582091 588619 593168 597058 601506 605987 609080 610056
52296 610056 608978 606151 602497 600010 600623 604294 608897 612373 614709 617650 622738 629937 638063 646198
52282 646198 654421 663273 672975 683548 695395 709053 724183 739455 753872 767863 782619 798716
52270 798716 815966 834411 854616 876769 900194 924153 948752 974620 1001956 1030395 1059665
52259 1059665 1089828 1120749 1151739 1182004 1211318 1239891 1267587 1293471 1316365 1335934 1353212
52248 1353212 1369962 1387318 1404937 1421392 1435413 1446810 1456269 1464392 1471089 1476005 1479389 1482166
52236 1482166 1484913 1487061 1487570 1486329 1484329 1482259 1479471 1474822 1468173 1460518 1452768 1445073 1437336 1429900
52222 1429900 1423586 1419368 1417916 1418942 1421191 1423893 1428264 1436557 1449167 1463791 1478289 1493446 1511578
52209 1511578 1532896 1554676 1574052 1590427 1604999 1619280 1634521 1651245 1668287 1683044 1693782
52198 1693782 1701402 1708096 1714608 1719768 1722610 1723950 1725480 1727826 1729902 1729986 1727254 1722394 1716791 1710984
52184 1710984 1703902 1693733 1679513 1661850 1642281 1622091 1601614 1580505 1558698 1537141 1517409
52173 1517409 1500450 1485914 1472737 1460093 1447662 1435471 1423927 1413693 1405131 1397903 1391378 1385240
52161 1385240 1379571 1374690 1371199 1369770 1370454 1372561 1375577 1379682 1384783 1389669 1393117 1395581 1398722 1403268
52147 1403268 1408360 1413066 1417438 1421658 1425213 1427720 1429920 1432907 1436629 1439898 1441949 1443515 1446170 1450723
52133 1450723 1456319 1461176 1464320 1466436 1468789 1471642 1474294 1476444 1478641 1481294 1484044 1486397 1488149 1488846
52119 1488846 1487600 1484058 1478903 1472837 1465698 1457196 1447826 1438256 1428497 1418725 1410423 1405363 1403435 1402730
52105 1402730 1402011 1402087 1404268 1408430 1413309 1418108 1423002 1428335 1434057 1439966 1446008 1452096 1457893 1463004 1467431
52090 1467431 1471791 1476945 1483259 1490247 1497005 1503001 1508479 1514280 1521303 1529816 1539055 1547793 1555693 1563960
52076 1563960 1574319 1587358 1602104 1617086 1631596 1646197 1662420 1681760 1704528 1729782 1756749
52065 1756749 1786010 1818715 1854815 1892762 1930911 1968557 2005740 2042864 2080536 2118860 2156560
52054 2156560 2191684 2223498 2252851 2280269 2304710 2324903 2340956 2353539 2362225 2365931 2364742 2360029
52042 2360029 2352804 2343137 2331315 2318379 2305076 2291298 2277105 2263336 2250374 2237134 2222417 2206996
52030 2206996 2193163 2181994 2171858 2160032 2145322 2128780 2112266 2096770 2082079 2067713 2054054
52019 2054054 2042635 2035279 2032948 2035352 2041541 2050612 2061889 2074817 2088937 2103843 2119029 2134015
52007 2134015 2148856 2164255 2180708 2197489 2212919 2225822 2236445 2245762 2254092 2260694 2264649 2265887
51995 2265887 2265255 2263580 2260742 2255838 2248353 2238860 2228142 2215893 2201012 2183289 2163921 2143876 2122429
51982 2122429 2098097 2070591 2041076 2010801 1980438 1950633 1922081 1894750 1867883 1841304 1816104
51971 1816104 1793574 1773853 1755979 1738818 1721626 1704239 1687279 1671806 1658188 1645464 1632150
51960 1632150 1617486 1601655 1585106 1568065 1550428 1531805 1512033 1491946 1473132 1456428 1441091
51949 1441091 1426066 1411451 1397789 1384283 1368989 1351010 1331586 1312639 1295017 1278490 1262569
51938 1262569 1246629 1229775 1211533 1192773 1175436 1161092 1149905 1140935 1133151 1125997 1119097 1111860
51926 1111860 1103800 1095202 1086917 1079259 1071516 1062911 1053581 1044093 1034454 1024274 1013506 1002097 989210
51913 989210 974003 957341 941636 928595 917976 908777 900514 892864 885371 878616 874816 875910 881301
51900 881301 888429 895381 902137 909678 918878 930005 942160 953062 960393 963618 963890 962243 958845 954015
51886 954015 948724 943490 937865 931881 927303 926321 929245 934404 940347 947424 957022 969844 985332 1002422
51872 1002422 1020380 1038814 1057131 1074261 1088989 1100471 1108364 1112580 1113201 1110728 1106257 1101208 1096762
51859 1096762 1093374 1090685 1087838 1083849 1077625 1067847 1053459 1034642 1013015 990318 967106 943292
51847 943292 919820 898971 882544 870208 860092 850767 842310 835698 831734 830560 831743 834543 838313
51834 838313 842852 848201 853760 857733 858036 854097 847405 839805 831600 822055 811513 801791 794144 787849
51820 787849 781563 775212 769632 765065 761323 759173 760258 765384 773638 783180 792222 799520 805062 810294
51806 810294 816600 823385 828582 831049 831204 829238 824369 816641 808094 801053 796128 792673 790218 788518
51792 788518 787113 785947 785765 786953 788690 790061 791129 791940 791429 788655 784253 779250 773247 765326 756107
51777 756107 747078 738496 729905 722270 717213 714052 710066 704365 699200 696494 695257 693816 692684 693250
51763 693250 694888 695335 693407 689861 686105 683294 682087 681869 680613 676991 672368 669446 669125 670003 670798
51748 670798 671693 673053 674283 674772 675068 676326 678951 682242 685039 686419 686144 684682 682623 679941 676117
51733 676117 671050 665570 660855 657460 654963 652518 649834 647571 646452 646103 645361 643938 642956 643302 644290
51718 644290 644893 645680 648262 652968 658198 662197 664539 665893 667435 670739 677098 686240 696393 706121
51704 706121 715561 725526 736201 747315 758913 771088 783091 793346 800300 803055 801511 796311 788398
51691 788398 778297 766100 752387 738607 725962 714258 702550 690815 680253 671886 665535 660565
51679 660565 657206 656574 659318 664639 670960 677494 684709 692974 701241 707738 711855 714508 716445 717132 715999
51664 715999 714037 713019 713177 712647 709485 703646 696664 690016 684250 679355 675278 671973 669272 666872 664440
51649 664440 661742 658805 655988 653849 652970 653882 656953 661993 667935 673202 676736 678753 680291 681987 683411
51634 683411 683687 682582 680843 679558 679392 680381 682211 684489 686698 688019 687485 684669 680206 675340 670912
51619 670912 667101 664159 662720 663024 664366 665923 667733 670195 673026 675658 678432 682323 687390 692647
51605 692647 697687 703230 709531 715394 719676 722724 725187 726296 724900 721897 720035 721092 724541 729313
51591 729313 735493 743521 752618 760926 766719 768858 766643 760191 750883 740729 731109 722296 714004 706013
51577 706013 698294 690873 683631 676225 668517 661239 655797 652995 652177 652053 652143 652934 654744 656994 658761
51562 658761 659662 660073 660651 661668 662634 662609 661109 658630 656099 653946 651914 649552 646533 642727 638449 634519
51546 634519 631591 629543 628002 627159 627364 628168 628870 630162 634043 641568 651667 662836 674961 688407
51532 688407 702052 713583 721592 726371 728819 729640 729553 729160 728296 726328 723412 720745 719451 719878 722071
51517 722071 726083 731673 738699 748102 761464 778978 798672 818339 837490 856827 876621 896535
51505 896535 916452 936453 956316 975944 996206 1018739 1045165 1076872 1114784 1158337 1205109
51494 1205109 1252515 1299589 1346123 1390440 1429430 1460918 1484837 1501831 1511645 1513118 1504857 1485918
51482 1485918 1457035 1421477 1383307 1344080 1302259 1256532 1208691 1162377 1119960 1081706 1047112
51471 1047112 1015622 986366 958567 932422 908858 888448 871215 857148 845960 836462 827359 818880
51459 818880 812689 809805 809339 809560 809302 807830 804211 797892 789623 780852 772234 763373 754104 745236 737553
51444 737553 730572 722944 714018 704534 695649 687774 680669 674345 669330 665965 663784 661793 659198 655839
51430 655839 652130 648716 646094 644483 644072 645140 647461 649671 649927 647650 644253 641635 640136 638447 635376
51415 635376 631098 626533 622082 617457 612569 608055 604675 602393 600356 597910 595448 594030 594306 596077
51401 596077 598822 602127 605419 607837 608910 609199 609716 610729 611664 612305 613582 616729 621850 627738 633137
51386 633137 637787 642155 646610 651380 657102 664753 674663 685880 696742 705899 712703 717099 719575 720988
51372 720988 721936 722470 722676 723087 723745 723121 719081 711207 701554 692812 686354 682189 679924 679070 679046 679659 681410
51355 681410 684776 689291 693697 696917 698720 699742 701077 703384 706062 707709 707722 707044 706968 707726 708722 709561
51339 709561 710229 710718 711270 712571 714969 717945 721300 726497 735543 748462 763043 777445 792032 808131
51325 808131 826030 845126 865556 888750 916352 949041 986402 1027603 1072218 1120598 1173375
51314 1173375 1230454 1290521 1351513 1411290 1467947 1519927 1566137 1605600 1636774 1657599 1666614
51303 1666614 1663751 1649686 1624757 1589263 1544632 1493398 1437692 1378529 1317137 1256262 1198977
51292 1198977 1146297 1097019 1050150 1006396 966727 930560 896620 864980 836913 812807 791510
51281 791510 771911 753985 738008 723906 711921 702792 696396 691036 684942 677965 671089 664907 659364
51268 659364 654375 649713 644731 639144 633857 630217 628649 628649 629659 631150 632305 632619 632554 632715 632750 632016 631024
51251 631024 631045 632333 633830 634534 634218 632896 630713 628377 626609 625076 622893 620133 617687 615585 612792
51236 612792 608907 604869 601622 599269 597907 597979 599178 600121 599843 598771 597719 596873 596295 596352 597056 597953 599375
51219 599375 602692 608430 614993 620137 623135 624940 627078 630847 636449 642085 645133 645165 644599 645197 645404
51204 645404 642948 639054 637818 641522 648364 654804 658544 659104 657265 654620 652575 651105 649069 645833
51190 645833 641811 637471 632845 628135 623776 619726 615632 611932 609687 608939 608250 606378 603587 600715 597740
51175 597740 594037 589608 585358 582333 580997 581015 581475 581697 582039 583534 586458 589777 592409 594574 597270
51160 597270 600609 603337 604266 603885 604130 606470 610434 614366 617490 620628 624564 628313 629817 628304 625362
51145 625362 623530 624169 626669 629307 630737 630890 630534 629946 628426 625458 621965 619762 619799 621486 623677 625708
51129 625708 627380 628563 629224 629618 630198 631299 632872 634460 635635 636581 637944 640001 642420 644957 647754
51114 647754 650493 652080 651967 651206 651168 651617 651100 649022 646216 643568 641236 639365 638471 638795 640126 642486
51098 642486 646081 650358 654086 656780 659146 661690 663700 664175 663037 660857 658029 654745 651241 647572
51084 647572 643584 639495 635951 633107 630318 627298 624967 624377 625149 625638 624576 622107 619434 617913 618295
51069 618295 620369 623217 625991 628448 630846 633588 636929 640658 644051 646560 648501 650691 653568 657268
51055 657268 662217 668662 675598 681318 685270 688403 691495 694259 696460 698524 700385 701142 700865 701424 704185
51040 704185 707919 710549 712108 714132 716638 717805 716827 715254 714788 715158 715015 713906 712536 711736 711925 713226
51024 713226 715592 719004 723647 729304 734493 737069 736306 733810 731799 730989 730749 730771 731548 733325 735637 738184
51008 738184 741332 745294 749579 753985 759565 767435 776817 785644 793606 803328 817427 835184 853388
50995 853388 869934 885075 899417 912679 925084 938316 953807 970855 987497 1002545 1015809
50984 1015809 1026974 1035412 1040896 1043589 1043535 1040796 1035737 1028494 1018734 1006886 995043 985369 977712 969806
50970 969806 959753 947396 933614 919702 907539 898836 893513 889780 886359 883780 883054 884061 886120
50957 886120 889390 894664 901970 910135 917844 924743 931503 938994 947456 956596 966677 979030 994659
50944 994659 1012388 1029458 1044431 1058738 1074757 1093069 1112301 1131029 1148746 1165223 1180138
50933 1180138 1193628 1206377 1218595 1229538 1238620 1246627 1255075 1264495 1274180 1283913 1295040 1309022
50921 1309022 1325364 1342055 1358037 1374148 1391305 1408891 1425842 1442590 1460997 1482856 1509354
50910 1509354 1541399 1579161 1621448 1666852 1715700 1769759 1829746 1894338 1962115 2033377 2109150
50899 2109150 2189102 2271389 2354276 2437201 2520295 2603159 2683915 2759310 2826190 2883245 2931149
50888 2931149 2970981 3003000 3027007 3043163 3052026 3054286 3050823 3042548 3029932 3013208 2993232 2971340
50876 2971340 2947992 2922329 2893743 2863130 2831899 2800376 2768007 2734518 2699862 2663389 2624213
50865 2624213 2582350 2538594 2493205 2445520 2395008 2342119 2287915 2233388 2179206 2125657 2072713
50854 2072713 2020429 1969320 1920199 1873885 1831246 1792976 1758753 1727044 1696513 1667344 1640547
50843 1640547 1616283 1593819 1572806 1553493 1535675 1518627 1502338 1487804 1475677 1465540 1456936
50832 1456936 1450200 1445584 1442363 1439563 1437145 1435787 1435955 1437740 1441127 1445736 1450694 1455615 1461473 1469705
50818 1469705 1480402 1492063 1503173 1513577 1524355 1536983 1552789 1572538 1596042 1622269 1650096
50807 1650096 1679073 1709614 1742701 1779306 1819782 1863725 1910613 1960600 2014514 2073188 2137091
50796 2137091 2206616 2282322 2364685 2453819 2549713 2652834 2764395 2885890 3018166 3160834
50786 3160834 3312687 3472626 3639901 3813448 3991579 4172734 4356015 4540240 4722662
50777 4722662 4899383 5066943 5222626 5363087 5483870 5581200 5653842 5702662 5728865 5733372
50767 5733372 5717515 5683403 5633622 5571360 5500839 5426804 5353174 5282428 5216134 5155209 5099349
50756 5099349 5046909 4995914 4944888 4892427 4836539 4774931 4705696 4627397 4538999 4440332 4332259
50745 4332259 4215731 4091046 3958913 3822088 3684849 3550483 3419970 3293447 3172116
50736 3172116 3058061 2952684 2856159 2768245 2688962 2618333 2556040 2501670 2455063 2416147 2384392
50725 2384392 2358474 2336584 2317174 2299557 2283735 2269667 2256854 2244669 2232842 2221377 2210210
50714 2210210 2199217 2188463 2178012 2167398 2155596 2141792 2126048 2109051 2091327 2072922 2053731
50703 2053731 2033718 2012634 1989871 1965119 1939326 1914758 1893824 1877614 1865383 1855373 1846338
50692 1846338 1838584 1833517 1831998 1833358 1836465 1841674 1850939 1865795 1885961 1910436 1939265 1973348 2013005
50679 2013005 2057816 2107899 2164227 2227323 2296356 2369858 2446791 2526631 2609145 2694592 2783655
50668 2783655 2876495 2972040 3068576 3164863 3260447 3355077 3448042 3537811 3622152 3698941 3766992
50657 3766992 3825584 3873014 3906383 3923542 3924864 3912422 3887728 3851043 3802959 3746054 3684756
50646 3684756 3623716 3566117 3513121 3464744 3421230 3383373 3351616 3325377 3303421 3284203 3265458
50635 3265458 3244322 3218748 3188404 3153372 3112475 3064095 3008520 2948418 2886758 2825170 2764436
50624 2764436 2705589 2649885 2598264 2551355 2509695 2473691 2443671 2420131 2403656 2394600 2393253 2400177
50612 2400177 2415647 2438626 2466884 2498395 2532260 2568352 2606795 2647730 2690652 2733779 2775018
50601 2775018 2814039 2852547 2892117 2932673 2973694 3015762 3059875 3105926 3153143 3201745 3253102
50590 3253102 3308277 3367218 3429297 3493967 3561056 3631251 3706235 3787545 3875181 3967832 4064340
50579 4064340 4164188 4266607 4369994 4472313 4571488 4665448 4752690 4833099 4907495 4976017 5037389
50568 5037389 5089939 5132859 5166327 5190847 5206246 5210345 5198484 5165817 5111366 5039782 4958755
50557 4958755 4875118 4793510 4717289 4649040 4590216 4541412 4503214 4475955 4458578 4448598 4443522 4441612
50545 4441612 4440876 4437981 4428775 4409606 4377840 4331753 4270783 4195876 4108997 4012143 3907141 3796161
50533 3796161 3681728 3565991 3450473 3336808 3227245 3123828 3027225 2936796 2851764 2771957
50523 2771957 2697585 2628899 2566322 2510311 2460662 2416216 2375839 2339758 2309550 2286591 2270585
50512 2270585 2259748 2252398 2248283 2248308 2253071 2261995 2274080 2289185 2307974 2330573 2356052 2383636 2413865
50499 2413865 2447861 2485803 2526946 2571095 2619149 2671841 2728626 2788289 2850119 2913835 2978654
50488 2978654 3043305 3107299 3171669 3237946 3306530 3376587 3447749 3521569 3600934 3688228 3784466
50477 3784466 3890023 4005405 4131004 4266907 4413603 4572353 4743983 4927660 5121822
50468 5121822 5326214 5541924 5769223 6006314 6250448 6499207 6750099 6999939 7245616
50459 7245616 7484856 7715170 7932294 8130454 8303981 8448078 8558675 8632924 8670078 8670938
50449 8670938 8636203 8566136 8462100 8327632 8167629 7987246 7792229 7589796 7388178 7194944
50439 7194944 7015746 6854467 6714244 6598158 6508847 6447288 6412077 6400203 6408501 6433948 6472436
50428 6472436 6517386 6559583 6588359 6593696 6568426 6509127 6415041 6286753 6126692 5940550 5736574
50417 5736574 5522437 5303053 5081479 4860816 4644391 4434833 4234074 4044161 3867250
50408 3867250 3704693 3556379 3420792 3295625 3179186 3071833 2975543 2891347 2817618 2751532
50398 2751532 2691564 2637685 2589792 2547356 2510535 2480304 2457116 2440086 2427508 2417507 2408648
50387 2408648 2401123 2397154 2398831 2405458 2414397 2424630 2437771 2455090 2475254 2495911 2515889 2534619
50375 2534619 2550918 2564134 2575597 2587380 2600245 2614292 2630744 2651127 2674969 2700263 2726375
50364 2726375 2754865 2787230 2823484 2863344 2907196 2955161 3006616 3061651 3122057 3189896 3265781
50353 3265781 3349203 3439932 3538230 3644165 3757335 3876917 4001527 4129260 4258029 4385448
50343 4385448 4508470 4624182 4731309 4829999 4919609 4997533 5060634 5106734 5134024 5140186 5123244
50332 5123244 5082663 5018838 4932692 4827140 4708090 4582208 4453829 4325279 4199630 4081240
50322 4081240 3973543 3878048 3795963 3729201 3678958 3644508 3624201 3616714 3620488 3632699 3649565
50311 3649565 3667229 3681793 3689135 3685510 3668194 3635394 3586176 3521020 3441892 3351265 3251586 3146047
50299 3146047 3038951 2934119 2833015 2735068 2639610 2546931 2457794 2372909 2293033 2218880 2150566
50288 2150566 2087505 2029240 1976398 1930648 1893520 1865031 1843610 1827571 1816320 1809424 1804664 1798227
50276 1798227 1787369 1772158 1754171 1734605 1714549 1695928 1680361 1667266 1654600 1641679 1630021
50265 1630021 1621049 1614244 1608248 1602890 1599223 1598044 1599042 1601162 1603259 1604611 1605147 1605006 1603825 1600985 1596836
50250 1596836 1593007 1590910 1590318 1590081 1589860 1590252 1591341 1592238 1592656 1594191 1599097 1607769 1618144 1627928 1636970
50235 1636970 1646988 1659222 1673157 1687637 1702493 1718462 1736045 1755272 1776215 1798679 1821375
50224 1821375 1842745 1863391 1886605 1914943 1946006 1972354 1985997 1983162 1965584 1938608 1908330
50213 1908330 1879173 1852586 1827625 1803170 1779617 1758220 1739120 1720924 1702544 1684870 1670022
50202 1670022 1659212 1651940 1647134 1644350 1643714 1645376 1649453 1656102 1665289 1676754 1690440 1706571 1724999
50189 1724999 1745058 1766508 1790055 1816085 1843293 1869424 1893217 1914835 1934637 1952605 1969017
50178 1969017 1984499 1998997 2011503 2021023 2026943 2028241 2023550 2012584 1996446 1975904 1950492 1920187
50166 1920187 1886856 1852872 1819244 1786388 1755776 1728972 1705480 1683311 1661469 1639963 1617271
50155 1617271 1590108 1556834 1519740 1482901 1448843 1418152 1390980 1367341 1346383 1326814 1308167
50144 1308167 1291047 1276223 1263950 1253748 1244373 1234533 1224289 1215226 1208507 1203248 1197574 1190753 1183330
50131 1183330 1175575 1167053 1157630 1147739 1137492 1126582 1115298 1104714 1095509 1087368 1079863 1073182 1067619
50118 1067619 1063127 1059746 1057768 1056979 1056471 1055756 1055427 1056080 1057190 1057905 1058393 1059464 1061166 1062896 1064907 1068547
50102 1068547 1074598 1082271 1090355 1098717 1107988 1118347 1129565 1142120 1157256 1175465 1195416 1214966
50090 1214966 1233058 1250228 1267430 1284854 1301932 1317846 1331762 1343158 1352707 1362642 1375580 1392734
50078 1392734 1413603 1437361 1464020 1494198 1528400 1566815 1609192 1654472 1701086 1748151 1796018
50067 1796018 1845049 1894266 1941977 1987481 2031421 2074544 2116926 2158293 2197958 2234009 2263431
50056 2263431 2283777 2294402 2295657 2287444 2269249 2241334 2205307 2163520 2118186 2070791 2021913 1971778
50044 1971778 1921352 1872674 1827725 1787135 1750355 1716727 1685830 1657122 1630100 1604942 1582329
50033 1582329 1562455 1544755 1528692 1514217 1501292 1489649 1479328 1470905 1464681 1460133 1456593 1454006
50021 1454006 1452467 1451362 1449682 1447054 1443814 1440025 1435044 1428298 1420122 1411510 1403112 1394643 1385279 1374653
50007 1374653 1363399 1352553 1342471 1332749 1323336 1315041 1308411 1302658 1296689 1291027 1287586 1287207 1288323
49994 1288323 1288725 1287929 1287007 1286612 1286403 1286474 1288183 1292778 1299750 1307370 1314734 1322558 1331806 1342251 1352880
49979 1352880 1363313 1374127 1385763 1397660 1408572 1417403 1423761 1428409 1433381 1440801 1450827 1461123
49967 1461123 1469217 1475139 1480971 1488000 1495449 1502150 1508332 1515033 1522656 1531030 1540446 1551585 1564544
49954 1564544 1578725 1593829 1610225 1628146 1647054 1666148 1685174 1704376 1723707 1742319 1758974
49943 1758974 1773160 1785836 1798739 1812651 1826547 1838664 1847947 1853873 1855385 1851238 1841572 1828001
49931 1828001 1811453 1790784 1764444 1732995 1698982 1664549 1630251 1596158 1562879 1530834 1499390
49920 1499390 1467576 1435293 1403136 1371404 1340129 1309940 1281951 1256563 1233155 1211325 1191619
49909 1191619 1174376 1158543 1142781 1127568 1115001 1106095 1099222 1091902 1083545 1075623 1069650 1065969 1064369
49896 1064369 1064663 1066200 1067710 1068543 1069786 1073424 1080418 1090109 1101380 1113793 1127362 1141779 1156277
49883 1156277 1170171 1183239 1195614 1207377 1218180 1227183 1233551 1237192 1238877 1239340 1238154 1233658 1224238
49870 1224238 1209917 1192705 1175161 1158376 1141375 1122696 1102494 1082830 1065983 1052830 1042795
49859 1042795 1034721 1027522 1020660 1014714 1011143 1010768 1012560 1014638 1016350 1018584 1022010 1026049 1030070 1034767
49845 1034767 1041535 1050817 1061738 1073058 1083931 1094037 1103741 1114051 1125831 1139049 1153268 1168574
49833 1168574 1185159 1202011 1216909 1228043 1235074 1238453 1238594 1236218 1232703 1229108 1224984 1218843 1209721
49820 1209721 1197857 1184015 1168785 1152588 1135838 1118869 1101986 1085687 1070517 1056684 1044072
49809 1044072 1032758 1023176 1015586 1009615 1004654 1000668 998362 998482 1001067 1005493 1011101 1017653 1025123 1033302
49795 1033302 1041857 1050826 1060770 1072234 1085159 1099075 1113896 1130175 1148186 1166762 1183525 1196750
49783 1196750 1206859 1215576 1223521 1229301 1231300 1229824 1226666 1222803 1217381 1209158 1198269 1186172 1174241
49770 1174241 1162810 1151376 1139490 1127470 1116288 1106645 1098409 1091364 1086263 1084312 1085481 1088195 1091157
49757 1091157 1094753 1100095 1107264 1115355 1123920 1133449 1144393 1156420 1168865 1181475 1194308 1207008
49745 1207008 1218371 1226936 1232290 1235674 1238759 1241669 1242754 1240558 1235416 1228669 1221021 1212277 1202138
49732 1202138 1190300 1176160 1159450 1141242 1123556 1107737 1093720 1080839 1068741 1057492 1047290
49721 1047290 1038215 1029909 1021607 1012966 1004735 998176 993977 992141 992474 994404 996727 998595 1000665 1004244
49707 1004244 1009397 1015082 1021227 1029254 1040030 1052580 1065516 1078650 1092172 1105096 1115790 1123683
49695 1123683 1129466 1133799 1136653 1137766 1136965 1133974 1128502 1120588 1110531 1098617 1085351 1071855 1059572
49682 1059572 1049527 1041935 1036322 1031794 1027497 1023221 1019469 1016821 1015475 1015551 1017212 1020009 1022546 1023499
49668 1023499 1022927 1022172 1022605 1024800 1028734 1034230 1041149 1049399 1058908 1069679 1082010 1096496 1113319 1131554
49654 1131554 1149829 1167667 1185259 1201541 1213716 1219787 1220951 1220399 1219980 1219072 1216433 1211962 1206354
49641 1206354 1200083 1193304 1186354 1179841 1174329 1169968 1166285 1162370 1157538 1151852 1145981 1140815 1137267 1135877
49627 1135877 1136128 1136597 1136391 1136166 1137299 1140392 1145185 1151528 1159763 1170371 1183802 1200310 1219335 1239535
49613 1239535 1260241 1282347 1306641 1331470 1353272 1369467 1379898 1385657 1387866 1387784 1386712 1385056 1382331
49600 1382331 1378610 1375307 1374164 1376118 1381145 1387960 1393362 1393115 1384645 1368661 1347798 1324392 1299955
49587 1299955 1275740 1252702 1231176 1211274 1193332 1177630 1164149 1152976 1144321 1137705 1131929 1126448
49575 1126448 1122036 1119351 1117544 1115134 1111654 1107508 1102739 1096988 1090354 1083276 1075821 1068019 1060590 1054159
49561 1054159 1047875 1040105 1030842 1022296 1016523 1013242 1010660 1007885 1005713 1005084 1005464 1005261 1003798 1002330 1002566
49546 1002566 1004459 1006375 1007585 1009423 1013208 1018046 1021973 1024652 1027481 1031216 1035021 1038156 1041196 1044878
49532 1044878 1048758 1051812 1053762 1055162 1056615 1058509 1061098 1064318 1067735 1071049 1074385 1077841 1081101 1083888
49518 1083888 1086553 1089788 1093770 1097789 1100816 1102631 1104450 1108068 1113956 1120639 1126601 1132353 1139581 1148615
49504 1148615 1158326 1168709 1181666 1198070 1215418 1229995 1240706 1249332 1257502 1264939 1270585 1273805
49492 1273805 1274112 1271101 1265471 1259277 1254401 1251159 1248797 1246751 1244910 1243249 1242032 1242183 1244681 1249378
49478 1249378 1254758 1259024 1261371 1262283 1262852 1263913 1265796 1268766 1273450 1280526 1290103 1301678 1314737 1329130
49464 1329130 1344925 1362384 1382147 1404777 1429522 1453814 1474561 1490027 1500305 1506358 1509141 1509623
49452 1509623 1508957 1508182 1507922 1508554 1510463 1514003 1519299 1526114 1533647 1540307 1544032 1543191 1537269 1526725 1512499
49437 1512499 1495840 1478154 1460333 1442198 1423132 1403478 1384987 1369571 1357784 1348624 1340560 1332598
49425 1332598 1324746 1317905 1313180 1310861 1309975 1309102 1307647 1306172 1305543 1306108 1307609 1309473 1311011 1311642 1311301
49410 1311301 1310637 1310630 1311875 1314106 1316394 1318004 1319136 1320630 1322794 1325025 1326992 1329658 1334253 1340383 1346181
49395 1346181 1350430 1353514 1355953 1357238 1357012 1356399 1356702 1357136 1355243 1349836 1342557 1336173 1331945 1328901 1325128
49380 1325128 1319563 1313036 1307816 1305898 1307652 1312366 1319561 1328978 1339545 1349704 1359165 1369469 1382339
49367 1382339 1398223 1416717 1437370 1459489 1482116 1505208 1530260 1558989 1591974 1629148 1670193
49356 1670193 1712640 1750077 1774525 1781731 1773721 1756306 1735164 1714165 1695489 1679857 1667063 1657163
49344 1657163 1650978 1649202 1651640 1657781 1667449 1680261 1694987 1710202 1725271 1740089 1754296 1767529
49332 1767529 1780182 1793019 1806014 1818367 1829718 1840394 1850077 1857065 1859660 1858021 1853878 1848450
49320 1848450 1841365 1831852 1820369 1808411 1796951 1785777 1774434 1763229 1752996 1744346 1737578 1732980
49308 1732980 1730659 1730275 1731413 1734089 1738432 1744020 1750018 1755711 1760330 1762627 1761566 1757542 1752120 1746398
49294 1746398 1740293 1733439 1725853 1717467 1708066 1698210 1689299 1682046 1675652 1669208 1663227 1659054 1657430 1658337
49280 1658337 1661551 1666296 1670891 1673762 1674600 1673840 1671628 1668302 1665177 1663465 1662690 1661510 1659891 1658997 1658988 1658663
49264 1658663 1657721 1657744 1660142 1664419 1669557 1676018 1685061 1696518 1708463 1719094 1728204 1736858 1746218 1756794
49250 1756794 1768431 1780807 1793873 1807603 1821286 1833329 1841825 1845246 1842854 1835002 1822959 1807978
49238 1807978 1790638 1771705 1753282 1737984 1726671 1717860 1709695 1701712 1694445 1688365 1683792 1680942 1679197
49225 1679197 1676939 1672929 1667543 1662059 1657066 1652026 1646085 1638885 1630905 1623308 1617033 1611864 1606937 1602233
49211 1602233 1598670 1596564 1595109 1593833 1593310 1593597 1593268 1591299 1588974 1588459 1590017 1591953 1592861 1592597 1591403
49196 1591403 1589564 1587971 1587818 1589619 1593408 1599687 1609096 1621351 1635657 1651988 1670527 1689731 1706344
49183 1706344 1717830 1723844 1725135 1722226 1715714 1706914 1697489 1688828 1681764 1676222 1671198 1666074 1661938 1660573
49169 1660573 1662144 1665197 1669004 1674333 1681464 1689209 1696834 1705421 1716048 1727853 1739327 1750473 1761998
49156 1761998 1773039 1781706 1787911 1794020 1802207 1812354 1823019 1833437 1843811 1854324 1864861 1875643
49144 1875643 1887590 1901722 1918419 1937340 1957926 1979616 2001632 2023211 2044522 2066718 2090214
49133 2090214 2113298 2133700 2151486 2169018 2187664 2206073 2222531 2237568 2252740 2267862 2281303
49122 2281303 2292854 2304599 2318576 2334775 2351977 2369762 2389179 2411819 2438450 2468205 2499105
49111 2499105 2529857 2561153 2594815 2631769 2671393 2712378 2752988 2790230 2820113 2840106 2851341
49100 2851341 2857757 2862950 2868166 2873255 2878836 2886738 2898211 2912368 2927041 2941048 2954865 2969103
49088 2969103 2983310 2996868 3010272 3024542 3039729 3054942 3069759 3084778 3100637 3117222 3134130
49077 3134130 3151491 3170081 3190716 3213509 3237581 3261794 3285950 3310849 3336835 3362959 3388280
49066 3388280 3413306 3439124 3465529 3491335 3516447 3542258 3569747 3598385 3627389 3656959 3687670
49055 3687670 3719634 3752916 3788016 3825315 3864879 3907622 3955869 4011869 4076366 4149606 4233256
49044 4233256 4329998 4440720 4562202 4687179 4806871 4915544 5014789 5112560 5214633 5314800
49034 5314800 5394546 5434813 5429699 5389519 5331457 5267375 5198782 5120598 5028143 4921462 4805349
49023 4805349 4687001 4573558 4470336 4379889 4302177 4235722 4178758 4129500 4086101 4047272 4013010
49012 4013010 3984185 3961088 3942667 3927144 3912903 3898718 3883891 3868714 3854375 3841742 3830505
49001 3830505 3820032 3810745 3803735 3799033 3795210 3791138 3787433 3785555 3785936 3787704 3790019 3792882 3796542 3800730
48987 3800730 3804779 3808263 3811444 3815379 3821658 3831579 3845293 3861814 3879853 3898326 3916231 3932741
48975 3932741 3947805 3962107 3975968 3988616 3999016 4007179 4014187 4021191 4028895 4037677 4047322 4056641 4064246
48962 4064246 4070044 4075372 4081318 4087564 4093387 4099191 4106197 4114850 4124346 4133816 4143239 4152949 4162931 4173221
48948 4173221 4184628 4198306 4214424 4231739 4248733 4264913 4280760 4296698 4312515 4327708 4341834
48937 4341834 4354326 4364446 4371919 4377464 4382163 4386201 4388605 4388397 4385651 4381111 4375127 4367540 4358545 4349021
48923 4349021 4339736 4330741 4322013 4314235 4308148 4303297 4298438 4293454 4289985 4289421 4290963 4292556 4293435 4294771
48909 4294771 4297938 4303122 4309652 4316593 4322664 4326637 4328663 4330590 4334210 4339560 4345440 4351204 4357349 4364759
48895 4364759 4374160 4386248 4401686 4420879 4443899 4470493 4499951 4531574 4565774 4604177 4647967
48884 4647967 4696511 4748259 4802569 4859741 4919666 4981597 5045277 5111250 5179829 5250535 5322743
48873 5322743 5396268 5471291 5548302 5627944 5710082 5793321 5876512 5960565 6047354 6136750 6226387
48862 6226387 6314849 6403346 6493137 6582786 6669571 6752808 6834227 6915482 6996668 7077113 7156244
48851 7156244 7233378 7307571 7378084 7444777 7508187 7569488 7629789 7688834 7744922 7796853 7845352
48840 7845352 7891703 7935567 7975430 8010834 8042787 8072071 8098539 8122114 8142938 8160011 8171100
48829 8171100 8174821 8171861 8163473 8149605 8129296 8102132 8068491 8028900 7983911 7934198 7880207 7822216
48817 7822216 7761237 7699119 7636957 7573848 7507952 7438267 7364580 7286440 7203486 7116628 7027648
48806 7027648 6937551 6846397 6754930 6665218 6579192 6497326 6419314 6345377 6276407 6213330 6156799
48795 6156799 6106936 6062798 6022526 5984713 5949505 5918056 5891204 5869169 5852123 5840287 5833447
48784 5833447 5830887 5831976 5836640 5845381 5859074 5878408 5902950 5930809 5959731 5988714 6018408 6050208
48772 6050208 6085295 6124174 6166325 6210187 6254080 6297254 6339639 6380837 6420352 6458929 6498438
48761 6498438 6539652 6580901 6619810 6655954 6691008 6726708 6763605 6801495 6839930 6878073 6914968
48750 6914968 6950464 6985393 7020514 7055663 7090243 7124180 7158058 7192512 7227730 7263423 7299025
48739 7299025 7333932 7367757 7400599 7433268 7467065 7502755 7539501 7575222 7608400 7639160 7668219
48728 7668219 7695418 7720024 7741904 7761200 7776927 7787127 7790745 7788361 7780656 7766971 7746006 7717313
48716 7717313 7681418 7638825 7589298 7531925 7465855 7391521 7311231 7227729 7141865 7052491 6959071
48705 6959071 6863376 6767934 6673755 6580642 6488945 6399592 6312655 6227228 6143010 6061064 5982692
48694 5982692 5908181 5836854 5767866 5700886 5636586 5576547 5522223 5473786 5430306 5390959 5355660
48683 5355660 5324542 5297398 5273802 5253499 5236553 5223193 5213324 5205985 5199688 5193739 5188958 5186612
48671 5186612 5186879 5188798 5191289 5193450 5194298 5193298 5191231 5189606 5189002 5188724 5188106 5187288 5186454 5185241 5183307 5180713
48655 5180713 5177327 5172633 5166750 5160998 5156724 5153913 5151600 5149294 5147301 5145851 5144658 5143384 5142004 5140585
48641 5140585 5139149 5137939 5137491 5138191 5139889 5142127 5144692 5147853 5152126 5158003 5165927 5176229 5188877 5203408
48627 5203408 5219322 5236352 5253951 5270777 5285427 5297836 5309209 5320304 5330476 5338783 5345102 5349473
48615 5349473 5351319 5350476 5348339 5346481 5344175 5338546 5327382 5310827 5290377 5267373 5242723 5216695 5188256
48602 5188256 5155404 5116854 5072982 5024930 4973611 4919919 4864986 4809434 4752891 4694782 4635264
48591 4635264 4575180 4515702 4458269 4404108 4353334 4305116 4259055 4215706 4175466 4137935 4102933
48580 4102933 4071019 4041999 4013792 3984070 3952719 3921494 3891314 3860991 3828952 3795517 3762985
48569 3762985 3733579 3707464 3682881 3658282 3633983 3611297 3590374 3569927 3549019 3527868 3506616
48558 3506616 3484798 3462933 3443379 3428263 3417268 3408560 3401136 3395056 3390103 3385848 3382893 3382584 3385379
48545 3385379 3390506 3397128 3404742 3412440 3418989 3423911 3427687 3430777 3433212 3435073 3436468 3437095 3436821 3436729 3438456
48530 3438456 3442155 3445967 3447623 3445738 3439452 3428099 3411879 3392071 3370032 3346559 3322463 3298913
48518 3298913 3276616 3255308 3234613 3214942 3197056 3181166 3166792 3153149 3139468 3125531 3112266
48507 3112266 3101330 3093764 3089398 3087684 3088329 3090693 3093298 3094709 3094587 3093180 3090013 3083797 3073792 3060782
48493 3060782 3046345 3031262 3014960 2996715 2977141 2957930 2940020 2922737 2905183 2887712 2871196
48482 2871196 2855403 2839210 2822097 2804182 2784947 2763462 2740162 2716950 2694898 2673115 2650752
48471 2650752 2629046 2610251 2595279 2583474 2574129 2567062 2562107 2559266 2559455 2564079 2573478 2586025 2598540
48458 2598540 2607108 2608076 2599689 2583427 2563147 2542287 2521948 2501746 2481970 2464300 2450481 2440908
48446 2440908 2434821 2431589 2431283 2434173 2440416 2450518 2465346 2484881 2507296 2530066 2551715 2571493
48434 2571493 2587485 2596467 2596339 2587980 2574066 2556703 2536875 2515533 2494090 2473724 2454802 2437069
48422 2437069 2420040 2403181 2386064 2368559 2350892 2333513 2316832 2300968 2285877 2271889 2259810
48411 2259810 2249976 2241306 2232032 2221522 2210895 2201604 2193843 2186556 2178641 2170059 2162097 2156527 2154031
48398 2154031 2153422 2152871 2151811 2151074 2151392 2152685 2154786 2157740 2161055 2163669 2165044 2165351 2164087 2159607 2150938
48383 2150938 2139372 2127444 2116793 2107586 2099345 2091479 2083319 2074401 2064679 2054138 2042608 2030225
48371 2030225 2017497 2004544 1990950 1976841 1963425 1951791 1941672 1931925 1921703 1910694 1898954
48360 1898954 1887241 1876835 1868122 1859684 1849467 1836555 1821420 1805208 1789489 1775979 1765351 1756464
48348 1756464 1747551 1737993 1728441 1719653 1711932 1705295 1699434 1693732 1687898 1682313 1677327 1672606 1667638 1662348
48334 1662348 1656755 1650664 1644278 1638419 1633422 1628404 1622364 1615415 1608256 1601073 1593803 1586893 1580969 1576183
48320 1576183 1572520 1570156 1568901 1568000 1567129 1566909 1567775 1569165 1570468 1571843 1573439 1574915 1576461 1578928 1582010
48305 1582010 1583889 1584033 1584839 1588800 1595408 1602720 1610665 1620527 1632140 1644096 1656273 1669885 1685183
48292 1685183 1701108 1717125 1733733 1751451 1770852 1793093 1818757 1846850 1876609 1909213 1945507
48281 1945507 1983061 2018207 2050533 2082689 2116123 2149804 2183224 2217988 2256106 2298804 2347026
48270 2347026 2400930 2459195 2521102 2588990 2666255 2753415 2848682 2951688 3063648 3184554 3313672
48259 3313672 3452522 3603970 3768818 3946754 4140161 4353145 4587626 4844775 5129671
48250 5129671 5449938 5810906 6217928 6682679 7220322 7840328 8546810 9347673 10256242
48241 10256242 11285902 12454306 13792554 15337476 17115299 19147668 21460763 24029042
48233 24029042 26657830 28939372 30398058 30742569 30006856 28472560 26481324 24305144
48225 24305144 22121824 20035373 18094761 16313940 14695137 13239480 11943371 10797334
48217 10797334 9791743 8917634 8161319 7504753 6933034 6436864 6007117 5632212 5302486
48208 5302486 5012995 4760282 4539405 4345194 4173590 4020780 3883389 3760132 3650966
48199 3650966 3554200 3466561 3386231 3313400 3247508 3186233 3127712 3071767 3018601 2968246 2921571
48188 2921571 2879710 2841920 2805870 2770706 2738138 2709868 2685486 2663695 2644213 2627420 2612841
48177 2612841 2598573 2581820 2560115 2532897 2502014 2469990 2437854 2405225 2371969 2338605 2305330
48166 2305330 2271872 2238278 2204877 2171606 2138443 2106297 2076233 2047816 2019380 1990179 1961365
48155 1961365 1934559 1910087 1886763 1862921 1837755 1811996 1786931 1762512 1737158 1709927 1681871
48144 1681871 1654461 1627830 1601652 1576491 1552696 1528908 1503578 1477421 1452654 1430244 1409623
48133 1409623 1390491 1372931 1356113 1339129 1323010 1309674 1298693 1287405 1274657 1262235 1251842
48122 1251842 1242793 1233682 1224441 1215546 1206824 1198331 1190971 1184886 1178463 1170308 1161276 1153324 1147254 1142779
48108 1142779 1139849 1138427 1137506 1135737 1132874 1129619 1126434 1123422 1121001 1119589 1118764 1117629 1115922 1114040
48094 1114040 1112201 1110427 1109285 1109753 1112083 1115244 1117765 1118964 1119515 1121052 1125039 1131513 1138784 1144519
48080 1144519 1147342 1147650 1147204 1147769 1149769 1152221 1154282 1156592 1160501 1166231 1172618 1178630 1184156 1189305 1194131
48065 1194131 1199352 1206115 1214386 1222677 1230171 1238109 1248064 1259756 1271833 1284140 1297725 1312827 1328182
48052 1328182 1342424 1355155 1366678 1377854 1390502 1406773 1427276 1450228 1472903 1493693 1512657
48041 1512657 1530715 1548956 1568494 1590291 1614595 1640473 1666126 1690121 1712469 1734323 1756517
48030 1756517 1778763 1800314 1820783 1839842 1856753 1871103 1883826 1896633 1910296 1924071 1936826
48019 1936826 1948119 1958087 1966946 1974932 1982192 1988505 1993578 1997856 2002507 2008223 2014444 2020136 2024894 2028878
48005 2028878 2032238 2035308 2039072 2044485 2051238 2057893 2063394 2067811 2071352 2073398 2073038 2070005 2064381 2055807
47991 2055807 2043865 2029151 2013026 1996010 1977082 1955014 1929969 1903358 1876467 1849693 1822939
47980 1822939 1796267 1769974 1744144 1718200 1691139 1662480 1632888 1603431 1574399 1545555 1517493
47969 1517493 1491636 1468360 1446167 1423624 1401368 1381090 1363119 1346285 1329827 1314032 1298971
47958 1298971 1284113 1269573 1256494 1245491 1235690 1225960 1216273 1207188 1198806 1190997 1183933 1177571 1171181
47945 1171181 1164249 1157419 1151624 1146645 1141501 1136115 1131621 1128983 1128125 1128526 1129841 1131592 1132885 1132997 1132065
47930 1132065 1130907 1130198 1129824 1128936 1126702 1123166 1119200 1115404 1111336 1106232 1100307 1094881 1091207 1089513 1089010
47915 1089010 1088351 1086309 1082774 1079202 1077381 1077559 1078258 1078139 1077364 1076759 1076323 1075358 1073744 1072326 1071994 1072891
47899 1072891 1074636 1076955 1079878 1083434 1087203 1090301 1092258 1094124 1098118 1105382 1114307 1122004 1127632 1133373
47885 1133373 1141721 1152690 1164481 1176205 1188657 1202473 1216839 1230608 1243810 1257156 1270421
47874 1270421 1282279 1291836 1299631 1306787 1313536 1318894 1321620 1321099 1317475 1311469 1304351 1297645 1292085 1286707
47860 1286707 1279524 1269567 1258053 1247168 1237925 1229727 1221803 1214338 1207969 1202744 1197946 1192737 1186787
47847 1186787 1180518 1174876 1170602 1167509 1164651 1161322 1157828 1155425 1155677 1159452 1165978 1173181 1179751 1186614
47833 1186614 1195441 1205939 1216037 1224930 1234276 1245633 1258314 1270918 1283562 1296946 1310207 1321615
47821 1321615 1330962 1339571 1348155 1356201 1363197 1368799 1371938 1371602 1368662 1365166 1361517 1356110 1348220 1339259
47807 1339259 1330305 1320218 1307569 1292946 1277816 1262259 1245544 1228247 1212127 1198098 1185597
47796 1185597 1173728 1161938 1149770 1137088 1124536 1112974 1102565 1093174 1085324 1079791 1076422 1074293
47784 1074293 1073019 1072998 1074372 1076648 1079501 1083090 1087298 1091292 1094186 1095878 1097211 1099598 1104151 1110482
47770 1110482 1116392 1119586 1119976 1119842 1121670 1126228 1132614 1139349 1145175 1149560 1152993 1156552 1160881 1165806
47756 1165806 1171048 1176867 1183837 1192357 1202640 1214754 1228268 1242292 1256530 1272365 1292242 1317563
47744 1317563 1347313 1379047 1411179 1444019 1478587 1514881 1551600 1587284 1621232 1653284 1683086
47733 1683086 1709697 1731831 1748507 1759639 1765878 1767741 1765242 1758688 1749248 1737929 1724336 1707481
47721 1707481 1687792 1667241 1647373 1628308 1609933 1592854 1577534 1563557 1550513 1538653 1527853
47710 1527853 1516888 1504814 1492296 1480567 1469715 1459164 1449165 1440436 1432651 1424631 1415972 1407407
47698 1407407 1399658 1393015 1387826 1384236 1381461 1378559 1376024 1375421 1377128 1379568 1381153 1382152 1384332 1389485
47684 1389485 1398551 1411293 1426324 1441930 1457190 1472082 1486805 1501705 1517564 1534855 1552750
47673 1552750 1569912 1586218 1602476 1618453 1632616 1644184 1653919 1662257 1668186 1670917 1671349 1670624 1668228
47660 1668228 1662759 1653890 1642410 1629034 1614350 1599410 1585014 1570656 1555220 1538399 1520485 1501294
47648 1501294 1480720 1460144 1441852 1426800 1414163 1403227 1394404 1387880 1382570 1377373 1372718 1370001
47636 1370001 1369997 1372609 1377784 1385704 1396076 1407919 1420282 1432776 1445429 1458563 1472976 1489734 1509154
47623 1509154 1530123 1550833 1570258 1588603 1606296 1623035 1638080 1650947 1661351 1668923 1673800 1677229
47611 1677229 1680463 1682766 1681517 1674985 1664330 1652180 1639785 1626473 1611511 1595355 1578861 1562135
47599 1562135 1544686 1526386 1507882 1490129 1473624 1458107 1443144 1429080 1417070 1407922 1401273 1396312
47587 1396312 1392807 1390756 1389477 1388121 1387106 1387915 1391060 1395020 1397706 1398414 1398010 1397912 1399426 1403255 1408827
47572 1408827 1414579 1419745 1425490 1433431 1443544 1454658 1466777 1481500 1499889 1521263 1544685 1570387
47560 1570387 1598758 1628882 1659398 1690317 1722766 1756980 1791606 1824878 1855388 1881631 1901948
47549 1901948 1915417 1922001 1921403 1912733 1895922 1872620 1844781 1812801 1775821 1733541 1686938 1637436
47537 1637436 1586268 1534677 1484011 1435377 1389586 1347332 1308902 1273721 1240867 1210251 1182674
47526 1182674 1158385 1136128 1114271 1092786 1073506 1058156 1046353 1036028 1025808 1016375 1008955 1002918
47514 1002918 995999 987124 977906 970560 965111 959721 953401 947238 942877 940756 940011 939377 937958 935679
47500 935679 933244 931235 929308 926758 923774 921404 920289 920178 920608 921155 920930 918969 915532 912066 909422
47485 909422 906952 903829 900200 896420 892298 888127 885457 885558 887661 889991 892030 894427 897043 898703
47471 898703 898953 898631 898331 897582 895973 893995 892278 891045 890876 892796 896700 900630 902557 902218 900389 897378
47455 897378 893567 890585 890080 891405 892141 891126 889475 888378 887645 887082 887528 889174 890348 889655 888354 888629
47439 888629 889972 889468 885789 881003 877889 877173 878087 879923 881821 882454 881531 880870 882400 885518 887784 888056
47423 888056 887551 887737 888446 888565 887712 886663 886504 887654 889627 891746 894185 897890 903082 908402 912222 914410
47407 914410 916008 917605 919048 920498 922568 925371 928492 931940 935902 939355 940336 938421 935957 935887 938859
47392 938859 943219 947298 950907 954915 960130 966680 974055 981764 990129 1000240 1012947 1028035 1044532
47379 1044532 1061593 1079008 1097176 1116805 1138516 1162594 1189117 1218000 1248613 1279673 1309967
47368 1309967 1339010 1366589 1392159 1415411 1436953 1457291 1475245 1488474 1495642 1497078 1493400 1484777
47356 1484777 1471782 1455662 1437220 1416549 1394234 1371677 1349682 1327861 1305929 1284453 1263689
47345 1263689 1243173 1223355 1206166 1192585 1180768 1168164 1154713 1142472 1132723 1125051 1118841 1114023
47333 1114023 1110288 1107026 1104363 1103245 1104211 1106813 1110294 1114155 1118055 1121865 1125789 1129969 1134147 1138189
47319 1138189 1142497 1147216 1151492 1154259 1155349 1155082 1153401 1150427 1147176 1144320 1140509 1133489 1122951 1110928
47305 1110928 1099201 1087613 1075296 1062217 1048836 1035182 1021111 1006940 993192 980059 967466
47294 967466 955343 943580 932018 920679 909776 899509 890056 881549 873663 865594 857091 849264 843681
47281 843681 840780 839836 840216 841786 844197 846727 848884 850343 850369 848359 845232 843335 844440 848315 853425
47266 853425 858383 862522 865722 868203 870262 872044 873719 875616 877738 879346 879548 878142 875472 871977
47252 871977 868566 866824 867684 870136 872302 873663 875228 877785 881182 885163 889578 893772 897159 900527
47238 900527 905439 912131 919371 926525 934277 942951 951811 960692 970694 982330 994322 1005379 1015976
47225 1015976 1027271 1039260 1051165 1062820 1074525 1086126 1097325 1108425 1119878 1131453 1142483
47214 1142483 1152508 1161194 1168293 1174148 1179531 1184648 1189238 1194020 1200586 1209040 1217141 1222966 1227234 1231787
47200 1231787 1236950 1241658 1244887 1245168 1239940 1227732 1210648 1192678 1175731 1159075 1142297 1126574
47188 1126574 1112838 1100681 1089545 1079332 1069594 1059913 1051541 1046784 1045977 1046709 1046880 1046820 1047464 1048366 1049130
47173 1049130 1051279 1056558 1064217 1071988 1079320 1087745 1098132 1109491 1120736 1131785 1142250 1150824 1157216
47160 1157216 1163501 1171937 1181950 1190653 1196249 1199543 1201973 1203542 1203485 1201927 1199733 1197155 1193786 1189847
47146 1189847 1186489 1184360 1182566 1179568 1174770 1168895 1163124 1158329 1154910 1152916 1152243 1152866 1154859 1158159
47132 1158159 1162545 1168003 1174952 1184034 1195776 1210378 1227496 1246186 1265394 1284556 1303470 1321897
47120 1321897 1339944 1358764 1379799 1402909 1426110 1447692 1467810 1487358 1506074 1522724 1536665
47109 1536665 1548314 1558415 1567641 1576556 1584969 1591618 1595467 1597170 1598227 1598818 1597573 1593638 1587861 1581555
47095 1581555 1574978 1567566 1558966 1549375 1539371 1529790 1521310 1513895 1507049 1500764 1495610 1491802 1488958 1487165
47081 1487165 1487404 1490249 1494727 1499209 1503016 1506442 1509615 1512250 1514501 1517164 1520706 1524485 1527168 1527683
47067 1527683 1525806 1522171 1517784 1513066 1507188 1498623 1486650 1472142 1456718 1441244 1425389 1408504
47055 1408504 1390612 1372473 1354922 1338390 1322935 1308541 1295228 1282898 1271072 1258913 1245851
47044 1245851 1232428 1220323 1210948 1203848 1196891 1188492 1179504 1172445 1168811 1167459 1165866 1162780 1159315
47031 1159315 1157453 1157877 1159667 1161875 1164669 1168535 1173072 1177415 1181634 1186728 1193059 1199691 1205720 1211535
47017 1211535 1218185 1226075 1234887 1244244 1253634 1262009 1268382 1272856 1276335 1279231 1281150 1281925 1282348 1283621
47003 1283621 1286524 1291154 1296889 1302446 1306639 1309515 1312438 1316736 1322534 1329083 1335817 1342665 1349691 1357018
46989 1357018 1365097 1374548 1385466 1397063 1408167 1418189 1427501 1436881 1446620 1456348 1465780 1475342 1485742
46976 1485742 1497024 1508476 1519611 1530817 1542722 1555128 1567067 1577920 1588050 1598149 1608345
46965 1608345 1618266 1627631 1636051 1642366 1645086 1644010 1640855 1637677 1635080 1632543 1629951 1627806 1626072 1623905
46951 1623905 1620685 1616465 1611254 1604808 1597487 1590399 1584239 1578809 1574151 1571197 1570588 1571679 1573550 1576297
46937 1576297 1580410 1585552 1591051 1597184 1604781 1613770 1623097 1632055 1640821 1649908 1659923 1671651 1685359
46924 1685359 1700052 1714430 1728587 1743834 1760841 1778942 1797321 1815761 1834003 1851555 1868617
46913 1868617 1886204 1904733 1923213 1940366 1955829 1969760 1982010 1992457 2001699 2010584 2019146 2026438
46901 2026438 2031446 2034104 2035708 2038316 2043102 2049009 2053521 2055138 2054740 2054399 2055527 2058573 2063854 2071757
46887 2071757 2082217 2094461 2107396 2120141 2132382 2144336 2156287 2168167 2179884 2191856 2204611
46876 2204611 2217825 2230545 2242547 2254686 2267436 2279791 2290224 2298290 2304658 2309853 2313488 2314481
46864 2314481 2311650 2304437 2293529 2280580 2266910 2252618 2237113 2220060 2201564 2182080 2162783 2145392
46852 2145392 2130747 2117773 2104717 2091317 2079047 2069280 2062119 2057227 2054900 2055778 2060026 2067460 2078238
46839 2078238 2092706 2110492 2130270 2150871 2172466 2196309 2223226 2252594 2282926 2313219 2343478
46828 2343478 2374050 2404765 2434700 2462588 2487581 2509853 2530416 2550033 2568462 2585009 2599529
46817 2599529 2612332 2623364 2632357 2639894 2647424 2655820 2664640 2673386 2682877 2694546 2708643 2723956 2739446
46804 2739446 2755590 2773748 2794347 2816027 2836761 2855775 2874008 2892495 2910755 2927308 2941413
46793 2941413 2953434 2963563 2971209 2975998 2978462 2979098 2977388 2972397 2964032 2953217 2941224 2929231 2918050
46780 2918050 2907754 2897848 2888158 2879217 2871575 2865378 2861003 2859265 2860226 2862481 2864650 2867190 2871804 2879323
46766 2879323 2889139 2900472 2913076 2926545 2939970 2952608 2964222 2974456 2982425 2987213 2988504 2986790
46754 2986790 2983354 2979740 2976343 2971556 2963198 2951024 2937043 2923117 2909065 2893579 2876131 2857319
$$ [...]
##END NTUPLES=NMR SPECTRUM
##END=
