
##TITLE=UV1054_TOCA01-ROVE100D_6099866_zUAobk78ds
##JCAMPDX= 6.0         $$ Bruker NMR JCAMP-DX V2.0
##DATA TYPE= NMR SPECTRUM
##DATA CLASS= NTUPLES
##ORIGIN= BRUKER
##OWNER= Administrator
$$ 1.72 TOPSPIN		Version 2.1
$$ 2012-05-13 00:34:35.359 -0500  Administrator@TOPSPIN
$$ Compression mode = diff/dup
##.OBSERVE FREQUENCY= 400.13188235
##.OBSERVE NUCLEUS= ^1H
##.ACQUISITION MODE= SIMULTANEOUS (DQD)
##.ACQUISITION SCHEME= undefined
##.AVERAGES= 8
##.DIGITISER RES= 22
##SPECTROMETER/DATA SYSTEM= spect
##.PULSE SEQUENCE= zg30
##.SOLVENT NAME= COFFEE_meoh
##.SHIFT REFERENCE= INTERNAL, COFFEE_meoh, 1, 14.98061
##AUDIT TRAIL= $$ (NUMBER, WHEN, WHO, WHERE, PROCESS, VERSION, WHAT)
$$ ##TITLE= Audit trail, TOPSPIN		Version 2.1
$$ ##JCAMPDX= 5.01
$$ ##ORIGIN= Bruker BioSpin GmbH
$$ ##OWNER= Administrator
$$ $$ C:\Bruker\TOPSPIN/data/COFFEE/nmr/UV1054_TOCA01-ROVE100D_6099866_zUAobk78ds/10/pdata/1/auditp.txt
$$ ##AUDIT TRAIL=  $$ (NUMBER, WHEN, WHO, WHERE, PROCESS, VERSION, WHAT)
(   1,<2012-05-13 00:34:28.187 -0500>,<Administrator>,<TOPSPIN>,<go>,<TOPSPIN 2.1>,
      <created by zg
	started at 2012-05-13 00:33:21.671 -0500,
	POWCHK enabled, PULCHK disabled,
       configuration hash MD5:
       AF F2 23 6B 01 CD 40 DD E5 A1 38 A0 06 EA F7 77
       data hash MD5: 64K
       BA 0C E1 69 25 89 DC 7E 2A 2F C7 2C 9A 98 0B 0B>)
(   2,<2012-05-13 00:34:31.171 -0500>,<Administrator>,<TOPSPIN>,<proc1d>,<TOPSPIN 2.1>,
      <Start of raw data processing
       efp LB = 0 FT_mod = 6 PKNL = 1 PHC0 = 0 PHC1 = 0 SI = 32K 
       data hash MD5: 32K
       6C 53 8E 5F DE 64 1F 26 69 DD E4 23 4D FE 9E CB>)
(   3,<2012-05-13 00:34:31.515 -0500>,<Administrator>,<TOPSPIN>,<proc1d>,<TOPSPIN 2.1>,
      <pk PHC0 = 213.9807 PHC1 = 0 
       data hash MD5: 32K
       D7 13 F2 8E ED F5 78 65 8F B9 75 27 AE 67 91 D3>)
(   4,<2012-05-13 00:34:31.578 -0500>,<Administrator>,<TOPSPIN>,<proc1d>,<TOPSPIN 2.1>,
      <abs ABSG = 1 
       data hash MD5: 32K
       DC 02 83 D0 8D 2F 95 77 8B 7B 5E A9 E1 2E AD 75>)
(   5,<2012-05-13 00:34:31.609 -0500>,<Administrator>,<TOPSPIN>,<proc1d>,<TOPSPIN 2.1>,
      <abs ABSG = 2 
       data hash MD5: 32K
       F5 62 EF 47 B0 DD 65 9B 5D 11 9E 0C D4 7A 44 D1>)
(   6,<2012-05-13 00:34:31.640 -0500>,<Administrator>,<TOPSPIN>,<proc1d>,<TOPSPIN 2.1>,
      <abs ABSG = 3 
       data hash MD5: 32K
       DC E1 7E 32 06 9A 13 3F 27 B7 D0 8B 9C 22 04 9E>)
(   7,<2012-05-13 00:34:31.843 -0500>,<Administrator>,<TOPSPIN>,<proc1d>,<TOPSPIN 2.1>,
      <abs ABSG = 4 
       data hash MD5: 32K
       D3 7B D8 ED A0 91 CE 40 F6 59 31 BE 13 B1 68 09>)
(   8,<2012-05-13 00:34:31.875 -0500>,<Administrator>,<TOPSPIN>,<proc1d>,<TOPSPIN 2.1>,
      <abs ABSG = 5 
       data hash MD5: 32K
       AF EB F2 79 A1 52 DC 37 F4 CD 30 79 AE 54 DE DC>)
$$ ##END=
$$ 
$$ $$ hash MD5
$$ $$ 85 4D 4E 14 A0 CC 53 F7 C9 CD B8 F6 4F 66 18 12
##$RELAX= 
##$RELAX= 
##$RELAX= 
##$RELAX= 
##$RELAX= 
##$RELAX= 
##$RELAX= 
$$ Bruker specific parameters
$$ --------------------------
$$ [...]
##$TP= (0..7)
150 150 150 150 150 150 150 150
##$TP07= 0
##$TPNAME0= <>
##$TPNAME1= <>
##$TPNAME2= <>
##$TPNAME3= <>
##$TPNAME4= <>
##$TPNAME5= <>
##$TPNAME6= <>
##$TPNAME7= <>
##$TPOAL= (0..7)
0.5 0.5 0.5 0.5 0.5 0.5 0.5 0.5
##$TPOFFS= (0..7)
0 0 0 0 0 0 0 0
##$TUNHIN= 0
##$TUNHOUT= 0
##$TUNXOUT= 0
##$USERA1= <user>
##$USERA2= <user>
##$USERA3= <user>
##$USERA4= <user>
##$USERA5= <user>
##$V9= 5
##$VALIST= <valist>
##$VCLIST= <CCCCCCCCCCCCCCC>
##$VD= 0
##$VDLIST= <DDDDDDDDDDDDDDD>
##$VPLIST= <PPPPPPPPPPPPPPP>
##$VTLIST= <TTTTTTTTTTTTTTT>
##$WBST= 2048
##$WBSW= 25
##$XGAIN= (0..3)
0 0 0 0
##$XL= 0
##$YL= 0
##$YMAX_a= 495483
##$YMIN_a= -588572
##$ZGOPTNS= <>
##$ZL1= 120
##$ZL2= 120
##$ZL3= 120
##$ZL4= 120
##$ABSF1= 14.98061
##$ABSF2= -5.57192
##$ABSG= 5
##$ABSL= 3
##$ALPHA= 0
##$AQORDER= 0
##$ASSFAC= 0
##$ASSFACI= 0
##$ASSFACX= 0
##$ASSWID= 0
##$AUNMP= <proc_prof1d_extract_pilot.lims>
##$AXLEFT= 0
##$AXNAME= <>
##$AXNUC= <1H>
##$AXRIGHT= 0
##$AXTYPE= 0
##$AXUNIT= <>
##$AZFE= 0.1
##$AZFW= 0.1
##$BCFW= 0
##$BC_mod= 0
##$BYTORDP= 0
##$COROFFS= 0
##$CY= 15
##$DATMOD= 1
##$DC= 0
##$DFILT= <>
##$DTYPP= 0
##$F1P= 0
##$F2P= 0
##$FCOR= 0.5
##$FTSIZE= 32768
##$FT_mod= 6
##$GAMMA= 0
##$GB= 0
##$INTBC= 1
##$INTSCL= 1
##$ISEN= 128
##$LB= 0
##$LEV0= 0
##$LPBIN= 0
##$MAXI= 10000
##$MC2= 0
##$MEAN= 0
##$ME_mod= 0
##$MI= 0
##$NCOEF= 0
##$NC_proc= -8
##$NLEV= 6
##$NOISF1= 0
##$NOISF2= 0
##$NSP= 0
##$NTH_PI= 0
##$NZP= 0
##$OFFSET= 14.98061
##$PC= 1
##$PHC0= 213.9807
##$PHC1= 0
##$PH_mod= 1
##$PKNL= yes
##$PPARMOD= 0
##$PPDIAG= 0
##$PPIPTYP= 0
##$PPMPNUM= 2147483647
##$PPRESOL= 1
##$PSCAL= 4
##$PSIGN= 0
##$PYNMP= <proc.py>
##$REVERSE= no
##$SF= 400.13
##$SI= 32768
##$SIGF1= 0
##$SIGF2= 0
##$SINO= 400
##$SIOLD= 32768
##$SPECTYP= <>
##$SREGLST= <1H.CDCl3>
##$SSB= 0
##$STSI= 32768
##$STSR= 0
##$SW_p= 8223.68421052632
##$SYMM= 0
##$S_DEV= 0
##$TDeff= 65536
##$TDoff= 0
##$TI= <>
##$TILT= no
##$TM1= 0
##$TM2= 0
##$TOPLEV= 0
##$USERP1= <user>
##$USERP2= <user>
##$USERP3= <user>
##$USERP4= <user>
##$USERP5= <user>
##$WDW= 1
##$XDIM= 32768
##$YMAX_p= 419639798
##$YMIN_p= -661005
##$CURPLOT= <Network HP LaserJet P1505>
##$CURPRIN= <$Network HP LaserJet P1505>
##$DFORMAT= <normdp>
##$LAYOUT= <+/1D_H.xwp>
##$LFORMAT= <normlp>
##$PFORMAT= <normpl>
##$SURQMSG= 1
$$ End of Bruker specific parameters
$$ ---------------------------------
##NTUPLES= NMR SPECTRUM
##VAR_NAME=  FREQUENCY,     SPECTRUM/REAL,   SPECTRUM/IMAG
##SYMBOL=    X,             R,               I
##VAR_TYPE=  INDEPENDENT,   DEPENDENT,       DEPENDENT
##VAR_FORM=  AFFN,          ASDF,            ASDF
##VAR_DIM=   32768,         32768,           32768
##UNITS=     HZ,            ARBITRARY UNITS, ARBITRARY UNITS
##FACTOR=    0.250966925370066, 1,           1
##FIRST=     8223.43324360095, 75729,        228129
##LAST=      0,             -111158,         107121
##MIN=       0,             -661005,         0
##MAX=       8223.43324360095, 419639798,    0
$$ Real data points
##PAGE= N=1
##DATA TABLE= (X++(R..R)), XYDATA
$$ [...]
$$ plain form
19546 -129826 -210212 23366 -90919 7460 -150920 237929 187383 -57728 33062 251442 -247016
19534 109400 205034 -159944 20077 188578 -105620 122283 -250032 -86075 -52583 -122712
19524 -122712 56775 350004 -11492 -116387 88374 -264529 315340 13079 -431757 -320549
19514 -320549 -4336 -137476 -332036 -168474 -379318 -48766 118127 -14733 -235074 -296988
19504 -296988 178584 -59639 -86283 -45600 22534 -222709 -198684 101137 173753 231716 190967
19493 190967 19589 -224284 -267699 -210506 -26270 -366297 232684 -17647 -67261 -217964 163392
19481 -481574 24794 75347 -217555 163791 -362908 159707 -225653 -28226 -103780 -222801
19471 -222801 -260197 129615 87920 -111431 292856 -99464 23114 -194784 -230649 -65880 137268
$$ packed form
19546a29826q0386B3366i0919G460a50920B37929n0546e7728C3062K18380b47016
19534A09400R5634a59944B0077J68501a05620A22283b50032h6075L3492p0129
19524a22712E6775K93229a1492j04895H8374b64529C15340A3079d31757J11208
19514c20549d336j33140j94560J63562k10844d8766A18127a4733k20341o1914
19504b96988A78584e9639k6644M0683B2534b22709K4025A01137P2616N7963m0749
19493A90967A9589b24284m3415N7193b6270l40027B32684a7647m9614j50703A63392
19481d81574B4794N0553b17555A63791c62908A59707b25653b8226p5554j19021
19471b22801l7396A29615m1695a11431B92856i9464B3114a94784l5865f5880A37268
$$ plain form
19459 651 -123842 37944 106422 -1209 110818 379070 87512 -136904 -556454 18542 -270469
19447 -47211 -244678 84557 -65179 -130679 -65671 -78214 -394854 -51919 -182598 -100205 -29313
19435 40288 -47157 -265698 -67911 -180971 -171374 -50020 36834 -100618 -122598 120035 -212971
19423 -131806 -111696 -142333 161896 88639 -315561 -178169 -196703 122883 -126741 201599
19412 41013 -20673 -188169 -91190 200933 -115348 81484 -104411 64264 5373 139757 -116624
19400 179522 -114886 -73253 152394 233372 -452945 336162 -280 174207 -25540 -101599 -100939
19389 -100939 -94900 -284752 -162881 73922 -61898 -43657 -113885 -110809 -320544 -185275 123721
19377 -199795 61116 -30877 -144 -14858 -301064 -323957 -24241 135766 -24228 -184393 124786
$$ packed form
19459F51a23842C7944O8478a209A10818K68252H7512a36904m19550A8542b70469
19447d7211j97467H4557f5179o5500O5008j2543l16640e1919j30679Q2393b9313
19435D0288d7157k18541f7911j13060R597e0020C6834a00618k1980A20035b12971
19423a31806K0110l0637A61896p3257c15561J37392j8534A22883a26741B01599
19412D1013b0673j67496i1190B00933a15348H1484a04411F4264E373J34384a16624
19400A79522a14886M1633A52394Q0978d52945C36162b80A74207b5540p6059O60
19389a00939O039j89852J21871G3922f1898J8241p0228L076k09735J35269A23721
19377a99795F1116c0877a44j4714k86206k2893b4241A35766b4228j60165A24786
$$ plain form
19365 196349 41315 -32411 -179976 46266 -98931 -93438 -68003 132687 -43533 -108077 -29172
19353 128378 282789 -19686 78307 165467 -96352 -412659 359532 -225570 -57736 -185884
19343 -185884 -180938 -278329 -2585 218597 103053 -279421 -7218 -197750 -120450 -249085 135272
19331 -205279 157548 -370105 215536 97793 2490 -284980 229592 -81387 42631 -70081 -73643
19320 -73643 4831 53428 -197086 -328133 30692 -21199 -73009 -5198 37168 -151481 116547
19308 -196633 -141510 -140393 90651 -360460 -232795 -41339 8180 -115489 -140502 192952 47592
19296 138411 108405 -103253 -52540 32139 -84457 -133082 12741 18402 -53526 -375647 285490
19284 -91531 -151997 15864 -213237 19894 -54938 -297583 -273935 219318 -258542 -133574 -146141
$$ packed form
19365A96349D1315c2411j47565D6266i8931N493K5435A32687d3533o4544b9172
19353A28378J54411a9686G8307Q7160i6352l16307C59532b25570e7736j28148
19343a85884M946r7391b585B18597A03053b79421g218j90532P7300j28635A35272
19331b05279A57548c70105B15536I7793B490b84980B29592h1387D2631g0081l562
19320g3643D831M8597a97086j31047C0692b1199n1810e198C7168a51481A16547
19308a96633N5123J117I0651c60460J27665d1339H180a15489k5013A92952D7592
19296A38411l0006a03253N0713C2139h4457m8625A2741N661e3526l22121B85490
19284i1531o0466A5864b13237A9894e4938k42645K3648B19318b58542J24968j2567
$$ plain form
19273 -146141 -37880 -105169 -417558 -224477 145848 -168313 84090 -149420 -196165 -2156 27023
19261 -66874 48849 406026 -73382 -316229 -208204 72127 59654 -87148 -340638 -309087 -98739
19249 157102 -233290 3890 -320203 -280521 -163877 -214296 15329 76659 286379 229285 -35697
19237 75362 -117734 -11174 -232078 -173005 -297953 69930 -134162 -185949 -294339 74286 -153590
19225 102730 -214023 115170 35277 -276163 48715 144292 110619 -308890 -124076 133641
19214 100568 -304989 -37771 280889 6503 -298691 -90389 -186348 -177003 34680 -131370 -393615
19203 -393615 -271628 -95870 191027 96511 -334591 -145272 -31428 59333 35988 -18824 -223422
19192 -223422 22555 -49074 144621 -402098 -103010 26397 12250 50729 -238180 14926 -206221
$$ packed form
19273a46141c7880o7289l12389J93081A45848a68313H4090a49420m6745b156B7023
19261f6874D8849L57177g3382k42847J08025G2127j2473h7148k53490L1551i8739
19249A57102b33290C890c20203L9682J16644n0419A5329O1330K09720n7094c5697
19237G5362a17734a1174k20904N9073j24948F9930a34162n1787j08390G4286a53590
19225A02730b14023A15170C5277b76163D8715R5577l3673c08890a24076A33641
19214A00568c04989c7771B80889F503b98691i0389r5959R345C4680a31370k62245
19203c93615J21987i5870A91027r4516c34591a45272c1428E9333k3345a8824k04598
19192b23422B2555d9074A44621d02098a03010B6397A2250L8479b38180A4926b06221
$$ plain form
19180 -215087 408060 -196519 57793 -141283 8708 -143369 -60244 -88435 47768 135074 -235514
19168 -203782 149259 20358 112559 -271747 139810 123296 -8525 -193384 -239963 -163735 100659
19156 -7384 305654 158230 70322 -248862 65854 72731 -294873 -246937 189085 140529 -117108
19144 -309419 -21318 -206332 -6225 -240116 -185267 -105087 -252368 61277 -101186 -289506 -125532
19132 65993 -265968 21227 216257 -115716 -42538 -271830 -163117 -301297 -262175 -214749
19122 -214749 313539 -33169 -28375 -143552 -285659 -102375 182128 -177014 -426011 -183635
19111 -164723 -160619 20971 -304621 -76841 -276117 120244 -201556 368011 -67946 -78773 -49280
19100 -49280 20750 -74009 -25374 -374651 -22257 16296 22870 -2662 223589 88636 176414 -216622
$$ packed form
19180b15087D08060a96519E7793a41283H708a43369f0244k8191D7768Q7306b35514
19168b03782A49259B0358R2201b71747A39810j6514h525j84859m6579P6228A00659
19156g384C05654j47424G0322b48862F5854O877b94873M7936A89085m8556a17108
19144c09419b1318j85014f225k33891N4849Q0180j47281F1277a01186j88320a25532
19132F5993b65968B1227J95030a15716d2538k29292J08713j38180L9122M7426
19122b14749C13539c3169M794j15177j42107a02375A82128a77014k48997a83635
19111a64723M104B0971c04621g6841j99276A20244b01556C68011f7946j0827K9493
19100d9280B0750g4009b5374l49277b2257A6296O574b662B23589H8636Q7778b16622
$$ plain form
19087 -134568 195407 12979 243821 -172283 -28802 -45575 -41351 -17154 -1469 66693 -254563
19075 -105075 -88917 13937 -23727 142833 -164949 20540 -195607 -160246 -5312 74120 -95306
19063 -190955 -210721 17367 -221067 -141666 13014 -385401 95577 109039 69707 -23574 250033
19051 239129 34564 -165475 234415 -106144 -51903 -144024 100718 -224857 -141276 26586
19040 214602 141175 -39408 -22216 48 -384597 -37582 282494 -55571 -232686 76748 69222 -82502
19027 29861 35030 310371 -118972 -138195 -24449 -275739 217839 -68061 -98677 -26127 -351310
19016 -351310 -48848 42610 8153 -25027 -98126 -48816 -126194 -125487 133943 -226320 -100663
19004 -133391 -230345 -354469 -405287 132507 -201667 -44984 -136993 -91077 -41508 -161282 -38256
$$ packed form
19087a34568A95407A2979K30842a72283b8802j6773M224a7154a469F6693b54563
19075a05075J6158A3937b3727A42833a64949B0540a95607L5361e312G4120i5306
19063a90955j9766A7367b21067P9401A3014c85401I5577J3462l9332b3574B50033
19051B39129C4564a65475B34415a06144e1903r2121A00718b24857Q3581B6586
19040B14602p3427c9408J7192D8c84597c7582B82494e5571j77115G6748p526h2502
19027B9861N169K75341a18972j9223b4449k51290B17839f8061l0616b6127l25183
19016c51310d8848D2610H153b5027p3099d8816p7378P07A33943b26320a00663
19004a33391r6954j24124n0818A32507b01667d4984r2009M5916d1508j19774c8256
$$ plain form
18992 19489 30772 345817 138530 -27887 -29023 -275914 -5063 29760 -229399 -73905 298855
18980 -323285 -97285 -34824 -126219 214292 -324548 -132404 -364521 -275048 9228 -312767 -163636
18969 -163636 -91699 185869 60613 34841 374277 -33226 158678 -258804 -137904 145196
18958 -98262 -92014 -66888 -174292 -71314 -27707 139943 -8338 -293308 -69179 69606 -353236
18946 -328891 77103 83645 -139663 -286594 -108467 82595 251583 -188785 77814 -268611
18935 -38949 -371846 164138 -102191 -20578 -150179 -71500 44638 -96246 145070 -122268
18924 -27867 -26667 55017 -109935 -15237 -181529 54526 -50088 48663 -66244 -341149 -133036
18912 -286467 -89072 47820 43606 174007 166813 63386 -231694 173709 -258354 -131521 -66164
$$ packed form
18992A9489J1283L15045A38530b7887j136k46891e063B9760b29399g3905B98855
18980c23285i7285c4824r1395B14292c24548a32404k32117Q9473I228c12767J49131
18969a63636P1937A85869F0613k5772L39436c3226A58678b58804J20900A45196
18958i8262O248K5126j07404g1314b7707A39943h338k84970f9179F9606c53236
18946c28891G7103O542a39663j46931a08467H2595J68988a88785G7814b68611
18935c8949l32897A64138a02191b0578j29601g1500D4638i6246A45070a22268
18924b7867J200E5017a09935a5237j66292E4526e0088D8663f6244k74905a33036
18912b86467h9072D7820m214J30401p194F3386b31694A73709b58354J26833O5357
$$ plain form
18901 -66164 -55735 201630 45667 15137 -164668 83497 -76674 -37203 265459 -101802 -191594
18890 -191594 226084 -17041 54401 114099 -5641 -85802 -13596 -21866 -132278 -376028 -154739
18878 -70473 -54441 -67964 277250 -138133 31743 403876 -29332 -188776 225234 -280707
18867 -7796 -42716 19722 -26166 -264607 -113724 -186348 -84956 -195687 87526 175614 11648
18855 -121898 111475 100624 22041 -43109 -173804 58721 341279 -271468 -8636 105105 -198912
18843 -223696 85448 -176059 56201 150156 -136564 -38371 -180897 -42279 -30910 90614 -159483
18831 -280748 85132 -236961 -165786 -203062 -97293 -134208 -155425 -21072 315922 -117814 -166855
18820 -166855 63497 104821 -143743 -180602 -276498 -46255 -253091 301941 -51105 -151355 84852
$$ packed form
18901f6164J0429B01630D5667A5137a64668H3497g6674c7203B65459a01802q9792
18890a91594B26084a7041E4401N9698e641q0161a3596q270j10412k43750a54739
18878g0473J6032j3523B77250a38133C1743L72133b9332j59444B25234b80707
18867g796l4920A9722b6166k38441a13724p2624h4956j10731H7526Q8088A1648
18855a21898A11475j0851B2041d3109j30695E8721K82558b71468h636A05105a98912
18843b23696H5448a76059E6201R3955a36564c8371j42526d2279J1369I0614a59483
18831b80748H5132b36961P1175l7276i7293l6915k1217b1072C15922a17814m9041
18820a66855F3497M1324a43743l6859r5896d6255k06836C01941e1105j00250H4852
$$ plain form
18808 -45990 -105635 81652 -180229 -223887 197942 -55556 65661 -68256 123725 -180617 -62724
18796 221468 36367 -162808 -37469 -20672 116373 -16621 -356564 -67411 -59128 -208189 122665
18784 -10400 -198678 30725 33230 45160 18705 237927 112250 -353015 117000 -467148 77649
18772 -222200 72693 79106 -352454 111622 351875 -104088 -285174 50767 -155917 -205321
18762 -205321 -67609 161953 37334 -28105 101953 36894 137021 -118185 50159 68257 -59965
18750 168403 134429 -268601 -57161 31288 95726 -321171 -56042 -376790 -280689 -177567 113123
18738 -328635 156544 82641 -205171 94307 -15918 248695 121936 -120095 34556 64963
18728 64963 83838 -135034 -199637 128193 -225995 -119560 -15888 -103853 -205639 -53675 -105393
$$ packed form
18808d5990n9645H1652a80229m3658A97942e5556F5661f8256A23725a80617f2724
18796B21468C6367a62808c7469J6797A16373a6621l39943f7411Q283j49061A22665
18784a0400j88278C0725K505J1930A8705K19222A12250c53015A17000d67148G7649
18772b22200G2693O413c52454A11622K40253a04088j81086E0767a55917m9404
18762b05321f7609A61953C7334b8105A01953C6894J00127a18185E0159J8098e9965
18750A68403l3974b68601e7161C1288O4438c21171e6042l20748R6101J03122A13123
18738c28635A56544p3903b05171I4307a5918B48695A21936a20095C4556L0407
18728F4963J8875a35034o4603A28193b25995J06435a5888q7965j01786e3675n1718
$$ plain form
18717 -105393 8311 -199018 -11675 -100686 77354 -7283 -232937 -185119 68038 75552 -2261 324177
18704 -21957 -54731 -262373 -277165 57253 297417 204916 -16866 -14981 -28331 -198445 65901
18692 -335936 -59722 78571 173124 -13698 219174 -123259 -11441 84934 -147106 -42565 154791
18680 -5301 123207 -110061 -302028 -434769 -30031 147639 -72740 -64861 223269 -121765 143520
18668 -152422 65413 -183573 -120135 -66080 -179061 217396 -210325 -8835 -226541 -142020 -110215
18657 -110215 -256393 168793 -233035 -216915 -57236 -1544 114915 -491706 -298885 33594
18646 -156881 -208730 -160004 -145603 118163 -105646 237869 2752 -340684 -340271 83453 -52677
18634 -310747 215915 -294181 -119918 -73571 49814 149212 -432436 -263917 -63740 -100361
$$ packed form
18717a05393H311a99018a1675q9011G7354g283k25654M7818F8038P514b261C24177
18704b1957l2774k07642j4792E7253K40164r2501a6866J885j3350j70114F5901
18692c35936e9722G8571R4553a3698B19174a23259a1441H4934a47106d2565A54791
18680e301A23207a10061j91967j32741c0031A47639g2740P879B23269a21765A43520
18668a52422F5413a83573O3438N4055j12981B17396b10325h835k17706Q4521L1805
18657a10215j46178A68793b33035J6120e7236a544A14915d91706J92821C3594
18646a56881n1849M8726J4401A18163a05646B37869B752c40684M13H3453e2677
18634c10747B15915b94181a19918M6347D9814R9398d32436J68519f3740l6621
$$ plain form
18624 -100361 -54543 -215172 33738 186026 -96571 -271428 -37706 71552 91181 -110632 -109256
18613 -109256 -93255 -18884 -302347 -287971 52063 -311331 -230586 -218337 -183745 -502384 -110757
18601 272901 -9638 -121569 -143919 -243486 172648 -33731 11160 -107359 12166 153507 -207383
18589 12579 9219 -407501 210443 274551 208740 277426 -165290 -229632 -204349 198303 140354
18578 140354 -34754 -281657 152465 -139505 149951 -17777 164588 -257627 -135434 213601
18567 142326 -275307 -281054 -27678 -32351 107550 136319 -354226 -320706 78142 -12847 143634
18555 59805 99077 51189 -128597 257170 -302276 26621 -36064 -146762 150043 309850
18545 309850 30629 -164820 -114875 -280818 -234637 -37209 48305 17698 -203744 61742 30609
$$ packed form
18624a00361M5818j60629C3738J52288i6571j74857c7706G1552J9629a10632J376
18613a09256J6001a8884k83463J4376E2063c11331Q0745J2249L4592l18639a10757
18601B72901i638j11931k2350r9567A72648c3731A1160a07359A2166J41341b07383
18589A2579l360d07501B10443O4108o5811O8686a65290o4342K5283A98303n7949
18578A40354c4754k46903A52465a39505A49951a7777A64588b57627J22193B13601
18567A42326b75307n747b7678m673A07550K8769c54226L3520G8142a2847A43634
18555E9805L9272m7888a28597B57170c02276B6621c6064j10698A50043J59807
18545C09850C0629a64820M9945j65943M6181c7209D8305A7698b03744F1742C0609
$$ plain form
18533 145222 -114951 -44516 -229458 210473 -162763 223282 402111 -476253 32614 -47053
18522 -106930 -336740 -143 -200074 208235 -26248 -168437 160762 -155712 72408 -117119
18511 -322080 -240738 90865 -290577 4355 142535 -122755 106743 -67292 -157171 65239 -50104
18499 -351676 90399 -23618 211885 93888 -90788 19373 13554 304611 25537 -47162 366728
18487 33946 51419 -73800 -56917 17410 83449 17442 -41784 72704 -217820 100975 -88075
18475 122510 -221214 -55757 -67767 -42514 176247 85709 -42058 34170 -86505 105372 -35764
18463 -85994 161780 65876 -437741 35419 87398 71225 -307428 -298615 -97265 -173693 93441
18451 102878 -294292 75168 -394213 200743 -179359 -11281 -49169 61189 -42933 40512 -421066
$$ packed form
18533A45222a14951d4516j84942B10473a62763B23282J78829d76253C2614d7053
18522a06930k29810a43j99931B08235b6248j42189A60762a55712G2408a17119
18511c22080Q1342I0865b90577D355J38180a22755A06743f7292q9879F5239e0104
18499c51676I0399b3618B11885I3888i0788A9373n819K91057B5537d7162C66728
18487C3946J7473g3800J6883A7410O6039A7442d1784G2704b17820A00975h8075
18475A22510b21214e5757j2010K5253A76247H5709d2058C4170h6505A05372c5764
18463h5994A61780F5876d37741C5419N1979j6173c07428Q813i7265p6428I3441
18451A02878b94292G5168c94213B00743a79359a1281l7888F1189d2933D0512d21066
$$ plain form
18439 -15536 -361759 -172423 -175779 -31537 -237017 -53373 74534 -305268 67607 -455741 132692
18427 18842 362633 -195952 273300 -232705 -328576 184904 162879 85109 425 -11446 -57166
18416 -57166 80871 58109 -20800 296103 -234009 -119158 158437 45023 -201513 -234720 -114568
18404 -83822 36538 -66723 3303 25976 -246591 236548 -213482 -150256 -103119 77264 185247
18393 185247 159647 -96291 147052 95216 -102455 -126264 -133530 -64621 -207291 -360249 -82635
18381 -6427 -139379 152001 164998 -70781 -2723 -233443 61869 52566 -276560 -39262 -324617
18370 -324617 -51581 101254 -25233 57607 -166491 328338 -90400 284066 -97590 -89817 -148222
18359 -148222 -27730 -13336 124458 142867 -195624 170322 -114587 115849 -157152 -100385
$$ packed form
18439a5536l46223a72423l356c1537k05480e3373G4534c05268F7607d55741A32692
18427A8842L43791a95952B73300b32705r5871A84904k2025p7770D25a1446m5720
18416e7166H0871k2762b0800B96103b34009J14851A58437D5023b01513l3207a14568
18404h3822C6538f6723C303K2673b46591B36548b13482O3226M7137G7264J07983
18393A85247k5600i6291A47052n1836a02455k3809p266f4621j42670j52958h2635
18381f427j32952A52001J2997g0781b723k30720F1869r303b76560c9262k85355
18370c24617e1581A01254b5233E7607a66491C28338i0400B84066i7590P773n8405
18359a48222b7730a3336A24458J8409a95624A70322a14587A15849a57152N6767
$$ plain form
18349 -100385 -336650 -246354 -274274 -24795 -214246 31790 -378169 -203204 -26391 -96261 155244
18337 250511 -170971 3849 -65194 -201952 204010 25613 -363175 212516 -11391 126243
18326 -307300 -347550 -144575 308704 -350953 300605 137860 -295710 -297055 -64122 -189459
18316 -189459 -90764 -143815 -297839 -127922 -8891 -62001 -212437 -105851 -114736 125766 -49107
18304 18419 369539 -192767 73278 -304088 -147595 -123216 -74779 178502 12783 2409 -202911
18292 -96271 223237 -3152 261153 -48941 79993 -197281 70218 -54642 51102 111188 -108729
18280 13445 9726 -32982 -54224 -164052 -207485 108855 -142931 976 -213569 62931 -88704
18268 -100988 -134753 142797 -72694 -281084 67201 -265822 -48102 48852 139797 -116851 42597
$$ packed form
18349a00385k36265R0296k7920b4795j89451C1790c78169J74965b6391o9870A55244
18337B50511a70971C849f5194j36758B04010B5613c63175B12516a1391A26243
18326c07300m0250a44575C08704c50953C00605A37860b95710j345f4122j25337
18316a89459i0764n3051j54024a27922h891n3110j50436a05851q885A25766d9107
18304A8419L51120a92767G3278c04088a47595K4379M8437A78502A2783B409b02911
18292i6271B23237c152B61153d8941G9993a97281G0218e4642E1102O0086a08729
18280A3445l719c2982k1242j09828m3433A08855a42931I76b13569F2931h8704
18268a00988l3765A42797g2694k08390F7201b65822d8102D8852R0945a16851D2597
$$ plain form
18256 93359 -46072 28548 -345974 -35688 7988 -10638 96189 -79787 -66396 7897 -260878 21625
18243 258119 -143419 -180756 -39834 169788 104018 57764 -2341 -264154 -304702 -54328 128979
18231 -254742 50356 117629 -27290 233226 -273857 101391 39376 164356 -48996 -44915 6633
18219 169404 113819 2640 69079 105486 134980 265096 -89350 -87874 -311155 -89227 -234427
18208 -234427 -287171 27998 185161 -312228 21103 -84984 115045 135869 274261 -193001
18197 158703 -250245 -157464 69198 141296 53151 -105223 263750 -64442 46151 -25289 -72876
18186 -72876 -405658 120323 -303493 -43399 -39864 104692 -8840 95988 86791 -300978 24996
18174 141771 -123696 53408 -37815 199328 -289010 -188697 -94352 -204136 265113 -311935
$$ packed form
18256I3359d6072B8548c45974c5688G988a0638I6189g9787J3391G897b60878B1625
18243B58119a43419l7337c9834A69788o5770m6254b341k61813m0548e4328A28979
18231b54742E0356O7273b7290B33226b73857A01391C9376J24980d8996M081F633
18219A69404n5585B640O6439L6407K9494J30116h9350J476k23281h9227j45200
18208b34427n2744B7998J57163c12228B1103h4984A15045K0824J38392a93001
18197A58703b50245R2781F9198P2098E3151a05223B63750f4442D6151b5289m7587
18186g2876l32782A20323c03493d3399L535A04692h840I5988r197c00978B4996
18174A41771a23696E3408c7815A99328b89010J00313R4345j09784B65113c11935
$$ plain form
18163 -212686 -142516 -76250 42479 81957 -170989 -155284 -50986 -1180 -125701 -67761 -141549
18152 -141549 210243 63554 8167 4047 7307 16233 -90232 -44528 -237339 164757 -120249
18140 149302 35573 58661 -34034 164880 155186 53517 -74625 -184607 -29039 -218777 -297899
18129 -297899 -232937 142238 71276 -25669 -114720 18599 -50641 67637 -300489 99214 -67912
18117 -245081 119179 189486 279447 -133210 -160721 -18402 74795 193441 -62178 -75720 -111921
18106 -111921 151319 40075 -59015 -34170 24697 -365312 153236 -307577 -322423 -223925 140798
18094 -89278 215388 -148847 -119243 18177 62212 -106894 -58412 -194579 -75457 -134827 290961
18082 47771 91034 242999 -116766 6518 -40519 -261467 8754 -399382 43804 -290626 -2082
$$ packed form
18163b12686P0170O6266D2479L9478a70989J5705e0986a180j24521N7940p3788
18152a41549B10243F3554H167D047L260Q926i0232d4528j92811A64757a20249
18140A49302C5573K3088c4034A64880r694E3517g4625j09982b9039j89738p9122
18129b97899O4962A42238p0962b5669q9051A8599e0641F7637c00489I9214f7912
18117b45081A19179P0307Q9961a33210k7511a8402G4795J18646f2178j3542l6201
18106a11921A51319D0075e9015K4845B4697c65312A53236c07577j4846R8498A40798
18094h9278B15388a48847K9604A8177M4035a06894M8482j36167g5457n9370B90961
18082D7771M3263J51965a16766F518d0519k20948H754c99382D3804b90626b082
$$ plain form
18070 206088 120420 -172323 81486 207193 242642 155471 -262938 113690 5169 -20220 228882
18058 -220096 -405428 -141068 -196435 -242488 18533 21937 39629 -169814 154170 -204427 3393
18046 -169665 -76749 27963 193691 -87801 351813 8021 -136235 -88218 79573 18311 -206923
18034 -125088 -111601 234991 -29236 -142656 -138520 93774 -40517 134305 126930 -108889 265872
18022 -208333 -218431 -20958 -1928 1576 59497 -107294 -136220 44762 52063 78025 -36969 -688
18009 -254764 -186882 -44499 57430 -320376 -310721 -54587 76480 204267 94080 -341735 65014
17997 -33409 -8099 -26764 46222 -146733 239772 15595 34760 -186385 -56677 -17796 -176062
17986 -176062 209577 93988 -95559 -293911 -147148 -160766 93852 -69572 -130429 -264673 -142220
$$ packed form
18070B06088q5668a72323H1486J25707L5449q7171b62938A13690E169b0220B28882
18058b20096j85332a41068n5367m6053A8533L404J7692a69814A54170b04427C393
18046a69665g6749B7963J65728h7801C51813H021a36235M8017G9573A8311b06923
18034a25088J3487B34991b9236j13420M136I3774d0517A34305p375a08889B65872
18022b08333j0098b0958a928A576N7921a07294k8926D4762P301K5962c6969f88
18009b54764O7882d4499E7430c20376R655e4587G6480J27787I4080c41735F5014
17997c3409h099j8665D6222a46733B39772A5595J9165a86385e6677a7796j58266
17986a76062B09577I3988i5559j98352J46763j3618I3852f9572o0857j34244J22453
$$ plain form
17975 -142220 -295775 -31248 153867 -280693 17606 -15685 39103 4931 -29843 29790 20630
17964 20630 -450119 1438 -346399 -73395 -147100 -1985 -151406 -19352 -46609 32360 -126718
17952 -188027 -237458 40455 -24857 108442 42335 52525 -43486 71760 74619 -25349 109700
17940 -24241 363026 -267090 -115658 -102186 -252570 136615 -133653 -136927 -207779 62867 -157740
17928 -190078 -31730 -109719 -250982 71227 239063 45588 -124464 106961 202336 -33298 -94237
17917 -94237 430557 11039 -93940 -57681 -199118 -30979 -7831 -244375 52923 -130340 -75732
17906 -75732 -28247 64717 -14110 268847 -31476 80703 -102586 -56732 265315 235115 242235
17895 242235 336674 -84645 -243313 -50196 -79303 -85174 103341 -138937 -13936 -19603 -284162
$$ packed form
17975a42220j53555c1248A53867b80693A7606a5685C9103D931b9843B9790r160
17964B0630d50119A438c46399g3395p3705a985j49421a9352k7257C2360a26718
17952a88027m9431D0455b4857A08442D2335J0190d3486G1760K859b5349A09700
17940b4241C63026b67090a15658J3472j50384A36615a33653l274p0852F2867a57740
17928a90078c1730p7989j41263G1227J67836D5588a24464A06961R5375c3298o0939
17917i4237D30557A1039i3940L6259j41437c0979g831k36544E2923a30340N4608
17906g5732b8247F4717a4110B68847c1476H0703a02586M5854B65315l0200P120
17895B42235R4439h4645j58668e0196k9107n871A03341a38937a3936n667k64559
$$ plain form
17884 -284162 -340878 148841 10572 -183973 -127301 -87953 -40631 189668 -123778 310726
17873 -84276 216573 -8155 -64803 -68834 -55536 84847 -127979 287119 -150531 -357382 -20055
17861 -223107 86175 -85437 76761 309157 272360 65792 66550 149764 249752 -151599 -150017 48576
17848 -19353 -45337 -268908 -127907 187466 -80351 151097 -269195 -169108 27683 -158658
17837 300592 224063 -73469 21615 74271 -30530 245950 -11708 -13553 -30414 437284 140917
17825 -83099 39959 89505 32218 -82999 170029 46432 -81172 102150 -37628 -162793 68173
17813 -189468 -12354 -93191 -94016 50668 143701 -247493 92547 234691 135265 -340693 -190360
17802 -190360 -80937 -285248 50326 -111400 -238258 194115 -34390 -9728 120107 -138559
$$ packed form
17884b84162n6716A48841A0572a83973N6672L9348d0631A89668a23778C10726
17873h4276B16573h155n6648m031J3298H4847a27979B87119a50531k06851b0055
17861b23107H6175h5437G6761K32396l6797F5792P58Q3214R9988a51599J582D8576
17848a9353k5984k23571a27907A87466h0351A51097b69195J00087B7683a58658
17837C00592p6529g3469B1615N2656c0530B45950a1708j845j6861D37284A40917
17825h3099C9959M9546C2218h2999A70029D6432h1172A02150c7628j25165F8173
17813a89468a2354q0837q25E0668R3033b47493I2547J42144r9426c40693J50333
17802a90360h0937k04311E0326a11400j26858A94115c4390i728A20107a38559
$$ plain form
17791 77543 -6691 -302987 261209 112649 -204483 -230137 -126445 63297 91576 36138 -259158
17779 -196364 -230871 205599 -34369 -80397 -110240 136319 5551 206608 -36735 -84359 152749
17767 30735 -155907 -9953 -17412 47934 6810 -73098 29209 -38041 108024 -26372 101674 167309
17755 167309 112537 -137366 202474 -266451 130065 216590 -7159 31867 165440 -96298 56611
17743 -69023 -182282 -139227 11071 19631 -156279 -43774 -68039 -42992 5197 118677 71865
17732 71865 -81971 -101370 -191237 -31500 84321 -70285 -5528 -50699 -43176 -149614 -56576 -137999
17720 -137999 -34750 331125 3614 -185123 250513 260877 -44097 168472 -296055 199228
17709 -67228 -242089 14080 -156651 -97489 43437 -23890 137798 -49611 -25156 -87984 36648
$$ packed form
17791G7543f691k96296B61209A12649b04483k5654J03692F3297K8279C6138b59158
17779a96364l4507B05599c4369m6028k9843A36319E551K01057c6735m7624A52749
17767C0735a55907i953p459D7934F810g3098B9209c8041A08024b6372A01674O5635
17755A67309n4772a37366B02474b66451A30065Q6525g159C1867J33573i6298E6611
17743f9023j13259M3055A1071Q560a56279d3774k4265K5047E197J13480m6812
17732G1865h1971j9399q9867c1500H4321g0285e528m5171P523j06438e6576q1423
17720a37999c4750C31125C614a85123B50513J0364d4097A68472b96055A99228
17709f7228j74861A4080a56651N9162D3437b3890A37798d9611K4455o2828C6648
$$ plain form
17697 292109 286424 104795 86217 -9513 -46648 -71100 -212506 237930 -39621 20074 162297
17686 162297 -241259 -78716 428198 -134768 37954 36381 -169679 245110 -94261 -109285 90474
17674 -80397 -230975 -243642 -135834 -124028 82632 -330217 123016 65907 -166216 -170990 -348271
17663 -348271 241831 -13591 370153 -293244 -186812 46420 80047 -26010 -94749 -338660
17653 -338660 133940 38438 26046 -219108 -213892 132513 -50472 -56071 419812 -41608 -262508
17642 -262508 247434 145959 143016 -224652 324360 371688 -227203 -19238 -69250 21801 328103
17631 328103 -164990 -810 -94153 162022 -210967 254761 -15015 -89648 167287 46612 200108
17620 200108 128647 134207 -215761 -21233 -18123 39177 -255124 318019 71661 -270166 98535
$$ packed form
17697B92109n685A04795j8578i513l7135k4452j41406B37930c9621B0074J42223
17686A62297b41259g8716D28198a34768C7954j573a69679B45110i4261j5024I0474
17674h0397j50578j2667J07808J1806H2632c30217A23016n7109a66216m774j77281
17663c48271B41831a3591C70153b93244J06432D6420L3627b6010o8739k43911
17653c38660A33940C8438j2392b19108N216A32513e0472n599D19812d1608k20900
17642b62508B47434j01475k943b24652C24360M7328b27203a9238n0012B1801L06302
17631C28103a64990h10r3343A62022b10967B54761a5015p4633A67287D6612J53496
17620B00108p1461N560b15761b1233L110C9177b55124C18019G1661b70166I8535
$$ plain form
17608 11834 158588 -103674 144214 513684 104073 24069 45319 -264635 199887 -100733
17597 -81461 67818 40725 -43014 -477879 12118 49082 -108076 252084 -164675 157274 22372
17585 114389 70624 -182949 -154516 107821 110891 -69872 -266884 -12857 -69190 -415020 -34995
17573 -20854 -94678 18133 104755 282706 -93676 129384 184369 78751 241054 -75948 34681
17561 -128948 37888 417311 -128591 100488 351545 319842 -272192 27016 63641 192919
17551 192919 -142287 19269 164711 410813 294214 -194079 359202 189271 219768 -59672
17540 102613 386959 -149806 -7250 249385 -13101 215125 204668 220856 -165241 -56617 -87965
17529 -87965 97244 117512 13063 180176 138517 33520 15553 -63145 -29615 -243088 171681
$$ packed form
17608A1834J46754a03674A44214L69470A04073B4069K1250b64635A99887a00733
17597h1461F7818k7093d3014m34865A2118L6964a08076B52084a64675A57274B2372
17585A14389m3765a82949K8433A07821L070f9872j97012a2857n6333l45830c4995
17573b0854p3824A8133Q6622J77951i3676A29384N4985G8751J62303g5948C4681
17561a28948C7888L79423a28591A00488K51057l1703b72192B7016L6625J29278
17551A92919a42287A9269J45442K46102j16599a94079C59202j69931L0497e9672
17540A02613K84346a49806g250B49385a3101B15125j0457J6188a65241e6617l1348
17529h7965I7244K0268A3063J67113m1659C3520A5553f3145b9615k13473A71681
$$ plain form
17517 -66248 -187575 -21688 397918 257799 -258445 94042 -195284 10529 189236 107929
17507 107929 -35949 -176286 115 -19018 -106845 212715 355111 57220 199176 -235387 -16402
17495 -19244 -61223 153515 120563 128717 124282 60655 35420 14662 52180 34653 139609 309463
17483 309463 -143606 286181 159409 -20876 141770 -30144 14863 185941 216177 -5482 -144232
17472 -144232 -214331 134484 61912 18947 264151 122782 158194 273639 458268 82869
17461 -39497 320228 258780 222168 219782 236946 101653 -9115 301566 181185 111879 293405
17450 293405 -219480 55721 108754 59202 105891 256061 -149992 -199583 224380 -21091 245989
17438 229370 433207 256381 292567 -71121 125067 457798 318890 41621 48246 241317
$$ packed form
17517f6248j21327b1688C97918j40119b58445I4042a95284A0529J78707q1307
17507A07929c5949j40337A15a9018q7827B12715J42396E7220J41956b35387a6402
17495a9244m1979A53515l2952Q154m435F0655k5235A4662L7518j7527J04956J69854
17483C09463a43606B86181j26772b0876A41770c0144A4863J71078L0236e482j38750
17472a44232p0099A34484F1912A8947K45204A22782L5412J15445J84629H2869
17461c9497C20228o1448l6612k386J7164A01653i115C01566j20381o9306J81526
17450B93405b19480E5721N3033m9552M6689J50170a49992m9591B24380b1091B45989
17438B29370K03837j76826L6186g1121A25067L32731j38908D1621O625J93071
$$ plain form
17428 241317 483657 412562 228355 231622 182766 -820 58139 278924 9629 66640 111248 253772
17416 253772 46353 509730 205649 226982 125766 219215 280299 99771 153855 206683 271712
17405 271712 160704 275510 245444 59572 145449 200617 160984 108523 425135 194983 -150993
17393 -340865 381310 -126007 16541 49914 338034 -212972 423656 100828 -298424 343560
17382 287775 14370 240725 372453 148926 361542 155207 155641 135660 185261 152439 110749
17371 110749 249686 423165 266172 -91046 26505 568807 389762 76099 318533 279691
17361 279691 246596 -194742 263514 74097 -86235 240519 -334560 68457 101316 -153254
17350 -307279 133767 311084 -111658 53174 201252 328016 28997 84185 171768 268271
$$ packed form
17428B41317K42340p1095j84207L267m8856h20E8139K20785I629N7011M4608J42524
17416B53772D6353M63377B05649K1333j01216R3449O1084I9771N4084N2828O5029
17405B71712j11008J14806l0066E9572Q5877N5168l9633n2461L16612A94983a50993
17393c40865C81310a26007A6541L3373K88120b12972D23656A00828b98424C43560
17382B87775A4370K26355J31728A48926K12616A55207M34j9981M9601l2822m1690
17371A10749J38937J73479j56993i1046B6505N42302j79045G6099K42434l8842
17361B79691l3095a94742B63514G4097h6235B40519c34560F8457L2859a53254
17350c07279A33767J77317a11658E3174J48078J26764B8997N5188Q7583R6503
$$ plain form
17340 268271 -105729 -27405 92078 40186 9217 -57282 385993 -13992 129227 -27537 -143064
17329 -143064 -90829 351124 288947 316364 48686 217219 -28474 102400 291065 244275 -33939
17317 63354 110713 459956 69228 32568 243141 -25397 7651 478802 -109983 48165 -51169
17305 543558 220738 72622 260031 46156 178572 27440 272598 11280 235131 312889
17295 312889 -16964 100111 61370 380296 244330 -56395 373440 135987 80870 337558
17285 337558 -69786 133083 130237 -207461 351712 -139914 345055 228902 -22593 363041
17274 197146 -15562 243348 -102116 206816 -85988 12763 134737 113371 -80666 277827
17263 364972 82938 201910 478163 141302 -62753 492115 352747 275336 313457 377656
$$ packed form
17340B68271a05729b7405I2078D0186I217e7282C85993a3992A29227b7537j15527
17329a43064N2235C51124o2177K7417D8686J68533b8474A02400J88665m6790c3939
17317F3354M7359L49243F9228C2568K10573b5397G651M71151a09983D8165e1169
17305E43558B20738G2622J87409D6156J32416B7440K45158A1280K23851P7758
17295C12889a6964A00111l8741L18926j35966e6395C73440A35987n5117K56688
17285C37558f9786A33083k846b07461C51712a39914C45055j16153b2593C63041
17274A97146a5562B43348a02116B06816h5988A2763J21974k1366h0666B77827
17263C64972H2938J18972K76253A41302f2753D92115j39368p7411L8121O4199
$$ plain form
17253 377656 362675 137930 101674 116216 155199 32713 309140 475333 343768 32035 24445
17242 24445 455757 -220071 186205 280248 11801 -45600 -4344 1300 -132021 381578 271773
17231 271773 262631 239247 -169798 351544 290760 187256 -211094 291843 164174 162400 298616
17220 298616 213921 -15395 229257 -279840 13644 305840 90458 287330 262325 347855 169538
17208 297783 340 -92886 -10132 311946 565138 471581 403279 -107250 156752 405799 66498
17196 246651 -109792 338110 207822 301169 392813 28275 -59840 -46985 110110 213864
17186 213864 10215 136557 -121474 466890 116205 252608 17210 251315 463924 245166
17176 245166 223930 78212 331146 -37584 235414 345133 162159 252257 258333 185616 193518
$$ packed form
17253C77656j4981A37930l6256J4542L8983C2713K76427J66193j31565C2035p590
17242B4445M31312b20071A86205R4043A1801d5600d344A300a32021C81578j09805
17231B71773r142k3384a69798C51544o0784j03504b11094B91843j27669j774J36216
17220B98616q4695a5395B29257b79840A3644K92196I0458J96872k5005Q5530A69538
17208B97783C40i2886a0132C11946K53192r3557o8302a07250A56752K49047F6498
17196B46651a09792C38110j30288R3347R1644B8275e9840J2855A10110J03754
17186B13864A0215J26342a21474D66890A16205J36403A7210K34105K12609k18758
17176B45166k1236G8212K52934c7584B35414J09719A62159R0098O076p2717P902
$$ plain form
17165 193518 334345 446970 -19814 152531 398900 273491 147600 342701 243855 392042
17155 392042 140367 296291 372659 131089 -75167 313942 309349 563745 175898 199569
17145 199569 310170 101277 -19891 326806 491227 503507 236525 263801 17646 243062
17135 243062 115971 -16360 320081 -18092 142789 193730 8213 502061 16701 217496 141551
17124 141551 231246 443861 440872 265200 384466 421525 440600 250332 295223 346688 480603
17113 480603 386177 540402 230268 200736 189535 216522 606721 186042 145761 262762
17103 262762 410609 418234 -61945 370126 484510 185406 545224 216739 204093 14500
17092 446104 526886 295444 499775 463804 230363 581074 398075 191598 526455 224146
$$ packed form
17165A93518J40827J12625a9814A52531K46369j25409j25891J95101r8846J48187
17155C92042A40367J55924P6368A31089g5167C13942m593K54396A75898K3671
17145A99569J10601A01277a9891C26806J64421J2280B36525K7276A7646K25416
17135B43062A15971a6360C20081a8092A42789N0941H213M93848A6701K00795p5945
17124A41551Q9695K12615k989j75672J19266L7059J9075j90268M4891N1465J33915
17113D80603r4426J54225B30268k9532j1201K6987L90199A86042m0281J17001
17103B62762J47847P625f1945C70126J14384A85406L59818B16739j2646A4500
17092D46104Q0782k31442K04331l5971B30363L50711j82999A91598L34857B24146
$$ plain form
17081 349214 223377 102353 364195 195838 236072 687416 265621 188129 375914 573934
17071 573934 434551 338013 82222 485540 247499 531214 590814 339477 504237 379034
17061 379034 405782 342723 167179 117056 359314 541096 316429 495736 160499 294419
17051 294419 339619 435042 234262 335989 240930 532062 424779 226556 610079 299808
17040 377213 621460 367473 216956 246664 348701 580669 510309 421415 553794 220367
17029 392992 490033 415374 202867 391886 398958 403043 403113 118371 451383 428131 114256
17017 626739 453077 419323 754928 569066 107864 641168 494243 543905 317378 543793
17007 543793 801354 762242 456042 739259 518854 551336 767024 751161 817185 561496
$$ packed form
17081C49214j25837A02353K61842j68357M0234M51344B65621p7492J87785J98020
17071E73934j39383r6538H2222M03318k38041K83715N9600k51337J64760j25203
17061C79034K6748o3059A67179n0123K42258J81782k24667J79307A60499J33920
17051B94419M5200R5423k00780J01727r5059K91132j07283j98223L83523B99808
17040C77213K44247k53987j50517K9708J02037K31968p0360q8894J32379B20367
17029C92992R7041p4659B02867J89019P072M085P0A18371L33012k3252A14256
17017F26739j73662l3754L35605j85862A07864N33304j46925M9662k26527K26415
17007E43793K57561l9112l06200K83217k20405L2482K15688j5863O6024k55689
$$ plain form
16997 561496 565372 907927 372165 474789 526390 678232 536947 648618 846626 208666
16986 677268 438814 573378 667547 277324 673731 901076 548999 856439 851982 666282
16976 666282 755096 869279 629526 938667 743210 606569 543854 921146 583687 938458
16966 938458 822736 646746 733040 885505 800839 819108 762919 791047 772922 681805 839212
16955 839212 800788 486067 712178 964785 790381 995504 901591 1134503 1129321 753950
16945 753950 847489 713691 823634 758277 655526 1021360 757250 1057858 883819 873928
16935 873928 653947 1133159 823073 893541 963235 1075907 1151250 938523 805122 1242279
16925 1242279 1009869 1002300 1239854 1249405 1022620 1235518 1247391 1046249 1081304 1183321
$$ packed form
16997E61496L876L42555C72165J02624N1601J51842j41285J11671J98008B08666
16986F77268k38454J34564R4169B77324L96407K27345l52077L07440m457j85700
16976F66282Q8814J14183k39753L09141j95457j36641o2715L77292l37459L54771
16966I38458j15722j75990Q6294J52465q4666J8269n6189K8128j8125r1117J57407
16955H39212l8424l14721K26111K52607j74404K05123r3913K32912n182l75371
16945G53950R3539j33798J09943o5357j02751L65834k64110L00608j74039r891
16935H73928k19981M79212l10086P0468O9694J12672P5343k12727j33401M37157
16925A242279k32410p569K37554R551k26785K12898J1873k01142L5055J02017
$$ plain form
16915 1183321 1257830 1252342 1075878 1332729 1186875 873394 1322212 1317525 1314453 1185485 1507194
16904 1507194 1142263 1556407 1287353 1463714 1409153 1515036 1718477 1158290 1648052 1522568
16894 1522568 1517193 1410417 1548668 1451499 1583701 1650800 1410734 1399328 1363948 1301227 1593180
16883 1593180 1655935 1468694 1566015 1809730 1698100 1718186 1677625 1270475 1588553 1819212
16873 1819212 1206641 1618079 1822046 2075298 1897361 1889091 2130950 2023060 1996418 1765892
16863 1765892 1858492 1522283 2189979 2019809 1926816 2361721 2196027 2065973 2107852 2684161
16853 2684161 2261252 2496836 2170962 2277100 2573864 2344749 2317404 2737784 2361688 2437063
16843 2437063 2818284 2711871 2878378 2494952 2787258 2726904 2771145 3181874 2952897 2964831
$$ packed form
16915A183321P4509n488j76464K56851j45854l13481M48818m687l072j28968L21709
16904A507194l64931M14144k69054J76361n4561J05883K03441n60187M89762j25484
16894A522568n375j06776J38251r7169J32202O7099k40066j1406l5380o2721K91953
16883A593180O2755j87241R7321K43715j11630K0086m0561m07150L18078K30659
16873A819212o12571M11438K03967K53252j77937q270K41859j07890k6642k30526
16863A765892R2600l36209O67696j70170r2993M34905j65694j30054M1879N76309
16853B684161m22909K35584l25874J06138K96764k29115k7345M20380l76096P5375
16843B437063L81221j06413J66507l83426K92306o0354M4241M10729k28977J1934
$$ plain form
16833 2964831 3164889 3015030 3050737 3310644 3072759 3051239 3382086 3888236 3625312 3699381
16823 3699381 3586762 3673945 3683760 3724189 3990765 4178388 3925974 4454811 4342294 4387880
16813 4387880 4265848 4662133 4778814 4794253 4750761 4790850 4718608 4642182 4962936 5396271
16803 5396271 5413859 5351436 5641401 5745295 5762968 6217935 5959742 6002398 6285480 6563056
16793 6563056 6860891 6525508 6631559 6862389 7451471 7219022 7242709 7817553 7939358 8071048
16783 8071048 8191886 8377693 8728482 8688147 9200168 9537864 9474546 9601935 9515735 10176855
16773 10176855 10588288 11037907 11310080 11483866 12027805 12044875 12360964 13184022 13330390
16764 13330390 13740710 14273801 14493441 14901450 15420042 16119438 16671868 17117568 17785111
$$ packed form
16833B964831K00058j49859L5707K59907k37885k1520L30847N06150k62924P4069
16823C699381j12619Q7183R815M0429K66576J87623k52414N28837j12517M5586
16813D387880j22032L96285J16681J5439m3492M0089p2242p6426L20754M33335
16803E396271J7588o2423K89965J03894J7673M54967k58193M2656K83082K77576
16793F563056K97835l35383J06051K30830N89082k32449K3687N74844J21805J31690
16783H071048J20838J85807L50789m0335N12021L37696o3318J27389q6200O61120
16773A0176855M11433M49619K72173J73786N43939J7070L16089Q23058J46368
16764A3330390M10320N33091K19640M08009N18592O99396N52430M45700O67543
$$ plain form
16755 17785111 18467018 19383021 19761404 20603439 21138691 22370154 22652636 24303302 25168448
16746 25168448 25569252 27068212 28180314 29095483 30345542 31932245 33595288 34722221
16738 34722221 36564313 38080740 40281532 42232039 44274015 46624922 49189197 51701991
16730 51701991 54822428 57609723 60901391 64351379 67919153 71922061 76361203 80836841
16722 80836841 85723035 90779096 96585849 102275014 108357696 114721396 121663344 128209021
16714 128209021 135393134 142066827 149266775 155849527 162307982 168004251 173528217 178004351
16706 178004351 181485469 183882877 185090350 185263905 183962740 181564228 178055340 173781838
16698 173781838 168592674 162641107 156023954 149211806 142360028 135036467 127814819 121183525
$$ packed form
16755A7785111O81907R16003L78383Q42035N35252J231463K82482J650666Q65146
16746B5168448M00804J498960J112102R15169J250059J586703J663043J126933
16738C4722221J842092J516427K200792J950507K041976K350907K564275K512794
16730E1701991L120437K787295L291668L449988L567774M002908M439142M475638
16722H0836841M886194N056061N806753N689165O082682O363700O941948O545677
16714A28209021P184113O673693P199948O582752O458455N696269N523966M476134
16706A78004351L481118K397408J207473J73555j301165k398512l508888m273502
16698A73781838n189164n951567o617153o812148o851778p323561p221648o631294
$$ plain form
16690 121183525 114178018 107646802 101379457 95415283 89950235 84223538 79574001 74905731
16682 74905731 70281663 66449960 62490289 59068815 55621926 52609927 49563991 47115609
16674 47115609 44421644 42029946 40067782 37735700 36061486 34114898 32767389 31024024
16666 31024024 29324396 28342538 26933545 25695110 24226721 23610098 22690848 21548530
16658 21548530 20607682 19743459 19289554 18297328 17590754 17095694 16346994 15914695 15534971
16649 15534971 14561937 14188385 13534789 13306269 13030704 12481973 12271069 11312445 11164597
16640 11164597 10678539 10736790 10359100 9848364 9597473 9278718 8952146 8920423 8856526 8516013
16630 8516013 8055675 7642936 7898371 7337043 7256609 7355805 7106985 6796056 6591738 6595102
$$ packed form
16690A21183525p005507o531216o267345n964174n465048n726697m649537m668270
16682G4905731m624068l831703l959671l421474l446889l011999l045936k448382
16674D7115609k693965k391698j962164k332082j674214j946588j347509j743365
16666C1024024j699628r81858j408993j238435j468389o16623r19250j142318
16658B1548530r40848q64223m53905r92226p06574m95060p48700m32299l79724
16649A5534971r73034l73552o53596k28520k75565n48731k10904r58624j47848
16640A1164597m86058N8251l77690n10736k50891l18755l26572l1723o3897l40513
16630H516013m60338m12739K55435n61328q0434R9196k48820l10929k04318L364
$$ plain form
16620 6595102 5890912 5923735 5930173 5966818 5888797 5426417 5329881 5338829 5206492 5041078 4811098
16609 4811098 4746805 4830724 4583337 4515675 4235776 4090029 4045434 3842661 4421886 4164221
16599 4164221 3679789 3824283 4030953 3453030 3808438 3290482 3463178 3492540 3468889 3246635
16589 3246635 2847765 3330823 2876983 3105005 3207419 3119859 2704884 2956336 2615169 3167620
16579 3167620 3104593 3104353 2373345 2530101 2388932 2731988 2441881 2458860 2523196 2492747 2374628
16568 2374628 2453649 2412756 2379450 1994211 2156391 2376735 2280472 1670350 1976320 2170317
16558 2170317 2103164 1932178 2139428 2048059 2065006 1650862 1799427 1951712 2181513 1500287
16548 1500287 1736086 1454485 1601380 1294568 1833857 1926009 1498535 1571213 1499731 1458021
$$ packed form
16620F595102p04190L2823O438L6645p8021m62380r6536Q948j32337j65414k29980
16609D811098o4293Q3919k47387o7662k79899j45747m4595k02773N79225k57665
16599D164221m84432J44494K06670n77923L55408n17956J72696K9362k3651k22254
16589C246635l98870M83058m53840K28022J02414q7560m14975K51452l41167N52451
16579C167620o3027k40p31008J56756j41169L43056k90107J6979O4336l0449j18119
16568B374628P9021m0893l3306l85239J62180K20344r6263o10122L05970J93997
16558B170317o7153j70986K07250r1369J6947m14144J48565J52285K29801o81226
16548A500287K35799k81601J46895l06812N39289R2152m27474P2678p1482m1710
$$ plain form
16538 1458021 1606558 1445249 1427648 1503193 1659118 1157270 1439943 1471384 1364922 1439875
16528 1439875 1503727 1434013 1272432 1458212 1337708 1282629 1285298 843676 1497321 1137328
16518 1137328 1167603 1184681 1146043 1337341 1253965 1049750 1092294 1181282 971575 1059074 926440
16507 926440 930636 1056252 836670 1072241 1014319 834958 1094768 1161520 864725 930444
16497 930444 849167 892222 945092 588525 1065945 911053 852669 936059 875890 830050 865178
16486 865178 761798 853558 998694 918712 728938 984061 665591 621519 837076 915620
16476 915620 665753 802854 506492 830147 698832 727295 480317 977149 482368 447860
16466 447860 588115 373365 616707 338564 902575 661889 530585 683495 556650 552380
$$ packed form
16538A458021J48537j61309j7601P5545J55925n01848K82673L1441j06462P4953
16528A439875O3852o9714j61581J85780j20504n5079K669m41622O53645l59993
16518A137328L0275J7078l8638J91298q3376k04215M2544Q8988k09707Q7499j32634
16507I26440M196J25616k19582K35571n7922j79361K59810O6752k96795O5719
16497I30444q1277M3055N2870l56567M77420j54892n8384Q3390o0169m5840L5128
16486H65178j03380R1760J45136p9982j89774K55123l18470m4072K15557P8544
16476I15620k49867J37101k96362L23655j31315K8463k46978M96832D82368l4508
16466D47860J40255k14750K43342k78143N64011k40686j31304J52910j26845m270
$$ plain form
16456 552380 566547 626373 562636 483509 500616 867813 619404 673037 251461 383460 686975
16445 686975 390230 193594 297062 331192 770912 688660 689320 488466 633433 809719
16435 809719 505969 627896 271058 385852 681623 466010 631419 348294 318056 246495
16425 246495 240079 535792 385598 540987 687769 341148 303673 338509 449053 444799 512778
16414 512778 505360 91748 624264 516236 295936 349098 195470 144794 535505 311231
16404 311231 340944 411845 384676 467508 127227 459996 381044 442304 238352 45673 414789
16393 414789 164199 334423 302380 391801 365899 348142 643093 202896 -22644 432788
16382 270795 280223 504893 459985 271545 225648 224962 108196 554900 244959 142367 339998
$$ packed form
16456E52380J4167N9826o3737p9127J7107L67197k48409N3633B51461J31999L03515
16445F86975k96745A93594J03468L4130M39720q2252O60k00854J44967J76286
16435H09719l03750J21927B71058J14794K95771k15613J65409k83125l0238p1561
16425B46495o416K95713j50194J55389J46782C41148l7475L4836J10544m254O7979
16414E12778p418I1748N32516j08028k20300N3162j53628n0676L90711k24274
16404C11231K9713P0901k7169Q2832A27227L32769p8952O1260k03952D5673L69116
16393D14789A64199J70224l2043Q9421k5902j7757K94951B02896b2644D32788
16382B70795R428K24670m4908j88440m5897o86A08196M46704B44959j02592J97631
$$ plain form
16371 339998 685203 303905 283983 415441 427838 353214 318360 351501 142973 516344
16361 516344 427377 336233 72993 245610 51863 227556 356192 331815 467606 38063 278081
16350 278081 313554 613963 361729 415090 -9413 488868 376458 350791 366763 239855 347745
16339 347745 299923 260900 267784 300343 149697 92645 439574 271441 452691 307677 202909
16328 202909 178222 378989 3270 495745 93528 283914 169915 195490 316606 218509 -148652
16316 366234 162545 431170 410704 475201 -162741 116181 78949 338909 230503 151247
16306 151247 33655 199262 448015 276032 505447 306573 -126734 -296284 43407 462861
16296 462861 97286 112641 213022 -75359 453671 63022 13206 104076 329033 88953 190938
$$ packed form
16371C39998L45205C03905j9922J31458J2397p4624l4854L3141A42973L73371
16361E16344q8967r1144G2993J72617E1863J75693J28636k4377J35791C8063K40018
16350B78081L5473L00409k52234N3361i413D88868j12410k5667J5972j26908J07890
16339C47745m7822l9023O884L2559A49697n7052L46929j68133J81250j45014j04768
16328B02909k4687K00767C270M92475I3528J90386j13999K5575J21116r8097a48652
16316C66234A62545K68625k0466O4497a62741A16181l7232K59960j08406p9256
16306A51247C3655J65607K48753j71983K29415j98874a26734j69550D3407M19454
16296D62861I7286J5355J00381g5359D53671F3022A3206R0870K24957H8953J01985
$$ plain form
16285 190938 -14069 419109 334910 17980 445306 23113 -60353 -186381 49641 96477 501829
16274 501829 192098 24674 46422 177785 291456 -142310 276776 201281 94199 -20069
16263 55427 -8775 249197 50188 230169 -81356 290823 113705 -84554 83519 305929 220953
16252 220953 252770 380042 -127917 -27330 85042 143664 210310 133085 116598 325852 85985
16240 420243 264616 58118 -362266 -77476 137073 -176424 175428 95753 151499 192261
16230 192261 -60826 265014 -122565 98580 -70378 278345 -12836 51179 203425 344980
16220 344980 151996 263254 -75520 -55391 361689 200145 6371 201504 2725 246211 -13292
16208 518310 -11732 319108 -127721 143448 360308 -22331 -4007 233618 170039 40315 -264524
$$ packed form
16285A90938a4069D19109q4199A7980M27326B3113f0353j26028D9641M6836M05352
16274E01829A92098B4674K1748J31363J13671a42310B76776p5495I4199b0069
16263E5427h775B49197E0188J79981h1356B90823A13705h4554H3519K22410q4976
16252B20953L1817J27272a27917b7330H5042N8622O6646p7225j6487K09254H5985
16240D20243j55627E8118c62266g7476A37073a76424A75428p9675N5746M0762
16230A92261f0826B65014a22565I8580g0378B78345a2836E1179J52246J41555
16220C44980A51996J11258g5520K0129C61689j61544F371J95133B725K43486a3292
16208E18310a1732C19108a27721A43448K16860b2331d007B33618o3579D0315b64524
$$ plain form
16196 100828 152512 116954 181821 38621 -25865 139229 151384 212294 -8449 -283168 327805
16184 4226 198933 -41942 75477 -25660 96717 139336 -150023 53272 -95993 191592 98570
16173 98570 88960 -10598 -225550 -118125 -227123 315870 48684 104577 34797 298582 -37930
16161 95598 177127 122301 -230045 -54461 203441 -175147 32873 -38188 -270314 223216 -82646
16149 188495 -1361 6068 132781 -228557 261821 -14173 67729 136499 67988 -106505 -151102
16138 -151102 -165523 120095 38856 217678 -149336 -136353 -164817 -532939 114409 220375
16128 220375 -195185 103729 37612 -13472 -107183 -150946 -203697 -159652 -101780 176837 291081
16117 291081 -335911 71910 -188203 -22040 -52913 273293 -294884 306995 -127244 110892
$$ packed form
16196A00828N1684l5558O4867C8621b5865A39229J2155O0910h449k74719C27805
16184D226J94707d1942G5477b5660I6717M2619a50023E3272i5993A91592r3022
16173I8570r610a0598k14952J07425j08998C15870D8684N5893C4797K63785c7930
16161I5598Q1529n4826b30045e4461B03441a75147C2873c8188k32126B23216h2646
16149A88495a361F068J26713b28557B61821a4173F7729O8770F7988a06505m4597
16138a51102j4421A20095C8856J78822a49336J2983k8464l68122A14409J05966
16128B20375a95185A03729C7612a3472r3711m3763n2751M4045N7872A76837J14244
16117B91081c35911G1910a88203b2040l0873B73293b94884C06995a27244A10892
$$ plain form
16106 -9359 91171 264685 186025 26883 144053 94585 -175076 -293220 -107298 -24398 401975
16094 355583 -138000 -130453 317634 262046 -98916 -57259 117503 8865 -131623 148253 285166
16083 285166 167947 161769 271009 121744 -39600 -193472 -189698 -231751 106248 -260246 124723
16071 -165840 -97249 187762 214328 75808 -176472 -178373 247905 -195811 -51058 -79104 -139992
16060 -139992 96800 215078 -38978 -118101 31316 194850 -49018 -125013 -83653 -71821 -50774
16049 -50774 -234525 99561 -111216 59336 2900 47545 -94257 45224 219352 165767 -46067
16037 -185108 126854 -276947 114811 -131389 -284896 111677 80448 109296 -63363 -131435
16027 -131435 170240 -69038 -212971 134365 -87859 174799 88930 209716 -8759 44466 -83841
$$ packed form
16106i359I1171J73514p8660B6883J17170m9468a75076j18144a07298b4398D01975
16094C55583a38000P547C17634n5588i8916M1657A17503H865a31623A48253J36913
16083B85166j17219o178J09240A21744c9600j53872L774m2053A06248b60246A24723
16071a65840O8591A87762K6566G5808a76472j901B47905a95811e1058k8046o0888
16060a39992I6800J18278c8978p9123C1316J63534d9018p5995M1360J1832K1047
16049e0774j83751I9561a11216E9336B900M4645i4257D5224J74128n3585d6067
16037a85108A26854b76947A14811a31389j53507A11677l1229K8848f3363o8072
16027a31435A70240f9038j43933A34365h7859A74799q5869J20786h759D4466h3841
$$ plain form
16015 29776 82833 234960 3579 -50109 80381 39198 69971 -229380 -376493 -70563 72529
16003 -127104 109548 272641 -236886 115751 -126843 -127091 -114869 113612 106770 8942 -65608
15991 -55725 -46191 2613 -14387 -59697 -37280 252271 71235 -65097 346297 -27517 -198588
15980 -198588 84787 -13735 58397 -92235 195005 -124609 -134311 276603 -148049 88483 92577
15969 92577 -26653 287280 -140480 -40317 -87960 136718 34410 -46932 -17960 40013 65024
15958 65024 -117091 7632 -103411 4863 92463 -417241 62956 -87700 34984 151811 -219051
15946 -10309 -28837 397083 159036 122313 -209391 -247851 127118 -156326 -205745 -127744 3396
15934 -27656 127359 389911 -264714 34084 235039 134952 -80299 -50431 -109105 -423659
$$ packed form
16015B9776N3057J52127C579e0109H0381C9198L0773b29380j47113g0563G2529
16003a27104A09548J63093b36886A15751a26843k48J2222A13612o842H942f5608
15991e5725R534B613a4387m5310K2417B52271G1235f5097C46297b7517j71071
15980a98588H4787a3735E8397i2235A95005a24609r702B76603a48049H8483M094
15969I2577b6653B87280a40480d0317m7643A36718C4410d6932a7960D0013K5011
15958F5024a17091G632a03411D863Q7600d17241F2956h7700C4984J16827b19051
15946a0309j8528C97083A59036l6723b09391l8460A27118a56326m9419P8001C396
15934b7656A27359K62552b64714C4084K00955j00087h0299K9868n8674l14554
$$ plain form
15924 -423659 -27203 -45948 177249 -124540 -16582 -147904 260130 152433 -7716 -137424
15914 -137424 278873 173108 108719 230594 -158670 -145628 -70586 -39804 110091 -25661
15903 -46608 -284366 50629 -83207 237290 155057 -28290 -116302 -182449 -382918 -341230 -90337
15891 -97776 77126 -80243 -3025 -190015 -45365 153642 136876 -89785 158917 93735 -354490
15879 -148418 -32589 106819 -3830 132939 -21211 -42085 -114569 281395 246246 213739 -160641
15867 -143653 -70696 -277825 -162136 -274099 331533 115252 -229545 -232458 290932 -166676
15856 -202112 -257116 33423 -133694 57669 -17330 7474 155003 -271366 -225260 -71497 91230
15844 -205915 -36143 433732 -285830 -890 -79245 -77779 -337177 -67981 98367 -336964 -59046
$$ packed form
15924d23659b7203j8745A77249a24540a6582j31322B60130j07697g716j29708
15914a37424B78873j05765o4389J21875a58670J3042g0586L0782A10091b5661
15903d6608k37758E0629h3207B37290q2233b8290q8012o6147k00469M1688i0337
15891i7776G7126h0243c025j86990d5365A53642j6766h9785A58917o5182c54490
15879a48418c2589A06819c830A32939b1211k0874p2484B81395l5149l2507a60641
15867a43653g0696k07129J15689j11963C31533A15252b29545k913B90932a66676
15856b02112n5004C3423a33694E7669a7330G474J47529b71366M6106g1497I1230
15844b05915c6143D33732b85830h90p8355J466k59398f7981I8367c36964e9046
$$ plain form
15832 159921 278673 160864 -331482 23101 330681 320849 -144038 112263 -126903 -22378
15821 61828 35462 -51110 6792 41770 7852 -210558 -272084 100313 -92218 -160959 -424436
15810 -424436 277049 -490354 -7689 -228200 42748 76313 74424 -438084 -88946 -17217 -23503
15799 -23503 -208847 -224759 54666 -408387 -19968 -201203 -277290 -397468 -91860 -45279 207577
15787 -123320 -68602 -184489 -334240 -10341 -3367 -63640 -131200 -90810 -297143 -631 162646
15775 445161 189795 -75806 83435 105319 -8994 -25202 -139749 -26258 -5746 -121612 -125098
15764 -125098 -94880 -243690 -151494 148095 -162461 71307 20455 -48290 -162676 167468
15753 -28926 148453 46189 69776 -49101 -159666 -878 -64158 54751 -262788 237481 -6696
$$ packed form
15832A59921J18752j17809c31482B3101L07580r832a44038A12263a26903b2378
15821F1828k6366e1110F792L4978G852b10558o1526A00313i2218o8741k63477
15810d24436B77049d90354g689k20511D2748L3565j889d38084h8946a7217o286
15799b3503j85344j5912E4666d08387a9968j81235p6087j20178i1860d5279B07577
15787a23320N4718j15887j49751a0341c367o0273o7560M0390k06333f31A62646
15775D45161A89795g5806H3435K1884h994j6208j14547b6258e746j15866l486
15764a25098L0218j48810R2196A48095a62461G1307B0455d8290j14386A67468
15753b8926A48453D6189K3587d9101j10565h78o3280E4751b62788B37481f696
$$ plain form
15741 -3334 161215 -210597 -336787 113359 -111953 128814 160372 280004 -174546 -32296
15730 222427 52075 35091 22724 -504605 72246 -41517 -78430 944 -16166 -551032 -310564
15719 -310564 114015 102243 -17374 -7596 50657 154575 -30496 296964 64673 283297 -293775
15707 -103498 -292332 -234264 -346683 211141 -284716 -194325 18737 100493 -8049 -172719 127884
15695 122269 -439239 -84651 139259 126253 -210808 21423 -10996 201414 31748 71019 228400
15684 228400 -148466 57074 77854 -210327 -139187 -139779 -48730 -107192 39036 71923 91733
15673 91733 -73978 34971 188413 -177534 138415 -47253 -363794 -10365 168039 -65975 -9225
15661 -264848 -30511 -73061 207331 193519 -89493 52067 -257131 74862 -56815 -97257 191431
$$ packed form
15741c334A61215b10597j26190A13359a11953A28814L1558J19632a74546c2296
15730B22427E2075j6984j2367e04605G2246d1517l6913I44a6166n34866K40468
15719c10564A14015j1772a7374g596E0657J03918c0496B96964F4673K18624b93775
15707a03498j88834N8068j12419B11141b84716R0391A8737Q1756h049j64670A27884
15695A22269d39239h4651A39259j3006b10808B1423a0996B01414C1748L9271J57381
15684B28400a48466E7074K0780b10327P1140n92d8730n8462C9036L2887J9810
15673I1733g3978C4971J53442a77534A38415d7253l16541a0365A68039f5975i225
15661b64848c0511m2550B07331j3812h9493E2067b57131G4862e6815m0442A91431
$$ plain form
15649 9181 242206 145616 107184 158796 -108682 27867 282962 -19961 11064 -102737 -32851
15637 -10690 -279706 -263589 374449 -78021 -96400 -52028 130474 33179 -24618 88916 223149
15626 223149 -169351 171927 -50832 -280493 186291 -109 139377 -85412 -232967 -20301 45708
15614 -10874 -258580 93912 120774 -51408 -186027 22808 -83054 -35498 -100506 -200176 182884
15602 242745 -43906 -245504 203750 -82685 -68045 66360 -128483 -307578 -96901 -118593 111577
15590 119880 52050 -175396 94753 -219277 -168440 -11541 82894 87911 -243626 -76034 -41423
15579 -41423 -292767 -170658 -30226 -424745 -106816 -33442 293434 -51641 -31388 24685 15158
15568 15158 -87392 -18306 -368732 -75455 -95658 50097 266628 -106959 -162439 100711 -404942
$$ packed form
15649I181K33025r6590l8432N1612a08682B7867K55095a9961A1064a02737c2851
15637a0690k69016J6117C74449g8021j8379M4372A30474C3179b4618H8916J34233
15626B23149a69351A71927e0832k29661A86291a09A39377h5412j47555b0301D5708
15614a0874k47706I3912K6862e1408j34619B2808h3054c5498o5008r9670A82884
15602B42745d3906k01598B03750h2685J4640F6360a28483j79095i6901k1692A11577
15590A19880E2050a75396I4753b19277N0837a1541H2894N017b43626g6034L4611
15579d1423k51344J22109c0226l94519a06816c3442B93434e1641K0253B4685r527
15568A5158h7392a8306l50426g5455k0203E0097K16531a06959n5480A00711d04942
$$ plain form
15556 -542 304384 -7906 107053 -238723 -240975 -98237 62273 -140822 301757 109890 -3560
15544 186871 77460 111185 -18894 -7246 -78919 -195019 -114322 -89406 90828 -17025 -226066
15533 -226066 24177 -137550 253439 -247859 127426 120811 4589 -85836 -214228 94263 -8154
15521 -84986 -95275 -57400 -70303 -215855 -239025 -290180 224771 108916 10827 194484 223429
15510 223429 -203406 -143168 -81744 95499 -146186 -103413 91052 -150331 -72007 -130005 120627
15498 -152968 9950 124819 -150373 95273 -186966 41389 -213767 47506 -276113 -164785
15488 -164785 -163054 155455 85971 157472 -167857 -429305 -87535 118681 212446 -161109 -117485
15477 -117485 7359 100757 205797 -69307 -259384 -248973 181857 -96060 -64579 -61931 190212
$$ packed form
15556e42C04384g906A07053b38723k252i8237F2273a40822C01757A09890c560
15544A86871G7460L3725a8894g246p1673j16100Q0697K4916I0828a7025k09041
15533b26066B4177a37550B53439b47859A27426o615D589h5836j28392I4263h154
15521h4986j0289L7875j2903j45552k3170n1155B24771A08916A0827J83657K8945
15510B23429b03406O0238O1424I5499a46186M2773I1052a50331g2007n7998A20627
15498a52968I950J14869a50373I5273a86966D1389b13767D7506b76113J11328
15488a64785J731A55455o9484P1501a67857k61448h7535A18681R3765a61109M3624
15477a17485G359R3398J05040f9307j90077J0411A81857i6060L1481K648A90212
$$ plain form
15465 -242787 415112 94993 32253 -42147 230355 184574 -77129 -65271 -118257 -80282 -294293
15454 -294293 99968 34124 -67775 -215580 173526 -158476 -112092 -98076 -187525 -220041 -122726
15443 -122726 76792 276919 134620 120053 8455 107411 41573 -55328 15197 -44788 -122744
15432 -122744 155075 -152013 124937 55993 91129 75314 -126333 264174 43779 -229873
15421 310803 -145810 34877 272609 -15410 -83633 -202508 -247049 86144 -197861 -90862 74582
15409 -61988 -98987 -151379 -125515 -40241 212151 -172206 -326780 -16680 1588 -33370 -339385
15398 -339385 33013 -71327 4972 -105650 72076 -278475 -37308 -169523 -158498 292576 -272480
15386 33133 25225 85413 -211215 -492271 115884 56766 -273107 201586 -48062 299527 137826
$$ packed form
15465b42787D15112I4993C2253d2147B30355m5781g7129J1858n2986L7975k14011
15454b94293I9968C4124f7775j47805A73526a58476M6384J4016q9449l2516R7315
15443a22726G6792K00127A34620j4567H455R8956D1573e5328A5197d4788p7956
15432a22744A55075a52013A24937E5993L5136j5815a26333B64174D3779b29873
15421C10803a45810C4877K37732a5410o8223j18875m4541H6144a97861i0862G4582
15409f1988l6999n2392K5864d0241B12151a72206j54574a6680A588c3370l06015
15398c39385C3013g1327D972a05650G2076b78475c7308j32215J1025B92576b72480
15386C3133p908O0188b11215k81056A15884E6766b73107B01586d8062B99527A37826
$$ plain form
15374 -246116 61287 -58228 -220572 -62050 21489 -151973 52051 -132668 -188763 16383 308455
15363 308455 99325 -52716 -89798 109517 -162514 11934 314561 -81828 -101875 12566 132352
15352 132352 -67642 44805 -146855 16636 -29618 -248338 447774 13624 -25265 -46906 -146572
15341 -146572 -102269 121724 74831 27519 -271879 228772 -73479 41527 24092 26164 197384
15330 197384 -17687 120036 -83881 96938 69467 13361 4435 -158050 195557 279549 -237871
15318 410429 -25412 63714 225097 34489 272396 35976 90156 -122288 -364020 -500103
15308 -500103 296968 97071 87884 298278 80639 -59347 141173 33008 -7120 7100 100055
15297 100055 92805 84122 274973 -18047 10465 213799 -418 -77118 -210425 35164 92180 -208740
$$ packed form
15374b46116F1287e8228j62344f2050B1489a51973E2051a32668n6095A6383K92072
15363C08455I9325e2716l7082A09517a62514A1934L02627h1828k0047A2566J19786
15352A32352f7642D4805a46855A6636b9618k18720D47774A3624b5265k1641r9666
15341a46572M4303A21724m6893B7519b71879B28772g3479D1527j7435K072J71220
15330A97384a7687A20036h3881I6938k7471A3361D435a58050A95557Q3992b37871
15318D10429b5412F3714J61383C4489K37907C5976N4180a22288k41732j36083
15308e00103B96968I7071r187K10394H0639e9347A41173C3008g120G100R2955
15297A00055p250q683J90851a8047A0465K03334d18p6700j33307C5164N7016b08740
$$ plain form
15284 238392 263514 -34712 67404 -18754 323291 -87471 46819 40283 -76236 28478 163957
15273 163957 -232913 8666 190574 76151 -284612 172507 179079 -208507 166583 142158 -48361
15261 -96859 -263235 275255 -5388 324132 64153 -127335 -236913 -231720 46460 47439 -175719
15249 -148526 -358378 229541 -122633 -141279 -305429 227892 -15887 -4556 45999 220881
15239 220881 181261 283382 296423 600340 773868 971954 1135630 1086457 883561 625746
15229 625746 120549 49880 97065 264801 308176 -212712 -455335 152452 -106962 19694
15218 129441 -152304 165022 214745 223803 -77830 177650 88071 365975 91223 123667 231720
15207 231720 43977 -79166 48381 362905 155022 -235672 101334 -268996 -128798 26007
$$ packed form
15284B38392K5122c4712F7404a8754C23291h7471D6819o536g6236B8478J35479
15273A63957b32913H666J81908G6151b84612A72507O572b08507A66583k4425d8361
15261i6859j66376B75255e388C24132F4153a27335j09578N193D6460R79a75719
15249a48526k09852B29541a22633j8646j64150B27892a5887d556D5999J74882
15239B20881l9620J02121J3041L03917J73528J98086J63676m9173k02896k57815
15229F25746A20549D9880M7185J67736M3375b12712k42623A52452a06962A9694
15218A29441a52304A65022M9723R058g7830A77650H8071K77904I1223L2444J08053
15207B31720D3977g9166D8381L14524A55022b35672A01334b68996a28798B6007
$$ plain form
15196 20459 201137 -31845 201202 -195145 -14253 -183014 94717 386865 120021 319272
15186 319272 216721 180648 -16086 11484 243892 234917 118005 114592 219588 -294252 -12187
15174 409971 -305781 169676 -115778 -133549 -28675 247086 73001 17530 -40575 -61658 66230
15162 -23139 -135959 176224 125055 52047 28616 176521 392808 66568 113942 220668 -66408
15150 176243 85773 -2481 54493 95931 -323760 264166 218046 -170948 -72633 136309 327157
15139 327157 401280 -75190 76660 -175333 190988 132034 42735 25353 212656 226584 -71674
15127 -81593 170788 4624 -57941 -149695 443549 263275 -193643 107521 174284 189519 669381
15116 669381 -128042 302418 104202 216537 169252 238255 138724 195122 -15397 58359 149841
$$ packed form
15196B0459J80678c1845B01202a95145a4253j68761I4717K92148A20021J99251
15186C19272j02551l6073a6086A1484K32408q975j16912l413J04996b94252a2187
15174D09971c05781A69676a15778j7771b8675B47086G3001A7530d0575k1083F6230
15162b3139j12820A76224n1169E2047k3431J47905K16287F6568M7374J06726f6408
15150A76243H5773b481E4493M1438c23760B64166m6120a70948g2633A36309J90848
15139C27157P4123g5190G6660a75333A90988n8954D2735j7382J87303J3928g1674
15127h1593A70788D624e7941r1754D43549j80274a93643A07521O6763J5235M79862
15116F69381a28042C02418A04202J12335m7285O9003r9531N6398a5397E8359R1482
$$ plain form
15105 149841 133522 69342 278857 202633 152601 6706 300108 187894 193385 477629 85008
15093 80681 -77348 -46365 91475 228181 -71592 28643 208324 -77245 -28996 188128 26562
15081 71839 148237 65458 279252 236495 166770 324664 169421 100306 89870 20332 45487
15070 45487 329899 143040 394286 115066 300316 159187 153192 151594 86171 -75886 11801
15058 422313 -15823 -8127 164085 170620 25442 205094 103376 -131145 381279 56778 -2453
15046 -192695 3248 119889 55009 204574 213274 442328 186771 142913 507636 282526 445237
15035 445237 207191 231918 217851 469108 -19553 413239 94756 25439 180829 56893 209344
15024 209344 168877 163111 118734 424080 118990 396376 70723 89006 91651 67447 -104827
$$ packed form
15105A49841j6319o4180K09515p6224n0032F706K93402j12214N491K84244H5008
15093H0681g7348L0983I1475J36706g1592B8643J79681g7245b8996A88128B6562
15081G1839P6398F5458K13794m2757o9725J57894j55243o9115j0436B0332K5155
15070D5487K84412A43040K51246A15066J85250j41129n995j598o5423g5886A1801
15058D22313a5823P696A64085O535B5442J79652j01718a31145C81279E6778b453
15046a92695C248J16641E5009J49565Q700K29054A86771m3858L64723k25110J62711
15035D45237B07191K4727j4067K51257a9553D13239I4756B5439J55390E6893J52451
15024B09344m0467n766m4377L05346A18990K77386G0723J8283K645k4204a04827
$$ plain form
15012 264390 -236847 108768 134099 17092 243202 250098 143519 330196 -69434 45768 510899
15001 510899 307481 396815 155419 405287 269583 216494 129828 246831 186197 260114
14991 260114 -129299 241461 108296 55269 71464 129641 -111269 382901 416057 105804
14980 -176276 257717 65702 214447 136147 -64418 103328 -99543 246880 320285 -92058 158314
14968 355157 153303 320386 416875 307789 246697 446818 166606 214287 311301 30469
14957 273747 -86083 207443 422195 266923 224092 157828 280842 302321 94491 511598
14947 511598 491548 458147 35296 101915 361504 159986 410008 200773 223359 227573 321559
14936 321559 -189882 431228 38952 72127 148495 317984 75516 110287 -47647 -69046 210282
$$ packed form
15012B64390b36847A08768K5331A7092K26110O896j06579J86677f9434D5768M65131
15001E10899k03418Q9334A55419K49868j35704n3089q6666J17003o0634P3917
14991B60114a29299B41461A08296n3027J6195N8177a11269C82901L3156A05804
14980a76276B57717F5702J48745p8300f4418A03328i9543B46880P3405i2058A58314
14968C55157A53303J67083R6489j09086o1092K00121A66606M7681R7014C0469
14957B73747h6083B07443K14752j55272m2831o6264J23014K1479I4491M17107
14947E11598k0050l3401C5296O6619K59589A59986K50022B00773K2586M214R3986
14936C21559a89882D31228C8952L3175P6368J69489G5516L4771d7647k1399B10282
$$ plain form
14924 260619 490929 206618 56168 296572 545561 122766 319257 -113366 -15318 238095
14913 264526 217284 279278 325140 415319 224331 372733 448469 461631 620883 252200 86495
14901 173042 248890 109759 594332 676220 484019 365195 128584 618351 233420 -24362
14890 391074 405092 125321 355381 253605 116731 519917 29320 617544 342655 201136
14880 201136 146633 275196 292180 241925 266621 153721 297203 248170 441986 428954 470029
14869 470029 314000 122142 428422 449366 405006 301921 340672 84793 706875 371432
14859 371432 417904 203575 250141 264826 452032 400453 419418 247422 125917 187119 549193
14848 549193 301640 448340 267736 292330 507529 498021 301970 41810 120161 557886
$$ packed form
14924B60619K30310B06618E6168K40404K48989A22766J96491a13366a5318B38095
14913B64526m7242O1994M5862R0179j90988J48402P5736J3162J59252B52200H6495
14901A73042P5848A09759M84573Q1888j92201j18824A28584M89767B33420b4362
14890C91074J4018A25321K30060j01776A16731M03186B9320N88224k74889j41519
14880B01136n4503J28563J6984n0255K4696j12900J43482m9033J93816j3032M1075
14869D70029j56029A22142L06280K0944m4360j03085L8751H4793O22082l35443
14859C71432M6472B03575M6566J4685J87206n1579J8965j71996j21505O1202L62074
14848E49193k47553J46700j80604K4594K15199r508j96051D1810P8351M37725
$$ plain form
14838 557886 424380 500302 -51981 557400 70632 513101 -18251 473158 615068 188141
14827 607933 317700 439391 485621 443452 699222 318302 246322 19894 352422 575498
14817 575498 558953 664503 562761 688822 582152 448271 88582 148882 551568 247408
14806 413365 594628 638414 126337 637501 529570 496266 461869 235738 514996 642642
14796 642642 360952 513275 570171 411779 363530 676893 431725 365201 505596 381476
14786 381476 300316 575478 425037 581710 367289 488443 500324 288820 257296 480039
14776 480039 574649 623969 325952 302872 516531 602320 377713 255027 545115 334354
14766 334354 541079 391711 753799 486458 550459 560052 640041 570037 886325 567724
$$ packed form
14838E57886j33506P5922e1981E57400G0632M42469a8251D73158J41910A88141
14827F07933k90233J21691M6230m2169K55770C18302p1980A9894L32528K23076
14817E75498j6545J05550j01742J26061j06670j33881H8582O0300M02686B47408
14806D13365J81263M3786A26337N11164j07931l3304l4397k26131K79258J27646
14796F42642k81690J52323N6896j58392m8249L13363k45168o6524J40395j24120
14786C81476q1160K75162j50441J56673k14421J21154J1881k11504l1524K22743
14776D80039R4610M9320k98017k3080K13659Q5789k24607j22686K90088k10761
14766C34354K06725j49368L62088k67341O4001R593P9989p0004L16288l18601
$$ plain form
14756 567724 763290 901053 429497 602193 489982 505390 532245 888910 333057 595008
14746 595008 395209 547725 816558 727527 799620 627143 695266 717666 467737 647064
14736 647064 487249 591628 667815 532806 480282 415251 734186 542512 764612 718992
14726 718992 804764 366897 716198 665829 441817 421135 362500 884532 712065 585975
14716 585975 872975 591489 802460 564741 685494 796450 814170 896153 702177 757451
14706 757451 670264 678411 928556 863461 542040 977781 901703 658014 770720 909406
14696 909406 736604 803722 686391 894453 663941 674462 544800 625554 636646 743885
14686 743885 864566 885106 843592 902186 518395 1134628 1128209 933575 954452 629472 963917
$$ packed form
14756E67724J95566J37763D29497J72696j12211J5408K6855L56665C33057K61951
14746E95008j99799J52516K68833q9031P2093j72477O8123K2400k49929J79327
14736F47064j59815J04379P6187j35009n2524o5031L18935j91674K22100m5620
14726G18992Q5772C66897L49301n0369k24012k0682n8635N22032j72467j26090
14716E85975K87000k81486K10971k37719J20753J10956J7720Q1983j93976N5274
14706G57451q7187Q147K50145o5095l21421M35741p6078k43689J12706J38686
14696I09406j72802O7118j17331K08062k30512J0521j29662Q0754J1092J07239
14686G43885J20681K0540m1514N8594l83791O16233o419j94634K0877l24980L34445
$$ plain form
14675 963917 789879 990233 876230 628510 792668 1207454 852767 952065 1176702 1154556
14665 1154556 953161 1211575 1120081 1011463 1203552 917716 909835 818824 1046420 1025936
14655 1025936 866935 857421 1074436 1045195 1249599 1007260 902007 983675 1246950 887165
14645 887165 953176 1063285 847620 1392091 755049 1113870 1082351 845421 939408 1037377
14635 1037377 1194437 1280022 761216 1336069 1209337 1414466 1400798 1318092 1241906 1025032
14625 1025032 1155909 1311021 899288 1467666 1237070 1151757 1058283 1388857 1136160 1207629
14615 1207629 1266451 1431911 1262251 1364379 1432137 1613026 1360975 1681596 1564055 1174711
14605 1174711 990783 1367231 1256630 1275889 1455164 1359153 1604327 1403107 1550815 1545015
$$ packed form
14675I63917j74038K00354j14003k47720J64158M14786l54687R9298K24637k2146
14665A154556k01395K58414r1494j08618J92089k85836p881r1011K27596k0484
14655A025936j59001r514K17015k9241K04404k42339j05253Q1668K63275l59785
14645H87165O6011J10109k15665N44471o37042L58821l1519k36930R3987R7969
14635A037377J57060Q5585n18806N74853j26732K05129j3668q2706p6186k16874
14625A025032J30877J55112m11733N68378k30596q5313r3474L30574k52697P1469
14615A207629N8822J65460j69660J02128O7758J80889k52051L20621j17541l89344
14605A174711j83928L76448j10601J9259J79275r6011K45174k01220J47708n800
$$ plain form
14595 1545015 1796210 1627812 1482591 1349551 1929046 1810726 1587528 1706711 1594001
14586 1594001 1482261 1429519 1564721 1769047 1763278 1954105 1705892 1844951 1984193 1515199
14576 1515199 1589272 1759549 1599801 1968137 2128432 1908055 1656761 2038388 2081877 1991859
14566 1991859 2136814 2189372 2139463 2128652 1941052 2151035 1940164 2080302 2149740 2536115
14556 2536115 2109955 1966119 2100880 2054738 2211259 2295439 2337120 2409317 2258965 2530352
14546 2530352 2741543 3104120 3284028 2883655 3134999 3540828 3849739 4389465 4391752 5204193
14536 5204193 6247589 7556823 9704132 13112045 19409467 28508240 27521190 16838104
14528 16838104 11147066 7181609 4957312 4028205 3031899 2810873 2865284 2561097 2571001
$$ packed form
14595A545015K51195j68398j45221j33040N79495j18320k23198J19183j12710
14586A594001j11740n2742J35202K04326n769J90827k48213J39059J39242m68994
14576A515199P4073J70277j59748L68336J60295k20377k51294L81627M3489r0018
14566A991859J44955N2558m9909j0811j87600K09983k10871J40138O9438L86375
14556B536115m26160j43836J34761m6142J56521Q4180M1681P2197j50352K71387
14546B530352K11191L62577J79908m00373K51344M05829L08911N39726K287Q12441
14536E204193J043396J309234K147309L407913O297422R098773r87050j0683086
14528A6838104n691038l965457k224297r29107r96306k21026N4411l04187R904
$$ plain form
14519 2571001 2289891 2485086 2196334 2173478 2383488 2243934 2661193 2115082 2241491 2505698
14509 2505698 2356713 2358093 2555493 2324494 2237155 2447023 2386004 2295857 2968444 2527376
14499 2527376 3162906 2639277 2829945 2634448 2806822 2772769 2898716 2910014 2617085 2905084
14489 2905084 2554128 2935025 3022138 2862648 2749697 2989045 3161754 3436523 3594919 3435508
14479 3435508 3336520 3399834 3566113 3619784 3517305 3539519 3506821 3465492 3660038 3573320 3852272
14468 3852272 3518229 3535997 3368369 3659349 3929981 4224980 4013961 4197895 3768417 4327821
14458 4327821 4308389 4099562 4194329 4102916 4424801 4014223 4522885 4519926 4598586 4747693
14448 4747693 4377873 4389480 4488238 4725373 4986838 4870748 4712579 5336487 5034083 5075879
$$ packed form
14519B571001k81110J95195k88752k2856K10010j39554M17259n46111J26409K64207
14509B505698j48985J380J97400k30999q7339K09868o1019r0147O72587m41068
14499B527376O35530n23629J90668j95497J72374l4053J25947J1298k92929K87999
14489B905084l50956L80897Q7113j59490j12951K39348J72709K74769J58396j59411
14479C435508r8988O3314J66279N3671j02479K2214l2698m1329J94546q6718K78952
14468C852272l34043J7768j67628K90980K70632K94999k11019J83934m29478N59404
14458D327821j9432k08827R4767r1413L21885m10578N08662k959P8660J49107
14448D747693l69820J1607R8758K37135K61465j16090j58169O23908l02404M1796
$$ plain form
14438 5075879 5082239 5251746 5067328 5789249 5433782 5704341 5258159 5406770 5625094 5885839
14428 5885839 6043903 5806821 5911493 6144089 6226231 5846410 5992061 6106583 6380891 6558209
14418 6558209 6693399 6740864 6736759 7059764 7002117 7097440 7283946 7158836 7443956 7465254
14408 7465254 7795715 7661848 7614535 8051159 8069739 8339153 8241567 8563906 8788107 8698511
14398 8698511 8680549 8691413 8981544 9185111 9210590 9216832 9662184 9413823 9861874 9966443
14388 9966443 10192049 10180301 10674017 10818568 11052630 10916887 11177103 11430842 11646543 11701972
14378 11701972 11936352 12259501 12184593 12245426 12985901 13059789 13233140 13511460 13753814 14224502
14368 14224502 14365516 14396855 14679662 15113118 15510211 15687019 15986540 16438228 16467337 17093414
$$ packed form
14438E075879O360J69507j84418P21921l55467K70559m46182J48611K18324K60745
14428E885839J58064k37082J04672K32596Q2142l79821J45651J14522K74308J77318
14418F558209J35190M7465m105L23005n7647R5323J86506j25110K85120K1298
14408G465254L30461j33867m7313M36624J8580K69414r7586L22339K24201q9596
14398H698511j7962J0864K90131K03567K5479O242M45352k48361M48051J04569
14388I966443K25606j1748M93716J44551K34062j35743K60216K53739K15701N5429
14378A1701972K34380L23149p4908O0833P40475P3888J73351K78320K42354M70688
14368A4224502J41014L1339K82807M33456L97093J76808K99521M51688K9109O26077
$$ plain form
14358 17093414 17078676 17547478 18347075 18276849 18713445 19021968 19663744 19661274 20368978 20579603
14348 20579603 20996451 21022626 22142972 22750386 22800658 23520513 23744153 24273523 24952348
14339 24952348 25551121 26410838 26686267 27067347 28157316 28718937 29610079 30287195 30891421
14330 30891421 31657359 32819177 33553577 34492809 35468356 35818781 37259408 38442619 39493523
14321 39493523 40616490 41467609 42495716 43956827 45421598 46755575 48171025 49451162
14313 49451162 51195789 52854476 54530542 56398005 58118120 59817298 61985977 64161474
14305 64161474 66499027 68716379 71197246 74070051 76764378 79411545 82310225 85745318
14297 85745318 89104633 92751782 96246818 100146423 104255275 108581441 113151998 118323025
$$ packed form
14358A7093414j4738M68802P99597p0226M36596L08523O41776k470P07704K10625
14348B0579603M16848K6175J120346O07414N0272P19855K23640N29370O78825
14339B4952348N98773Q59717K75429L81080J089969N61621Q91142O77116O04226
14330C0891421P65938J161818P34400R39232R75547L50425J440627J183211J050904
14321C9493523J122967Q51119J028107J461111J464771J333977J415450J280137
14313D9451162J744627J658687J676066J867463J720115J699178K168679K175497
14305F4161474K337553K217352K480867K872805K694327K647167K898680L435093
14297H5745318L359315L647149L495036L899605M108852M326166M570557N171027
$$ plain form
14289 118323025 123133220 128608555 134095939 140504072 146936903 154085584 160710520 168017861
14281 168017861 175992985 184457518 193228710 202663340 212680938 223049867 233857890
14274 233857890 245091091 256993562 269262505 281885493 295319743 308772926 322424619
14267 322424619 335632238 347657864 358166291 367890808 377021790 385915395 393603717
14260 393603717 401008354 407400201 412653171 416329023 418394141 419639798 416852184 411364949
14252 411364949 407202441 400887378 393399661 385191960 375070536 363827277 352712130
14245 352712130 340854187 328533723 315528322 303031734 291375155 279381471 267598187
14238 267598187 255814979 244524361 233083218 222638076 212243443 202234518 192490463
$$ packed form
14289A18323025M810195N475335N487384O408133O432831P148681O624936P307341
14281A68017861P975124Q464533Q771192R434630J0017598J0368929J0808023
14274B33857890J1233201J1902471J2268943J2622988J3434250J3453183J3651693
14267C22424619J3207619J2025626J0508427R724517R130982Q893605P688322
14260C93603717P404637O391847N252970L675852K065118J245657k787614n487235
14252D11364949m162508o315063p487717q207701j0121424j1243259j1115147
14245C52712130j1857943j2320464j3005401j2496588j1656579j1993684j1783284
14238B67598187j1783208j1290618j1441143j0445142j0394633j0008925r744055
$$ plain form
14231 192490463 183069538 174998668 166894901 158615786 150973377 143929835 136887218 130530783
14223 130530783 124852162 119244212 113735163 108915309 104274318 99614272 95926632 92424533
14215 92424533 88490256 84969617 81457836 78627468 75568352 72591193 70153549 67815990
14207 67815990 64819805 62922555 60941111 58447536 56838826 54966116 53269949 51296425
14199 51296425 49735266 48820849 47093737 45345429 44257914 42862142 41270607 40817971
14191 40817971 39505514 38532216 37250510 35655793 35229529 34203791 33270131 32558458 31644120
14182 31644120 31134254 30119191 29246894 28897900 27531707 27253114 26692733 25671017 25347076
14173 25347076 24459682 24301995 23755673 23289348 22379654 21789853 21543640 21039188 20719416
$$ packed form
14231A92490463r420925q070870q103767q279115p642409p043542p042617o356435
14223A30530783n678621n607950n509049m819854m640991m660046l687640l502099
14215I2424533l934277l520639l511781k830368l059116k977159k437644k337559
14207F7815990k996185j897250j981444k493575j608710j872710j696167j973524
14199E1296425j561159r14417j727112j748308j087515j395772j591535m52636
14191D0817971j312457r73298j281706j594717m26264j025738r33660p11673r14338
14182C1644120n09866j015063q72297l48994j366193k78593n60381j021716l23941
14173B5347076q87394j57687n46322m66325r09694n89801k46213n04452l19772
$$ plain form
14164 20719416 20317385 19781985 19067847 19063776 18757598 18225804 17895271 17561348 17505338 16477435
14154 16477435 16297387 15751751 15693824 15848981 15443542 15011406 14756681 14351268 14220832
14145 14220832 13988561 13468476 13478752 13181183 13151242 12874828 12787616 12444286 12537440 12167990
14135 12167990 11928611 11795608 11556802 11229405 11086089 11192779 10836963 10935020 10641514
14126 10641514 10415386 10246254 10299387 9769067 9949233 9840100 9884975 9325640 9217495 8389390
14116 8389390 8886703 8886396 8793422 8302773 8499239 8368886 8291272 8217867 8011784 8030712 7637275
14105 7637275 7906553 7322678 7680487 7282426 7454769 7271053 7063567 6685130 6966538
14096 6966538 6933451 6825335 6919152 6342904 6609709 6560212 6605725 6336823 6071809 6268937
$$ packed form
14164B0719416m02031n35400p14138m071l06178n31794l30533l33923n6010j027903
14154A6477435j80048n45636n7927J55157m05439m32136k54725m05413j30436
14145A4220832k32271n20085J0276k97569k9941k76414q7212l43330R3154l69450
14135A2167990k39379j33003k38806l27397j43316J06690l55816R8057k93506
14126A0641514k26128j69132N3133n30320J80166j09133M4875n59335j08145q28105
14116H389390M97313l07r2974m90649J96466j30353p7614p3405k06083J8928l93437
14105G637275K69278n83875L57809l98061J72343j83716k07486l78437K81408
14096F966538l3087j08116R3817n76248K66805m9497M5513k68902k65014J97128
$$ plain form
14086 6268937 5869550 6326775 5832220 6004764 5611624 5615660 5883489 5503903 5407457 5562936
14076 5562936 5564048 5271578 5235335 5517338 5526332 5257501 4986258 4852026 4798235 5192685
14066 5192685 4980607 4779483 4499899 4766749 4473875 4845807 4452065 4290268 4469868
14057 4469868 4369973 4557571 4467358 4388591 4320268 4047730 4141182 4063845 3841692 4074119
14047 4074119 4041752 3959531 3902166 4039231 4033424 3747619 4025786 3509271 3738786 3711969
14037 3711969 3608586 3629916 3456938 3268236 3584013 3727103 3206474 3541373 3231360 2940219
14027 2940219 2854362 3404008 2950577 2889774 3472895 3357568 3148989 3056099 2913858 2948753
14017 2948753 3089371 3024032 3115882 2940059 2963606 2823493 3177269 2885954 2743119 2715695
$$ packed form
14086F268937l99387M57225m94555J72544l93140M036K67829l79586r6446J55479
14076E562936J112k92470l6243K82003Q994k68831k71243j34232n3791L94450
14066E192685k12078k01124k79584K66850k92874L71932l93742j61797J79600
14057D469868r9895J87598r0213p8767o8323k72538R3452p7337k22153K32427
14047D074119l2367q2221n7365J37065n807k85805K78167n16515K29515k6817
14037C711969j03383K1330j72978j88702L15777J43090n20629L34899l10013k91141
14027B940219q5857N49646m53431o0803N83121j15327k08579r2890j42241L4895
14017B948753J40618o5339R1850j75823K3547j40113L53776k91315j42835k7424
$$ plain form
14007 2715695 2844394 2374569 2608982 2777201 2613992 2614679 2550175 2547803 2467326 2684485 2537586
13996 2537586 2608489 2401061 2328569 2610130 2191496 2641637 2208963 2328115 2152310 2140448
13986 2140448 2394904 2503168 2473706 2746561 2517652 2548115 2556729 2864755 3228608 3134242
13976 3134242 3718367 4799350 6086307 9062216 14431808 24077954 27804840 19739774
13968 19739774 13565077 9762186 7852595 6022930 4763430 4114393 3995988 3479998
13960 3479998 3451749 3056628 2856754 2731510 2874769 2913091 2861279 2460054 2385461 2645736
13950 2645736 2637030 2386351 1967973 2132987 1817241 2236886 2230828 2160214 2070295 1792689
13940 1792689 1812719 1969857 1907094 1880478 1861537 1698852 2028589 1763647 2152457 1899754
$$ packed form
14007B715695J28699m69825K34413J68219j63209O87o4504k372q0477K17159j46899
13996B537586P0903k07428p2492K81561m18634M50141m32674J19152j75805j1862
13986B140448K54456J08264k9462K72855k28909L0463Q614L08026L63853r4366
13976C134242N84125J080983J286957K975909N369592R646146L726886q065066
13968A9739774o174697l802891j909591j829665j259500o49037j18405n15990
13960C479998k8249l95121j99874j25244J43259L8322n1812m01225p4593K60275
13950B645736q706k50679m18378J65014l15746M19645o058p0614q9919k77606
13940A792689K0030J57138o2763k6616j8941j62685L29737k64942L88810k52703
$$ plain form
13930 1899754 1883116 1837614 1612476 2017308 2038482 2115130 1366955 1565591 1589970 1535589
13920 1535589 1978911 1948832 1745652 1827867 1588458 1715122 1874764 1382322 1620293 1747984
13910 1747984 1662271 1475633 1434728 1817826 1835283 1653267 1516339 1439235 1442409 1875193
13900 1875193 1388374 1554535 1593095 1240114 1509794 1369524 1423527 1266430 1060618 1527579
13890 1527579 1480691 1491973 1499016 1524849 1435237 1583310 1385311 1478969 1471971 1338641 1059304
13879 1059304 1047349 1394801 1371010 1504268 887922 1252134 1098141 1206937 1273156 949363
13869 949363 1152926 1158427 1301167 1299358 1200540 1592069 1129680 1405224 970628 1373640
13859 1373640 962359 716500 1237818 1121814 1430804 1145710 962839 1103449 1228255
$$ packed form
13930A899754j6638m5502k25138M04832K1174P6648p48175J98636K4379n4381
13920A535589M43322l0079k03180Q2215k39409J26664J59642m92442K37971J27691
13910A747984q5713j86638m0905L83098J7457j82016j36928p7104L174M32784
13900A875193m86819J66161L8560l52981K69680j40270N4003j57097k05812M66961
13890A527579m6888J1282P043K5833q9612J48073j97999R3658o998j33330k79337
13879A059304j1955L47452k3791J33258o16346L64212j53993J08796O6219l23793
13869I49363K03563N501J42740j809r8818L91529m62389K75544m34596M03012
13859A373640m11281k45859N21318j16004L08990k85094j82871J40610J24806
$$ plain form
13850 1228255 1078777 1074693 1361922 1226914 1155093 1049671 1213496 1147687 1215299 956203
13840 956203 1051425 1108655 1113328 1018957 897562 877007 1082774 662588 852086 1126268 1019243
13829 1019243 996889 1086461 669677 1134302 1020784 1203654 1154167 878255 696851 565766
13819 565766 704491 963231 739581 1308584 934667 903376 1058389 757348 837257 1248725
13809 1248725 565606 998191 611737 1107613 992299 1126222 505315 1081423 772225
13800 772225 1122483 704421 657048 847386 775384 940279 1062178 653823 949601 905182
13790 905182 809570 510650 782089 752356 883019 757779 951328 857380 887260 572913
13780 572913 643487 585991 662212 808183 516591 577728 699739 1122077 576515 848923
$$ packed form
13850A228255j49478m084K87229j35008p1821j05422J63825o5809O7612k59096
13840I56203R5222N7230M673r4371j21395k0555K05767m20186J89498K74182j07025
13829A019243k2354Q9572m16784M64625j13518J82870m9487k75912j81404j31085
13819E65766J38725K58740k23650N69003l73917l1291J55013l01041P9909M11468
13809A248725E65606M32585l86454M95876j15314J33923E05315N76108l09198
13800G72225L50258m18062m7373J90338p2002J64895J21899m08355K95778m4419
13790I05182r5612k98920K71439k9733J30663j25240J93549r3948K9880l14347
13780E72913P0574n7496P6221J45971k91592O1137J22011M22338n45562K72408
$$ plain form
13770 848923 888384 456810 788530 661851 602986 770126 718698 797998 789407 896107 855535
13759 855535 904217 416363 681165 761444 835068 749359 837013 840279 613430 715381 456288
13748 456288 793758 300947 654083 653896 666059 535309 827353 564520 612594 523486 631436
13737 631436 566968 624895 473495 754635 780044 637613 634920 580013 504252 490681 394303
13726 394303 621674 757984 946152 812441 679318 458576 419887 457761 444162 496519
13716 496519 786241 561410 591036 518337 840805 534645 811334 787714 595780 907652
13706 907652 587643 335172 693072 555695 371414 470445 502347 941012 381716 433900
13696 433900 752849 798264 611379 553731 327929 480511 528718 492480 656224 790457
$$ packed form
13770H48923L9461m31574L31720j26679n8865J67140n1428P9300q591J06700m0572
13759H55535M8682D16363K64802Q0279P3624q5709Q7654L266k26849J01951k59093
13748D56288L37470C00947L53136j87J2163j30750K92044k62833M8074q9108J07950
13737F31436o4468N7927j51400K81140K5409j42431k693n4907p5761j3571r6378
13726C94303K27371J36310J88168j33711j33123k20742l8689L7874j3599N2357
13716D96519K89722k24831K9626p2699L22468l06160K76689k3620j91934L11872
13706I07652l20009k52471L57900j37377j84281R9031L1902M38665C81716N2184
13696D33900L18949M5415j86885n7648k25802J52582M8207l6238J63744J34233
$$ plain form
13686 790457 516674 707297 720577 714717 721992 447564 373558 500194 759030 712941 537384
13675 537384 327824 644653 311809 366093 217342 690082 518680 438167 521688 648287
13665 648287 375532 207158 324904 537882 646781 6174 318705 272136 577166 749294
13655 749294 605969 345866 571725 532344 468668 188948 571445 428231 399123 695380
13645 695380 295388 214620 519119 473087 303418 328108 386351 523721 434308 634118
13635 634118 319152 613053 704647 487417 422768 623926 404884 519399 556781 315909
13625 315909 255422 370386 300673 312103 356229 416832 282021 431711 457427 313900 82162
13613 470550 232219 453329 375813 349669 867874 577217 383236 392687 216970 108453
$$ packed form
13686G90457k73783J90623J3280n860P275k74428p4006J26636K58836m6089j75557
13675E37384k09560L16829C11809N4284j48751M72740j71402q0513Q3521J26599
13665F48287k72755j68374J17746K12978J08899F174L12531m6569L05030J72128
13655G49294j43325k60103K25859l9381o3676A88948L82497j43214k9108K96257
13645F95380B95388q0768L04499m6032j69669K4690N8243J37370q9413J99810
13635F34118l14966K93901R1594k17230o4649K01158k19042J14515L7382k40872
13625C15909o0487J14964o9713J1430M4126O0603j34811J49690K5716j43527H2162
13613D70550B32219K21110p7516k6144N18205k90657j93981R451j75717A08453
$$ plain form
13602 153136 639149 443293 299628 519198 312897 259947 427644 621609 308273 433211
13592 433211 528304 24515 213096 529199 511336 229793 688091 605542 411243 541619
13582 541619 335650 283837 343623 449291 436050 295686 138141 605616 216889 388660
13572 388660 245388 197193 382663 243389 142784 328173 55569 287745 119013 538174
13562 538174 265776 197492 566773 443596 420066 172473 404231 108570 525399 473574
13552 473574 455886 -8341 532956 158170 482462 290717 300660 603575 375845 478782
13542 478782 367382 240509 272364 313092 422071 228686 490945 446818 329868 89136
13531 335323 247810 380580 584408 475893 333507 295157 72153 371856 409526 -28047
$$ packed form
13602A53136M86013j95856j43665K19570k06301n2950J67697J93965C08273J24938
13592D33211R5093B4515J88581L16103j7863B29793M58298q2549j94299J30376
13582E41619k05969n1813N9786J05668j3241j40364A38141M67475B16889J71771
13572C88660j43272m8195J85470j39274j00605J85389E5569K32176A19013M19161
13562E38174B65776o8284L69281j23177k3530A72473K31758A08570M16829n1825
13552D73574j7688h341E32956A58170L24292j91745R943L02915k27730J02937
13542D78782j11400j26873L1855M0728J08979j93385K62259m4127j16950H9136
13531C35323q7513J32770K03828j08515j42386l8350G2153K99703L7670b8047
$$ plain form
13520 287387 275002 281424 362954 203334 368983 310819 161482 198774 384168 -43650 173897
13508 39184 224245 250657 417182 364610 270632 -84988 385554 94653 290308 288205 332316
13497 332316 434493 379375 -12750 736346 417704 591516 323707 199287 215286 157798
13487 157798 -3917 161190 271629 249947 99991 219233 249351 274376 209894 28146 407746
13476 407746 245213 169851 298821 -143111 15181 -70416 173325 368303 435522 421950
13466 421950 398876 251936 451921 239521 108032 495468 40580 364472 283831 428965
13456 428965 197211 267881 332867 431224 374302 147043 324151 162388 222 292556 368395
13445 368395 -58390 488964 346413 435659 277384 -64444 57244 29922 91189 -90168 294788
$$ packed form
13520B87387j2385O422Q1530j59620J65649n8164j49337L7292J85394d3650A73897
13508C9184J85061K6412J66525n2572r3978h4988C85554I4653J95655k103M4111
13497C32316J02177n5118a2750G36346l18642J73812k67809j24420J5999n7488
13487A57798c917A61190J10439k1682I9991J19242L0118K5025o4482B8146L79600
13476D07746j62533p5362J28970a43111A5181g0416A73325J94978O7219j3572
13466D21950k3074j46940J99985k12400A08032L87436D0580L23892q0641J45134
13456D28965A97211P0670O4986R8357n6922A47043J77108j61763B22K92334P5839
13445C68395e8390D88964j42551Q9246j58275f4444E7244k7322O1267i0168B94788
$$ plain form
13433 235112 65429 245943 409123 -49547 146388 348521 304454 176711 355490 453664
13423 453664 177741 91276 326555 126291 363578 -25941 134615 428799 426341 590202
13413 590202 277382 188816 31593 591304 377104 219656 434266 145641 459603 379036
13403 379036 315722 95145 102958 479083 498072 321301 62391 313187 318567 123916 -24029
13391 311533 429275 78419 225670 -45177 117790 303473 247749 335486 214842 288259
13381 288259 124713 198257 214000 76488 230419 326346 184904 228011 246430 513545 180408
13369 -35179 100657 167833 60432 710937 209678 203184 286617 269356 -266883 460108 156032
13357 172378 238964 28562 292247 283535 376816 178739 178889 334932 127683 -82986 67097
$$ packed form
13433B35112F5429J80514J63180d9547A46388K02133m4067j27743J78779R8174
13423D53664A77741q6465K35279A26291K37287b5941A34615K94184k458J63861
13413E90202B77382q8566C1593N59711k14200j57448K14610A45641L13962q0567
13403C79036o3314I5145P813L76125J8989j76771F2391K50796N380A23916b4029
13391C11533J17742G8419J47251d5177A17790J85683n5724Q7737j20644P3417
13381B88259A24713P3544J5743G6488J53931R5927j41442M3107J8419K67115A80408
13369c5179A00657O7176F0432O50505B09678o494Q3433j7261b66883D60108A56032
13357A72378O6586B8562K63685q712R3281A78739J50J56043A27683h2986F7097
$$ plain form
13345 220735 224685 318305 -108185 165912 243908 411418 -204066 178044 299772 142153
13334 421987 99126 348607 638234 563709 196209 404104 129439 410552 211097 295866
13324 295866 -2369 291326 529427 -39307 198320 138876 274539 -8359 206812 39274 182226
13313 182226 256130 303871 148321 354647 31813 223186 182986 209035 298160 115535 -68945
13301 -16054 -80359 346074 340279 94348 284746 125087 187740 17092 194757 370986 147813
13289 176995 244173 82365 181700 381846 -88203 -191185 106561 256474 34645 180538
13279 180538 -51062 281661 137974 216242 468598 -225755 -69191 -40789 223216 -147775
13268 227958 393072 141432 350828 87370 110102 -240606 13019 -59105 316771 301220
$$ packed form
13345B20735L950R3620a08185A65912P7996J67510b04066A78044J21728A42153
13334D21987I9126K49481K89627p4525A96209K07895A29439K81113j99455Q4769
13324B95866b369B91326K38101c9307A98320n9444J35663h359B06812C9274J42952
13313A82226P3904M7741A48321K06326C1813J91373m0200K6049Q9125A15535f8945
13301a6054o4305C46074n795I4348J90398A25087O2653A7092J77665J76229A47813
13289A76995O7178H2365R9335K00146h8203j02982A06561J49913C4645J45893
13279A80538e1062B81661A37974P8268K52356b25755f9191K8402B23216a47775
13268B27958J65114A41432K09396H7370K2732b40606A3019e9105C16771j5551
$$ plain form
13258 301220 37293 86247 270960 231347 120648 143517 284698 363729 -183019 -52841 165081
13246 -193152 166348 114213 -81949 -196582 56395 377063 -282351 -209065 144712 259339
13236 259339 12496 46168 90889 -123320 157254 167532 170145 343938 -134222 -145335 -206121
13225 -206121 54159 211798 -171374 145219 250317 -11817 292206 205179 151261 -95289
13214 93054 -231141 265154 369421 -324525 11972 -140758 3849 162323 203927 323089
13204 323089 207455 323631 120629 86134 12691 174434 167135 -17240 279528 186678 516575
13193 516575 300376 -212355 169473 329831 354054 215530 7601 41051 188433 -66758
13182 47190 261861 237328 131959 358622 -78823 493457 -255249 338495 -4296 240336
$$ packed form
13258C01220C7293M8954J84713l9613j10699K2869J41181P9031a83019e2841A65081
13246a93152A66348n2135h1949j14633E6395L20668b82351P3286A44712J14627
13236B59339A2496L3672M4721a23320A57254J0278K613J73793a34222j1113o0786
13225b06121E4159J57639a71374A45219J05098a1817B92206q7027n3918i5289
13214I3054b31141B65154J04267c24525A1972a40758C849J58474M1604J19162
13204C23089j15634J16176A20629l4495A2691J61743p299a7240B79528r2850L29897
13193E16575k16199b12355A69473J60358K4223j38524G601L3450J47382f6758
13182D7190K14671k4533j05369K26663g8823D93457b55249C38495d296B40336
$$ plain form
13171 64812 56358 406959 38246 -84241 103224 -147569 146007 267564 64032 32494 147180
13160 147180 -70218 -121993 88902 -57034 240966 251224 121577 -61792 -42245 -83462 -61480
13149 -61480 99875 -25766 -5578 -23882 -120071 272368 29908 -68446 118507 -30913 121963
13137 -51883 207821 95642 144928 285848 140374 156929 -141243 309247 92161 69545 141928
13126 141928 146526 -266009 212542 63994 19686 16978 -90799 -332685 365987 117568 6876
13114 88318 47363 -120192 30971 127709 -186649 -55677 269173 289360 108296 224908 428985
13103 428985 257747 173358 -165124 -77631 51521 112575 -263116 164798 107539 23368 -123909
13091 210261 188829 29272 346310 187948 124952 50756 103127 -200625 176667 387287
$$ packed form
13171F4812q454L50601C8246h4241A03224a47569A46007J21557F4032l1538J14686
13160A47180g0218n1775H8902e7034B40966J0258A21577f1792J9547m1217K1982
13149f1480I9875b5766e578j8304r6189B72368B9908f8446A18507c0913A21963
13137e1883B07821I5642M9286J40920A40374J6555a41243C09247I2161k2616P2383
13126A41928M598b66009B12542F3994A9686k708i0799k41886C65987A17568F876
13114H8318m0955a20192C0971R6738a86649e5677B69173K0187A08296J16612K04077
13103D28985j71238q4389a65124g7631E1521O1054b63116A64798n7259B3368a23909
13091B10261k1432B9272L17038j58362o2996E0756N2371b00625A76667K10620
$$ plain form
13081 387287 275682 32041 186383 221651 -79405 115271 322792 -66767 20362 37907 5799
13069 -94133 173409 175897 -108006 175664 259128 260019 -102220 -78432 143825 198374 159233
13058 159233 190581 -311833 153499 -129184 81732 -111410 216402 -142989 376686 178947
13047 -55431 -106920 201922 -296258 48086 43150 23675 -37455 308430 253511 211750 143756
13036 143756 154576 -133137 387762 18482 22955 -158612 122754 302471 322424 108450
13025 410776 141060 405179 4751 -136862 -475244 285087 209948 314090 -162062 164145
13014 63618 392884 -18397 99767 18309 -5776 133259 -37027 -33509 392279 160671 328690
13003 328690 57542 69223 112485 173754 -11438 403387 19761 104961 121724 205847 51129
$$ packed form
13081C87287j11605C2041J54342L5268g9405A15271K07521f6767B0362J7545E799
13069i4133A73409K488a08006A75664Q3464Q91a02220K3788A43825N4549l9141
13058A59233L1348c11833A53499a29184H1732a11410B16402a42989C76686A78947
13047e5431n1489B01922b96258D8086m936j9475c7455C08430n4919m1761o7994
13036A43756J0820a33137C87762A8482M473a58612A22754J79717J9953A08450
13025D10776A41060K64119D751a36862l38382B85087p5139J04142a62062A64145
13014F3618L29266a8397I9767A8309e776A33259c7027L518C92279A60671J68019
13003C28690E7542J1681M3262O1269a1438D03387A9761Q5200J6763Q4123E1129
$$ plain form
12991 170426 78809 172719 274529 234613 87577 27889 184325 186597 -112706 92001 -58127
12979 153721 183783 -67489 321412 540943 126951 210828 228831 -117821 -209845 147333
12968 -97974 50133 -100488 180307 17285 11228 -214485 17107 37719 81241 157080 45012
12956 72028 187647 10370 63952 -198788 135313 -174517 13212 -106838 43807 -52348 85773
12944 151524 245693 122338 150784 -177508 -75773 218071 80800 136999 -29892 -335240 -95458
12932 -216557 74073 -67737 44679 316166 104274 -8510 -14645 -91633 -92712 168598 349412
12921 349412 -86757 181285 22713 -227709 -488593 -21661 31233 278510 -232062 141136
12910 -9042 -328085 -58539 -47161 234291 -170816 319054 -62115 -50591 13559 259406 30372
$$ packed form
12991A70426G8809R3910J01810l9916H7577B7889J56436K272a12706I2001e8127
12979A53721L0062f7489C21412K19531A26951Q3877J8003a17821r2024A47333
12968i7974E0133a00488A80307A7285o057b14485A7107K0612M3522P5839D5012
12956G2028J15619A0370N3582a98788A35313a74517A3212a06838D3807e2348H5773
12944A51524R4169A22338K8446a77508g5773B18071H0800N6199b9892l05348i5458
12932b16557G4073f7737D4679K71487A04274h510o135p6988j079A68598J80814
12921C49412h6757A81285B2713b27709k60884b1661C1233K47277b32062A41136
12910i042l19043e8539J1378B34291a70816C19054f2115J1524A3559K45847C0372
$$ plain form
12898 209359 1823 148279 -19977 50882 -12154 -115276 -180590 101505 -7827 -30334 177629
12886 -54548 -5546 -277544 52462 128468 -103607 -68230 -104094 267768 -129924 57476 -305370
12874 165631 160745 206815 147184 66075 -93857 -32894 -358081 352875 194445 120837 328425
12863 328425 -234483 -161352 -210797 -201301 -289126 59601 81211 -43677 134143 59711 -48846
12851 164340 85450 -180494 -16900 -203234 95290 147488 176625 -106872 -269399 179029
12840 37103 -451344 52359 -65076 -61412 -198521 120322 363511 -19530 145365 -15579 120487
12828 100149 184695 -292749 287658 125993 654647 187035 466052 143506 -54133 -217548
12818 -217548 354748 -302885 47476 77516 6891 46757 5233 -242123 167918 -157451 -160774
$$ packed form
12898B09359A823J46456a9977E0882a2154j03122o5314A01505g827k2507A77629
12886e4548e546k71998E2462P6006a03607L5377l5864B67768a29924E7476c05370
12874A65631m886M6070n9631F6075i3857c2894l25187C52875j58430p3608K07588
12863C28425b34483P3131m9445R496q7825E9601K1610d3677A34143E9711d8846
12851A64340p8890a80494a6900j86334I5290N2198K9137a06872j62527A79029
12840C7103d51344E2359f5076L664j37109A20322K43189a9530A45365a5579A20487
12828A00149Q4546b92749B87658A25993N28654A87035K79017A43506e4133j63415
12818b17548C54748c02885D7476L0040F891L9866E233b42123A67918a57451l323
$$ plain form
12807 -160774 168519 -37149 92469 131008 146084 -46695 239913 167489 -59974 -170511 59661
12795 66743 -2938 -178589 11428 -45497 -168294 -57079 206591 62285 -103649 99637 -95896
12783 260900 359806 181072 -332526 111269 187874 -147418 -8872 214921 136259 291453
12773 291453 170244 -120425 211510 48759 167791 -156589 22376 -129687 178151 17516
12762 -2647 -184973 438807 -40255 -111418 -129300 -32069 -30336 425506 23841 -388370 -163010
12750 161918 475140 33993 203847 370002 50970 75956 -289077 436267 -259924 -52901
12739 -185635 21808 240672 -224522 207897 -186777 14627 -15866 163412 -44128 -17706
12728 142986 149027 83351 112418 -171749 123827 131470 286416 182134 -220318 -81752 -169288
$$ packed form
12807a60774A68519c7149I2469L8539J5076d6695B39913p2424e9974j10537E9661
12795F6743b938j75651A1428d5497j22797e7079B06591F2285a03649I9637i5896
12783B60900R8906j78734c32526A11269P6605a47418h872B14921p8662J55194
12773B91453j21209a20425B11510D8759J19032a56589B2376a29687A78151A7516
12762b647j82326D38807d0255p1163j7882c2069J733D25506B3841c88370a63010
12750A61918L13222C3993J69854J66155E0970K4986b89077D36267b59924e2901
12739a85635B1808K18864b24522B07897a86777A4627a5866A63412d4128a7706
12728A42986O041o5676K9067a71749A23827P643J54946j04282b20318h1752q7536
$$ plain form
12717 -169288 105446 23807 -122892 60789 364715 -136258 -16446 318916 62362 392896
12707 392896 -286904 -7980 238585 32054 99639 -143777 -339034 287043 18317 207882
12697 207882 89281 -155399 169745 -122219 307818 313022 -479713 168808 -108752 -64775
12687 -64775 157346 131206 -48113 -61336 -193124 84256 -290930 463593 -250293 -75710 26088
12675 362873 -66393 -105927 282908 463865 338285 20478 89531 258210 75272 -51995 29055
12663 -141557 114313 -8117 114749 -486709 334776 216585 -96338 500837 192330 -121018
12652 431880 -177671 -156655 -129222 39366 -197370 -7199 -2204 58725 158502 -53095 134778
12640 177267 -2522 86677 175749 349480 -140520 23937 344379 360596 30183 -70368 17867
$$ packed form
12717a69288A05446B3807a22892F0789L03926a36258a6446C18916F2362L30534
12707C92896b86904g980B38585C2054O7585a43777j95257B87043A8317J89565
12697B07882H9281a55399A69745a22219C07818N204d79713A68808a08752M3977
12687f4775A57346k6140d8113j3223j31788H4256b90930D63593b50293g5710B6088
12675C62873f6393l9534B82908J80957j25580B0478O9053J68679G5272e1995B9055
12663a41557A14313h117A14749d86709C34776j18191i6338E00837A92330a21018
12652D31880a77671K1016K7433C9366a97370g199b204E8725R9777e3095A34778
12640A77267b522H6677Q9072J73731a40520B3937L20442J6217C0183g0368A7867
$$ plain form
12628 -25974 16435 -322234 222030 232264 -110921 -64932 45597 -132390 338887 99229 -23990
12616 141763 73572 -137282 23130 153420 2485 115716 35538 -105533 287296 43477 77374
12605 77374 274300 126309 -21879 177455 99702 268902 111227 33353 130241 229948 23803
12593 115755 205722 33143 -44853 -68532 99364 -356092 -74284 129157 159644 95505 394130
12582 394130 55444 162509 -1071 -60577 -100997 373241 -41936 12785 -361847 10135 243021
12571 243021 -132236 14085 298292 82853 260166 -75295 79345 119733 -230209 187166
12560 -197272 -208071 -193133 -198176 37789 157528 13697 234952 -154238 -119868 117720 -160207
12548 -305543 90922 -215507 42279 143639 76749 111950 139770 -104799 258187 211080 315415
$$ packed form
12628b5974A6435c22234B22030J0234a10921M5989D5597a32390C38887I9229b3990
12616A41763o8191a37282B3130J30290B485J13231C5538a05533B87296D3477L3897
12605G7374J96926A26309b1879A77455p7753J69200A11227C3353R6888R9707B3803
12593A15755Q9967C3143d4853k3679I9364c56092g4284A29157L0487o4139K98625
12582C94130E5444J07065a071n9506m0420C73241d1936A2785c61847A0135K32886
12571B43021a32236A4085K84207H2853J77313g5295G9345M0388b30209A87166
12560a97272j0799J4938n043C7789J19739A3697K21255a54238L4370A17720a60207
12548c05543I0922b15507D2279J01360o6890L5201K7820a04799B58187m7107J04335
$$ plain form
12537 315415 -76322 153224 56386 38947 -139013 49171 -165780 35617 9590 -86468 -129559
12526 -129559 303314 -48909 336861 -108385 -87936 28476 -83804 26734 196941 119090 3383
12514 276397 -92178 -17766 127716 -370002 -274669 105755 106836 -126496 -59508 109476 17041
12502 -85855 204678 155544 240697 -356107 -101195 355415 -18746 85196 -126447 86273 40145
12490 77519 -123878 -11529 251475 161266 436795 174093 -78350 14266 77534 -37376 12104
12478 180313 78038 -37185 -104367 382560 180783 -34987 -58829 -116194 -75840 -7849 159034
12466 317338 204024 301210 -146868 390835 371057 -380850 139927 157013 -60672 -24924
12455 14441 -17 77185 -288741 -26931 28202 63260 -187108 -84040 -233107 -125067 341287
$$ packed form
12537C15415g6322A53224E6386j7439a39013D9171a65780C5617I590h6468m3091
12526a29559C03314d8909C36861a08385K0449B8476h3804B6734J70207p7851C383
12514B76397i2178a7766A27716c70002R5333A05755J081a26496e9508A09476A7041
12502h5855B04678m9134Q5153c56107a01195C55415a8746H5196a26447H6273D0145
12490G7519a23878a1529B51475r0209K75529A74093g8350A4266O3268c7376A2104
12478A80313G8038c7185o7182C82560A80783c4987k3842n7365M0354g849A59034
12466C17338j13314R7186a46868C90835j9778c80850A39927J7086f0672b4924
12455A4441a7G7185b88741b6931B8202L5058a87108h4040j49067J08040C41287
$$ plain form
12443 58529 -334227 100193 262908 -376533 -143621 -64642 -85582 121408 -314760 -95306
12432 -11345 -138664 -54676 -60297 -271105 345149 -126998 37165 277321 -164135 197928
12421 -51071 -23851 102934 185185 18666 60171 -85064 -246515 133379 106141 12695 88980
12410 88980 56066 -422453 104983 251404 -121125 -130646 272342 159795 210844 -57895 286226
12398 -361442 -79661 27529 -53626 124008 184275 62526 -106721 -193424 -189204 -305610 -5621
12386 85072 -100494 132489 87707 288978 188856 -178054 124880 275011 75228 -172722
12375 -53206 -92438 -54592 -104246 -107054 19962 -169908 -120407 -54422 -75808 -53646 -17207 -137763
12363 -137763 30533 -4456 237546 172404 -10591 -158565 -27339 -133289 -27917 29298 147665
$$ packed form
12443E8529c34227A00193J62715c76533a43621f4642k0940A21408c14760i5306
12432a1345j27319e4676n621k10808C45149a26998C7165K40156a64135A97928
12421e1071b3851A02934Q2251A8666M1505h5064j61451A33379k7238A2695P6285
12410H8980l2914d22453A04983J46421a21125r521B72342j12547N1049e7895B86226
12398c61442g9661B7529e3626A24008O0267F2526a06721q6703M220j16406e621
12386H5072a00494A32489m4782K01271j00122a78054A24880J50131G5228a72722
12375e3206l9232L7846m9654k808A9962a69908M9501e4422k1386K2162a7207j20556
12363a37763C0533d456B37546o5142a0591j47974b7339j05950b7917B9298J18367
$$ plain form
12352 147665 215025 4009 -259980 -97568 235165 -365000 71642 241530 -4954 160187 331364
12341 331364 118452 -70277 -18186 -235164 10293 29240 -246983 -36740 -106096 -68608 217619
12329 241638 134991 86083 -207574 -109425 86935 247017 23683 55997 22069 -127569 -236534
12318 -236534 206136 -65151 -13753 217156 168458 211755 196228 -27848 194902 -12174 82294
12306 -86538 -96734 37476 126531 -69552 -64768 48131 -42123 -63940 304864 -499628 -219648
12294 -643639 15043 178806 265488 -57671 45976 -71003 -159522 -31375 283819 -187190 137325
12282 -51659 -201687 -228620 47176 44699 11420 31745 -83648 212233 280299 -124944 -23779
12270 -81693 428502 112313 9218 466793 -6458 -18353 247873 165451 -107183 -118328 334608
$$ packed form
12352A47665O7360D009b59980i7568B35165c65000G1642J69888d954A60187J71177
12341C31364A18452g0277a8186k16978A0293J8947b46983c6740o9356L7488B17619
12329B41638j06647m8908b07574R8149H6935J60082B3683L2314B2069a27569j08965
12318b36534B06136f5151a3753B17156m8698M3297j5527b7848A94902a2174H2294
12306h6538j0196C7476Q9055f9552M784D8131d2123k1817C04864d99628b19648
12294f43639A5043J63763Q6682e7671D5976g1003q8519c1375B83819a87190A37325
12282e1659j50028k6933D7176k477A1420K0325h3648B12233O8066a24944b3779
12270h1693D28502A12313I218M57575f458j1895B47873q2422a07183j1145C34608
$$ plain form
12258 95419 10085 -117962 156722 69221 309395 242692 112921 -280215 266495 -53098
12247 -101941 -74860 165176 -86012 77313 127677 -115357 -77703 115068 318286 -71162 -181151
12236 -181151 207186 -58408 260492 -24377 -62334 193661 48702 8561 325065 -229085 -29436
12224 226061 187950 -234492 256443 622661 -19787 -66329 184344 79903 261194 274079
12214 274079 -73928 218783 -65578 103115 290388 91997 105332 482362 119371 58144
12203 105256 124876 23981 237691 41401 536627 90639 63498 83179 60282 247939 128360
12192 128360 -278645 83319 172569 -135281 270990 86613 392409 124694 16336 381217
12182 381217 78755 554317 189527 197543 33849 -11248 316799 252924 275691 238542 -54701
$$ packed form
12258I5419A0085a17962A56722F9221K40174o6703A12921b80215B66495e3098
12247a01941K7081A65176h6012G7313N0364a15357L7654A15068K03218g1162j09989
12236a81151B07186e8408B60492b4377l7957A93661D8702H561L16504b29085b9436
12224B26061l8111b34492B56443L66218a9787m6542A84344G9903J81291J2885
12214B74079g3928B18783f5578A03115J87273I1997J3335L77030A19371E8144
12203A05256J9620B3981K13710D1401M95226I0639k7141J9681k2897J87657j19579
12192A28360b78645H3319Q9250a35281B70990H6613L05796A24694A6336L64881
12182C81217G8755M75562A89527Q016C3849a1248C16799o3875K2767l7149e4701
$$ plain form
12170 -63458 -78200 134598 180113 -17857 93390 169231 206341 -93529 -25809 -71437 -56502
12159 -56502 -68748 116987 158115 54017 258038 228262 19592 -74772 185456 -85078 160587
12147 146239 76854 -246384 176779 -17677 -93167 -127595 72092 139956 -151379 -62381 109376
12135 -57522 132981 8863 -80094 -83758 264844 32418 151689 253077 -78296 187580 -25379
12123 -36185 -242287 101343 221200 272305 -35799 -275512 48739 1022 165927 158054 -81627
12111 176461 -1899 -1683 -80168 152433 467516 -88261 -85886 278958 -206419 234190 -20787
12099 25340 129063 -185764 233996 -43680 -7218 67052 18195 63282 -267134 -20629 -119721
12088 -119721 -149514 -216581 -79592 -229065 12107 -128457 -2305 -124317 27272 132850 316741
$$ packed form
12170f3458j4742A34598M5515a7857I3390P5841L7110i3529b5809m5628J4935
12159e6502j2246A16987M1128E4017K04021k9776A9592g4772A85456h5078A60587
12147A46239o9385b46384A76779a7677p5490l4428G2092O7864a51379f2381A09376
12135e7522A32981H863h0094l664B64844C2418J19271J01388g8296A87580b5379
12123c6185k06102A01343J19857N1105c5799k39713D8739A022J64905p873h1627
12111A76461a899K16p8485A52433L15083h8261K375B78958b06419B34190b0787
12099B5340J03723a85764B33996d3680g218F7052A8195M5087b67134b0629r9092
12088a19721k9793o7067g9592j49473A2107a28457b305j22012B7272J05578J83891
$$ plain form
12077 316741 -82445 171875 -277729 191419 252943 -526768 -190705 -25697 67 -8808 48990
12065 -49313 -133400 -47034 -55569 -29991 91065 48119 368034 19843 423805 416478 780681
12054 780681 1036322 391163 371694 346516 383701 254156 20445 198774 56569 207004
12044 207004 79062 -28835 2856 -148700 -204112 456827 -208106 -37269 56206 191577 1558
12032 -54928 232189 -180901 -661005 84032 35240 219654 727 -88466 43596 -474554 -105595
12020 17026 147387 -176724 381013 -450325 -24143 23881 12502 -101009 -201357 -127582
12010 -127582 -190417 -47508 135415 107901 -359557 58643 20043 -12726 20284 28078 -181445
11998 -397808 359494 -26837 -308424 36048 75667 205367 207359 -215857 -188895 273780 231591
$$ packed form
12077C16741h2445A71875b77729A91419O1524e26768a90705b5697F7h808D8990
12065d9313q4087d7034q535K5578I1065m2946L19915A9843M03962p327L64203
12054G80681K55641C91163j9469k5178L7185j29545B0445J78329E6569J50435
12044B07004G9062b8835B856a48700n5412D56827b08106c7269E6206J35371A558
12032e4928B32189a80901m80104H4032C5240J84414G27h8466D3596d74554a05595
12020A7026J30361a76724C81013d50325b4143B3881j1379a01009j00348P3775
12010a27582o2835d7508A35415k7514c59557E8643B0043a2726B0284P794a81445
11998c97808C59494b6837k81587C6048L9619J29700J992b15857K6962B73780m2189
$$ plain form
11987 231591 22314 -288795 -512723 -14095 -352889 -193925 123694 -206158 -107218 -143740
11977 -143740 153971 -173521 161614 158657 189969 -271799 -95089 -100108 -175732 -71730 -244206
11966 -244206 -113262 117817 -221185 336120 -209139 -14248 87289 -9489 131421 13165
11955 182472 184899 -11112 -41990 114013 209077 162346 88244 144292 359281 -38187 -167097
11944 -167097 -192974 -227800 -201397 2864 -158308 -280031 28279 -191543 -45495 -42216 167490
11932 -8647 -467879 60956 -364395 90826 -149572 122016 -10017 -149967 140076 113821 -62489
11920 128258 -227320 256340 375070 -141413 133887 141735 -125828 353710 -66711 201482
11909 -298949 70733 149872 221857 92030 210039 -54795 110252 -72617 -124164 -23912 -74094
$$ packed form
11987B31591B2314b88795k23928a4095l38794J58964A23694b06158R8940l6522
11977a43740A53971a73521A61614k957L1312b71799i5089n019p5624g1730j72476
11966b44206a13262A17817b21185C36120b09139a4248H7289i489A31421A3165
11955A82472K427a1112l0878A14013R5064m6731p4102N6048K14989c8187j28910
11944a67097k5877l4826K6403B864a58308j21723B8279a91543d5495L279A67490
11932h647m59232F0956c64395I0826a49572A22016a0017j39950A40076k6255f2489
11920A28258b27320B56340J18730a41413A33887P848a25828C53710f6711B01482
11909b98949G0733P9139P1985I2030J18009e4795A10252g2617n1547b3912n0182
$$ plain form
11898 -74094 91030 89459 132499 241880 14133 29689 -201256 -146999 -169289 -110300 130616
11886 124663 19683 -59958 -64507 -185973 287050 10734 125976 -9475 22054 1994 -103236
11874 71764 11783 -123443 -67045 57021 -294590 131529 -525 -234386 66409 -73343 -35955
11862 -110852 151586 66315 -80558 -118551 116636 -34565 -70591 -27044 -71828 53346 293009
11851 293009 -10130 152091 -192236 87274 -6553 22955 130558 -235731 181744 -135697
11840 -378406 -28419 -133568 -89232 -189348 71149 -61754 -136887 -150946 -355077 -101724 203368
11828 -174360 -93706 255687 -298528 -7756 15457 -91696 51691 -138822 51962 -196490 53420
11816 -147309 92599 35458 68281 -174937 85877 -40815 95398 21127 80451 108814 -204915
$$ packed form
11898g4094I1030j571M3040J09381A4133J5556b01256N4257k2290N8989A30616
11886A24663A9683e9958m549j21466B87050A0734J15242i475B2054A994a03236
11874G1764A1783a23443N6398E7021b94590A31529e25k33861F6409g3343c5955
11862a10852A51586F6315h0558l7993A16636c4565l6026b7044m4784E3346K39663
11851B93009a0130A52091a92236H7274f553B2955J07603b35731A81744a35697
11840c78406b8419j05149M4336j00116G1149f1754p5133j4059k04131a01724B03368
11828a74360Q0654B55687b98528g756A5457i1696E1691a38822E1962a96490E3420
11816a47309I2599C5458L2823a74937H5877d0815I5398B1127N9324K8363b04915
$$ plain form
11804 -69895 -210503 -154722 23429 39415 144348 -103720 -2066 122137 266554 -281188 -172694
11793 -172694 -3002 108957 39257 47312 227385 118144 3159 43535 -118302 231586 356878
11782 356878 -250967 84049 326704 -106729 -372569 144821 91269 -144261 -158269 -255125
11772 -255125 -198142 -146284 -52233 -218684 -70527 21679 397005 -256920 -15547 -184747 -115322
11761 -115322 -126762 -125091 -146456 -118967 30421 16100 478877 97330 137315 149130 23193
11749 -196771 29920 -18973 1654 -131544 -129505 -164962 133306 -301554 -184697 92355 253590
11738 253590 2807 196830 80354 -1366 27629 -223498 -111950 -331404 -11881 148331 -166193
11726 -12357 -125060 -130384 410130 -46415 -80359 -17559 -3005 15048 -88020 241923 134590
$$ packed form
11804f9895j40608N5781B3429J5986J04933a03720b066A22137J44417b81188J08494
11793a72694c002A08957C9257Q055J80073j09241C159M0376a18302B31586J25292
11782C56878b50967H4049K42655a06729k65840A44821n3552a44261j4008r6856
11772b55125N6983N1858e2233j66451g0527B1679L75326b56920a5547j69200O9425
11761a15322j1440J671k1365K7489C0421j4321M62777I7330L9985J1815B3193
11749a96771B9920a8973A654a31544K039l5457A33306c01554J16857I2355J61235
11738B53590B807J94023H0354a366B7629b23498J11548k19454a1881A48331a66193
11726a2357j12703n324D10130d6415l3944a7559c005A5048h8020B41923j07333
$$ plain form
11715 134590 160440 199843 -204975 34427 -405519 65818 150663 257188 -33144 120610 -9183
11703 237008 302558 -7408 144927 67984 80852 30705 70347 39427 84641 -72537 101148
11691 -251821 -1692 -316319 77742 215197 190421 40966 -9486 -217937 131190 189216 -161865
11679 181334 -175655 10103 -261444 -114614 -97197 -316897 -457 283986 -63736 329047 -71109
11667 -22380 -140477 61134 218646 201044 -256131 149998 -55017 225277 -313075 118298
11656 107439 24155 -143961 -239667 -186297 308566 229032 205028 -186832 -5065 -262367 148557
11644 -70847 -288951 12956 -49114 232331 -70378 322304 -323898 142590 -50183 318419
11633 112324 202417 251044 -105180 -28965 250959 -83520 -266611 527792 264380 -146058
$$ packed form
11715A34590K5850L9403b04975C4427d05519F5818Q4845J06525c3144A20610i183
11703B37008O5550g408A44927F7984J2868C0705L9642l0920M5214g2537A01148
11691b51821a692l14627G7742J37455k4776D0966i486k08451A31190N8026a61865
11679A81334a75655A0103b61444a14614J7417k19700d57B83986f3736C29047g1109
11667b2380j18097F1134J57512j7602b56131A49998e5017B25277c13075A18298
11656A07439B4155a43961r5706N3370C08566p9534k4004a86832e065k57302A48557
11644g0847k18104A2956d9114B32331g0378C22304c23898A42590e0183C18419
11633A12324R0093M8627a05180b8965B50959h3520j83091E27792k63412a46058
$$ plain form
11622 150044 -141925 43145 -214472 15009 -146693 -68745 -129215 -88251 19218 -11292 -466570
11611 -466570 55156 118370 280700 -49870 133986 34877 -81911 -30550 15585 160109 163563
11600 163563 -362111 108040 356071 -40516 98033 59157 -131276 -106932 -82543 38936 -279346
11588 171612 -162978 17835 257900 145278 213191 360327 143666 115899 493293 76407
11577 86756 141096 89531 -91906 119106 -7666 162103 -105055 -136635 122804 -314497 -110150
11565 247379 1132 49858 -81807 384763 -46612 -116447 311651 160288 53548 -227934 98100
11553 12615 -243252 -50844 -13376 18201 -129154 166103 -5492 129911 10517 27368 -358651
11541 -169751 -48157 -15124 90850 -110316 -22364 -327170 85496 91981 121324 85451 148210
$$ packed form
11622A50044a41925D3145b14472A5009a46693f8745o0470M0964A9218a1292m55278
11611d66570E5156O3214J62330d9870A33986C4877h1911c0550A5585J44524L454
11600A63563c62111A08040K48031d0516I8033l8876a31276K4344K4389C8936b79346
11588A71612a62978A7835K40065j12622O7913J47136A43666k7767L77394G6407
11577H6756N4340n1565i1906A19106g666A62103a05055l1580A22804c14497a10150
11565B47379A132M8726h1807C84763d6612o9835C11651j51363E3548b27934I8100
11553A2615b43252e0844a3376A8201a29154A66103e492A29911A0517J6851c58651
11541a69751d8157a5124I0850a10316b2364l04806H5496O485K9343l5873O2759
$$ plain form
11530 148210 -25677 68454 60517 -9659 89240 -63060 176723 181327 240619 49903 50903 295982
11518 295982 -91456 -97907 281875 21770 432195 123340 -183315 -21313 -357998 -303933 277866
11506 -131249 78502 -95789 -42096 247885 -72451 171768 168660 419107 142587 119932 118890
11495 118890 64826 156177 11269 28741 -48243 -88169 284510 -110786 74586 -271671 228941
11483 -39321 64048 -108220 -104158 -28946 156065 -187798 -51765 129247 242713 434846 226593
11472 226593 -44166 2326 7420 156019 -349989 -13883 72108 179729 96347 -187247 -73301
11460 -41623 216483 130870 -213895 52077 164293 137492 48881 112936 224409 289915 326772
11449 326772 277374 -132119 279696 38526 405935 80004 309474 95829 177573 13666 245688
$$ packed form
11530A48210b5677F8454p937i659H9240f3060A76723M604N9292D9903J000K45079
11518B95982i1456o451B81875B1770M10425A23340a83315b1313l36685N4065B77866
11506a31249G8502i5789d2096B47885g2451A71768l108K50447A42587k2655j042
11495A18890n4064R1351A1269J7472d8243l9926B84510a10786G4586b71671B28941
11483c9321F4048a08220M062b8946A56065a87798e1765A29247J13466J92133k08253
11472B26593d4166B326N094J48599c49989a3883G2108J07621q3382a87247g3301
11460d1623B16483q5613b13895E2077J12216k6801D8881O4055J11473O5506L6857
11449C26772m9398a32119B79696C8526L67409H0004K29470I5829Q1744A3666K32022
$$ plain form
11438 245688 -299942 24604 -177826 130474 70423 31775 24412 -104593 -41078 293527 -147241
11426 -257577 -92437 -46126 217588 -69533 202022 -68649 -107431 123081 -238015 -254467 -48126
11414 233128 22862 185358 -126310 124098 324568 249374 168329 -77319 45658 175384
11404 175384 29633 11378 -246455 232060 -93028 -227566 -25162 82720 -107172 33135 232363
11393 232363 31479 182440 -41484 218670 -58739 46489 123334 172668 159842 -183855 251573
11381 31329 9706 68346 -164128 -2571 -92605 -297389 -27013 161318 154482 10934 -471957
11369 -164475 144173 54265 -33272 326839 -67623 34751 -222933 211089 -72742 -178836
11359 -178836 208117 -9071 -16282 98085 76949 222827 -10089 -24117 28730 -50627 76902
$$ packed form
11438B45688b99942B4604a77826A30474o0051C1775p363a04593d1078B93527a47241
11426b57577i2437d6126B17588f9533B02022f8649l8782A23081b38015j6452d8126
11414B33128B2862J62496a26310A24098K00470p5194q1045g7319D5658J29726
11404A75384B9633A1378b46455B32060i3028j34538b5162H2720a07172C3135J99228
11393B32363C1479J50961d1484B18670e8739D6489P6845M9334j2826a83855B51573
11381C1329I706N8640a64128b571r0034k04784b7013A61318o836A0934d71957
11369a64475A44173E4265c3272C26839f7623C4751b22933B11089g2742j06094
11359a78836B08117i071p211I8085k1136J45878a0089j4028B8730e0627G6902
$$ plain form
11347 88451 -186028 -176239 -43153 -254356 -204833 -194456 159234 -45253 -149763 -352409 26788
11335 89821 116523 103552 160881 -126101 -47398 195651 88416 58043 58127 54447 134837 -57875
11322 31455 -504098 38013 -316874 120428 -275162 -37831 90257 50069 128103 -18500 17291
11310 172737 -104247 6218 -105833 -150956 -180127 29244 38719 -172867 106111 -392645 -147390
11298 214835 -151414 441001 -82093 26555 -206236 16768 148973 -248037 74446 337277
11288 337277 52525 -22295 196596 -53487 69276 106605 166177 -164477 22058 -140839 11085
11276 -50147 -197599 204949 -153482 274316 -136137 -177177 33267 170487 -98077 847 165388
11265 165388 80459 -255153 93333 41091 48839 -294583 95438 175922 -51185 92302 -41857
$$ packed form
11347H8451a86028R789d3153k11203M9523J0377A59234d5253j04510k02646B6788
11335H9821K6702j2971N7329a26101d7398A95651H8416l0373Q4l680Q0390e7875
11322C1455e04098C8013c16874A20428b75162c7831I0257m0188P8034a8500A7291
11310A72737a04247F218a05833m5123k9171B9244R475a72867A06111c92645a47390
11298B14835a51414D41001h2093B6555b06236A6768J32205b48037G4446K62831
11288C37277E2525b2295A96596e3487F9276L7329N9572a64477B2058a40839A1085
11276e0147j47452B04949a53482B74316a36137m1040C3267J37220i8077H47J64541
11265A65388H0459b55153I3333D1091P748b94583I5438Q0484e1185I2302d1857
$$ plain form
11253 -240180 -55905 -65826 16607 121337 78044 83583 107474 -14988 -125933 -60953 104272
11241 -256259 102991 -60436 228509 -99020 -140406 204971 -51359 -174463 -111194 -175976 -167848
11230 -167848 198868 54310 15754 95327 -246867 375613 43664 -6544 64622 -69975 -130019
11219 -130019 -247805 44686 52960 275289 -7209 128852 -123558 -32169 104352 -326738 -387153
11208 -387153 98233 -46437 -88571 -220470 -97571 -138046 -22161 -252357 102323 -317090 -157098
11196 -84821 84798 -207117 -111431 -55874 -73344 -99297 -294297 -28007 89354 189013 31994
11184 -118493 227222 -84732 -249839 1035 -147872 3085 -120111 -92467 530592 157050 -117885
11172 143428 -278449 71180 -74604 229958 -34031 -364766 49537 301004 -190090 -408285
$$ packed form
11253b40180e5905r921A6607J04730m3293N539K3891a4988j10945f0953A04272
11241b56259A02991f0436B28509i9020m1386B04971e1359j23104O3269o4782Q128
11230a67848A98868E4310A5754P9573b46867C75613D3664f544F4622f9975o0044
11219a30019j17786D4686Q274K22329g209A28852a23558c2169A04352c26738o0415
11208c87153I8233d6437m2134j31899i7571m0475b2161k30196A02323c17090a57098
11196h4821H4798b07117R5686N5557j7470k5953j95000b8007H9354R9659C1994
11184a18493B27222h4732j65107A035a47872C085a20111K7644E30592A57050a17885
11172A43428b78449G1180g4604B29958c4031l30735D9537K51467a90090k18195
$$ plain form
11162 -408285 -174529 -52427 -88378 9241 86601 -204271 -39930 -1332 -321229 -121905 184260
11150 58957 204307 -235221 -46380 -106543 42822 -73908 -186212 175385 264550 418193 -155525
11138 15843 -321295 -33256 46879 -275365 -205098 -67280 -80277 -211517 140141 -188862 -73991
11126 388308 44968 56263 -65069 146494 139186 132860 -49890 -66951 -65833 -365332 -319246 -102605
11113 43933 173298 126707 144090 69367 411551 261860 92685 -169171 -363090 -108013
11102 338956 74811 40038 -253871 -31645 211346 264594 281890 276895 387218 60182 207058
11091 207058 292333 274967 -37137 149287 119247 85336 -318754 -165415 -115555 18251 304151
11080 304151 228481 161544 304663 516285 268211 -27871 10927 139167 188012 65444 -149600
$$ packed form
11162d08285a74529e2427l5951I241P7360b04271c9930a332l19897a21905A84260
11150E8957J45350b35221d6380o0163D2822g3908j12304A75385Q9165J53643a55525
11138A5843c21295c3256D6879b75365P0267f7280j2997j31240A40141a88862g3991
11126C88308D4968J1295f5069A46494p308o326d9890j7061J118k99499M6086a02605
11113D3933J29365m6591J7383F9367L42184j49691I2685a69171j93919a08013
11102C38956G4811l4773b53871c1645B11346N3248J7296m995J10323F0182J46876
11091B07058Q5275j7366c7137A49287l0040l3911c18754J53339M9860A8251K85900
11080C04151p5670o6937J43119K11622k48074b7871A0927J28240M8845F5444a49600
$$ plain form
11068 -119376 22993 327491 80994 172085 339637 30225 202936 540531 397800 325592
11058 325592 532887 117636 448815 373361 220715 233398 207448 265182 399320 289535
11048 289535 797103 201116 37725 142800 -5775 372376 618197 453836 986229 401669
11037 787156 425722 391452 537010 244995 847048 866063 521534 699726 353766 616559
11027 616559 517008 475789 566544 734074 673874 684370 603991 552374 764483 626793 573220
11016 573220 369992 661557 494171 654640 620194 556800 773742 742753 298139 639177
11006 639177 644856 839571 758066 501456 399392 413179 265648 562173 513894 173236
10995 508447 241008 328575 565602 391795 540311 779257 474573 509842 773831 375152
$$ packed form
11068a19376B2993L04498H0994R1091J67552C0225J72711L37595j42731p2208
11058C25592K07295A17636L31179p5454j52646J2683k5950N7734J34138j09785
11048B89535N07568B01116C7725J05075e775C72376K45821j64361N32393D01669
11037G87156l61434l4270J45558B44995O02053J9015l44529J78192l45960K62793
11027F16559r9551m1219R0755J67530o0200J0496q0379n1617K12109j37690n3573
11016E73220k03228K91565j67386J60469l4446o3394K16942l0989B98139L41038
11006F39177N679J94715q1505k56610j02064J3787j47531K96525m8279A73236
10995E08447B41008Q7567K37027j73807J48516K38946l04684L5269K63989C75152
$$ plain form
10984 483967 589825 593571 581356 663333 507252 693635 558547 647502 479182 560133 601171
10973 601171 827392 761855 948997 927799 692960 1201982 1063788 1024739 1174458 1520649
10963 1520649 1165583 1309487 1498671 1823897 2056620 2284627 2263471 2272118 2247015 2296284
10953 2296284 1703136 1920940 1788871 1301521 1281904 1248772 1012921 1066651 1354982 1034531
10943 1034531 1093478 1240625 1119063 1106853 999408 802515 778883 541797 460660 431371
10933 431371 352383 497812 270615 348449 -114130 195263 250611 -27937 191712 161154
10923 161154 60280 -176153 76004 344810 -381171 208540 209900 147543 57832 109753 40556
10911 -24008 111743 -205062 -92014 138605 98166 -156033 -21605 -110774 -110750 -371081 -22584
$$ packed form
10984D83967J05858L746j2215Q1977j56081J86383j35088Q8955j68320Q0951M1038
10973F01171K26221o5537J87142k1198k34839N09022j38194l9049J49719L46191
10963A520649l55066J43904J89184L25226K32723K28007k1156Q647k5103M9269
10953B296284n93148K17804j32069m87350j9617l3132k35851N3730K88331l20451
10943A034531N8947J47147j21562j2210j07445j96893k3632k37086q1137k9289
10933D31371p8988J45429k27197P7834a14130A95263N5348b7937A91712l0558
10923A61154F0280a76153G6004K68806c81171B08540J360o2357E7832N1921D0556
10911b4008A11743b05062i2014A38605m0439a56033b1605q9169K4k60331b2584
$$ plain form
10899 -136339 -272504 -137730 179091 -57632 101317 -336486 90631 111431 -462789 -33570
10888 -81032 -10950 12301 101664 36192 383717 -90617 66839 -158967 -375343 -229651 -128313
10877 -128313 -433603 34723 -225001 -66307 -164655 -177695 -52891 235901 -288829 61583 192
10865 -197314 -48525 178235 -346110 -81227 -100659 -342289 -316081 116201 -26499 303843
10854 -161450 -167645 -114504 260070 84759 -235966 -11831 149325 -278214 -169631 -18085 -69507
10843 -69507 222937 108809 -411387 -555205 159253 103177 -1599 -61132 -54323 -209851 -56190
10831 -132309 251371 -330610 -195083 -61622 -361507 63381 127467 -212098 190182 15660
10820 316091 159462 50276 39488 89225 130628 45645 73101 -184984 201725 -171325 -363713
$$ packed form
10899a36339j36165J34774A79091e7632A01317c36486I0631K0800d62789c3570
10888h1032a0950A2301Q9363C6192L47525i0617F6839a58967k16376J45692J01338
10877a28313l05290C4723b25001f6307r8348j3040e2891B35901b88829F1583A92
10865a97314d8525A78235c46110h1227j9432k41630K6208A16201b6499C03843
10854a61450o195N3141B60070H4759b35966a1831A49325b78214J08583a8085n1422
10843f9507B22937A08809d11387j43818A59253n6076a599n9533O809j55528e6190
10831a32309B51371c30610J35527f1622k99885F3381O4086b12098A90182A5660
10820C16091j56629E0276j0788M9737M1403D5645K7456a84984B01725a71325j92388
$$ plain form
10809 -363713 79541 -128467 35469 -304610 -10590 85816 -81632 -538152 147993 111619 65285
10798 65285 -49868 49295 -189315 -263024 294516 172519 212642 109006 191072 55194 143602
10787 143602 -60499 336127 -70124 -193001 160475 -22605 101132 137249 -120990 164402
10776 110799 -34539 -180887 227164 -261751 128638 -160352 -352807 -28105 269707 -115660
10765 -27688 93091 -421441 -110056 -192099 -344202 111629 143839 -144258 42491 193771
10755 193771 -11507 -102783 -93922 -46042 -159689 113272 103087 -82204 53377 -154385 -69561
10743 21656 -89296 56420 -29975 -50866 -178397 -7342 -3210 -56171 -16350 -45981 108627 115382
10731 115382 29380 -138691 36922 80213 71113 96989 62834 -77037 64423 167802 111217
$$ packed form
10809c63713G9541a28467C5469c04610a0590H5816h1632m56520A47993l6374m6334
10798F5285d9868D9295a89315p3709B94516j21997M0123j03636Q2066E5194Q8408
10787A43602f0499C36127g0124j22877A60475b2605A01132L6117a20990A64402
10776A10799c4539j46348B27164b61751A28638a60352j92455b8105B69707a15660
10765b7688I3091d21441a10056q2043j52103A11629L2210a44258D2491J51280
10755A93771a1507r1276Q861d6042j13647A13272j0185h2204E3377a54385f9561
10743B1656h9296E6420b9975k0891j27531g342c210n2961a6350k9631A08627O755
10731A15382B9380a38691C6922M3291r100K5876l4155g7037F4423J03379n6585
$$ plain form
10720 111217 -281126 -199682 -193522 -256790 28662 -77556 35499 220162 -109914 -80172 -364766
10709 -364766 180593 -91808 -128803 -128229 38314 -175496 42722 97860 63816 -62950 -42734
10698 -42734 90654 50587 -234519 -45042 -161505 -170223 -111459 117475 -261906 175654 381
10686 143946 -41878 25619 -106615 -345031 -176007 -282443 5368 -57411 -264606 -379264
10676 -379264 -176816 -87910 89129 -61103 153227 -21635 -215439 158076 61785 -77555 -7384
10664 -98207 -102543 -69424 -40233 -30622 -186223 -72776 47138 18840 112954 -242463 -1011 -23018
10652 -23018 -72702 49109 -214100 78449 -104640 -114016 133329 137237 -494547 -170296 168170
10640 -352107 -398158 -163216 -205100 159983 -82364 68852 -351688 -98032 -180797 290645 -46906
$$ packed form
10720A11217b81126Q1444O160o3268B8662g7556C5499J84663a09914K9742k84594
10709c64766A80593i1808l6995N74C8314a75496D2722N5138l4044f2950K0216
10698d2734I0654m0067b34519d5042j16463q718N8764A17475b61906A75654C81
10686A43946d1878B5619a06615k38416J69024j06436E368e7411k07195j14658
10676c79264a76816h7910H9129f1103A53227b1635j93804A58076F1785g7555g384
10664i8207m336L3119K9191R611j55601g2776D7138A8840R4114b42463a011k2007
10652b3018m9684D9109b14100G8449a04640r376A33329L908d94547a70296A68170
10640c52107m6051a63216m1884A59983h2364F8852c51688i8032q2765B90645d6906
$$ plain form
10628 -315908 -281592 -228278 -166882 -225706 -223874 89636 57035 226416 -315420 -128686 -8481
10616 19480 211920 -118245 -230034 286422 -262398 -375031 26529 275810 -157034 138042
10605 -232713 -129240 45503 -56935 212846 -53554 -131952 -55084 -27122 -76163 -106544 287995
10593 -9643 230429 223737 -103024 -6945 29638 232033 -161637 -49516 46378 146705 52276
10581 -8416 14153 21066 -80518 103247 132699 -12682 -239207 59034 155341 -157631 -20749
10569 33793 -14639 -129944 -48503 -235676 87724 276962 91334 142377 -41593 145700 -131187
10557 -141172 -166262 -148018 -32740 -155368 -43859 -113783 6063 -256687 231093 218269 -130165
10545 -306962 18601 266680 44998 6057 -128739 61079 -69513 177890 -185724 301055 111873
$$ packed form
10628c15908L4316N3314O1396n8824J832H9636l2601J69381c15420a28686h481
10616A9480J92440a18245j11789B86422b62398j12633B6529K49281a57034A38042
10605b32713J03473D5503e6935B12846e3554p8398e5084b7122m9041l0381B87995
10593i643B30429o692a03024f945B9638K02395a61637d9516D6378J00327E2276
10581h416A4153O913h0518A03247K9452a2682k26525E9034R6307a57631b0749
10569C3793a4639j15305d8503j87173H7724J89238I1334N1043d1593A45700a31187
10557a41172k5090J8244c2740j22628d3859o9924F063b56687B31093j2824a30165
10545c06962A8601K48079D4998F057a28739F1079f9513A77890a85724C01055A11873
$$ plain form
10533 73951 3872 -405252 -329796 -246659 -128688 -250101 -101389 78675 217991 226309 64509
10521 307834 46792 -23684 -276619 -99494 -93478 2575 149705 -271703 107223 -199222 -142165
10510 -142165 -31160 51263 -152103 -10194 216045 -143155 -129758 -125157 8720 -56045 68891
10498 -24482 134527 -147939 -284143 20844 -28799 -244975 -201391 -150103 -323413 -112871
10487 -236053 -66492 -132717 -48425 64972 -379397 -120649 -26913 -98278 -87133 13800 110979
10476 110979 208364 -265385 236053 -35359 -3447 14584 181069 8550 66748 299192 60171
10464 166851 138499 251558 229580 267353 -169178 44246 27277 -47489 -19707 5236 130060
10453 130060 -19372 113291 -51345 5945 -214932 6443 -41616 309811 -137243 67018 -45736
$$ packed form
10533G3951C872d05252P5456Q3137J17971j21413a01389G8675J39316Q318F4509
10521C07834D6792b3684k52935i9494O016B575J47130b71703A07223a99222N7057
10510a42165c1160E1263a52103a0194B16045a43155J3397M601H720e6045F8891
10498b4482A34527a47939j36204B0844b8799k16176M3584N1288j73310a12871
10487b36053f6492o6225d8425F4972c79397a20649b6913p1365J1145A3800R7179
10476A10979R7385b65385B36053c5359c447A4584J66485H550N8198K32444F0171
10464A66851k8352J13059k1978L7773a69178D4246j6969d7489a9707E236J24824
10453A30060a9372A13291e1345E945b14932F443d1616C09811a37243F7018d5736
$$ plain form
10441 -143894 -325313 218763 187108 141061 74178 -72395 29781 86615 8041 49964 74174
10430 74174 229431 -30729 -51598 -39263 95172 -300566 64399 -83563 -144379 84455 165006
10419 165006 -117771 -243535 132193 81399 -212151 -222247 -192933 -89622 263651 -227195
10408 -96549 205035 -1890 169779 205058 146566 -590903 -128161 30531 -202673 280787 -43177
10396 223498 -185168 -65892 -162993 -62803 -146894 43824 -204913 8593 -79348 -41734 62205
10384 274088 26216 -5236 -23420 83297 556009 -377977 129525 -98345 290587 -53260 143602
10372 208730 147797 138629 184449 400262 115785 111016 41128 -122776 285370 -154117 160867
10360 415858 262643 333585 389252 -5926 119354 246497 374462 492785 329147 174056
$$ packed form
10441a43894j81419B18763l1655m6047o6883g2395B9781N6834H041M1923K4210
10430G4174J55257c0729k0869J2335I5172c00566F4399h3563o0816H4455Q0551
10419A65006a17771j25764A32193n0794b12151j0096K9314h9622B63651b27195
10408i6549B05035a890A69779L5279n8492e90903a28161C0531b02673B80787d3177
10396B23498a85168f5892r7101f2803q4091D3824b04913H593g9348L7614F2205
10384B74088B6216e236j8184H3297M72712c77977A29525i8345B90587e3260A43602
10372B08730o0933r168M5820K15813A15785m769D1128a22776B85370a54117A60867
10360D15858j53215P0942N5667e926A19354J27143J27965J18323j63638j55091
$$ plain form
10350 174056 64855 358741 -110199 97971 359004 190045 -2229 26823 385800 -30000 170584
10338 228912 277778 551242 532928 389780 324067 -81028 208730 117543 223778 615290
10328 615290 317709 93184 173278 320655 28373 33090 -66792 332798 -164817 -246356 295222
10316 194463 -112010 50080 108152 144303 46650 259795 188797 182351 14071 219118 163168
10305 163168 301340 -42860 101464 5452 -38313 78832 135085 -18350 49818 131052 -49555
10293 -38083 -136665 155121 251804 -387835 -310349 -220730 70469 156240 -90598 -95622 -932 169566
10280 72462 -107197 8708 85854 142190 -258326 15106 96598 224552 -132777 339109 -131413
10268 -112429 22134 -156996 -66206 293461 -15927 76504 -241714 -97974 353022 170493
$$ packed form
10350A74056F4855K93886a10199I7971K61033j68959b229B6823L58977c0000A70584
10338B28912M8866K73464j8314j43148o5713h1028B08730r1187J06235L91512
10328F15290k97581I3184Q0094J47377B8373M717f6792C32798a64817q1539B95222
10316A94463a12010E0080N8072L6151D6650K13145p0998o446A4071K05047n5950
10305A63168J38172d2860A01464E452c8313G8832N6253a8350D9818Q1234d9555
10293c8083r8582A55121R6683c87835P7486Q9619G0469Q5771i0598n024i32A69566
10280G2462a07197H708P7146N6336b58326A5106Q1492J27954a32777C39109a31413
10268a12429B2134a56996f6206B93461a5927G6504b41714i7974C53022A70493
$$ plain form
10257 49623 -51796 59590 -177082 -212723 322504 219795 -34507 -200328 171708 -253011
10246 130668 -150637 160946 209271 42170 -18835 -56027 300589 73372 -46568 -191941 108530
10234 246726 69332 183447 -101164 136383 244443 58552 267148 -158662 -304599 -379526
10224 -379526 -313255 -369121 -97770 -34530 -34498 183255 98542 -87353 -100585 -144878 -130321 -268545
10212 -268545 213242 -120257 11528 -206197 294444 -22994 -425 -262297 -275517 -83531 -339861
10201 -339861 -125084 -249394 -343768 145677 -182540 138703 61838 -104532 43181 -167438
10190 -137366 -29822 -82434 8127 -325762 -166496 224484 -159364 -3377 284085 -5414 40049
10178 45084 -17248 384069 -162887 144740 -49384 -236599 -40704 -68074 75930 -99748 -234922
$$ packed form
10257D9623e1796E9590a77082l5641C22504j02709c4507j65821A71708b53011
10246A30668a50637A60946M8325D2170a8835l7192C00589G3372d6568j45373A08530
10234B46726F9332J14115a01164A36383J08060E8552K08596a58662j45937p4927
10224c79526O6271n5866i7770c4530L2A83255q4713h7353j3232m4293J4557j38224
10212b68545B13242a20257A1528b06197B94444b2994d25k61872j3220h3531k56330
10201c39861a25084j24310r4374A45677a82540A38703F1838a04532D3181a67438
10190a37366b9822n2612H127c25762J59266B24484a59364c377B84085e414D0049
10178D5084a7248C84069a62887A44740d9384j87215d0704k7370G5930i9748j35174
$$ plain form
10167 -234922 10722 -130742 -91936 -125648 -354949 -66627 -87811 -20278 -253092 224496 -132329
10155 88539 157440 -69646 -264722 14831 185688 66897 101060 19900 -18284 -171161 -297325
10144 -297325 333908 -30201 -276449 312049 69672 -132946 -143968 -173198 -49849 -367661
10134 -367661 -237587 -129529 199233 -294957 67441 93770 142822 -170006 74919 427431
10124 427431 -130911 60070 -17265 -191708 79410 57714 102831 -1676 272442 -135852 82911
10112 -6928 154871 -251161 44531 -93561 247298 181661 -129822 -194868 248364 254716 -111384
10100 -57508 17774 -33803 224110 206689 -146292 -226577 -260835 -250450 99160 123539 282922
10089 282922 -89069 -215489 -120471 -12058 12135 96003 -37486 -281157 -300414 -188849 -18847
$$ packed form
10167b34922A0722a30742L8806l3712k29301f6627k1184b0278k32814B24496a32329
10155H8539O8901f9646j95076A4831J70857F6897L4163A9900a8284j52877j26164
10144b97325C33908c0201k46248C12049F9672a32946j1022k9230d9849l17812
10134c67661J30074J08058A99233b94957F7441K6329M9052a70006G4919L52512
10124D27431a30911F0070a7265j74443G9410k1696M5117a676B72442a35852H2911
10112f928A54871b51161D4531i3561B47298o5637a29822o5046B48364O352a11384
10100e7508A7774c3803B24110j7421a46292q0285l4258J0385I9160K4379J59383
10089B82922h9069j26420R5018a2058A2135Q3868c7486k43671j9257J11565a8847
$$ plain form
10077 29628 -262852 -191305 -62486 -169937 -218407 -148195 354979 13544 -418366 -18527 -119727
10066 -119727 67483 -291879 100194 -103447 -172872 -124274 7837 -86170 -134082 199068 23529
10054 -229275 -351018 -9780 156701 -166084 -39436 96373 130265 402354 92324 -25709 -181477
10043 -181477 97464 49379 -187788 -215495 -72351 -134295 -112188 -68594 -72256 -141114 53557
10031 164939 255400 -188682 187452 -118205 -385966 394275 -342722 -193098 -225449 -56044
10020 -50942 -4013 -365160 -131504 -52592 180274 181365 -125628 -96152 -288431 -95193 -118699
10009 -118699 -128019 154701 -36224 71324 -209551 -68158 -13669 180766 -6796 -367968 -46350
9997 -130927 69216 -107073 136038 229268 -210672 67022 305944 53767 -467669 334049
$$ packed form
10077B9628b62852P1547f2486j07451m8470P0212C54979A3544d18366a8527j01200
10066a19727F7483b91879A00194a03447o9425M8598G837h6170m7912A99068B3529
10054b29275j21743i780A56701a66084c9436I6373L3892K72089I2324b5709j55768
10043a81477I7464m8085a87788k7707g2351o1944K2107M3594l662o8858E3557
10031A64939R0461a88682A87452a18205k67761C94275c42722J49624l2351e6044
10020e0942d013l61147a31504e2592A80274J091a25628K9476j92279i5193k3506
10009a18699r320A54701c6224G1324b09551f8158a3669A80766f796l61172d6350
9997a30927F9216a07073A36038R3230b10672F7022K38922E3767d67669C34049
$$ plain form
9986 -250088 -76503 -45048 -121140 28526 -282630 -283314 66377 -52413 161703 213302 -187890
9974 32345 -54088 -8918 81385 -121260 -177461 -34770 -56153 -40527 -70202 -197543 -187689 -65697
9961 -276142 145595 -103642 -133509 155803 -140820 -145644 -30086 -17899 71570 -346025 31302
9949 -18908 -98133 133478 -228841 -81041 -117209 -107218 -189704 31497 65416 130739 -221776
9937 -144041 -121974 -7308 -66161 -20480 74632 -44760 -7758 -32991 41065 -106323 135598 -42489
9924 26827 17257 -202760 6576 -236355 -132093 -163516 -3797 -294887 -205115 -164563 -219644 -201008
9912 -201008 -150367 -188671 -214690 -37753 150750 77145 69603 -76173 -163873 78014 -289505
9900 35628 -1899 -103424 92987 62616 69957 -63368 14006 -28076 -307426 -367064 -431040 170232
$$ packed form
9986b50088g6503L1455p6092B8526b82630o84F6377e2413A61703N1599a87890
9974C2345e4088h918H1385a21260n6201c4770k1383J5626k9675j27341R854f5697
9961b76142A45595a03642k9867A55803a40820m824c0086J2187G1570c46025C1302
9949a8908p9225A33478b28841h1041l6168R991q2486C1497L3919O5323b21776
9937a44041K2067g308n8853b0480G4632d4760g758k5233D1065a06323A35598d2489
9924B6827r570b02760F576b36355J04262l1423c797k91090Q9772M0552n5081J8636
9912b01008N0641l8304k6019c7753A50750p3605p542g6173q7700G8014b89505
9900C5628a899j01525I2987l0371P341f3368A4006b8076k79350n9638o3976A70232
$$ plain form
9887 242119 -343378 69968 -126121 2834 -86873 -75340 -492915 262123 188945 -59403 11244
9875 21311 -4575 -420893 5671 -5413 -77682 21827 -100908 -68923 -189070 -118204 -61119 -43710
9863 -43710 4499 -61312 -62799 -220296 -8710 -56804 63291 -6193 -39011 -559109 -238975 -292895
9851 -292895 225828 -154680 36550 -259427 129312 -276166 23773 73318 -259750 -110729
9840 78600 -88656 271949 -180581 29536 -328079 125752 -87992 -179395 36228 -437 18896
9828 -175230 92048 187396 8718 237357 -197278 306447 -56956 73486 24198 168956 -42283
9816 203161 -174449 6317 107656 -92693 9365 -182243 61032 -268665 -65010 27087 183564
9805 183564 106609 4800 98847 -121442 143972 -383980 -115709 5174 -262214 -229682 201907
$$ packed form
9887B42119c43378F9968a26121B834h6873J1533m17575B62123p3178e9403A1244
9875B1311d575m16318E671e413p2269B1827a00908L1985j20147P0866N7085J7409
9863d3710D499f1312j487j57497h710m8094F3291f193l2818n20098b38975n3920
9851b92895B25828a54680C6550b59427A29312b76166B3773M9545b59750a10729
9840G8600h8656B71949a80581B9536c28079A25752h7992r1403C6228d37A8896
9828a75230I2048R5348H718K28639a97278C06447e6956G3486B4198J44758d2283
9816B03161a74449F317J01339i2693I365a82243F1032b68665f5010B7087J56477
9805A83564p6955D800R4047a21442A43972c83980a15709E174b62214L2532B01907
$$ plain form
9793 -166945 -426085 87945 -247183 242771 55648 249084 446838 -413236 -9531 -158410
9783 -158410 -69835 1169 -207097 35380 110160 -205324 111758 240660 -5325 -307344 162428
9771 -79033 -123569 -112151 41013 89978 -225151 -74937 15870 -54386 -76560 -133113 -102149 126608
9758 -105252 -50081 173875 169647 214334 -127761 208234 -87051 27614 31824 -263513 -293848
9747 -293848 -191116 -319445 -42469 76447 -72834 42219 189103 -320214 -104148 -289317
9737 -289317 43069 189100 -176570 24672 -21628 226917 92359 220061 -75182 15412 94654
9726 94654 99188 -305793 258287 -330707 -17414 -1129 59522 -87001 28920 206275 -136048
9714 -61198 3514 -189802 -27029 169042 -170644 -270014 12523 57814 -443332 -114112 -69521
$$ packed form
9793a66945k59140H7945b47183B42771E5648J93436J97754d13236i531j48879
9783a58410f9835A169b07097C5380P4780b05324A11758J28902e325l02019A62428
9771g9033m4536J1418D1013M8965b25151g4937A5870e4386k2174n6553L0964A26608
9758a05252e0081A73875m228M4687a27761B08234h7051B7614M210b63513l0335
9747b93848J02732j28329d2469G6447g2834D2219J46884c20214a04148j85169
9737b89317D3069J46031a76570B4672b1628B26917I2359J27702g5182A5412P9242
9726I4654M534c05793B58287c30707a7414a129E9522h7001B8920J77355a36048
9714f1198C514a89802b7029A69042a70644r9370A2523M5291d43332a14112M4591
$$ plain form
9703 -69521 82781 -65646 -137812 -405631 -73637 -171263 -68162 116615 5718 -285698 -68961
9691 -3443 134318 -121665 -232171 -113094 76405 7638 -195340 306515 -158037 108943 -210589
9679 -16838 117453 -228208 79054 -401332 -164172 -46827 -36010 -165390 -245448 -117799 -274265
9668 -274265 137219 -364222 147515 123442 -8759 224244 -38090 297829 42926 175819 -434370
9656 -352655 217921 -148960 113982 -135291 -384800 -124968 -27177 32056 -190766 32228
9645 95950 121031 -20377 46438 -23111 -240759 -137460 -219550 -378543 -65772 -347767 -54801
9633 -273112 21882 57510 -289304 -128892 299822 -234090 -106423 -111154 -180042 -125235 168447
9621 -273067 62651 97799 116677 131501 -86363 -241283 -21499 64540 -43306 83879 -204865
$$ packed form
9703f9521H2781f5646p2166k67819g3637r7626f8162A16615E718b85698f8961
9691c443A34318a21665j10506a13094G6405G638a95340C06515a58037A08943b10589
9679a6838A17453b28208G9054d01332a64172d6827J0817j29380q0058a17799j56466
9668b74265A37219c64222A47515k4073h759B24244c8090B97829D2926J32893d34370
9656c52655B17921a48960A13982a35291k49509a24968b7177C2056a90766C2228
9645I5950K5081b0377D6438b3111k17648J03299q2090j58993f5772k81995e4801
9633b73112B1882L5628b89304a28892B99822b34090a06423m731o8888N4807A68447
9621b73067F2651L5148J8878J4824h6363j54920b1499F4540d3306H3879b04865
$$ plain form
9609 -275341 92049 -110196 -402789 -90765 -300223 -135666 85272 42278 31191 -265525 162676
9597 -58572 -147051 -125503 16174 -77589 -129232 104540 -22250 67819 -142107 -3848 -462201
9586 -462201 -154953 -41880 103236 -153864 -129876 -196780 -89458 -51055 20975 106431 81937
9575 81937 251730 -202841 171687 -1456 104406 83823 -150181 -55270 180817 55848 -333313
9563 44455 -44183 121735 -79730 -361577 -288794 -187221 -165049 365266 92980 -201906 -255714
9552 -255714 216651 30750 -204051 42199 -483413 133040 172029 84679 254548 277412 14934
9540 54037 -124842 -614402 39554 109468 -137397 -162322 -46801 -11331 170522 -51135 -114067
9529 -114067 -197399 78455 3535 -97875 190452 150836 73933 85988 61146 -224305 -272355
$$ packed form
9609b75341I2049a10196k92593i0765k09458a35666H5272D2278j1087b65525A62676
9597e8572q8479K1548A6174g7589n1643A04540b2250F7819a42107c848m58353
9586d62201a54953d1880A03236a53864K3988o6904h9458L8403B0975Q5456k4494
9575H1937J69793b02841A71687a456A04406k0583a50181e5270A80817E5848c33313
9563D4455d4183A21735g9730k81847P2783J01573K2172C65266I2980b01906n3808
9552b55714B16651C0750b04051D2199d83413A33040L8989H4679J69869K2864A4934
9540E4037a24842m89560C9554O9914a37397k4925d6801a1331A70522e1135o2932
9529a14067q3332G8455C535i7875A90452l9616G3933J2055k4842b24305m8050
$$ plain form
9518 -272355 -338470 318538 111394 -29357 -95294 45518 181655 -284402 -86666 47679 31971
9507 31971 182216 161544 191132 -197851 -15170 -184060 306265 -72569 -97080 96263 -287067
9495 54304 -309248 153865 41455 -67813 -153130 -318956 -170460 -51958 -126007 -92164 -223780
9484 -223780 32100 97795 16966 -134750 38187 195096 -245203 -168034 280120 -228338 -3641
9472 -152671 -105166 -183482 -41630 -22637 -298286 45553 -601960 -49859 66537 -108018 116343
9460 -210774 -48458 -254473 -97074 -71850 -199005 301517 -69791 12775 -327481 170655 -58734
9448 -152084 -59201 10266 8412 70813 -59384 -19414 130867 112934 -182774 -34360 -16707
9436 61450 -45177 199699 287617 50957 -452976 -57010 94302 -168266 5995 -175584 -62905
$$ packed form
9518b72355o6115C18538A11394b9357o5937D5518J36137b84402h6666D7679j5708
9507C1971J50245k0672K9588a97851a5170j68890C06265g2569k4511I6263b87067
9495E4304c09248A53865D1455f7813q5317j65826J48496e1958p4049L3843j31616
9484b23780C2100O5695A6966a34750C8187J56909b45203P7169B80120b28338c641
9472a52671M7505p8316d1630J8993k75649D5553f01960d9859F6537a08018A16343
9460b10774d8458k06015i7074K5224j27155C01517f9791A2775c27481A70655e8734
9448a52084e9201A0266j854O2401e9384a9414A30867j7933a82774c4360a6707
9436F1450d5177A99699Q7918E0957d52976e7010I4302a68266E995a75584f2905
$$ plain form
9424 -105935 70415 187211 -107075 239118 48607 368 321583 -25613 -318739 24951 34402
9413 34402 216966 224352 144157 124169 402750 145752 -15721 88599 -137041 -410153 28054
9401 -176756 -41183 -249389 -20225 -147657 -77985 477060 286937 28073 76034 -81158 152056
9389 -272740 -50152 -34949 -103226 120770 31376 -35527 13016 35878 -140069 34083 -125934
9377 -62158 53404 24891 -60360 2640 68772 -119022 -208870 -195371 12958 -106021 58562 -171628
9364 -29148 -149959 -39878 118626 -51020 -210414 -43712 21686 -31129 -107747 -92809 -291288
9353 -291288 -374572 135806 -344914 -91917 -104525 -26377 56820 -216805 54866 -75030 -239311
9342 -239311 153708 -141888 -232681 -121086 -193046 72704 -309899 19364 -20119 -149820 67961
$$ packed form
9424a05935G0415J16796a07075B39118D8607C68L21215b5613k93126B4951R451
9413C4402J82564P386q0195j9988K78581A45752a5721H8599a37041k73112B8054
9401a76756d1183k08206b0225j27432O9672D77060j90123B8073M7961h1158A52056
9389b72740e0152J5203o8277A20770C1376c5527A3016K2862a40069C4083a25934
9377f2158E3404B4891f0360B640O6132a19022q9848J3499A2958a06021E8562a71628
9364b9148j20811c9878A18626e1020j59394d3712B1686c1129p6618J4938j98479
9353b91288q3284A35806c44914i1917j2608b6377E6820b16805E4866g5030j64281
9342b39311A53708a41888r0793J11595p1960G2704c09899A9364b0119j29701F7961
$$ plain form
9330 151405 -102321 10220 -183811 -1227 -14399 79697 43526 -113376 124421 64809 86763
9319 86763 -233691 -186280 -239668 17491 15537 -61854 -46677 366100 -447582 -48065 -121504
9308 -121504 -63042 -162583 -140634 35692 -10540 -361253 -126173 -106108 85366 10366 -141084
9296 22281 -72917 36847 72067 -188997 -16636 -366589 -113729 49520 -105649 -217057 56017
9284 -205086 153942 -67260 -93246 118126 -149426 -111730 -76044 -49574 -135566 -4598 -143894
9273 -143894 -83338 -111480 -133520 99342 -602629 2776 16820 -54617 48099 -84757 200654
9261 46190 -75100 41102 216298 15440 -81867 127545 188455 -13879 -89801 -214874 -32208
9249 -538535 -148540 24504 96625 -211470 -44733 -7988 126939 -36079 235258 214087 210057
$$ packed form
9330A51405a02321A0220a83811a227j3172G9697l6171a13376A24421n9612K1954
9319H6763b33691M7411n3388A7491j954f1854J5177C66100d47582d8065p3439
9308a21504N8462r9541K1949C5692a0540l50713a26173K0065H5366A0366a41084
9296B2281g2917C6847L5220a88997a6636l49953a13729D9520a05649j11408E6017
9284b05086A53942f7260k5986A18126a49426L7696L5686K6470q5992d598j39296
9273a43894O0556k8142k2040I9342f02629B776J4044e4617D8099h4757B00654
9261D6190g5100D1102J75196A5440h1867A27545O0910a3879p5922j25073c2208
9249e38535a48540B4504P2121b11470d4733g988A26939c6079B35258k1171m030
$$ plain form
9238 210057 -166913 -80901 -166794 -239744 -227947 6034 -161752 93208 136902 -332110 -74931
9226 123878 -97307 -147242 74204 -105870 -302685 -68776 76499 -173973 -11600 311645 63151
9214 200682 -119277 -81654 6423 96658 -60907 -2352 -248550 32181 -82688 -11371 51048 -81715
9201 -259373 -140549 -247872 -63225 31500 161047 -162351 -233916 -130552 117398 -85210
9190 29054 268576 -84829 -392017 286680 -257744 -11353 -200733 -58380 -306134 -467411
9180 -467411 52323 -244267 -79902 -268137 135683 43220 42034 -11663 -145081 -57311 -73838
9169 -73838 130849 -112236 -332289 -44822 33441 -18986 116744 54001 -93250 -37502 -99521
9158 -99521 -50163 14513 31824 -437171 287849 -330141 -52351 -23990 -56371 212387 -18234
$$ packed form
9238B10057a66913h0901q5893p2950J1797F034a61752I3208M3694c32110g4931
9226A23878i7307m9935G4204a05870j96815f8776G6499a73973a1600C11645F3151
9214B00682a19277L7623F423R0235f0907b352k46198C2181h2688a1371E1048h1715
9201b59373J18824j07323f3225C1500J29547a62351p1565J03364A17398h5210
9190B9054K39522h4829l07188B86680b57744a1353j89380e8380k47754j61277
9180d67411E2323b44267g9902j88235A35683D3220j186a1663j33418e7311j6527
9169g3838A30849a12236k20053d4822C3441a8986A16744E4001i3250c7502o2019
9158i9521M9358A4513J7311d37171B87849c30141e2351b3990l2381B12387a8234
$$ plain form
9146 62010 146902 -456626 -225271 32028 -54220 -101363 -149839 97478 -277532 -23749 -220459
9135 -220459 13654 73802 229377 -111929 -88929 -23299 -534013 1640 -297367 -51215 234516
9123 -252323 13736 -100591 -63976 207764 -145477 -351136 71503 -324598 -207177 24598
9112 -489140 193294 -276128 294514 78218 -125990 -263413 -83218 73638 3690 -102811 -18733
9100 25629 73264 -207539 49999 -157773 -176295 168913 -54702 -148590 -141869 -277765 -10783
9088 113024 -36170 16931 146287 -44937 -71521 54111 -87773 111502 337049 -28518 -90488
9077 -90488 -341716 101056 -32335 -21809 -226352 -20397 -247520 120717 -161145 90816 109933
9066 109933 133645 -184583 -224353 -48233 220864 -76936 272449 -1225 -97607 111859 -117055
$$ packed form
9146F2010Q4892d56626b25271C2028e4220m7143m8476I7478b77532b3749j96710
9135b20459A3654O0148J55575a11929K3000b3299n10714A640b97367e1215B34516
9123b52323A3736a00591L6615B07764a45477k05659G1503c24598J17421B4598
9112d89140A93294b76128B94514G8218a25990j37423h3218G3638C690a02811a8733
9100B5629M7635b07539D9999a57773j8522A68913e4702r3888O721j35896a0783
9088A13024c6170A6931J29356d4937k6584E4111h7773A11502K25547b8518o1970
9077i0488k51228A01056c2335J0526k04543b0397k27123A20717a61145I0816J9117
9066A09933K3712a84583l9770d8233B20864g6936B72449a225r6382A11859a17055
$$ plain form
9054 85962 49449 149303 82948 -391215 -49744 84690 -31937 -154369 -177157 56716 7060 -240781
9041 -21983 -232132 21706 -148062 -75 -352576 -211796 -26957 271624 132448 54563 -237153
9029 -290401 -244000 -404179 81389 -227342 -102362 -188970 -277985 -126136 -224405 -230569 5181
9017 306462 -204976 165808 -75183 260848 378995 91673 -188852 -439651 186954 62697
9006 -49543 158921 -327622 -199559 -25292 42227 -25424 -169241 -90345 -101395 29569 -100794
8994 31102 -18558 -147731 -118840 144391 -203096 -229700 77084 179804 -526619 104870 -325184
8982 -64474 -34285 126928 78815 -50331 -230729 -421197 -1091 195110 169849 -30483 189755
8970 -95920 6954 -146851 -281464 -341936 -40226 -84480 337538 -205702 -111081 -262109 -29372
$$ packed form
9054H5962l6513R9854o6355c91215d9744H4690c1937j22432k2788E6716G060b40781
9041b1983k10149B1706a48062g5l52501J40780b6957B71624A32448E4563b37153
9029b90401M6401j60179H1389b27342a02362q6608q9015a26136r8269o164E181
9017C06462b04976A65808g5183B60848J18147I1673a88852k50799A86954F2697
9006d9543A58921c27622J28063b5292D2227b5424j43817P8896j1050B9569a00794
8994C1102a8558j29173K8891A44391b03096k6604G7084J02720e26619A04870c25184
8982f4474L0189A26928m8113e0331j80398j90468a091A95110k5261c0483A89755
8970i5920F954a46851j34613o0472d0226m4254C37538b05702R4621j51028b9372
$$ plain form
8958 -150216 -152620 -67079 39790 -217049 -75891 -166108 319197 270410 216356 249857 131377
8947 131377 -159698 88932 1096 -64147 -319262 -2110 215155 -75646 18006 150530 212582
8936 212582 -80159 -194664 166405 2640 -204566 172321 220206 -17341 -111329 45770 -6943
8924 -50133 -9835 -251537 12152 -78720 271166 214717 375634 11132 297340 381191 347060
8913 347060 543877 611089 682188 925049 1139672 2115856 4569552 10307221 6523752 3499729
8903 3499729 2205975 1105468 701488 388618 626840 426116 322114 94246 99018 345785
8893 345785 144878 478706 174495 -186500 273359 97796 -21001 -61112 -23279 -417211
8883 -417211 13357 -342912 92417 -47403 65210 -379792 -270299 -20911 120486 -93839 -202744
$$ packed form
8958a50216k404f7079C9790b17049g5891r0217C19197m8787n4054L3501j18480
8947A31377a59698H8932A096f4147k55115b110B15155g5646A8006J32524O2052
8936B12582h0159j14505A66405B640b04566A72321M7885a7341r3988D5770f943
8924e0133i835k41702A2152g8720B71166n6449J60917A1132K86208Q3851l4131
8913C47060J96817O7212P1099K42861K14623R76184K453696N737669l783469l024023
8903C499729j293754j100507m03980l12870K38222k00724j04002I4246M772K46767
8893C45785A44878L33828A74495a86500B73359I7796b1001m0111b3279l93932
8883d17211A3357c42912I2417d7403F5210c79792J09493b0911A20486i3839j08905
$$ plain form
8872 -202744 -29760 73942 99021 542068 162227 48268 191492 -252455 46707 -73700 -62156
8861 -62156 44481 -138419 -54756 107902 -164504 -36238 -344027 59765 159076 -19045 208946
8849 168342 -178606 -213787 -159477 158009 -124919 239069 75722 102521 -305428 -228924 -129365
8838 -129365 -463454 -370932 311411 237048 -35741 -385810 -93623 261052 131541 190660 -99632
$$ packed form
8872b02744b9760G3942K5079M43047A62227D8268J43224b52455D6707g3700J1544
8861f2156D4481a38419e4756A07902a64504c6238l07789E9765R9311a9045B08946
8849A68342a78606l5181N4310A58009a24919B39069G5722K6799c05428P6504R9559
8838a29365l34089R2522C11411p4363c5741l50069i3623B61052j29511N9119i9632
$$ [...]
##END NTUPLES=NMR SPECTRUM
##END=
