
##TITLE=UV1054_TOCA01-ROVE100D_6099866_zUAobk78ds
##JCAMPDX= 6.0         $$ Bruker NMR JCAMP-DX V2.0
##DATA TYPE= NMR SPECTRUM
##DATA CLASS= NTUPLES
##ORIGIN= BRUKER
##OWNER= Administrator
$$ 1.72 TOPSPIN		Version 2.1
$$ 2012-05-13 00:47:37.984 -0500  Administrator@TOPSPIN
$$ Compression mode = diff/dup
##.OBSERVE FREQUENCY= 400.13188235
##.OBSERVE NUCLEUS= ^1H
##.ACQUISITION MODE= SIMULTANEOUS (DQD)
##.ACQUISITION SCHEME= undefined
##.AVERAGES= 64
##.DIGITISER RES= 22
##SPECTROMETER/DATA SYSTEM= spect
##.PULSE SEQUENCE= noesygpps1d.comp
##.SOLVENT NAME= COFFEE_meoh
##.SHIFT REFERENCE= INTERNAL, COFFEE_meoh, 1, 14.96671
##AUDIT TRAIL= $$ (NUMBER, WHEN, WHO, WHERE, PROCESS, VERSION, WHAT)
$$ ##TITLE= Audit trail, TOPSPIN		Version 2.1
$$ ##JCAMPDX= 5.01
$$ ##ORIGIN= Bruker BioSpin GmbH
$$ ##OWNER= Administrator
$$ $$ C:\Bruker\TOPSPIN/data/COFFEE/nmr/UV1054_TOCA01-ROVE100D_6099866_zUAobk78ds/12/pdata/1/auditp.txt
$$ ##AUDIT TRAIL=  $$ (NUMBER, WHEN, WHO, WHERE, PROCESS, VERSION, WHAT)
(   1,<2012-05-13 00:47:33.125 -0500>,<Administrator>,<TOPSPIN>,<go>,<TOPSPIN 2.1>,
      <created by zg
	started at 2012-05-13 00:36:02.875 -0500,
	POWCHK enabled, PULCHK disabled,
       configuration hash MD5:
       AF F2 23 6B 01 CD 40 DD E5 A1 38 A0 06 EA F7 77
       data hash MD5: 64K
       8C EE A2 D5 4F E0 CD 55 47 59 EE C7 BB 3C 41 3B>)
(   2,<2012-05-13 00:47:35.875 -0500>,<Administrator>,<TOPSPIN>,<proc1d>,<TOPSPIN 2.1>,
      <Start of raw data processing
       efp LB = 0.3 FT_mod = 6 PKNL = 1 PHC0 = 0 PHC1 = 0 SI = 128K 
       data hash MD5: 128K
       BB 75 30 8B 38 10 94 88 32 1E E7 60 A7 1F 73 DC>)
(   3,<2012-05-13 00:47:37.109 -0500>,<Administrator>,<TOPSPIN>,<proc1d>,<TOPSPIN 2.1>,
      <pk PHC0 = 36.6449 PHC1 = 0 
       data hash MD5: 128K
       D7 06 74 E5 29 9A DB 4B 68 4C B5 3E CB 48 BC 6A>)
(   4,<2012-05-13 00:47:37.687 -0500>,<Administrator>,<TOPSPIN>,<proc1d>,<TOPSPIN 2.1>,
      <abs ABSG = 1 
       data hash MD5: 128K
       94 B5 E4 0F A5 03 43 BF E5 9B 80 BF 66 80 26 6C>)
(   5,<2012-05-13 00:47:37.750 -0500>,<Administrator>,<TOPSPIN>,<proc1d>,<TOPSPIN 2.1>,
      <abs ABSG = 2 
       data hash MD5: 128K
       90 2F AE 7E E4 0F 20 98 E8 0A 74 E8 76 E4 14 41>)
(   6,<2012-05-13 00:47:37.796 -0500>,<Administrator>,<TOPSPIN>,<proc1d>,<TOPSPIN 2.1>,
      <abs ABSG = 3 
       data hash MD5: 128K
       62 60 2B DA 84 C8 1B AD F4 1B 0E CB 9C 15 AD 4A>)
(   7,<2012-05-13 00:47:37.859 -0500>,<Administrator>,<TOPSPIN>,<proc1d>,<TOPSPIN 2.1>,
      <abs ABSG = 4 
       data hash MD5: 128K
       5A 09 F4 F4 AB F1 B2 0B 1C 55 4F 7A 13 A3 28 45>)
(   8,<2012-05-13 00:47:37.921 -0500>,<Administrator>,<TOPSPIN>,<proc1d>,<TOPSPIN 2.1>,
      <abs ABSG = 5 
       data hash MD5: 128K
       18 0E 30 88 31 FF 66 E7 56 1B 6B 8E D0 13 A2 61>)
$$ ##END=
$$ 
$$ $$ hash MD5
$$ $$ 62 2F FA B1 07 EE 22 C9 97 D5 D3 30 2D 5D 05 F0
##$RELAX= 
##$RELAX= 
##$RELAX= 
##$RELAX= 
##$RELAX= 
##$RELAX= 
##$RELAX= 
##$RELAX= 
$$ Bruker specific parameters
$$ [...]
##$TP07= 0
##$TPNAME0= <>
##$TPNAME1= <>
##$TPNAME2= <>
##$TPNAME3= <>
##$TPNAME4= <>
##$TPNAME5= <>
##$TPNAME6= <>
##$TPNAME7= <>
##$TPOAL= (0..7)
0.5 0.5 0.5 0.5 0.5 0.5 0.5 0.5
##$TPOFFS= (0..7)
0 0 0 0 0 0 0 0
##$TUNHIN= 0
##$TUNHOUT= 0
##$TUNXOUT= 0
##$USERA1= <user>
##$USERA2= <user>
##$USERA3= <user>
##$USERA4= <user>
##$USERA5= <user>
##$V9= 5
##$VALIST= <valist>
##$VCLIST= <CCCCCCCCCCCCCCC>
##$VD= 0
##$VDLIST= <DDDDDDDDDDDDDDD>
##$VPLIST= <PPPPPPPPPPPPPPP>
##$VTLIST= <TTTTTTTTTTTTTTT>
##$WBST= 2048
##$WBSW= 25
##$XGAIN= (0..3)
0 0 0 0
##$XL= 0
##$YL= 0
##$YMAX_a= 10715844
##$YMIN_a= -5506909
##$ZGOPTNS= <>
##$ZL1= 120
##$ZL2= 120
##$ZL3= 120
##$ZL4= 120
##$ABSF1= 14.96671
##$ABSF2= -5.58582
##$ABSG= 5
##$ABSL= 3
##$ALPHA= 0
##$AQORDER= 0
##$ASSFAC= 0
##$ASSFACI= 0
##$ASSFACX= 0
##$ASSWID= 0
##$AUNMP= <proc_prof1d_extract.lims>
##$AXLEFT= 0
##$AXNAME= <>
##$AXNUC= <1H>
##$AXRIGHT= 0
##$AXTYPE= 0
##$AXUNIT= <>
##$AZFE= 0.1
##$AZFW= 0.1
##$BCFW= 0
##$BC_mod= 0
##$BYTORDP= 0
##$COROFFS= 0
##$CY= 15
##$DATMOD= 1
##$DC= 0
##$DFILT= <>
##$DTYPP= 0
##$F1P= 0
##$F2P= 0
##$FCOR= 0.5
##$FTSIZE= 131072
##$FT_mod= 6
##$GAMMA= 0
##$GB= 0
##$INTBC= 1
##$INTSCL= 1
##$ISEN= 128
##$LB= 0.3
##$LEV0= 0
##$LPBIN= 0
##$MAXI= 10000
##$MC2= 0
##$MEAN= 0
##$ME_mod= 0
##$MI= 0
##$NCOEF= 0
##$NC_proc= -3
##$NLEV= 6
##$NOISF1= 0
##$NOISF2= 0
##$NSP= 0
##$NTH_PI= 0
##$NZP= 0
##$OFFSET= 14.96671
##$PC= 1
##$PHC0= 36.6449
##$PHC1= 0
##$PH_mod= 1
##$PKNL= yes
##$PPARMOD= 0
##$PPDIAG= 0
##$PPIPTYP= 0
##$PPMPNUM= 2147483647
##$PPRESOL= 1
##$PSCAL= 4
##$PSIGN= 0
##$PYNMP= <proc.py>
##$REVERSE= no
##$SF= 400.130005560606
##$SI= 131072
##$SIGF1= 0
##$SIGF2= 0
##$SINO= 400
##$SIOLD= 131072
##$SPECTYP= <>
##$SREGLST= <1H.CDCl3>
##$SSB= 0
##$STSI= 131072
##$STSR= 0
##$SW_p= 8223.68421052632
##$SYMM= 0
##$S_DEV= 0
##$TDeff= 65536
##$TDoff= 0
##$TI= <>
##$TILT= no
##$TM1= 0
##$TM2= 0
##$TOPLEV= 0
##$USERP1= <user>
##$USERP2= <user>
##$USERP3= <user>
##$USERP4= <user>
##$USERP5= <user>
##$WDW= 1
##$XDIM= 131072
##$YMAX_p= 413867127
##$YMIN_p= -88521210
##$CURPLOT= <Network HP LaserJet P1505>
##$CURPRIN= <$Network HP LaserJet P1505>
##$DFORMAT= <normdp>
##$LAYOUT= <+/1D_H.xwp>
##$LFORMAT= <normlp>
##$PFORMAT= <normpl>
##$SURQMSG= 1
$$ End of Bruker specific parameters
$$ ---------------------------------
##NTUPLES= NMR SPECTRUM
##VAR_NAME=  FREQUENCY,     SPECTRUM/REAL,   SPECTRUM/IMAG
##SYMBOL=    X,             R,               I
##VAR_TYPE=  INDEPENDENT,   DEPENDENT,       DEPENDENT
##VAR_FORM=  AFFN,          ASDF,            ASDF
##VAR_DIM=   131072,        131072,          131072
##UNITS=     HZ,            ARBITRARY UNITS, ARBITRARY UNITS
##FACTOR=    0.0627417313425165, 1,          1
##FIRST=     8223.62146879498, 7983,         -104389
##LAST=      0,             9654,            -104420
##MIN=       0,             -88521210,       0
##MAX=       8223.62146879498, 413867127,    0
$$ Real data points
##PAGE= N=1
##DATA TABLE= (X++(R..R)), XYDATA
$$ [...]
67386 261415 261565 262781 264543 267045 270427 273695 275301 274667 272520 269984 268014 267415 268433 270255 271749
67371 271749 272722 273713 274634 274678 273674 272408 271335 270104 268798 268467 269686 271582 273105 274379 275892 277149
67355 277149 277262 276412 275653 275534 275754 275957 276057 275950 275607 275351 275545 276234 277468 279466 281859 283406 283318 282425
67337 282425 282077 282330 282292 282052 282849 285146 287598 288526 287671 286039 284528 283296 282205 281437 281529 282855 285085
67320 285085 287387 289238 290754 292086 292970 293213 293168 293194 293055 292444 291771 291773 292551 293630 294739 295899 297040
67303 297040 298277 300340 303814 307959 311155 312580 312759 312418 311695 310667 309733 308976 307833 306041 304495
67288 304495 304508 306296 308607 309978 310173 310323 311647 314167 316815 318641 319456 319326 318245 316806 316483 318444
67272 318444 322314 326653 330340 332910 334217 334670 335430 337201 338945 338893 336930 334928 334577 335886 338075
67257 338075 340795 343826 346345 347339 346556 344711 342931 342038 341959 341817 341067 340427 341084 343077 345263 346846
67241 346846 348039 349071 349645 349839 350584 352585 355370 357951 359844 360980 361274 360927 360655 360983 361622 361999
67225 361999 362050 362029 361912 361439 360471 358951 356768 354045 351372 349538 349162 350442 352812 354996 356192 357193
67209 357193 359430 362736 365174 365546 364957 365129 366158 366930 366903 366314 365133 363111 360814 359566 360098 361773
67193 361773 363212 363387 362382 361412 361743 363208 364274 363985 363097 362706 362655 362374 362527 364406 367899 371455 374100
67176 374100 376309 378753 381273 383414 384958 385694 385503 384938 384825 385032 384601 383407 382704 383442 385015 386446
67160 386446 388031 390797 394764 398696 401433 402743 402918 402258 401102 399922 399116 398831 398967 399228 399255 398898
67144 398898 398318 397723 397152 396683 396631 397321 398718 400436 402059 403400 404528 405600 406541 407006 406972 407332 409328
67127 409328 413064 416908 418801 418090 415922 414110 413914 415626 418703 422123 424900 426558 427275 427715 428746
67112 428746 431009 434377 437858 440306 441317 441381 441292 441645 442712 444362 445972 446824 446884 446971 447818 449141 450080
67095 450080 450558 451675 454401 458201 461483 463389 464641 466378 468545 469883 469429 467644 465963 465551 466606
67080 466606 468559 470611 472136 472980 473592 474706 476680 479123 481271 482669 483330 483435 483304 483765 485909 489901
67064 489901 494327 497409 498940 500368 502829 505792 508133 509904 512201 515510 519022 521739 523616 525259
67050 525259 527010 528777 530555 532605 535039 537437 539064 539534 539281 539340 540407 542075 543150 542826 541422
67035 541422 539916 539016 538898 539606 541238 543603 546070 547991 549248 550350 552038 554815 558583 562587 565871
67020 565871 568027 569537 571320 574069 578033 583091 588720 594138 598854 602964 606592 609342 610934 612106
67006 612106 613957 616338 617997 618694 619990 623120 627072 630053 632158 635071 639341 643527 646292 647972
66992 647972 649632 651755 654528 658301 662846 666920 669524 671150 673006 675453 678007 680526 683534 687408
66978 687408 691894 696449 700654 704414 708066 712035 716099 719445 721934 724770 729183 734751 739836 743504
66964 743504 746300 749186 752518 756040 759293 762011 764793 769197 776344 785267 793530 799842 805340 811894
66950 811894 819840 828017 835498 842362 848751 854035 857484 859663 862649 868443 877145 886969 896213 904915
66936 904915 914320 925008 936033 945841 953653 959948 965913 972493 979796 987324 994767 1002296 1010013 1017636
66922 1017636 1025177 1033485 1043399 1054512 1065488 1075564 1085180 1095197 1106112 1118012 1130612 1143307
66910 1143307 1155887 1169226 1184359 1200590 1215602 1228246 1240508 1255618 1274382 1294349 1312741
66899 1312741 1329308 1345829 1363451 1381606 1399608 1418307 1439179 1462106 1485174 1506975 1528214
66888 1528214 1550390 1573628 1596809 1619466 1642482 1666954 1693281 1721536 1751851 1784054 1817421
66877 1817421 1851046 1884237 1916786 1949423 1983676 2020368 2058418 2096335 2134906 2176914 2223590
66866 2223590 2272632 2320668 2366662 2411864 2457391 2503406 2550288 2599031 2650146 2703067 2757052
66855 2757052 2812107 2868868 2927907 2989226 3052116 3115617 3179524 3244830 3312803 3383772 3457117
66844 3457117 3532092 3608041 3684035 3759079 3832882 3906046 3979383 4053369 4128121 4203520 4279285
66833 4279285 4355210 4431279 4507376 4583183 4658637 4734022 4809060 4882335 4952382 5019142 5083479
66822 5083479 5145391 5203738 5257901 5308692 5357089 5402806 5444725 5482259 5515704 5545514 5571720
66811 5571720 5593760 5610557 5621123 5625593 5625289 5621180 5612476 5597434 5575474 5547782 5515775 5479733
66799 5479733 5439380 5395135 5347966 5298159 5245017 5187994 5127636 5065042 5000716 4934294 4865200
66788 4865200 4793239 4718694 4642271 4564977 4487706 4410850 4334432 4258478 4182879 4107045 4030319
66777 4030319 3952947 3876150 3800948 3727197 3654019 3580830 3507747 3435350 3364421 3295622 3229100
66766 3229100 3164564 3101886 3041177 2982056 2923356 2864060 2804187 2744495 2685947 2629936 2578024
66755 2578024 2530241 2484107 2436770 2388102 2340384 2294859 2250206 2205093 2160678 2119104 2080309
66744 2080309 2041912 2002226 1962091 1923506 1887405 1853229 1819902 1786564 1752765 1718632 1684896
66733 1684896 1652320 1621053 1590782 1561499 1533781 1508089 1483975 1460271 1435935 1410514 1383981
66722 1383981 1356700 1329665 1304132 1280527 1258128 1236284 1215491 1196465 1178497 1159788 1139612
66711 1139612 1119054 1099263 1079989 1060680 1042161 1025987 1012318 999536 986046 971599 956673
66700 956673 941531 926419 911979 898585 885471 871240 855439 839230 824299 811271 799263
66689 799263 786847 773286 759046 745450 733897 724969 717808 710356 700709 688563 675310 662692
66677 662692 651630 642289 634603 628190 622110 615439 608054 600358 592378 583826 575038 566932 559687 552317
66663 552317 544187 536217 529676 524176 518060 510833 504080 499446 496500 493380 489064 484083 479120 473858
66649 473858 467675 460873 454494 449039 444017 438938 434195 430417 427203 423156 417372 410428 403706 398173
66635 398173 394121 391546 390004 388312 385244 380832 376401 373061 370584 367986 364690 360706 356119 351054
66621 351054 346017 341616 337810 333895 329479 325207 322113 320209 318022 313914 307928 301963 297792 295221
66607 295221 292791 290105 288579 289492 292040 293930 293516 290810 286815 282641 279122 276502 274283 271782 268950
66592 268950 266350 264408 263013 261729 260009 257380 253966 250812 249145 249202 250084 250663 250298 248930 247106
66577 247106 245835 245698 246063 245844 244982 244364 244092 242863 239643 235222 231366 228834 226941 224822 222420 220165
66561 220165 218257 216607 215411 215349 216794 218737 219154 217053 213774 211527 210846 210395 209102 207363 205966
66546 205966 205036 204446 204223 203972 202852 200700 198273 195778 192349 187881 184269 183473 185092 187115 188475
66531 188475 189460 190064 189533 187590 184898 182205 180022 178994 179427 180520 181242 181888 183453 185402 185684 183419
66515 183419 180181 177816 176227 174244 171617 169043 166914 165238 164415 164955 166450 167682 167837 167045 165747
66500 165747 164162 162656 162116 163358 166047 168501 169029 167602 165822 165092 165310 165696 166131 166753 166801 165317
66484 165317 162992 161922 163005 164720 165124 164000 162273 160275 157739 155034 153199 152825 153592 154810 155816
66469 155816 156061 155480 154729 154517 154719 154543 153532 151975 150409 149070 147895 146892 146441 147015 148354 149152
66453 149152 148296 146425 145381 145868 146626 146344 145331 144425 143275 140985 137869 135195 133386 131815 130472
66438 130472 130577 133024 136936 140206 141125 139494 136656 134455 133617 133139 131704 129407 127371 126050 125030
66423 125030 124406 124993 126738 128137 128100 127573 128385 130885 133543 134673 134021 132824 132712 134346 136742 138115
66407 138115 137662 136214 134895 133648 131652 128867 126379 125165 125100 125459 126020 127227 129185 130788 130394 127666
66391 127666 124447 123163 124407 126624 128226 129167 130068 130691 130227 128833 127905 128599 130530 132133 132151 130644
66375 130644 128686 127077 125513 123334 121000 120038 121188 123305 124790 125513 126437 127769 128706 128951 129236 129961
66359 129961 130331 129441 127338 124456 120868 117033 114570 115083 118240 121998 124740 126429 127612 128215 127717
66344 127717 125857 122722 118651 114457 111318 109944 110087 111175 113038 115579 118106 119693 120126 119927 119417
66329 119417 118266 116111 113152 109990 107239 105459 105016 105694 106759 107760 109121 111534 114858 117978 119889
66314 119889 120705 121417 122696 124171 125019 125085 124939 124700 123406 120301 116461 114176 114500 116300 118145 120130
66298 120130 122895 125607 126419 124922 122869 121993 122091 121873 120978 120264 120468 121275 121586 120277 116958 112566 109082
66281 109082 108095 109512 111947 114164 115772 116768 117146 117009 116540 115744 114736 114223 115023 116857 118305 118342 117397
66264 117397 116499 116002 115767 116080 117516 120067 123095 126042 128470 129610 128802 126587 124534 123584 123224 122639
66248 122639 122029 122221 123492 125404 127411 129033 129752 129462 128830 128541 128194 126616 123361 119381 116117 114411
66232 114411 114295 115232 116411 117375 118634 121108 124678 127848 129295 129272 128947 128862 128741 128493 128454 128576 128224 127052
66214 127052 125500 124036 122514 120785 119484 119457 120575 121783 122371 122579 122807 122921 122798 123047 124450 126763
66198 126763 128603 128629 126520 122932 119022 116107 115228 116610 119629 123374 127050 129882 131257 131274 130734 130210
66182 130210 129462 128147 126720 126085 126522 127513 128527 129455 130339 131181 132099 133188 134167 134569 134412 134306 134732
66165 134732 135446 135661 134680 132430 129649 127428 126237 125449 124090 121880 119207 116390 113537 110924 108875
66150 108875 107371 106406 106506 108106 110530 112626 114457 117208 121163 124981 127464 128917 130049 130619 130151
66135 130151 129117 128312 127694 126891 126246 126180 126070 125071 123762 123552 124517 125198 124747 124022 124181 125313 126942 128871
66117 128871 130877 132413 133311 134224 135820 137913 139811 140951 140782 138785 135398 132468 131854 133543 135668
66102 135668 136371 135258 133170 131071 129304 127640 125889 124503 124382 125835 127819 128497 126760 123173 119475
66087 119475 117144 116372 116423 116870 118106 120415 123035 124817 125695 126654 128085 129092 128939 128485 129314 131734
66071 131734 134395 135838 135826 135129 134596 134644 135250 136137 137012 137677 137950 137710 137239 137292 138423 140232 141582 141653
66053 141653 140621 139381 138814 139214 140061 140375 139629 138465 138259 139786 142400 144581 145280 144681 143721 142896 141704
66036 141704 139578 137243 136503 138153 140624 141447 139908 137495 135806 135078 135002 135913 138292 141713 145230 148464
66020 148464 151452 153662 154147 152782 150524 148249 146103 144223 143191 143202 143373 142610 140867 139044 137936
66005 137936 137771 138524 140042 141932 143806 145625 147515 149350 150763 151356 150651 148313 144896 141990 140998
65990 140998 142051 144604 148495 153445 157996 160395 160604 160162 159853 158857 156736 154846 154727 156030 157188
65975 157188 157565 157864 158773 160209 161779 163277 164810 166840 169691 172570 173776 172673 170810 170054 170209
65960 170209 169744 168501 168042 169200 170914 172102 173428 176276 180810 185945 190627 194202 196014 195840 194908
65945 194908 195528 198992 204109 208338 210376 211165 212340 214481 217578 222476 230296 240128 248761 253639 255168
65930 255168 255249 254684 253476 252744 254242 257887 261489 263315 263617 263366 262897 262314 261811 260891 258475 254646 251172
65913 251172 249359 248283 246168 242723 239054 235869 232939 229936 226692 222810 218054 213265 210134 209779
65899 209779 211781 214461 215854 214807 211694 208042 205234 203789 203865 205693 209069 213140 217312 221816 226758
65884 226758 231270 234466 236758 239361 242812 246730 250557 253655 255205 255227 255532 258280 263343 268197 270770
65869 270770 271486 272143 273804 276463 279983 284355 289159 293669 297671 301811 306800 312342 317161 320342 322552
65854 322552 325561 330440 336601 342731 348066 352368 355332 356903 357982 359976 363460 367712 371519 374088
65840 374088 375328 375735 375869 375525 373813 370646 367691 366713 367128 366308 362618 357100 351691 346772 341298 334722
65824 334722 327802 321615 316404 311531 306170 300063 293794 288379 284428 281660 279109 275744 271171 266121
65810 266121 262146 260244 259681 258642 256257 253552 252136 252390 253286 253610 252823 250882 247864 244101 240526
65795 240526 238462 238771 241087 244060 246493 248133 249287 250002 250078 249763 249883 251018 252834 254434 255273 255675
65779 255675 256518 258473 261480 264884 267965 270210 271266 271239 271128 272353 275361 279086 282263 284855 287606
65764 287606 290657 293484 296019 298937 302725 307217 312231 317862 323891 329511 334025 337399 339864 341452
65750 341452 342266 342774 343400 344022 344165 343600 342459 340775 338090 333769 327909 321797 317004 313833 311190 308228
65734 308228 305417 303560 302627 302448 303693 306729 309959 311015 309753 308572 309489 312319 316190 321184 327440
65719 327440 333971 339727 345091 351173 358166 365406 372487 379181 384627 387781 388600 387875 385967 382630 378081
65704 378081 373315 369117 365414 361787 358064 354175 350003 345818 342635 341703 343549 347595 352832 358879
65690 358879 366196 375166 385308 395805 406513 417818 429792 442413 456535 473292 492011 509777
65678 509777 523888 534000 541272 546391 549428 550696 550278 546973 539046 526189 510018 492684 475681
65665 475681 459691 444654 429935 415161 400841 387647 375377 363346 351390 339687 328009
65654 328009 316228 305237 296079 288318 280602 272916 266724 262561 258965 254593 250161 247280 246265 246086
65640 246086 245852 245304 244241 242491 240480 239219 239540 241497 244276 246691 248163 249374 251459 254473 257379
65625 257379 259752 262483 266264 270383 273984 277706 282919 289802 297439 305523 314600 324581 334464 344089
65611 344089 354951 368280 383065 397178 410304 424804 443390 466480 491999 517217 540359
65600 540359 560869 578941 595116 609935 623451 635020 643798 649576 653147 655878 658933 662684 666708
65587 666708 670383 673634 676962 680628 684089 686470 687315 686470 683485 677754 669108 657685 643296 625702
65573 625702 605620 584624 563724 542651 520868 498550 476094 453434 430546 408116 386951
65562 386951 367141 348600 332083 318693 308422 299981 292199 284968 278729 273651 269518 265959 262634
65549 262634 259544 257127 255634 254530 253023 251142 249687 249077 248853 248280 246799 243939 239772 235754 234090
65534 234090 235596 238792 241671 243712 245517 247275 248661 249929 251971 255234 259290 263585 267951 272395
65520 272395 277056 282414 288917 296366 304381 313546 325285 340237 357371 375012 392113 408263 423342
65507 423342 437950 453554 471135 489711 506915 521093 532308 541282 547932 551188 549878 543743
65495 543743 533792 521652 508309 493504 476638 458037 438892 420156 402133 385054 369304 354881
65483 354881 341383 328910 318396 310500 304577 299189 293293 286628 279463 272653 267508 264808 263967 263754
65469 263754 263685 263971 264224 263209 260253 256098 251733 246915 240598 232638 224422 217688 213130 210325 208692
65454 208692 208210 209119 211073 212876 213334 212324 210829 209953 210241 211792 214305 216657 217234 215491 212869 211320
65438 211320 211053 210682 209646 209348 211301 215049 218771 221450 223474 225516 227852 230710 234152 237383 239203
65423 239203 239612 240174 242230 245471 248811 251854 254648 256672 257267 256778 256093 255129 252903 249277 245482 242580
65407 242580 240458 238795 237893 237659 236728 233819 229567 225912 223775 222306 220370 217829 215049 212009 208481
65392 208481 204765 201760 200295 200398 201199 201702 201919 203096 206486 211919 217830 222482 224950 225385 225039 225801
65376 225801 228778 233129 236967 239590 242144 245827 250220 253872 255926 256495 255909 254437 252677 251409 250761
65361 250761 249859 247598 243705 239025 234899 232248 231092 230885 231277 232445 234654 237662 240715 243084 244558
65346 244558 245456 246165 246644 246524 245814 245333 246076 248207 251081 254297 258203 263123 268497 273273 276970 280027
65330 280027 283047 285897 287581 287105 284600 281468 279184 278044 277418 276898 276431 275471 273155 269803 267251
65315 267251 266922 268368 270513 273402 277398 281334 283343 283661 284880 288704 293842 298048 301127 304640 309449
65300 309449 315048 321077 327920 335498 342751 349108 355717 364340 375268 386918 397341 405593 411787
65287 411787 416417 419861 422194 423267 423060 421986 420570 418830 416246 412451 407600 401901 395228 387600
65273 387600 379658 372038 364409 355799 345855 335120 324093 313013 302910 295747 292401 291082 288958
65260 288958 285229 281572 279592 278966 278349 276915 274323 270177 264509 258349 252954 248728 245551 243665 243281
65245 243281 243621 243550 243270 244254 247047 250115 251639 251742 252089 253712 256191 258774 261228 263331 264438 264229
65229 264229 263404 262938 262836 262289 261072 260068 260005 260199 259200 256598 253531 251256 249793 248316 246420 244476
65213 244476 243016 242374 242783 244090 245284 245100 243462 241770 241256 241515 241214 239826 237940 236153 234565 233497
65197 233497 233827 236114 239800 243649 246653 248225 248006 246149 243723 242282 242706 244509 246321 247020 246449
65182 246449 245217 243946 242754 241434 239870 238110 236263 234605 233575 233175 232548 230807 228376 226772 226761
65167 226761 227412 227401 226596 225690 224842 223628 222060 220626 219321 217540 215175 213022 211717 210889 209866 208752
65151 208752 208218 208509 209220 210046 211277 213306 215829 217823 218551 218464 218746 219766 220428 219562 217626 216379 216917
65134 216917 218684 220385 221181 220955 220314 220715 223692 229286 235668 240831 244192 246152 246887 246439 245496 245026
65118 245026 245236 245722 246486 247981 250220 252657 255011 257435 259838 261963 264206 267273 270621 272314 271140
65103 271140 268175 265568 264551 265397 268438 273679 279802 285047 289269 293865 299321 304187 307324 310131
65089 310131 315209 323218 332269 340538 348499 358196 370978 386357 402703 418536 433229 446824 459300
65076 459300 470268 479610 488154 497014 506161 514378 520974 526697 532214 536427 537584 535843 533313 531242
65062 531242 528553 523950 518185 512811 507429 499956 489716 478701 469107 460832 452305 442905 433428 424550
65048 424550 415972 407080 397598 387548 377283 367658 359377 351947 344021 335118 326376 319200 313780 309383
65034 309383 305449 301807 298429 295731 294519 294653 294236 291418 286909 283339 281981 281455 280126 278289 276965
65019 276965 275763 273416 269929 266736 264834 263830 262888 261696 260439 259547 259477 260045 260088 258568 255942 253613
65003 253613 252118 250891 249790 249651 250940 252892 254511 255583 256260 256512 256629 257478 259576 262330 264591
64988 264591 265417 264187 261029 257559 255930 256265 256058 253227 248772 245246 243461 242242 240697 239007 237229
64973 237229 235064 232889 231536 230946 230459 230507 232332 235571 237749 237007 234158 231316 229624 229080 229380 229976
64957 229976 230255 230601 232350 235719 238742 239465 238339 237188 236597 235900 235248 235820 237882 240210 241871 243359
64941 243359 245492 248318 251622 255490 259589 262753 264216 264875 266454 269524 273022 275748 277805 280243
64927 280243 283529 286717 288391 288348 288016 288992 291455 294302 296498 297791 298363 298440 298276 297969 297226 295704 293560
64910 293560 291204 288644 285699 282714 280256 278081 275334 271979 269050 267070 265262 263019 261146 260584
64896 260584 260590 259472 256927 254431 253254 253116 253027 252472 251275 249063 245602 241442 237654 234900 233016 231535
64880 231535 230494 230514 231947 234032 235318 235171 234466 234411 235095 235741 236081 236715 238166 240177 241980 242703 241747
64863 241747 239506 237598 237448 238599 239370 239264 239508 240764 241762 241204 239969 240110 242298 245534 248955 252512
64847 252512 255927 258438 259998 261776 265058 270266 277177 285193 293068 299251 303172 305894 309211 314460
64833 314460 322163 331984 342535 351866 358784 363577 367288 370742 374422 378610 383237 388032 393095 398667
64819 398667 404041 407617 408761 408731 408731 407734 403679 396626 389199 383490 378823 373333 366807 360898 357044 355217
64803 355217 354575 354284 353445 351125 347194 342731 338917 335707 332148 327869 323420 319044 314125 308431 303033
64788 303033 299013 295771 291785 286796 282119 278816 276730 275370 274410 273034 270229 266419 263482 262270
64774 262270 261407 259554 257589 257137 258131 259567 261735 265611 270446 274135 276006 277190 278049 277489 275524
64759 275524 274486 276434 280888 286274 292111 298231 303096 304862 303865 302612 303419 307044 313253 321418 330461
64744 330461 339259 347429 355258 362881 369923 375764 379755 381605 382042 382514 383462 383307 380084 373845 366569
64729 366569 359923 354123 348898 344461 341175 339119 338395 339313 341850 345250 348436 350680 351887 352529 353245
64714 353245 354270 355352 356409 357922 360320 363401 366815 370669 375049 379519 384008 389716 397910 407961
64700 407961 417763 426191 433927 441648 448680 454120 458294 462277 466557 470778 474364 476997 479004 481685
64686 481685 486550 493591 500722 505483 507016 506046 503468 499508 493952 486647 477809 468098 458187 448321
64672 448321 438661 429926 422913 417440 412778 409305 408337 409741 411069 410174 407589 405005 402467 398813 394263
64657 394263 390665 389209 389632 391750 395865 401110 405201 406978 407966 410232 413631 416384 417665 418161 418334
64642 418334 417524 415042 411189 406764 402171 397276 391770 385453 378566 372005 366796 363043 359774 356083
64628 356083 352137 348714 346095 343969 342256 341256 340925 340795 341048 342788 346435 350537 353374 355428 358752
64613 358752 363835 368842 372680 377037 383905 392378 399882 405874 412120 419299 425586 429337 431384 433462
64599 433462 435578 436189 434238 430009 424555 419226 415244 412814 410889 408414 405429 402505 399870 397899
64585 397899 397660 399759 403082 405906 408088 411001 415411 420592 425655 430618 435898 441717 448393 456328
64571 456328 465357 474919 485249 497379 511201 524291 533675 538568 540627 541573 541263 538184 531451 521987
64557 521987 511752 501974 492396 482424 472495 463614 455802 448011 439820 432211 426089 420960 415985 411614
64543 411614 408976 407889 406803 404894 403061 402330 402251 401764 401082 401555 403683 406241 407857 408783 410460 413693
64527 413693 417998 422667 427585 432690 437336 440896 443705 446910 451541 458020 466049 474333 480889 484679
64513 484679 486899 489730 493722 497353 499222 499552 499096 497709 494825 490480 484932 477959 469443 460079 450543
64498 450543 440464 429409 418508 409765 403637 398476 392668 386329 380515 375743 371876 368788 366375
64485 366375 364294 362301 360781 360501 361883 364701 368426 372683 377328 382000 385551 386335 383482 377816 371121
64470 371121 364706 359105 354781 352217 351192 350775 350274 349645 348885 347782 346485 345586 345329 345409 345759 346697 347875
64453 347875 348090 346906 345706 346230 348724 352391 356991 362671 368650 373581 377404 381474 386450 391313 395184
64438 395184 399117 404891 412548 420294 426865 433007 440203 448602 456829 463556 468566 472150 474075 473762
64424 473762 471324 467823 464314 461103 458201 456003 454969 454827 454640 453677 451850 449391 446606 443934 441736
64409 441736 439837 437688 435178 432930 431548 430885 430447 430364 431600 435092 440786 447488 453660 458540 462583
64394 462583 466752 471392 475987 479977 483501 487184 491493 496541 502310 508752 515808 523618 532700 543605
64380 543605 556388 570627 586018 602705 620927 640619 661619 684188 709100 737154 768771
64369 768771 804081 843196 886197 932910 983056 1036806 1095135 1159325 1230046 1307026 1389597
64358 1389597 1477264 1569378 1664285 1759141 1850877 1937458 2018297 2093600 2163144 2225284 2276861
64347 2276861 2314513 2336641 2344170 2339048 2322069 2292696 2250973 2198706 2138107 2069801 1993109 1908285
64335 1908285 1817700 1724613 1631324 1538868 1447949 1359633 1275230 1195903 1122409 1054993 993524
64324 993524 937790 887603 842619 802330 766381 734671 706889 682134 659379 638384 619811
64313 619811 604187 590872 578390 565859 553766 542969 533195 523157 512229 501242 491139 481613
64301 481613 471952 462684 455120 449182 442996 435167 426585 419263 414088 410417 407366 404732 402989 403061 405812
64286 405812 411030 417070 422092 425542 427980 429834 430970 431220 430502 428455 424714 419638 414099 408532 402844
64271 402844 397346 392943 390099 388238 386584 385110 384227 383850 383238 381753 379591 377762 377267 378110 379219
64256 379219 379582 379296 379218 379838 380971 382287 383461 383982 383566 382642 381540 379271 374320 366970 359622 354163
64240 354163 349974 345363 340010 334956 330939 328082 326788 327494 329419 330779 330647 329859 329791 330993 333174
64225 333174 335727 337944 339521 341387 345232 351445 357995 362240 363776 364841 367921 373554 380510 387431
64211 387431 393893 400286 407147 414568 421934 428134 432191 433809 433386 431695 429598 427841 426834 426593 427062
64196 427062 428409 430729 433460 435459 435937 435056 433322 430533 425752 418338 408823 398727 389705 382743
64182 382743 377781 373999 370725 368221 367376 368504 370632 372135 372088 370971 370126 370436 371369 371422 369734 367134
64166 367134 365245 364654 364546 364220 364281 365801 368694 371520 372828 372321 370748 369065 367841 367215 367130 367320 367054
64149 367054 365237 361279 355901 350648 346592 343915 342584 342507 342822 342192 340675 340449 343504 349037 354289
64134 354289 357692 359941 362135 364494 367373 372051 379465 389059 399729 411104 422910 434010 443555
64121 443555 452578 462754 473433 481507 484696 483661 480134 474440 466224 456603 447673 439889 431660 422037
64107 422037 412409 404650 398624 392681 385993 379143 372691 366470 360543 355672 352321 349987 348022 346445
64093 346445 345322 344081 342348 341019 341499 343895 346846 349212 351208 353639 356784 360349 363889 366824
64079 366824 368558 369165 369653 371049 373345 375691 377384 378288 378617 378884 379824 381622 383160 382845 380638 378730
64063 378730 379673 384015 390211 396559 402599 408606 414419 419410 423425 427328 432466 439792 449453 460925
64049 460925 473340 485859 498016 509672 520474 529578 536277 540953 544932 549165 553480 557487 561764
64036 561764 567331 574023 580328 585284 589792 595243 601127 604989 604908 601265 595681 588943 580776 571277 561447
64021 561447 551923 541922 530188 516748 503153 490979 480653 471802 464057 457080 450395 443911 438489
64008 438489 435296 434480 434987 435728 436368 436841 436883 436599 436941 438881 442331 446544 451272 456689 462185 466326
63992 466326 468509 470010 472775 477509 483460 489736 496183 502988 510082 517217 524440 532191 540886 550431
63978 550431 560153 569223 577147 583889 589716 595003 599845 603601 605115 603914 600977 597627 593844 588655
63964 588655 582366 577301 575574 576883 579251 581288 582785 583602 583266 581721 579540 577115 574289 570919 567250
63949 567250 563598 560131 556942 553836 550101 545129 539290 533574 528413 523514 518952 515531 513827 513603
63935 513603 514558 516967 521100 526536 532407 537920 542489 546159 550360 557420 568542 582628 597691 612960
63921 612960 628902 645721 662881 680137 698168 717880 739508 762586 786436 810544 834677
63910 834677 858906 883730 910351 940579 975629 1014655 1055129 1095326 1136151 1180007 1228400
63899 1228400 1281407 1339141 1402553 1472631 1549713 1634046 1726432 1827985 1939799 2063180 2199615
63888 2199615 2349733 2512556 2686576 2871830 3070340 3283804 3510812 3746826 3987135
63879 3987135 4229413 4472797 4714656 4949095 5168965 5368670 5544673 5694176 5814468
63870 5814468 5903514 5960173 5983506 5972378 5926086 5845164 5731550 5588359 5419599 5229703
63860 5229703 5023028 4803813 4576297 4344301 4110666 3877688 3648328 3426400 3215156
63851 3215156 3016164 2830081 2658051 2501454 2360312 2232864 2117159 2012501 1918781 1834890
63841 1834890 1758785 1689202 1626443 1570963 1521733 1476590 1433871 1393094 1354294 1317506 1282879
63830 1282879 1250518 1219993 1190667 1162747 1137301 1114827 1094444 1075130 1057358 1042902 1033183
63819 1033183 1028178 1026610 1026800 1027711 1029839 1034957 1044481 1058102 1074192 1091265 1108687 1126426 1144650
63806 1144650 1163334 1181748 1198723 1213944 1228508 1243444 1258140 1271150 1282149 1291772 1299578 1303580
63794 1303580 1302241 1295899 1285759 1272562 1256913 1239808 1221699 1201589 1178188 1151769 1123994 1095946
63782 1095946 1067177 1036824 1005043 973100 942408 913576 886029 858447 829870 800595 771909
63771 771909 745033 720395 697627 675833 653999 631828 610373 591321 575248 560951 546841
63760 546841 532617 519053 506610 495143 484888 476558 469993 463661 456327 448627 442081 437021 432655
63747 432655 428818 426268 424925 423185 419715 415073 410809 407653 405266 403135 400936 398411 395638 393059
63733 393059 390704 387776 383566 378331 372815 367518 363058 360488 360211 361100 361582 361178 360122 358195 355205
63718 355205 352105 350115 348915 347129 344556 342503 341780 341775 341690 341353 340518 338811 336800 335747 335795 335766 335282
63701 335282 335626 337590 339891 340857 340528 339830 338692 336504 333850 332358 332932 335114 337971 340703 342705
63686 342705 343934 345133 346890 348691 349602 349662 349890 351156 353723 357625 362731 368486 374219 379662 384828
63671 384828 389714 394536 399795 405515 410904 415410 419639 424477 429806 434982 440110 445722 451445 456186
63657 456186 459725 462981 466460 469315 470402 469619 467887 466200 464896 463518 461404 458791 457130 457567 459208
63642 459208 459701 457780 454526 451841 450381 449506 448747 448576 449715 452172 455220 458230 461244 464598 468253
63627 468253 471891 475572 479688 484130 488149 491446 494736 498708 502899 506263 508492 510160 511782 513305
63613 513305 514327 514427 513506 512135 511132 510556 509829 509290 510606 514648 519702 522928 523071 520757 516886 512197
63597 512197 507861 504807 502490 499803 497115 495898 496322 496922 496761 496271 495649 494414 493248 494333 498593
63582 498593 504137 508841 513207 519169 527131 535916 544981 554986 566249 578108 589964 601996 614806
63569 614806 629075 645390 663654 682784 701772 720907 741364 763844 788324 814734 843026
63558 843026 872744 903469 935588 969875 1006485 1045235 1086723 1132058 1181309 1233180 1286473
63547 1286473 1341003 1396594 1451786 1503960 1550323 1588592 1617437 1636831 1647894 1652150 1651046 1645927
63535 1645927 1637780 1626774 1612559 1595252 1575680 1554447 1531213 1505161 1475760 1442908 1406901
63524 1406901 1368622 1329320 1289826 1250424 1211923 1176231 1145157 1118809 1095876 1075403 1057677
63513 1057677 1043377 1032508 1024452 1018614 1014789 1013156 1014128 1018016 1024717 1033894 1045410 1059248 1075041
63500 1075041 1092218 1110848 1131757 1155313 1180577 1206445 1233514 1264026 1299786 1340682 1385425
63489 1385425 1433078 1483419 1536393 1591894 1649681 1708462 1764797 1813581 1850298 1873032 1882558
63478 1882558 1881165 1871655 1856915 1839471 1820990 1802177 1783116 1763522 1742742 1719836 1693850 1663893
63466 1663893 1628954 1588088 1541266 1489916 1436122 1381181 1325461 1269842 1216492 1167285 1121766
63455 1121766 1077779 1034377 993235 956700 925156 897046 870905 846416 823633 802212 781788
63444 781788 762484 744646 728343 713363 699436 686278 673642 661576 650575 641395 634701 630708
63432 630708 628805 627525 625289 621544 617109 613268 610587 608736 607321 606617 607189 608891 610714 611989 613433
63417 613433 616317 620579 624443 626227 625987 625068 624628 625037 626038 626707 625668 622313 617752 613927 611916
63402 611916 611605 612550 614244 615861 616906 618194 621137 625916 631320 636637 642591 649970 658375 667053 676241
63387 676241 686918 699747 714817 731985 750897 771160 792971 817160 844269 874210 907253
63376 907253 944455 986229 1031020 1076319 1120566 1163189 1203352 1240025 1273342 1304750 1335537
63365 1335537 1366217 1397729 1432240 1471828 1516729 1565561 1617138 1671465 1728980 1789444 1851898
63354 1851898 1915120 1977229 2034694 2082661 2117368 2138469 2148602 2150705 2146281 2136068 2121221 2103094
63342 2103094 2082495 2059806 2035310 2008532 1977580 1940224 1895979 1846672 1794791 1741720 1687659
63331 1687659 1632799 1578148 1525248 1475225 1428245 1383985 1342562 1304636 1270546 1239892 1212357
63320 1212357 1188498 1169141 1154248 1143044 1135154 1131040 1131261 1135906 1144897 1158295 1175922 1196979
63308 1196979 1220408 1245674 1273091 1303440 1337284 1374594 1414984 1458313 1504976 1555527 1610012
63297 1610012 1667624 1726916 1786451 1845497 1903931 1960990 2014050 2059143 2092964 2114173 2123003
63286 2123003 2120550 2108954 2091398 2070846 2048696 2024995 1999509 1971971 1941662 1907638 1869462
63275 1869462 1827156 1780515 1729103 1673110 1613901 1553678 1494727 1438633 1385682 1335164 1286700
63264 1286700 1241162 1200120 1164750 1135589 1112413 1093310 1074476 1052420 1026591 998884 970689
63253 970689 941711 911799 882301 854798 829721 807082 787434 770771 755254 738573 720460
63242 720460 702742 686977 673155 660753 649707 639818 630267 620623 611757 604866 599823 595252 590120
63229 590120 584471 578534 572040 564972 558382 553594 550628 548079 544728 540775 537224 534499 532133 529692
63215 529692 527522 526441 526814 528013 528861 528739 528225 528383 529389 530206 529886 528914 528940 531266 535759 541088 545805
63198 545805 549327 552168 555264 559099 563621 568884 575274 582901 591301 600043 609265 619293 630183 642055
63184 642055 655345 670053 685099 699265 712765 727230 744086 763401 784266 805754 827426
63173 827426 849366 871829 894712 917508 939991 962514 985201 1007361 1028386 1048845 1069815
63162 1069815 1091437 1113053 1134507 1156077 1177142 1196262 1212933 1228053 1241986 1253105 1259054
63151 1259054 1258781 1252869 1242703 1230069 1216720 1203111 1187779 1168862 1146287 1121940 1097984 1075677
63139 1075677 1055662 1038613 1025320 1016439 1012126 1011683 1013702 1016966 1021115 1026289 1032500 1039867 1049084
63126 1049084 1060897 1075057 1090460 1106501 1123713 1142676 1162742 1182414 1200864 1218497 1235845
63115 1235845 1252492 1267671 1281614 1295378 1309062 1320980 1329208 1333370 1334131 1331470 1324579 1313272
63103 1313272 1298233 1279711 1257154 1230625 1201498 1171149 1139930 1108199 1077328 1048546 1021343
63092 1021343 994183 966557 939391 913713 889934 868265 848746 830864 814166 799408 787999
63081 787999 779957 773362 766425 759332 753331 748684 744473 740175 736456 734287 733953 735189 737696 741003
63067 741003 744130 746057 746732 747284 749059 752615 757714 763880 770618 777377 783850 790198 796468 801910 805612
63052 805612 807993 810935 815978 822788 829727 835509 839946 843684 847763 853051 859434 865841 871588 877363
63038 877363 884248 892092 899657 906155 911734 916478 919984 922215 923899 925592 926982 927627 927838 928292 929236
63023 929236 930673 932994 936684 941477 946504 951498 957280 964724 973590 982872 992253 1002607 1014805 1028418
63009 1028418 1042360 1056774 1073445 1093771 1116918 1140847 1164920 1190488 1218881 1249968 1283202
62998 1283202 1319006 1358061 1399876 1443348 1488590 1536890 1588505 1641648 1694389 1746836 1800568
62987 1800568 1856301 1912981 1968979 2023389 2076167 2127829 2179253 2231206 2283740 2336317 2388399
62976 2388399 2439315 2487630 2531615 2570719 2605624 2636178 2660078 2674531 2678736 2673781 2660583 2639105
62964 2639105 2609548 2573118 2531303 2485150 2435466 2383122 2329105 2274994 2223314 2176464 2135089
62953 2135089 2098379 2066093 2039252 2018605 2003746 1994405 1991410 1995387 2005387 2019779 2037717 2058733
62941 2058733 2081783 2106051 2132200 2161309 2192704 2224079 2253788 2281910 2309064 2335323 2360430
62930 2360430 2383949 2404846 2421899 2434866 2444363 2450149 2450315 2442660 2426284 2401599 2369544 2331253
62918 2331253 2287723 2239113 2184831 2124871 2060757 1994808 1928876 1864200 1801971 1743288 1688579
62907 1688579 1637421 1589001 1542732 1498769 1458029 1421281 1387959 1356311 1325055 1294511 1265753
62896 1265753 1239032 1213560 1188669 1164624 1142145 1121290 1100955 1079692 1057309 1035439 1015941
62885 1015941 998675 981557 963034 943836 925815 909728 894841 880456 867099 856108 848229
62874 848229 842510 836600 828674 819149 809935 801922 794254 786441 779751 775375 772373 769094 765888 764463
62860 764463 764823 764974 763995 763258 763749 764093 762628 759911 757446 755039 751361 746581 742419 739639 737187 734046
62844 734046 730373 726413 721851 716911 712834 710360 708705 706910 705347 705042 706296 708848 712603 717109
62830 717109 720994 723135 723976 724474 724193 721887 717835 714039 711867 710853 710163 709887 710217 710624 710678 710689 710718
62813 710718 709928 707893 705615 704101 702693 700191 697024 694726 693415 691466 688056 684735 683717 685424
62799 685424 688255 690246 690571 689964 689982 691348 692915 692895 691252 689989 690624 692302 693112 692571 691852 691986 692864
62782 692864 693923 694901 695639 695801 695229 694346 693934 694541 696029 697600 698336 697914 696712 695137 693175 690947
62766 690947 689421 689932 692874 697287 701828 705718 708620 710251 710817 711706 714967 721641 730682 739846 747721
62751 747721 754868 763120 773953 787404 802178 816516 829196 840158 850479 861633 874578 889402
62739 889402 905757 923568 943274 965332 989452 1014479 1039290 1063916 1089717 1118352 1150661
62728 1150661 1186534 1225562 1267648 1313190 1362866 1417172 1476053 1539130 1606266 1677446 1751860
62717 1751860 1827676 1903308 1978501 2053321 2126140 2193504 2252159 2300456 2337653 2362832 2375249
62706 2375249 2375188 2363693 2341720 2310117 2270053 2222647 2168271 2107060 2040303 1970597 1900190 1829614
62694 1829614 1758430 1687107 1617664 1552403 1492195 1435979 1381763 1328211 1275627 1225677 1180118
62683 1180118 1139595 1103379 1070147 1039058 1010386 985223 964363 947275 932387 918651 906593
62672 906593 897269 890326 883941 877007 870502 866065 863940 863357 864351 867734 873378 880165 887981 898024
62658 898024 910235 922239 932556 943667 959654 981264 1005520 1030287 1056919 1087569 1121856
62647 1121856 1157739 1194490 1233364 1276008 1323480 1376333 1434374 1496440 1561263 1628459 1698000
62636 1698000 1769027 1839996 1909647 1977023 2040800 2099483 2152068 2197570 2234111 2259687 2273852
62625 2273852 2277444 2270401 2251148 2218890 2175445 2123802 2065632 2001404 1932530 1861877 1791670 1721842
62613 1721842 1651208 1579947 1510295 1444811 1384465 1328562 1276116 1226739 1180192 1135752 1092712
62602 1092712 1051457 1013477 979985 950799 924763 900903 878778 857917 837686 818039 800014
62591 800014 784867 772551 761384 749488 736510 723788 712964 704681 698483 693540 689232 685366
62579 685366 682141 679868 678583 678105 678539 680279 683072 685386 685459 683135 680091 678016 677062 676457 676005 676182
62563 676182 676912 677186 676307 675010 674827 676584 679971 684445 689934 696541 704116 712495 721963 733064 745957
62548 745957 760168 774885 789371 803264 816888 831243 847382 865707 886073 908429 933056
62537 933056 960245 990203 1023134 1058736 1095496 1131329 1165453 1198982 1232917 1265924 1294904
62526 1294904 1317464 1333029 1341759 1343670 1339180 1329501 1315586 1297183 1273676 1245544 1214273 1181027
62514 1181027 1146223 1110510 1075368 1042190 1011111 981183 951646 922808 895770 871495 850111
62503 850111 830912 813032 796184 780719 766929 754507 742912 732198 723159 716575 712428 709865
62491 709865 707748 705251 702215 699108 696487 694423 692657 691340 691127 692142 693314 693538 693434 695159 700134
62476 700134 707439 714741 720316 723908 726384 729336 734528 742597 752233 761532 770446 781165 795706 813879
62462 813879 834219 856233 880766 908392 938485 970191 1003566 1039284 1077519 1117515 1158112
62451 1158112 1198488 1238511 1278463 1318189 1356357 1390780 1419717 1442735 1460211 1472354 1479054
62440 1479054 1480445 1477147 1469886 1459197 1445569 1429664 1412348 1394645 1377614 1362010 1348091 1335962
62428 1335962 1326103 1319248 1315772 1315550 1318594 1325463 1336692 1351885 1369737 1389129 1410137 1433737 1460306
62415 1460306 1488442 1515482 1539240 1559090 1575333 1587965 1596290 1599245 1595658 1584688 1566685 1543312
62403 1543312 1515949 1484163 1446698 1404021 1358872 1313951 1269984 1226525 1183723 1142512 1103598
62392 1103598 1067147 1033280 1002354 974824 951009 930663 912627 895530 879183 864751 853272
62381 853272 844619 838173 833563 830154 826851 823373 820961 820828 822425 824128 824973 824641 822440 817738 811126
62366 811126 803940 796800 789642 782702 776090 768753 759384 748381 737595 728198 720122 713364 708120 703585
62352 703585 698427 692816 688297 685205 682019 677954 674423 672961 673259 674260 675690 677335 678271 678269 678858 681608
62336 681608 686277 691798 697959 704765 711255 716652 721865 728224 735355 741921 747871 754376 762137 771505
62322 771505 783649 799373 816769 832344 845208 858426 875421 896384 919054 941856 965225
62311 965225 990606 1019193 1051352 1086595 1124131 1163734 1206056 1252216 1303321 1360051 1422191
62300 1422191 1488759 1559196 1634164 1714520 1799792 1888515 1979686 2072683 2165605 2254754 2336204
62289 2336204 2407311 2466600 2513053 2545964 2565122 2570981 2564752 2547840 2520560 2481899 2431491 2371440
62277 2371440 2305116 2234577 2160613 2085108 2011351 1941325 1874263 1808869 1745848 1687162 1633726
62266 1633726 1584998 1540282 1499190 1460943 1424205 1387965 1352268 1318012 1286078 1256430 1227859
62255 1227859 1198754 1168245 1136601 1104813 1074132 1045620 1019503 995162 972408 952410 936304
62244 936304 923142 910603 897932 886836 878938 873712 869788 867170 866881 868996 872157 874846 876378
62231 876378 876878 877081 878102 880751 884901 889748 894663 899749 905790 913738 923920 935743 948455 962020
62217 962020 976701 992121 1007804 1024571 1043991 1066039 1088684 1110702 1133776 1160622 1191889
62206 1191889 1226182 1262700 1302458 1346938 1396725 1451733 1511911 1577330 1648033 1724098 1805550
62195 1805550 1891979 1982209 2074376 2166312 2255992 2341495 2420284 2488862 2543896 2583807 2608806
62184 2608806 2619546 2616639 2601357 2575403 2539318 2492148 2433473 2364949 2289203 2208082 2122855
62173 2122855 2035315 1947686 1861939 1779838 1702819 1630887 1562520 1496836 1435248 1379762 1330380
62162 1330380 1285593 1244907 1209160 1178449 1151333 1126395 1103340 1082519 1064557 1050511 1040945
62151 1040945 1034527 1028852 1023143 1018951 1017799 1019336 1022324 1025958 1029435 1031662 1032826 1035272 1041226 1050025
62137 1050025 1058919 1066334 1073090 1080529 1088906 1097985 1107974 1119106 1131034 1143388 1156381 1170192 1184098
62124 1184098 1197057 1209050 1221199 1234517 1249097 1264638 1281043 1298128 1315380 1332715 1351331
62113 1351331 1373157 1399383 1429820 1463654 1500529 1541051 1586606 1638528 1696886 1760080 1825979
62102 1825979 1893204 1960713 2026505 2087774 2142443 2189546 2227882 2255457 2270945 2274856 2268538 2252702
62090 2252702 2227640 2194152 2153456 2106720 2055442 2001660 1946768 1890525 1832300 1773007 1714889
62079 1714889 1659679 1608062 1560794 1519056 1483365 1452987 1426756 1403886 1383853 1366298 1351365
62068 1351365 1339559 1330866 1324363 1318953 1314295 1310954 1309764 1310801 1312638 1312936 1310323 1305513 1300196 1295360
62054 1295360 1291361 1288901 1288452 1288731 1287162 1282302 1274933 1266390 1256874 1245956 1233938 1222046 1211774
62041 1211774 1204344 1200069 1197744 1195487 1192994 1192416 1196132 1203925 1213192 1221795 1229941 1239136 1250062 1261995
62027 1261995 1274119 1286826 1301420 1318617 1337767 1357904 1379277 1403294 1430870 1461426 1493782
62016 1493782 1527612 1563501 1601717 1641450 1681643 1722555 1766129 1814255 1866573 1920460 1973579
62005 1973579 2026127 2080232 2137525 2197640 2258532 2317372 2371400 2418763 2458662 2490151 2511197
61994 2511197 2519908 2516603 2503523 2482291 2452662 2414136 2367613 2314654 2255920 2191437 2122110 2050077
61982 2050077 1977498 1905500 1834378 1764507 1696883 1632762 1572793 1516765 1464363 1415807 1371168
61971 1371168 1329561 1289975 1252843 1219639 1190690 1164531 1139882 1117034 1096388 1076755 1056448
61960 1056448 1035541 1015652 997550 980296 963041 946607 932549 921125 910922 900465 889790
61949 889790 880166 872421 865869 859226 852389 846823 844018 844010 845610 847687 849853 852198 854750 857133 858615
61934 858615 858759 858141 857918 858290 857823 854930 849822 844308 839668 835341 829957 823192 816174 810246 805726
61919 805726 801882 797776 792997 787806 782873 778778 775447 772164 768482 765037 762841 761772 760591 758801
61905 758801 757487 757511 757775 756521 753917 751979 751978 753226 754560 755871 757753 760648 764726 769888 775663 781853
61889 781853 789213 798459 808667 818153 827233 838453 853349 870535 888063 906167 926192 947910
61877 947910 969613 990320 1010355 1030147 1049836 1069824 1090394 1110804 1129796 1146878 1162143
61866 1162143 1175090 1184792 1191118 1194770 1196094 1194833 1191024 1185326 1178569 1171718 1165862 1161143 1156112 1149537
61852 1149537 1142700 1138444 1137930 1139873 1143169 1148450 1156305 1165595 1174812 1184009 1194044 1204446 1213214 1218470
61838 1218470 1219489 1216442 1210068 1201494 1191504 1179768 1165210 1147252 1126553 1104689 1083336 1063590
61826 1063590 1045650 1029026 1013065 997356 981925 967363 954538 943615 933480 922733 911299
61815 911299 900419 891059 883106 876202 870403 865650 861631 858818 858686 861958 867276 872670 877906 884292
61801 884292 892470 901760 911860 923940 939324 957794 978096 999935 1024725 1054119 1088035 1124456
61789 1124456 1161218 1197756 1234882 1273056 1311490 1349146 1385858 1421726 1455603 1484950 1507376
61778 1507376 1522054 1529772 1532167 1530886 1526841 1520061 1510614 1499719 1489398 1480946 1474408 1469785 1467836
61765 1467836 1468988 1472227 1476155 1480831 1487319 1495251 1501904 1504150 1500630 1491591 1477543 1458911 1436435
61752 1436435 1410817 1382033 1349796 1314718 1278362 1242035 1206107 1170573 1135700 1101986 1069953
61741 1069953 1040132 1012763 987512 963987 942563 923939 907755 892515 877282 862651 849486
61730 849486 837532 826116 815607 807045 800530 794928 789186 783088 776678 769808 762628 755870 750195
61717 750195 745606 741787 738628 736110 733924 731675 729449 727901 727551 727964 727846 726322 724171 723369 725080
61702 725080 728352 731147 732462 733015 734056 736011 738351 740333 741660 742560 743272 743506 742711 741117 740171 741409
61686 741409 744852 748758 750929 750180 746896 742640 739149 737331 737036 737711 738970 740556 742371 744770 748185
61671 748185 752016 754687 755516 755864 757511 760411 763053 764666 765972 768020 771420 776454 782627 788084 790877
61656 790877 791178 791105 792106 793684 795033 796425 798192 799515 799287 797409 794371 790242 785061 779633 775024
61641 775024 771496 768531 765510 761890 757280 752045 747357 743953 741241 738102 734052 729039 722879 715802
61627 715802 709041 703858 700285 697586 695426 693642 691376 687813 683631 680500 678973 677938 676387 674698
61613 674698 673812 673979 674746 675494 675629 674918 674065 674323 675956 677559 677428 675348 672575 670293 668627 667084
61597 667084 665492 664317 664252 665699 668473 671785 674492 675736 675783 676068 677846 680732 683144 684377 685469
61582 685469 687542 690024 691346 690945 689711 688733 688538 689348 690996 692407 692150 689958 687083 684820 683250
61567 683250 681764 680239 679091 678346 677090 674080 669033 663326 659008 656796 655414 653326 650582 648160
61553 648160 646012 642962 638482 633380 628551 624039 619543 614698 608690 600823 591992 584334 578679 573523
61539 573523 567374 560932 555695 551472 546868 541646 536863 532746 528029 521770 514691 508247 503224 499575
61525 499575 496864 494417 491546 488038 484199 480419 476975 474073 471588 468968 465923 463017 460910 459321
61511 459321 457569 455887 455106 455119 454918 454349 454557 456183 458298 459829 460967 462265 463149 462480 460122 457052
61495 457052 454273 452423 451972 452796 453657 453172 451511 450509 451850 455454 459635 462504 463341 463027 463161 464536
61479 464536 466576 468269 469141 469102 468144 466824 466387 467446 468970 469550 469295 469380 469955 469782 468100 465642 463479
61462 463479 461928 461034 461086 461949 462676 462524 461859 461447 461349 461146 460888 461217 462700 465338 468499 471104 472333
61445 472333 472372 471976 471122 468829 464783 460368 457396 456298 456193 456178 455808 454865 453642 453170 454239 456289 458034
61428 458034 459014 459693 460169 459830 458540 457323 457467 459370 462399 465391 467286 467903 468287 469666 471884 473462
61412 473462 473455 472595 472226 472677 473288 473672 474314 475908 478502 481342 483359 483876 483073 481907 481501 482413 484228
61395 484228 485709 485618 483720 481017 478903 478302 479722 483491 489206 495128 499007 499850 498509 496525 494899
61380 494899 493981 493809 494161 494770 495849 498069 501745 506397 511356 516331 521052 524833 527168 528579 530395
61365 530395 533592 538063 542881 546953 549562 550789 551584 553118 555755 558774 561326 563584 566464 570007
61351 570007 572613 572649 570730 569395 570204 571991 572644 571736 570362 569028 567175 564762 562913 562495 562980 563121
61335 563121 562012 559180 554667 549656 546247 545789 547723 550481 553041 555247 557333 559747 562902 566418
61321 566418 569014 569698 568739 567018 564971 562767 560959 560079 559936 560077 560691 562276 564580 566611 567677 567826
61305 567826 567390 566767 566673 568023 571460 577173 584839 593273 600702 606262 611061 616919 624156 631510 638209
61290 638209 645104 653387 663012 672835 681766 689306 695398 700327 704754 709524 715271 721915 728425 733510
61276 733510 737083 740712 745971 752533 758612 763077 766152 768140 768748 768101 767268 767045 766999 766513 766046 766452
61260 766452 767679 769169 771181 774504 778864 782846 785770 788838 793777 800869 808903 816826 824809 833650
61246 833650 843628 854233 864900 875615 886615 897712 908294 917968 926693 934099 939206 941388 941251
61233 941251 939797 936827 931058 922126 911688 901922 893411 885183 876490 867777 859954 853492 848352 844075
61219 844075 839639 833915 826938 820473 816716 816328 817911 819348 819648 819842 822187 828076 836434 844625 851133
61204 851133 856709 862466 867945 872191 876031 881593 889608 898738 907849 917335 927496 937068 944632 950583
61190 950583 956439 962662 968295 972481 975382 977767 980317 983099 985237 985669 984908 985275 988232 992039 993385
61175 993385 991065 986769 982513 978923 976252 975348 976695 979490 982465 985006 987029 988592 990198 992735
61161 992735 996495 1000887 1005542 1010846 1016769 1022090 1025847 1028962 1033416 1039973 1047555 1054632 1060404 1064782
61147 1064782 1068079 1070862 1073548 1076085 1078492 1081608 1086684 1094133 1103154 1112707 1122421 1132425 1142745
61134 1142745 1153260 1164092 1175847 1189277 1204539 1220647 1235796 1248431 1258020 1264930 1269819 1273249
61122 1273249 1275492 1276549 1276668 1276825 1277985 1279608 1279723 1277178 1273153 1269640 1267027 1264214 1260566 1256289 1251100
61107 1251100 1244272 1236408 1229509 1224259 1218552 1209991 1198979 1187836 1177454 1166495 1153881 1140312
61095 1140312 1126780 1113043 1098719 1085036 1074130 1066757 1061673 1057342 1053362 1049970 1046891 1043245 1038283
61082 1038283 1031738 1023680 1014541 1005250 996849 989720 983565 978322 974698 973340 973717 974452 974860 975695 978209
61067 978209 983043 990321 1000133 1012096 1024839 1037033 1049137 1063230 1080581 1099979 1119120 1137275
61055 1137275 1155993 1177308 1201871 1228824 1256967 1285756 1315345 1345834 1376599 1406618 1435519
61044 1435519 1463867 1492000 1518890 1542771 1562757 1579289 1592999 1603723 1610760 1613597 1612185 1606945
61032 1606945 1598773 1588686 1577136 1563850 1548560 1531641 1513785 1495201 1475421 1454004 1431373
61021 1431373 1408841 1387606 1367769 1348661 1330186 1313215 1298340 1284885 1271889 1259570 1248947
61010 1248947 1240305 1233115 1227255 1223159 1220741 1219495 1220046 1224300 1233256 1245546 1258897 1272322 1286284
60997 1286284 1301619 1319232 1340273 1365636 1395364 1429022 1466185 1506144 1547883 1591118 1637100
60986 1637100 1687823 1744857 1809153 1881013 1959499 2042703 2129658 2221594 2320583 2427535 2542258
60975 2542258 2664613 2794633 2932137 3077330 3231108 3393664 3563560 3739712 3924010
60966 3924010 4120693 4333354 4563614 4812206 5079746 5366541 5673015 6000562 6351487
60957 6351487 6729141 7139741 7593729 8103899 8682563 9341453 10092912 10949409 11924027
60948 11924027 13034601 14305007 15757202 17403404 19251400 21309079 23555141 25879405
60940 25879405 28058111 29826061 31014240 31639680 31871358 31917640 31943338 32058038 32318468
60931 32318468 32689427 33001230 32989125 32424365 31238547 29540185 27528023 25390881 23262611
60922 23262611 21225656 19324773 17575985 15977507 14522501 13204924 12018241 10954627
60914 10954627 10006313 9164910 8419425 7757479 7168489 6643800 6174578 5752351 5371535
60905 5371535 5028948 4720712 4441861 4189044 3961262 3757376 3574710 3410384 3262026
60896 3262026 3126653 3000760 2882346 2771519 2668591 2573020 2484586 2403855 2330723 2263887
60886 2263887 2202506 2146957 2097183 2051696 2009292 1970472 1935956 1904732 1874824 1845446 1817349
60875 1817349 1791516 1768434 1748202 1730285 1713234 1695519 1676783 1657928 1640066 1623759 1609107
60864 1609107 1596148 1585069 1576179 1569748 1565875 1564522 1565433 1567916 1571135 1575065 1580787 1589246 1600056
60851 1600056 1612250 1625807 1641465 1659169 1677814 1696629 1715716 1735030 1753793 1771278 1787313
60840 1787313 1801618 1813424 1822082 1827346 1828948 1826819 1821910 1815474 1806921 1793602 1773761 1748790 1721527
60827 1721527 1693047 1662498 1629683 1596246 1563943 1532775 1501424 1469074 1436324 1404569 1374831
60816 1374831 1347142 1320779 1295004 1269645 1245125 1221997 1200387 1179968 1160632 1143077 1128214
60805 1128214 1115842 1104488 1092766 1080205 1066431 1050641 1032941 1015317 999791 986035 972202
60794 972202 957797 944065 931658 919847 908346 897924 888440 878145 866183 854259 844349 835868
60782 835868 826674 816059 805173 794971 785233 775456 765510 755483 745728 736791 728490 719551 709221
60769 709221 698873 690903 686263 684081 683273 683209 682993 681686 679549 677852 677026 676104 674404 672761 672501 673965
60753 673965 676509 679252 681354 682285 682436 682901 684145 685431 686042 686449 687596 689518 691413 692779 693789
60738 693789 694814 696222 698324 700621 701248 698358 692475 686585 683241 682125 681033 678591 675021 670652
60724 670652 665092 658297 651441 645855 641545 637447 632867 628078 623707 620081 617010 613693 609126 603319
60710 603319 597903 594600 593095 591394 588511 585731 584575 584514 583742 581772 580108 580322 582274 584503 585786
60695 585786 585991 585806 586126 587679 590901 595761 601561 607093 611430 614678 617736 621217 624879 628194 631036
60680 631036 633418 634855 634584 632614 630127 628394 627218 624887 620012 613191 606277 600100 593807 586796
60666 586796 580234 575613 572498 568971 564027 558216 552011 545093 537628 530844 525576 521352 517660 515068
60652 515068 514062 513595 511983 508862 505365 502677 501222 500902 501215 501279 500463 499052 497855 497358 497669 498861
60636 498861 500826 503060 505099 506946 508782 510672 512921 516016 519697 522758 524528 525877 528083 531334
60622 531334 535221 539919 545747 552130 558223 564133 570294 576061 580407 583856 588258 594512 601789 609022
60608 609022 615769 621407 625006 626607 627419 628208 628587 628368 628376 629138 629786 629191 627405 625184 622811 620249 617825
60591 617825 615925 614428 613159 612413 612448 612964 613718 614959 616434 616591 613905 608751 602954 597655 592627 587639
60575 587639 583376 580527 578695 576724 573750 569658 564924 560411 557060 555262 554400 553219 550881 547783
60561 547783 545328 544769 546264 548988 551951 554470 556196 557252 558367 560245 562548 564031 563955 562940 562141
60546 562141 562110 562831 564235 566001 567265 567396 566879 566685 566866 566610 565833 565796 567666 571034 574357 576560 577757
60529 577757 578746 580367 583170 587083 591205 594352 596015 596714 597439 599055 602262 607567 614868 623302 632036
60514 632036 641187 651565 663516 676487 689848 703753 718877 735473 752808 769325 783464 794735
60502 794735 804067 812501 819390 822651 821266 816812 811763 807013 802129 797461 794396 793455 793699 794734 798133
60487 798133 805783 817554 831621 846705 862979 880954 900493 921134 942572 964315 985237 1003943
60475 1003943 1019490 1031512 1039746 1043792 1043565 1039939 1034696 1029672 1025896 1023432 1021681 1019674 1016449 1011735
60461 1011735 1006290 1001254 997278 994593 993657 995001 998395 1002852 1007736 1013341 1020193 1028468 1038578 1051696
60447 1051696 1068986 1090534 1115626 1143956 1176062 1212635 1253929 1299958 1350937 1407223 1468686
60436 1468686 1533916 1600035 1663683 1722501 1775477 1821552 1858246 1882197 1891114 1884946 1865177 1833385
60424 1833385 1790603 1737828 1676838 1610336 1541222 1471812 1403795 1338628 1277456 1220614 1167778
60413 1167778 1118833 1074217 1034123 997881 964569 933900 906108 881266 859224 839908 822955
60402 822955 807165 791104 774565 758977 745975 735799 727247 718945 710338 701672 693451 686076 679706
60389 679706 674071 668341 661611 653902 646535 641053 637737 635553 633543 631660 630113 628545 626379 623531
60375 623531 620292 616887 613689 611418 610421 610012 609323 608617 608837 609878 610392 609672 608713 608645 608867 607788 605103
60358 605103 602356 601148 601622 602895 604185 605034 605032 604175 603390 603999 606387 609580 612338 614403 616437 618957
60342 618957 621662 623773 624870 625373 626218 627905 629837 630892 630818 630743 632027 634841 638306 641734 645184 648890
60326 648890 652822 656904 661049 664795 667470 669167 671182 674973 680643 686617 690893 692892 694299 697768
60312 697768 704212 711575 716997 720117 723305 728546 735208 741392 746333 750577 754610 758426 762092 765854
60298 765854 769923 774708 780781 787970 795235 802448 811447 823873 838336 851386 861241 868976 875837
60285 875837 881185 883810 883771 881851 878285 873172 867330 861614 855951 849991 844250 839563 835815 832189 828469
60270 828469 825140 822275 819230 815550 811547 807907 805145 803319 801829 799762 796961 794426 793042 792391
60256 792391 791803 792220 795673 802829 812281 822616 833967 846983 861493 877240 895085 916254 940584
60243 940584 966315 991287 1013532 1030991 1041720 1044703 1040017 1028350 1010983 990066 968003 946267
60231 946267 925265 905309 886903 870022 854093 839251 826833 817845 811372 805273 798246 790658
60219 790658 783681 778395 775565 775301 776487 777180 776115 773649 771041 769123 767929 767184 766574 765608 763810
60204 763810 761202 758269 755203 751488 746572 740852 735647 732105 730290 729313 728101 726013 723129 720285
60190 720285 718598 718580 719659 720814 721636 722604 724490 727803 732592 738218 743292 746456 747520 747482 747307 747197
60174 747197 747130 747369 747964 748379 748343 748631 750216 752962 755941 758790 761770 764542 766077 766268 766728 769221 773725
60157 773725 778689 782939 786693 790745 795287 799887 804465 809851 817052 825882 834729 841998 847650 852998
60143 852998 859277 866834 875398 884345 892696 899705 905734 911932 918767 925487 931332 936513 941459 945754
60129 945754 948646 950271 951543 952881 953700 953225 951353 948549 945263 941686 937876 933905 929724 924970 919249
60114 919249 912846 906852 901993 897489 891873 885006 878479 873815 871096 869637 868876 867928 865446 861247 857455
60099 857455 856528 858230 859738 858761 855531 851750 848820 847420 847611 848669 849558 850205 851713 854866 859030
60084 859030 863107 867010 871457 876635 881813 886147 889377 891858 894432 898196 903799 910792 917988 924575
60070 924575 930581 936251 941390 945714 949592 953904 958952 963802 967094 968495 969056 970103 972042 974448
60056 974448 976969 979738 982945 986467 990073 993756 997560 1001158 1003771 1004806 1004583 1004153 1004035 1003351 1000707
60041 1000707 995960 990453 985350 980499 975421 970705 967419 965458 963458 960538 957375 955243 954555 954609 954367
60026 954367 953094 950537 946961 943197 940498 939923 941370 943142 943015 940134 935575 930885 926621 922647 918945
60011 918945 915209 910220 902879 893744 884454 875692 866901 858071 850378 844454 839170 833028 825960 818958
59997 818958 812535 806479 800679 795304 790278 785410 781107 778344 777621 778206 778706 778502 778527 780225 783499 786300
59981 786300 786977 786696 788410 793427 800192 806658 812424 817888 822644 825985 828072 829342 829372 827673 825174
59966 825174 823489 822795 821744 819496 816548 813342 809306 803882 797527 790989 784244 776897 769190 761906
59952 761906 755329 748853 741718 734044 727019 721805 718075 713961 707980 700865 694805 690901 688154 685170
59938 685170 682059 680091 679993 681161 682358 682699 682119 681290 681090 681886 683243 684369 684796 684736 685103 687085 691133
59921 691133 696099 699769 700714 699530 698064 697600 697928 697841 696251 693100 689577 687287 686852 687360 687420 686538 685206
59904 685206 683961 682953 682401 682732 683857 684770 684509 683500 683383 685127 687584 688430 686669 683869 682605 683934
59888 683934 686761 689480 691562 693342 694976 696268 697270 698410 699943 701740 703695 705940 708474 710911
59874 710911 712790 713933 714388 714397 714668 716184 719083 721883 722639 721219 719940 721387 725870 731590 737089 742718
59858 742718 749391 756732 763334 768751 774330 781663 790621 799402 806300 810975 814031 815926 816639 816204 815129
59843 815129 814167 813778 813855 813862 813178 811449 808834 806055 804142 803903 805377 807752 810025 811883 813907 816798
59827 816798 820628 825021 829874 835391 841366 847071 852273 857991 865624 875392 886108 896407 905620 913334
59813 913334 918897 922025 923528 924662 925604 925131 922126 917113 911931 907919 904764 901227 896835 892542 889779
59798 889779 889116 890006 891641 893692 896331 899933 904921 911490 919087 926248 931294 933359 932772 930653 928305
59783 928305 926762 926324 926212 924892 921099 914782 907050 899294 892343 886347 881170 876648 872425 867833 862421
59768 862421 856831 852883 852122 854004 855749 854442 849353 842116 834891 828814 824141 821021 819426 818600 817340
59753 817340 814972 811644 807744 803685 800250 798330 797802 797298 795696 793309 790874 787914 783230 776866 770385
59738 770385 764933 760114 755373 751413 749177 748034 746269 743425 741140 741136 743027 744723 744770 743735 743214 743963
59722 743963 745371 746613 747718 749075 750270 750166 748293 745616 743613 742952 743371 744360 745413 745926 745549 744685
59706 744685 744180 744477 745436 746849 748646 750641 752694 755129 758235 761169 762294 761289 760178 761292 764555
59691 764555 767911 770312 773013 777436 782957 787815 791527 795210 799765 804830 809616 813757 817054 819351
59677 819351 821126 823403 826421 829095 830512 831367 832983 835395 837473 838742 839901 841468 843061 844354
59663 844354 845677 847056 847586 846619 844950 843889 843480 842622 840919 839558 840008 842296 844848 845878 844876
59648 844876 842959 841768 841903 842488 842350 841376 840381 839850 839356 838286 836732 835506 835593 837730 842098 847977
59632 847977 853834 858210 860670 861710 861752 860697 858695 856793 856038 856072 855466 853714 852041 851645 851917 851260
59616 851260 849206 846645 844125 841108 837058 832252 827104 821511 815303 808754 802416 797052 793816 793430
59602 793430 794727 795038 792801 789051 785695 783246 781169 779568 779103 779643 780357 781154 782960 786446 791300
59587 791300 796762 802111 806655 810081 812801 815173 816359 814951 810843 805624 800862 796778 792906 789219
59573 789219 786182 784196 783335 783117 782476 780692 778669 778439 780855 784352 786524 786486 785156 783729 782574 781379
59557 781379 779692 777322 774553 771995 770001 768304 766410 764184 761933 760088 758919 758427 758398 758755 759735
59542 759735 761406 763120 764049 764328 765046 766807 768900 770304 771065 772184 774377 777302 779820 780841 780212
59527 780212 778871 777737 776420 773790 770025 766990 765832 765126 762613 758251 754158 751649 749780 747133
59513 747133 743774 740757 738698 737698 737982 739552 741481 742473 742189 741323 740506 739835 739604 740547 742809 745178
59497 745178 746111 745480 744906 746290 750232 755762 761327 766092 770549 775824 782239 788728 794068 798514 803710
59482 803710 810998 820389 831288 843621 857954 874939 894667 915628 933935 944698 945564 938863
59470 938863 929497 920952 913920 908094 903653 900729 898778 897238 896110 895378 894583 893563 893029 893699 895310
59455 895310 897026 898476 899670 900158 899000 895606 890226 883636 876704 870096 863916 857576 850407 842449
59441 842449 834338 826476 818666 810737 803235 797205 793362 791623 791429 792245 793526 794373 793835 791929 790061
59426 790061 789900 791834 794852 797841 800608 803744 808061 814252 822567 832557 843315 853977 863677 871354
59412 871354 876403 879569 882405 885619 888692 891281 893923 896884 899309 900461 901083 902595 905464 909292
59398 909292 913983 919688 925875 931683 937213 943413 950532 957720 964494 971719 980697 991875 1004724 1018134
59384 1018134 1030508 1040196 1046489 1049863 1050949 1049827 1046701 1042529 1038193 1033442 1027484 1020384 1013027 1005783
59370 1005783 998097 989631 981113 973654 967778 963551 961229 961294 964021 969437 977467 987758 999651 1012911
59356 1012911 1028385 1047276 1069810 1095377 1124019 1156592 1192444 1227453 1255485 1272088 1276519
59345 1276519 1270873 1258454 1243047 1228246 1216335 1208088 1204183 1206088 1214221 1224988 1230858 1224754 1205075
59332 1205075 1176382 1145164 1115150 1086643 1059396 1034545 1013299 995094 978566 963915 952731
59321 952731 945352 939900 934604 929827 926776 925164 923487 921145 918992 917907 917952 919107 921776 926103 931375
59306 931375 936534 940943 944614 948188 952774 959260 967488 976400 985116 993448 1001438 1009093 1016868 1025638
59292 1025638 1035660 1046121 1056494 1067919 1082215 1099405 1117234 1133680 1149248 1165892 1184031
59281 1184031 1201744 1217181 1230743 1244074 1257520 1269680 1279262 1286205 1290676 1292144 1290184 1285436
59269 1285436 1278806 1270137 1258663 1244651 1229679 1215232 1201767 1189236 1177621 1166572 1155233 1143112
59257 1143112 1130870 1119826 1110899 1104291 1099828 1097148 1095802 1095749 1097698 1102358 1109233 1116694 1123592 1130487
59243 1130487 1138820 1148915 1159120 1166778 1169674 1166639 1157634 1143981 1128321 1113530 1101227 1091347
59231 1091347 1083052 1075653 1068722 1061824 1054548 1046630 1037951 1028756 1019999 1013044 1008610 1006197 1004799 1003904
59217 1003904 1003436 1003090 1002517 1002270 1003900 1008602 1015966 1024418 1032787 1041032 1049519 1058206 1066923 1076001 1085795
59202 1085795 1095543 1103514 1108723 1111828 1113760 1114093 1111624 1106144 1098580 1089553 1079046 1067668 1057023
59189 1057023 1048132 1040369 1032671 1025169 1018982 1014944 1013197 1013521 1015259 1017164 1018019 1017475 1016179 1015438 1016768
59174 1016768 1020905 1026662 1031486 1033896 1034830 1035923 1037209 1037580 1037010 1036974 1038587 1041238 1043197 1042975 1040168
59159 1040168 1035672 1031132 1027605 1024804 1021982 1019140 1016715 1014570 1012272 1010067 1008499 1007086 1004520 1000413
59145 1000413 995996 992874 991742 992394 994175 996212 997907 999425 1001230 1003202 1004871 1006404 1008498 1011269
59131 1011269 1014049 1016287 1017833 1018475 1018216 1018085 1019497 1022564 1025975 1028685 1030688 1032072 1032732 1033327 1035056
59116 1035056 1037837 1040053 1040835 1041298 1042682 1044738 1047102 1050807 1056816 1064075 1070798 1077020 1084080 1092123
59102 1092123 1099961 1107255 1114890 1122949 1130127 1135717 1140606 1145541 1149740 1152217 1153382 1154192 1154429 1152943
59088 1152943 1149282 1144134 1138379 1132519 1126871 1121433 1115468 1108056 1099410 1091094 1084509 1079387 1074120 1067421
59074 1067421 1059373 1051038 1043434 1036980 1031565 1026804 1022336 1018104 1014365 1011328 1008891 1006938 1005854 1006464
59060 1006464 1009386 1014546 1021218 1028238 1034331 1038867 1042748 1048141 1056685 1067795 1079021 1088266 1095513
59047 1095513 1102291 1109601 1116703 1122107 1125564 1128592 1132746 1137623 1141153 1141952 1140950 1140392 1141444 1143212
59033 1143212 1144091 1143596 1142479 1141184 1138879 1134499 1128447 1122571 1118280 1115280 1112392 1108955 1104806 1099398
59019 1099398 1091855 1082007 1070817 1059706 1049716 1041165 1033560 1025959 1017970 1010461 1004852 1001618 999755
59006 999755 997542 993535 987225 979441 972078 966810 963988 962994 963152 963645 963185 961033 958205 956449 955975
58991 955975 955365 953828 952173 951174 950327 948937 947350 946323 946059 946537 947955 950040 951738 952375 952538 953170
58975 953170 954435 955972 957488 958577 958972 959747 963151 970154 979065 987644 995732 1004593 1014541 1024760
58961 1024760 1034885 1045251 1055930 1066970 1079254 1093602 1109156 1124055 1137628 1150396 1161984
58950 1161984 1170750 1175966 1178966 1181593 1184558 1187696 1190759 1193546 1196282 1200071 1205893 1212946 1219342 1224810
58936 1224810 1231211 1239802 1249559 1259151 1268977 1279815 1290753 1300251 1308545 1317242 1326827 1336198 1344609
58923 1344609 1352576 1360696 1368882 1377085 1385594 1394232 1402388 1410361 1419592 1430861 1443162 1455224 1467382
58910 1467382 1480883 1495916 1511621 1527925 1545931 1565995 1586619 1606120 1624662 1643550 1662861
58899 1662861 1681017 1696764 1710470 1723010 1734425 1744493 1753748 1762563 1769468 1771899 1769243 1764106
58887 1764106 1759752 1756853 1753696 1749154 1744098 1739589 1734824 1727945 1718533 1708357 1699416 1691865 1684104 1674428
58873 1674428 1662201 1647905 1632668 1617667 1603378 1589262 1574543 1559373 1544857 1531906 1520528
58862 1520528 1510477 1502128 1496254 1493018 1491473 1490018 1487351 1483255 1478754 1475356 1473884 1474088 1475470 1478263
58848 1478263 1483288 1490799 1499684 1508091 1515111 1521943 1531195 1544782 1562492 1582498 1602762 1621653 1637912
58835 1637912 1651059 1661877 1671767 1681445 1690736 1699538 1708233 1717183 1726574 1736845 1748381 1760567 1771988
58822 1771988 1781802 1790120 1796904 1801611 1804276 1805709 1805883 1803181 1796075 1784690 1769933 1752071 1731187
58809 1731187 1708216 1684460 1660646 1637337 1615433 1595235 1575910 1557029 1539728 1524871 1510974
58798 1510974 1495689 1478819 1462033 1446005 1429865 1413399 1397633 1382885 1368173 1353182 1338991
58787 1338991 1326036 1312997 1298799 1284356 1271107 1258799 1245963 1231937 1217445 1203594 1191046
58776 1191046 1179850 1169522 1159720 1151053 1144564 1140083 1135972 1131020 1125753 1121291 1117757 1114611 1111830
58763 1111830 1109956 1109425 1110465 1113051 1116334 1118757 1119498 1119275 1119060 1118677 1117519 1116035 1115342 1115583 1115770 1115315
58747 1115315 1114881 1115422 1116941 1118376 1118522 1116970 1114314 1111312 1107913 1103519 1098190 1092801 1087660 1081784 1074264
58732 1074264 1065613 1056925 1048257 1038949 1029341 1021030 1015180 1011362 1008395 1005795 1004061 1003836 1004965 1006393
58718 1006393 1007139 1007465 1008633 1011097 1013407 1013559 1011183 1007610 1003981 1000222 996029 991881 988400 985241 981374
58703 981374 976380 970940 966045 962079 958876 956354 954759 954277 954669 955433 956189 956765 957124 957491 958406 960247
58687 960247 962748 965383 968262 972153 977446 983561 989648 995517 1001573 1008166 1015275 1022536 1029299 1035039
58673 1035039 1040084 1045609 1052442 1060235 1068415 1077572 1088924 1102181 1114906 1124612 1131040 1135749 1139928
58660 1139928 1143628 1147062 1151370 1157231 1163504 1168488 1172396 1177376 1184731 1193175 1200541 1206391 1211936 1217808
58646 1217808 1222988 1226048 1226592 1225235 1222649 1218889 1213328 1205086 1193627 1179027 1161774 1142680 1122986
58633 1122986 1103844 1085396 1067073 1049205 1033343 1020232 1008454 996393 984711 975218 967718 959876
58621 959876 950317 940210 931399 924505 919310 915502 912292 908666 904870 902489 902230 902699 902298 901329 901288
58606 901288 902973 906357 911495 918344 926155 934141 942470 951720 961588 970716 977503 980664 979701 975623
58592 975623 970719 966772 963733 960526 956517 951631 945874 939650 933992 929531 925671 921557 917316 913464
58578 913464 909723 905544 901420 898540 897335 897352 898274 899931 901481 901779 900854 900061 900547 902290 904788 907951
58562 907951 912025 917110 922940 928747 933459 936643 939258 942922 948273 954465 960272 965262 969873 974713
58548 974713 979831 984417 987256 987788 986636 984991 983742 983364 984138 985920 987985 989562 990341 990302 989532 988544
58532 988544 988178 988635 989224 989636 990812 993764 998131 1002958 1008402 1015494 1024431 1034375 1044990 1056910 1070242
58517 1070242 1083627 1095530 1105931 1116088 1126913 1138120 1148996 1159575 1170746 1183196 1196612
58506 1196612 1210213 1223915 1238493 1254675 1272762 1293150 1316362 1342122 1369067 1395835 1421830
58495 1421830 1446551 1468953 1488120 1503976 1516733 1526260 1532658 1536827 1539667 1541120 1540593 1537845 1532845
58482 1532845 1525421 1515772 1504715 1492605 1478534 1461487 1441832 1420962 1399966 1379382 1359636 1340775
58470 1340775 1322228 1303653 1285528 1268349 1252048 1237091 1225160 1217448 1212894 1209310 1205619 1201755
58458 1201755 1197195 1191255 1184504 1178352 1173455 1169741 1167464 1166658 1165940 1163593 1159666 1155478 1151350 1146676
58444 1146676 1142070 1139300 1138738 1138739 1138073 1137193 1136538 1135428 1133620 1132467 1133370 1136010 1138920 1140921 1141486 1140868
58428 1140868 1140725 1143543 1150422 1159910 1169625 1178424 1186678 1195419 1205858 1218765 1233496 1248250 1262069
58415 1262069 1276044 1291834 1309355 1326532 1341077 1352148 1360559 1367593 1373370 1376427 1375408 1371057
58403 1371057 1365766 1361110 1356781 1352267 1348479 1346959 1348045 1350682 1353898 1357883 1363457 1370749 1378709 1386105
58389 1386105 1392796 1399429 1405827 1410533 1412322 1411246 1407608 1400996 1391422 1380524 1370338 1361506 1353879
58376 1353879 1348047 1344662 1342841 1341077 1339445 1339107 1339953 1340742 1341624 1344466 1350202 1357664 1365588 1374017 1383072
58361 1383072 1391937 1399942 1407472 1415027 1422432 1429468 1436205 1442223 1446588 1449016 1450098 1450161 1449063 1447242
58347 1447242 1445671 1444512 1443093 1441284 1439410 1436807 1432445 1427505 1425256 1427272 1431326 1434140 1434929 1435223
58333 1435223 1436536 1439436 1443904 1449306 1454428 1458376 1461238 1463731 1466816 1471461 1477689 1483936 1488565 1492022
58319 1492022 1496074 1501150 1506221 1511220 1517360 1524651 1531459 1537362 1544221 1553349 1563595 1573538 1583645
58306 1583645 1594815 1606358 1617022 1626918 1637198 1648903 1663014 1680229 1699630 1718854 1736586
58295 1736586 1753624 1770772 1787343 1802705 1817545 1832344 1846291 1859004 1871745 1885493 1899389
58284 1899389 1912621 1926312 1941833 1958479 1974552 1989753 2004947 2020506 2036365 2052936 2070782
58273 2070782 2090157 2111680 2136296 2163607 2191530 2218561 2245001 2271131 2296061 2319633 2343495
58262 2343495 2368542 2392958 2414680 2434378 2454054 2474000 2493153 2511430 2529716 2548223 2566667
58251 2566667 2585612 2606285 2629511 2655722 2685132 2717024 2749890 2783045 2816966 2851517 2885613
58240 2885613 2919418 2954833 2992670 3031423 3070096 3110105 3152829 3197443 3242897 3289954 3339404
58229 3339404 3390288 3441849 3495231 3551284 3608719 3666534 3726238 3789414 3854999 3921261 3988451
58218 3988451 4057224 4126531 4195745 4267070 4343159 4424048 4508821 4598280 4693149 4791504 4891079
58207 4891079 4992722 5098819 5209811 5325081 5445741 5573630 5708706 5849948 5997403
58198 5997403 6150969 6308832 6469765 6635409 6807923 6987301 7173394 7368329 7574140
58189 7574140 7790312 8016628 8256233 8512841 8787140 9078988 9390781 9725573 10084392
58180 10084392 10468667 10882568 11329651 11810169 12325344 12881102 13483644 14134538 14834376
58171 14834376 15587866 16400462 17272982 18204226 19195944 20250572 21367402 22545934 23790033
58162 23790033 25104639 26492876 27961366 29523476 31191475 32970250 34864501 36885937
58154 36885937 39046293 41349932 43802501 46421718 49231046 52248872 55493545 58992832
58146 58992832 62777992 66875410 71316373 76150511 81441306 87260392 93702370 100896896
58138 100896896 108990364 118125111 128453066 140157427 153440644 168501718 185536611
58131 185536611 204726986 226200012 250042606 276366892 305146385 335582318 365372856
58124 365372856 390760676 407764929 413867127 408913939 394731929 374036474 349500634
58117 349500634 323318721 297097673 271877506 248229020 226395187 206412405 188194880
58110 188194880 171607394 156519053 142812448 130369524 119076561 108841981 99592588
58103 99592588 91253718 83745944 76997059 70942446 65514764 60645489 56275604 52354177
58095 52354177 48827690 45640463 42744299 40099128 37666688 35413584 33320115 31377662
58087 31377662 29577401 27907832 26360787 24930844 23608457 22380465 21237448 20174774
58079 20174774 19186856 18266088 17407027 16606209 15858058 15155612 14494576 13872378 13284329
58070 13284329 12725240 12193771 11690978 11215639 10764868 10337650 9933550 9549503 9182136
58061 9182136 8831734 8499809 8184459 7882324 7593276 7318767 7057275 6806060 6565827
58052 6565827 6338943 6124476 5919772 5725532 5544204 5374165 5210458 5050798 4896217
58043 4896217 4746312 4598774 4453638 4313501 4179252 4049565 3924662 3806579 3695408
58034 3695408 3588916 3486106 3387726 3293285 3201055 3111125 3025209 2943490 2864837 2789819 2720052
58023 2720052 2654695 2590902 2527634 2465744 2404704 2342938 2281283 2222372 2166304 2110462 2053866
58012 2053866 1998224 1944383 1891365 1839538 1791331 1747959 1708423 1672253 1639990 1610363 1580466
58001 1580466 1549960 1522073 1499081 1479267 1459468 1438285 1415834 1392662 1369978 1348960 1329057
57990 1329057 1308803 1288575 1270231 1253730 1236746 1218268 1200041 1183592 1168204 1152808 1137696
57979 1137696 1123372 1109730 1097185 1086698 1077849 1068727 1058424 1047864 1037678 1027198 1016107 1005082
57967 1005082 994171 982424 969670 956833 944096 930802 917609 906568 898451 892077 886794 883272
57955 883272 881059 877709 871553 863463 854963 846517 838601 832494 828737 826280 823991 821569 818508 814032
57941 814032 808666 803920 799806 794788 788922 784606 783111 782658 781392 780115 780431 782053 783733 785295 787035
57926 787035 788377 788697 788259 786942 783437 777323 770745 766284 763945 761749 758533 754683 750694 746565 742559
57911 742559 739508 738248 739024 741141 743102 743662 742756 740753 737391 732875 729530 730120 734212 738429 740801
57896 740801 742652 745391 747940 748745 748133 746930 744687 741242 738370 737732 738338 737997 736403 734955 734408 734594
57880 734594 735863 739002 744050 750483 758131 766753 775340 783081 790395 797873 804900 810482 814616 817655
57866 817655 819226 819172 818628 818569 818027 815433 811147 806949 803466 799945 796288 793413 791371 788820 784935 780570
57850 780570 777007 774477 772379 770308 768372 766840 765730 764646 763249 761866 760994 760029 757453 752952 748389
57835 748389 745712 744688 743724 742159 740449 738711 736653 734887 734838 737000 740113 742408 743170 743065 743326 744573
57819 744573 746203 747226 747763 748890 750808 752273 752533 752623 753759 755560 757113 758627 760429 761268 759626
57804 759626 756327 753938 753634 754439 755574 757620 760895 764373 766953 768583 769499 769564 769059 769053 770207 771925
57788 771925 773299 774165 774726 774883 774563 774112 773735 773123 772155 771434 771500 771866 771441 769698 767082 764531 762845
57771 762845 762160 761684 760342 758063 756050 755352 755660 756180 757335 760509 765847 771258 774437 775495 776754
57756 776754 779893 784091 787248 788350 787971 786912 785297 783093 780727 778756 777303 776197 775360 774870 774733
57741 774733 774760 774577 773822 772594 771617 771656 772873 775051 778184 782267 786668 790500 793714 797095 801002 804755
57725 804755 807504 809168 810355 811875 814384 817841 821187 823272 824319 825840 829007 833677 838917 843526
57711 843526 846166 846293 845274 845337 846921 848276 848285 848191 849561 851723 852613 851355 848730 845580 841992 837978
57695 837978 834103 831452 831255 834105 839208 845097 851354 858715 867070 874717 880478 885405 891289 898503
57681 898503 906501 915296 924868 933787 940073 943166 943940 943331 942221 942048 943898 947208 950650 954006 957856
57666 957856 961786 964476 965495 965562 965024 963474 961041 958785 957535 957271 957745 958695 959397 959088 958022 957381
57650 957381 958044 960025 962732 965040 965710 964864 964552 966605 970246 973061 973807 972924 971023 968838 968257 971131
57634 971131 976779 982609 987472 992417 997894 1002569 1005818 1009248 1014373 1020398 1025695 1030105 1034542 1039519
57620 1039519 1045473 1053426 1063901 1075871 1087997 1100377 1114219 1130592 1150500 1175247 1205453 1240243
57608 1240243 1278424 1319780 1363857 1407781 1446396 1474574 1489053 1489093 1476756 1456249 1431727 1405494
57596 1405494 1378693 1352844 1329367 1307945 1286964 1265944 1246541 1230788 1219158 1210650 1203981 1198229
57584 1198229 1192991 1188601 1186010 1185941 1188066 1191153 1194044 1196438 1198739 1201278 1203926 1206584 1209679 1213610
57570 1213610 1217771 1220872 1222531 1224009 1226933 1231677 1237305 1242731 1247451 1251426 1254809 1257758 1260194 1261745
57556 1261745 1262174 1261825 1261546 1262188 1264084 1266777 1269269 1270920 1272197 1274203 1277458 1281568 1286104 1291217 1297148
57541 1297148 1303632 1310143 1316397 1322344 1327948 1333119 1337608 1341042 1343560 1346404 1351003 1357135 1362690 1365866
57527 1365866 1367175 1368773 1372192 1377229 1382752 1387883 1392388 1396432 1400321 1404494 1409594 1416068 1423416 1430307
57513 1430307 1436102 1442003 1449764 1459337 1468831 1476940 1484262 1491750 1499053 1505286 1510536 1515542 1520489 1525262
57499 1525262 1530590 1537715 1546763 1556273 1564656 1571685 1578380 1585842 1594365 1603458 1612497 1621229 1629590 1637271
57485 1637271 1644045 1650600 1658445 1668604 1680770 1693987 1707624 1721270 1734242 1745907 1756279 1765783
57473 1765783 1774647 1783047 1791650 1801319 1812130 1823148 1833439 1843125 1853163 1864006 1874664 1883451
57461 1883451 1889746 1894561 1899089 1903352 1907046 1911091 1916978 1924427 1930980 1934484 1935073 1934301 1933319 1932583 1932422
57446 1932422 1932920 1933661 1934347 1935341 1937155 1939883 1943608 1948811 1955845 1964496 1974460 1985561 1997127 2008162
57432 2008162 2018789 2030452 2043773 2057249 2069369 2081084 2094560 2109952 2125160 2138740 2151454
57421 2151454 2164699 2178808 2193341 2207884 2221963 2235030 2247139 2259010 2271091 2283133 2295016
57410 2295016 2307337 2320795 2335432 2350726 2365926 2380136 2392732 2404117 2415635 2428385 2442378
57399 2442378 2456993 2471785 2486510 2500795 2514307 2527223 2540218 2553792 2567636 2580778 2592596
57388 2592596 2603675 2615306 2628073 2641446 2654938 2668869 2683429 2697746 2710930 2723556 2736971
57377 2736971 2751295 2765326 2778457 2791419 2804738 2817755 2829950 2842363 2856578 2872722 2889340
57366 2889340 2905149 2920198 2935315 2950991 2966999 2982742 2997825 3012494 3027582 3043873 3061371
57355 3061371 3079224 3096396 3112468 3127837 3143253 3159331 3176441 3194684 3213510 3231551 3247483
57344 3247483 3261359 3274646 3288750 3303892 3319641 3335776 3352026 3367601 3382022 3396174 3411559
57333 3411559 3428408 3445418 3461621 3477695 3494978 3513705 3532770 3550982 3568156 3585130 3603043
57322 3603043 3622450 3642808 3662793 3681375 3698739 3716091 3734506 3753963 3773583 3792694 3811371
57311 3811371 3829832 3847735 3864532 3880268 3895461 3910402 3925303 3941079 3959019 3979337 4000790
57300 4000790 4022016 4042534 4062203 4080792 4098720 4117195 4136747 4156423 4175352 4194259 4214299
57289 4214299 4235088 4255301 4274755 4294470 4314823 4335035 4354569 4373789 4393060 4412332 4431784
57278 4431784 4451853 4472316 4492328 4511662 4531067 4551164 4571797 4592695 4613925 4635370 4656500
57267 4656500 4676933 4696651 4715680 4734310 4753533 4774216 4795750 4816562 4836168 4855568 4875432
57256 4875432 4895164 4914284 4933405 4953053 4972592 4991319 5009722 5028650 5047829 5066178 5083217
57245 5083217 5099312 5114845 5129832 5144190 5157967 5171557 5185895 5201827 5218976 5236018 5252443
57234 5252443 5269086 5286264 5302487 5316237 5328243 5340621 5354056 5367204 5378867 5389586 5400874
57223 5400874 5413785 5428363 5443576 5457612 5469206 5479171 5489884 5502741 5516665 5529654 5541195
57212 5541195 5552333 5563601 5573949 5582087 5588230 5593815 5599783 5605845 5611532 5617229 5623702 5631058 5638742
57199 5638742 5646340 5653843 5661242 5668442 5675611 5683114 5691020 5698999 5706706 5714019 5721101 5728474 5736662 5745202
57185 5745202 5752519 5757616 5761526 5766050 5771248 5775386 5777450 5778420 5779725 5781573 5783373 5784844 5786115 5787593
57171 5787593 5790240 5795168 5802467 5811200 5820925 5832259 5845555 5860240 5876168 5894511 5916243 5940683
57159 5940683 5966449 5992945 6019867 6046194 6070936 6094266 6116800 6138463 6159219 6180077 6201789
57148 6201789 6223089 6241818 6257615 6272015 6286066 6299300 6310937 6320582 6327775 6332586 6337002 6344055
57136 6344055 6354841 6367656 6380593 6393515 6406558 6418162 6426270 6430964 6434389 6437892 6440205 6438839
57124 6438839 6432805 6423646 6413877 6404558 6394489 6381763 6365840 6347793 6328823 6309042 6287655 6263770
57112 6263770 6236901 6207158 6174922 6139975 6100970 6056351 6005910 5950915 5892593 5830924 5765115
57101 5765115 5694833 5620713 5543839 5464786 5383043 5297587 5208228 5116011 5021806 4925029 4824658
57090 4824658 4721297 4617172 4513987 4411703 4309724 4208341 4108498 4010853 3915824 3824251
57080 3824251 3737510 3657073 3584079 3519033 3461638 3411128 3366863 3328329 3294393 3262752 3230088
57069 3230088 3192471 3145677 3085625 3008896 2912953 2796017 2656675 2493100 2302433 2081550
57059 2081550 1828896 1544925 1230102 883162 502075 85813 -366224 -856089 -1387384 -1964468
57049 -1964468 -2593657 -3285345 -4053016 -4909444 -5864881 -6928578 -8109745 -9415919 -10851546
57040 -10851546 -12418468 -14116222 -15941531 -17889843 -19959055 -22151200 -24470084 -26917784
57032 -26917784 -29491432 -32179398 -34961632 -37822860 -40775634 -43874807 -47209950 -50881481
57024 -50881481 -54970566 -59501075 -64396438 -69459590 -74406889 -78942605 -82817223 -85829497
57016 -85829497 -87793102 -88521210 -87855450 -85721005 -82174275 -77421336 -71799103 -65720744
57008 -65720744 -59599691 -53777191 -48475623 -43786299 -39687770 -36083389 -32843516 -29840163
57000 -29840163 -26970012 -24167929 -21411721 -18716214 -16118387 -13660948 -11380638 -9301745
56992 -9301745 -7433125 -5769106 -4294384 -2989987 -1837213 -819545 76226 860257 1541893
56983 1541893 2132134 2643793 3089813 3481994 3830836 4145547 4433960 4702897 4958494
56974 4958494 5205724 5447753 5686205 5921242 6149624 6362012 6543739 6680847 6767380 6807966
56964 6807966 6814133 6798121 6769023 6732466 6691780 6648428 6601698 6549090 6487985 6417522 6339234
56953 6339234 6256195 6171519 6087259 6004351 5923452 5845681 5772257 5703388 5637968 5574691 5513151
56942 5513151 5453461 5394963 5335719 5273172 5204954 5129371 5045853 4955179 4858917 4758568 4655672
56931 4655672 4552686 4452865 4358578 4270008 4185986 4105917 4030276 3959259 3891574 3824849 3756797
56920 3756797 3685544 3609120 3525402 3432965 3331575 3221380 3101829 2972112 2832823 2686645
56910 2686645 2537056 2386790 2237809 2092154 1952050 1819436 1695959 1583128 1481711
56901 1481711 1391187 1310628 1239990 1179586 1128284 1083386 1042650 1005386 971042 937892 904178
56890 904178 869911 836502 804918 775094 746879 720694 697258 677281 661146 648260 636998
56879 636998 626216 616771 610764 609200 611059 614703 619517 626079 635332 647554 661312 673210 679429
56866 679429 677905 668724 652745 630988 605683 580485 558263 538883 520058 500365 480731 462982
56854 462982 447685 433847 420393 407507 396368 387697 380816 374269 367190 359794 352724 346393 341067
56841 341067 337032 334273 332239 330242 328122 326383 325867 327325 331056 336725 343662 351512 360579 371535
56827 371535 384933 400884 418793 437247 454454 469103 480756 489451 495279 498547 500105 501183
56815 501183 502833 505526 509146 513353 518050 523438 529635 536678 545313 557306 573980 594401 616065
56802 616065 637856 661532 689459 721297 753519 781878 803627 817687 823728 821781 812637 798427
56790 798427 782547 768317 757169 748238 740126 732937 728308 727839 732135 741101 754372 771353 791612
56777 791612 815561 844137 877456 914216 952623 991181 1027830 1058759 1079202 1085886 1078640 1059823
56765 1059823 1032838 1001255 968386 936633 906971 879482 854534 833204 816512 804604 797009
56754 797009 793457 794066 798834 807467 819901 836553 857529 881504 905685 927021 943276 952941 954549
56741 954549 946790 929678 905378 877422 848842 821005 794034 767942 743130 720133 699399 681456
56729 681456 667011 656574 649912 645995 643669 642523 643182 646680 653486 662870 672818 680392 682666 678144
56715 678144 667564 652944 635706 616093 594415 572022 550395 529712 509070 488028 467371
56704 467371 448424 432131 418755 407869 398480 389591 380892 372750 365575 359336 353622 347928 342103
56691 342103 336770 332983 331079 330155 329149 328020 327232 326537 325242 323430 321828 320447 318509 315844 313158
56676 313158 310582 307232 302882 298880 296392 294697 292375 289492 287361 286514 286127 285251 283513 280754 277192
56661 277192 274066 272924 273858 275357 276313 277227 278846 280536 281048 280427 279991 280388 280809 280514 280279 281458 283962
56644 283962 286140 286805 286642 287204 289078 291561 293703 294923 294869 293594 292075 291713 292810 294035 293923 292657
56628 292657 291909 293039 295797 298688 300276 300144 298887 297395 296207 295512 295437 296049 297172 298526 299930 301093
56612 301093 301504 301107 300887 301958 303989 305393 305332 304765 305098 306551 308422 310334 312495 315015 317544 319408
56596 319408 319807 318273 315267 311896 308634 304860 300052 294790 289857 284937 279068 272109 264895 258121
56582 258121 251890 246341 241952 238980 237054 235434 233518 231287 229536 229395 231179 233983 236721 239168
56568 239168 241497 243518 245191 247305 250393 253178 253510 251228 248926 249202 251922 254922 256730 257654 258436
56553 258436 258925 258603 257806 257592 258302 258947 258530 257583 257570 258863 260228 260555 260150 259809 259514 259030 259151 261200
56535 261200 265294 269876 273060 274011 273238 272113 271957 273058 274667 276256 278262 281129 284283 286942 289445
56520 289445 292580 295870 297769 297755 297207 297776 299574 301381 302212 302416 303349 305894 309264 311732 312818 314005
56504 314005 316800 321037 325973 331997 339800 348608 356977 364918 373372 381756 388036 391396 392961 393626
56490 393626 393209 392337 392926 395519 397922 397881 395721 392995 389980 386237 382477 379954 378643 377631 376820 376622
56474 376622 376420 375093 372985 371786 372232 373261 373644 373271 372531 371572 370556 369737 368893 367511 365860 365033
56458 365033 365457 366018 365211 362661 359120 355485 352363 350193 349074 348498 347636 345984 343558 340649 337755
56443 337755 335713 335378 336830 339053 340806 341818 342786 344115 345163 345088 344052 343011 342570 342630 342971 343419
56427 343419 343457 342575 341250 340811 341964 344123 346455 348799 351012 352248 351757 350060 348640 348651 350282 352833
56411 352833 354829 354669 352162 349260 348429 350231 353147 355643 357611 359643 361705 363103 363459 363247 363353
56396 363353 364335 366223 368897 372282 375919 378676 379528 378784 378007 378439 379866 381130 381237 379767 376915 373651
56380 373651 371352 370705 371230 372100 372934 373509 373500 373200 373773 375858 378341 379523 379276 379006 379550 380175 379907 378964
56362 378964 378384 378813 380146 382022 384221 386656 389174 391445 393184 394586 396286 398531 400573 401312 400588
56347 400588 399457 399186 400199 401857 402870 402038 399191 395620 393254 393095 394463 395778 395905 394797 393261
56332 393261 392399 393084 395537 399192 403112 406804 410592 414956 419569 423429 426170 428742 432404 437383 443023
56317 443023 448820 454627 460000 464181 466784 468053 468568 469194 470878 473622 475987 476568 475697 474554 473079
56302 473079 470485 467659 466908 468715 470760 471181 470917 471547 472571 472659 472253 472922 475011 477789 481243 485742
56286 485742 490294 493119 493982 494374 495393 496958 499089 502275 506206 509589 511704 513143 514729 516692 519067
56271 519067 521857 524587 526644 528261 530261 532868 535792 539416 544576 550946 556976 561775 565837 569446
56257 569446 571725 572122 571715 572031 573280 574723 576291 578823 582768 587364 591333 594116 596393 599361 603464
56242 603464 608008 612210 616306 621119 626867 632974 638818 644034 648416 652394 657398 664697 673838 683153
56228 683153 691823 700410 709263 717654 725156 733003 743302 757173 773993 792057 809689 826119 841695
56215 841695 857322 873884 892226 912987 935795 959207 982351 1006186 1032121 1059866 1087996
56204 1087996 1116407 1146693 1180004 1215974 1254207 1295443 1340671 1390163 1443898 1501988 1564244
56193 1564244 1630381 1701211 1778651 1863909 1956441 2055170 2159862 2270663 2387111 2508298
56183 2508298 2633387 2761374 2890775 3019920 3147010 3269620 3384793 3489884 3582637 3660341
56173 3660341 3719917 3759341 3778264 3776988 3755835 3715955 3659826 3590277 3509666 3420263 3324430
56162 3324430 3223708 3118503 3009317 2897736 2785812 2675212 2567382 2463656 2364624 2270028
56152 2270028 2179754 2094268 2013773 1937937 1866904 1801540 1741919 1686455 1633421 1582675 1535169
56141 1535169 1491421 1451303 1414787 1381947 1352372 1325207 1299738 1275788 1253802 1234494 1217919
56130 1217919 1203013 1188838 1176132 1166467 1159755 1153823 1146864 1139133 1131815 1125535 1120662 1117825 1117121
56117 1117121 1117638 1118542 1120001 1122573 1126572 1132423 1140393 1149262 1156453 1160527 1162856 1166187 1172397 1182082
56103 1182082 1194970 1209718 1224267 1237525 1250246 1263838 1279288 1297584 1319578 1344461 1369755
56092 1369755 1394013 1418446 1444964 1474034 1505764 1541551 1582743 1628562 1677258 1728995 1786092
56081 1786092 1850661 1923195 2003039 2088910 2178933 2271000 2362995 2452365 2536207 2612463 2680532
56070 2680532 2740581 2793434 2841450 2887638 2932650 2973803 3008037 3034463 3053189 3063763 3066650
56059 3066650 3064603 3060176 3052494 3038107 3014151 2979147 2932130 2873416 2805804 2733131 2658017 2582402
56047 2582402 2509253 2441708 2380929 2326533 2278555 2237367 2202321 2172167 2146236 2123715 2102885
56036 2102885 2083130 2066819 2056867 2052883 2051851 2052079 2054210 2058732 2064961 2072519 2081628 2091810 2102241
56023 2102241 2113512 2127165 2143444 2161178 2179784 2199459 2219452 2238217 2255638 2273515 2293572
56012 2293572 2316256 2341335 2368162 2395672 2423710 2454031 2488287 2525362 2562540 2598959 2635943
56001 2635943 2674191 2712768 2750959 2789197 2827940 2867287 2907776 2950122 2994302 3040240 3088817
55990 3088817 3140643 3194529 3248966 3304281 3361394 3419317 3476296 3532745 3590608 3650313 3710829
55979 3710829 3772231 3835696 3901422 3969033 4039467 4113848 4191084 4269421 4349824 4434932 4525232
55968 4525232 4619405 4717953 4822987 4934537 5050369 5169394 5292197 5418590 5548295 5683793
55958 5683793 5828584 5982502 6142400 6307452 6479832 6660257 6847408 7042350 7248988
55949 7248988 7469101 7701149 7945022 8203750 8479377 8771450 9081148 9412853 9769999
55940 9769999 10153017 10562699 11001957 11473225 11978064 12520442 13106465 13739783 14421184
55931 14421184 15153235 15940745 16785848 17687476 18646511 19666324 20747512 21887936 23089278
55922 23089278 24357949 25698827 27114973 28615072 30213788 31922184 33744589 35687141
55914 35687141 37761893 39980043 42349593 44883726 47604016 50531994 53685856 57089416
55906 57089416 60775965 64780063 69136226 73891945 79114224 84880921 91278647 98415722
55898 98415722 106425620 115452081 125644931 137178635 150263039 165131980 182035665
55891 182035665 201234576 222948990 247269137 274085592 302993076 333004916 362127046
55884 362127046 387262138 404915796 412501770 409371754 396854006 377426586 353738488
55877 353738488 328017377 301893962 276437016 252268934 229713547 208920206 189928664
55870 189928664 172700635 157150304 143165018 130607084 119320427 109156257 99993149
55863 99993149 91731619 84281386 77562170 71507898 66060126 61160356 56752770 52787757
55855 52787757 49216550 45986839 43048766 40361735 37892346 35610991 33494979 31530926
55847 31530926 29709691 28021300 26456488 25008303 23668600 22426460 21272870 20203279
55839 20203279 19212840 18292973 17435668 16637528 15896197 15205663 14558142 13948119 13372020
55830 13372020 12826587 12310289 11823891 11366944 10935453 10524833 10132961 9758601 9399460
55821 9399460 9054088 8723512 8408741 8108369 7820318 7543993 7278940 7023190 6774585
55812 6774585 6532308 6296065 6065589 5841921 5627058 5421443 5223973 5035024 4856432
55803 4856432 4687431 4523840 4363035 4206821 4057634 3914986 3777788 3647146 3524139
55794 3524139 3407430 3295799 3190636 3092806 2999125 2905308 2811117 2719666 2632745 2549798 2470591
55783 2470591 2395902 2325726 2259024 2194916 2132362 2069466 2005219 1941365 1880489 1822810 1766659
55772 1766659 1711506 1658421 1607987 1559861 1514315 1472344 1434132 1398867 1365963 1335206 1305921
55761 1305921 1277373 1249821 1223979 1199668 1176134 1153223 1131001 1108743 1085733 1062702 1041002
55750 1041002 1020636 1000648 981296 964117 949595 936302 922951 910174 899617 891985 886547 882055
55738 882055 877705 873516 870115 868079 867364 867284 866860 865386 863159 861645 862198 864446 866690 868026 869019 869822
55722 869822 868850 864354 856570 847215 837298 826446 814268 801523 789764 780133 772570 766242 760877
55709 760877 757186 755214 752781 746979 737265 725631 713532 700497 686314 672574 660712 650186
55697 650186 640097 631161 624285 618274 610954 601855 591917 581107 568336 553620 538621 524958 513390
55684 513390 504476 498323 493513 487890 480930 474173 469053 465467 462755 460644 458583 455330 450140 443690
55670 443690 437123 430703 424042 417069 410037 402963 395859 389426 384737 381954 379886 377176 373734 370513
55656 370513 367948 365250 361629 357868 356084 357886 363062 369940 376756 382704 388004 392792 395977 395896 392513
55641 392513 387989 384163 380385 375138 368775 362719 356624 348856 339763 331807 325949 320548 314761 310253
55627 310253 307933 305670 301514 297098 295218 295631 295935 295374 294947 294682 293809 293212 294685 297683 299586 299539
55611 299539 299383 300186 300511 299125 297035 295404 293434 289967 285775 282575 280727 279400 278345 278186 279316
55596 279316 281475 284151 286693 288394 289219 290139 292178 295395 299155 302950 306460 309226 310855 311402 311169
55581 311169 310321 308965 307416 306091 305174 304417 303115 300413 295992 290432 284664 279173 274037 269423 265502
55566 265502 262093 258906 255907 252989 249732 246265 243885 243720 244919 245265 243524 240083 235357 229028 221309
55551 221309 213660 207460 202813 199250 196723 195122 193578 191174 188078 185327 183734 183432 184138 185390 186752
55536 186752 188123 189665 191204 192099 192003 191410 191160 191618 192543 193466 194047 194362 194902 195942 196900 196847 195806 194980
55518 194980 195456 197191 199584 202591 206748 212266 218465 224154 228565 232020 235568 239789 244092 247473
55504 247473 249658 251024 251617 250949 248696 245026 240242 234662 228820 223200 217840 212630 207846 203677 199549
55489 199549 194791 189886 186054 183599 181659 179623 177604 175271 171576 166388 161461 158909 159243 161394
55475 161394 163932 165685 165874 164532 162562 160870 159733 159180 159330 159862 159711 157912 154472 150112 145612
55460 145612 141693 138865 136867 134718 131842 128778 126425 125050 124360 124002 123598 122920 122566 123866 127447
55445 127447 132162 135945 137491 136863 135109 133730 133908 135498 137093 137611 137507 137951 139174 140186 139904 138172
55429 138172 135936 134676 135268 137044 138392 138480 137892 137379 136829 135924 134942 134154 133131 131537 130098 129884 130890
55412 130890 132089 132648 132471 131897 131441 131552 131997 131874 130808 129663 129497 130285 131366 132519 133688 134180 133298
55395 133298 131603 130455 130322 130396 129822 128506 126712 124763 123247 122851 123765 125622 127825 129486 129551 127818
55379 127818 125513 124009 123199 122092 120739 120351 121407 122836 123428 123144 122639 122234 121773 121028 120069 119641 120963
55362 120963 124387 128457 131268 132773 134720 138193 142280 145344 146531 145747 143356 140441 138283 136989
55348 136989 135674 134462 134960 137726 140582 140915 138900 136910 136256 136154 135781 135579 135948 135976 134448 131552
55332 131552 128841 127698 128235 129492 130418 130761 131155 132280 133907 134886 134146 131720 128877 127290 127725 129330
55316 129330 130472 130435 129878 129375 128270 125774 122759 121219 121872 123335 124100 124464 125872 128902 132555 135219
55300 135219 135856 134509 132108 129568 126823 123053 118195 113746 111548 112146 114828 118651 122580 125232 125863
55285 125863 125629 126530 128785 130514 130469 129727 129666 129560 127736 124447 121837 121121 121333 121179 120740 120727 121114 121288
55267 121288 120946 120213 119381 118959 119462 120691 121749 122185 122546 123291 123909 123899 124045 125666 128756 131791 133405
55250 133405 133562 132999 132264 131537 130817 129996 129090 128639 129524 132045 135273 137561 137900 136940 136561 138005 140251
55233 140251 140704 137946 133463 130201 129712 131239 133222 134794 135861 136638 137476 138585 139583 139718 138762 137319
55217 137319 136045 134991 133982 133179 132891 133119 133646 134369 135230 135980 136364 136436 136471 136599 136738 136766 136559 136012 135292
55198 135292 135003 135759 137484 139393 140805 141747 142557 143141 143025 142187 141349 141152 141385 141456 141379 141617 141926 141125
55180 141125 138431 134564 131090 129010 128441 129240 131177 133515 135187 135775 135913 136460 137517 138461 138768 138443
55164 138443 137824 137235 136970 137253 137918 138185 137180 134938 132545 130975 130023 128877 127464 126526 126412 126667 127039
55147 127039 127986 129639 131016 130999 129656 127919 126480 125724 126270 128473 131528 134007 135358 136049 136295 135722
55131 135722 134576 134163 135303 136987 137496 136648 136049 137019 138873 139739 138804 137206 136606 137343 138480 139352 140274
55114 140274 141542 142485 142121 140335 137912 135687 134208 133938 135069 137134 139257 140842 141775 142102 141930 141516
55098 141516 141196 141280 142107 143725 145327 145703 144750 143844 144007 144419 143717 142095 140901 140601 140619 140988 142561 145329
55080 145329 147978 149626 150757 151923 152637 152237 150861 148880 146325 143591 141812 141556 141825 141250 139772
55065 139772 138361 137680 137884 139184 141432 143384 143600 142271 141211 141648 142722 142688 141153 139543 139447 141064
55049 141064 143452 145903 148499 151401 154245 156619 158693 160869 163099 164997 166252 166506 165403 163461
55035 163461 162265 162592 162858 160975 157674 156213 158326 162095 164669 165658 166615 168279 169789 170059 168673
55020 168673 165727 161914 158651 157184 157441 158268 158767 159000 159561 160800 162332 163285 163432 163959 166241 169766
55004 169766 172418 173166 173162 173443 173049 170726 167308 164726 163352 162138 160974 161019 162493 163755 163178 160916
54988 160916 158357 156634 155958 155717 154971 153470 152309 152923 155329 157947 159174 158522 156317 153182 150013
54973 150013 147751 146696 146338 146001 145500 145262 145971 147705 149228 148924 147016 145971 147599 150534 152009 151598
54957 151598 151474 153056 155358 157066 158391 159859 160701 159898 158127 157392 158846 161645 163831 163967 162239
54942 162239 160342 159978 161191 162544 162992 162934 163166 163628 163807 163763 164003 164554 164815 164314 163279 162543 163008 164951
54924 164951 167563 169362 169353 167808 165924 164782 164531 164449 163950 163606 164698 167500 170685 173011 174838 176978
54908 176978 178791 178879 177365 175814 174851 173650 172162 171988 174012 176667 177885 177710 177656 178256 178533 177554 175413
54891 175413 172997 171493 171605 172502 172250 170301 168872 170565 174978 179085 180810 180876 181007 181680 182263 182406
54875 182406 182465 182831 183317 183162 181628 178825 175889 174026 173494 173831 174823 176724 179658 183396 187763 192817
54859 192817 198652 205301 212638 219980 226107 230334 233441 236998 241828 247625 253796 259891 265146 268348
54845 268348 268423 265032 258894 251971 246694 243875 241601 237387 231447 226443 223774 221686 218024 213474 210613
54830 210613 210463 211538 212048 211653 210925 210409 210655 212185 214762 217338 219253 220885 222657 224044 224358 224039
54814 224039 224191 225025 225808 226544 228666 233419 240209 247328 253906 260268 266491 271553 274256 274474 273047
54799 273047 270757 267764 263860 258896 252984 246504 240066 234385 230104 227499 226086 224536 221285 215598
54785 215598 208196 200951 195815 193706 194024 195198 195818 195217 193142 189512 184921 180849 178578 177944 177745
54770 177745 177266 176689 176174 175457 174553 173975 173866 173623 172797 171746 170932 170188 169176 168058 167287 167272 168600 171853
54752 171853 176552 180880 183135 183053 181330 178645 175944 174816 176289 179523 182720 185113 187029 188335 188219
54737 188219 186731 185389 185714 187779 190460 192489 193135 192513 191476 190776 190348 189923 190017 191332 193328 194583
54721 194583 194803 195327 197135 199506 201270 202462 203851 205605 207386 209262 211598 214288 216831 219002 220931
54706 220931 222882 225492 229700 235565 241516 245792 248615 252042 257623 265044 273140 281172 288527 293990
54692 293990 296276 295219 291868 287506 282919 278540 274650 271142 267303 262225 255663 248508 242327 238306
54678 238306 236497 235956 235503 234284 231861 228170 223625 219029 215017 211559 208277 205384 204004 205181 208658
54663 208658 212938 216591 219241 221317 223323 225586 228332 231717 235983 241744 249513 258387 265708 269065
54649 269065 268781 267646 267894 268956 268566 265475 260583 255713 251878 248714 245175 240628 235415 230348 225790
54634 225790 221538 217621 214681 213096 212137 210632 208396 206273 204633 202601 199376 195867 194104 194878 196674
54619 196674 197276 195958 193652 191493 189966 189275 189547 190406 191014 190917 190364 189522 188100 186198 184783 184514 184653
54602 184653 184040 182869 182556 183924 186301 188402 189381 189137 188327 188061 188764 189493 189202 188434 188528 189210 188545 185813
54584 185813 182965 182293 183736 185508 186473 186803 186936 187013 186986 186457 184961 183224 183362 186657 191588 195375 197098
54567 197098 197986 198882 199041 197715 195491 193494 192202 191562 191383 191117 190151 188829 188411 189348 190310 189654 187435
54550 187435 185243 184395 184912 186114 187520 189038 190635 192111 193270 194349 196070 198882 202196 204713 205583
54535 205583 204974 203640 202385 201759 201645 201221 200085 199308 200373 202950 204914 205075 204630 205079 205819 205129 202739
54518 202739 199973 197567 194942 191803 189161 188166 188785 190122 191454 192464 192927 192773 192249 191795 191799 192363 193039
54501 193039 192926 191659 190316 190702 193501 197679 201890 205786 209545 212835 215003 215961 216206 216089 215595 214752
54485 214752 213728 212558 211269 210268 210033 210369 210459 209966 209682 210749 213396 216695 219442 221075 221854 222375
54469 222375 222838 222753 221582 219852 219207 220808 223712 225462 224495 221566 218580 216668 215940 216615 219290 223869
54453 223869 228930 232667 234248 234123 233350 232771 232393 231318 228681 224940 221799 220497 220671 221305 222150 223411
54437 223411 224525 224393 222815 220725 218941 217652 217278 218581 221242 223363 223434 222287 222039 223409 225142
54422 225142 226088 226788 228517 231458 234458 236424 237451 238480 240025 241457 241645 240286 238320 236987 236803
54407 236803 237610 239152 241044 242464 242569 241275 239198 236817 234262 231977 230898 231578 233485 235611 237607
54392 237607 239997 243283 246998 249663 249859 247662 244938 243747 244298 244982 244532 243473 242918 242667 241513 239219
54376 239219 237066 236093 235705 234596 232471 230134 228244 226773 225613 224924 224686 224525 224360 224859 226802 230121
54360 230121 233718 236104 236332 234820 233413 233910 236096 237821 237697 237009 237975 240596 242663 242927 242721 243800
54344 243800 245813 246917 246146 244179 242331 241680 242792 245301 247955 249861 251467 253624 256024 257548 257871
54329 257871 257703 257505 257087 256617 256884 258158 259612 260261 259828 258409 256145 253622 251817 251018 250358 248992
54313 248992 247318 246552 247450 249748 252429 254208 254262 252962 251607 251191 251739 252871 254333 255746 256599 256936
54297 256936 257396 258242 259069 259892 261508 264013 265927 265943 264976 265242 267633 271092 274377 277145 279171 279624
54281 279624 277754 273939 269744 267002 266486 267051 266487 263858 260657 259015 259156 259480 258760 257161 255280 253414
54265 253414 251890 250967 250061 248059 244833 241616 239471 238154 236899 235579 234647 234526 235534 237806 240896
54250 240896 244007 246974 250325 253930 256328 256210 254034 251462 249482 247834 246086 244447 243284 242336 240778
54235 240778 238075 234754 232186 231300 231538 231445 230375 229060 228317 227837 226824 225473 225119 226841 230314 234165
54219 234165 237329 239894 242562 245352 247240 247384 246385 245715 246003 246548 246455 245503 243760 241308 238794 237500
54203 237500 238112 239825 241177 241537 241404 241624 242717 244596 246507 247535 247551 247334 247501 247792 247823 247983 248903
54186 248903 250402 251632 252120 252117 251964 251694 251208 250506 249742 249224 249189 249406 249214 248164 246400 244404 242829 242461
54168 242461 243454 244356 243059 239526 236614 237102 240609 244628 247902 251198 255003 258334 260302 261312 261854
54153 261854 261252 258683 254762 251025 248067 245138 241588 237989 235507 234614 234849 235694 237192 239385 241523
54138 241523 242496 242201 241806 242195 242686 241939 239829 237672 236638 236637 236814 236570 235934 235430 235716 236992 238689 240055
54120 240055 240992 241886 242685 242734 241650 239883 238244 237207 236804 236851 237153 237617 238169 238478 238086 237086 236293 236313
54102 236313 236814 237171 237373 237482 236782 234543 231488 229295 228655 228833 229155 229704 230402 230720 230693 230920 231127 230149
54084 230149 228147 227310 229077 231811 232735 231397 229777 229620 231232 234400 238545 241928 242545 240441 237868
54069 237868 236566 236141 235767 236084 238170 241452 244085 245218 245801 247118 249379 251872 253706 254149 252955
54054 252955 250832 249196 248897 249458 250038 250848 252870 256094 258890 259710 258879 257936 257510 256743 254876 252483
54038 252483 250711 250064 250484 251996 254427 256795 257907 257660 257181 257599 259160 261528 264324 267106 269287
54023 269287 270481 270843 270949 271441 272680 274402 275778 276231 276219 276746 277969 278882 278734 278300 279143 281815 285335
54006 285335 288483 291125 294027 297682 301756 305777 310087 315669 322853 330478 336818 341383 345298 349729
53992 349729 354404 358110 360238 361082 360771 358931 355867 353383 353432 355983 358988 360666 361226 361961 363305 364659
53976 364659 365928 368195 372381 377944 383621 389048 394871 401302 407438 412252 415659 418255 420516 422657
53962 422657 424848 426933 428262 428379 427755 427302 427228 426849 425326 421981 416157 407860 398697 391156 386239 382524
53946 382524 378190 373273 369091 366114 363503 360517 357178 353554 349538 345618 342788 341119 339236 335915
53932 335915 331674 328178 326487 326489 327655 329648 332228 335042 337553 339059 339080 337900 336395 335042 333527
53917 333527 331645 330061 329668 330619 332533 335198 338374 341231 342827 343109 342851 342765 343272 344884 347933 351910
53901 351910 355801 359139 362088 364582 366192 366922 367277 367395 366903 365764 364420 362844 360466 357525 355589
53886 355589 356034 358577 361972 365556 369463 373900 378998 385004 391849 398815 405314 411740 418856 426570
53872 426570 433991 440498 446119 451116 456000 461758 469072 477168 484303 489664 494134 498977 504591 510985
53858 510985 518666 528368 540274 554212 570290 588595 608244 627264 643570 655793 663288 666006
53846 666006 664597 660243 653966 646227 637326 627924 618741 609803 600429 590121 579300 568965 559812
53833 559812 551795 544429 537254 529956 522240 513824 504739 495614 487365 480387 474183 468046 461916 456167
53819 456167 450710 444966 438828 432900 427492 422149 416761 412369 409946 408796 407204 404471 401314 398399
53805 398399 395584 392753 390175 387601 384062 379139 373579 367999 361946 355164 349008 345312 344082 343414
53791 343414 341692 339006 336340 334305 332983 332227 331607 330514 328859 327482 327437 328850 330722 331876 331922 331199
53775 331199 329966 328116 325928 324674 325712 328773 331759 332751 331937 331143 331614 332786 333259 332546 331514 331174
53759 331174 331377 331097 330072 329689 331676 336101 341288 345639 348888 351518 353902 356438 359718 363875 368240
53744 368240 372236 376134 380403 384875 389292 394164 400123 406698 412710 417868 423066 428979 435109 440456
53730 440456 444495 447244 448926 449866 450390 450546 450123 448936 446870 443854 440330 437623 437063 438387 439438
53715 439438 437864 432977 426002 418934 413358 409866 407977 406438 403876 399545 393788 387884 383141 379929
53701 379929 377644 375669 373946 372398 370336 367101 363062 359314 356463 354227 352222 350491 349240 348612
53687 348612 348853 350109 351845 352933 352681 351521 350485 350254 350919 352356 354455 356941 359233 360755 361589
53672 361589 362659 364881 368021 370721 371906 371859 371726 372345 373774 375515 376834 377350 377755 379473 383050 387363
53656 387363 391017 393961 397038 400475 403828 407023 410473 414431 419091 424835 431221 436154 437670 436599
53642 436599 435973 437580 440455 443012 445136 447658 451212 456327 463203 470467 475492 477158 477317 478439 480769
53627 480769 482987 484671 486459 488265 488931 487706 485056 482064 479891 479420 480320 480647 478640 474975 472189
53612 472189 471719 472411 472176 470154 466970 463738 461396 460551 461355 463474 466147 468249 468775 467771 466353 465108
53596 465108 462982 458889 454154 451834 453162 456035 457785 458336 459503 462070 465053 467624 470286 473739
53582 473739 477685 481397 484754 487976 490771 492663 494027 495948 498785 501655 503838 506140 510059 515777
53568 515777 521872 527098 531684 536476 541494 545991 549605 552751 555892 558948 561646 564236 567655 572947
53554 572947 580400 589249 598379 607316 616317 625582 634850 643844 652562 660813 668017 673949 679249 684645
53540 684645 689980 694475 697638 699351 699463 698115 696264 694948 693890 691616 687174 681172 674929 669339
53526 669339 664824 661623 659442 657281 654352 651022 648271 646328 644404 641745 638387 634776 631275 628421
53512 628421 627089 627588 628715 628464 626064 622893 621025 621234 622797 624909 627551 630996 635086 639230 642787
53497 642787 645291 646743 647909 650052 653999 659547 665796 671946 677805 683784 690378 697470 704356 710848
53483 710848 718039 727255 738432 750309 762211 774626 787966 801995 816881 833600 852435 872074
53471 872074 891149 909880 929289 949659 970910 993752 1019026 1046299 1074377 1102907 1132251
53460 1132251 1162130 1191899 1222103 1254219 1288645 1324321 1360559 1397851 1436469 1475701 1515144
53449 1515144 1555481 1597254 1639978 1683117 1726729 1770255 1811988 1851040 1888822 1927088 1965205
53438 1965205 2000987 2033913 2065848 2098478 2131523 2163923 2195482 2226598 2257308 2287483 2317518
53427 2317518 2347858 2377902 2406011 2431001 2453585 2476084 2500357 2525742 2549225 2567950 2581479
53416 2581479 2591298 2598445 2602358 2602068 2597651 2589951 2579455 2566162 2550251 2532071 2511412 2487588 2460672
53403 2460672 2432184 2404032 2376914 2350104 2322544 2293636 2263067 2230548 2195989 2159686 2122311
53392 2122311 2085111 2049971 2018405 1990115 1963262 1936617 1910801 1886870 1864664 1843740 1825329
53381 1825329 1811641 1802976 1796878 1790831 1784938 1781354 1781812 1786307 1793573 1802192 1811656 1822910 1837502
53368 1837502 1855778 1876388 1897996 1920973 1946797 1976341 2009401 2045409 2083675 2123199 2163297
53357 2163297 2204583 2248643 2296483 2347743 2401444 2457073 2514937 2575958 2641134 2710667 2783519
53346 2783519 2858262 2934384 3012253 3091952 3173006 3255564 3340924 3430094 3522207 3615092 3707286
53335 3707286 3798852 3890205 3980923 4070089 4157402 4243266 4327760 4409923 4488294 4561887 4630481
53324 4630481 4694312 4753857 4809601 4861204 4906713 4943395 4969936 4987517 4998278 5003088 5001307 4992214
53312 4992214 4975680 4951437 4918602 4876273 4824104 4762216 4691245 4612801 4529151 4441897 4351433
53301 4351433 4258148 4163492 4069033 3974923 3880314 3785228 3691049 3599122 3509900 3423787 3341624
53290 3341624 3263377 3187115 3110645 3034107 2959764 2889008 2820635 2752761 2685614 2621476 2562203
53279 2562203 2507815 2457510 2411009 2368349 2329014 2292090 2257237 2225023 2196252 2171250 2149730
53268 2149730 2130907 2113620 2096700 2079587 2062578 2046428 2031787 2019023 2008312 1999708 1993270 1989297
53256 1989297 1988184 1989905 1993915 1999922 2008411 2019721 2032888 2046444 2060620 2077575 2098639 2122270
53244 2122270 2146020 2169949 2196495 2226990 2260071 2294124 2329603 2367726 2408059 2449006 2490010
53233 2490010 2531645 2573728 2614889 2654208 2691889 2728035 2762072 2793869 2824067 2852359 2876497
53222 2876497 2894127 2905054 2910786 2912365 2909623 2902073 2889471 2871764 2849571 2824514 2797935 2769263
53210 2769263 2736859 2700647 2662582 2623955 2583571 2539620 2492406 2443856 2394867 2344571 2292206
53199 2292206 2238332 2183868 2129068 2074072 2019524 1965852 1912567 1859226 1806744 1756778 1709818
53188 1709818 1664610 1619492 1573720 1527495 1481507 1436791 1394449 1355071 1318544 1284448 1252316
53177 1252316 1221599 1192036 1164148 1138701 1115443 1093169 1071349 1050798 1032112 1014235 995549
53166 995549 975877 956391 937855 920040 902731 886163 870196 853967 836765 818753 800583
53155 800583 782799 765796 749830 734810 720385 706327 692668 679678 668013 658350 650104 640964
53143 640964 628932 614812 601601 591257 583056 575171 566552 556969 546722 537134 530140 526277 523799
53130 523799 520555 515967 510453 504067 496956 490326 485456 482084 478907 475372 471746 467809 462822 456852
53116 456852 451043 446546 444027 443910 445801 447731 447393 444469 440592 436772 432344 427090 422963 422228 424490
53101 424490 426812 426757 424458 421640 419363 417218 414544 411826 410327 410336 410537 409683 408321 407904 408538 408876 408353
53084 408353 408198 409641 412128 414165 415185 415719 416127 416008 414758 412210 408902 406024 404720 405025 405793 406027
53068 406027 405878 405978 406396 406821 407274 407873 408287 408211 408218 409307 411594 414045 415484 415354 413689 411106 408838
53051 408838 407990 408456 409088 409097 408843 409057 409866 410796 411298 410956 409577 407313 404410 400734 396035 390870 386612
53034 386612 383953 381888 378911 375008 371749 370454 371028 372672 374887 377319 379371 380794 382287 384593
53020 384593 387070 388053 386834 384483 382358 380668 379192 378534 379461 381314 382333 381657 379979 378085 375963
53005 375963 373785 372494 372528 372967 373021 373504 375475 378002 378872 377474 375394 373930 372520 370223 367415 365139
52989 365139 363803 363491 364678 367347 369964 370685 369580 368580 369043 370186 370127 367848 363994 360247 358020
52974 358020 357292 356639 354773 351984 349626 348452 348159 348431 349415 350967 352385 353345 354360 355757 356954 357389
52958 357389 357507 357985 358462 358019 356830 356382 357844 360802 363836 365929 367088 367864 368523 368704 367952 366601
52942 366601 365805 366414 368041 369521 370033 369519 368398 367419 367394 368350 369063 368176 365851 363637 362599 362298 361895
52925 361895 361562 362242 364322 367077 369425 371018 372506 374666 377252 379048 379371 379162 379947 381925 383873
52910 383873 384920 385607 386967 389325 392288 395240 397470 398516 398852 399623 401171 402386 402113 400678 399370
52895 399370 398820 398531 397705 395882 393064 389880 387429 386311 385864 384968 383483 382290 381912 381692 380494 377874
52879 377874 374444 371257 368798 366530 363660 360366 357707 356081 354560 352403 350468 350105 351092 351885 351759
52864 351759 351542 352042 352960 353686 354153 354329 353695 352003 350054 349039 349354 350461 351632 352414 352742 352993 353689
52847 353689 354783 355512 355360 354787 354582 354754 354687 354334 354560 356036 358249 360039 360955 361578 362463 363205 363060 362247
52829 362247 361986 362964 364354 364824 364114 363026 362144 361417 360978 361479 363197 365341 366779 367162 367029 367041 367403
52812 367403 367829 367826 367219 366621 367151 369363 372520 375175 376387 376239 375352 374231 373099 372067 371206 370538 370195
52795 370195 370615 372259 374801 376796 376726 374575 371943 370332 369685 368873 367038 364024 360048 355776 352430
52780 352430 350883 350625 350284 349211 347820 346369 344309 341224 337761 335117 333959 334072 334825 335778 337057
52765 337057 339082 341582 343075 342058 338691 334705 331600 329752 329232 330292 332495 334398 335009 335010 335767 337569
52749 337569 339553 341019 342021 342893 343897 345356 347556 350397 353312 355497 356170 355030 352691 350330 348645
52734 348645 347493 346667 346413 346834 347449 347836 348125 348353 348058 347272 347202 348827 351126 351925 350421 347893 345819
52717 345819 344365 343048 341931 341431 341426 341270 340570 339579 338841 338660 339053 340052 341784 343966 345576 345686 344836
52700 344836 344964 347479 351807 356102 358806 359100 356799 352921 349774 349057 349902 349930 348337 346798 347048 348743
52684 348743 350261 350672 350254 349833 350314 352308 355446 358400 360138 360872 361456 362398 363959 366555 370157 373656
52668 373656 375759 376437 376680 376883 376384 374792 372827 371383 370388 369200 367642 365961 364104 361782 359182
52653 359182 356816 354526 351495 347685 344563 343540 344132 344684 344872 346325 350189 355084 358463 359595 360120
52638 360120 361673 364004 365818 366606 366889 367033 366762 365971 365464 366366 368891 371942 374016 374471 373912 373502 373885
52621 373885 374667 374823 373675 371504 369132 366875 364314 361427 359489 359971 362414 364220 363181 359842 356845
52606 356845 356244 358081 361331 365384 370143 375122 378998 380381 379178 377162 376759 378945 382422 385022 385647
52591 385647 384674 383008 381443 380666 381032 382119 383018 383193 382664 381441 379508 377468 376420 376653 377054 376446
52575 376446 375103 374261 374363 374633 374430 374204 374697 375818 376977 378260 380526 384174 388408 391971 394242 395312
52559 395312 395408 394847 394303 394407 394907 394813 393643 392067 390961 390242 389147 387520 386286 386497 388109 389909 390736
52542 390736 390821 391617 393937 396497 397075 395265 393201 393027 394318 394872 393546 391197 388945 386707 383977 381210
52526 381210 379572 379533 380390 381296 382267 383874 386192 388594 390707 392966 395786 398555 400243 400849 401343 402081
52510 402081 402278 401434 400234 399318 398140 396030 393709 392553 392757 393387 394016 395033 396358 396995 396166 394048
52494 394048 391258 388456 386512 386056 386565 386803 386439 386427 387464 388918 389676 389294 387975 386203 384824 384607
52478 384607 385248 385547 385104 385024 386374 388759 391090 392870 393892 393603 392010 390632 391150 393228 394844 394787
52462 394787 393780 393080 393047 393355 393621 393468 392709 391893 391969 392982 393816 393731 393560 394782 397933 402479 407807 413503
52444 413503 418973 423657 427607 431140 433935 435320 435571 435965 437063 437778 436792 434272 431337 428460 425389
52429 425389 422324 419868 417848 415475 412903 411321 410994 410525 409002 407717 408460 410850 412857 413611 414210
52414 414210 415660 417340 417924 416835 414413 411416 408776 407252 406982 407687 409310 411899 415028 418170 421669
52399 421669 426328 431712 435907 437627 437830 438499 440196 441512 440780 437840 434185 431609 430708 430658 430493 430228
52383 430228 430252 430054 428534 425647 422778 421197 420877 421098 421348 421191 420049 417802 415170 413038 411751 411202
52367 411202 411046 410611 409369 407785 406971 407240 407938 409016 411570 416003 420699 423673 424906 426063 428475
52352 428475 432483 438192 445507 453422 460468 466178 471507 477694 485193 493600 501996 509295 514723 518029
52338 518029 519111 517776 514202 509192 503536 497451 491092 485112 480148 476166 472902 470468 468910 467759
52324 467759 466901 467390 470311 474999 479487 482770 485653 489186 493145 496470 498628 500006 501178 502154 502534
52309 502534 502515 503472 507012 513316 521054 529155 537823 547263 556261 562963 566662 568062 568130 567417 566139 564301
52293 564301 562053 560399 560867 563882 568183 572580 577470 583665 590702 597543 604217 611301 618415 624745
52279 624745 630653 637277 644944 653459 663413 675411 688365 700620 712702 726874 743807 761863
52267 761863 780109 799806 822077 845980 869917 893358 916253 938407 960419 983627 1008027
52256 1008027 1031751 1053668 1074829 1096025 1115717 1132220 1146548 1161023 1176028 1190138 1202773
52245 1202773 1214716 1226439 1237799 1249103 1260579 1270873 1277936 1281711 1284342 1287401 1290365 1292244
52233 1292244 1293222 1293826 1293598 1291617 1287860 1283248 1278584 1273984 1269359 1265159 1262392 1261686 1262353 1262919 1262903 1263639
52217 1263639 1267003 1273749 1283392 1294939 1307206 1319289 1331551 1345398 1361014 1376152 1388594 1399180
52205 1399180 1410730 1424115 1437163 1447669 1455858 1463300 1470864 1478543 1486158 1493223 1498837 1502591 1505195
52192 1505195 1507655 1510312 1513131 1516249 1519482 1521706 1521489 1518355 1513078 1506737 1499717 1491559 1481800 1471032
52178 1471032 1460839 1452231 1444475 1436274 1427887 1420902 1415691 1410432 1403498 1395823 1389808 1386380 1384252 1381888
52164 1381888 1379099 1376634 1375092 1374664 1375319 1376672 1377987 1378845 1379912 1382609 1387700 1394342 1400946 1406977 1413384
52149 1413384 1420988 1429084 1436363 1442665 1448795 1454749 1459490 1462807 1466125 1470615 1475468 1479137 1481657 1484423
52135 1484423 1487869 1490759 1492144 1492948 1494884 1498386 1502449 1506204 1509780 1513377 1516252 1517362 1516879 1516239 1516429
52120 1516429 1516820 1516191 1514335 1511799 1508427 1503435 1497102 1491149 1486737 1483039 1478630 1473482 1468580 1464218
52106 1464218 1460061 1456606 1455010 1455035 1454525 1451805 1447988 1446009 1447719 1452528 1458564 1464360 1469411 1473871 1478147
52091 1478147 1482551 1486909 1490446 1492252 1492149 1491144 1490863 1492369 1495557 1499761 1504635 1510126 1515890 1521476
52077 1521476 1527283 1534687 1544709 1556786 1569327 1581314 1593006 1605254 1618735 1633960 1651442 1671374
52065 1671374 1693264 1716366 1740544 1766466 1794802 1825368 1857219 1889456 1921720 1953896 1985581
52054 1985581 2016001 2044285 2069749 2092106 2111713 2129388 2145543 2159360 2169160 2173840 2173809 2170373
52042 2170373 2164481 2156432 2146692 2136460 2126989 2118454 2109853 2100271 2090143 2080985 2073806 2068018 2062077
52029 2062077 2055080 2047458 2040115 2033096 2025351 2015899 2005238 1995420 1988387 1984247 1981610 1979662 1979252 1981533
52015 1981533 1986299 1992526 1999924 2008681 2017973 2026438 2034515 2044630 2058037 2072727 2085746 2096548 2106594
52002 2106594 2116388 2124732 2130661 2134224 2135174 2132639 2126777 2119400 2112117 2104828 2096605 2086978 2075718 2062599
51988 2062599 2048331 2034607 2021922 2008211 1991126 1971140 1950912 1931831 1912795 1892474 1871176
51977 1871176 1849835 1828431 1806469 1784387 1763488 1744669 1727893 1712884 1699678 1688207 1677719
51966 1677719 1667133 1656078 1645166 1634893 1624564 1612931 1599732 1585803 1571598 1556626 1540735
51955 1540735 1524870 1509692 1494381 1477928 1460984 1445122 1430555 1415802 1399492 1381429 1362017
51944 1362017 1341854 1321943 1303113 1285011 1266624 1247870 1229658 1212460 1196016 1180489 1166416
51933 1166416 1153203 1139303 1124579 1111002 1099983 1090347 1080169 1069518 1059941 1051874 1044060 1035303
51921 1035303 1025660 1015937 1006818 998377 989826 979973 968438 956071 943716 931222 918303 905697
51909 905697 894578 885371 877918 872202 867914 863952 859526 855457 853329 853680 856069 860440 867044 875221
51895 875221 883619 891758 900221 909135 917607 924798 930528 934624 936629 936430 934350 930586 925494 920350
51881 920350 916753 915156 915061 916622 920619 926742 933526 940606 949468 960977 973431 984225 992569 999541
51867 999541 1006158 1012404 1017456 1019860 1018028 1011476 1001248 988584 973936 957918 942087 927526 913488
51854 913488 898939 884961 873994 866897 862316 859099 857793 859294 863312 869006 876232 885203 895201
51841 895201 904297 910432 912724 911919 909563 906607 903013 898870 895189 892753 890624 886863 880581 872155
51827 872155 861523 847827 831374 814755 801028 791339 784821 779995 775588 770830 766038 762504 761080
51814 761080 761289 762494 765141 769710 774964 778770 780681 782436 785635 790085 794693 798735 801577 802212 800077
51799 800077 795816 790453 784261 777156 769775 763370 758852 756493 756192 757265 758316 758278 757441 756639 755506
51784 755506 752624 747596 742010 737845 735552 734085 732120 728793 723964 718490 713895 711062 709371 707485
51770 707485 704655 700873 696292 691274 686819 684057 683073 682736 681881 680325 678620 677098 675387 672797 669119
51755 669119 664938 660981 657244 653279 649408 646899 646404 646799 646411 645141 644563 646000 649198 652878 655809
51740 655809 657260 657091 655853 654495 653710 653577 653594 652804 650298 646134 641478 637283 633325 629275 626044 624667
51724 624667 624167 622257 618481 615101 614230 615545 617640 620126 623100 625769 627324 628543 630831 633948 636224
51709 636224 637073 637827 639783 642708 645859 649528 654771 662091 670944 680308 689421 698184 707012 716207 725416
51694 725416 733795 740419 744294 744448 740735 734378 727026 719348 711195 702931 695636 689747 684369 678449
51680 678449 672108 666483 662616 660729 660185 660012 659873 660575 663072 666998 670964 674472 678577 684085 689962
51665 689962 694379 696766 697910 698295 697335 694311 689383 683441 677343 671417 665557 659804 654847 651613 650081
51650 650081 648922 646716 643290 639526 636389 634756 635643 639487 645208 650901 655558 659329 662092 662960 661758
51635 661758 659963 659281 659998 661593 664368 669110 675190 680262 682370 681654 679566 677083 674259 671009 667493
51620 667493 663878 660275 657013 654484 652684 651206 649791 648630 648108 648538 650037 652254 654323 655735 657442
51605 657442 661351 668173 676237 683046 687625 690642 692607 693135 692172 690896 690734 692052 694354 697342 701251
51590 701251 706475 713288 721433 729459 735022 736795 735936 734760 734034 732443 728675 722964 716199 708553 699759
51575 699759 690087 680278 670905 662440 655495 650189 645527 640296 634579 629690 626510 624573 622897 621049
51561 621049 619124 617201 615275 613387 611534 609699 608129 607265 607099 606929 606145 605183 605339 607551 611428 615499
51545 615499 618447 620248 622126 625274 629679 634369 638678 642962 648094 654691 662880 672378 682594 692929
51531 692929 703081 712680 720589 725148 725476 722207 716790 710571 704762 700555 698564 698444 699549 701714
51517 701714 705033 709461 715276 723519 735060 749465 765494 782508 800557 819391 838532 858404
51505 858404 880220 904257 929095 953069 975863 998303 1021409 1046281 1074248 1106215 1141993
51494 1141993 1180658 1221185 1262264 1301960 1338324 1370187 1396894 1417461 1430586 1435349 1431389 1418621
51482 1418621 1397421 1369119 1335617 1298251 1257493 1213987 1169569 1126914 1088160 1053769 1022526
51471 1022526 992685 963423 935303 909370 886006 864909 845858 828932 813999 800542 788138
51460 788138 776738 766295 756515 747199 738515 730648 723462 716887 711413 707783 706104 705555 705039 703956
51446 703956 702375 700753 699673 699561 700244 700721 699727 696857 693074 689776 687272 684467 680343 675515 671836
51431 671836 670318 669905 668661 665856 662343 659014 655691 651927 648256 645782 644651 643659 641527 637921 633068
51416 633068 627087 620227 613265 606917 601017 594867 588351 582156 576892 572473 568517 564978 562206 560496
51402 560496 559630 558849 557633 556684 557606 561015 565396 568698 570861 573767 578639 584565 589922 594223 597933
51387 597933 601327 604438 607744 612188 618659 627725 639350 652447 665214 676485 686154 693884 698403
51374 698403 699193 698086 697679 698359 698440 697279 696503 697358 698224 696085 689803 680929 671716 663433 656465 650877
51358 650877 646461 642793 639598 636853 634494 632460 631124 631258 633363 637334 642847 649596 656965 664052
51344 664052 670496 676865 683592 689894 694554 697695 700859 705178 710380 715904 721937 728616 735110 740628
51330 740628 745840 752179 760047 768949 779223 792239 808594 827369 847713 870160 895852 925360
51318 925360 958773 996039 1036652 1080083 1127156 1179714 1237628 1297047 1353068 1403580 1449005
51307 1449005 1488837 1520410 1541360 1551656 1552486 1544362 1527065 1500523 1464996 1421172 1371005 1317988
51295 1317988 1265664 1215811 1168381 1122870 1079215 1037505 997576 959230 922754 888994 858833
51284 858833 832591 809970 790496 773686 758721 744416 730069 716248 704282 694892 687509 680710
51272 680710 673074 663915 653724 643886 635633 629199 624102 619844 616034 612337 608811 605941 603744 601417
51258 601417 598597 596336 595663 595631 594280 591421 588869 587651 586710 585149 584206 585659 589295 593358 596905
51243 596905 600264 603419 605443 605937 605921 606614 607780 607928 605979 602408 598633 595573 593000 590230 586986
51228 586986 583427 579889 577128 576340 578056 581118 583669 585203 586649 588315 588987 587725 585538 584372 585037
51213 585037 586916 589210 591559 593746 595594 597117 598331 599142 599806 601041 603243 606085 609375 613568 618480
51198 618480 622190 622517 619531 615510 612336 609987 607740 605666 604260 603341 602207 600670 599300 598570 598073
51183 598073 596820 594293 591098 588413 586863 586241 586332 587394 589354 591037 590900 588525 584954 581680 579714
51168 579714 579373 580263 581315 581357 579977 577707 575435 573780 572864 572400 572134 572353 573590 575530 576734 576112
51152 576112 574382 573404 574291 576824 580337 584263 587873 590603 592989 596487 601850 608093 613362 616533 617890
51137 617890 618680 620056 621970 623006 621742 618322 614200 610571 607858 606531 607111 608850 609610 607976 604851
51122 604851 602225 600966 600671 601015 602051 603348 603955 603461 602420 601572 601259 601616 602696 604178 605474 606414
51106 606414 607431 608896 610637 612280 613621 614422 614314 613351 612327 612078 612550 613075 613488 614450 616434 618832
51090 618832 620453 620746 620158 619395 618770 618406 618628 619698 621321 622759 623555 623831 623877 623711 623147 622046 620307
51073 620307 617934 615423 613881 614145 615638 616527 615450 612974 610999 610782 611846 612749 612481 610968 608773
51058 608773 606809 606101 607274 610148 614088 618629 623456 628031 631841 635021 638145 641277 643823 645528
51044 645528 647072 649362 652792 657492 663611 670660 677121 681540 683865 685045 685585 685342 684699 684946 686966
51029 686966 689989 692100 691924 689722 686973 684943 683555 681747 679056 676538 675809 677374 680218 682819 684239
51014 684239 684546 684666 685591 687273 688648 689249 690251 693173 697975 703481 709253 715779 723021 730410 738465
50999 738465 748749 761489 774665 786367 796793 806890 816409 824896 833664 844845 858634 873113
50987 873113 886892 900484 914748 929170 942287 953002 961061 966859 971090 974000 974784 972356 966975
50974 966975 960408 954151 947953 940316 929963 916612 901167 885578 871851 860493 850285 840158
50962 840158 830869 824142 820462 818560 817145 816435 817681 821698 828309 836980 847415 859341 871960 884051
50948 884051 894830 904631 914567 925498 937381 949467 960969 971663 982167 993738 1007470 1023479
50936 1023479 1040828 1058246 1074939 1090927 1106871 1123394 1140227 1156163 1170283 1183142 1196183
50925 1196183 1209928 1223407 1235536 1246460 1257146 1268299 1280159 1292794 1305849 1318338 1329419
50914 1329419 1339331 1349075 1359519 1371599 1387168 1408442 1436025 1468144 1502359 1537831 1575606 1617146
50902 1617146 1663098 1713191 1766726 1822989 1881540 1942308 2005303 2070014 2135003 2198129 2257471
50891 2257471 2312250 2362794 2409473 2451877 2489261 2521512 2549146 2572499 2591647 2607256 2620954
50880 2620954 2634389 2648060 2660990 2671107 2676127 2674998 2668985 2660632 2651127 2639176 2622924 2602334
50868 2602334 2578950 2553914 2527105 2497796 2465161 2428313 2386991 2342263 2295648 2247403 2196537
50857 2196537 2142670 2087083 2031755 1978153 1927066 1878537 1831624 1785320 1740283 1698707 1661818
50846 1661818 1628497 1597245 1568439 1543267 1521116 1499768 1478226 1457933 1440741 1426673 1414173
50835 1414173 1401759 1388886 1375802 1363270 1352300 1343796 1338248 1335515 1334562 1333709 1331812 1329290 1327544
50822 1327544 1327465 1329112 1332649 1338475 1346101 1353885 1360663 1367089 1374711 1384217 1395256 1407599 1421639 1437854
50808 1437854 1456486 1477741 1501673 1527760 1555181 1583763 1614339 1648010 1685306 1726150 1770399
50797 1770399 1818338 1870784 1928597 1991833 2059540 2130904 2206629 2288631 2378161 2474646 2576610
50786 2576610 2683285 2795015 2912568 3036538 3166902 3302406 3440498 3578643 3715814
50777 3715814 3852000 3986115 4115020 4234852 4342783 4437291 4517609 4583600 4635681 4674243
50767 4674243 4699636 4713395 4718839 4719306 4716034 4708855 4698858 4689052 4682101 4678560 4677645 4678313 4678799 4676264
50753 4676264 4668069 4652729 4628651 4592962 4543261 4480131 4406299 4323160 4229532 4124163 4008209
50742 4008209 3884675 3756537 3626321 3496735 3370583 3249939 3135852 3028810 2929237 2837653
50732 2837653 2754586 2680173 2613896 2554974 2503088 2458397 2420784 2389429 2363184 2340949 2321659
50721 2321659 2304389 2288669 2274382 2261291 2249031 2237352 2225777 2213103 2198158 2181281 2164152
50710 2164152 2147775 2131324 2113409 2093596 2072059 2048620 2023126 1996303 1969253 1942342 1915410
50699 1915410 1888851 1863733 1840959 1821039 1804364 1790837 1779301 1768332 1757789 1748908 1742827 1739799
50687 1739799 1739859 1743246 1749809 1758963 1770853 1786797 1807849 1833540 1862826 1895847 1933785 1977185
50675 1977185 2025425 2077950 2135086 2197053 2262746 2330131 2397808 2465839 2535119 2606171 2678484
50664 2678484 2750690 2821252 2889063 2953619 3014854 3072958 3128045 3179395 3224876 3261742 3288530
50653 3288530 3305949 3315434 3317210 3310658 3296592 3278106 3258695 3240171 3223010 3207952 3196254 3188573
50641 3188573 3184558 3183572 3185003 3187732 3190120 3190943 3189784 3186048 3177993 3163155 3139601 3106624 3064759
50628 3064759 3015679 2961861 2905789 2849290 2793685 2740446 2691364 2647939 2610626 2578820 2551873
50617 2551873 2530338 2515953 2509980 2511713 2519181 2531345 2548930 2572954 2603126 2638163 2677014 2719090
50605 2719090 2763515 2808842 2853566 2896675 2937911 2977898 3017828 3058535 3099874 3141263 3182755
50594 3182755 3225149 3269024 3314104 3359813 3406379 3455132 3507499 3563701 3622779 3684230 3749338
50583 3749338 3820159 3897220 3978962 4063796 4151819 4243795 4338952 4434747 4528659 4619348 4706006
50572 4706006 4787383 4861954 4928653 4986966 5036521 5077081 5109112 5133821 5151745 5160743 5155782 5131660
50560 5131660 5086547 5023208 4947414 4865812 4784678 4708881 4640950 4581529 4531132 4490732 4460366
50549 4460366 4438199 4421839 4409733 4400319 4390595 4376851 4356373 4327228 4286871 4232696 4164355 4084264
50537 4084264 3995320 3898936 3795569 3686286 3573327 3459742 3348629 3241946 3139919 3042338
50527 3042338 2950434 2866329 2790450 2720867 2655915 2596214 2543050 2495902 2453090 2414300 2380767
50516 2380767 2352852 2328855 2306838 2286798 2270530 2259897 2255602 2257057 2262797 2271195 2281370 2293523
50504 2293523 2308273 2325765 2345710 2368228 2394251 2424837 2460231 2499818 2542846 2588943 2638089
50493 2638089 2690633 2747470 2809565 2876755 2947191 3018485 3089334 3159805 3230416 3301621 3374152
50482 3374152 3449134 3527640 3610443 3698275 3791876 3891774 3998481 4113038 4236896 4371193
50472 4371193 4516602 4673932 4844174 5027534 5222916 5428795 5644344 5869403 6103489
50463 6103489 6344937 6590600 6836222 7077542 7311302 7534913 7745118 7937581 8107999
50454 8107999 8252931 8369131 8452888 8501016 8512457 8488474 8431552 8344479 8230102 8091322
50444 8091322 7931622 7756180 7572173 7387259 7207785 7038908 6885813 6753439 6644691
50435 6644691 6559859 6498231 6459579 6443442 6447416 6466554 6493986 6521710 6541360 6545263 6527179 6482225
50423 6482225 6406892 6300125 6164329 6004390 5825241 5630715 5424703 5212308 4998838 4787968
50413 4787968 4581738 4382152 4191659 4011775 3842337 3682979 3534691 3398921 3275446
50404 3275446 3162247 3057636 2961558 2874482 2795894 2724587 2659959 2602354 2552348 2510203 2475736
50393 2475736 2448129 2425884 2407517 2392404 2380649 2372104 2365855 2360808 2356517 2353381 2352239 2353817 2358347
50380 2358347 2365544 2374884 2385770 2397244 2407848 2416410 2423333 2430816 2441392 2456146 2474374 2494695
50368 2494695 2516253 2539099 2564045 2592377 2625211 2662651 2703684 2747360 2794044 2845215 2902078
50357 2902078 2964838 3033266 3107409 3187477 3273653 3366359 3466249 3573359 3686518 3804051 3924717
50346 3924717 4047418 4170304 4290990 4407635 4519143 4624326 4721514 4809001 4885114 4947640
50336 4947640 4993903 5021735 5029877 5017260 4982673 4925812 4848408 4754066 4647328 4533058 4415966
50325 4415966 4299937 4187762 4081733 3984144 3896896 3821017 3757113 3706177 3669399 3647068 3637774
50314 3637774 3638588 3645859 3655951 3665502 3671112 3669131 3656128 3629633 3588279 3531653 3460711 3378235
50302 3378235 3287907 3192506 3093455 2992050 2890158 2789336 2690306 2593922 2501756 2414853 2332618
50291 2332618 2253879 2178562 2107446 2040917 1979099 1922837 1873206 1830000 1791758 1757465 1727369
50280 1727369 1701993 1681219 1664636 1652084 1643598 1639394 1639936 1645218 1653726 1662930 1671375 1679775 1689500
50267 1689500 1700178 1709159 1713329 1711318 1704178 1694076 1682479 1669847 1656957 1645535 1636738 1629522
50255 1629522 1621581 1611887 1601430 1591622 1583116 1576305 1571613 1568664 1566143 1563298 1560895 1560031 1560697 1562293
50241 1562293 1564893 1568947 1574063 1579175 1584062 1589920 1598071 1608418 1619352 1629029 1636856 1643930 1651984
50228 1651984 1661741 1672438 1683000 1693291 1704009 1715775 1728740 1742784 1757712 1773538 1790751
50217 1790751 1809626 1828532 1843407 1849945 1846453 1834325 1816320 1795317 1774211 1755187 1738358 1722217
50205 1722217 1706204 1691972 1681233 1673213 1665531 1657253 1649709 1644216 1640360 1637086 1634470 1633548 1634980
50192 1634980 1638751 1644879 1653532 1664491 1677143 1691094 1706326 1722877 1741028 1761783 1786337 1814741
50180 1814741 1845628 1877534 1909903 1942408 1973992 2003261 2029454 2052486 2072421 2089676 2105338
50169 2105338 2120201 2133337 2142514 2146437 2145893 2142106 2134351 2119904 2096495 2064578 2027107 1987242
50157 1987242 1946399 1904502 1861779 1819704 1780026 1743540 1710340 1680819 1655490 1633837 1614101
50146 1614101 1594410 1573529 1550451 1524208 1494750 1463553 1432642 1403116 1375030 1348471 1324139
50135 1324139 1302651 1283643 1265965 1248900 1232985 1219222 1207393 1195703 1182520 1168131 1154141
50124 1154141 1141506 1130008 1119455 1110206 1102195 1094559 1086897 1079990 1074496 1069768 1064945 1060581 1058023
50111 1058023 1057462 1057773 1058259 1059337 1061297 1063573 1065856 1068981 1073766 1079424 1084145 1087301 1090408 1095688 1104076
50096 1104076 1114829 1126657 1138873 1151740 1166238 1183479 1203685 1225332 1245735 1263056 1277736
50085 1277736 1291548 1305422 1318756 1330706 1341390 1351579 1361915 1372831 1384712 1397731 1411929
50074 1411929 1427834 1446465 1468357 1493120 1520509 1551395 1587070 1628047 1674169 1725290 1780955
50063 1780955 1839947 1901259 1965243 2032533 2101840 2170117 2235236 2297386 2357538 2415712 2471355
50052 2471355 2524288 2574328 2620579 2661904 2697472 2726057 2745379 2753040 2747826 2729472 2697898 2653910
50040 2653910 2600368 2541226 2479093 2414652 2348723 2283711 2222298 2165260 2111428 2059620 2010208
50029 2010208 1964911 1925362 1891591 1861599 1832641 1803373 1774713 1748475 1725374 1704645 1685261
50018 1685261 1666913 1649777 1633879 1618881 1604199 1589220 1573760 1558434 1544123 1530823 1517488
50007 1517488 1503403 1489177 1475620 1462110 1447222 1431027 1415549 1402433 1391320 1381337 1373015 1367305
49995 1367305 1363467 1359797 1356432 1355554 1358225 1362559 1365999 1368257 1370980 1375507 1382090 1390446 1399597 1407567
49981 1407567 1412665 1415117 1416520 1417991 1419928 1423104 1428290 1434631 1440077 1444026 1448162 1453816 1459732 1463665
49967 1463665 1465347 1466654 1469247 1473143 1477404 1481142 1483734 1484986 1485534 1486699 1489606 1494400 1500274 1506310
49953 1506310 1512440 1519612 1528648 1539061 1549659 1560391 1572687 1587687 1605178 1624919 1647859 1674741
49941 1674741 1704305 1734413 1764668 1796436 1830214 1864460 1897432 1928999 1960033 1990962 2021540
49930 2021540 2051079 2078021 2099810 2114008 2119355 2115420 2101700 2077786 2044312 2003181 1956679 1906400
49918 1906400 1852887 1796311 1737683 1679295 1623507 1571173 1521790 1475133 1431913 1392588 1356451
49907 1356451 1322469 1290409 1260578 1233012 1207602 1184597 1164321 1146653 1131343 1118594 1108730
49896 1108730 1101405 1095657 1090694 1086329 1082867 1080934 1081184 1083755 1088199 1094258 1102403 1113161 1126173 1140328
49882 1140328 1154540 1167970 1179934 1190247 1199419 1207851 1215015 1220046 1222985 1224677 1225352 1223942 1218934
49869 1218934 1209484 1195737 1178706 1160037 1141339 1123397 1106178 1089708 1074661 1061957 1051875
49858 1051875 1043541 1035342 1026248 1017074 1010085 1006801 1006380 1006595 1006194 1005690 1006030 1007404 1009574 1012600 1016694
49843 1016694 1021706 1027344 1033879 1042217 1052905 1065163 1077426 1089236 1102078 1117445 1134261 1149498
49831 1149498 1161546 1171528 1180572 1187504 1190869 1191912 1193329 1195490 1196136 1193856 1189560 1183958 1175748 1163542
49817 1163542 1148038 1130959 1113026 1094286 1075528 1058008 1042341 1028720 1017572 1008791 1000917 992434
49805 992434 983762 976842 972844 971164 970539 970154 969765 969815 971599 976381 983937 992642 1001367 1010805 1022529
49790 1022529 1037058 1053086 1068481 1081967 1093985 1105919 1118388 1130476 1140762 1148731 1154743 1158957
49778 1158957 1160980 1160597 1158349 1155128 1151454 1147148 1141562 1134240 1125577 1116715 1108544 1100939 1093269 1085482
49764 1085482 1078374 1072928 1069584 1067937 1066841 1065142 1062802 1061240 1062185 1066255 1072928 1081552 1091764 1102993
49750 1102993 1114263 1124862 1135013 1145547 1156811 1167854 1176878 1182832 1186555 1189815 1193095 1194973
49738 1194973 1194032 1190655 1186296 1181572 1175876 1168442 1158888 1146939 1132634 1116844 1100806 1085194 1070308
49725 1070308 1056904 1045724 1036146 1026505 1016175 1006321 998100 991079 984159 977257 971191 966428 962872
49712 962872 960553 959568 959426 959413 959763 961754 966285 972864 980325 988197 997038 1007580 1019848 1032910 1045235
49697 1045235 1055447 1063159 1069183 1074717 1080252 1085412 1089720 1092890 1094161 1092081 1085896 1076980 1067911 1059938
49683 1059938 1052183 1043627 1034899 1027397 1021455 1016375 1011787 1007811 1004023 999424 993708 987790 982874 979722
49669 979722 978848 980414 983471 986276 988034 989742 992639 996410 999792 1002667 1006559 1012974 1021888 1032111
49655 1032111 1042674 1053574 1065408 1078550 1092535 1106000 1117145 1124429 1127200 1126102 1122962 1119939
49643 1119939 1118354 1118159 1118411 1118102 1116570 1113569 1109316 1104455 1099740 1095671 1092317 1089274 1085724 1080783 1074147
49628 1074147 1066507 1059266 1053742 1050477 1049133 1049131 1050521 1054082 1060258 1068143 1076064 1083361 1091262 1101768
49614 1101768 1115955 1133506 1153368 1174329 1195033 1213901 1229276 1239764 1244959 1246195 1246186 1247135 1249087
49601 1249087 1250590 1250967 1251302 1253041 1256421 1260804 1265713 1270386 1272564 1269215 1259191 1244401 1227664 1210055
49587 1210055 1191252 1171882 1154008 1138926 1125570 1111824 1096966 1082334 1069999 1061198 1055575 1051399
49575 1051399 1046785 1041201 1035732 1031674 1029228 1027764 1026718 1025602 1023598 1020029 1015060 1009312 1002893 995499
49561 995499 987352 979319 971987 965232 958790 952775 947622 943928 942169 942044 942355 942313 942763 945071 948815
49546 948815 951820 952970 953851 956768 961885 967273 971329 974173 976795 979677 982547 985058 987341 989806
49532 989806 992499 995020 997476 1001132 1007163 1014594 1020490 1022815 1022475 1022029 1023102 1025784 1029724 1034488 1038986
49517 1038986 1041905 1043172 1044222 1046380 1049475 1052527 1055336 1058789 1063729 1070025 1076982 1084372 1092623 1102068
49503 1102068 1112460 1123507 1135463 1148539 1161809 1173387 1181856 1187130 1189814 1190375 1189261 1187210 1184846
49490 1184846 1182148 1178617 1173864 1168027 1162066 1157630 1155902 1156312 1157170 1157871 1159542 1162885 1166527 1168724 1170011
49475 1170011 1172652 1177630 1183555 1188791 1193513 1199321 1207679 1219114 1233198 1248829 1264944 1281337 1298582
49462 1298582 1317177 1337106 1357818 1377893 1395065 1407830 1417255 1426052 1435458 1444109 1450429 1454874
49450 1454874 1458858 1462538 1465136 1466949 1469612 1474281 1480602 1487519 1494002 1498627 1499416 1494935 1485290 1471704
49436 1471704 1455368 1437084 1417706 1398404 1380308 1363980 1349249 1335609 1322852 1311266 1301144
49425 1301144 1292259 1284148 1276816 1270702 1265902 1261897 1258339 1255637 1254277 1253838 1253357 1252611 1252337 1252888 1253436
49410 1253436 1253170 1252861 1254227 1257605 1261184 1263076 1263535 1264361 1266433 1268817 1270384 1271431 1273098 1275690 1278255
49395 1278255 1279756 1280093 1279844 1279344 1278289 1276167 1272848 1268746 1264470 1260467 1257029 1254435 1252775 1251579 1249930
49380 1249930 1247206 1243619 1239822 1236162 1232688 1229905 1229036 1231036 1235485 1240949 1246587 1253028 1261397 1271863
49366 1271863 1283709 1296702 1311759 1330129 1352465 1378825 1408909 1441904 1476854 1513816 1553650
49355 1553650 1595150 1632661 1658465 1668673 1666142 1657202 1646539 1635870 1626097 1618599 1614290 1612967
49343 1612967 1614191 1617983 1624241 1632192 1640887 1649661 1657811 1664689 1670849 1678409 1689181 1702437 1715308
49330 1715308 1725477 1732881 1738659 1743225 1745886 1745974 1743641 1739464 1733699 1726274 1717364 1707547 1697268 1686515
49316 1686515 1675426 1665048 1656893 1651518 1647982 1644941 1641926 1639246 1637099 1635332 1633887 1632964 1632856 1634027
49302 1634027 1637034 1641739 1646605 1649548 1649695 1647813 1644974 1641492 1637356 1632859 1628202 1623003 1616867 1610188
49288 1610188 1603845 1598321 1593624 1589832 1587165 1585590 1584850 1584864 1585622 1586731 1587561 1587905 1588051 1588109 1587662 1586268
49272 1586268 1583977 1581077 1577588 1573345 1568562 1563982 1560244 1557192 1554143 1551049 1549095 1549611 1552464 1556134
49258 1556134 1559564 1563209 1567850 1573103 1577939 1582320 1587394 1594102 1602378 1611800 1622254 1633701 1645919
49245 1645919 1658871 1672918 1688288 1704507 1720545 1735419 1748784 1761216 1773937 1787866 1802934
49234 1802934 1818482 1833940 1848480 1860293 1867338 1869144 1867146 1862880 1856510 1847500 1835932 1822590
49222 1822590 1808348 1794097 1780767 1768634 1756959 1745008 1733062 1721729 1710670 1699177 1688096
49211 1688096 1679980 1676697 1677434 1679629 1681449 1682753 1684049 1685406 1686609 1687625 1688356 1688248 1686692 1683761 1680123
49196 1680123 1676237 1672211 1668490 1666030 1665481 1666873 1670610 1677993 1689813 1704734 1720038 1733811 1745495
49183 1745495 1754540 1759858 1760916 1758276 1752594 1744054 1733244 1721498 1709610 1697112 1683804 1671219
49171 1671219 1661433 1654841 1650206 1646650 1644503 1644149 1645058 1646358 1647829 1650081 1653984 1659965 1667625 1676122
49157 1676122 1684992 1694245 1703504 1711809 1718915 1726239 1735659 1747633 1761183 1775399 1790044 1804922 1819682
49144 1819682 1834315 1849098 1863965 1878653 1893466 1909060 1925460 1942104 1958994 1976833 1995693
49133 1995693 2014384 2031675 2047546 2062726 2077548 2091771 2105182 2117892 2130195 2142393 2154623
49122 2154623 2166765 2178811 2191331 2205102 2220246 2236278 2253118 2271366 2291259 2312141 2333575
49111 2333575 2356544 2382873 2413697 2448932 2487902 2529607 2572151 2612422 2646899 2673113 2690614
49100 2690614 2700759 2705596 2706938 2706458 2706226 2708417 2714117 2722579 2732062 2741488 2751362 2763067 2777132 2792128
49086 2792128 2805537 2815950 2824071 2831287 2837920 2843811 2850204 2859655 2873650 2891161 2910072 2929250
49074 2929250 2948881 2969576 2991836 3015837 3041143 3067130 3094077 3123088 3154423 3186720 3218643
49063 3218643 3250340 3282239 3313318 3342257 3369835 3398319 3428438 3458782 3488750 3520231 3555292
49052 3555292 3593625 3633748 3675818 3721750 3773118 3830521 3894887 3968017 4051637 4146783 4253527
$$ [...]
##END NTUPLES=NMR SPECTRUM
##END=
