
##TITLE=UV1055_TOCA01-ROVE100D_6100010_pmNMsA0UUi
##JCAMPDX= 6.0         $$ Bruker NMR JCAMP-DX V2.0
##DATA TYPE= NMR SPECTRUM
##DATA CLASS= NTUPLES
##ORIGIN= BRUKER
##OWNER= Administrator
$$ 1.72 TOPSPIN		Version 2.1
$$ 2012-05-13 01:41:13.328 -0500  Administrator@TOPSPIN
$$ Compression mode = diff/dup
##.OBSERVE FREQUENCY= 400.13188235
##.OBSERVE NUCLEUS= ^1H
##.ACQUISITION MODE= SIMULTANEOUS (DQD)
##.ACQUISITION SCHEME= undefined
##.AVERAGES= 8
##.DIGITISER RES= 22
##SPECTROMETER/DATA SYSTEM= spect
##.PULSE SEQUENCE= zg30
##.SOLVENT NAME= COFFEE_meoh
##.SHIFT REFERENCE= INTERNAL, COFFEE_meoh, 1, 14.98061
##AUDIT TRAIL= $$ (NUMBER, WHEN, WHO, WHERE, PROCESS, VERSION, WHAT)
$$ ##TITLE= Audit trail, TOPSPIN		Version 2.1
$$ ##JCAMPDX= 5.01
$$ ##ORIGIN= Bruker BioSpin GmbH
$$ ##OWNER= Administrator
$$ $$ C:\Bruker\TOPSPIN/data/COFFEE/nmr/UV1055_TOCA01-ROVE100D_6100010_pmNMsA0UUi/10/pdata/1/auditp.txt
$$ ##AUDIT TRAIL=  $$ (NUMBER, WHEN, WHO, WHERE, PROCESS, VERSION, WHAT)
(   1,<2012-05-13 01:41:06.593 -0500>,<Administrator>,<TOPSPIN>,<go>,<TOPSPIN 2.1>,
      <created by zg
	started at 2012-05-13 01:40:00.171 -0500,
	POWCHK enabled, PULCHK disabled,
       configuration hash MD5:
       AF F2 23 6B 01 CD 40 DD E5 A1 38 A0 06 EA F7 77
       data hash MD5: 64K
       7F 11 9A 2D C7 7F AE 9F 65 E2 A8 AB 29 13 F0 DA>)
(   2,<2012-05-13 01:41:09.203 -0500>,<Administrator>,<TOPSPIN>,<proc1d>,<TOPSPIN 2.1>,
      <Start of raw data processing
       efp LB = 0 FT_mod = 6 PKNL = 1 PHC0 = 0 PHC1 = 0 SI = 32K 
       data hash MD5: 32K
       CB 31 0C E1 7C 45 82 EF 28 32 49 0E 8A F6 73 CE>)
(   3,<2012-05-13 01:41:09.625 -0500>,<Administrator>,<TOPSPIN>,<proc1d>,<TOPSPIN 2.1>,
      <pk PHC0 = 215.8539 PHC1 = 0 
       data hash MD5: 32K
       8C 5A DD 20 AE 6B 78 1E C2 80 97 E0 BE 63 08 36>)
(   4,<2012-05-13 01:41:09.734 -0500>,<Administrator>,<TOPSPIN>,<proc1d>,<TOPSPIN 2.1>,
      <abs ABSG = 1 
       data hash MD5: 32K
       26 6A E2 2D 6E E9 0E 7F 7B 04 0C AD 02 D6 C0 EF>)
(   5,<2012-05-13 01:41:09.765 -0500>,<Administrator>,<TOPSPIN>,<proc1d>,<TOPSPIN 2.1>,
      <abs ABSG = 2 
       data hash MD5: 32K
       BA 77 07 07 B4 DA F3 92 14 2A 62 C3 31 CD 69 EE>)
(   6,<2012-05-13 01:41:09.796 -0500>,<Administrator>,<TOPSPIN>,<proc1d>,<TOPSPIN 2.1>,
      <abs ABSG = 3 
       data hash MD5: 32K
       41 65 3B B2 62 2F C3 FF BF 26 61 14 6B 67 DA A0>)
(   7,<2012-05-13 01:41:09.828 -0500>,<Administrator>,<TOPSPIN>,<proc1d>,<TOPSPIN 2.1>,
      <abs ABSG = 4 
       data hash MD5: 32K
       09 C2 96 FB 68 3A 8F D5 99 6B D6 6D 86 31 50 FF>)
(   8,<2012-05-13 01:41:09.859 -0500>,<Administrator>,<TOPSPIN>,<proc1d>,<TOPSPIN 2.1>,
      <abs ABSG = 5 
       data hash MD5: 32K
       C3 F5 85 19 A8 6A 0E AF 03 B0 85 DE ED E9 6D 40>)
$$ ##END=
$$ 
$$ $$ hash MD5
$$ $$ F8 04 7C A2 75 C4 10 95 70 CB FE 6F 12 15 F2 CD
##$RELAX= 
##$RELAX= 
##$RELAX= 
##$RELAX= 
##$RELAX= 
##$RELAX= 
##$RELAX= 
$$ Bruker specific parameters
$$ --------------------------
$$ [...]
150 150 150 150 150 150 150 150
##$TP07= 0
##$TPNAME0= <>
##$TPNAME1= <>
##$TPNAME2= <>
##$TPNAME3= <>
##$TPNAME4= <>
##$TPNAME5= <>
##$TPNAME6= <>
##$TPNAME7= <>
##$TPOAL= (0..7)
0.5 0.5 0.5 0.5 0.5 0.5 0.5 0.5
##$TPOFFS= (0..7)
0 0 0 0 0 0 0 0
##$TUNHIN= 0
##$TUNHOUT= 0
##$TUNXOUT= 0
##$USERA1= <user>
##$USERA2= <user>
##$USERA3= <user>
##$USERA4= <user>
##$USERA5= <user>
##$V9= 5
##$VALIST= <valist>
##$VCLIST= <CCCCCCCCCCCCCCC>
##$VD= 0
##$VDLIST= <DDDDDDDDDDDDDDD>
##$VPLIST= <PPPPPPPPPPPPPPP>
##$VTLIST= <TTTTTTTTTTTTTTT>
##$WBST= 2048
##$WBSW= 25
##$XGAIN= (0..3)
0 0 0 0
##$XL= 0
##$YL= 0
##$YMAX_a= 536326
##$YMIN_a= -628954
##$ZGOPTNS= <>
##$ZL1= 120
##$ZL2= 120
##$ZL3= 120
##$ZL4= 120
##$ABSF1= 14.98061
##$ABSF2= -5.57192
##$ABSG= 5
##$ABSL= 3
##$ALPHA= 0
##$AQORDER= 0
##$ASSFAC= 0
##$ASSFACI= 0
##$ASSFACX= 0
##$ASSWID= 0
##$AUNMP= <proc_prof1d_extract_pilot.lims>
##$AXLEFT= 0
##$AXNAME= <>
##$AXNUC= <1H>
##$AXRIGHT= 0
##$AXTYPE= 0
##$AXUNIT= <>
##$AZFE= 0.1
##$AZFW= 0.1
##$BCFW= 0
##$BC_mod= 0
##$BYTORDP= 0
##$COROFFS= 0
##$CY= 15
##$DATMOD= 1
##$DC= 0
##$DFILT= <>
##$DTYPP= 0
##$F1P= 0
##$F2P= 0
##$FCOR= 0.5
##$FTSIZE= 32768
##$FT_mod= 6
##$GAMMA= 0
##$GB= 0
##$INTBC= 1
##$INTSCL= 1
##$ISEN= 128
##$LB= 0
##$LEV0= 0
##$LPBIN= 0
##$MAXI= 10000
##$MC2= 0
##$MEAN= 0
##$ME_mod= 0
##$MI= 0
##$NCOEF= 0
##$NC_proc= -8
##$NLEV= 6
##$NOISF1= 0
##$NOISF2= 0
##$NSP= 0
##$NTH_PI= 0
##$NZP= 0
##$OFFSET= 14.98061
##$PC= 1
##$PHC0= 215.8539
##$PHC1= 0
##$PH_mod= 1
##$PKNL= yes
##$PPARMOD= 0
##$PPDIAG= 0
##$PPIPTYP= 0
##$PPMPNUM= 2147483647
##$PPRESOL= 1
##$PSCAL= 4
##$PSIGN= 0
##$PYNMP= <proc.py>
##$REVERSE= no
##$SF= 400.13
##$SI= 32768
##$SIGF1= 0
##$SIGF2= 0
##$SINO= 400
##$SIOLD= 32768
##$SPECTYP= <>
##$SREGLST= <1H.CDCl3>
##$SSB= 0
##$STSI= 32768
##$STSR= 0
##$SW_p= 8223.68421052632
##$SYMM= 0
##$S_DEV= 0
##$TDeff= 65536
##$TDoff= 0
##$TI= <>
##$TILT= no
##$TM1= 0
##$TM2= 0
##$TOPLEV= 0
##$USERP1= <user>
##$USERP2= <user>
##$USERP3= <user>
##$USERP4= <user>
##$USERP5= <user>
##$WDW= 1
##$XDIM= 32768
##$YMAX_p= 450951945
##$YMIN_p= -734932
##$CURPLOT= <Network HP LaserJet P1505>
##$CURPRIN= <$Network HP LaserJet P1505>
##$DFORMAT= <normdp>
##$LAYOUT= <+/1D_H.xwp>
##$LFORMAT= <normlp>
##$PFORMAT= <normpl>
##$SURQMSG= 1
$$ End of Bruker specific parameters
$$ ---------------------------------
##NTUPLES= NMR SPECTRUM
##VAR_NAME=  FREQUENCY,     SPECTRUM/REAL,   SPECTRUM/IMAG
##SYMBOL=    X,             R,               I
##VAR_TYPE=  INDEPENDENT,   DEPENDENT,       DEPENDENT
##VAR_FORM=  AFFN,          ASDF,            ASDF
##VAR_DIM=   32768,         32768,           32768
##UNITS=     HZ,            ARBITRARY UNITS, ARBITRARY UNITS
##FACTOR=    0.250966925370066, 1,           1
##FIRST=     8223.43324360095, -156867,      -144708
##LAST=      0,             163446,          107932
##MIN=       0,             -734932,         0
##MAX=       8223.43324360095, 450951945,    0
$$ Real data points
##PAGE= N=1
##DATA TABLE= (X++(R..R)), XYDATA
$$ [...]
19536b01001R2982A0892i5234J2680k87538a19249H1579l7128c0521j145H8545
$$ -201001 -108019 10892 -95234 -82554 -370092 -119249 81579 44451 -30521 -31666 88545
19524G8326b1446l7150l05170i4628j79122a09959C9568e5625A62198b41645d2023
$$ 78326 -21446 -58596 -363766 -94628 -273750 -109959 39568 -55625 162198 -241645 -42023
19512B15804r6700e1645j27901c3529p6727B551a52067A24382F404d804C12364
$$ 215804 119104 -51645 -179546 -33529 -110256 2551 -152067 124382 6404 -4804 312364
19500B61699a50391f5830a5962C04558f7562d487G9673b00480B07619N5521i7868
$$ 261699 -150391 -65830 -15962 304558 -67562 -4487 79673 -200480 207619 263140 -97868
19488b63321B68106c05591a21071a8578o5099K4938D6480J58275a04090F2907
$$ -263321 268106 -305591 -121071 -18578 -83677 -58739 46480 204755 -104090 62907
19477a75412n2962b261j51559a0644E0554b24665o1697c9105B65104g3954m3864
$$ -175412 -228374 -2261 -153820 -10644 50554 -224665 -286362 -39105 265104 -73954 -117818
19466a17818A1328b84198P9000j11478C19640p8795c1354l6828j17984c75E8756
$$ -117818 11328 -284198 -205198 -316676 319640 240845 -31354 -68182 -186166 -375 58756
19454A65123b47890h2907p6270l3853m1148i7707A30832P2858a39544d1870j7768
$$ 165123 -247890 -82907 -159177 -193030 -234178 -97707 130832 203690 -139544 -41870 -59638
19443e9638A07468a70531r3512A27055d6161j28510A4472J7157N8955C1642a25389
$$ -59638 107468 -170531 -264043 127055 -46161 -174671 14472 31629 90584 31642 -125389
19431a14285D312b33495J04266n1222e8585j14550B02792H4189i3301A46346l6006
$$ -114285 4312 -233495 -129229 -180451 -58585 -173135 202792 84189 -93301 146346 110340
19420A10340i4335l6096I7596O9022G2038A8468h2326A23556i6548K4774K5279
$$ 110340 -94335 -130431 97596 166618 72038 18468 -82326 123556 -96548 -71774 -46495
19409d6495H6593O4707J32318A18505a4509j1057l85296d7068E6125a09414k2787
$$ -46495 86593 151300 283618 118505 -14509 -25566 -410862 -47068 56125 -109414 -132201
19398a32201A72609a76855A7678d868F1444b31028F9624p081K6042c79268A77787
$$ -132201 172609 -176855 17678 -4868 61444 -231028 69624 62543 88585 -379268 177787
19386A11778K88148c88145g528o5034A91498G35a06371C1802a58552G5674J43689
$$ 111778 399926 -388145 -7528 -72562 191498 735 -106371 31802 -158552 75674 219363
19375B19363i7862b1547k50312E3006b0375m3283b6035r1834A90884B3444J7674
$$ 219363 -97862 -21547 -271859 53006 -20375 -63658 -26035 -117869 190884 23444 41118
19364D1118a84312k36020a67803J6954j39043J35128I9986D908c89250A22187
$$ 41118 -184312 -420332 -167803 -150849 -289892 -154764 99986 4908 -389250 122187
19353c37865c1322E691g3896E1012e9097j2888g934A75644c07503C9403a75964
$$ -337865 -31322 5691 -73896 51012 -59097 -71985 -7934 175644 -307503 39403 -175964
19341b89779A49712f3518b7687B9927c83440a52708O7749d873B3706J46621c5112
$$ -289779 149712 -63518 -27687 29927 -383440 -152708 -84959 -4873 23706 170327 -35112
19329c3287O032k28647D3268a30261M9918j91962J30314d9920A02469a05077K599
$$ -33287 -27255 -255902 43268 -130261 -80343 -272305 -141991 -49920 102469 -105077 -102478
19318a02478n6254A90080H8093a24760A72067P8271c30911M9580P3387A32306
$$ -102478 -158732 190080 88093 -124760 172067 250338 -330911 -281331 -207944 132306
19307d2371i117A56620b24529M8993b6291r848J030k58843R3041i0550k24636
$$ -42371 -9117 156620 -224529 -175536 -26291 -36139 -35109 -293952 -200911 -90550 -315186
19296c15186Q8393a210q9863d5296l5255C8259a81324B07937b09427N8277J7660
$$ -315186 -226793 -1210 -91073 -45296 -80551 38259 -181324 207937 -209427 -151150 -133490
19285a33490A61940b1639m4333j11494D158g3817m4710E3534f8394G258K977P4576
$$ -133490 161940 -21639 -65972 -177466 4158 -73817 -118527 53534 -68394 7258 10235 84811
19273H4811R3371O5368b41798N7007Q3343H5068c25j79484L4605E385b84107A18912
$$ 84811 178182 243550 -241798 -184791 -101448 85068 -325 -179809 -145204 5385 -284107 118912
19260C27200b83538j06405J13960Q8585j00232Q7304l40075b69048a03586p2410
$$ 327200 -283538 -389943 -275983 -187398 -287630 -200326 -540401 -269048 -103586 -175996
19250a75996j53504B61187E7397Q2370c82193a1949A59981B2319m9b0222j57977
$$ -175996 -329500 261187 57397 139767 -382193 -11949 159981 22319 22270 -20222 -178199
19239a78199A74917c3262A04308J13791J980J11421I3282c53598f5282b6979C34491
$$ -178199 174917 -33262 104308 218099 220079 331500 93282 -353598 -65282 -26979 334491
19227a24170B26357c07374f5861l5735l3601A6679J70293d4185j77033b0361J778
$$ -124170 226357 -307374 -65861 -101596 -135197 16679 186972 -44185 -221218 -20361 -18583
19216a8583C1191a31417K1388n0959a3908p7985C70333a48585L9661p5903K8538
$$ -18583 31191 -131417 -110029 -160988 -13908 -91893 370333 -148585 -108924 -184827 -156289
19205a56289K565C50252A00092J42493f2448b6306A02074d9333A12506b39652
$$ -156289 -153724 350252 100092 242585 -62448 -26306 102074 -49333 112506 -239652
19194c38772a34984J1089o3830P4977p9546c3714C2794J9994e74914b54658J14100
$$ -338772 -134984 -123895 -187725 -112748 -192294 -33714 32794 52788 -574914 -254658 -140558
19183a40558g279j73965e1983G1914b92921F9085d32555h5520j68663A12507C9027
$$ -140558 -7279 -181244 -51983 71914 -292921 69085 -432555 -85520 -254183 112507 39027
19171e658A2374J8866L3604b286n83349C332h7532j38403i0005d317B03714N2960
$$ -5658 12374 31240 64844 -2286 -585635 3332 -87532 -225935 -90005 -4317 203714 256674
19159B56674b73539e9270F8972h4337k16676a32041j12032A17187b22554E3455
$$ 256674 -273539 -59270 68972 -84337 -301013 -132041 -244073 117187 -222554 53455
19148b45598A15700b01793h9017J8637B8312a51187f6282j79608p6986m237c6167
$$ -245598 115700 -201793 -89017 -70380 28312 -151187 -66282 -245890 -322876 -327113 -36167
19136h5800n2400D6593b95799j62016h8800C85132E9490l612a91351A1848K06919
$$ -85800 -138200 46593 -295799 -457815 -88800 385132 59490 55878 -191351 11848 218767
19125B18767L1805f803D7944a71060A3743a53846O4533B3215a22481F7323K04579
$$ 218767 250572 -6803 47944 -171060 13743 -153846 -89313 23215 -122481 67323 271902
19114B71902a72282D2154g0972l12665e8087K8875j83291A53680b10660a8774
$$ 271902 -172282 42154 -70972 -383637 -58087 -29212 -212503 153680 -210660 -18774
19103a38127F8004J74865c0643H500C697c72441R0794Q4358A4301a90986A60207
$$ -138127 68004 242869 -30643 8500 3697 -372441 -281647 -197289 14301 -190986 160207
19091A72240O0555b4346n7030j01006J2944B74299g6043l9401J246D32941A8989
$$ 172240 232795 -24346 -81376 -182382 -169438 274299 -76043 -115444 -114198 432941 18989
19079b34506E8168d19088a671B22653g9448j00116k6289p2997f7051l5589B1029
$$ -234506 58168 -419088 -1671 222653 -79448 -179564 -205853 -278850 -67051 -102640 21029
19067B61440j22265c41363A62856i9332E2133a57067C06903b383B5505f5918G0455
$$ 261440 139175 -341363 162856 -99332 52133 -157067 306903 -2383 25505 -65918 70455
19055a90637G6378a28406E8755b12828m5803A32402b28442j8016A19217a05507
$$ -190637 76378 -128406 58755 -212828 -258631 132402 -228442 -246458 119217 -105507
19044C90667H9725K2993O4011C5658j170a38904n7327M2895A91415b09906p8327
$$ 390667 89725 112718 176729 35658 34488 -138904 -196231 -153336 191415 -209906 -288233
19033b88233C20726a79660J2870F2379c0979B5080J04260n1369b35108B24067
$$ -288233 320726 -179660 -166790 62379 -30979 25080 129340 77971 -235108 224067
19022b44610a12019b9837B58298G489Q1739b21089B71839A2999K57387c37322
$$ -244610 -112019 -29837 258298 7489 89228 -221089 271839 12999 270386 -337322
19011A44495a37910a9523C04549A44800c14371A23646G711N167J54994l5574A5662
$$ 144495 -137910 -19523 304549 144800 -314371 123646 7711 12878 167872 132298 15662
18999A67079A9167O8980b39742A11494d7914k33260M2637j73319A50998b17828
$$ 167079 19167 88147 -239742 111494 -47914 -281174 -238537 -411856 150998 -217828
18988a83803a1168l11273O4561a13873l09316H7529R3823a1946k41780Q9115q0514
$$ -183803 -11168 -322441 -257880 -113873 -423189 87529 181352 -11946 -253726 -164611 -245125
18977b45125E8355b3994k59080B06836C5930a56472A60560l6443C2675Q545A1329
$$ -245125 58355 -23994 -283074 206836 35930 -156472 160560 124117 32675 41220 11329
18965b54104b6908k84670L9585A245f7890F4276h3555A4095K6438L8554a04663
$$ -254104 -26908 -311578 -271993 1245 -67890 64276 -83555 14095 40533 79087 -104663
18953I773b02128P7217l6797M8038d8041J0231C03498e7171B77581b37270j59854
$$ 9773 -202128 -124911 -161708 -113670 -48041 -37810 303498 -57171 277581 -237270 -397124
18942c97124q1523K11790A27446B4541L2308K3757m400a35819a2384j7881j28536
$$ -397124 -478647 -266857 127446 24541 56849 80606 76206 -135819 -12384 -30265 -158801
18931a58801f1015D57130h9137a8364D22540A04623B4432J13723f4884K2051B20780
$$ -158801 -61015 457130 -89137 -18364 422540 104623 24432 138155 -64884 -42833 220780
18919B0074J99165A8818M0726b39944H0113c28755c3578k85753E6457L52503d08038
$$ 20074 219239 18818 59544 -239944 80113 -328755 -33578 -319331 56457 408960 -408038
18907a14875A64300f6806k68502g2553A96393b84289F9526a95448c1205A91085
$$ -114875 164300 -66806 -335308 -72553 196393 -284289 69526 -195448 -31205 191085
18896a84619L6153A29405a10025a5001j10217i214m989A8870L5091b1543B4551
$$ -184619 -148466 129405 -110025 -15001 -125218 -9214 -14203 18870 53961 -21543 24551
18884D55643a37544c4094C02555A10510g4731B35625c14402h8524A9146a22302
$$ 455643 -137544 -34094 302555 110510 -74731 235625 -314402 -88524 19146 -122302
18873E9444K5665b88925l2491n1209A80729C8092b20005h731C30652a20901C6108
$$ 59444 85109 -288925 -321416 -372625 180729 38092 -220005 -8731 330652 -120901 36108
18861b82597c819D5473a98096a7243j18351N690C00331b08654B62586b3916C1390
$$ -282597 -3819 45473 -198096 -17243 -135594 -129904 300331 -208654 262586 -23916 31390
18849g8135E8970b26056k29772F2199K65613b06179A4022d5796k80510b5274e160
$$ -78135 58970 -226056 -455828 62199 327812 -206179 14022 -45796 -326306 -25274 -5160
18837A98478I4529C5218i6379l2865L6141B30549f0037j584F1903h892r7340D6167
$$ 198478 94529 35218 -96379 -129244 -93103 230549 -60037 -61621 61903 -8892 -106232 46167
18824a78986Q4046M1562n42158a56411f6037A05714l1859l3676e7410A11942d05183
$$ -178986 -94940 -53378 -595536 -156411 -66037 105714 73855 40179 -57410 111942 -405183
18812B8432J42236a14287q2981J0880a8185m917A42110c51897b6717j34908Q277
$$ 28432 170668 -114287 -197268 -186388 -18185 -23102 142110 -351897 -26717 -161625 -153348
18801a53348N7832L9706A99995M2942f9896b6760j70397A77145c93182A29769
$$ -153348 -95516 -55810 199995 242937 -69896 -26760 -197157 177145 -393182 129769
18790h3465m0994C0132N7580c39039L4468A75876a3273C7930a74178n5504B43014
$$ -83465 -124459 30132 87712 -339039 -304571 175876 -13273 37930 -174178 -229682 243014
18778a61266E221c13093a36102A13130K86781C498b56121m3496j38189A33659
$$ -161266 5221 -313093 -136102 113130 399911 3498 -256121 -299617 -437806 133659
18767d2793j52143c1780k7329q0953j5734A45147M3711J47696b55186A0501J01769
$$ -42793 -194936 -31780 -59109 -140062 -155796 145147 188858 336554 -255186 10501 112270
18756A12270a54298G8647f1589k64706a61827O6077l278I5100a81262m3250a09758
$$ 112270 -154298 78647 -61589 -326295 -161827 -95750 -99028 95100 -181262 -224512 -109758
18744d09594C73914i2556A930P0204b70545R8983L0977F535J24488c61149a40575
$$ -409594 373914 -92556 1930 72134 -270545 -171562 -140585 6535 131023 -361149 -140575
18732c52021b3719l05589h886F7260L1581K6613K6071i272o9898F3102J62336
$$ -352021 -23719 -329308 -8886 67260 98841 125454 151525 -9272 -79170 63102 225438
18721B25438B7125j0860Q4238a19587K073N4809j89315M1467G1470c48868m7989
$$ 225438 27125 16265 100503 -119587 -117514 -62705 -252020 -210553 71470 -348868 -396857
18710c96857A37325N0274b0390j04337A05911b25949G9198a51750b1372j20999
$$ -396857 137325 187599 -20390 -124727 105911 -225949 79198 -151750 -21372 -142371
18700a42371A40016g482j78152g1657r5663F5366a03365A1771c45065J33826A9680
$$ -142371 140016 -7482 -185634 -71657 -167320 65366 -103365 11771 -345065 -211239 19680
18688h5286B31309a77352P2333A11762a04045E8251d7037B6940J23593h004q0954
$$ -85286 231309 -177352 -105019 111762 -104045 58251 -47037 26940 150533 -8004 -88958
18677h8958A94189e24921B91248c07056N0773f1915l15827D8576f9249j46483
$$ -88958 194189 -524921 291248 -307056 -256283 -61915 -377742 48576 -69249 -215732
18667b15732a06883M9683B20519a09824e4256q8175O5623r191l13283B3951g0988
$$ -215732 -106883 -57200 220519 -109824 -54256 -142431 -76808 -85999 -399282 23951 -70988
18655D7620d7687E3765a03593o8940j46181a47239I4523B5682a94227a6080l4301
$$ 47620 -47687 53765 -103593 -172533 -318714 -147239 94523 25682 -194227 -16080 -50381
18644e0381K1527k26378a12533D4415a03966A00254f5961B56475a98568c496D8675
$$ -50381 -28854 -255232 -112533 44415 -103966 100254 -65961 256475 -198568 -3496 48675
18632B98088A12067a20474L1254A10026k1402c1010m6805p4339e1932A32678L8779
$$ 298088 112067 -120474 -89220 110026 88624 -31010 -77815 -152154 -51932 132678 171457
18621A71457h7687k67687B63653a89888c691j15361r743D2187f6431A23386K43306
$$ 171457 -87687 -355374 263653 -189888 -3691 -119052 -128795 42187 -66431 123386 366692
18610C66692b06249a393A06225a38590B8192J84059a39286B6048b0027k17650
$$ 366692 -206249 -1393 106225 -138590 28192 212251 -139286 26048 -20027 -237677
18600b37677g1361j71562F7405b45459g5671F1259J09714b41424n7204a28591
$$ -237677 -71361 -242923 67405 -245459 -75671 61259 170973 -241424 -298628 -128591
18589e9946l3815j37491A19278e7761A28073a81363g7996J2595A24634a58910
$$ -59946 -93761 -231252 119278 -57761 128073 -181363 -77996 -65401 124634 -158910
18578b01325F6921J5504b31888G1442b25707r3357F4946a85419o9043P4661c5907
$$ -201325 66921 82425 -231888 71442 -225707 -319064 64946 -185419 -254462 -179801 -35907
18566A23408D3326J28505M9765H7631b60473B82050A7228J10270b8761j8754A65204
$$ 123408 43326 171831 221596 87631 -260473 282050 17228 127498 -28761 -47515 165204
18554a17830k276N0307k02812a20123r165p8818R3912m005C20561H9337d0853
$$ -117830 -120106 -69799 -272611 -120123 -129288 -208106 -114194 -118199 320561 89337 -40853
18542i0498k1560m7373J3093C3001J52362c03531b1745c486J17p0719B14435c922
$$ -90498 -112058 -159431 -146338 33001 185363 -303531 -21745 -3486 -3369 -74088 214435 -3922
18529e73004a01594j26015B8572c54747c0285I1727j1421a82545N2207q5046a1765
$$ -573004 -101594 -227609 28572 -354747 -30285 91727 80306 -182545 -130338 -215384 -11765
18517a9588p6647q490j38736A28780L5488d86137a22077A13895k2900B9835e7457
$$ -19588 -96235 -104725 -243461 128780 164268 -486137 -122077 113895 90995 29835 -57457
18505A3689h1682j2459K2508A66576a55379b422j20679j8094k07316a27970B4674
$$ 13689 -81682 -94141 -71633 166576 -155379 -2422 -123101 -141195 -348511 -127970 24674
18493B7918a70795M5195D8242b28652J1485O1428A74521J30193a47484G4581K500
$$ 27918 -170795 -125600 48242 -228652 -217167 -155739 174521 304714 -147484 74581 77081
18482G7081d84341B9026g2269j48615A85052o8623B5475b141B33696H8231c8946
$$ 77081 -484341 29026 -72269 -220884 185052 116429 25475 -2141 233696 88231 -38946
18470c84108b3351A09101m6383N0317h4443D15285A89613d82316A98259a22373
$$ -384108 -23351 109101 62718 113035 -84443 415285 189613 -482316 198259 -122373
18459C7264b71438B360g2641N60F9797K33334A08942c0562k40388A65589b37712
$$ 37264 -271438 2360 -72641 -72081 69797 303131 108942 -30562 -270950 165589 -237712
18447a08294M5347l34109h4343M0123j36437e1579Q576R079A25940b95879o9514
$$ -108294 -62947 -397056 -84343 -44220 -180657 -51579 -43003 -33924 125940 -295879 -365393
18436c65393J53111M4076A77946b22915n49a05536b6210k31443B3546J35358a2883
$$ -365393 -212282 -168206 177946 -222915 -223464 -105536 -26210 -257653 23546 158904 -12883
18424a76523P9722J43D278i089I7311D7095B1865K5097R1834a27423m9006H1806
$$ -176523 -96801 -96658 4278 -9089 97311 47095 21865 46962 138796 -127423 -176429 81806
18411a63133j2921C0256b76847A18795J4979G13c0111A33455c1072I1790d6284
$$ -163133 -176054 30256 -276847 118795 133774 713 -30111 133455 -31072 91790 -46284
18399a11516N3530C07648h3577G9678A749J01809a0718n3843G0277P7567O7630
$$ -111516 -57986 307648 -83577 79678 1749 103558 -10718 -64561 70277 147844 215474
18388B15474j7775a78884r5430D8646b41954D0361l688O2165j1164a35242j06906
$$ 215474 197699 -178884 -274314 48646 -241954 40361 36673 98838 87674 -135242 -242148
18377b42148e4849B99343b40646L5439R7668N3095B17756g6798G3207k3628f7360
$$ -242148 -54849 299343 -240646 -205207 -107539 -54444 217756 -76798 73207 49579 -67360
18365g6818j07107A27532b03052A53363c46975m2112J04242A28106a50058A06633
$$ -76818 -183925 127532 -203052 153363 -346975 -389087 -284845 128106 -150058 106633
18354a3287C024N9555a26895P174E3435a32107G2783K6544J23847a38416K4198
$$ -13287 3024 62579 -126895 -119721 53435 -132107 72783 99327 223174 -138416 -114218
18343a14218d9249I6780a77135A27756a64782e7997m1366o3055k35069A62284
$$ -114218 -49249 96780 -177135 127756 -164782 -57997 -99363 -162418 -397487 162284
18332a7123A66935a77530j23351d0882k35738A75275p3071A0093J12683K29125
$$ -17123 166935 -177530 -300881 -40882 -276620 175275 102204 10093 122776 351901
18322C51901D1847a08500A76469i4140G1296a11864j5274r9373K9510N1249g2457
$$ 351901 41847 -108500 176469 -94140 71296 -111864 -127138 -226511 -197001 -145752 -72457
18310A1238L34988b30361l0635m7921f7789F5667a09723B34958c75614M8092F5874
$$ 11238 346226 -230361 -260996 -308917 -67789 65667 -109723 234958 -375614 -327522 65874
18298a83229M7369A01850a20565C0031b66978F7944a68494I0184b38754A41511
$$ -183229 -135860 101850 -120565 30031 -266978 67944 -168494 90184 -238754 141511
18287a16561N3119j71068a11285B1422K81767j13701B6666a91418j71479J78380
$$ -116561 -63442 -234510 -111285 21422 303189 189488 26666 -191418 -362897 -184517
18277a84517A63535a62743B36582d45182a93343G0063a26060A74996o0972a16452
$$ -184517 163535 -162743 236582 -445182 -193343 70063 -126060 174996 114024 -116452
18266F818J15765a11196b2995C25969A1881a89239J7426c6325F9203a37310L3709
$$ 6818 122583 -111196 -22995 325969 11881 -189239 -171813 -36325 69203 -137310 -103601
18255a03601l74050a42904L9204k29277A62839h5767H5821a18736a7251E5200
$$ -103601 -477651 -142904 -103700 -332977 162839 -85767 85821 -118736 -17251 55200
18244e8286k55093g1691o2557e7202A21745a0645j10113A02764l421a79847d6638
$$ -58286 -313379 -71691 -134248 -57202 121745 -10645 -120758 102764 99343 -179847 -46638
18232A19109a2822l03437K8934E56043a66699m2486f0136c82k29417J07223B55045
$$ 119109 -12822 -316259 -287325 556043 -166699 -209185 -60136 -382 -229799 -122576 255045
18220a21147a5250H3703i6451a6932k12009j8105B86246A35012F5446J99580a78654
$$ -121147 -15250 83703 -96451 -16932 -228941 -247046 286246 135012 65446 265026 -178654
18208f1988k47295a11738k22887I9117h112C6647a72439a8449A61729a98709D8414
$$ -61988 -309283 -111738 -334625 99117 -8112 36647 -172439 -18449 161729 -198709 48414
18196a6328j00847l56394K02981k59669a30695b5317j78094B42570r6043L6432
$$ -16328 -117175 -473569 -270588 -530257 -130695 -25317 -203411 242570 146527 182959
18186A82959b6210l1014G9370J83614a17168j26215i8399k21714B45360d86845
$$ 182959 -26210 -57224 79370 262984 -117168 -243383 -98399 -320113 245360 -486845
18175i4010p875A64664f5217F8396L13900b73110o034B17847a56797F3592B0080
$$ -94010 -101885 164664 -65217 68396 382296 -273110 -279144 217847 -156797 63592 20080
18163A66397a28404m8023A02538b90715C05982I3112D1974g7926I8537d0948a7496
$$ 166397 -128404 -176427 102538 -290715 305982 93112 41974 -77926 98537 -40948 -17496
18151d6775B5312O1858i3256j9382k48095J00020k2069e7688p5978A65343g6735
$$ -46775 25312 87170 -93256 -112638 -360733 -260713 -282782 -57688 -133666 165343 -76735
18139C2576i0529l30814J44758f0994q5560L5997A71575a76322N8904a2124q2479
$$ 32576 -90529 -421343 -276585 -60994 -146554 -110557 171575 -176322 -117418 -12124 -94603
18128i4603o8348a6195k76695J24331r9819a05023M7181B35997m2803a514j225
$$ -94603 -162951 -16195 -292890 -168559 -268378 -105023 -57842 235997 193194 -1514 -2739
18117b739A85489q6587e48882B94951e8235B74906n5234H6275a59346E4619a42167
$$ -2739 185489 98902 -548882 294951 -58235 274906 219672 86275 -159346 54619 -142167
18105B77486c09831G1811h1621F9194J2721a26360m3286A05081J2500a49980f2215
$$ 277486 -309831 71811 -81621 69194 81915 -126360 -169646 105081 117581 -149980 -62215
18093A20927A8864J3264i2594B9365c17442a32098q1139N0018G1822a23976e6513
$$ 120927 18864 32128 -92594 29365 -317442 -132098 -213237 -163219 71822 -123976 -56513
18081a46205A16394A427c6762A09822b50738f5865A40895i8707j70179h6767B39900
$$ -146205 116394 1427 -36762 109822 -250738 -65865 140895 -98707 -268886 -86767 239900
18069B22437b33444l404D2022e0550Q65j60875n351j50657J66108l7169a5937
$$ 222437 -233444 -236848 42022 -50550 -49685 -210560 -215911 -366568 -200460 -237629 -15937
18057b40063i8774L5611o063j29980E7663c5572o3231m1013B43961a64208H9686
$$ -240063 -98774 -63163 -69226 -199206 57663 -35572 -98803 -139816 243961 -164208 89686
18045b1827C1522b00460G395K20600b13953M2830A14583e646j41267N327I5971
$$ -21827 31522 -200460 7395 227995 -213953 -171123 114583 -5646 -146913 -141586 95971
18033A58101G2233m78J0464l1444i2739L9696n5816A05374d1510k28750F4005
$$ 158101 72233 71755 82219 50775 -92739 -53043 -108859 105374 -41510 -270260 64005
18021A93619a87203h8488A24583L022M0372b1271K293j69062A44512a24491C7148
$$ 193619 -187203 -88488 124583 127605 167977 -21271 -18978 -188040 144512 -124491 37148
18009e31695A02505M0043F5217j923d23121F2208j3296A6576c11694f4797D3256
$$ -531695 102505 142548 65217 63294 -423121 62208 48912 16576 -311694 -64797 43256
17997D4808K94887a0171A24454K1171a10780B7237i4786A19160a53632p7883E391
$$ 44808 339695 -10171 124454 145625 -110780 27237 -94786 119160 -153632 -231515 5391
17985f8165C33631a10554o1183E8034k7762a59189B06652n1523b92823H2077b3299
$$ -68165 333631 -110554 -171737 58034 30272 -159189 206652 155129 -292823 82077 -23299
17973c94766a11218J410j42168f4765M393A81829g5212A52639K0145H5461i13
$$ -394766 -111218 -109808 -251976 -64765 -60372 181829 -75212 152639 172784 85461 -913
17961e6034C42661b47072F1769a19426N0915L330j86902g3328G9967K04184B6067
$$ -56034 342661 -247072 61769 -119426 -68511 -65181 -252083 -73328 79967 284151 26067
17949A12389Q7738Q881a60988A76337I587J29083P3808a70664j47150A94185b12795
$$ 112389 200127 209008 -160988 176337 9587 138670 212478 -170664 -317814 194185 -212795
17937a28878J78B0467O1676A294i6748a1294j18252B71610A863K495c7783J1743
$$ -128878 -128700 20467 82143 1294 -96748 -11294 -129546 271610 1863 4358 -37783 -26040
17925b6040H7401a89657C02049c3143l4212N611j70118H2724k7603L1061N2443
$$ -26040 87401 -189657 302049 -33143 -67355 -61744 -231862 82724 55121 86182 138625
17914A38625O1101J8790F6837J10313b23981c2801H0501a992B06049K1709j9090
$$ 138625 199726 218516 66837 177150 -223981 -32801 80501 -1992 206049 227758 208668
17903B08668h1262b3713N382A68155a88768N9921E8065a15548F3755b7835A2898
$$ 208668 -81262 -23713 -18331 168155 -188768 -128847 58065 -115548 63755 -27835 12898
17891A32389b92660g4200K5235F427c9324G3724c85092f6044r0069K5667a3978
$$ 132389 -292660 -74200 -48965 6427 -39324 73724 -385092 -66044 -156113 -130446 -13978
17879F22a32088O1744R150A19444i2430j18702B97445a33055j28608C3731a4662
$$ 622 -132088 -70344 -61194 119444 -92430 -211132 297445 -133055 -261663 33731 -14662
17867b31917J7469A50838a44587a9670I8981c22612A28279n9600K02666c7119
$$ -231917 -214448 150838 -144587 -19670 98981 -322612 128279 68679 271345 -37119
17856B41535D6378b96500e6482j28307B8439K36793I8806b19266j58285E755J85719
$$ 241535 46378 -296500 -56482 -184789 28439 265232 98806 -219266 -377551 5755 191474
17845A91474F336L05911r928d8834a3045l51669a17427k4204B93869a00629I9428
$$ 191474 6336 312247 302319 -48834 -13045 -364714 -117427 -141631 293869 -100629 99428
17833h9549J230j55213M8824r4800a15491A70672f3945j25178A92831a39865j48393
$$ -89549 -88319 -243532 -194708 -289508 -115491 170672 -63945 -189123 192831 -139865 -288258
17822b88258E4721e3224j18586p6386A01603P4877f67j65550K5299j3417q4991
$$ -288258 54721 -53224 -171810 -248196 101603 176480 -667 -166217 -140918 -154335 -239326
17811b39326B11587D2490J0330a2224A6138J30920a4460B42089q9379e6852k51759
$$ -239326 211587 42490 52820 -12224 16138 147058 -14460 242089 152710 -56852 -308611
17800c08611B55143a5856k92749C7332b5542q2206B69256K34163A35065F3219
$$ -308611 255143 -15856 -308605 37332 -25542 -107748 269256 503419 135065 63219
17789a66709a3281A01948a06918j78184N9680h1950A07069G368i9061k4176D30852
$$ -166709 -13281 101948 -106918 -285102 -225422 -81950 107069 7368 -99061 -123237 430852
17777A62630b61412L7746C10664A29751b67333A33598Q4531D080K09600a91389
$$ 162630 -261412 -223666 310664 129751 -267333 133598 218129 4080 213680 -191389
17766H6381e2452k3684M883l03498j69A09000c69125e1116p6639d9749k01448
$$ 86381 -52452 -76136 -71253 -374751 -374920 109000 -369125 -51116 -127755 -49749 -251197
17755b51197D9995N8621F858J98614C6416J40522o0619h0122A42720k095C3976
$$ -251197 49995 108616 6858 205472 36416 176938 116319 -80122 142720 140625 33976
17743A6587c31699a0532A72811g8627A96932b2838A36816M7884h2728j07839b3260
$$ 16587 -331699 -10532 172811 -78627 196932 -22838 136816 184700 -82728 -190567 -23260
17731C59769c4700A48795i9865l5319j1360A98431e4997A82322b59318k3749C78576
$$ 359769 -34700 148795 -99865 -135184 -146544 198431 -54997 182322 -259318 -283067 378576
17719C2977O8940b45172e0490j54778A92330E4531K28669f6360A11250a60722
$$ 32977 101917 -245172 -50490 -205268 192330 54531 283200 -66360 111250 -160722
17708B87728a42483j36803A60392a13129p781A36240j7198a58407c6572k835p090
$$ 287728 -142483 -279286 160392 -113129 -120910 136240 119042 -158407 -36572 -39407 -46497
17697d6497l7301A42686D8933K52494a41207a5951B5679a19081B03124R3621a61417
$$ -46497 -83798 142686 48933 301427 -141207 -15951 25679 -119081 203124 296745 -161417
17685a63451A22758L6244M20375f5088j22771A77442J17301d616C1429a58313
$$ -163451 122758 159002 579377 -65088 -187859 177442 294743 -4616 31429 -158313
17674a17595j49342d9133B18036c37131q657A29952l2519a0956p9938A71267D2908
$$ -117595 -266937 -49133 218036 -337131 -345788 129952 97433 -10956 -90894 171267 42908
17662b29221I921d1284E824a8738j20233p7112A40613j5354L55817a05676j914
$$ -229221 9921 -41284 5824 -18738 -138971 -216083 140613 125259 481076 -105676 -107590
17651a07590B7387J61237n4161B776L91816A4197J50114Q359J7427G6319a09885
$$ -107590 27387 188624 134463 2776 394592 14197 164311 172670 190097 76319 -109885
17639A60904a54059c3777F0475J37690c6970j26057C07482j11203K3238b3438
$$ 160904 -154059 -33777 60475 198165 -36970 -163027 307482 196279 219517 -23438
17628C50189b16522D9464M60b93341a02559L0427B02343j01019a27996A75312
$$ 350189 -216522 49464 49924 -293341 -102559 -72132 202343 101324 -127996 175312
17617c9918j04899lA17120a99277k1928E3820a78731K3397H348J60912a93663
$$ -39918 -144817 -144820 117120 -199277 -221205 53820 -178731 -155334 8348 169260 -193663
17605b14228i0108l567A00860J50829M3103e7605A07647l3987Q4789B2339K10089
$$ -214228 -90108 -93675 100860 251689 294792 -57605 107647 73660 158449 22339 232428
17594B32428B050J08731R8803L603b60122j7617e132k49959a12953j12158p0153
$$ 232428 2050 110781 209584 213187 -260122 -277739 -5132 -255091 -112953 -225111 -295264
17583b95264R8193C2134P6038J0474J05570a37447E3931N4908J5667E0175Q7586
$$ -295264 -197071 32134 108172 118646 224216 -137447 53931 108839 124506 50175 137761
17572A37761K69421g4417H5792B8312j2771J37005c8152A39405L3330D5531c41086
$$ 137761 407182 -74417 85792 28312 15541 152546 -38152 139405 172735 45531 -341086
17560A49914R6635a52657b50o2618E7823g7378j82954C03191F2109M9061c4525
$$ 149914 246549 -152657 -250 -62868 57823 -77378 -260332 303191 62109 111170 -34525
17548a53115b7930A03057Q0460g2262F21106A53540k864J45666a28078B34978
$$ -153115 -27930 103057 183517 -72262 621106 153540 150676 296342 -128078 234978
17537C50318F8911a06745A46061k3105A3342J24433a39568B43147K02730a13205
$$ 350318 68911 -106745 146061 122956 13342 137775 -139568 243147 445877 -113205
17526a19457H4034K338e1035K0781j20552B27623H6532L5939j1679J02070l9925
$$ -119457 84034 86372 -51035 -30254 -150806 227623 86532 122471 110792 212862 172937
17515A72937J31403h4874C2613J054h8127A95429b20802C10616A00666h0293A18765
$$ 172937 304340 -84874 32613 33667 -88127 195429 -220802 310616 100666 -80293 118765
17503a34209B58406M9707D0825J98274h6209d2674C96134A58288b59712B4877
$$ -134209 258406 308113 40825 239099 -86209 -42674 396134 158288 -259712 24877
17492b6614C3283e8843j92669B24895H5944D0129c1267J1695E5601k4535L42584
$$ -26614 33283 -58843 -251512 224895 85944 40129 -31267 -19572 55601 31066 373650
17481C73650A76940Q5335C8381J98819b6053C7695d1524D0942J00596J12470J25288
$$ 373650 176940 262275 38381 237200 -26053 37695 -41524 40942 141538 254008 379296
17470C79296C1224J60724i1859B29616q5906L66518b383A88174J32530G5957P2772
$$ 379296 31224 191948 -91859 229616 143710 510228 -2383 188174 320704 75957 148729
17459A48729C3693M8466K46435A08444E1205K13158C7688K60795N9142e7915b6698
$$ 148729 33693 82159 328594 108444 51205 264363 37688 298483 357625 -57915 -26698
17447F6459A6538M9773a5169A7619M61369A27283J27345k8619q8790m885K32266
$$ 66459 16538 66311 -15169 17619 478988 127283 254628 226009 137219 132334 364600
17436C64600J5507G0928j5401N43740f0613E1513K66652m0707F3519M56869B41669
$$ 364600 380107 70928 55527 599267 -60613 51513 318165 277458 63519 520388 241669
17424C17696j50330K44254I3355K00422Q7614N4516f9369C90559E6348J38830
$$ 317696 167366 411620 93355 293777 381391 435907 -69369 390559 56348 195178
17414A95178J05179J39770A27872H836L22442j13759p7031J47529k3541l3678
$$ 195178 300357 440127 127872 8836 331278 217519 140488 288017 264476 230798
17404B30798r5814J29014p1383E5416L36046r3772H3621J72220g2590I6054A7397
$$ 230798 134984 263998 192615 55416 391462 297690 83621 255841 -72590 96054 17397
17392h9102A51996N1546G0011J09583e420A21075J45926a13579B45820F4536P4951
$$ -89102 151996 203542 70011 179594 -5420 121075 267001 -113579 245820 64536 139487
17381A39487P0852J75764I9857K02271p5147c6367C51311j16832B2480K98260
$$ 139487 210339 386103 99857 302128 226981 -36367 351311 234479 22480 320740
17371C20740H170L6875J62444g6331m07864D5877a0302B10059C0626J65156J27192
$$ 320740 8170 45045 207489 -76331 -484195 45877 -10302 210059 30626 195782 322974
17360C22974o7330J94794G5603l6308L42349a22360B5808O6185B4226J71742L6011
$$ 322974 255644 450438 75603 39295 381644 -122360 25808 91993 24226 195968 231979
17349B31979E7488L00189I7306f6489B72600n7332H006J81480A5640h068j45851
$$ 231979 57488 357677 97306 -66489 272600 215268 8006 189486 15640 -8068 -153919
17338a53919a6071D44077j40685n7513A9237J29884f4336O375B30552j14802J72179
$$ -153919 -16071 444077 303392 245879 19237 149121 -64336 -57961 230552 115750 287929
17327B87929M3706j41490m6108J74652b16035A45138D8371K53321j30197n3261
$$ 287929 331635 190145 144037 318689 -216035 145138 48371 301692 171495 118234
17317A18234O914J90919P0730i4561c2904A6665J37862J39271j32683K44046A94161
$$ 118234 125148 316067 386797 -94561 -32904 16665 154527 293798 161115 405161 194161
17305a22344D54569I0132K81314b5716P378H7606R3900a88755I1491e4726A11321
$$ -122344 454569 90132 371446 -25716 -18338 87606 181506 -188755 91491 -54726 111321
17293D8645J09945b343G6052K84642N1849A36559P8261j04753K5673J68142P9684
$$ 48645 158590 -2343 76052 360694 412543 136559 214820 110067 135740 303882 383566
17282C83566c6759A43070h3248B07549B8374J93016f2440k2159B54920N3468E7218
$$ 383566 -36759 143070 -83248 207549 28374 221390 -62440 -84599 254920 308388 57218
17270H2669R7642J67550A38814K81407I3293g7151A94555p4384M3821Q8615b525
$$ 82669 180311 347861 138814 420221 93293 -77151 194555 120171 163992 252607 -2525
17258A89995L5372h1473n3251N6850A82663H8272K90185A86670f1038B47635p966
$$ 189995 225367 -81473 -134724 -77874 182663 88272 378457 186670 -61038 247635 239669
17247B39669b12480A65395f1093a7505D21148J0460A19995k8721q204e8171B29385
$$ 239669 -212480 165395 -61093 -17505 421148 431608 119995 91274 83070 -58171 229385
17235B8326M14096k04797J47071a21895C7925L51935A79765a27296I8443i3455
$$ 28326 442422 237625 384696 -121895 37925 389860 179765 -127296 98443 -93455
17224A53163M17211h5046B56732L23432B31714n2233J55555a12963C23776j50993
$$ 153163 570374 -85046 256732 580164 231714 179481 335036 -112963 323776 172783
17214A72783J2728a3770C92486f586D8802a45916B80266l1717o6788J81883A13213
$$ 172783 185511 -13770 392486 -6586 48802 -145916 280266 248549 181761 363644 113213
17202A99161J37111e5176A32336N176J90900p79A61975D6047L78137B02699o0113
$$ 199161 336272 -55176 132336 137512 328412 327633 161975 46047 424184 202699 142586
17191A42586K00420n9414L7063P812p8621P8851R0515M4075k22109j03678J60582
$$ 142586 343006 283592 320655 328467 249846 328697 419212 463287 241178 137500 298082
17180B98082l4915J57498j77141r0151E4878K03558a11692A59060l8310O6243
$$ 298082 263167 420665 243524 153373 54878 258436 -111692 159060 120750 186993
17170A86993N1056J41071M0600F1344K19439k5606o5715P09003i0809A98543k0488
$$ 186993 238049 379120 419720 61344 280783 255177 189462 898465 -90809 198543 178055
17159A78055K32415L3833n8187L67287B52560g5341E06864A71324J53137J47137
$$ 178055 410470 444303 386116 753403 252560 -75341 506864 171324 324461 471598
17149D71598c7643C45172M9890a43578C07412q0810N3083A38432L26223B7820
$$ 471598 -37643 345172 395062 -143578 307412 226602 279685 138432 464655 27820
17138C84580M0655H8659P2312G1N0911A1595K99973l4051N5616H3315J60661N0045
$$ 384580 425235 88659 160971 71 50982 11595 311568 277517 333133 83315 243976 294021
17126B94021M6263K19439B6685L09444J70538A65564J67020j48571j1626N01464
$$ 294021 340284 559723 26685 336129 506667 165564 332584 184013 172387 673851
17116F73851f8576E17537N1436k09413J95788j35943E0576K05444J69272B07851
$$ 673851 -68576 517537 568973 359560 555348 419405 50576 256020 425292 207851
17105G3079L22639L6097A69026o3656K60039k466o1252L681J42086n5872j15634
$$ 73079 395718 431815 169026 105370 365409 362943 301691 305372 447458 391586 275952
17094B75952J67450n9250K93525A86048L39839o4445M5183B43411K23756A96205
$$ 275952 443402 384152 677677 186048 525887 461442 506625 243411 467167 196205
17083D70863j70069o5430G0523Q6058J80837A62738K17617K00379A69169K52075
$$ 470863 300794 235364 70523 156581 337418 162738 380355 580734 169169 421244
17073D21244M3295P7j56502l7199L30920j76319k5025Q5545K59590H5349M95700
$$ 421244 464539 464616 308114 270915 601835 425516 400491 486036 745626 85349 581049
17062E81049j74938j13153k4403L85715J09500l01360p3028K9918k6603K89430
$$ 581049 406111 292958 268555 654270 763770 462410 389382 419300 392697 682127
17052F82127p7846o7771K5388J0755A02613K42969N4343J45517j39287K48335
$$ 682127 604281 536510 561898 572653 102613 345582 399925 545442 406155 654490
17042F54490j76279j46463L4036K07781J60596C66063N5794R7951J99342B15044
$$ 654490 478211 331748 365784 573565 734161 366063 421857 519808 719150 215044
17031D53958L0718j37559j01194K29562M5151r9326p1483L25523m0344k47756
$$ 453958 484676 347117 245923 475485 520636 421310 349827 675350 635006 387250
17021C87250J95959J14462j94421p9485K30015l4926j39775J62520l16561P0499
$$ 387250 583209 697671 503250 423765 653780 618854 479079 641599 325038 395537
17011C95537L47940l33120O6625r8111K09147p6351J87990j18157K22193j29960
$$ 395537 743477 410357 476982 378871 588018 511667 699657 581500 803693 673733
17001F73733Q541j8496k54850K2445L23091B47947K95660Q9274o345R2035J80242
$$ 673733 682274 663778 408928 431373 754464 247947 543607 632881 626536 718571 898813
16990H98813l92593K35187L4712J0962L6851o5148l02074J06205B56976N47722
$$ 898813 506220 741407 776119 787081 823932 758784 456710 562915 256976 804698
16980H04698j43312j80806K19101K74846l86875L54425C15211K55652J88556j77432
$$ 804698 661386 480580 699681 974527 587652 942077 315211 570863 759419 581987
16970E81987K61801J54301j86623L25850n55652j61047J81757L92538L4383K05841
$$ 581987 843788 998089 811466 1137316 581664 420617 602374 994912 1029295 1235136
16960A235136k41904j22180K74242l99265L21053J19482m50592k8806K04051J2242
$$ 1235136 993232 871052 1145294 746029 1067082 1186564 735972 707166 911217 923459
16950I23459r7068l2576J50253K11991m36338K41506j51536J36106K27643j13145
$$ 923459 826391 793815 944068 1156059 719721 961227 809691 945797 1173440 1060295
16940A060295J06734k02328k2067l1073L00901j98255O0109L2060q5716J4691
$$ 1060295 1167029 964701 942634 911561 1212462 1014207 1074316 1106376 1020660 1035351
16930A035351j82028L46484j85106J04296j58554M84856m32369J53894k10618
$$ 1035351 853323 1199807 1014701 1118997 960443 1445299 1012930 1166824 956206
16921I56206j31383J61820P2499K72853q8362r6637j09749L34597k59200M0257
$$ 956206 824823 986643 1059142 1331995 1243633 1146996 1037247 1371844 1112644 1152901
16911A152901K21683n3144M69714k06446k96120N9130j77693J95844K99724j78223
$$ 1152901 1374584 1321440 1791154 1584708 1288588 1347718 1170025 1365869 1665593 1487370
16901A487370q0566j6415j90898J87131L4239j34596L84189l39450L44407O190
$$ 1487370 1406804 1390389 1199491 1386622 1420861 1286265 1670454 1331004 1675411 1681601
16891A681601k68366J49551j2059J0796L18885o99758K28401R2468N8028L4369
$$ 1681601 1413235 1562786 1550727 1561523 1880408 1180650 1409051 1501519 1559547 1593916
16881A593916J20744j10751J65096M32282p1482r1258l04117Q6402J00345l84845
$$ 1593916 1714660 1603909 1769005 2201287 2129805 2038547 1734430 1820832 1921177 1536332
16871A536332O61735k38472n5535K49457j84619k8176J19760K11164q9474K35423
$$ 1536332 2198067 1959595 1904060 2153517 1968898 1940722 2060482 2271646 2182172 2417595
16861B417595j90870K71156l23835L93397k91615J30830j12435J08010J7579K6558
$$ 2417595 2226725 2497881 2174046 2567443 2275828 2406658 2294223 2402233 2419812 2446370
16851B446370J44577N3239L54008l79337m07429N53711q8200L05524o8087j49755
$$ 2446370 2590947 2644186 2998194 2618857 2211428 2765139 2676939 2982463 2914376 2764621
16841B764621P1172J37517p4280K43158K0437K28361m73029K53187J98581k17661
$$ 2764621 2835793 2973310 2899030 3142188 3162625 3390986 2917957 3171144 3369725 3152064
16831C152064O02758k10390j82961M5521K62173J04947l5636j4540J94809J4478
$$ 3152064 3754822 3544432 3361471 3406992 3669165 3774112 3738476 3723936 3918745 3933223
16821C933223J8108J97199l27501K68136P0701K26408K26741R604j78445L62872
$$ 3933223 3951331 4148530 3821029 4089165 4159866 4386274 4613015 4622619 4444174 4807046
16811D807046J43502j13616K14490M3735N3122J07168J32869M28881j78319J64468
$$ 4807046 4950548 4836932 5051422 5095157 5148279 5255447 5388316 5817197 5638878 5803346
16801E803346K3819j18113K74207m809M73638j14415N27773J88440J15172N0882
$$ 5803346 5827165 5709052 5983259 5978450 6452088 6337673 6865446 7053886 7169058 7219940
16791G219940j13410R5825M13747J26676K46003J97959J01149K90877J44208K54227
$$ 7219940 7106530 7202355 7616102 7742778 7988781 8186740 8287889 8578766 8722974 8977201
16781H977201J70936K11751K99142K26708L39821R0217J37264L49647K63533M11726
$$ 8977201 9148137 9359888 9659030 9885738 10225559 10315776 10453040 10802687 11066220 11477946
16771A1477946M81147L45336k205M72160O59072J69970M46623M12640O15389Q15820
$$ 11477946 11959093 12304429 12302224 12774384 13433456 13603426 14050049 14462689 15078078 15893898
16761A5893898M226P62522L98797R88544K24601O53686R00588O44975Q53536O60683
$$ 15893898 15898124 16660646 17059443 18047987 18272588 18926274 19826862 20471837 21325373 21986056
16751B1986056P97619N53826R56450P69117J553688J004787Q16465J410039J306944
$$ 21986056 22783675 23337501 24293951 25063068 26616756 27621543 28438008 29848047 31154991
16742C1154991J258967J530020J872326J299381J819285J815594J936442K134575
$$ 31154991 32413958 33943978 35816304 37115685 38934970 40750564 42687006 44821581
16734D4821581K194943K644531K243352L182793K786975K790850L716354L704486
$$ 44821581 47016524 49661055 51904407 55087200 57874175 60665025 64381379 68085865
16726F8085865M049963L792406M252235M940885N146683N155466N947518N662561
$$ 68085865 72135828 75928234 80180469 85121354 90268037 95423503 101371021 107033582
16718A07033582O272047O927424O439261P253950O885900P178937P321177O783715
$$ 107033582 113305629 120233053 126672314 133926264 140812164 147991101 155312278 162095993
16710A62095993O787845O471193N890034N196801M360187K997690K065241O44124
$$ 162095993 168883838 175355031 181245065 186441866 190802053 193799743 195864984 196509108
16702A96509108k47598j554033k826458l662340m703047o055862o440390o576720
$$ 196509108 196261510 194707477 191881019 188218679 183515632 177459770 171019380 164442660
16694A64442660p110326p420559p665488p248924p215716p059577o864201o403295
$$ 164442660 157332334 149911775 142246287 134997363 127781647 120722070 113857869 107454574
16686A07454574o247673o020244n266729n352842n155433m603921m093644m048205
$$ 107454574 101206901 95186657 89919928 84567086 79411653 74807732 70714088 66665883
16678F6665883l873736l413470l445597k932029k889240k516757k607381j897550
$$ 66665883 62792147 59378677 55933080 53001051 50111811 47595054 44987673 43090123
16670D3090123k519008k145585j659718k004819j600930j258003j432250j410459
$$ 43090123 40571115 38425530 36765812 34760993 33160063 31902060 30469810 29059351
16662B9059351j399925j058384j193934o69289j312900q36246q67984q62318r00078
$$ 29059351 27659426 26601042 25407108 24737819 23424919 22588673 21720689 20858371 19958293
16653A9958293q95628l08535q29653q22478n21848n01572k85210q10571m21578
$$ 19958293 19062665 18754130 17924477 17101999 16580151 16078579 15793369 14982798 14561220
16644A4561220n62179k25400m85375q90267K95718o71698m18836k68016k91874
$$ 14561220 13999041 13773641 13288266 12397999 12693717 12022019 11603183 11335167 11043293
16635A1043293l31018n25225k79596k17285j88672l30469l70869O264o0089m06140
$$ 11043293 10712275 10187050 9907454 9690169 9501497 9171028 8800159 8806423 8746334 8340194
16625H340194j27398l57150j68645k70339k89736m5713l24930k11432K75541O0736
$$ 8340194 8212796 7855646 7687001 7416662 7126926 7081213 6756283 6544851 6820392 6881128
16615F881128l16970n9554n30223P2228j33282l39954J18972k32055l00993K71136
$$ 6881128 6564158 6504604 5974381 6046609 5913327 5573373 5692345 5460290 5159297 5430433
16605E430433k05086m33821K65634l26881j9818j99054l1095q4697q0252j19211
$$ 5430433 5225347 4791526 5057160 4730279 4710461 4511407 4480312 4395615 4315363 4196152
16595D196152m9601L444j29294l79847L04427o79380L62161p8488J21298j02347
$$ 4196152 4146551 4149995 4020701 3640854 3945281 3265901 3628062 3549574 3670872 3568525
16585C568525p8857r855j92770J50570k24335L8404j22979M4607N9722m12614
$$ 3568525 3489668 3479813 3287043 3437613 3213278 3251682 3128703 3173310 3233032 2820418
16575B820418K13206m34047L1393K0229J90715k33593M87472l81980k55554K0281
$$ 2820418 3033624 2599577 2630970 2651199 2841914 2608321 3095793 2713813 2458259 2478540
16565B478540L10J50794k15949l1083l5362k41540N6026J36101r6346j51120K90736
$$ 2478540 2478850 2629644 2413695 2382612 2347250 2105710 2161736 2297837 2201491 2050371 2341107
16554B341107k41708k3296K99755m28585J50352k11460J73856k83937K66258j33840
$$ 2341107 2099399 2076103 2375858 1947273 2097625 1886165 2060021 1776084 2042342 1908502
16544A908502p0122j06181n4278J1488J93450m6328O0036l01808L64870k97473
$$ 1908502 1838380 1732199 1677921 1689409 1882859 1836531 1896567 1594759 1959629 1662156
16534A662156J67828k65939j25701M22931k88636R5939o9316J6263l76807K99967
$$ 1662156 1829984 1564045 1438344 1861275 1572639 1668578 1599262 1615525 1238718 1538685
16524A538685k98383K81054j20825R125j45241L8541K49230k40217J40655m47129
$$ 1538685 1240302 1521356 1400531 1409656 1264415 1302956 1552186 1311969 1452624 1005495
16514A005495K47756p0627J70258k40341M00210l55661j264l8110J83521j65417
$$ 1005495 1253251 1182624 1352882 1112541 1512751 1157090 1155826 1117716 1301237 1135820
16504A135820J98070n11155L24673J19418R7719o68598L87259j33916M07200N383
$$ 1135820 1333890 822735 1147408 1266826 1364545 695947 1083206 949290 1356490 1361873
16494A361873m84658Q4490J04272n9410l3686K05487r4279j96850j28460P3747
$$ 1361873 877215 961705 1065977 1006567 972881 1178368 1084089 887239 758779 832526
16484H32526J80127J24836m68078L48454k93094p8078J69363M5340j01061j93513
$$ 832526 1012653 1137489 669411 1017865 724771 646693 816056 861396 760335 566822
16474E66822R4166L09523j24839N825J42620J81813j22982k9449E00151L31641
$$ 566822 660988 970511 845672 851497 994117 1175930 1052948 1023499 500151 831792
16464H31792C47258L21878Q2899C14910K99797J82984m7647K5250m9479K70535
$$ 831792 347258 669136 752035 314910 614707 797691 750044 775294 725815 996350
16454I96350k26098K6907l94184N05669j47240r059k77205P0968j33581M50354
$$ 996350 770252 797159 402975 908644 761404 752345 475140 546108 412527 862881
16444H62881l59712q0511K98500j35599L04505j67980J44570l79053O9905K30909
$$ 862881 503169 422658 721158 585559 890064 722084 866654 487601 557506 788415
16434G88415l38252J12663K19334k16926N6026j84516L95767m01332j80608K65960
$$ 788415 450163 562826 782160 565234 621260 436744 832511 431179 250571 516531
16424E16531m716J86514j91276M0748J36549j98811j53858N50062k70957o6264
$$ 516531 511815 698329 507053 547801 684350 485539 331681 881743 610786 544522
16414E44522j88000O7561R4406J40398k24767J94197B94947K79264k00113J98573
$$ 544522 356522 424083 518489 658887 434120 628317 294947 574211 374098 572671
16404E72671r3555M2907j21102K1963j66888K35025Q5614q85k6351k38393L75918
$$ 572671 479116 522023 400921 422884 255996 491021 576635 575750 549399 311006 686924
16393F86924q9754k45657j12185J64444J54416Q8503B50149O40877C18428K38545
$$ 686924 597170 351513 239328 403772 558188 646691 250149 891026 318428 556973
16383E56973r5211j68245J62493j95592K98080j49993j47252A24476N15758l11027
$$ 556973 461762 293517 456010 260418 558498 408505 261253 124476 640234 329207
16373C29207p1892K68899I1524b7231C0566J31051J32415j00079J95128k1615
$$ 329207 257315 526214 91524 -27231 30566 161617 294032 193953 389081 367466
16363C67466O9922r3883l1167M5988J45348j02461o2027n162K86079l09333J88860
$$ 367466 437388 343505 312338 358326 503674 401213 339186 334024 620103 310770 499630
16352D99630b50235C63943e5545D52275j23633K03800I3533J70939r437K83314
$$ 499630 -250235 363943 -55545 452275 328642 532442 93533 264472 255035 538349
16342E38349l1774a65911D40490F6646N00815I8774L79313J98615B22524C8893
$$ 538349 506575 -165911 440490 66646 567461 98774 478087 676702 222524 38893
16331C56588K2208o0484j39919J99819I6091K84444h2366A07710O4807J42855
$$ 356588 378796 318312 178393 378212 96091 380535 -82366 107710 172517 315372
16321C15372n5009R4454J42924k18455Q4779j9900q2967M9686A2002L02700J5213
$$ 315372 260363 354817 497741 279286 364065 344165 261198 310884 12002 314702 329915
16310C29915j40783O4078p8000e5134D56998j60848j12610q7012K01292K911B4852
$$ 329915 189132 253210 175210 -55134 456998 296150 183540 96528 297820 300731 24852
16298D4838a10328k3827C88732K28395B50803A11383p80O3945k9028k1296L29821
$$ 44838 -110328 -134155 388732 617127 250803 111383 110603 174548 145520 124224 454045
16287D54045e381B56196M0322n1084j05790B9230f547H325b0133B98001L1755
$$ 454045 -5381 256196 296518 245434 139644 29230 -6547 8325 -20133 298001 329756
16276C29756j63709L3186A9487b9758n6987A50379J04305a1983B47051B2016M17796
$$ 329756 166047 199233 19487 -29758 -86745 150379 254684 -11983 247051 22016 439812
16265D39812j83660k4676n7129O2769O0314O1695A59568L7589G6589b79105A99078
$$ 439812 256152 231476 174347 237116 297430 359125 159568 197157 76589 -279105 199078
16253D53234i7713C05070D9141J35995e6928r5938b2945F4399K52862g2523A46853
$$ 453234 -97713 305070 49141 185136 -56928 -152866 -22945 64399 317261 -72523 146853
16241C69687C4465a12751N534B05266C0783Q7140P2330K4696e9174A30417p004
$$ 369687 34465 -112751 -107217 205266 30783 117923 190253 214949 -59174 130417 123413
16230A23413j4357J05361M2475A10012l6694J27965j6109I680K63729h4756B33074
$$ 123413 109056 214417 256892 110012 73318 201283 185174 9680 273409 -84756 233074
16218a24800A8072a69958A23154k2927Q469B3026i8864B63015i6732e73D16544
$$ -124800 18072 -169958 123154 100227 108696 23026 -98864 263015 -96732 -573 416544
16206H4893L06383K3226j71698a25269l11655E53874H9949K08936j7473D9328
$$ 84893 391276 414502 242804 -125269 -436924 553874 89949 298885 281412 49328
16195C22113A4160J51505J69130D456J62747e0204D54044f2481A56830B9390g1308
$$ 322113 14160 165665 334795 4456 167203 -50204 454044 -62481 156830 29390 -71308
16183G0641l3668i7805m3438k2006A9784a82278g0932B75799K796F7188K27679
$$ 70641 36973 -97805 -141243 -163249 19784 -182278 -70932 275799 278595 67188 294867
16172B94867f7601l89432B00847k5093d7586k27673A91237a48087E0289a97288
$$ 294867 -67601 -457033 200847 175754 -47586 -275259 191237 -148087 50289 -197288
16161B08633j8394B4123L56634a76137O8073i185j41929A25295a07949E0542b88799
$$ 208633 190239 24123 380757 -176137 -108064 -9185 -151114 125295 -107949 50542 -288799
16149b9931j69965A07073M6130a17643B02742G9563c92495C01416a9840k777A52530
$$ -29931 -199896 107073 153203 -117643 202742 79563 -392495 301416 -19840 -22617 152530
16137f3186J7650p311G2469K34926j49199a44043c2111A02572j4525R7014J46087
$$ -63186 -45536 -52847 72469 307395 158196 -144043 -32111 102572 88047 185061 331148
16126C31148i653q306B52868a90922E7106a6586k9990B16229D8359J07929a11768
$$ 331148 -9653 -17959 252868 -190922 57106 -16586 -46576 216229 48359 156288 -111768
16114a21725a0408C2094J41248p5412J32156G5059a52908A40728a01092A83731
$$ -121725 -10408 32094 173342 97930 230086 75059 -152908 140728 -101092 183731
16103A1055J7668M02029f4984A97962b31701B83545A18924J282B4601M0809a0048
$$ 11055 28723 430752 -64984 197962 -231701 283545 118924 120206 24601 65410 -10048
16091A7597a21506B4640J90380K13073A07723m5641K64016A7309J928L37051c78757
$$ 17597 -121506 24640 215020 428093 107723 62082 326098 17309 19237 356288 -378757
16079b12123B8698K8726A492c7059D8806L9790J18075e1975C4206g2597A57770
$$ -212123 28698 57424 1492 -37059 48806 88596 206671 -51975 34206 -72597 157770
16067A16900M09723B47958h8612N653p3076a4103D1945M1015r837g4761j15032
$$ 116900 526623 247958 -88612 -82959 -156035 -14103 41945 82960 73123 -74761 -189793
16056a89793g467n84337a9439j5708D22721j76501a96788b9051O9l30204a17456
$$ -189793 -7467 -591804 -19439 -35147 422721 246220 -196788 -29051 -28982 -359186 -117456
16044b29787A71037f151K45A79368l4027E2607J59261b33729m4055N7401g8882
$$ -229787 171037 -6151 -5906 179368 145341 52607 211868 -233729 -277784 -220383 -78882
16032F753b18431p6589A25803i9770j8579C30965q207E547J47822c11137A26845
$$ 6753 -218431 -295020 125803 -99770 -118349 330965 322758 5547 153369 -311137 126845
16020E3658b31656B38500h2621J686j7446k1873A01681b4049A67078M4285K25786
$$ 53658 -231656 238500 -82621 -80935 -98381 -120254 101681 -24049 167078 211363 437149
16009D37149j59284b50821C9534K884e3085A46112a9281k10427N7765f582n6800
$$ 437149 277865 -250821 39534 42418 -53085 146112 -19281 -229708 -171943 -6582 -63382
15998f3382A13329L74055d32454O6278C7114N736a34823C0065h1454A6872a23402
$$ -63382 113329 487384 -432454 -366176 37114 42850 -134823 30065 -81454 16872 -123402
15986B15097b84452B17166f6580E7399a91518r3617f7582A03628j3856b04979
$$ 215097 -284452 217166 -66580 57399 -191518 -285135 -67582 103628 89772 -204979
15975D2700L65896A36407a14228H1733B2095P1973K64973C9037a10175H371J69378
$$ 42700 408596 136407 -114228 81733 22095 94068 359041 39037 -110175 8371 177749
15964A77749b58918A57119m1313D5862a88241k10416c8669l32187E7485A8821
$$ 177749 -258918 157119 115806 45862 -188241 -398657 -38669 -370856 57485 18821
15953a36337o3262E0613i2918m9756E1250f5626A33803D48J16811a53128k19792
$$ -136337 -199599 50613 -92918 -142674 51250 -65626 133803 448 117259 -153128 -372920
15942c72920a71123r3485R090g2034I9475b05559b6855E810a78161j27707A74139
$$ -372920 -171123 -264608 -255518 -72034 99475 -205559 -26855 5810 -178161 -305868 174139
15930A7373f8397l15598d3001j15771A58017a041A85602B6361c0159r9276A5278
$$ 17373 -68397 -383995 -43001 -158772 158017 -1041 185602 26361 -30159 -129435 15278
15918a27612j72588N7495r7917J12126A89278a57820e9374C33224G3405j9997
$$ -127612 -300200 -242705 -340622 -228496 189278 -157820 -59374 333224 73405 53408
15908E3408d9406k06806J24201I0066a19737j92429G7916C2256a56210r2007j6007
$$ 53408 -49406 -256212 -132011 90066 -119737 -312166 77916 32256 -156210 -248217 -264224
15897b64224B67428b0476F8430c9059A29906K574D6796c65115J69591e2182B32980
$$ -264224 267428 -20476 68430 -39059 129906 132480 46796 -365115 -195524 -52182 232980
15885H1319R423a08084B87213H7871b387r9652A17756J90144b01702q3253H7639
$$ 81319 90742 -108084 287213 87871 -2387 -102039 117756 307900 -201702 -284955 87639
15873H9223b07226J9798P5364B13487a37876B85233a61082A73986f7646j36408
$$ 89223 -207226 -187428 -112064 213487 -137876 285233 -161082 173986 -67646 -204054
15863b04054j15336j22029a43350P715L206B30114i7098l1467n5262A52393A5464
$$ -204054 -319390 -441419 -143350 -135635 -132429 230114 -97098 -128565 -183827 152393 15464
15851c593A80311f4093c580q5481p8529A31625o0329a24739E423J5650h5047J4520
$$ -3593 180311 -64093 -3580 -89061 -167590 131625 71296 -124739 5423 21073 -85047 -70527
15839g0527m6812q0693K9943C69106d5874A16052P2827a11209f340B16075a15340
$$ -70527 -117339 -198032 -168089 369106 -45874 116052 188879 -111209 -6340 216075 -115340
15827H7355b90073B15282p4592a60286M6201C1209R4707a75147n0848j96161A21655
$$ 87355 -290073 215282 140690 -160286 -114085 31209 125916 -175147 -225995 -422156 121655
15815B21785a49578q565B07596i4539B0315J41775k1436b50769h7801k84876P2091
$$ 221785 -149578 -158143 207596 -94539 20315 162090 140654 -250769 -87801 -372677 -300586
15804c00586D0557M9854c6298n2733n1416n3008k06803c9391D5453a50688H5438
$$ -300586 40557 90411 -36298 -89031 -140447 -193455 -400258 -39391 45453 -150688 85438
15792C1757a58127c3473J974B495b74601K8165J6583I3134M2990a24592B10046
$$ 31757 -158127 -33473 -31499 2495 -274601 -246436 -229853 93134 136124 -124592 210046
15780b95604f2509m34132A77795p0618g560C1687M6430b35646R608a9364k93008
$$ -295604 -62509 -496641 177795 107177 -7560 31687 78117 -235646 -226038 -19364 -312372
15769c12372A79660d586r7306A07244K34302b48170A4739K07R2493a08755B29407
$$ -312372 179660 -4586 -101892 107244 341546 -248170 14739 14946 107439 -108755 229407
15757A90762a43425r1139A46584N3472D7539a9514q5764g525j27110j19704A8397
$$ 190762 -143425 -234564 146584 200056 47539 -19514 -105278 -7525 -134635 -254339 18397
15745a17120b5633h671j45870r8439b5957A42399B9766c6331E0737q692h4225
$$ -117120 -25633 -8671 -154541 -252980 -25957 142399 29766 -36331 50737 42045 -84225
15733A65322c52963a00601A6467K00783c32437a55890N6239A85250M7932o5572
$$ 165322 -352963 -100601 16467 217250 -332437 -155890 -99651 185250 233182 167610
15723A67610M2799d25062a96175b3398A9429K55165a57027B29353i1852C07184
$$ 167610 210409 -425062 -196175 -23398 19429 274594 -157027 229353 -91852 307184
15712h1719o3905A22473b23984b8718A46317o3588J1284d428B09362C0650c10630
$$ -81719 -145624 122473 -223984 -28718 146317 82729 94013 -4428 209362 30650 -310630
15700c05830d3612m1087A11558J68877g6240j31781B8151b40421D5134b53574
$$ -305830 -43612 -84699 111558 280435 -76240 -208021 28151 -240421 45134 -253574
15689b16658E4646K21695b46529B96861f754F7812g8942C456b22035m0890g9596
$$ -216658 54646 276341 -246529 296861 -6754 67812 -78942 3456 -222035 -262925 -79596
15677A42813a32079B43658E1706J69003b72455R3005B00131f1823k5430A22880
$$ 142813 -132079 243658 51706 220709 -272455 -179450 200131 -61823 -87253 122880
15666c8347A16620b09009G5499a4679C27868e5831B65550a23257I2405F398a22738
$$ -38347 116620 -209009 75499 -14679 327868 -55831 265550 -123257 92405 6398 -122738
15654D7980a24035N2871B26702p1137a00112F676b5426m47719a52720b2534J0499
$$ 47980 -124035 -71164 226702 155565 -100112 6676 -25426 -473145 -152720 -22534 -12035
15643a2035j00925k4394E227a95979M3808e4615J4635j42777I4010a39360n1004
$$ -12035 -112960 -137354 5227 -195979 -152171 -54615 -39980 -182757 94010 -139360 -190364
15632a90364A30282K04664A67422b38934A11607E1118a03950A31919C478K34047
$$ -190364 130282 334946 167422 -238934 111607 51118 -103950 131919 3478 237525
15622B37525m0046i057q3122G1786b59562B08476b74188H5948d2611C2774J96129
$$ 237525 197479 -9057 -92179 71786 -259562 208476 -274188 85948 -42611 32774 228903
15611B28903b27033A90486g0865n2317A23528a95953G0077a58671A17355J59425
$$ 228903 -227033 190486 -70865 -123182 123528 -195953 70077 -158671 117355 276780
15601B76780h3392B1169J1250b2602B61402o2683a24344m0015A31865L3133i091
$$ 276780 -83392 21169 32419 -22602 261402 198719 -124344 -164359 131865 164998 -9091
15589A8440g7291n80947d1323n2841c1883j9304j66785J04459J0099o1098H3269
$$ 18440 -77291 -658238 -41323 -94164 -31883 -51187 -217972 -113513 -103414 -164512 83269
15577A86253a5719D8486d17081F3913R0810N71h9002j93736H7700c1885K499g969
$$ 186253 -15719 48486 -417081 63913 154723 155294 -89002 -282738 87700 -31885 -29386 -7969
15564G9040a6264l20736A5971b42534I7536b03672D9859J13149a84981A30857
$$ 79040 -16264 -337000 15971 -242534 97536 -203672 49859 163008 -184981 130857
15553C0279J52621b38663B13748a67219d2690A33199j9254C5383J11223n436m1906
$$ 30279 182900 -238663 213748 -167219 -42690 133199 113945 35383 146606 141170 99264
15542I9264g2367L4635D2973K0534L5698b1437l4325j66984c8197n2067J1697
$$ 99264 -72367 -37732 42973 63507 99205 -21437 -55762 -222746 -38197 -90264 -78567
15531g8567b316o5814j01491M077A38644G350O3981B0443R2081i3700L7180B62154
$$ -78567 -2316 -68130 -169621 -165544 138644 7350 71331 20443 112524 -93700 -56520 262154
15518B74211i0895C86663a73101H3395B0407b66535a2595B90026a30087J9445
$$ 274211 -90895 386663 -173101 83395 20407 -266535 -12595 290026 -130087 -110642
15508a10642B39867g405B44023b62786d1065J6685A36797f5487C28170B9724J793
$$ -110642 239867 -7405 244023 -262786 -41065 -24380 136797 -65487 328170 29724 31517
15497C1517g4714A08733r813d6786j98835c0494o4967B4224c0315j04593A08304
$$ 31517 -74714 108733 98920 -46786 -245621 -30494 -95461 24224 -30315 -134908 108304
15485d9998L050E891b21745A75778a38886h789m94243B15207D7494c09048G0097
$$ -49998 -46948 5891 -221745 175778 -138886 -8789 -503032 215207 47494 -309048 70097
15473i6063k53099E2466a62034L114j54954n5358C4071a30361K2017B93013b56134
$$ -96063 -349162 52466 -162034 -158920 -313874 -369232 34071 -130361 -108344 293013 -256134
15461a65445I3079l3046J40143a02195B2589J61563a72817P1368k0554k1141D01
$$ -165445 93079 60033 200176 -102195 22589 184152 -172817 -101449 -122003 -143144 401
15449a35203j3794b8753B8695P942J60335p532b50440A02434J52851J26789E9194
$$ -135203 -148997 -28753 28695 36637 196972 189440 -250440 102434 255285 382074 59194
15437f8154B39103i8423b8585B00770C2791A1684b70637E6376e6546B81919A02703
$$ -68154 239103 -98423 -28585 200770 32791 11684 -270637 56376 -56546 281919 102703
15425h1490c7213A30363d47679F6131i0295B09328a16218L8895j5822F7567K1982
$$ -81490 -37213 130363 -447679 66131 -90295 209328 -116218 -77323 -93145 67567 89549
15414H9549c8127k72094a6267c258D00138C5823a99256M7774B9013a14490B43088
$$ 89549 -38127 -310221 -16267 -3258 400138 35823 -199256 -151482 29013 -114490 243088
15402a3663k21462I3973J58312d0454r8708k2200A05642i0235F7502g9594a1908
$$ -13663 -235125 93973 252285 -40454 -139162 -161362 105642 -90235 67502 -79594 -11908
15390g2556A8775K12394a05157H6303i4003E822a8142A80215c755p5732H0842
$$ -72556 18775 231169 -105157 86303 -94003 5822 -18142 180215 -3755 -79487 80842
15378b74087A33525b51478C7376a26467G325M3214O0263D7868K60283A25304J64859
$$ -274087 133525 -251478 37376 -126467 7325 50539 110802 47868 308151 125304 290163
15367B90163c11180D8160M4511A2446b90794o754F2021N4768N7452E6744a50024
$$ 290163 -311180 48160 92671 12446 -290794 -297548 62021 116789 174241 56744 -150024
15355A17979n7648b12627g5373A81952a01204m1125A83899a28287B50959h1962
$$ 117979 60331 -212627 -75373 181952 -101204 -142329 183899 -128287 250959 -81962
15344a07133B15835c12391E68674C8585N5191a04885L4017D5516J8440g5261j45781
$$ -107133 215835 -312391 568674 38585 93776 -104885 -70868 45516 63956 -75261 -221042
15333b21042N5842C02681c4912j8073A89286b4793A6092O9045c08966D1306J76757
$$ -221042 -165200 302681 -34912 -52985 189286 -24793 16092 85137 -308966 41306 218063
15322B18063n288l1943R358H9662D1087b15004P3646C9111L66909j07497j36387
$$ 218063 212775 180832 190190 89662 41087 -215004 -141358 39111 406020 298523 162136
15311A62136p6838g5627b8293I9713a9345k48004P9374a790H4289b28030Q6903
$$ 162136 85298 -75627 -28293 99713 -19345 -267349 -187975 -1790 84289 -228030 -141127
15300a41127A30078L398b95553J04612j59724F2024a78780B40565r3541a2722
$$ -141127 130078 133476 -295553 -190941 -350665 62024 -178780 240565 147024 -12722
15289B9581d8787m86734C4442a23365B96205D2456H070R1717I071J90728D7987
$$ 29581 -48787 -535521 34442 -123365 296205 42456 8070 99787 9071 199799 47987
15277a06408B73413l6970j02465B3055i3893B47582b03489I3033D0134J291a47479
$$ -106408 273413 236443 133978 23055 -93893 247582 -203489 93033 40134 41425 -147479
15265d149k82908B77045G1539i0158A16235C4188L55274g1362B33407A4825L8160
$$ -4149 -287057 277045 71539 -90158 116235 34188 389462 -71362 233407 14825 52985
15254E2985g9366B2763f8910k1000B55166H5816P2672R0489D8562b35756A70026
$$ 52985 -79366 22763 -68910 -89910 255166 85816 158488 248977 48562 -235756 170026
15242B30883a18509D94062k43240H3063O8205J35598J27408M16263J56056K85811
$$ 230883 -118509 494062 250822 83063 151268 286866 414274 830537 986593 1272404
15232A272404j31722l52922l60605K40670l15463a71901P6364B92606A08609p879
$$ 1272404 1140682 787760 427155 667825 352362 -171901 -95537 292606 108609 100730
15222A00730i0169d199A52834a05530n04H9120i4235c0497k46214I7853M1552
$$ 100730 -90169 -4199 152834 -105530 -106034 89120 -94235 -30497 -276711 97853 139405
15211A39405D105c82855i7331D66922k33059l483H3507a82397F4430g733A28462
$$ 139405 4105 -382855 -97331 466922 233863 230380 83507 -182397 64430 -7733 128462
15199a18084I151M8662J03794R0658I7256J72607i1932A01073B8650i47C87716
$$ -118084 9151 57813 161607 252265 97256 269863 -91932 101073 28650 -947 387716
15187C42310a25594A4934K72763r4531l7399e3459h343A53700J20505E2798J55695
$$ 342310 -125594 14934 287697 193166 155767 -53459 -8343 153700 274205 52798 208493
15176B08493b82210D9447e8289B30785J01202F0579d5438A61544D1986a57935
$$ 208493 -282210 49447 -58289 230785 331987 60579 -45438 161544 41986 -157935
15165A52746n0802b4902I5021a16949C08201P5504f2724B24924b57411B57958
$$ 152746 101944 -24902 95021 -116949 308201 383705 -62724 224924 -257411 257958
15154A17027D468J15906a05314A43796b11628e9045B83203A03540c5584C28452
$$ 117027 4468 120374 -105314 143796 -211628 -59045 283203 103540 -35584 328452
15143B60255A8732C793J10432L7338a10758N0778C79296r4179A0076K27398p847
$$ 260255 18732 3793 114225 151563 -110758 -59980 379296 285117 10076 237474 229627
15132B29627j3248A5662J62156J64483L3938a7425A35971M795j8682n172a52630
$$ 229627 216379 15662 177818 342301 376239 -17425 135971 140766 122084 116912 -152630
15120D6990K90068A44690A8660J43520a7192B16973h1545C06945L6887A1653J76586
$$ 46990 337058 144690 18660 162180 -17192 216973 -81545 306945 343832 11653 188239
15109A88239a40325C8026e8045A50469C7381O0973D3403B0093c8113C42363A66787
$$ 188239 -140325 38026 -58045 150469 37381 98354 43403 20093 -38113 342363 166787
15097a0450B36367F9202J63191P5023A18415O0481R7286n3296a05480j93416B12632
$$ -10450 236367 69202 232393 307416 118415 178896 276182 222886 -105480 -298896 212632
15085C5287a66358n7054C54806n3823c2910A57851M4250R1072i8665A02561J90387
$$ 35287 -166358 -223412 354806 300983 -32910 157851 202101 293173 -98665 102561 292948
15074B92948h6445K3647A85078l6756B1501Q0980J02929q8164a87478A92824D8187
$$ 292948 -86445 -62798 185078 148322 21501 102481 205410 117246 -187478 192824 48187
15062C42607j42329J10389J53565k25383o0099J56775A33857j3452l3070d4874
$$ 342607 200278 310667 464232 238849 178750 335525 133857 120405 87335 -44874
15051B13385i1210j2045A89361H3835O9414C3837G08K82241J8995B8793K51618
$$ 213385 -91210 -103255 189361 83835 153249 33837 708 282949 301944 28793 280411
15040B80411m52j00159H3567j9595K51799g4567B31410j9940j9255g9380B97545
$$ 280411 279959 179800 83567 63972 315771 -74567 231410 211470 192215 -79380 297545
15028A16113K73865c06652E34716d9598A40864D0513M12209j38860q1125L8664
$$ 116113 389978 -306652 534716 -49598 140864 40513 452722 313862 232737 271401
15018B71401N1800m4507k8486A4632J31554d9655B07546L73187B50152c3269I3826
$$ 271401 323201 278694 250208 14632 146186 -49655 207546 580733 250152 -33269 93826
15006B50461Q5963A33371e9646C07670b6552A97558m3852K52907j80626K0991
$$ 250461 336424 133371 -59646 307670 -26552 197558 153706 406613 225987 246978
14996B46978P1515c114A33464P5269J48537I4809J84739q7830K17718r4886j16978
$$ 246978 318493 -3114 133464 208733 357270 94809 279548 191718 409436 314550 197572
14985A97572m8004E6598K95188I3543M81671A98474N0643o2072G0811Q8068L03909
$$ 197572 149568 56598 351786 93543 575214 198474 249117 187045 70811 158879 462788
14974D62788k02308A20926J27715A09781d9563F2031J75546a115E20104M7844
$$ 462788 260480 120926 248641 109781 -49563 62031 237577 -1115 520104 567948
14964E67948A53827K27928p0293M2280A30609L12931J01829B31773J39671K6415
$$ 567948 153827 381755 311462 353742 130609 443540 545369 231773 371444 397859
14954C97859h45D18823a27294B34701r4418N0843M78799a4926D37142A13135J79333
$$ 397859 -845 418823 -127294 234701 140283 191126 669925 -14926 437142 113135 292468
14943B92468K91567A59586K0364L0283I1363K57827D0105L13215d1109C55317
$$ 292468 584035 159586 179950 210233 91363 349190 40105 353320 -41109 355317
14932A64404J88007n5387j16253j5897n7682N0961k7284M57036k00791L1933j54807
$$ 164404 352411 297024 180771 164874 107192 158153 130869 587905 387114 419047 264240
14921B64240K75399a82570C67001R1826o7547j32348q0470B1686K87293O1189
$$ 264240 539639 -182570 367001 458827 391280 258932 178462 21686 308979 370168
14911C70168J56092l3982j58912E1638L33054A04863K82415j66044J88932B03009
$$ 370168 526260 492278 333366 51638 384692 104863 387278 221234 410166 203009
14900B27062o1513M7874j5879P9416d032D3064N82164C04109k0648N504A30132
$$ 227062 165549 213423 197544 276960 -4032 43064 625228 304109 283461 288965 130132
14888D82403B37971L67521j30370j90243K8588P1088j70388Q9442q9774R2794
$$ 482403 237971 605492 475122 284879 313467 384555 214167 303609 213835 306629
14878C06629J86726K0945B42481r1882K41922j36234J59135J61449B44667M84366
$$ 306629 493355 514300 242481 150599 392521 256287 415422 576871 244667 729033
14868G29033l29496H5187K42046j09183B9621f415B63704K67398j03777j64436
$$ 729033 399537 85187 327233 218050 29621 -6415 263704 531102 427325 262889
14858B62889h1076E25058j28223j5305j58999L44958n2137j34149k0532p1406
$$ 262889 -81076 525058 396835 381530 222531 567489 515352 381203 360671 289265
14848B89265o2923M83111A28477B2211L92377K8932A04279k9493O14790k18813
$$ 289265 226342 709453 128477 22211 414588 443520 104279 74786 689576 470763
14838D70763p034j6833q6026A11653J32945J41264G7436K93409K51419r7823j48578
$$ 470763 463729 446896 360870 111653 244598 385862 77436 370845 622264 524441 375863
14827C75863R5933o2585j60910R4145j6266M11393k34663K4897j09248j40J01243
$$ 375863 471796 409211 248301 342446 326180 737573 502910 527807 418559 418419 519662
14816E19662A74990K07777q334K71158r7139M3082Q3275k88235j28851j17306
$$ 519662 174990 382767 374433 645591 548452 591534 674809 386574 257723 140417
14806A40417L11307A57365O83739C90980p0442M62138k63273k03173G9329M65757
$$ 140417 451724 157365 841104 390980 320538 782676 519403 316230 79329 545086
14796E45086j31663q2497L07164M2824N7048C18610J03175J47709J16811p2580
$$ 545086 413423 330926 638090 680914 737962 318610 421785 569494 686305 613725
14786F13725A78053J74466J43513k28385K50406L31492B62410N84626k29186N6598
$$ 613725 178053 352519 496032 267647 518053 849545 262410 847036 617850 674448
14776F74448k23266k4273M39724j86746n5178j99222J48559L51531k07832J17185
$$ 674448 451182 426909 866633 679887 624709 425487 574046 925577 717745 834930
14766H34930C70238L62913L13188l99450l02768J76996j3031K42862n0954N0186
$$ 834930 370238 733151 1046339 646889 344121 521117 508086 750948 699994 750180
14756G50180C08175J60958R0316m8949J97784j80286n9466n2785L32514C71324
$$ 750180 308175 469133 559449 510500 708284 527998 468532 415747 748261 371324
14745C05274J19431N46183k99156o4901J29951m9383L51613l75556J66063L8756
$$ 305274 424705 970888 671732 606831 736782 687399 1039012 663456 829519 868275
14735H68275M1630l29826M06426j38508A33372N41494J62068j87641l0682J61999
$$ 868275 909905 580079 986505 847997 133372 674866 836934 649293 618611 780610
14725G80610P5077l3008l1809j12156j68525P3924L10803m09190M33044k82896
$$ 780610 855687 822679 790870 678714 510189 584113 894916 485726 918770 635874
14715F35874K02845k60970k06354N37254k79643L01608k35723J47074k90950M94779
$$ 635874 838719 577749 371395 908649 629006 930614 694891 841965 551015 1045794
14705A045794p0820l33096M51485D65610P30401m61473J39370k80119K19351k4963
$$ 1045794 974974 641878 1093363 465610 1196011 734538 873908 593789 813140 788177
14695G88177K28487j04536k04231O74870F30208L68145l21849J38936P3952N6098
$$ 788177 1016664 912128 707897 1382767 630208 998353 676504 815440 889392 945490
14685I45490j42682J44168K12184k58320k28505K65709Q9701r2973k63898K78021
$$ 945490 802808 946976 1159160 900840 672335 938044 1027745 934772 670874 948895
14675I48895N2788l27312K30316l4723J86920j36633J79383j96438J00295J9388
$$ 948895 1001683 674371 904687 869964 1056884 920251 1099634 903196 1003491 1022879
14665A022879R5297L6432k27647k0851l246j01663M57313J20858l87142q166O1504
$$ 1022879 1118176 1154608 926961 906110 902864 801201 1258514 1379372 992230 984064 1045568
14654A045568J53616j8019l14519J67595M385K10215k94407M09471q3950J01491
$$ 1045568 1199184 1181165 866646 1034241 1038626 1248841 954434 1363905 1279955 1381446
14644A381446l21799M25193n58196J36069r645J46160K04658n57466K78537K28475
$$ 1381446 1059647 1484840 926644 1062713 1053068 1199228 1403886 846420 1124957 1353432
14634A353432K9113J53804K1162j59011k98274M22464l90237L1609j19500k09362
$$ 1353432 1382545 1536349 1557511 1398500 1100226 1522690 1132453 1164062 1044562 835200
14624H35200O84308j07877K20911n64801L43701j95373K75366j33420k6205L39
$$ 835200 1519508 1411631 1632542 1067741 1411442 1216069 1491435 1358015 1331810 1332149
14614A332149K543K98054m51351J72856j35644L16228O8178l40035L21726k59618
$$ 1332149 1334692 1632746 1181395 1354251 1218607 1534835 1603013 1262978 1584704 1325086
14604A325086R8161J93488j30315l84212L93821n9139R3847p212p8424J05158
$$ 1325086 1423247 1616735 1486420 1102208 1496029 1436890 1530737 1523525 1445101 1550259
14594A550259o8057J72820J27456k86087J37204J73894j67459L3482J24368m3599
$$ 1550259 1482202 1655022 1782478 1496391 1633595 1807489 1640030 1673512 1797880 1754281
14584A754281R423N0833k67435L35203K0750J88705l07782p255J93672Q1510k34539
$$ 1754281 1763704 1814537 1547102 1882305 1903055 2091760 1783978 1776723 1970395 2051905 1817366
14573A817366J13571J33146j99438j98162L38328J82625l29436K21558k13075
$$ 1817366 1930937 2064083 1864645 1666483 2004811 2187436 1858000 2079558 1866483
14564A866483J74479J10076l0648p5093K27377N2693l41401K26553K88912J99816
$$ 1866483 2040962 2151038 2120390 2045297 2272674 2325367 1983966 2210519 2499431 2699247
14554B699247P2604l28853Q4709M18938m64149M3602N44472l618L78666m72594
$$ 2699247 2771851 2442998 2527707 2946645 2482496 2526098 3070570 3066952 3445618 2973024
14544B973024J85534l1203O42257L02063M18173K72451M45621M05204Q63520J679265
$$ 2973024 3158558 3127355 3769612 4071675 4489848 4762299 5207920 5613124 6476644 8155909
14534H155909K026879L954614P112516R277371o29942j1196266p064331m143686
$$ 8155909 10182788 14137402 21249918 30527289 29897347 18701081 11636750 7493064
14526G493064k029722j029612p75509q85038J90785j81714n38980L60373m8940
$$ 7493064 5463342 4433730 3658221 2773183 2963968 2782254 2243274 2603647 2554707
14517B554707k35322j3091J2078L42057k94613J44538M6141l07131J72605L6981
$$ 2554707 2319385 2306294 2318372 2660429 2365816 2510354 2556495 2249364 2421969 2458950
14507B458950J86004r499J96697l50946K06903k75170L76606m4131K09866O5934
$$ 2458950 2644954 2635455 2832152 2481206 2688109 2412939 2789545 2745414 2955280 3021214
14497C021214k87035J13668K0817J56165L16144k59732l67790M55891l10830M62094
$$ 3021214 2734179 2847847 2868664 3024829 3340973 3081241 2713451 3169342 2858512 3320606
14487C320606j09108J74636j29150r2588K20301K52170k43497J01284L0850k7736
$$ 3320606 3211498 3386134 3256984 3164396 3384697 3636867 3393370 3494654 3525504 3497768
14477C497768j41803L12228j47351L64601l15652k5450M32210l50902K76792J0051
$$ 3497768 3355965 3668193 3520842 3885443 3569791 3544341 3976551 3625649 3902441 3912492
14467C912492J61947j6799J21646k08284L67167K1456N0219Q6109k48270K34419
$$ 3912492 4074439 4057640 4179286 3971002 4338169 4359625 4409844 4495953 4247683 4482102
14457D482102j83761L00353K2442k02273o583J07017N58548m84985J83502l3958
$$ 4482102 4298341 4598694 4621136 4418863 4412280 4519297 5077845 4592860 4776362 4742404
14447D742404J57275k9267K42979M3833M7798M5564K15109k51766J47396m3095
$$ 4742404 4899679 4870412 5113391 5157224 5205022 5250586 5465695 5213929 5361325 5318230
14437E318230M33291O8111P4280J3289K09001p7757j21725j09057L73495k19580
$$ 5318230 5751521 5819632 5893912 5907201 6116202 6038445 5916720 5807663 6181158 5961578
14427E961578N48701o3396L42440l48098L02662n977L21230m31810L10028K76273
$$ 5961578 6510279 6446883 6789323 6441225 6743887 6737910 7059140 6627330 6937358 7213631
14417G213631j15436k22338M53694K14466O8539L37183J60483k42085J25702K48713
$$ 7213631 7098195 6875857 7329551 7544017 7612556 7949739 8110222 7868137 7993839 8242552
14407H242552K76117J00725j36877K72720j79999J45822j13115L71955L82086
$$ 8242552 8518669 8619394 8482517 8755237 8575238 8721060 8607945 8979900 9361986
14398I361986P390N0276J65157Q5192K43444j29536M33650K81022K20129K44854
$$ 9361986 9369376 9419652 9584809 9670001 9913445 9783909 10217559 10498581 10718710 10963564
14388A0963564k58041K06236o5904J64118P99052l35934P06367J96085K0223P2739
$$ 10963564 10705523 10911759 10845855 11009973 11809025 11473091 12179458 12375543 12395766 12468505
14378A2468505K46730K61216l9487O43120J0372N14770q42L09366L63271J67429
$$ 12468505 12715235 12976451 12936964 13580084 13590456 14105226 14104384 14413750 14777021 14944450
14368A4944450K24885K45541J75004K90654N95972J20292K88516J30195L65802
$$ 14944450 15169335 15414876 15589880 15880534 16476506 16596798 16885314 17015509 17381311
14359A7381311Q24321K47978J78381K84995N51122K32720L68027L94323M79105
$$ 17381311 18205632 18453610 18631991 18916986 19468108 19700828 20068855 20463178 20942283
14350B0942283K38556P01858L96531N73586M25205N71093N51006P2158R21848
$$ 20942283 21180839 21882697 22279228 22852814 23278019 23849112 24400118 24472276 25394124
14341B5394124N62010P49549N64606N42648R41550M48928P31969O42235Q60990
$$ 25394124 25956134 26705683 27270289 27812937 28754487 29203415 29935384 30577619 31438609
14332C1438609N47138J021573J288468L36053J104937J171571Q92871J046581
$$ 31438609 31985747 33007320 34295788 34631841 35736778 36908349 37801220 38847801
14324C8847801J051851Q98259J410622J307517J306276J104187J454263J308062
$$ 38847801 39899652 40797911 42208533 43516050 44822326 45926513 47380776 48688838
14316D8688838J745744J310198J580459J704089J872972K007684J846107J989250
$$ 48688838 50434582 51744780 53325239 55029328 56902300 58909984 60756091 62745341
14308F2745341K230817J920508K456856K580394K457780K400301K946056L174147
$$ 62745341 64976158 66896666 69353522 71933916 74391696 76791997 79738053 82912200
14300H2912200L114477L174051L447855L552664L908285M221602M082142M524323
$$ 82912200 86026677 89200728 92648583 96201247 100109532 104331134 108413276 112937599
14292A12937599M822109N367532M726621N710910N879780O286744O505071O771082
$$ 112937599 117759708 123127240 127853861 133564771 139444551 145731295 152236366 159007448
14284A59007448P587918P825790P843645Q715853R051471R660774J0161846J0597909
$$ 159007448 166595366 174421156 182264801 190980654 200032125 209692899 219854745 230452654
14276B30452654J1282156J1449436J2296706J2782126J2831435J2831128J3631606
$$ 230452654 241734810 253184246 265480952 278263078 291094513 303925641 317557247
14269C17557247J3463390J2738827J2695236J1829985J1679721J0774439J0278925
$$ 317557247 331020637 343759464 356454700 368284685 379964406 390738845 401017770
14262D01017770R596073Q754894Q432642P666884O420804M454906J961544K646428
$$ 401017770 410613843 419368737 427801379 435468263 441889067 446343973 448305517 450951945
14254D50951945k049547n698828m538753n284162p350753q096950j0232867j1128071
$$ 450951945 448902398 443203570 438664817 433380655 426029902 417932952 407700085 396572014
14246C96572014j2321553j2653173j2691634j3264631j3178398j3296607j2997142
$$ 396572014 384250461 371597288 358905654 345641023 332462625 319166018 306168876
14239C06168876j3130137j2699229j2522050j1971407j1925636j1916892j1495106
$$ 306168876 293038739 280339510 267817460 255846053 243920417 232003525 220508419
14232B20508419j1170134j0455160r767579q761414q723325q450015p701012p414885
$$ 220508419 209338285 198883125 189115546 180354132 171630807 163180792 155479780 148064895
14224A48064895o065880o273098n858124n897108n526598m668671m831830m570754
$$ 148064895 141999015 135725917 129867793 123970685 118444087 113775416 108943586 104372832
14216A04372832l799462m075636l638577l616471l541687l280199k947344k840114
$$ 104372832 100573370 96497734 92859157 89242686 85700999 82420800 79473456 76633342
14208G6633342l057592k178365k889591k058610k419480k071394j921756j950286
$$ 76633342 73575750 71397385 68507794 66449184 64029704 61958310 60036554 58086268
14200E8086268j863626j482637j618331j674782j417234j520155j739189j333544
$$ 58086268 56222642 54740005 53121674 51446892 50029658 48509503 46770314 45436770
14192D5436770p70958j378277j222544j604961q10219j437976k72458q39254j707865
$$ 45436770 44665812 43287535 42064991 40460030 39649811 38211835 37939377 37100123 35392258
14183C5392258n33429p85545j106369q95605m30275q64879q30924o89427o99294
$$ 35392258 34858829 34073284 32966915 32071310 31641035 30776156 29945232 29255805 28556511
14174B8556511q23753o71347n12369p44457n11788l36674m28855q56090k34061
$$ 28556511 27732758 27061411 26549042 25804585 25292797 24956123 24527268 23671178 23437117
14165B3437117o05129n42916m57677o45523n88686p0085o70702j48587m75120
$$ 23437117 22831988 22289072 21831395 21185872 20597186 20527101 19856399 19707812 19232692
14156A9232692m73335l10972k7834o30187k78745k05574p90033J4078P8316p00108
$$ 19232692 18759357 18448385 18420551 17790364 17511619 17306045 16516012 16530090 16608406 15908298
14146A5908298j28630p07662M54235m30695n15795j85936l71864k37557m27497
$$ 15908298 15779668 15072006 15526241 15095546 14579751 14393815 14021951 13784394 13356897
14137A3356897M577j82401r7231l91483K0557j49704n35634j67738j29014R8136
$$ 13356897 13361474 13179073 13081842 12690359 12710916 12561212 12025578 11857840 11728826 11826962
14127A1826962m73967m5826j80143n3362m02686K37838o69728L55555o72040L63426
$$ 11826962 11352995 11307169 11127026 11073664 10670978 10908816 10239088 10594643 9922603 10286029
14117A0286029l52896j19102k46063j22712k28503K1508l02927j4813j70712j03296
$$ 10286029 9933133 9814031 9567968 9445256 9216753 9238261 8935334 8920521 8749809 8646513
14107H646513J10445l31698k50263L66171k03139k09066q8544k47173j77425J93739
$$ 8646513 8756958 8425260 8174997 8541168 8338029 8128963 8040419 7793246 7615821 7809560
14097G809560q8082p4046n62497P5765J00459J47366o95606L0613j44231K7157
$$ 7809560 7721478 7647432 7084935 7160700 7261159 7408525 6712919 6743532 6599301 6626458
14087F626458K17951O7320m02501n20721K34170k48726M65228k97938j9049K23245
$$ 6626458 6844409 6911729 6509228 5988507 6222677 5973951 6439179 6141241 6122192 6345437
14077F345437j52841j94776M189J41430l78372L5174r4727k96736K41079k00388
$$ 6345437 6192596 5997820 6002009 6143439 5765067 5800241 5705514 5408778 5649857 5449469
14067E449469j00257j38435L2868j78711q008Q3414k20242L37974l98997J68980
$$ 5449469 5349212 5210777 5243645 5064934 5056926 5140340 4920098 5258072 4859075 5028055
14057E028055k88316m63953K84011j50118J95320j50596l7096k26970M33078k08946
$$ 5028055 4739739 4275786 4559797 4409679 4604999 4454403 4417307 4190337 4623415 4414469
14047D414469j55737N6711K21182q3919L1214k41078k00649J83560j97801R9189
$$ 4414469 4258732 4315443 4536625 4452706 4483920 4242842 4042193 4225753 4027952 4127141
14037D127141k83880k03075L53351R0510k83186k12077R1109M8006l45210K34499
$$ 4127141 3843261 3640186 3993537 4084047 3800861 3588784 3679893 3727899 3382689 3617188
14027C617188m8584K62868k53527J10201r1278k89843K29567n26792P34327m79417
$$ 3617188 3568604 3831472 3577945 3688146 3596868 3307025 3536592 3009800 3744127 3264710
14017C264710K78971k01527j95895j22936j62319K34462J09065q8122N9351l91292
$$ 3264710 3543681 3342154 3146259 3023323 2861004 3095466 3204531 3116409 3175760 2784468
14007B784468M46864j87238L2188o8767J71161p5665l66675j40916K57019j93559
$$ 2784468 3231332 3044094 3076282 3007515 3178676 3103011 2736336 2595420 2852439 2658880
13997B658880l80731O77808m26705j80265L76645J39724m57393L25933J83525
$$ 2658880 2278149 2955957 2529252 2348987 2725632 2865356 2407963 2733896 2917421
13988B917421k96249k64448K01799K41936j19797n3736j45281J25630N07070J80774
$$ 2917421 2621172 2356724 2558523 2800459 2680662 2626926 2481645 2607275 3114345 3295119
13978C295119J19406M19331O30240Q10429J506059K914457O584398J0195638L579270
$$ 3295119 3414525 3833856 4464096 5274525 6780584 9695041 16279439 26475077 30054347
13969C0054347q897709o838240l755542k656906j543337q74418o98611o81435
$$ 30054347 21156638 14318398 10562856 7905950 6362613 5488195 4789584 4108149
13961D108149o0016k79720l13620j78836j92185J8438l98760J45352m4599m04923
$$ 4108149 4048133 3768413 3454793 3275957 3083772 3102210 2703450 2848802 2804203 2399280
13951B399280j16544O58677l97326j06617p2828k3411j81069O5342N0448j34441
$$ 2399280 2282736 2941413 2544087 2437470 2364642 2341231 2160162 2225504 2275952 2141511
13941B141511o8677J47575K85378m04446p0266J33008n361m1147j21744K5731
$$ 2141511 2072834 2220409 2505787 2101341 2031075 2164083 2158722 2117575 1995831 2021562
13931B021562M3150j32247J04380p496O210K00685l9301m44530J13824l6998K40922
$$ 2021562 2064712 1932465 2036845 2029349 2035559 2236244 2196943 1752413 1866237 1829239 2070161
13920B070161M908k69709L2852k71484k2032K81120n288j69988R8811j62325R4188
$$ 2070161 2075069 1805360 1838212 1566728 1544696 1825816 1820528 1650540 1749351 1587026 1681214
13909A681214K7858K31940k94464k29840L80592K06880n77187L95332m3926k93158
$$ 1681214 1709072 1941012 1646548 1416708 1797300 2004180 1426993 1822325 1778399 1485241
13899A485241J41176l32797L38021j2143J46727l33386J52285q5705K95669l03947
$$ 1485241 1626417 1293620 1631641 1619498 1766225 1432839 1585124 1499419 1795088 1491141
13889A491141J50605j96067p1492m1245j50680J86208m0460L11403n85742M46124
$$ 1491141 1641746 1445679 1374187 1332942 1182262 1368470 1328010 1639413 1053671 1499795
13879A499795j43550M8908J11821m11669J24100R7248K16202k83377L33558m74094
$$ 1499795 1356245 1405153 1516974 1105305 1229405 1326653 1542855 1259478 1593036 1118942
13869A118942m2961N08808M6217j79634m0326m35078L93692j51844J23993K87525
$$ 1118942 1075981 1584789 1631006 1451372 1411046 975968 1369660 1217816 1341809 1629334
13859A629334k79721r8872l05740L16143o836k8118L17553k04211J34237m84069
$$ 1629334 1349613 1250741 945001 1261144 1254308 1226190 1543743 1339532 1473769 989700
13849I89700R8490M6803k4774J06081j00132L46018k91364R4307j32494l10290
$$ 989700 1088190 1134993 1110219 1216300 1116168 1462186 1170822 1265129 1132635 822345
13839H22345L87355o9217m51890J56317N00050l24773P2500n4549k3025R085N270
$$ 822345 1209700 1140483 688593 844910 1344960 1020187 1092687 1038138 1015113 1024198 1029468
13828A029468j63711n4177l8726K80906M2460J80106p3058k60626N4080R5471
$$ 1029468 865757 811580 772854 1053760 1096220 1276326 1203268 942642 996722 1092193
13818A092193J47179l50853K29977j67049J17427j91279J02990p1079L01610j43407
$$ 1092193 1239372 888519 1118496 951447 1068874 877595 980585 909506 1211116 1067709
13808A067709l57976J94346l56092O38611L5810k06712j1736k63727L08732L4838
$$ 1067709 709733 904079 547987 1186598 1222408 1015696 1003960 740233 1048965 1083803
13798A083803k29893p9567p9349K5016J92248m7482l1497J10550K37767m27887
$$ 1083803 853910 774343 694994 720010 912258 864776 833279 943829 1181596 753709
13788G53709P8582Q9357j48597N379M3331p4591J80066j80228R4532L0494L2605
$$ 753709 832291 921648 773051 778430 821761 747170 927236 747008 841540 872034 904639
13777I04639k26161K05008j28863P9953J13958k40244K94296C96162M08927J75586
$$ 904639 678478 883486 754623 834576 948534 708290 1002586 396162 805089 980675
13767I80675k10785j49697j7825J48868J9759k9820j25953j7240K1591J62100
$$ 980675 769890 620193 602368 751236 770995 741175 615222 597982 619573 781673
13757G81673J70009j01504k94711R5413M63562k45915J04402n5488j91744J60434
$$ 781673 951682 850178 555467 650880 1114442 868527 972929 917441 725697 886131
13747H86131j74027k42589J20659K95903N7244l66706m687K96402n7373k7609
$$ 886131 712104 469515 590174 886077 943321 576615 571928 868330 810957 783348
13737G83348k02443K36196L4362k84294J30750q5405L83388j81741J26546l91726
$$ 783348 580905 817101 851463 567169 697919 612514 995902 814161 940707 548981
13727E48981M84041l50446K20575O6403k98448r6538P2243O3732j37600J40797
$$ 548981 1033022 682576 903151 969554 671106 574568 646811 710543 572943 713740
13717G13740j24663j75833k049L3603J27847L28326l68875K3940J31156k16963
$$ 713740 589077 413244 411195 444798 572645 900971 532096 556036 687192 470229
13707D70229L78499j5046L572j92109J405k57055O3056Q5631Q0050j06436J03454
$$ 470229 848728 833682 837254 645145 646550 389495 452551 538182 618232 511796 615250
13696F15250m2025j14758L58982B94111K48913J75239k63659K18141j60823J00716
$$ 615250 573225 458467 817449 294111 543024 718263 454604 672745 511922 612638
13686F12638J66176o7566r3816K87540l83103K9718L22333n2364l11002J7470
$$ 612638 778814 711248 617432 904972 521869 551587 873920 821556 510554 528024
13676E28024K63235k40668k17843J82238L41283l26565P3408p579k42125j13005
$$ 528024 791259 550591 332748 514986 856269 529704 603112 595533 353408 240403
13666B40403K45282M5936K96663o3234N8385j55447k36079k11988K86700L10174
$$ 240403 485685 531621 828284 765050 823435 667988 431909 219921 506621 816795
13656H16795l67950M386k18054o8912L71908j68100K64287l1335k23200j49815
$$ 816795 448845 453231 235177 166265 538173 370073 634360 603025 379825 230010
13646B30010L62034P7062J35047B44129M28069l25340K91091j90888o5625J707
$$ 230010 592044 669106 804153 244129 672198 346858 637949 447061 381436 383143
13636C83143j53380Q7047j2849K42640N4173q5641j32383A49087J04237L43926
$$ 383143 229763 316810 303961 546601 600774 515133 382750 149087 253324 597250
13626E97250j72825L07519C13152J71173j92507K66349j84209J49580H5286L64341
$$ 597250 424425 731944 313152 484325 291818 558167 373958 523538 85286 449627
13616D49627J36923B70313I3233M06166K4036k04975j4972M5099m5438m7346J7254
$$ 449627 586550 270313 93233 499399 523435 318460 303488 348587 303149 255803 273057
13605B73057K67051j36385J1634P6002q8836J12503I0818K66072L70420B80509
$$ 273057 540108 403723 415357 491359 402523 515026 90818 356890 727310 280509
13594B69635L48729j17472m4085p5106K13032k02362k056L0606j4311j84538N36475
$$ 269635 618364 500892 456807 381701 594733 392371 390315 420921 406610 222072 758547
13583G58547B60443K74296j64600p3834I5734r005L13597n8395L409A47368K79799
$$ 758547 260443 534739 370139 296305 95734 86729 400326 341931 345340 147368 427167
13572D27167N0881A45039K05687L46754A05431M17543k16649O9565M07878B21526
$$ 427167 478048 145039 350726 697480 105431 522974 306325 375890 783768 221526
13561A91345l7872K70605D5056L46523J26935B03358K24398j09770J25963l0802
$$ 191345 153473 424078 45056 391579 518514 203358 427756 317986 443949 413147
13551D13147L4162R7432j84287j51179J56238p3943L11672k76011m3748J79435
$$ 413147 447309 544741 360454 209275 365513 291570 603242 327231 283483 462918
13541D62918j08042A73034L90646A32669K04661L5529F715K60249O427K86322
$$ 462918 354876 173034 563680 132669 337330 372859 6715 266964 273391 559713
13531E59713k00332J17937k15706l6870K48046B24463q9164J63383j13811K03956
$$ 559713 359381 477318 261612 224742 472788 224463 135299 298682 184871 388827
13521C88827N6614H5134a54294B08567Q3382J4980n3720j04228L45978r7659K5399
$$ 388827 445441 85134 -154294 208567 291949 306929 253209 148981 494959 397300 422699
13510D22699C5021M63547q1444k6290n6978A54820J28619J67396A00002L93790
$$ 422699 35021 498568 417124 390834 333856 154820 283439 450835 100002 493792
13500D93792B00743M76809A97413K43810A32245O3368I3888J97823k9090P7335
$$ 493792 200743 677552 197413 441223 132245 195613 93888 291711 262621 339956
13490C39956A56624L61196q217A73435L35148A87198N7471K63610j01707n7527
$$ 339956 156624 517820 509603 173435 508583 187198 244669 508279 406572 349045
13480C49045L03690A70841K22084j75629J30578H4852R7774K04542J26324o3849
$$ 349045 652735 170841 392925 217296 347874 84852 182626 387168 513492 449643
13470D49643A18599N0117L9153Q311K472J16635A31331J66196Q0436H1261O3473
$$ 449643 118599 168716 207869 216180 218652 335287 131331 297527 377963 81261 144734
13459A44734L17221r9855j47154e2102C80172j57977L88940A09259K00298A53503
$$ 144734 461955 362100 214946 -52102 380172 222195 611135 109259 309557 153503
13448C57943j00644c1281D55875r3604L36203B17844K99540B2934K66685n6978
$$ 357943 257299 -31281 455875 362271 698474 217844 517384 22934 289619 232641
13438B32641n0059K69146A13343N4189O6903P8263K19365e5830B71200r6128M28873
$$ 232641 182582 451728 113343 167532 234435 312698 532063 -55830 271200 175072 603945
13427F03945B34491j7184R3674k2470j08539H6032j2562K12189c5873A41782J02477
$$ 603945 234491 217307 310981 288511 179972 86032 73470 285659 -35873 141782 244259
13416B44259J84656p6159j55485J00089g3910A94170K01713A67545r84K91604
$$ 244259 428915 352756 197271 297360 -73910 194170 395883 167545 166561 458165
13406D58165d2234D63251A37326L04672P2334n0106k23029j09375o2828a33703
$$ 458165 -42234 463251 137326 441998 514332 464226 241197 131822 68994 -133703
13395G2036K10571M554J71668A61374J74269N7280r708k5854a88272B35681c12408
$$ 72036 282607 287161 458829 161374 335643 392923 383215 357361 -188272 235681 -312408
13383a95402F3278d1414j6535A23941M0143J1719G2513m540K9874d8616B37362
$$ -195402 63278 -41414 -57949 123941 164084 175803 72513 67973 97847 -48616 237362
13371B13493F4578M03942k17538m9731g0434A00525P9907J23667H7572L24784
$$ 213493 64578 468520 250982 201251 -70434 100525 180432 304099 87572 412356
13361D12356j20134j02413G3692N28208k83268Q1154I3805J60844J01695a47094
$$ 412356 292222 189809 73692 601900 318632 399786 93805 254649 356344 -147094
13350a09573D06273j96956L36171F4989k1758M56672B31798E3028M15454j21477
$$ -109573 406273 209317 545488 64989 43231 499903 231798 53028 468482 347005
13340C47005p8607O6063m3229J25799g9815j15223F04217j56638J61473k48023
$$ 347005 268398 334461 291232 417031 -79815 -195038 604217 447579 609052 361029
13330C61029j8235L54769A80114o90P3635Q9098k782G1928K32474J670I2417M78067
$$ 361029 342794 697563 180114 179424 253059 342157 339375 71928 304402 306072 92417 570484
13318E70484A79673H4968K45615J86171A77503Q9739l1965K73262j77347J58687
$$ 570484 179673 84968 330583 516754 177503 267242 235277 508539 331192 489879
13308D89879A87853J02213a13460B80245j29697K47331j43705D1084Q6264K6970
$$ 489879 187853 290066 -113460 280245 150548 397879 254174 41084 127348 154318
13298A54318P3451b17501B52784j14675i438A86534b595C62011q4488j24775J99371
$$ 154318 227769 -217501 252784 138109 -9438 186534 -2595 362011 277523 152748 352119
13287C52119k7311F7160g1009D62403j88534I4551b9963H4404J62253N8673a47649
$$ 352119 324808 67160 -71009 462403 273869 94551 -29963 84404 246657 305330 -147649
13275i6944B22535P903b43703C919J74898c30799A63653K42725j41017n4215A5053
$$ -96944 222535 230438 -243703 3919 178817 -330799 163653 406378 265361 211146 15053
13263A63910J46906j00448J62109A12045j5218J40721l9721J78294a01217D1838
$$ 163910 310816 210368 372477 112045 96827 237548 197827 376121 -101217 41838
13252B85517j20889J67125b11041B97555m1564a20993N9870P569C05355b31509
$$ 285517 164628 331753 -211041 297555 255991 -120993 -61123 -53554 305355 -231509
13241A95976K90569B0121J64323J67707a23713A70956J24941i9206A72739O0617
$$ 195976 486545 20121 184444 352151 -123713 170956 295897 -99206 172739 233356
13231B33356O360o130A1380L36517j62700O875G1323J88676I1572K01269A20304
$$ 233356 239716 233586 11380 347897 185197 192072 71323 259999 91572 292841 120304
13219C13768R539a4873C59060A39278n6790c68032A32894K25571A12833k7074
$$ 313768 323307 -14873 359060 139278 82488 -368032 132894 358465 112833 85759
13209H5759J40707h1888K0249A9936J78765G4175h3889E8132K29842c3683B76158
$$ 85759 226466 -81888 -61639 19936 198701 74175 -83889 58132 287974 -33683 276158
13197a47855A87993m2758K74199E0667P7204J17018g9725C04323j51749K18942
$$ -147855 187993 145235 419434 50667 127871 244889 -79725 304323 152574 371516
13187C71516A23909a68805j42374a25436A75597P6276C5382K69895j8010m9720
$$ 371516 123909 -168805 -311179 -125436 175597 251873 35382 305277 287267 237547
13177B37547C6017a2117C18785a12316A32806A3894a12113A72973o0422J5936
$$ 237547 36017 -12117 318785 -112316 132806 13894 -112113 172973 112551 128487
13167A28487C8853A0694b6607B21823r6518j8728J95016d0542C04179p4553a00445
$$ 128487 38853 10694 -26607 221823 125305 106577 301593 -40542 304179 229626 -100445
13155a12n4929B5040L7323K6132b0081C3036J89079e6394A51337L2891d6235B19281
$$ -112 -55041 25040 62363 88495 -20081 33036 222115 -56394 151337 184228 -46235 219281
13142B42794j13770K36997A63431A3570K94420F9835K1170b13831A44287m370
$$ 242794 129024 366021 163431 13570 307990 69835 91005 -213831 144287 139917
13132A39917J45560B940a20839G1498K89625A6809a5400j0269B97998C9782E207
$$ 139917 285477 2940 -120839 71498 361123 16809 -15400 -25669 297998 39782 5207
13120f0169j38622P2095N2652I6247K92439I1219K3076L8662M1593J80916b1485
$$ -60169 -198791 -126696 -74044 96247 388686 91219 114295 152957 194550 375466 -21485
13108B19565M8684b2021B25404A1673J70230n7256J54852G1850K0118B3102L35484
$$ 219565 268249 -22021 225404 11673 181903 124647 279499 71850 91968 23102 358586
13097C58586A01827j7119c05796A27253L8634d72130e5254K670q2470j9829H2664
$$ 358586 101827 84708 -305796 127253 165887 -472130 -55254 -52584 -135054 -154883 82664
13085a80969H4196j5605a6420B6458M6343a6964l31273A01600k7522O3343K20803
$$ -180969 84196 68591 -16420 26458 72801 -16964 -348237 101600 74078 137421 358224
13074C58224C2387J97776J93107A37070D1240L6784c5214q1156B55045a73343
$$ 358224 32387 230163 423270 137070 41240 78024 -35214 -116370 255045 -173343
13063G0036J16013h7463D8358A6332L18156l6261q8054j9407J66338c23282E7047
$$ 70036 186049 -87463 48358 16332 334488 298227 210173 190766 357104 -323282 57047
13051A94322Q2242a79117H7677L1876Q3570r999D3522P6437D7389N4277K36771
$$ 194322 276564 -179117 87677 119553 203123 193124 43522 119959 47389 101666 338437
13040C38437j40917b4032C1382K64781b58739R8254A70477N5559f1621A53028
$$ 338437 197520 -24032 31382 296163 -258739 -160485 170477 226036 -61621 153028
13029a8259l9498B95919f6643A59883a13705k25833B08496a51947A89482q0863
$$ -18259 -57757 295919 -66643 159883 -113705 -339538 208496 -151947 189482 108619
13019A08619C9437l515g9504j84821B56518k8086q3805Q5913Q1685H4945l8374
$$ 108619 39437 35922 -79504 -264325 256518 228432 144627 230540 312225 84945 46571
13008D6571L28034j62280a05574A0270J46892b2913B63576R6464b67119A24418
$$ 46571 374605 212325 -105574 10270 157162 -22913 263576 360040 -267119 124418
12997E2211K29463J90778A11279J06590L5521H1564B1351K17164E9768J57398
$$ 52211 281674 472452 111279 217869 253390 81564 21351 238515 59768 217166
12987B17166J25746r4122j21847j8174j7569B5887J54490p7097J9594c8780A05585
$$ 217166 342912 248790 126943 108769 91200 25887 180377 103280 122874 -38780 105585
12975c2797A18970n2515L8864C3445K43779D7529e6452A03877l1083L30516j84449
$$ -32797 118970 66455 105319 33445 277224 47529 -56452 103877 72794 403310 218861
12964B18861a75543j7706D62162f8002b4563A72603m6712h0347N048n6367I8464
$$ 218861 -175543 -193249 462162 -68002 -24563 172603 125891 -80347 -75299 -131666 98464
12952B50712K3869h5469K2836B86849E1522b63994B49238J22153A45350K3607
$$ 250712 274581 -85469 -62633 286849 51522 -263994 249238 371391 145350 168957
12942A68957p8122k4911J15294a53160F0112a98122A6924J81006R7781E2817J70276
$$ 168957 90835 65924 181218 -153160 60112 -198122 16924 197930 295711 52817 223093
12931B23093a7877j90562N7910B14167a75451A48696k2033k1497a78152B3552
$$ 223093 -17877 -208439 -150529 214167 -175451 148696 126663 105166 -178152 23552
12920a39508E2110K77926E493c1406j78251g8182n4656I4762M8025F4714r574
$$ -139508 52110 330036 5493 -31406 -209657 -78182 -132838 94762 142787 64714 55140
12909E5140c4880B1507a60688A25943Q9228B5244A287J16927a12397o5889C62013
$$ 55140 -34880 21507 -160688 125943 215171 25244 1287 118214 -112397 -178286 362013
12897f007G2134K12214e8335a9156C2491a68811B08045A5286K47825C6960N2902
$$ -6007 72134 284348 -58335 -19156 32491 -168811 208045 15286 263111 36960 89862
12886H9862a87908A77445J86374E9434O6414h5394B42656b15120A44060G444J75456
$$ 89862 -187908 177445 363819 59434 125848 -85394 242656 -215120 144060 7444 182900
12875A82900B117c26862b8504D1488J11646J48112E8403M3177J55617h3116B3735
$$ 182900 2117 -326862 -28504 41488 153134 301246 58403 101580 257197 -83116 23735
12863H639L0325a61767I6164a86271B62621A15483f9824n3701A43717a0009B79966
$$ 8639 38964 -161767 96164 -186271 262621 115483 -69824 -123525 143717 -10009 279966
12851A5313N1804J34947a93977h2671E3729a9399A35857a0678k62446G1880b47810
$$ 15313 67117 202064 -193977 -82671 53729 -19399 135857 -10678 -273124 71880 -247810
12839a62319D8603L3306Q16P0388f1345A9170P3091L98630A22288n0847C0597
$$ -162319 48603 81909 82725 153113 -61345 19170 92261 490891 122288 71441 30597
12827b30266e2994A342a6446J950A32658J02865J26392b9875k08850a06378c8369
$$ -230266 -52994 1342 -16446 -14496 132658 235523 361915 -29875 -238725 -106378 -38369
12815E3795j9150j5525a49221n5184g7554A02379O8793B0298P9576C263K45437
$$ 53795 34645 19120 -149221 -204405 -77554 102379 171172 20298 99874 3263 248700
12804B48700A11994J13969r2110Q7544A4137K09072F6428m938A3748i1773K1134
$$ 248700 111994 225963 133853 221397 14137 223209 66428 61490 13748 -91773 -70639
12793g0639F4122J46512f1782B22546p9522J30092g4797G5573d9042C65220A06896
$$ -70639 64122 210634 -61782 222546 143024 273116 -74797 75573 -49042 365220 106896
12781A13627a05638A44812a582C7408M0450a00329B68497B0874b09606d2281J4476
$$ 113627 -105638 144812 -1582 37408 77858 -100329 268497 20874 -209606 -42281 -27805
12770b7805q8975B15401a33988D73650A95105E9000K58829b26049A83937b28732
$$ -27805 -116780 215401 -133988 473650 195105 59000 317829 -226049 183937 -228732
12759B43000C2123A316P5417b9313J0326D0785N3074a17979B31208p3383L9456
$$ 243000 32123 1316 76733 -29313 -18987 40785 93859 -117979 231208 157825 197281
12748A97281O1131q5510D6648e1927D1113d9547J436G6656J81780A25925D4349
$$ 197281 258412 172902 46648 -51927 41113 -49547 -48111 76656 258436 125925 44349
12736b43727B48592a84097b9283G4508a08979c0332C33789C9751b26481A32527
$$ -243727 248592 -184097 -29283 74508 -108979 -30332 333789 39751 -226481 132527
12725B19614H0425a12333c8818C76829b2525j3181q2236F080j460J14916l2658
$$ 219614 80425 -112333 -38818 376829 -22525 -35706 -117942 6080 4620 119536 86878
12714H6878h6134A57525f2357J3914J6283B13299F5198A8640K04745a27850r466
$$ 86878 -86134 157525 -62357 -48443 -32160 213299 65198 18640 223385 -127850 -137316
12703a37316K4731A58745J93502c1646N357n3411K5460A17436d0724A39446n778
$$ -137316 -112585 158745 352247 -31646 -26289 -79700 -54240 117436 -40724 139446 133668
12692A33668L47187B36023j3787b1992Q086C25336a53496A29254D6015e225H8370
$$ 133668 480855 236023 222236 -21992 -13906 325336 -153496 129254 46015 -5225 88370
12680A77246J78082j33129p3430F3857i1957A38994J90978b71285L4357A00341
$$ 177246 355328 222199 148769 63857 -91957 138994 329972 -271285 -236928 100341
12669A40623b12034d3816F4410J950a17134A13057J32076c564E5174J35444c9759
$$ 140623 -212034 -43816 64410 66360 -117134 113057 245133 -3564 55174 190618 -39759
12657g8170C8401d4948o8366B39972a564l36289B22060l1640r0625C9135L83720
$$ -78170 38401 -44948 -113314 239972 -1564 -337853 222060 190420 99795 39135 422855
12646D22855f1842B35835L74116B26116f3004G0117R8278L80193a20207A94902
$$ 422855 -61842 235835 609951 226116 -63004 70117 168395 548588 -120207 194902
12635h8723B42198K46449k11583b39214A16007J5192J89548A590J18167Q5636
$$ -88723 242198 488647 277064 -239214 116007 131199 320747 1590 119757 205393
12625B05393h4814j03713A9167K0471b10120d5928j16203l6672G2054b53731g3539
$$ 205393 -84814 -188527 19167 39638 -210120 -45928 -162131 -198803 72054 -253731 -73539
12613d7193C62459j21586p3931a59798b3397B43058J47762d902j17544b9904C73681
$$ -47193 362459 240873 166942 -159798 -23397 243058 390820 -4902 -122446 -29904 373681
12601a63530D3610K00708E4543p032b28177F0887a87223l3807d0757B19717M5779
$$ -163530 43610 244318 54543 47511 -228177 60887 -187223 -221030 -40757 219717 265496
12590B65496L13568k10755q6600A03493l134c16825D14661j01502M4204j78219
$$ 265496 579064 368309 281709 103493 100359 -316825 414661 313159 357363 179144
12580A79144d6857C7884K19229H9648J22432a51586P2466K8845C90360q0711a92815
$$ 179144 -46857 37884 257113 89648 212080 -151586 -79120 -50275 390360 309649 -192815
12568A28760f1662n5386B99506k2160d7j32293A8384a08307D36517H9678a47563
$$ 128760 -61662 -117048 299506 277346 -47 -132340 18384 -108307 436517 89678 -147563
12556A04195m6324r252J70117H5533E975a64705A51359F3537b29593J0382a06273
$$ 104195 57871 48619 218736 85533 5975 -164705 151359 63537 -229593 -219211 -106273
12544d0020D0714g0307j73257B27747a4709A8587J33641d6082C0408j2443a75007
$$ -40020 40714 -70307 -243564 227747 -14709 18587 152228 -46082 30408 17965 -175007
12532A57708J01140a0641D940O4761a29127B81423D284b97500D0526K76851j17796
$$ 157708 258848 -10641 4940 69701 -129127 281423 4284 -297500 40526 317377 199581
12521A99581q0774J47078a58044M6397F7188F037a87478B14426a9013j64719D32490
$$ 199581 118807 265885 -158044 -111647 67188 6037 -187478 214426 -19013 -183732 432490
12509b01852c7306B33055a60210B86838b18461R770a8281j05914m089j22851a9485
$$ -201852 -37306 233055 -160210 286838 -218461 -208691 -18281 -124195 -128284 -251135 -19485
12497D5794b6609B22998r9172J48444b08062F5400O6081J05914N7843k1769C4415
$$ 45794 -26609 222998 123826 272270 -208062 65400 131481 237395 295238 273469 34415
12485a31850a3148O115C2516R5388C4101d266k41950B24127b65795C10167A46977
$$ -131850 -13148 -7033 32516 127904 34101 -4266 -246216 224127 -265795 310167 146977
12473A3128K70753a49435J2975D0527a51641k1811r2206f0501G0719b0322o9280
$$ 13128 283881 -149435 -136460 40527 -151641 -173452 -265658 -60501 70719 -20322 -89602
12462h9602B54653a81835E511c1810k40354I4385g9833k26890D23540a7208A50860
$$ -89602 254653 -181835 5511 -31810 -272164 94385 -79833 -306723 423540 -17208 150860
12450d5295j74086H0335B9890h3283k17835A37194J36262d0187D3182L5207J09239
$$ -45295 -219381 80335 29890 -83283 -301118 137194 273456 -40187 43182 78389 187628
12439A87628B5502P4563b87746J05105A8912J02237A9809a62687j32718J23988
$$ 187628 25502 100065 -287746 -182641 18912 121149 19809 -162687 -295405 -171417
12429a71417B49136d5776j17451e8948A36909E838c1619B75339b81287a04067
$$ -171417 249136 -45776 -163227 -58948 136909 5838 -31619 275339 -281287 -104067
12418e8315l0356D4293a73053A88644C6763b65737G3423a25332b9760j72880C85780
$$ -58315 -88671 44293 -173053 188644 36763 -265737 73423 -125332 -29760 -202640 385780
12406A3581K79529b27425M6124M9796f638C32389a31526a0894l46982A7096J45393
$$ 13581 293110 -227425 -181301 -131505 -6638 332389 -131526 -10894 -357876 17096 162489
12395A62489o2603r008P7538A8879J78736Q0697g3269E1292b3762C2748K9332
$$ 162489 99886 90878 168416 18879 197615 278312 -73269 51292 -23762 32748 62080
12384F2080L11868A17523l427j345a13164A85373D3643M0284Q381K8893K19482
$$ 62080 373948 117523 114096 112751 -113164 185373 43643 83927 92308 121201 340683
12373C40683a18491E9489J0984a14032B15658H7131b5649A19438B1150a47366
$$ 340683 -118491 59489 70473 -114032 215658 87131 -25649 119438 21150 -147366
12362E4931N9743l8629J77755g2590A54069J33617D659b343A14310e8728B52699
$$ 54931 114674 76045 253800 -72590 154069 287686 4659 -2343 114310 -58728 252699
12350A63400C1195J03394a72268F0169k3364c32392A39911b18775i244n6419I4177
$$ 163400 31195 134589 -172268 60169 36805 -332392 139911 -218775 -9244 -65663 94177
12338A43844a14663l29905D0440L00487c9632A15107K0589k681b04770O5681L2357
$$ 143844 -114663 -444568 40440 340927 -39632 115107 135696 133015 -204770 -139089 -106732
12327a06732l1008e9733q763a5654D5672i3823A14055g3147A78342N2327O308
$$ -106732 -137740 -59733 -68496 -15654 45672 -93823 114055 -73147 178342 230669 236977
12316B36977o3188b42120H5295a80509A60508a79191c5788l08808g0977A99894
$$ 236977 173789 -242120 85295 -180509 160508 -179191 -35788 -344596 -70977 199894
12305a12751A23334K67126j54838D9733O2933b52769B05724E3576h674A16662
$$ -112751 123334 390460 235622 49733 112666 -252769 205724 53576 -8674 116662
12294a69087j14738A37119a71894B13550p7232b0122k6044j86281A43252a39436
$$ -169087 -283825 137119 -171894 213550 136318 -20122 -46166 -232447 143252 -139436
12283a86188M4633A78998F6083f1008B02750a64837B37043a80824A78675Q3904
$$ -186188 -141555 178998 66083 -61008 202750 -164837 237043 -180824 178675 262579
12273B62579G4152a04830A29173M3640P8155a26897D22902I8384O4665o4882K45092
$$ 262579 74152 -104830 129173 172813 250968 -126897 422902 98384 163049 98167 343259
12262C43259e5317k10655a29254G5942J74961g2103H4889d4341A54393b33945
$$ 343259 -55317 -265972 -129254 75942 250903 -72103 84889 -44341 154393 -233945
12251A1376J83095D4469b95364A81161b9240p6872B80872j6675r0015h8969B53583
$$ 11376 194471 44469 -295364 181161 -29240 -106112 280872 264197 174182 -88969 253583
12239B06576a29102D6793g326C44830b1124k3245A11797L18369a16242d0637H672
$$ 206576 -129102 46793 -7326 344830 -21124 -44369 111797 430166 -116242 -40637 8672
12227C40472j56930P5941C3441L10239F1560d1280M96g423C21811A49978j4906
$$ 340472 183542 259483 33441 343680 61560 -41280 -40784 -7423 321811 149978 135072
12216A35072J24142l0246B1400M14395j61933F628P5116J88534p8508K60894F898
$$ 135072 259214 228968 21400 435795 273862 6628 81744 270278 191770 452664 6898
12204A97230K74689B09359K8354c5020A81137c42539F1351a80493A66755N725
$$ 197230 471919 209359 237713 -35020 181137 -342539 61351 -180493 166755 172480
12194A72480J92304o5699r6012g9482A27235K69296m2357K6816A72358C6835M13227
$$ 172480 364784 299085 203073 -79482 127235 396531 354174 380990 172358 36835 450062
12183D50062j38126A14367P5049D1077K4892J26597q1325j7989a89356A48466
$$ 450062 311936 114367 189416 41077 65969 192566 111241 93252 -189356 148466
12172A15687D3132N4223M5387P661i273B92027A34787A0342k723L43716C591K11997
$$ 115687 43132 97355 142742 150403 -9273 292027 134787 10342 7619 351335 3591 215588
12160B15588A00222J71357g6732B74299A10708b59938E2264Q7990d9513k761k69940
$$ 215588 100222 271579 -76732 274299 110708 -259938 52264 140254 -49513 -52274 -322214
12149c22214D2319G400a04064f495A90078K5335a27738A21350K0913k7979n183
$$ -322214 42319 7400 -104064 -6495 190078 215413 -127738 121350 142263 114284 109101
12138A09101c04704B69909i94F8262l3001a59690A79312P3928H7384C8530f3806
$$ 109101 -304704 269909 -994 68262 35261 -159690 179312 253240 87384 38530 -63806
12126f1309C3213O2052b7866B42250c49757A41293h189A15878b12553e9493A40948
$$ -61309 33213 95265 -27866 242250 -349757 141293 -8189 115878 -212553 -59493 140948
12114B6571a01645A96336a15709G967a97106A54800c7805A07449K06757d7041
$$ 26571 -101645 196336 -115709 7967 -197106 154800 -37805 107449 314206 -47041
12103A72893a65707P8420J2789C02137E5497N9337h6330K7064k87625b7446A13658
$$ 172893 -165707 -87287 -74498 302137 55497 114834 -86330 -59266 -346891 -27446 113658
12091a95656L1552i004l41984e0929A67513O8486k4033o4165C6218J49987P482
$$ -195656 -164104 -9004 -350988 -50929 167513 235999 211966 147801 36218 186205 193687
12080A93687m0088m6385B9409i1556G2258h4482A29914i5017k1736I4682m4513
$$ 193687 153599 107214 29409 -91556 72258 -84482 129914 -95017 -116753 94682 50169
12069E0169a40853H1882a76518m7667J08062m3821O1678a3354m57246A81594e8961
$$ 50169 -140853 81882 -176518 -224185 -116123 -159944 -98266 -13354 -470600 181594 -58961
12057f3379G4776O6681N02623K25909J55422l59978l6782C1411b1617C28000h4721
$$ -63379 74776 141457 644080 869989 1025411 665433 628651 31411 -21617 328000 -84721
12045H9102C6509a40664A42550J45279B9396N6068a9565o2251B51947E6224J22489
$$ 89102 36509 -140664 142550 287829 29396 85464 -19565 -81816 251947 56224 178713
12034A78713J4273d9848j49544Q5231D4306K7163b9646p8323d4656A0684J8841
$$ 178713 192986 -49848 -199392 -114161 44306 71469 -29646 -107969 -44656 10684 29525
12023B9525b51469R6384B193a66380j3288O0638B56986a17853r1125H4780g706
$$ 29525 -251469 -155085 2193 -166380 -179668 -119030 256986 -117853 -208978 84780 -7706
12011A72229f2781c831l9529A27407L7695a62832d6481A96163p5002N32b96373
$$ 172229 -62781 -3831 -43360 127407 165102 -162832 -46481 196163 121161 121693 -296373
11999A13430f223m31876A99835n7912P7359a02334k3304b3142l84694B72595c59284
$$ 113430 -6223 -438099 199835 141923 219282 -102334 -125638 -23142 -407836 272595 -359284
11987i9887j93747H1189c7607C07847a60439C7943i8501o5707m0622e8535B51527
$$ -99887 -293634 81189 -37607 307847 -160439 37943 -98501 -164208 -204830 -58535 251527
11975d5617A32717Q2701b12405A82140b4957A73383a30324A60279D981Q6010k7789
$$ -45617 132717 215418 -212405 182140 -24957 173383 -130324 160279 4981 90991 63202
11964F3202P1801b85742A36247K11957a28058B79656b8416k76058A4288J9607
$$ 63202 135003 -285742 136247 348204 -128058 279656 -28416 -304474 14288 33895
11954C3895J75187f5189C3796a41617O9466B17644f7455A46267c36337J60169
$$ 33895 209082 -65189 33796 -141617 -72151 217644 -67455 146267 -336337 -176168
11944a76168A19169a50985k5121j18038A8361j817O1908h2840A01244b16940J6721
$$ -176168 119169 -150985 -176106 -294144 18361 16544 78452 -82840 101244 -216940 -200219
11933b00219B18954h8135a2970B55464N0846I2668a05833c1228B53407N6920b69304
$$ -200219 218954 -88135 -12970 255464 306310 92668 -105833 -31228 253407 310327 -269304
11921B3509b02007A45177D2539J71038n8329a28507r1691A83765E5618g606j94336
$$ 23509 -202007 145177 42539 213577 155248 -128507 -220198 183765 55618 -7606 -201942
11910b01942C59787b98120a9023k16003A36361P2551J35315A17463l2419l8637
$$ -201942 359787 -298120 -19023 -235026 136361 208912 344227 117463 85044 46407
11900D6407k0502d3011j352A68628a02226k16193j2988b2713o7972A0920K71904
$$ 46407 25905 -43011 -44363 168628 -102226 -318419 -331407 -22713 -90685 10920 282824
11889B82824c20631i982qG5108l4564h104C06810e5374j24458c731A78851L5291
$$ 282824 -320631 -9982 -9990 75108 40544 -8104 306810 -55374 -179832 -3731 178851 214142
11877B14142b9455q029A23611m7498b20715f294A69206D7669M7197k1945a93185
$$ 214142 -29455 -37484 123611 76113 -220715 -6294 169206 47669 94866 72921 -193185
11865a55941A90992q7882k3911R9223a08314K6917j2692I5404e0059k6938p2117
$$ -155941 190992 103110 79199 178422 -108314 -81397 -94089 95404 -50059 -76997 -149114
11854a49114C44e022m7134b1488I9409b4954G8649d4556F5754M5191a76777B61617
$$ -149114 344 -5022 -52156 -21488 99409 -24954 78649 -44556 65754 110945 -176777 261617
11841A72568i849B974a33439C7345a51675B48355p1001a46771B20650f8288b2811
$$ 172568 -9849 2974 -133439 37345 -151675 248355 177354 -146771 220650 -68288 -22811
11829g1127j21440N6647c3545a3842j99297F8585c05299e5246n9249g92l22043
$$ -71127 -192567 -135920 -33545 -13842 -213139 68585 -305299 -55246 -114495 -792 -322835
11818c22835g8070A8886b44716g1741A77955J74381a10180i08D3658b78606a03209
$$ -322835 -78070 18886 -244716 -71741 177955 352336 -110180 -908 43658 -278606 -103209
11806a6699j37740A01852M0004d9775C58396A62293r983l7790a6738l27532A0712
$$ -16699 -154439 101852 141856 -49775 358396 162293 152310 114520 -16738 -344270 10712
11794b5051r7106F4041J00611e1458E9128k7232f947A4055J34597b28911I0054
$$ -25051 -122157 64041 164652 -51458 59128 31896 -6947 14055 148652 -228911 90054
11782a11344b6015k09785J02906p9060N092c6958k12925A85227A235a0145o0995
$$ -111344 -26015 -235800 -132894 -211954 -206862 -36958 -249883 185227 1235 -10145 -71140
11771g1140B83914E5028J58345f7194l02411B59466b4516C71584E916J53059B4391
$$ -71140 283914 55028 213373 -67194 -369605 259466 -24516 371584 5916 158975 24391
11759a90055a4694q6443F342J3225J51533b32428e8300A18050d2815B79007q8812
$$ -190055 -14694 -101137 6342 19567 171100 -232428 -58300 118050 -42815 279007 190195
11748A90195a31617H0399M9169C7972k577a20282k63959D61741a45319c2694C27016
$$ 190195 -131617 80399 129568 37972 35395 -120282 -384241 461741 -145319 -32694 327016
11736a24217g524k43910E8191c76736e7083B19603b02645n4466i3993F0474b6258
$$ -124217 -7524 -251434 58191 -376736 -57083 219603 -202645 -257111 -93993 60474 -26258
11724C52608G6104a30467p2296g6618A9458a3799l44131J25955H3511a17795k0955
$$ 352608 76104 -130467 -202763 -76618 19458 -13799 -357930 -231975 83511 -117795 -138750
11713a38750D2953a05684I1592j1751K7599F27K00840n3676d16084A72776B2914
$$ -138750 42953 -105684 91592 79841 107440 627 201467 147791 -416084 172776 22914
11701g8479E3531a2445q2208o479L207I0025Q3479b9740j18792L4549d1983A13067
$$ -78479 53531 -12445 -94653 -101132 -97925 90025 173504 -29740 -148532 -113983 -41983 113067
11688F5701a15424A15177c2153k06842A14568K13132a61070A75774b70999I9949
$$ 65701 -115424 115177 -32153 -238995 114568 327700 -161070 175774 -270999 99949
11677I1569b55244D3257c417p0061B39384c39522J00530f4974C5973a74928f2127
$$ 91569 -255244 43257 -3417 -73478 239384 -339522 -238992 -64974 35973 -174928 -62127
11665A45604J5922j3970B5740J7233L0592D393h1596A25709K1346h4376H1192
$$ 145604 161526 147556 25740 42973 73565 4393 -81596 125709 147055 -84376 81192
11653B07313P439a63644f1540K0987A72965f5979m045I3362e5766I9335e7467
$$ 207313 214752 -163644 -61540 -40553 172965 -65979 -70024 93362 -55766 99335 -57467
11641C50679a63006m3807B2142a67432D4006Q3474a71232r6662H7463J7380K35638
$$ 350679 -163006 -206813 22142 -167432 44006 127480 -171232 -267894 87463 104843 340481
11630C40481a56574p5411A44899L8954A9537J32689l2298a98581A06992c3224
$$ 340481 -156574 -231985 144899 183853 19537 152226 119928 -198581 106992 -33224
11619F7762e2131m17749A4805a28765j61483B96491f6545A69086A1335J24530
$$ 67762 -52131 -469880 14805 -128765 -290248 296491 -66545 169086 11335 135865
11609A35865L21848A16802g6186j95903a18748l7397I976d4770G4792J10400O9232
$$ 135865 457713 116802 -76186 -272089 -118748 -156145 9976 -44770 74792 185192 254424
11598B54424B0842M6619j1794a48953j2371E0763k376K21111B8775b31051A13683
$$ 254424 20842 67461 55667 -148953 -161324 50763 48387 269498 28775 -231051 113683
11586B43634J57395A26668c0899C8630J55277i8507B34018i9059j1439j22236
$$ 243634 401029 126668 -30899 38630 193907 -98507 234018 -99059 -110498 -232734
11576b32734A16852b05423B35726a72497a001H770J82467d6999A99616e9895B42576
$$ -232734 116852 -205423 235726 -172497 -1001 8770 191237 -46999 199616 -59895 242576
11564c7994j70540B05688K728M1204H5209a73366E0601d7489H6822i1279F9306
$$ -37994 -208534 205688 208416 249620 85209 -173366 50601 -47489 86822 -91279 69306
11552a90576F304L156f0070B31836b65l00489a3854o1133L0956k6078k54056B94229
$$ -190576 6304 9460 -60070 231836 -265 -300754 -13854 -74987 -44031 -70109 -324165 294229
11539b51669A77996p1753j0522B2905d20295A53416c3267A86925J47177A33316
$$ -251669 177996 106243 95721 22905 -420295 153416 -33267 186925 334102 133316
11528B77744h1456I2399d2300B79118a03540a4065e198o3301B58951a18672K3859
$$ 277744 -81456 92399 -42300 279118 -103540 -14065 -5198 -68499 258951 -118672 -94813
11517i4813m3007F587K39529F259K13030f91500B03971e3170A02907P9927j7209
$$ -94813 -137820 6587 246116 6259 219289 -691500 203971 -53170 102907 182834 165625
11506A65625a54071M0887L0043j97504P8071c8741C94536j89089j5604D9229b52183
$$ 165625 -154071 -113184 -83141 -280645 -202574 -38741 394536 205447 189843 49229 -252183
11494E3475M3387a0132p2544B12711a0056D3239K13087j24308i0802B58596j05199
$$ 53475 96862 -10132 -82676 212711 -10056 43239 256326 132018 -90802 258596 153397
11483A53397i3673B2255E168M79456B36099b4363C28350E7637d8520C20017h5801
$$ 153397 -93673 22255 5168 484624 236099 -24363 328350 57637 -48520 320017 -85801
11471B96387K3506a49773q0308e4740C38746C3875L9191K50854A26442K0786P6113
$$ 296387 319893 -149773 -230081 -54740 338746 33875 73066 323920 126442 147228 223341
11460B23341p4889K66798e8382B50803r6776f0981A55006j8431J3271J2740J4294
$$ 223341 148452 415250 -58382 250803 154027 -60981 155006 136575 149846 162586 176880
11449A76880a4451A62292i9778l5820D65195a07848E1606H446K01931B6581O3631
$$ 176880 -14451 162292 -99778 -135598 465195 -107848 51606 8446 210377 26581 90212
11438I0212i0225B71027H7944J36284o197C0728J41755F0057J17121R0615b1879
$$ 90212 -90225 271027 87944 224228 218031 30728 172483 60057 177178 267793 -21879
11426D4497g2980A18505A3022b18469i2228B2116f3204A47995m1083i2554B10232
$$ 44497 -72980 118505 13022 -218469 -92228 22116 -63204 147995 106912 -92554 210232
11414B30209a19981D6009i3274j2755E2319h2041A58068c74782M5497a17671A12718
$$ 230209 -119981 46009 -93274 -106029 52319 -82041 158068 -374782 -329285 -117671 112718
11402a63183j67339A40073a99094d8542j88227h0138k37209C1834b36541B47229
$$ -163183 -330522 140073 -199094 -48542 -236769 -80138 -317347 31834 -236541 247229
11391b93802G2053N7901b9614j21831A89386J74945a32441B4319a04309A68540
$$ -293802 72053 129954 -29614 -151445 189386 364331 -132441 24319 -104309 168540
11380I3233J06237a16017A90429h3758r7123n411Q9863k8512o8265B01334d7555
$$ 93233 199470 -116017 190429 -83758 -180881 -186292 -96429 -124941 -193206 201334 -47555
11368e6143q4187F648K05678c0372j76577G9103L232a80439d8128C2731c8036
$$ -56143 -140330 6648 212326 -30372 -206949 79103 82335 -180439 -48128 32731 -38036
11356D8741h7014l5202j35967G3511f4935j64604R7885A97757k7290a11819j45621
$$ 48741 -87014 -122216 -258183 73511 -64935 -229539 -131654 197757 170467 -111819 -257440
11345b57440B76408j04342E9012a37719B80539b2202j91498A59950L5548a50940
$$ -257440 276408 172066 59012 -137719 280539 -22202 -213700 159950 195498 -150940
11334C92841b00776Q0494E2352b0029k7121F5445h3407j58862A78400a94255m680
$$ 392841 -200776 -120282 52352 -20029 -47150 65445 -83407 -242269 178400 -194255 -198935
11323a98935d5930A20910J08378i9913j39181h4909a5699B19561b75777b1463
$$ -198935 -45930 120910 229288 -99913 -239094 -84909 -15699 219561 -275777 -21463
11312G569R7615N9239a1429n8996F6112J19416g6257p7085B2894e9320B22169
$$ 7569 105184 164423 -11429 -70425 66112 185528 -76257 -153342 22894 -59320 222169
11300a73910O4882L3562j71983J19033m68188A20997k0401m0014a26380b7572
$$ -173910 -109028 -75466 -247449 -128416 -596604 120997 100596 60582 -126380 -27572
11289d6967I687L9687a08942m2298j68113J28061E0956k1285N4548c48633B2984
$$ -46967 9687 49374 -108942 -151240 -319353 -191292 50956 29671 84219 -348633 22984
11277b91399D8914b02694d4516A13721J8322b55994B32778l6891a39320J3064
$$ -291399 48914 -202694 -44516 113721 132043 -255994 232778 195887 -139320 -126256
11267a26256j2529E089M018a12601m6850g0860N331C48870B2866J26532o0237
$$ -126256 -138785 5089 9107 -112601 -159451 -70860 -65529 348870 22866 149398 89161
11256H9161f80102A51823a15570j42117A7441a33615D0300j1835b56848I4517
$$ 89161 -680102 151823 -115570 -257687 17441 -133615 40300 28465 -256848 94517
11245g6981n2849O119G6934h7265A69585a77094Q0336B62357b01849h0611F5435
$$ -76981 -129830 -123711 76934 -87265 169585 -177094 -96758 262357 -201849 -80611 65435
11233c7163j63940K7627e0332B7734L6733B5155a74395N3545F3938J97220I0530
$$ -37163 -201103 -173476 -50332 27734 64467 25155 -174395 -120850 63938 261158 90530
11221D6h3218H8173d2530B17291D2140f1227k05754A66973d3839A18819b5257
$$ 46 -83218 88173 -42530 217291 42140 -61227 -266981 166973 -43839 118819 -25257
11209E5915O0402c3712r7440O0996p0119n4968n7428R7739d3497B8856a06480
$$ 55915 116317 -33712 -131152 -70156 -140275 -195243 -252671 -154932 -43497 28856 -106480
11197B13736b92394h8840C9306H027g4899L3649a0682G8382B9160Q752a81488
$$ 213736 -292394 -88840 39306 8027 -74899 -41250 -10682 78382 29160 37912 -181488
11185i6945I4098c6368C54232a46368e0462k19351B84416b75252J2942c2835A6308
$$ -96945 94098 -36368 354232 -146368 -50462 -269813 284416 -275252 -262310 -32835 16308
11173a30917k0252r231A58502a02571A43313h4223j69306c4070i929p815k20601
$$ -130917 -151169 -160400 158502 -102571 143313 -84223 -253529 -34070 -9929 -17744 -238345
11162b38345a04613j00547A23637h5848A17917d0598A8636P1977K0306d6681C4255
$$ -238345 -104613 -205160 123637 -85848 117917 -40598 18636 90613 110919 -46681 34255
11150A52424i8942I8152c34455B11516K33642a46795b5415k2584j598j01735A24680
$$ 152424 -98942 98152 -334455 211516 445158 -146795 -25415 -47999 -49597 -151332 124680
11138a71970f7687A81977N467a03124A9252J32379m6084J08277m1652q0822g387
$$ -171970 -67687 181977 187444 -103124 19252 151631 105547 213824 172172 91350 -7387
11126a8037j48527R208B77798r0134c11791N7237A89139a47699A86399d2449B4497
$$ -18037 -166564 -157356 277798 187664 -311791 -254554 189139 -147699 186399 -42449 24497
11114D50462G560L3657a23357D9659a19006E07959B12465M7427A21531d2870I0413
$$ 450462 7560 41217 -123357 49659 -119006 507959 212465 259892 121531 -42870 90413
11102a14894F2236a62968E2998R1425a84502A66578O5434E1563n731A1873J982
$$ -114894 62236 -162968 52998 144423 -184502 166578 232012 51563 45832 11873 13855
11091A3855R3965j7497M29556B00686I3945N4922O0746J98258d4107G8502J56203
$$ 13855 107820 90323 519879 200686 93945 148867 209613 407871 -44107 78502 234705
11080B34705c5008A85336J15905j46711J4780m977a49656A66304F2761K83443
$$ 234705 -35008 185336 301241 154530 169310 164333 -149656 166304 62761 346204
11070C46204j67401k6962J34725L3076M6775q378j72897K09581A33858K34380
$$ 346204 178803 151841 286566 319642 366417 358039 185142 394723 133858 368238
11060C68238j56027H1807N4482K44697J28522j79742C7889L27526J71185G5415
$$ 368238 212211 81807 136289 380986 509508 329766 37889 365415 536600 75415
11049C12590A36889J70790K21362J98424J99181C46013q8121J79786M40424B59817
$$ 312590 136889 307679 529041 727465 926646 346013 257892 437678 878102 259817
11038C50398K79619K07091j61501J31877l05786K17094p9986J68761k27325L0957
$$ 350398 630017 837108 675607 807484 501698 718792 638806 807567 580242 611199
11028F11199J93965j56716j92042K97431k31854L63254j27873C65794L16411K60611
$$ 611199 805164 648448 456406 753837 521983 885237 757364 365794 682205 942816
11018I42816m45713K79831J20463j03166j25803p1316O3135j76608J34390R6522
$$ 942816 497103 776934 897397 794231 668428 597112 660247 483639 618029 714551
11008G14551l8784M3811B05090N11298J17454C32239J69333K07713l39358L07602
$$ 714551 675767 719578 205090 716388 833842 332239 501572 709285 369927 677529
10998F77529j58630O9709J173k78445L41389p3087k53286K73979J013K77641m10331
$$ 677529 518899 588608 589781 311336 652725 579638 326352 600331 601344 878985 468654
10987D68654K20850k5700k0260k92004N55842k63261O1756L9459k18097o4730
$$ 468654 689504 663804 643544 351540 907382 644121 705877 745336 527239 462509
10977D62509j44043O74544C28602L40083k18675M60873k34412L26355k78109J45520
$$ 462509 318466 993010 328602 668685 450010 910883 676471 1002826 724717 870237
10967H70237O9923j56219L53171L5769J96279L10268L2451L02396J52429L32538
$$ 870237 940160 783941 1137112 1172881 1369160 1679428 1711879 2014275 2166704 2499242
10957B499242p6719J56824o3967L8155m13194j14811l26635p9369j39693j70940
$$ 2499242 2422523 2579347 2515380 2553535 2140341 2025530 1698895 1619526 1479833 1308893
10947A308893l15220p5553M31581j05045k1326P8459k60518j08302j2279j65058
$$ 1308893 993673 918120 1349701 1244656 1223330 1301789 1041271 932969 920690 755632
10937G55632R8856j43458J48829D05221j95478K42870k25394K40501j20074a0412
$$ 755632 854488 711030 859859 405221 209743 452613 227219 467720 347646 -10412
10926A13072Q6222c02625A98244I1144L7222J71039K7298f9760F0359d175G8024
$$ 113072 199294 -302625 198244 91144 128366 299405 326703 -69760 60359 -4175 78024
10914B53067K88785A07818C5848g4841J895r3333D8733K15790a72144G9750J05457
$$ 253067 541852 107818 35848 -74841 -72946 -166279 48733 264523 -172144 79750 185207
10903A85207k6508a31832A64181f8675q0804A04088a01560B21847J62336I0581
$$ 185207 158699 -131832 164181 -68675 -149479 104088 -101560 221847 384183 90581
10892B762K4654M76044A35566c5680E4841f7841l4774E3462a9732k6227I776M0479
$$ 2762 27416 503460 135566 -35680 54841 -67841 -102615 53462 -19732 -45959 9776 50255
10880E0255J05285k4242a19984B74505a80728B09379b21097d0027D0411K05295
$$ 50255 155540 131298 -119984 274505 -180728 209379 -221097 -40027 40411 245706
10870B45706J38972C9757N9314J01835i7297d0150n3635A96129b97564c4321B38024
$$ 245706 384678 39757 99071 200906 -97297 -40150 -93785 196129 -297564 -34321 238024
10858C3698a95229Q9581j25441N6498B4021a1385p386k05374d8428H5375l2319
$$ 33698 -195229 -105648 -231089 -174591 24021 -11385 -18771 -224145 -48428 85375 53056
10847E3056K44121a55791A24341a21428A4162b35372A96864C4040J69075b9563
$$ 53056 297177 -155791 124341 -121428 14162 -235372 196864 34040 203115 -29563
10836A62851m2885n4980L55a49041C5297Q8615k2865B2881O6556d30982A08303
$$ 162851 119966 64986 65341 -149041 35297 123912 101047 22881 89437 -430982 108303
10824B0439g9930D3073a63678A44573m0024c20441A23941a89630A691a2746B60512
$$ 20439 -79930 43073 -163678 144573 104549 -320441 123941 -189630 1691 -12746 260512
10812I5635l1040a43554j24254a20443k6386J6641L5967l66550A91808a00418
$$ 95635 64595 -143554 -267808 -120443 -146829 -130188 -94221 -460771 191808 -100418
10801E479a31005p3830B3628b65622N3927d1598J2913H2638a51919O0497l8334
$$ 5479 -131005 -204835 23628 -265622 -211695 -41598 -28685 82638 -151919 -91422 -129756
10790a29756A10741I256M3897a18721K9395A04738c3957j60897D1206d111p8855
$$ -129756 110741 9256 53153 -118721 -89326 104738 -33957 -194854 41206 -4111 -82966
10779h2966J8924k1866B9461D122a77831B3475a4389j256C47722a25525a7786
$$ -82966 -64042 -85908 29461 4122 -177831 23475 -14389 -15645 347722 -125525 -17786
10767c4456a4786n3007B21955n2870H4222H47c24650I5839j7030c99541A67976
$$ -34456 -14786 -67793 221955 169085 84222 847 -324650 95839 78809 -399541 167976
10755B85034A6319J89048A8367O2225a00818A13825a06834B92954a09715d8955
$$ 285034 16319 205367 18367 80592 -100818 113825 -106834 292954 -109715 -48955
10744A60847G9148C9130j6720b29938d5676j15453e8037j97229a6624A53470h3503
$$ 160847 79148 39130 22410 -229938 -45676 -161129 -58037 -255266 -16624 153470 -83503
10732a77452C46547a81872A63615J49189i5382j02587A11867a04989B665O1125
$$ -177452 346547 -181872 163615 312804 -95382 -197969 111867 -104989 2665 63790
10722F3790J91747a69066Q0587n5339j08421g4361A27607d04550B39303N3991
$$ 63790 255537 -169066 -88479 -143818 -252239 -74361 127607 -404550 239303 293294
10712B93294f2249o7003O4312j2371F9238j2787j5911b00521F8793C2465a72474
$$ 293294 -62249 -129252 -64940 -77311 69238 56451 40540 -200521 68793 32465 -172474
10700A53332a23431j72921C6657K1365b67680c2652C1987d9980k66838J42505
$$ 153332 -123431 -296352 36657 58022 -267680 -32652 31987 -49980 -316818 -174313
10690a74313b4769d475k41081B38779c0854j46847D3007H186b26285j48358a84774
$$ -174313 -24769 -4475 -245556 238779 -30854 -177701 43007 8186 -226285 -374643 -184774
10678C5437a41032m4651e4383A22689h9353j36643b8540k40855a11168A25712
$$ 35437 -141032 -185683 -54383 122689 -89353 -225996 -28540 -269395 -111168 125712
10667a98702B2466f92651A45165b85865b4764j39580O8498j76585A28765N1970
$$ -198702 22466 -692651 145165 -285865 -24764 -164344 -95846 -272431 128765 180735
10657A80735a39553o6512e6112A27083k1524e6705K1634A39717C8926K8565c65106
$$ 180735 -139553 -206065 -56112 127083 105559 -56705 -35071 139717 38926 67491 -365106
10645C32640G0534j4481A6630a3172j45238L8399N9998F8472a30307l2661k2552
$$ 332640 70534 56053 16630 -13172 -158410 -120011 -60013 68472 -130307 -162968 -185520
10634a85520q3979F0624c71224k2186J65581k91306K36330a08102N275j09608
$$ -185520 -269499 60624 -371224 -393410 -227829 -519135 -282805 -108102 -102827 -212435
10624b12435k43532C98092b33830I1845J46354b50438L6578k35865a14511C0407
$$ -212435 -455967 398092 -233830 91845 238199 -250438 -213860 -449725 -114511 30407
10613a36408B19824j05711g7358A95938a65099B75468i2326C3417c14176F9196
$$ -136408 219824 114113 -77358 195938 -165099 275468 -92326 33417 -314176 69196
10602c23075Q1517d5076H5888k1100a0034A42894a31622r2832j30298Q2933F4155
$$ -323075 -241558 -45076 85888 64788 -10034 142894 -131622 -224454 -354752 -271819 64155
10590D45370A15265b21039c7051D4096b02741L0701A60326A8619R9915g5539C99287
$$ 445370 115265 -221039 -37051 44096 -202741 -172040 160326 18619 118534 -75539 399287
10578a79672A38522a81508e2018B15434a80387d7671j4721a8109B24763d00258
$$ -179672 138522 -181508 -52018 215434 -180387 -47671 -62392 -18109 224763 -400258
10567A91607a26577A26011b81789I3499a44788B4216a2098k61159f205I1501b97910
$$ 191607 -126577 126011 -281789 93499 -144788 24216 -12098 -273257 -6205 91501 -297910
10555C38723d57m5840k2503l9891A75870a39891j94558a45071q9014A7207J6348
$$ 338723 -457 -46297 -68800 -108691 175870 -139891 -334449 -145071 -234085 17207 33555
10544C3555A3264i7178B09541F8174b72704B67178b13165K2414A82689h0201E2278
$$ 33555 13264 -97178 209541 68174 -272704 267178 -213165 -190751 182689 -80201 52278
10532b16277A2486b40532R3726A71367a04687j29922f4346A87534i0448j36744
$$ -216277 12486 -240532 -146806 171367 -104687 -234609 -64346 187534 -90448 -227192
10522b27192A07923b40648C1025f6497j5876C9927a64260C17549b48706a02910
$$ -227192 107923 -240648 31025 -66497 -82373 39927 -164260 317549 -248706 -102910
10511a94233K7578B803b2887H1599Q2388K4746a92472A507N290K38150H848e6432
$$ -194233 -166655 2803 -22887 81599 163987 188733 -192472 1507 6797 244947 8848 -56432
10498b45298j2142j18447J58920A49930N2353a17681F2284a41030m3845H0105
$$ -245298 -257440 -375887 -216967 149930 202283 -117681 62284 -141030 -184875 80105
10487a3613G6270b48055g6503j01704g8970A83686b4595A22281b60903A40899
$$ -13613 76270 -248055 -76503 -178207 -78970 183686 -24595 122281 -260903 140899
10476F7603g8062l70832b9962B5225a56564j2311q932D17174I7213m4350p015
$$ 67603 -78062 -448894 -29962 25225 -156564 -168875 -177807 417174 97213 52863 45848
10465D5848J06728b8887F69230B14011a48480E3055K7642J77171b32808k900l1735
$$ 45848 152576 -28887 669230 214011 -148480 53055 80697 257868 -232808 -235708 -267443
10454b67443a7681j990m3546b3491l5116k49568d9313K4403q4649F8614K06627
$$ -267443 -17681 -19671 -63217 -23491 -58607 -308175 -49313 -24910 -109559 68614 275241
10443B75241a41682q5119A13641b48954I1710a02335B26803c34685B80501b13797
$$ 275241 -141682 -226801 113641 -248954 91710 -102335 226803 -334685 280501 -213797
10432a2573k7122D2870R8399J59251A13355k6936b52558c1736d581A8565h9694
$$ -12573 -39695 42870 141269 300520 113355 86419 -252558 -31736 -4581 18565 -89694
10420A04097C0031Q8197K89684h3528A94995R8654A00600i6709G6368e9041A0689
$$ 104097 30031 118228 407912 -83528 194995 293649 100600 -96709 76368 -59041 10689
10408h2259p7389j35543G90b91942I413J64501a66883K1753J4367A24510a62541
$$ -82259 -159648 -295191 790 -291942 9413 173914 -166883 -145130 -130763 124510 -162541
10396A36888o4213j9643I933a39053l89165a2252n8316n1119b4901C76230d8057
$$ 136888 72675 53032 9933 -139053 -528218 -12252 -70568 -121687 -24901 376230 -48057
10384f1704B43245A12925a04995A89601b29022B43769a30167A2257h5060B10876
$$ -61704 243245 112925 -104995 189601 -229022 243769 -130167 12257 -85060 210876
10373D1205A5349E594K46462d2853e480C17459A46564K18281H4962L27988E6495
$$ 41205 15349 5594 252056 -42853 -5480 317459 146564 364845 84962 412950 56495
10361B38702q1146c0528B91644J15487j16523Q4339L28045k54168L0269M2663
$$ 238702 157556 -30528 291644 407131 290608 374947 702992 448824 479093 521756
10351E21756B19171L09967J9990L3946A49848p2958k6946j7803K11396i0214A94170
$$ 521756 219171 529138 549128 583074 149848 76890 49944 32141 243537 -90214 194170
10339H1061L76334k09262J65025p4912J34854K94835B10059P4490j22406J99982
$$ 81061 457395 248133 413158 338246 473100 767935 210059 284549 162143 362125
10329C62125A42350l531L815R6988Q3719j32840m2717O9605B7994g259A224J28099
$$ 362125 142350 138819 142634 239622 323341 190501 147784 217389 27994 -7259 1224 129323
10317A29323B5978K46846a47760M3676r5290B99467n0093J68131f5027B26670
$$ 129323 25978 272824 -147760 -104084 -199374 299467 249374 417505 -65027 226670
10306A96956J16669K060j43667g3732D39708n6750A56927M29100B9241e315j57926
$$ 196956 313625 315685 172018 -73732 439708 382958 156927 586027 29241 -5315 -163241
10295a63241Q218L0570c2004j65852H2033C7415a57721A8103O5895a4362j24244
$$ -163241 -155023 -124453 -32004 -197856 82033 37415 -157721 18103 83998 -14362 -138606
10284a38606r1319P3103C38612a95713h2141C25087c27200B79169b5249F9269
$$ -138606 -229925 -156822 338612 -195713 -82141 325087 -327200 279169 -25249 69269
10273a12428N3533j76465q9364C09939a36364F3656g2828k59068A10530O143B1674
$$ -112428 -58895 -235360 -324724 309939 -136364 63656 -72828 -331896 110530 116673 21674
10261d5675g899k16099C68701A11256b14100f3474A76334N4923a78987E47134
$$ -45675 -7899 -223998 368701 111256 -214100 -63474 176334 231257 -178987 547134
10250d6236A6887a06572e0570A69646Q4898P7363h4608A97319p9191G031J78653
$$ -46236 16887 -106572 -50570 169646 254544 331907 -84608 197319 118128 7031 185684
10239A85684A7108J16602d7270G823J18098a14492C78207e5767o9176B19095c5240
$$ 185684 17108 133710 -47270 7823 125921 -114492 378207 -55767 -124943 219095 -35240
10227A27150e3720A13419L3316n164N0931O8105a45320B4624b02119B3617K15557
$$ 127150 -53720 113419 146735 141571 192502 260607 -145320 24624 -202119 23617 239174
10216B39174c3093A51666b09115k0637B78923c40649a65043D3755A3651f480j77682
$$ 239174 -33093 151666 -209115 -229752 278923 -340649 -165043 43755 13651 -6480 -184162
10205a84162O9791A38827C0349d39620C3751a62802k78985b5294k00173R0909
$$ -184162 -114371 138827 30349 -439620 33751 -162802 -441787 -25294 -225467 -134558
10195a34558k22502J70967A76337c1286k16977a21229l7355P1887o5096J2065
$$ -134558 -357060 -186093 176337 -31286 -248263 -121229 -158584 -86697 -151793 -139728
10185a39728k34901a57802F2109f9080k77655B13135a25968N5363k01019D1705
$$ -139728 -374629 -157802 62109 -69080 -346735 213135 -125968 -70605 -271624 41705
10174a45551f1328n7052o2297J6138A8853b0156k07479Q8383b6015j43321A5821
$$ -145551 -61328 -118380 -180677 -164539 18853 -20156 -227635 -139252 -26015 -169336 15821
10162a88919P0523j05498I7161a21333m2488N5814k11280G5685A2502K28436C2851
$$ -188919 -118396 -223894 97161 -121333 -163821 -108007 -319287 75685 12502 240938 32851
10150b25311m1788A34421k4862g9659j8223A76664c7121B32706a57581J9686A47001
$$ -225311 -267099 134421 109559 -79659 -97882 176664 -37121 232706 -157581 -137895 147001
10138b60803a13484k88076F1639g34932c24377A0363f5479Q521A67842b41410
$$ -260803 -113484 -401560 61639 -734932 -324377 10363 -65479 -56958 167842 -241410
10127C4839K57176G4840a3453C578a22459k52011a81437N2342l41425a15008o8579
$$ 34839 292015 74840 -13453 3578 -122459 -374470 -181437 -129095 -470520 -115008 -183587
10116a83587K9680b9394A81430c6190r085j66087G0865b24164j64324I3197b1459
$$ -183587 -153907 -29394 181430 -36190 -45275 -211362 70865 -224164 -388488 93197 -21459
10104b46850G7796e0184j12015D22189a17544j24606A0347a72158g7336j19193
$$ -246850 77796 -50184 -162199 422189 -117544 -242150 10347 -172158 -77336 -196529
10094a96529i2919j09869H9294c05019J47495b4435a1582j95115A39017b04770
$$ -196529 -92919 -202788 89294 -305019 -157524 -24435 -11582 -206697 139017 -204770
10083a19087N2706m05885f029j25836L3172B910f4646a3195B65437J12189b8561
$$ -119087 -66381 -472266 -6029 -131865 -98693 2910 -64646 -13195 265437 377626 -28561
10071a97197A97741i1647A78669e34174A68923I531a0022B77985A14221M6631
$$ -197197 197741 -91647 178669 -534174 168923 9531 -10022 277985 114221 160852
10061A60852b95146f4127A06417d58976E6494a25765A12244J92022d69047a38928
$$ 160852 -295146 -64127 106417 -458976 56494 -125765 112244 304266 -469047 -138928
10050a11283C19017a82355R1148B3654i1737C10033g2901A30019D6202R3125b28981
$$ -111283 319017 -182355 -91207 23654 -91737 310033 -72901 130019 46202 139327 -228981
10038B9727a44924f1369n76k51434C7140J05309d44336A57457a58825A04420b08869
$$ 29727 -144924 -61369 -61945 -313379 37140 142449 -444336 157457 -158825 104420 -208869
10026B24207j00607b62312P1747B18707k7097a14369k0492c6354J7227k13673
$$ 224207 123600 -262312 -190565 218707 191610 -114369 -134861 -36354 -19127 -232800
10016b32800h216j3526l97797J71517P9232h2092A23717N3031a3415B3895d7309
$$ -232800 -8216 -21742 -419539 -248022 -168790 -82092 123717 176748 -13415 23895 -47309
10004b6031A49036D923b12672g7552b5652j98839o7352C12036a34521N7102j59922
$$ -26031 149036 4923 -212672 -77552 -25652 -224491 -291843 312036 -134521 -77419 -237341
9993b37341A13471K189K21453j38496i802p387j07940b7469j63584b7634B2935
$$ -237341 113471 115660 337113 198617 -9802 -17189 -125129 -27469 -191053 -27634 22935
9981D3940b2468A50833K7206E737a38365B3265K25668b68670p5374J39285M392
$$ 43940 -22468 150833 178039 5737 -138365 23265 248933 -268670 -344044 -204759 -200367
9970b00367D1026b31319h7772j44705c2489o2757r7255j51543A90005j1108J62313
$$ -200367 41026 -231319 -87772 -232477 -32489 -95246 -192501 -344044 190005 178897 341210
9959C41210C7870d2764j49873N5582k14021O8173k56291I9369D2516K62584f395
$$ 341210 37870 -42764 -192637 -137055 -351076 -282903 -539194 99369 42516 305100 -6395
9947G3485a20098D7406N2829K0779C8119a7553A44035m1359a60738N9514A90274
$$ 73485 -120098 47406 100235 121014 38119 -17553 144035 102676 -160738 -101224 190274
9935G1851c22683G2523H015c66751A27695a10703I9949e3777p3740k01100A14584
$$ 71851 -322683 72523 8015 -366751 127695 -110703 99949 -53777 -127517 -328617 114584
9923b005k04534D2628e6884k36464f1375a2249C8651b10139B7628a85940F9696
$$ -2005 -206539 42628 -56884 -293348 -61375 -12249 38651 -210139 27628 -185940 69696
9911a04350D06785a0441k49966k3188J12738P9701k0922m1038k9597C0959a2439
$$ -104350 406785 -10441 -260407 -283595 -170857 -91156 -112078 -153116 -182713 30959 -12439
9899c28534e5035B77517b77078H713a3739k0556H8850b17583F9204a18854R173
$$ -328534 -55035 277517 -277078 8713 -13739 -34295 88850 -217583 69204 -118854 -109681
9888a09681I8858d974A48243b50670A700i7416A6330a51665c5898k5073b8806
$$ -109681 98858 -4974 148243 -250670 1700 -97416 16330 -151665 -35898 -60971 -28806
9876A28835a39443M2352j72339C2920d21926a12347A28180a93870g9835r2387
$$ 128835 -139443 -97091 -269430 32920 -421926 -112347 128180 -193870 -79835 -172222
9866a72222A75649c06101A16729J12266A9867b84278K029K0665b0640A46360A1627
$$ -172222 175649 -306101 116729 228995 19867 -284278 -282249 -261584 -20640 146360 11627
9854d3678G7925b5905r7741G0190k8407K8055a35208p6035m641A81184a30520
$$ -43678 77925 -25905 -123646 70190 41783 69838 -135208 -211243 -215884 181184 -130520
9842c7623F1584D442K93311I1905b04459A05093b6337j62587B2782J8515D83g2191
$$ -37623 61584 4442 297753 91905 -204459 105093 -26337 -188924 22782 41297 483 -72191
9829a04652j24227e0019j66097A31518h7215A59937o9460m878Q0488h3955c1258
$$ -104652 -228879 -50019 -216116 131518 -87215 159937 90477 85599 166087 -83955 -31258
9817b66482q358A69073c39006G3266B2272b34472A78092k6147b87080B6347R5283
$$ -266482 -274840 169073 -339006 73266 22272 -234472 178092 151945 -287080 26347 121630
9806A21630E3623b13403A19312a01296J4063K1277A73818h4014k13342D5596L035
$$ 121630 53623 -213403 119312 -101296 -87233 -65956 173818 -84014 -297356 45596 48631
9795D8631a58999e7542o7645f2009A82208Q832a37988M8928a5608C07984N8274
$$ 48631 -158999 -57542 -125187 -62009 182208 191040 -137988 -89060 -15608 307984 366258
9784C66258a04550k9366B61838D1795b0820m83579b03996C06085E457R6917a51966
$$ 366258 -104550 -133916 261838 41795 -20820 -504399 -203996 306085 5457 102374 -151966
9772e968n1585B8041b6119A62655h5375E9008M7399m2319J17K81259D7878d0740
$$ -5968 -57553 28041 -26119 162655 -85375 59008 106407 64088 64205 345464 47878 -40740
9759a05017f848r1224r5464n4820a05727M9625k19096a08077G9286d8464b2264
$$ -105017 -6848 -98072 -193536 -248356 -105727 -56102 -275198 -108077 79286 -48464 -22264
9747a03221m8161H5131d81564b5926F9504J11066G1664b2294j48608D1876K6775
$$ -103221 -151382 85131 -481564 -25926 69504 180570 71664 -22294 -170902 41876 68651
9736F8651J34823b40430B24242d2559B4815h381B03930a26093G1259d9433p5791
$$ 68651 203474 -240430 224242 -42559 24815 -8381 203930 -126093 71259 -49433 -125224
9725a25224j71460J21120a3026m9564r1980e6310A27135b85718A23023a18615
$$ -125224 -296684 -175564 -13026 -62590 -154570 -56310 127135 -285718 123023 -118615
9714a77105P3840r5043O6556O2472A61588a33259k2230A38896R3362c92839R6266
$$ -177105 -103265 -198308 -131752 -69280 161588 -133259 -155489 138896 232258 -392839 -296573
9703b96573j48648e5598j56058I538K0212a24657D257b78434K4343H5319c62511
$$ -296573 -445221 -55598 -211656 9538 29750 -124657 4257 -278434 -254091 85319 -362511
9691D1949J89036b68902e0007q6032G905A453O6029j5080a50024n8500m8440H8512
$$ 41949 230985 -268902 -50007 -136039 7905 1453 67482 52402 -150024 -208524 -256964 88512
9678c09619J40284b5120k07229C61151i3322C35028f1474C9754b40899j7634a13292
$$ -309619 -169335 -25120 -232349 361151 -93322 335028 -61474 39754 -240899 -258533 -113292
9666i3908l75670A21114D7979h8257J0830k13081A64467J61673a9807B15504b81238
$$ -93908 -469578 121114 47979 -88257 -77427 -290508 164467 326140 -19807 215504 -281238
9654G6391b00767Q9286A8247O8356a20797k61062J19116a04382A36315a77958
$$ 76391 -200767 -111481 18247 86603 -120797 -381859 -262743 -104382 136315 -177958
9643a35846C901h2258C5902d82904J73384d7278J9245m33227a24629B17824M0102
$$ -135846 3901 -82258 35902 -482904 -309520 -47278 -28033 -461260 -124629 217824 257926
9632B57926b09312g2682B12712f4817J5580n3888j53228F9552K28261A32965a91285
$$ 257926 -209312 -72682 212712 -64817 -49237 -103125 -256353 69552 297813 132965 -191285
9620B44087h5435j29019J01473k34418E2219b31194f8760a8871k4017F3784a27335
$$ 244087 -85435 -214454 -112981 -347399 52219 -231194 -68760 -18871 -42888 63784 -127335
9608h5250k6543B2245b7376j79187H575b26681a06362j66537K8937j0836I1286
$$ -85250 -111793 22245 -27376 -206563 8575 -226681 -106362 -272899 -243962 -254798 91286
9596a87738j03141G6500Q6401g2694k22526d8719M946j79529d0572j42409Q7477
$$ -187738 -290879 76500 162901 -72694 -295220 -48719 -43773 -223302 -40572 -182981 -95504
9585i5504E9380a02199a8615M769G3793a2134p2818j70759B18766f7333l87056
$$ -95504 59380 -102199 -18615 -13846 73793 -12134 -84952 -255711 218766 -67333 -454389
9574d54389E4066J61850c8236m15458a0902H3772a1851j54447A22515b55280a19528
$$ -454389 54066 215916 -38236 -453694 -10902 83772 -11851 -166298 122515 -255280 -119528
9562A26154N4656L3500P7821a4733q2858A26095a7847j34024p549k849H2091d2631
$$ 126154 180810 214310 292131 -14733 -97591 126095 -17847 -151871 -159420 -162269 82091 -42631
9549b77214I9377a4820l96103J69585a02041I5352c88373n8867I5199a35692L1037
$$ -277214 99377 -14820 -410923 -241338 -102041 95352 -388373 -447240 95199 -135692 -104655
9538a04655b1964A19297a68888H1826e6541j67545A6522J66102a74979K3277d332
$$ -104655 -21964 119297 -168888 81826 -56541 -224086 16522 182624 -174979 -151702 -4332
9526a6632A01810D7174a73834M8001L1104j52459B16254a94043B14161a85054
$$ -16632 101810 47174 -173834 -125833 -94729 -247188 216254 -194043 214161 -185054
9515E4176K30156a08089J3774O850j21526A26048B8387A533a94249g2957E5425
$$ 54176 284332 -108089 -94315 -87465 -208991 126048 28387 1533 -194249 -72957 55425
9503i6529A36831n7800b66626B83030A08862a34412j72831i516k38882J03625
$$ -96529 136831 79031 -266626 283030 108862 -134412 -307243 -9516 -248398 -144773
9493a44773e2855C1603A5260J01348K5940b45244a6665j84400J9974n7620C01978
$$ -144773 -52855 31603 15260 116608 142548 -245244 -16665 -201065 -181091 -238711 301978
9481A78091b55555L6915M4325Q0561c7515C20486A15000c00120c9747q2823j41357
$$ 178091 -255555 -218640 -174315 -93754 -37515 320486 115000 -300120 -39747 -122570 -263927
9470b63927O3257f0601A0201L3887a31823A2092a25099C8834a52543c8915P452
$$ -263927 -200670 -60601 10201 44088 -131823 12092 -125099 38834 -152543 -38915 -31463
9459c1463I9615b93485j8081C1752K06377b01319O5269A7378c29214J57207P4172
$$ -31463 99615 -293485 -311566 31752 238129 -201319 -136050 17378 -329214 -172007 -97835
9448i7835c3078A73809G2961b99697F5729h3468l4334M4987m501F745h5671F1287
$$ -97835 -33078 173809 72961 -299697 65729 -83468 -117802 -72815 -77316 6745 -85671 61287
9435b85614B99488c27582a15330F3960c45873B49130a7281j88769A21203j9075
$$ -285614 299488 -327582 -115330 63960 -345873 249130 -17281 -206050 121203 102128
9425A02128a71813A73714a44246H1493C8346J63385a77942j746e477l4799k41716
$$ 102128 -171813 173714 -144246 81493 38346 201731 -177942 -179688 -5477 -40276 -281992
9414b81992J32063d7792A70342g408n3675B03391K4912E8643b75722A12261k7975
$$ -281992 -149929 -47792 170342 -7408 -61083 203391 228303 58643 -275722 112261 84286
9403H4286b64945J06760J5488J0756H5990k0586Q5816E8530N2566d9634r853b1040
$$ 84286 -264945 -158185 -142697 -131941 85990 65404 151220 58530 111096 -49634 -59487 -21040
9390b34902A40288a20946K2695l4525J567H5091a49914N832M3302B10667c1991
$$ -234902 140288 -120946 -98251 -132776 -131209 85091 -149914 -144082 -100780 210667 -31991
9378B10368o671H4391a78606B24141n4933d9985l0878r1351A47668a05799F4612
$$ 210368 203697 84391 -178606 224141 169208 -49985 -80863 -172214 147668 -105799 64612
9366B3806a45991r1763F6952b31008R2869A22045M665a85094e3482A8866b45622
$$ 23806 -145991 -237754 66952 -231008 -138139 122045 126710 -185094 -53482 18866 -245622
9354A91885b2767E2393e12624c078B7382K71270D5566a44588b0650k40866N1071
$$ 191885 -22767 52393 -512624 -3078 27382 298652 45566 -144588 -20650 -261516 -210445
9343b10445a00354B17632r8328b0834k06512E0337b69567P9746g4193L4346q0272
$$ -210445 -100354 217632 119304 -20834 -227346 50337 -269567 -189821 -74193 -39847 -120119
9332a20119j18056i8646j25974J2560m4505A89584c17216M6947a3214n8099q3895
$$ -120119 -238175 -98646 -224620 -212060 -256565 189584 -317216 -270269 -13214 -71313 -155208
9321a55208A4890L3837a48500B7762a48095K073M2280j12042A73667g5666F0650
$$ -155208 14890 48727 -148500 27762 -148095 -146022 -103742 -215784 173667 -75666 60650
9309a59885H671K59903k8190b29844a13846j93525M9987m9994a45747A1541a62150
$$ -159885 8671 268574 240384 -229844 -113846 -307371 -257384 -307378 -145747 11541 -162150
9297a07720b6385k29502d6387I2050a59296A02752a58769H5025M8995P7561a56969
$$ -107720 -26385 -255887 -46387 92050 -159296 102752 -158769 85025 134020 211581 -156969
9285C081c7401F3302K5588m2432f6748j53709j6036m5652A06663K5538d3460i197
$$ 3081 -37401 63302 88890 46458 -66748 -220457 -236493 -282145 106663 132201 -43460 -9197
9272D062h4730C2094J23986b10970c740A85436a92012D36524d09515A05431l8392
$$ 4062 -84730 32094 156080 -210970 -3740 185436 -192012 436524 -409515 105431 67039
9261F7039b65016a20166j01401A46662a52640K7947o3194E3432c9078r2650H4418
$$ 67039 -265016 -120166 -221567 146662 -152640 -124693 -187887 53432 -39078 -131728 84418
9249g0076E7132N5786b57918e6455j8544H458f1985l202B5993K58852c44643g4750
$$ -70076 57132 112918 -257918 -56455 -74999 8458 -61985 -65187 25993 284845 -344643 -74750
9236d7802F4823a07502G6554h4015L6026A84482d5835B47985F2076a49967K5301
$$ -47802 64823 -107502 76554 -84015 -47989 184482 -45835 247985 62076 -149967 -124666
9225a24666M1365E9966e1156j05291k4621B05481b6536C529a93879N1742j65885
$$ -124666 -83301 59966 -51156 -156447 -181068 205481 -26536 3529 -193879 -142137 -308022
9214c08022C8471J45890N612a66908c2786k28178B98185a87085A09058b45361
$$ -308022 38471 184361 189973 -166908 -32786 -260964 298185 -187085 109058 -245361
9203e2390A56456a3404k2591H9770b68477K218k905A82908F2046B9772K6761c09782
$$ -52390 156456 -13404 -35995 89770 -268477 -266259 -269164 182908 62046 29772 56533 -309782
9190C83900E3072L1933a03421a1554C2671L06426d70737b18029A79834a03237
$$ 383900 53072 85005 -103421 -11554 32671 339097 -470737 -218029 179834 -103237
9179h3307B14178a92301B71893h9481A79769a95963A93819a98003D7600J39206
$$ -83307 214178 -192301 271893 -89481 179769 -195963 193819 -198003 47600 186806
9169A86806f8041P463A3965b63426F8O5953b07566d1254C68112a31011H4192h6598
$$ 186806 -68041 -60578 13965 -263426 68 66021 -207566 -41254 368112 -131011 84192 -86598
9156a05337K1088J2584j59848f1468a8329G4914B8957b12208j07082c6310k04507
$$ -105337 -84249 -71665 -231513 -61468 -18329 74914 28957 -212208 -319290 -36310 -240817
9145b40817O4396M4386A53690b173k4350k71725g1068c1503A08681M230a3677
$$ -240817 -176421 -132035 153690 -2173 -26523 -298248 -71068 -31503 108681 112911 -13677
9133a02285k10538f9790A50956c566k8001E9141b37039a6334p9011j41514i4778
$$ -102285 -312823 -69790 150956 -3566 -31567 59141 -237039 -16334 -95345 -236859 -94778
9121b36163N9331N3527L3236A8353a90561k07009b1208P481j03407B43075A0343
$$ -236163 -176832 -123305 -90069 18353 -190561 -397570 -21208 -13727 -117134 243075 10343
9109c02040B08817c05284A4137J60953b50596B91272i3570n8643e1245C50226
$$ -302040 208817 -305284 14137 175090 -250596 291272 -93570 -152213 -51245 350226
9098e382B86694a00043B34065a01885q8758D06575b01725G4239c95989A62429
$$ -5382 286694 -100043 234065 -101885 -190643 406575 -201725 74239 -395989 162429
9087a12753A24010C1K19947i5097k4311j23112k0163J28614k23209J52465A6551
$$ -112753 124010 31 219978 -95097 -119408 -242520 -262683 -134069 -357278 -204813 16551
9075A35228a72777p7995f1054j39092K3115h7322B56507j08050b61l4760j22688
$$ 135228 -172777 -250772 -61054 -200146 -177031 -87322 256507 148457 -261 -35021 -157709
9064a57709A0772K04978c9969A60455b6117k27235J08844A98481b61743c6141
$$ -157709 10772 215750 -39969 160455 -26117 -253352 -144508 198481 -261743 -36141
9053A33888a78462D9089a24177n7852j85286B95039F6590a11757A51253n7030
$$ 133888 -178462 49089 -124177 -182029 -367315 295039 66590 -111757 151253 94223
9043I4223a79044G5134C0354a04773A80332b3355F1956e8686C28926c04617B38107
$$ 94223 -179044 75134 30354 -104773 180332 -23355 61956 -58686 328926 -304617 238107
9031i9119a5353j633p9211B25694c32760A11397b17373j65542J40588A51151i5684
$$ -99119 -15353 -16986 -96197 225694 -332760 111397 -217373 -382915 -242327 151151 -95684
9019a90707I9203a30106Q760K1918j93535a10001B9678c15689a41124e298C68635
$$ -190707 99203 -130106 -121346 -99428 -292963 -110001 29678 -315689 -141124 -5298 368635
9007a38562G5900c469m0491j85474l7880b9630k89417G2530a83777G7271b9213
$$ -138562 75900 -3469 -43960 -229434 -267314 -29630 -319047 72530 -183777 77271 -29213
8995c13297A00338L4730d21247b3067D0838a26735A45556d70227b073k44565H1553
$$ -313297 100338 135068 -421247 -23067 40838 -126735 145556 -470227 -2073 -246638 81553
8983b9883p8354D06176A84109a16631j56389e3417j02149D56221a06471n2671
$$ -29883 -108237 406176 184109 -116631 -273020 -53417 -155566 456221 -106471 -159142
8973a59142k6243K9151A48820D4104c3711H9235a99839f3876H1462M3097j2119
$$ -159142 -185385 -156234 148820 44104 -33711 89235 -199839 -63876 81462 124559 112440
8962A12440i0026A0988a36779n4916e6739m0004j85395A03264J07158K09852i7013
$$ 112440 -90026 10988 -136779 -191695 -56739 -96743 -282138 103264 210422 420274 -97013
8950b08211A11026a18602A69336C6239a80171f9801K4995H6441K36768D8825d6056
$$ -208211 111026 -118602 169336 36239 -180171 -69801 -44806 86441 323209 48825 -46056
8938f8667j34871h3033A19577b08072L3110k62077B77646E506K60530a33911G4944
$$ -68667 -203538 -83033 119577 -208072 -174962 -437039 277646 5506 266036 -133911 74944
8926A90917a0322A79732q30m3643A4724J57863M7532i389B33558H3427P6526J14924
$$ 190917 -10322 179732 178902 135259 14724 172587 220119 -9389 233558 83427 159953 274877
8914B74877J863Q3054L12778M6867K69549K90996Q95172J320137M197166k29186
$$ 274877 276740 359794 672572 719439 988988 1279984 2175156 3495293 7692459 7463273
8904G463273C666561j753167o70083k74309m08566B55292j7137K43881H4598b5480
$$ 7463273 3666561 1913394 1243311 969002 560436 255292 238155 482036 84598 -25480
8893A64632b8580B70962E5864K97498c15256C44771a56192N2900a6102C62b2260
$$ 164632 -28580 270962 55864 353362 -315256 344771 -156192 -103292 -16102 362 -22260
8881b55230b3812j2347A97424d3802l4121r8697j65696J05868C47423b51491o3173
$$ -255230 -23812 -36159 197424 -43802 -77923 -176620 -342316 -236448 347423 -251491 -314664
8870c14664L6655P9219A33058h4082j28124a0104H742a29532E697a09163E6717
$$ -314664 -278009 -198790 133058 -84082 -212206 -10104 8742 -129532 5697 -109163 56717
$$ [...]
##END NTUPLES=NMR SPECTRUM
##END=
