
##TITLE=UV1055_TOCA01-ROVE100D_6100010_pmNMsA0UUi
##JCAMPDX= 6.0         $$ Bruker NMR JCAMP-DX V2.0
##DATA TYPE= NMR SPECTRUM
##DATA CLASS= NTUPLES
##ORIGIN= BRUKER
##OWNER= Administrator
$$ 1.72 TOPSPIN		Version 2.1
$$ 2012-05-13 01:54:17.359 -0500  Administrator@TOPSPIN
$$ Compression mode = diff/dup
##.OBSERVE FREQUENCY= 400.13188235
##.OBSERVE NUCLEUS= ^1H
##.ACQUISITION MODE= SIMULTANEOUS (DQD)
##.ACQUISITION SCHEME= undefined
##.AVERAGES= 64
##.DIGITISER RES= 22
##SPECTROMETER/DATA SYSTEM= spect
##.PULSE SEQUENCE= noesygpps1d.comp
##.SOLVENT NAME= COFFEE_meoh
##.SHIFT REFERENCE= INTERNAL, COFFEE_meoh, 1, 14.96677
##AUDIT TRAIL= $$ (NUMBER, WHEN, WHO, WHERE, PROCESS, VERSION, WHAT)
$$ ##TITLE= Audit trail, TOPSPIN		Version 2.1
$$ ##JCAMPDX= 5.01
$$ ##ORIGIN= Bruker BioSpin GmbH
$$ ##OWNER= Administrator
$$ $$ C:\Bruker\TOPSPIN/data/COFFEE/nmr/UV1055_TOCA01-ROVE100D_6100010_pmNMsA0UUi/12/pdata/1/auditp.txt
$$ ##AUDIT TRAIL=  $$ (NUMBER, WHEN, WHO, WHERE, PROCESS, VERSION, WHAT)
(   1,<2012-05-13 01:54:12.500 -0500>,<Administrator>,<TOPSPIN>,<go>,<TOPSPIN 2.1>,
      <created by zg
	started at 2012-05-13 01:42:42.328 -0500,
	POWCHK enabled, PULCHK disabled,
       configuration hash MD5:
       AF F2 23 6B 01 CD 40 DD E5 A1 38 A0 06 EA F7 77
       data hash MD5: 64K
       BE 83 77 10 9E A4 36 E9 31 49 1B 63 2E 35 63 9B>)
(   2,<2012-05-13 01:54:15.375 -0500>,<Administrator>,<TOPSPIN>,<proc1d>,<TOPSPIN 2.1>,
      <Start of raw data processing
       efp LB = 0.3 FT_mod = 6 PKNL = 1 PHC0 = 0 PHC1 = 0 SI = 128K 
       data hash MD5: 128K
       37 FB 09 36 8D 64 92 0E E3 39 6F E1 30 61 A0 21>)
(   3,<2012-05-13 01:54:16.609 -0500>,<Administrator>,<TOPSPIN>,<proc1d>,<TOPSPIN 2.1>,
      <pk PHC0 = 37.81494 PHC1 = 0 
       data hash MD5: 128K
       17 AF 83 47 5B 39 46 59 8E F8 C8 5E 06 97 FF EC>)
(   4,<2012-05-13 01:54:16.843 -0500>,<Administrator>,<TOPSPIN>,<proc1d>,<TOPSPIN 2.1>,
      <abs ABSG = 1 
       data hash MD5: 128K
       08 AD 59 25 EA 6B DF B4 10 2B 50 D1 47 5C 1F 4C>)
(   5,<2012-05-13 01:54:16.921 -0500>,<Administrator>,<TOPSPIN>,<proc1d>,<TOPSPIN 2.1>,
      <abs ABSG = 2 
       data hash MD5: 128K
       E2 E6 18 C1 D5 EF 5D CD 03 A4 46 2C D9 FD EA 9C>)
(   6,<2012-05-13 01:54:17.156 -0500>,<Administrator>,<TOPSPIN>,<proc1d>,<TOPSPIN 2.1>,
      <abs ABSG = 3 
       data hash MD5: 128K
       92 E2 B7 6C A7 6E D3 5B A9 00 55 67 F3 F9 9F 6C>)
(   7,<2012-05-13 01:54:17.203 -0500>,<Administrator>,<TOPSPIN>,<proc1d>,<TOPSPIN 2.1>,
      <abs ABSG = 4 
       data hash MD5: 128K
       3A 94 51 A1 E5 C4 E5 AB EF 61 4F D2 FD 86 9E 2F>)
(   8,<2012-05-13 01:54:17.265 -0500>,<Administrator>,<TOPSPIN>,<proc1d>,<TOPSPIN 2.1>,
      <abs ABSG = 5 
       data hash MD5: 128K
       A3 D1 A0 E6 16 1B 34 56 36 8F 0F A0 77 DE C0 0E>)
$$ ##END=
$$ 
$$ $$ hash MD5
$$ $$ C5 72 C2 62 7C C9 12 6C B7 3F 56 F4 F6 D5 00 2E
##$RELAX= 
##$RELAX= 
##$RELAX= 
##$RELAX= 
##$RELAX= 
##$RELAX= 
##$RELAX= 
##$RELAX= 
$$ [...]
##$TP07= 0
##$TPNAME0= <>
##$TPNAME1= <>
##$TPNAME2= <>
##$TPNAME3= <>
##$TPNAME4= <>
##$TPNAME5= <>
##$TPNAME6= <>
##$TPNAME7= <>
##$TPOAL= (0..7)
0.5 0.5 0.5 0.5 0.5 0.5 0.5 0.5
##$TPOFFS= (0..7)
0 0 0 0 0 0 0 0
##$TUNHIN= 0
##$TUNHOUT= 0
##$TUNXOUT= 0
##$USERA1= <user>
##$USERA2= <user>
##$USERA3= <user>
##$USERA4= <user>
##$USERA5= <user>
##$V9= 5
##$VALIST= <valist>
##$VCLIST= <CCCCCCCCCCCCCCC>
##$VD= 0
##$VDLIST= <DDDDDDDDDDDDDDD>
##$VPLIST= <PPPPPPPPPPPPPPP>
##$VTLIST= <TTTTTTTTTTTTTTT>
##$WBST= 2048
##$WBSW= 25
##$XGAIN= (0..3)
0 0 0 0
##$XL= 0
##$YL= 0
##$YMAX_a= 10670448
##$YMIN_a= -5388174
##$ZGOPTNS= <>
##$ZL1= 120
##$ZL2= 120
##$ZL3= 120
##$ZL4= 120
##$ABSF1= 14.96677
##$ABSF2= -5.58576
##$ABSG= 5
##$ABSL= 3
##$ALPHA= 0
##$AQORDER= 0
##$ASSFAC= 0
##$ASSFACI= 0
##$ASSFACX= 0
##$ASSWID= 0
##$AUNMP= <proc_prof1d_extract.lims>
##$AXLEFT= 0
##$AXNAME= <>
##$AXNUC= <1H>
##$AXRIGHT= 0
##$AXTYPE= 0
##$AXUNIT= <>
##$AZFE= 0.1
##$AZFW= 0.1
##$BCFW= 0
##$BC_mod= 0
##$BYTORDP= 0
##$COROFFS= 0
##$CY= 15
##$DATMOD= 1
##$DC= 0
##$DFILT= <>
##$DTYPP= 0
##$F1P= 0
##$F2P= 0
##$FCOR= 0.5
##$FTSIZE= 131072
##$FT_mod= 6
##$GAMMA= 0
##$GB= 0
##$INTBC= 1
##$INTSCL= 1
##$ISEN= 128
##$LB= 0.3
##$LEV0= 0
##$LPBIN= 0
##$MAXI= 10000
##$MC2= 0
##$MEAN= 0
##$ME_mod= 0
##$MI= 0
##$NCOEF= 0
##$NC_proc= -3
##$NLEV= 6
##$NOISF1= 0
##$NOISF2= 0
##$NSP= 0
##$NTH_PI= 0
##$NZP= 0
##$OFFSET= 14.96677
##$PC= 1
##$PHC0= 37.81494
##$PHC1= 0
##$PH_mod= 1
##$PKNL= yes
##$PPARMOD= 0
##$PPDIAG= 0
##$PPIPTYP= 0
##$PPMPNUM= 2147483647
##$PPRESOL= 1
##$PSCAL= 4
##$PSIGN= 0
##$PYNMP= <proc.py>
##$REVERSE= no
##$SF= 400.130005537078
##$SI= 131072
##$SIGF1= 0
##$SIGF2= 0
##$SINO= 400
##$SIOLD= 131072
##$SPECTYP= <>
##$SREGLST= <1H.CDCl3>
##$SSB= 0
##$STSI= 131072
##$STSR= 0
##$SW_p= 8223.68421052632
##$SYMM= 0
##$S_DEV= 0
##$TDeff= 65536
##$TDoff= 0
##$TI= <>
##$TILT= no
##$TM1= 0
##$TM2= 0
##$TOPLEV= 0
##$USERP1= <user>
##$USERP2= <user>
##$USERP3= <user>
##$USERP4= <user>
##$USERP5= <user>
##$WDW= 1
##$XDIM= 131072
##$YMAX_p= 430671719
##$YMIN_p= -97355395
##$CURPLOT= <Network HP LaserJet P1505>
##$CURPRIN= <$Network HP LaserJet P1505>
##$DFORMAT= <normdp>
##$LAYOUT= <+/1D_H.xwp>
##$LFORMAT= <normlp>
##$PFORMAT= <normpl>
##$SURQMSG= 1
$$ End of Bruker specific parameters
$$ ---------------------------------
##NTUPLES= NMR SPECTRUM
##VAR_NAME=  FREQUENCY,     SPECTRUM/REAL,   SPECTRUM/IMAG
##SYMBOL=    X,             R,               I
##VAR_TYPE=  INDEPENDENT,   DEPENDENT,       DEPENDENT
##VAR_FORM=  AFFN,          ASDF,            ASDF
##VAR_DIM=   131072,        131072,          131072
##UNITS=     HZ,            ARBITRARY UNITS, ARBITRARY UNITS
##FACTOR=    0.0627417313425165, 1,          1
##FIRST=     8223.62146879498, 1732,         -103750
##LAST=      0,             3540,            -105313
##MIN=       0,             -97355395,       0
##MAX=       8223.62146879498, 430671719,    0
$$ Real data points
##PAGE= N=1
##DATA TABLE= (X++(R..R)), XYDATA
$$ [...]
64706 372965 376929 381807 386801 391578 396130 400315 404532 410187 418171 427151 434745 440436 446027 453008
64692 453008 460870 468507 475913 483440 490352 495340 498070 499261 499533 499036 497898 496102 492976 487647 480118
64677 480118 471357 462376 453750 445791 438399 430774 422236 413583 406835 403119 401354 399546 396953 394432
64663 394432 392937 392380 392098 392044 393138 396337 401368 406597 410387 412517 414043 415933 418337 421078 424039
64648 424039 426694 427999 427553 426422 425953 425845 424357 420659 416076 412362 409334 405071 398273 389623 380774
64633 380774 372794 366032 360879 357792 356463 355489 353248 349285 344907 342393 343269 346950 351124 353721 354587
64618 354587 355113 356470 358639 361164 364202 368351 373595 378958 383409 386970 390703 395512 401029 405932
64604 405932 409412 411994 414534 416700 417095 414962 411149 407112 403543 400474 398192 397198 397314 397599 397407
64589 397407 397018 396987 397353 397917 398964 401183 404809 409200 413390 416913 420016 423281 427289 432641 439997
64574 439997 449741 461482 473962 485568 494999 501691 506005 509232 513013 518101 523461 526834 526416 522058
64560 522058 514963 506642 498272 490577 483684 477016 469712 461410 452561 443967 436159 429208 422770 416155
64546 416155 408771 400983 394382 390631 389849 390418 390557 389794 388769 388122 388053 388765 390725 394249 399041 404249
64530 404249 408860 412165 414142 415544 417507 421013 426597 434168 442790 450966 457771 463744 470193 477548
64516 477548 484881 491180 496478 501396 506075 510111 513234 515355 515967 514128 509375 502459 494980 488347
64502 488347 482991 478173 472307 463775 452084 438565 425692 415256 407112 399852 392601 385714 379832
64489 379832 375059 371401 369190 368248 367236 365029 362547 362002 364153 367393 369835 371097 371554 371184 370233
64474 370233 369939 371126 372549 372064 369258 365604 362102 358231 353594 349242 346451 345023 343691 341791 339742
64459 339742 338089 336860 336015 336017 337561 340681 344274 346803 347710 348052 349566 353217 358742 365160 371253 375851
64443 375851 378399 379321 379500 379608 380496 383796 390992 401666 413536 424430 433481 440354 444640 446770
64429 446770 448442 451046 454135 456281 456950 456644 455735 454343 453215 453521 455496 458034 459856 460457 459809 457910
64413 457910 455048 452011 449532 447637 445710 443125 439890 436915 435569 436645 439710 443711 448048 452781
64399 452781 458010 463555 469060 473934 477368 479028 479642 480320 481522 483335 486394 491359 497521 503365 508884
64384 508884 515937 525544 536269 546511 557218 570580 586591 602877 618123 634057 653369 676896
64372 676896 703589 732369 763068 796034 831725 870683 913498 960742 1013097 1071241 1135459
64361 1135459 1205607 1281527 1363055 1449390 1538948 1630139 1721803 1812437 1899449 1979950 2052278
64350 2052278 2116115 2171052 2215485 2247271 2265299 2270265 2263943 2247821 2222403 2187580 2143226 2089228
64338 2089228 2025482 1952588 1872490 1787737 1700076 1610574 1521153 1434800 1353464 1276657 1203112
64327 1203112 1133124 1068104 1008334 952668 900431 852276 808934 770347 736367 706981 681251
64316 681251 657345 634622 614616 598696 585494 572226 558200 545419 535476 527247 518310 507588
64304 507588 495758 483803 472298 461965 453872 448571 445330 442566 439039 434562 429716 425190 421470
64291 421470 418846 417313 416473 415939 415925 416959 418794 420184 420251 419609 419390 419448 418447 415725 412165 409078 407049
64274 407049 406130 406131 406111 404535 400933 396816 394029 392659 391616 390819 391254 392828 393704 392501 390057 388132
64258 388132 387290 387010 387120 387849 388821 389327 389655 390951 393397 395415 395225 392563 388420 383741 379006 374676
64242 374676 371303 369150 368032 367461 366758 365213 362394 358290 353191 347763 343206 340640 339923 339660 338897
64227 338897 338417 339775 343376 348165 352829 356562 358938 360109 361249 363899 368437 373815 379041 384220
64213 384220 389756 395288 400192 404660 409451 414659 419537 423615 427271 430655 432663 431893 428819 426130
64199 426130 426189 428584 431117 432880 434926 437566 438770 436686 432559 429200 427005 423604 417645 410892 405786
64184 405786 402588 400039 397373 394365 390524 385786 381350 378449 376842 375773 375720 377524 380141 381263 380479
64169 380479 380158 382498 386894 390988 393356 394345 395075 396505 399053 402390 405690 408509 411155 413857 415886
64154 415886 415936 413314 408624 403465 399477 397313 396275 395062 392875 389697 385851 381900 378772 377164 376679
64139 376679 376209 375276 374340 373771 373433 373555 375018 378257 382705 387825 393901 401143 408912 416724 425241 435210
64123 435210 445953 456028 464916 472795 478939 481799 480854 477151 471753 464922 457230 450098 444247 438462
64109 438462 431051 422126 413585 407057 402609 399252 395899 391796 386681 380759 374325 367597 361254 356734
64095 356734 355123 355728 356507 356197 355458 355714 357465 360101 362811 365167 367148 369138 371653 374672 377509
64080 377509 379763 381996 384770 387301 388007 386527 384253 382521 381028 378626 375132 371625 369270 368574 369690
64065 369690 372668 377128 382110 386639 390454 394096 398346 403519 409263 415135 421308 428430 436615 445027
64051 445027 452840 460391 468884 478977 490022 500604 509524 516328 521372 525493 529374 533229 537298
64038 537298 542374 549282 557822 566793 575158 582741 589605 595302 599136 600815 600474 598243 594163 588408
64024 588408 581277 572941 563422 552839 541581 530216 519214 508776 498928 489908 482325 476659 472517
64011 472517 468598 463568 457078 450119 444579 442286 443935 448527 453833 457597 458638 457217 454600 452108
63997 452108 450326 449190 448802 449729 452281 455858 459523 463072 467121 472309 478811 486379 494337 501748 508248
63982 508248 514633 522040 530647 539818 549296 559243 568999 576923 581969 584731 586478 587799 588608 588693 587698
63967 587698 585170 581278 577060 573452 570546 568244 566998 567187 568279 569364 570162 570802 571015 570268 568387
63952 568387 565239 560242 553246 545797 540383 538068 537592 537078 535923 534771 534365 534998 536581 538597 540140
63937 540140 540606 540497 541221 543825 548015 552658 557265 562586 569428 577290 584957 592374 600965 611738 623935
63922 623935 636253 648635 661977 676693 692683 710401 730635 753060 776149 798949 822215
63911 822215 847350 874795 903830 933512 963450 993993 1025953 1060025 1096562 1136165 1180042
63900 1180042 1228878 1281450 1335576 1391037 1450796 1518660 1596237 1682729 1777122 1879800 1992411
63889 1992411 2117043 2255553 2408872 2576686 2758006 2952065 3158283 3375389 3601081
63880 3601081 3832737 4068096 4304920 4540122 4769573 4988774 5193444 5379292 5541599
63871 5541599 5675796 5778932 5850345 5890447 5898989 5874986 5818179 5729846 5612106 5467309 5298692
63860 5298692 5110918 4908992 4696685 4476618 4251740 4025820 3802278 3583334 3370894
63851 3370894 3167738 2977005 2800430 2637566 2486790 2346767 2217015 2097631 1988864
63842 1988864 1890683 1802432 1722977 1651327 1586942 1529294 1477479 1430645 1388528 1351041 1317505
63831 1317505 1286787 1258173 1231553 1206694 1182989 1160112 1138343 1117954 1098723 1080402 1063266
63820 1063266 1048031 1035638 1027249 1023700 1024487 1027869 1032527 1038657 1046962 1057273 1068949 1082093 1097380
63807 1097380 1114862 1133746 1153158 1172412 1190817 1208091 1224792 1241464 1257499 1271706 1283770
63796 1283770 1294024 1301902 1305931 1305538 1301644 1295094 1285654 1273081 1258027 1241092 1221842 1199651 1174836
63783 1174836 1148168 1119837 1089695 1058004 1025279 991897 958515 926283 895771 866218 836713
63772 836713 807667 780169 754327 729318 704899 681773 660494 640990 623210 607240 592575
63761 592575 578165 563458 548663 534009 519782 507280 498361 493195 489389 484288 477547 470571 464167
63748 464167 457983 451864 446255 441076 435546 429724 425187 423272 423216 422836 420641 416597 411332 405666 400770
63733 400770 397577 395628 393284 389557 385168 381498 379131 377770 376853 375676 373615 370976 369085 368707 368918
63718 368918 368483 367762 368034 369248 369958 369524 368780 368152 366719 364064 361592 360686 360476 358957 355916 353347
63702 353347 353021 354721 356950 358366 358380 357255 356008 355629 356124 356734 357163 358026 359889 362344 364356 365270
63686 365270 365355 365541 366686 368922 371763 374919 378554 382308 384691 384529 382972 382959 386201 391475 396382 400019
63670 400019 403161 406444 409580 412415 415739 420436 426239 431960 436931 441727 447182 452947 457524 459920
63656 459920 460858 461908 463630 465199 465927 466427 467752 469864 471701 472643 473171 473905 474696 475152 475506 476203 476868
63639 476868 476652 475776 475798 477699 480394 482069 482589 483464 485423 487351 488218 489018 491679 496503 501782 505918
63623 505918 508973 511845 514686 516721 517402 517271 517642 519442 522325 524976 526430 526985 527556 528328 528580 527931
63607 527931 527231 527775 529808 532175 533438 533150 532040 531055 530295 528851 525745 521107 516352 513109 511867
63592 511867 511662 511135 509941 509076 509753 512134 515418 519097 523545 529118 535131 540385 544704 549418 556099
63577 556099 565038 575176 585317 595253 605788 617852 631667 646706 662410 678786 696292 715226
63565 715226 735388 756325 777854 800329 824391 850383 878049 906970 937338 970098 1006236
63554 1006236 1046066 1089249 1135276 1183730 1234196 1286075 1338548 1390851 1442677 1493956 1543672
63543 1543672 1589083 1626969 1655936 1676768 1690333 1696283 1694740 1688242 1680344 1672212 1661848 1646949
63531 1646949 1627509 1605204 1581230 1555472 1527206 1495777 1460899 1423077 1383830 1345142 1308544
63520 1308544 1274718 1243705 1215179 1188708 1164111 1141681 1121996 1105592 1092787 1083578 1077535 1073979
63508 1073979 1072453 1072931 1075584 1080573 1088213 1099035 1113331 1130696 1150172 1170887 1192573 1215643
63496 1215643 1240946 1269363 1301538 1337823 1378223 1422131 1468336 1515883 1565098 1617301 1672949
63485 1672949 1730060 1784701 1833043 1872911 1903618 1924902 1936462 1938544 1932627 1921058 1905939 1888634
63473 1888634 1870334 1852333 1834879 1816005 1792494 1762447 1726439 1686028 1641955 1594380 1544095
63462 1544095 1492400 1439897 1386436 1332518 1279955 1230640 1185171 1143107 1104009 1067524 1032797
63451 1032797 998815 965560 934164 905507 879296 855024 833244 814978 800037 786787 773796
63440 773796 760964 748789 737291 726261 716037 707237 699814 692947 685861 678451 671280 665374 661839
63427 661839 661141 662630 665078 667651 670159 672541 674570 676033 676852 677063 676951 677089 677891 679220 680659 681936
63411 681936 682778 682796 682045 681317 681136 680779 679274 677139 675981 676225 676420 675205 672963 671017 670243 671153 674427
63394 674427 680236 687627 695562 704258 714637 726779 739858 753403 767527 781909 795802 809654
63382 809654 825877 847031 873333 902556 932469 963064 996309 1034061 1076418 1121792 1167939
63371 1167939 1212702 1254378 1292261 1326978 1359881 1392099 1424543 1458627 1496034 1537432 1582208
63360 1582208 1630017 1681887 1739018 1800802 1864707 1927863 1988161 2044086 2094300 2137500 2172236
63349 2172236 2196947 2210771 2214484 2210356 2201041 2188701 2174642 2159014 2140711 2118041 2089642 2054783
63337 2054783 2013297 1965888 1914290 1860425 1805440 1750015 1695305 1642682 1592584 1544551 1498682
63326 1498682 1456231 1418332 1384775 1354533 1327033 1302448 1281149 1263337 1249027 1238070 1230408
63315 1230408 1226486 1226999 1231959 1240407 1251414 1265098 1282261 1303373 1328295 1356764 1388671 1423959
63303 1423959 1462645 1504915 1550894 1600350 1652737 1707410 1763715 1821200 1879813 1939360 1998284
63292 1998284 2053493 2101990 2142307 2173740 2194864 2204270 2202948 2194480 2181971 2165625 2144256 2118344
63280 2118344 2090174 2060968 2029290 1992853 1951049 1904978 1855635 1803074 1747406 1689810 1632185
63269 1632185 1576063 1522122 1470586 1421767 1376074 1333584 1293921 1256908 1223258 1194023 1168911
63258 1168911 1145381 1119998 1090888 1058844 1026262 995393 967349 941974 918232 895035 872041
63247 872041 849678 828532 809095 791943 777375 764570 751845 738337 725001 713330 703463 694156
63235 694156 684272 673587 662352 651058 640715 632495 626718 622635 619329 616217 612509 607221 600464
63222 600464 594121 590282 589056 588623 587403 585509 583858 582563 580742 577743 574093 571086 569608 569503 570008
63207 570008 570583 571162 571736 572088 572188 572632 574240 577079 580092 582016 582698 583390 585660 590145 596458 604016
63191 604016 612479 621324 629603 636671 642964 649595 657293 666246 676860 689818 705029 721090 736387
63178 736387 750500 764185 778307 793390 809949 828486 848830 869964 890861 911286 931562
63167 931562 951748 971346 989831 1007296 1024506 1042366 1061272 1080870 1100345 1118916 1136102
63156 1136102 1151729 1165787 1178189 1188459 1195684 1198953 1197957 1193128 1185249 1174975 1162636 1148366
63144 1148366 1132556 1116295 1101086 1087697 1075378 1062799 1049816 1037835 1028307 1021532 1017234 1015480
63132 1015480 1016174 1018206 1020286 1022641 1026855 1033901 1043374 1054993 1069564 1087431 1106870 1125399 1142371
63119 1142371 1159012 1175974 1192289 1207148 1221412 1236444 1252273 1267847 1282502 1296100 1307888
63108 1307888 1316334 1320313 1319766 1314978 1305826 1292148 1274405 1253558 1230394 1205190 1177908 1148694
63096 1148694 1118469 1089026 1061920 1036885 1011771 984793 956792 930679 908505 889662 872235
63085 872235 855437 840021 826628 814836 804174 795264 789132 785653 783415 781114 778456 775577 772290
63072 772290 768378 764304 761111 759656 760099 761931 764343 766829 769744 774031 780098 787201 794285 801144
63058 801144 808201 815320 821610 826615 831158 836628 843696 851917 860243 867695 873856 879206 884960 892281
63044 892281 901445 911661 921552 929869 936127 940894 945345 950284 955562 960512 964850 968953 973303 977821
63030 977821 981739 984156 984800 984243 983225 981777 979446 976551 974631 974942 976711 977805 977436 977540 980900
63015 980900 988307 998081 1007978 1016892 1024963 1033110 1042699 1054833 1069441 1085566 1102936 1122565 1145214
63002 1145214 1170004 1195562 1222048 1250815 1282104 1314510 1347189 1381463 1419414 1461624 1507085
62991 1507085 1554643 1603538 1652895 1701785 1749878 1797397 1844520 1891466 1939041 1988170 2038678
62980 2038678 2089159 2138357 2186206 2233286 2279770 2325114 2368390 2408629 2445078 2477168 2503926
62969 2503926 2523467 2533690 2533774 2524626 2507784 2484350 2455080 2420727 2381836 2338833 2293035 2247101
62957 2247101 2203616 2163215 2124642 2086646 2049469 2014770 1984756 1961350 1945358 1935967 1931378 1930267
62945 1930267 1932601 1939072 1950137 1965706 1985258 2007801 2031964 2056607 2081524 2107345 2134657 2163238
62933 2163238 2192069 2219956 2246143 2270434 2292763 2312686 2329336 2341852 2349649 2352214 2348827 2338697
62921 2338697 2321286 2296384 2264192 2225792 2183407 2139272 2093653 2044436 1989507 1929670 1868655
62910 1868655 1810117 1755089 1702513 1651492 1602334 1555766 1512030 1471048 1432883 1397590 1364770
62899 1364770 1333756 1304367 1277138 1252394 1229122 1205334 1179966 1154143 1129927 1107943 1086937
62888 1086937 1065681 1044305 1023322 1002403 981210 960807 942965 928068 914778 901750 888651
62877 888651 875417 861868 848671 837499 829168 822205 814227 804381 793698 783567 774949 768773 765680
62864 765680 764860 764115 761773 758167 754839 752798 752012 752051 752363 752047 750214 746917 743199 739899 736832 733542
62848 733542 730383 728158 726811 725393 723561 722300 722516 723485 723616 722635 722101 723558 726824 730429 733178
62833 733178 734910 736179 737680 739762 742006 743412 743257 741753 739677 737625 735821 734311 732898 731070
62819 731070 728421 725123 721649 718223 714930 712235 710748 710321 709893 708512 706129 703089 699362 694889 690509
62804 690509 687682 686991 687395 687501 687178 687254 687799 687631 685903 683456 681958 682102 683380 685241 687507 689716
62788 689716 691186 692167 694080 697879 702609 706209 707438 706615 704960 703899 704600 707193 710272 711855 711214
62773 711214 709539 708691 709600 711765 713918 715075 715376 716032 718173 721632 725124 727596 729047 730077 731297
62758 731297 733385 737041 742267 748060 753414 758549 764573 771997 780203 788476 796931 806090 815985 826200
62744 826200 836521 847102 858128 869787 882440 896295 910912 925619 940497 956418 973962
62733 973962 992995 1013575 1036458 1062046 1089566 1118292 1149159 1184036 1223440 1266114 1311128
62722 1311128 1359344 1412339 1470688 1533861 1600956 1670688 1741117 1810354 1877520 1942512 2004749
62711 2004749 2062477 2113163 2154408 2184704 2203626 2211199 2207109 2191103 2164303 2129399 2088907 2043658
62699 2043658 1993463 1938616 1879992 1818248 1754051 1688946 1624985 1563381 1504342 1448285 1396203
62688 1396203 1348406 1303613 1259943 1216596 1174316 1134503 1098096 1065022 1034577 1006464 981422
62677 981422 960434 943377 928912 915792 903791 893224 884111 876095 868806 862089 856217 852033 850404
62664 850404 851312 853875 857504 862526 869354 877633 886836 897240 909524 923520 938305 953783 971448
62651 971448 992949 1018225 1045635 1073962 1103755 1136573 1173410 1214302 1259192 1308345 1361578
62640 1361578 1417584 1474712 1532451 1591736 1653598 1717700 1782329 1845647 1906698 1965089 2019909
62629 2019909 2069231 2110775 2142762 2163902 2173040 2169593 2154357 2129132 2095231 2052994 2003104 1947628
62617 1947628 1889040 1828616 1766434 1702642 1638046 1573803 1511175 1451280 1394342 1339427 1285775
62606 1285775 1234214 1186465 1143163 1103451 1066400 1031807 999556 969268 940904 914852 891131
62595 891131 869313 849396 831762 816025 801095 786866 774674 765303 757512 749470 740779 732145
62583 732145 723840 715712 708171 701929 697030 693106 690276 688656 687250 684702 681323 679155 679615 681990
62569 681990 684659 686830 688485 689334 688810 686971 684811 683548 683789 685366 687855 691202 695643 700888 705782
62554 705782 709414 712511 717054 724194 733027 741817 750125 759168 770084 782369 794522 806217 819234
62541 819234 835720 855661 876888 897719 918899 942368 968853 997548 1027740 1059553 1092847
62530 1092847 1126235 1157654 1185505 1209082 1228381 1243766 1255410 1262827 1265187 1262224 1254517 1242816
62518 1242816 1227384 1208043 1184530 1156928 1126330 1095036 1065270 1037297 1009410 980287 950994
62507 950994 924122 901158 881104 861651 841477 821511 804039 790426 779742 769861 759721 749919
62495 749919 741220 733484 726465 720671 716576 713457 709935 705532 700982 697190 694602 693483 694046 696037
62481 696037 698685 701272 703513 705404 707098 709018 711827 716152 722322 730028 738023 744699 749682 754698
62467 754698 762253 773549 788072 804786 822858 841503 860388 880472 903402 929658 958174 988182
62455 988182 1020399 1055686 1093552 1132999 1174033 1216974 1260511 1301815 1338798 1371403 1400444
62444 1400444 1425983 1447197 1463209 1473691 1478887 1479268 1475045 1466282 1453847 1439910 1426751 1415109
62432 1415109 1404424 1394495 1385960 1379106 1373400 1368687 1365949 1366347 1370313 1378087 1390167 1406372 1425307
62419 1425307 1445850 1468531 1494147 1521374 1547120 1569231 1587533 1602057 1611685 1615291 1613122 1605981
62407 1605981 1593528 1574385 1547849 1514939 1477807 1438452 1397854 1355917 1312339 1267788 1224066
62396 1224066 1182876 1144660 1108944 1075438 1044200 1014963 987153 960883 937292 917364 900719
62385 900719 886069 872788 861506 852943 846602 841036 835328 829920 825893 823633 822391 821072 819335
62372 819335 817814 817166 816862 815187 810740 803781 795718 787441 778837 769926 761517 754196 747462 740693 734404
62357 734404 729583 726044 722496 718216 713695 709500 705511 701598 698174 695530 693281 691035 689151 688412
62343 688412 689316 691973 696136 700981 705433 709211 713065 717690 723022 728999 736043 743957 751257 756941
62329 756941 762505 770726 782351 795225 807001 817700 829062 842261 856944 872093 887248 903059
62317 903059 920858 941371 963769 986550 1009510 1034264 1062477 1094231 1128557 1164956 1203674
62306 1203674 1244953 1288846 1335675 1385972 1440087 1498527 1562587 1633722 1711930 1795438 1882467
62295 1882467 1972720 2066469 2162389 2257019 2346430 2427904 2499949 2561301 2610496 2646411 2668889
62284 2668889 2678721 2676974 2664166 2639933 2603600 2555343 2496914 2431180 2360895 2287811 2212907 2137357
62272 2137357 2063076 1992044 1924997 1861124 1799461 1740399 1685314 1634751 1587733 1543119 1500851
62261 1500851 1461187 1423352 1385983 1348744 1312625 1278519 1246282 1215392 1185796 1157737 1131194
62250 1131194 1105809 1081059 1056564 1032784 1011463 994508 982009 971952 962253 952477 943188 934527
62238 934527 926289 919032 914175 912894 915232 919965 925005 928500 930264 931960 935326 940524 946690 953618
62224 953618 961977 972050 983248 995021 1007553 1021297 1036260 1051864 1067286 1082098 1097029 1113892
62212 1113892 1134143 1157559 1182823 1209186 1236978 1266817 1299303 1335523 1376809 1423615 1475372
62201 1475372 1531840 1593905 1662499 1737229 1816671 1899794 1986569 2077097 2170351 2263841 2354560
62190 2354560 2440234 2519324 2589677 2647857 2690600 2716853 2727927 2725985 2712994 2690447 2658647
62179 2658647 2616092 2560927 2493613 2417400 2335802 2250579 2162627 2073704 1986244 1902017 1821784
62168 1821784 1745906 1674599 1607840 1545505 1487382 1432998 1382172 1336003 1296251 1262982 1233774
62157 1233774 1206255 1180584 1158179 1138744 1120337 1102252 1086029 1072983 1062234 1052217 1043207
62146 1043207 1036968 1034145 1033273 1032873 1033778 1038441 1047915 1060297 1072710 1084316 1096490 1110248 1124830
62133 1124830 1139334 1154548 1171960 1191547 1211765 1231529 1251079 1270831 1290385 1308989 1326238
62122 1326238 1342109 1357077 1372420 1389567 1408590 1427837 1445613 1461984 1478688 1497749 1520643
62111 1520643 1548393 1581644 1620400 1663972 1711533 1762862 1818548 1879307 1944889 2013663 2083208
62100 2083208 2151001 2214394 2270584 2317397 2354099 2380821 2397309 2402933 2397896 2383478 2360795 2330128
62088 2330128 2291933 2247591 2198263 2143615 2082934 2017586 1951451 1888499 1830479 1777141 1728005
62077 1728005 1683144 1642563 1605743 1572210 1542135 1515818 1492714 1471502 1451293 1432384 1415611
62066 1415611 1401377 1389709 1380866 1375110 1371875 1369970 1368897 1369273 1371310 1373344 1372804 1368808 1363186 1358612
62052 1358612 1356073 1354505 1352494 1349596 1345839 1340705 1333337 1323712 1313001 1302552 1292869 1283762 1275106
62039 1275106 1267238 1260965 1257475 1257778 1261655 1267394 1273235 1279068 1286191 1295432 1306136 1317149 1328242
62026 1328242 1340316 1354571 1371682 1391496 1413326 1436766 1462216 1490283 1520751 1552694 1585683
62015 1585683 1620253 1657040 1696178 1737845 1782541 1830120 1879228 1928657 1979000 2032114 2089038
62004 2089038 2149141 2211097 2273679 2335363 2394074 2447830 2495187 2534748 2564949 2585002 2595662
61993 2595662 2598275 2593057 2578954 2555290 2522951 2483567 2437902 2385648 2326689 2261938 2192749 2120159
61981 2120159 2045372 1970639 1898645 1830645 1765791 1702758 1641646 1583805 1530223 1480820 1435168
61970 1435168 1393086 1354317 1318337 1284878 1254171 1226109 1199499 1172852 1146058 1120785 1098812
61959 1098812 1080110 1062921 1045721 1028628 1012617 997786 983184 968387 954417 942506 932513
61948 932513 923259 914182 905879 899101 894049 890751 889273 889165 889396 889363 889392 889731 889637 888237 885892 883742
61932 883742 881901 878998 873845 867021 860359 855078 850672 845470 838161 828940 819408 811418 805966 802947
61918 802947 801484 800331 798466 795829 793200 790942 788269 784457 780389 777843 777228 777109 776242 774990 774265
61903 774265 774181 774667 776411 779938 784209 787488 789514 791664 794879 798571 801944 805422 810133 816588 824477
61888 824477 833449 843606 855369 869055 884444 900797 917670 935646 955680 977707 1000550 1023424
61876 1023424 1046713 1070896 1095453 1119449 1142505 1164479 1184763 1202796 1218983 1234202 1248535
61865 1248535 1261309 1272240 1281596 1289082 1293567 1294384 1292290 1288674 1284272 1279146 1273559 1268272 1264037 1261220
61851 1261220 1260041 1260986 1264724 1271507 1280643 1290811 1301045 1311141 1320834 1328922 1333818 1334967 1333181
61838 1333181 1329479 1324057 1316497 1306442 1293774 1278558 1261254 1242760 1223910 1204841 1184993 1163751
61826 1163751 1141298 1119009 1098683 1080872 1064177 1046866 1029082 1012657 998718 986499 974858
61815 974858 963849 954111 945668 938340 932561 928556 925207 921140 916865 914465 914926 917034 919418 922598
61801 922598 928242 937169 948931 962925 979106 997784 1019338 1044173 1072578 1104533 1139628 1176933
61789 1176933 1214996 1252549 1289474 1326570 1364043 1400717 1435103 1466717 1495825 1522394 1545964
61778 1545964 1566117 1582239 1593130 1597784 1596739 1592017 1585753 1579440 1574349 1571639 1571740 1574305 1579068
61765 1579068 1586077 1594834 1604048 1612791 1621229 1629479 1636261 1639489 1637970 1631826 1621403 1606412 1586101
61752 1586101 1559785 1527453 1490505 1451728 1413578 1376289 1338347 1299070 1259939 1223093 1189246
61741 1189246 1157715 1127840 1099570 1072950 1047893 1024437 1002549 981756 961674 942937 926808
61730 926808 913613 902225 891350 880570 869682 858067 845776 834575 826443 820981 815625 808789
61718 808789 801550 795708 791468 788095 785729 784828 784261 781831 777115 772286 769387 767827 765431 761240 756402
61703 756402 752857 752000 754230 758801 764047 768405 771401 773440 774982 776351 777983 780068 781989 782717 781894
61688 781894 780154 778450 777326 776609 775434 772978 769778 767831 768468 770381 770903 769241 767258 766762 767332
61673 767332 767520 767183 767530 769432 772710 776842 781441 785953 789606 791972 793324 794392 795910 798312 801664
61658 801664 805925 811210 817462 823866 829107 832401 833778 833171 830150 825254 820852 819490 821297 823812
61644 823812 824380 822107 817512 811269 803908 796280 789550 784402 780407 776387 771578 766354 761642 757791
61630 757791 754448 751448 749010 746762 743488 738650 733575 730044 727879 725000 720134 714608 710931 710017
61616 710017 710334 709724 707765 706126 706554 708726 710582 710681 709476 708036 706553 704847 703410 702720 702105 700598
61600 700598 698637 697494 697169 696369 694725 693414 693125 693039 692657 693132 695565 699069 701889 703632 705077 706385
61584 706385 707018 707211 708117 710277 712946 715131 716527 717316 717773 718187 718621 718742 718305 717503 716265 713703 709239
61567 709239 703937 699464 695856 691754 687013 683416 682078 681622 680159 677886 676246 675226 673221 669462
61553 669462 665064 661379 658540 656041 653585 650628 645992 638917 630183 621413 613485 606213 599363 593119
61539 593119 587434 581651 575299 569046 564305 561637 559676 555967 549169 540407 532256 526366 522339 518816
61525 518816 514984 510741 506050 500893 495583 490448 485404 480560 476948 475592 475735 475109 472466 468922 466266
61510 466266 464942 464518 465084 466761 468345 468131 466194 464469 464140 464157 463009 460981 459751 460356 462414 464991
61494 464991 467360 468986 469529 469122 468360 467945 468386 469856 472058 474375 476397 478224 480131 482149 484139
61479 484139 485977 487445 488188 488128 487718 487461 487352 487149 487042 487670 489459 492201 495213 497681 498933 498717 497282
61462 497282 494966 491778 487630 483012 479093 476855 476077 475402 473677 471270 469759 470115 471569 472715 473254
61447 473254 473827 474371 473927 472429 471423 472106 473548 473949 473035 471993 471492 471168 471031 471953 474269 476956 478713
61430 478713 479130 478404 476703 474348 471967 470013 468698 468693 470978 475331 479800 482560 483804 484928 486456
61415 486456 487893 489213 491097 493597 495803 497251 498630 500603 502806 504660 506416 508554 510588 511286
61401 511286 510003 507269 504295 502381 502495 504580 507220 508622 508167 506678 505156 503767 502145 500153 498083
61386 498083 496512 496271 498181 502359 507893 513471 518314 522401 525952 529008 531512 533673 536079 539257
61372 539257 542983 546258 548340 549663 551276 553442 555499 557258 559670 563480 567782 570792 571919 572370
61358 572370 573704 576315 579435 582135 584178 586123 588615 591408 593293 593378 592192 591053 590546 590280 590020
61343 590020 590144 590682 590656 589045 586165 583575 582574 582969 583301 582212 579662 576766 574522 573029 572147 572303
61327 572303 573941 576441 578506 579717 580942 583010 585653 587981 589338 589413 588278 586817 586489 588050 590764
61312 590764 593275 594938 596016 597045 598461 600503 603007 605501 607803 610263 613242 616743 620767 625493
61298 625493 630800 636091 640994 645763 650731 656027 662239 670533 681316 693312 704743 715032 724626
61285 724626 733587 741351 747803 753812 760549 768585 777409 785551 791738 796398 801416 807763 814146 818856
61271 818856 822120 825316 828497 830278 830016 828572 826855 824997 823101 821377 819325 816240 812812 810713
61257 810713 810134 809427 808018 807909 811016 816487 822288 828340 836165 846168 857323 869307 882870 897717
61243 897717 911847 923856 934483 944889 954476 961623 965989 968814 971003 971949 970493 966385 960530
61230 960530 954241 948566 943813 939214 933254 925008 915349 906388 899442 893950 888778 884101 881176 880290
61216 880290 879939 878522 876238 874631 874628 875675 876651 877017 877172 878326 882041 889155 898782 908823 917862 926280
61200 926280 935323 945541 956569 967868 978925 988908 997001 1003207 1008147 1011899 1013917 1014561 1015866
61187 1015866 1019800 1026060 1032372 1036762 1038715 1038453 1036363 1033427 1031045 1029704 1028500 1026590 1024473 1023203
61173 1023203 1022849 1022588 1022002 1021528 1021735 1022793 1024581 1026872 1029469 1032532 1036526 1041444 1046438 1050718 1054522
61158 1054522 1058645 1063343 1068347 1073636 1079488 1085928 1092742 1099729 1106232 1110873 1112796 1113112 1114097 1116880
61144 1116880 1120759 1124748 1128728 1132966 1137653 1143352 1150965 1160676 1171622 1182942 1194489 1206327 1218492
61131 1218492 1231563 1246364 1262408 1277652 1290663 1302175 1313453 1323848 1331288 1334900 1335904 1335915
61119 1335915 1335536 1334904 1334497 1334586 1334416 1332835 1329740 1326401 1324027 1322330 1319835 1315536 1309807 1303560 1296908
61104 1296908 1289050 1279206 1267317 1254033 1240302 1226710 1212907 1198123 1182687 1168394 1156573 1146362
61092 1146362 1135991 1125301 1115673 1107773 1100981 1095101 1090719 1087303 1082708 1075709 1067696 1060717 1054951
61079 1054951 1049355 1043730 1038614 1033856 1028951 1024556 1022171 1022300 1024051 1026561 1029760 1033709 1038341 1044114
61065 1044114 1052032 1062596 1075234 1088993 1103316 1118144 1133878 1151480 1172084 1196147 1223054
61054 1223054 1251588 1280667 1309792 1339058 1368724 1398685 1428535 1458101 1487375 1515821 1542496
61043 1542496 1567283 1591263 1615168 1637998 1657934 1674087 1686404 1694211 1696110 1691663 1682451 1670984
61031 1670984 1658836 1645952 1631479 1614991 1596868 1577659 1557458 1536237 1514396 1492317 1469689
61020 1469689 1446271 1423185 1402222 1383713 1366464 1350084 1335707 1323669 1312406 1301105 1291845
61009 1291845 1287225 1287024 1289194 1293251 1300341 1310331 1321318 1332394 1344909 1360420 1378998 1400206 1424297
60996 1424297 1451635 1481907 1514513 1549051 1585174 1622899 1663233 1707582 1756317 1808838 1865228
60985 1865228 1926727 1994193 2067026 2144212 2225844 2313201 2407616 2509347 2617296 2730128 2848132
60974 2848132 2973548 3108473 3253006 3405987 3566419 3733163 3904711 4081287 4266428
60965 4266428 4464466 4677049 4904126 5147453 5410375 5694463 5999411 6326453 6679227
60956 6679227 7061471 7477583 7936282 8450259 9031354 9690079 10441531 11307412 12309587
60947 12309587 13465347 14790588 16300820 18003919 19898656 21986293 24266918 26690840
60939 26690840 29098110 31230192 32846055 33858950 34371737 34587958 34697556 34833327 35081668
60930 35081668 35465768 35886782 36107828 35849276 34941842 33411094 31434136 29229217 26973742
60921 26973742 24782927 22719767 20808014 19046235 17424248 15933170 14565614 13314404
60913 13314404 12174882 11145179 10221264 9393468 8649615 7979847 7377036 6834612 6346082
60904 6346082 5905703 5508175 5148522 4823207 4530306 4267642 4031708 3819142 3627926
60895 3627926 3456069 3300162 3156412 3022458 2897380 2780734 2672397 2572529 2480739 2395735
60885 2395735 2316372 2242471 2174160 2111255 2053803 2002244 1956274 1914195 1874119 1835223 1797436
60874 1797436 1760777 1725548 1692289 1660837 1630321 1600668 1573087 1548196 1524735 1501251 1478238
60863 1478238 1457391 1439312 1423076 1407584 1392356 1377491 1363882 1353005 1345419 1339900 1335090 1331397
60851 1331397 1329987 1330453 1331172 1331882 1334236 1339513 1347346 1357222 1369709 1385235 1402775 1421032 1440319
60838 1440319 1462177 1487285 1514626 1542696 1570816 1599144 1627945 1657048 1685683 1712647 1736809
60827 1736809 1757721 1775691 1791099 1803549 1811777 1814596 1811954 1804901 1794426 1780558 1762878 1741756
60815 1741756 1718697 1695289 1671975 1648013 1622642 1596173 1569737 1543918 1517905 1490405 1461342
60804 1461342 1432182 1404440 1378322 1353143 1328554 1304825 1282129 1260157 1238449 1216681 1194565
60793 1194565 1171935 1149085 1126802 1105836 1086438 1068348 1051072 1034180 1017518 1001173 985154
60782 985154 969258 953512 938598 925399 913917 902917 890899 877365 863020 848887 835481
60771 835481 822800 810775 799444 788765 778648 769335 761544 755867 752121 749481 747232 745097 742915
60758 742915 740473 737854 735643 734550 734877 736361 738216 739240 738393 735691 732481 730524 730786 732997 736009
60743 736009 738396 739197 738672 738249 739334 742096 745600 748944 751806 753876 754268 751942 746766 740002 733600
60728 733600 728875 725687 722807 719098 714396 709414 704959 701191 697507 693152 688073 683095 679062 675949
60714 675949 673053 669876 666346 662344 657673 652640 648009 644130 640620 637151 633868 630673 626832 622063
60700 622063 617499 614688 613817 613710 613484 613497 614586 616953 619929 622419 623640 623940 624878 628005 633409 639731
60684 639731 645418 649654 652395 654220 656014 658090 659620 659696 658880 658776 659859 660589 659063 654798 648542
60669 648542 641173 633392 625815 618636 611649 605150 600205 597280 595096 591762 586906 581867 577887 574826
60655 574826 571642 567532 562586 557882 554771 553382 551907 548211 542288 536335 532168 529367 526498 523479
60641 523479 521911 523223 527055 531526 534863 536752 538243 540319 542692 544296 544895 545608 547634 550947 554653
60626 554653 558164 561480 564617 567439 570075 572993 576524 580547 584740 588971 593423 598444 604171 610257
60612 610257 616232 622221 628928 636593 644360 651151 656741 661305 664265 664663 662854 660855 660480 661655 663000
60597 663000 663452 662798 661163 658929 657115 657028 659116 662345 664940 665829 665428 665074 665548 666213 665845 664174 662024
60580 662024 659830 656781 651970 645773 639332 633112 626916 621106 616723 614068 612024 609262 605583 601647
60566 601647 597913 594371 591077 588419 586903 586887 588382 590901 593649 596019 597806 598958 599506 599803 600354
60551 600354 601157 601631 601547 601601 602634 604644 607047 609540 611992 613753 613893 612313 610071 608510 608520 610561
60535 610561 614596 619683 624343 627880 630895 634064 636919 638511 638917 639302 640564 642739 645801 650187 656016
60520 656016 662361 667989 672700 677517 683649 691594 701173 711964 723634 736087 749455 763906 779566
60507 779566 796735 815842 836698 857787 876755 891797 902395 908907 911960 912313 910632 907006 901265
60494 901265 894243 888293 885747 886914 890096 893541 897008 901619 908793 919348 933085 949088 966764
60481 966764 986494 1008787 1032931 1057305 1081181 1105323 1130198 1154176 1174221 1188162 1195848 1198484
60469 1198484 1197623 1194694 1190759 1186285 1181284 1175735 1169730 1163390 1156975 1151042 1146133 1142281 1139100 1136472
60455 1136472 1134928 1135275 1137939 1142702 1149069 1157001 1167372 1181472 1199814 1221644 1245961 1272900 1303802
60442 1303802 1340162 1382892 1432399 1488519 1550041 1614848 1681105 1748194 1816099 1883959 1949573
60431 1949573 2010268 2063768 2107960 2140210 2157686 2158847 2144409 2116462 2076672 2025736 1964589
60420 1964589 1895543 1821850 1746452 1671392 1598005 1527158 1459539 1396070 1337695 1284304 1234371
60409 1234371 1186537 1141372 1100717 1065306 1033999 1005380 979005 954651 931530 909137 888090
60398 888090 869150 851810 834762 817492 800665 785185 771647 760490 751785 744891 738982 733852
60386 733852 729456 724899 718994 711981 705643 701221 698005 694458 689983 685038 680236 676111 673301 672094
60372 672094 671857 671434 670044 667518 664038 660089 656347 653121 650197 647669 646417 647065 648861 650428 651378
60357 651378 652267 653143 653259 652439 651714 652145 653717 655759 657780 659494 660756 661945 663759 666081 667782 668267
60341 668267 668553 669907 671924 673050 672801 672330 672703 673725 674914 676686 679732 683667 687112 689216 690633
60326 690633 692883 696886 702179 707390 711417 714264 716861 720186 724544 729510 734441 739007 743245 747099
60312 747099 750099 751818 752650 753716 755866 759108 763156 767924 772996 777220 779765 781507 784389 789074
60298 789074 793929 796972 798502 801210 807590 817561 828775 839107 848507 858335 869235 880246 889903
60285 889903 897427 902431 904290 902765 898992 894833 891114 887187 882415 877398 873434 871212 870281 869460 867655
60270 867655 864704 861562 859320 857950 856380 853805 850431 846974 844052 842195 841749 842525 844074 846423 849923
60255 849923 854266 858617 863043 868904 877220 887529 898984 911793 926637 943482 962096 983151
60243 983151 1007308 1033144 1057206 1076516 1090266 1098875 1102288 1099785 1090996 1076620 1058247 1037684
60231 1037684 1016344 995215 975331 957878 943493 931784 921975 913675 906494 899275 890682 880653
60219 880653 870622 862173 855849 851152 847027 842342 836624 830589 825542 822140 820079 818716 817311 814884
60205 814884 810949 806552 803500 802082 800491 797192 793019 790065 789115 789177 789193 789068 788929 788376 787028 785400
60189 785400 784669 785501 787314 788819 789317 789407 790342 792843 796703 801204 805378 808049 808493 807481 807062 808810
60173 808810 812502 816720 820271 822684 823913 824293 824579 825434 826860 828367 829496 830035 830243 831326 835044
60158 835044 841914 850063 856773 861249 865051 869772 875252 880521 885630 891634 898959 906584 913257 919244
60144 919244 926427 936305 948017 958826 966812 972544 977709 982777 986994 990255 993587 997452 1000806 1002656
60130 1002656 1003662 1005310 1007936 1010483 1011826 1011509 1009386 1005536 1000593 995353 989883 983660 976745 970151
60116 970151 964726 960277 956169 952274 948829 945759 942685 939431 936036 932396 928383 924377 921304 919815
60102 919815 919444 918714 916339 912551 909089 907504 907533 907645 907175 907139 908611 911124 913473 915495 918075 921570
60086 921570 925353 929032 933173 938381 944380 950445 956202 961567 966392 970772 975471 981462 988934 996892
60072 996892 1003673 1007936 1009581 1009928 1010732 1012821 1015859 1019347 1023157 1026849 1029221 1029459 1028549 1028851 1031976
60057 1031976 1037301 1042579 1045862 1046895 1046875 1047126 1048280 1050676 1054690 1059804 1063792 1064254 1061188 1056916 1053099
60042 1053099 1049144 1044167 1038901 1034306 1029665 1024073 1018957 1016793 1017346 1017426 1014950 1011318 1008890 1007841 1006831
60027 1006831 1005409 1004087 1002705 1000431 997410 995123 994753 995818 996616 995617 992378 987557 982190 976860 971536
60012 971536 966035 960158 953361 945022 935481 926281 918798 912879 907243 900880 893666 886040 878663 872071
59998 872071 866099 859904 853081 846479 841234 837257 833418 829101 824781 821036 817897 815553 814918 816751
59984 816751 820514 824764 828717 832856 837779 842883 846852 849417 851936 855635 859686 861861 861172 859120
59970 859120 857972 858369 859109 858743 856782 853602 849830 845823 841415 836150 829939 823308 816785 810354 803790
59955 803790 797171 790701 784436 778617 773878 770446 767466 763858 759664 755764 752422 749085 745719 743233
59941 743233 742030 740947 738481 734646 730874 728232 726532 725184 724134 723549 723139 722459 721759 721854 722976 724312
59925 724312 725068 725628 727141 730180 734347 738915 743079 745647 745537 743076 740114 738342 737983 738426 739316 740345
59909 740345 740750 740045 738915 738469 738781 738971 738402 737010 734746 731864 729661 729651 731545 732981 731917 728737
59893 728737 725663 724584 725737 727943 729711 730506 731220 733112 736260 739577 742302 744689 747045 749101 750855
59878 750855 753206 756891 761347 765344 768400 770849 772905 774563 776274 778835 782359 785972 788836 791169
59864 791169 793945 797694 801766 804972 807009 809092 812709 817792 822695 826198 828828 831806 835434 839353
59850 839353 843857 849696 856478 862304 865480 865975 864872 862974 860640 858671 858432 860638 864197 866741 866718
59835 866718 865002 864133 865727 868923 871696 873480 875850 880532 887311 894263 899787 904077 908695 914977
59821 914977 922849 931089 938631 945493 952351 959398 965963 971223 974828 976713 976761 975061 972270 969241 966257
59806 966257 962914 958798 954092 949485 945659 942863 940882 939371 938333 938193 939370 941928 945832 951370
59792 951370 959009 968772 979877 990806 999588 1004584 1005769 1005174 1005187 1006195 1006647 1005657 1004402 1004196 1004190 1002249
59776 1002249 997646 991578 985266 978913 972597 966736 961187 955109 948385 942188 937448 933703 929973 925722
59762 925722 920219 912351 902472 893261 887019 882665 877232 870054 863583 859960 858740 858452 858517 858584 857536
59747 857536 854605 850656 847085 843915 840022 834828 828867 822948 817602 813163 809662 806663 803703 800782
59733 800782 798148 795999 794700 794715 795733 796477 796152 795643 796363 798285 800032 800657 800351 799487 798064 796327
59717 796327 795072 794903 795684 796802 797350 796174 792744 788361 785552 785598 787226 788277 788051 787368 786880 786288
59701 786288 785115 783424 781651 780310 780016 781268 783916 787168 790346 793470 797031 801438 806811 812949
59687 812949 819305 825221 830508 835573 840687 845308 848617 850636 852271 854100 855720 856672 857508 859273 862197
59672 862197 865505 868434 870755 872288 872724 872364 872398 873841 876394 878806 880258 881048 882032 883696 885730 887302
59656 887302 887743 887020 885479 883277 880514 877941 876838 877703 879506 880773 881156 881415 882092 882882 883311 883427
59640 883427 883664 884408 885876 888167 891298 895252 899882 904624 908503 910708 911141 910279 908774 907376 906821
59625 906821 907252 907920 907957 907293 906396 905345 903772 901645 899446 897491 895534 893106 889790 885217 879373 873052
59609 873052 867436 863045 859487 856245 853200 850283 847246 844060 841113 838799 837264 836614 836842 837413 837458
59594 837458 836684 835697 835324 836107 838516 842869 848608 854268 858707 861920 864319 865753 865814 864638 862816 860798
59578 860798 858851 857170 855442 852689 848280 843050 838818 836813 836920 838190 839496 839818 838663 836491 834406
59563 834406 833180 832702 832335 831699 831048 830840 830759 829395 825433 819294 812956 807944 804220 801288 799354 798669
59547 798669 798680 798897 799869 802066 804329 804975 804149 803601 804148 805020 805978 808225 812343 816762 819544 820686 821406
59530 821406 821898 821196 818962 816118 813561 811216 808643 806015 804181 803978 805381 807047 806991 804281 800107
59515 800107 796860 796103 797573 799819 801383 801585 800707 799545 798574 797550 795976 793779 791398 789479 788527
59500 788527 788480 788554 788112 787915 789790 794528 800762 806567 811527 816410 821420 825899 829555 832928 836669 841168
59484 841168 846864 854079 862635 872378 883898 897797 913563 930364 948632 968936 988851 1002945
59472 1002945 1007332 1003305 995448 987235 979723 973337 968722 965770 963543 961713 960988 961707 963088 964402
59458 964402 966021 968461 970999 972128 971243 969176 967006 964933 962500 959362 955330 949905 942539 933628
59444 933628 924774 917452 911588 905950 899854 893848 888688 884418 880768 877715 875084 872159 868522 864988
59430 864988 862923 862621 863011 863080 862969 863478 864971 867167 869810 873162 877772 883915 891460 900299 910600
59415 910600 922235 934081 944555 953022 960109 966342 971105 973520 973790 972955 971667 970108 968983 969658
59401 969658 973000 978610 985330 992072 998154 1003537 1009074 1016059 1025088 1035480 1045959 1055792 1065283 1075397
59387 1075397 1086887 1099449 1111573 1121432 1128076 1131734 1133206 1133166 1131825 1128836 1123552 1115830 1106665 1097755
59373 1097755 1090312 1084330 1078836 1072708 1065504 1057848 1050935 1045583 1041990 1040383 1041244 1044654 1050164 1057739
59359 1057739 1068001 1080969 1095551 1111230 1129260 1150969 1175940 1203561 1235129 1271439 1308109
59348 1308109 1336322 1349716 1349174 1340160 1327550 1314274 1302539 1293569 1286945 1282328 1281313 1285441 1292354
59335 1292354 1295862 1290464 1274944 1251710 1224129 1194930 1165936 1138289 1112941 1090895 1072555 1057080
59323 1057080 1043158 1030467 1019758 1011484 1005032 999346 993801 988379 983558 980072 978330 978048 978764 980466
59309 980466 983264 986839 990895 995896 1002492 1010312 1018143 1025318 1032216 1039371 1046904 1054906 1063615 1072931
59295 1072931 1082422 1092041 1102297 1113536 1125600 1138374 1152104 1166874 1182234 1197638 1212948 1228381
59283 1228381 1244295 1261085 1278897 1297236 1315072 1331341 1345188 1356019 1363761 1368881 1371706 1371968
59271 1371968 1369579 1365464 1360726 1355128 1347375 1336971 1324846 1311963 1298311 1283703 1268714 1254231
59259 1254231 1240606 1227758 1215634 1204205 1193485 1183842 1175827 1169425 1164131 1160110 1158541 1160224 1164400
59246 1164400 1169718 1176007 1184409 1195923 1210413 1226713 1242908 1256349 1264195 1264682 1258078 1246367 1231969
59233 1231969 1216661 1201462 1187128 1174347 1163379 1153911 1145535 1138062 1131136 1124096 1116811 1110192 1105059
59220 1105059 1100794 1096108 1091108 1087515 1086689 1088421 1091916 1096815 1102642 1108332 1113334 1118661 1125906 1135458
59206 1135458 1146204 1156619 1165500 1172119 1176594 1180115 1184043 1188522 1192234 1193606 1192039 1188030 1182402
59193 1182402 1175542 1167346 1157839 1147589 1137357 1127667 1119053 1112295 1107529 1103387 1098199 1092352 1088445
59180 1088445 1088512 1091831 1096012 1099514 1102448 1105511 1108957 1112417 1115221 1117147 1118991 1121894 1125852 1129627
59166 1129627 1132484 1135064 1137863 1139754 1139026 1135416 1130237 1124897 1120090 1116020 1112586 1109598 1107366 1106510
59152 1106510 1106637 1106022 1103604 1100555 1098671 1097871 1096745 1095128 1094426 1095339 1096927 1098289 1099701 1101545 1103317
59137 1103317 1104426 1105047 1105587 1106110 1106899 1108727 1111776 1114909 1116840 1117790 1119266 1122220 1125875 1128448 1128987
59122 1128987 1128451 1128788 1130774 1133213 1134697 1135632 1137614 1141126 1145012 1148230 1150951 1153716 1156717 1160369 1165455
59107 1165455 1171982 1178833 1185315 1192163 1200169 1208564 1215846 1221801 1227658 1234345 1241276 1246859 1249704 1249592
59093 1249592 1247746 1245950 1245000 1244268 1242957 1241094 1238763 1235211 1229700 1222754 1215422 1207613 1198344 1187630
59079 1187630 1176987 1167829 1160267 1153743 1147887 1142289 1136336 1129969 1124144 1119845 1116893 1114140 1110666 1106498
59065 1106498 1102462 1099620 1098568 1099040 1100443 1102909 1107285 1113723 1120930 1127542 1133854 1141332 1150462 1159985
59051 1159985 1168546 1176398 1184946 1194947 1205647 1215641 1224259 1232043 1239915 1247831 1254385 1258031 1258713 1257987
59037 1257987 1257512 1257810 1258505 1259031 1258723 1256898 1253643 1250240 1247937 1246359 1243847 1239401 1233571 1227328 1220897
59022 1220897 1214024 1206596 1198408 1188858 1177575 1165125 1152635 1140931 1130407 1121344 1113763 1107164 1100893
59009 1100893 1094642 1088260 1081454 1074264 1067528 1062085 1057654 1053257 1048648 1044481 1041032 1037842 1035007 1033795
58995 1033795 1035116 1037905 1039952 1040116 1038969 1037421 1035651 1033691 1032291 1032510 1034606 1037846 1041407 1045114
58981 1045114 1049115 1053185 1056727 1059473 1061892 1064794 1068720 1073750 1079646 1085925 1091988 1097502 1102661 1107890
58967 1107890 1113400 1119288 1125990 1134231 1144237 1155222 1165949 1175954 1186048 1197421 1210136 1222843
58955 1222843 1234309 1245085 1256968 1270598 1284238 1295485 1303687 1309990 1315368 1319658 1322596 1324787
58943 1324787 1327073 1329627 1332347 1335769 1340879 1348157 1357368 1368200 1380406 1393094 1404656 1414147 1422571
58930 1422571 1432076 1443638 1456050 1467537 1477924 1488517 1499975 1511107 1520060 1526207 1530498 1534490
58918 1534490 1539618 1547136 1557921 1571980 1588298 1605402 1622215 1638630 1655440 1673566 1693164 1713571
58906 1713571 1734013 1754108 1773740 1793022 1812447 1832337 1851867 1869520 1885144 1900597 1917264
58895 1917264 1933613 1946660 1955619 1962570 1969316 1975109 1978183 1978260 1976470 1973562 1969504 1964677 1960326 1957449
58881 1957449 1955737 1953967 1951298 1947965 1944624 1941063 1935763 1926965 1914150 1898288 1880865 1863026 1845542
58868 1845542 1829002 1813713 1799572 1786143 1772810 1759201 1745817 1733938 1724280 1715919 1707321 1698348
58856 1698348 1690489 1685049 1681986 1680765 1681343 1683707 1687179 1690953 1695041 1700127 1706691 1714577 1723307 1732700
58842 1732700 1743488 1757190 1774654 1794576 1814221 1831897 1848023 1863537 1878348 1892024 1904935
58831 1904935 1917580 1929352 1939140 1946965 1954129 1961940 1970958 1981066 1991262 1999650 2004781 2007061 2007874
58818 2007874 2007270 2003582 1995591 1984033 1970431 1955297 1938205 1919005 1898158 1876135 1853171 1829535
58806 1829535 1805553 1781412 1757303 1733658 1710822 1688603 1666616 1645139 1625090 1606765 1589011
58795 1589011 1570277 1550543 1531654 1515319 1501098 1486824 1470958 1454017 1437576 1422397 1407908
58784 1407908 1393246 1378357 1364029 1351127 1339862 1329651 1319649 1309385 1298948 1288734 1279297
58773 1279297 1271337 1265265 1260444 1255251 1248447 1240527 1233324 1228192 1224790 1221718 1218102 1214326 1211322 1209453
58759 1209453 1208337 1207600 1207428 1208162 1209692 1211538 1213349 1214993 1216310 1217184 1217804 1218489 1219280 1220029 1220684 1220922
58743 1220922 1219644 1215686 1209248 1201872 1194657 1187152 1178485 1168968 1159927 1152336 1146239 1141173 1136415 1131042
58729 1131042 1124625 1117999 1112672 1109141 1106288 1102784 1098744 1095604 1094545 1095471 1097460 1099665 1101532 1102603
58715 1102603 1102762 1102660 1103281 1104776 1106014 1105545 1102752 1098006 1092231 1086603 1082059 1078405 1074405 1069406 1064432
58700 1064432 1060867 1058525 1056174 1053704 1052418 1052985 1054391 1055426 1056193 1057558 1059881 1062871 1066095 1069221
58686 1069221 1072376 1076483 1082438 1089655 1096342 1101652 1106612 1112459 1119207 1126540 1134941 1144689 1154539 1162702
58672 1162702 1168878 1174442 1181021 1189665 1200694 1213165 1224837 1233956 1241087 1248310 1256760 1265847 1274657
58659 1274657 1282950 1290583 1297012 1301856 1305395 1308190 1310650 1313187 1316394 1320726 1326083 1331807 1337111 1341578
58645 1341578 1345151 1347393 1346932 1342289 1333292 1321068 1306654 1290555 1273703 1257472 1242004 1225662
58633 1225662 1207168 1187396 1168157 1150077 1132740 1116076 1100338 1085354 1071077 1058436 1048432
58622 1048432 1040805 1034570 1029224 1024261 1018277 1010274 1001419 993977 988792 985272 983347 983521 985255 987402
58608 987402 990360 995666 1003053 1009999 1014999 1019424 1025154 1031999 1038525 1043912 1047802 1049647 1049603 1049004 1048655
58593 1048655 1047543 1044544 1040495 1037150 1034740 1032129 1028994 1026301 1024578 1023114 1021123 1018599 1015657 1012033
58579 1012033 1007776 1003788 1001051 999642 998899 998288 997736 997306 997034 997081 997629 998463 999000 999035 999215 1000265 1001910
58562 1001910 1003165 1003730 1004447 1006154 1008740 1011697 1014849 1018083 1021055 1023864 1027332 1031853 1036618 1040987
58548 1040987 1045968 1052973 1061343 1068398 1072140 1072946 1072624 1072824 1074450 1077467 1080806 1083091 1083797 1083282 1081853
58533 1081853 1079539 1076745 1074430 1073579 1074987 1079189 1085757 1092943 1099049 1104157 1109804 1117239 1126756 1138117
58519 1138117 1150399 1161876 1171524 1180538 1190963 1202987 1215041 1226422 1238094 1250816 1264223 1278075
58507 1278075 1292841 1308662 1325303 1343413 1364190 1387403 1411507 1436189 1462789 1491392 1519529
58496 1519529 1545060 1568639 1591848 1614281 1634000 1649814 1661612 1669303 1672819 1672613 1669112 1662263
58484 1662263 1652431 1641011 1629265 1617279 1604657 1591369 1577170 1561217 1543113 1523500 1502983
58473 1502983 1481515 1459451 1437894 1417252 1396935 1377413 1360871 1348402 1338019 1327104 1315635
58462 1315635 1305344 1296879 1289685 1283752 1279376 1275644 1271092 1265807 1261438 1259300 1259463 1261017 1261935 1259596
58448 1259596 1253309 1245893 1241043 1239405 1238812 1237805 1236930 1236684 1236333 1235319 1234204 1233591 1233334 1233321 1234017 1235826
58432 1235826 1238696 1242540 1247242 1252132 1256371 1260028 1264050 1269121 1275227 1282275 1290256 1298851 1307627 1316752
58418 1316752 1326948 1338869 1352973 1369564 1388160 1407157 1424847 1440506 1453839 1464016 1470341
58407 1470341 1473461 1474796 1474914 1473398 1470073 1465433 1460148 1455032 1451172 1449108 1448212 1447894 1449071 1453267 1460381
58392 1460381 1468420 1475437 1480876 1485204 1489127 1493105 1496918 1499740 1501064 1501024 1499271 1494499 1486144 1475829
58378 1475829 1466039 1457991 1451883 1448257 1447476 1448371 1449071 1449035 1449105 1450070 1452529 1457460 1465145 1473888 1481551 1488154
58362 1488154 1495227 1502954 1510008 1516104 1522437 1529127 1534340 1536789 1537470 1538087 1539173 1540535 1542215 1544040
58348 1544040 1545175 1544915 1543195 1540017 1535410 1530349 1526579 1524803 1524026 1523330 1523402 1525476 1529362 1533426 1536366
58333 1536366 1538506 1541311 1545719 1550978 1555398 1558386 1561228 1565430 1571051 1577335 1584244 1592222 1600925 1609348
58319 1609348 1616954 1623719 1629490 1634444 1639795 1646822 1655421 1664717 1674702 1685923 1697783 1708682 1717995
58306 1717995 1726737 1736219 1747063 1759520 1773696 1789364 1806308 1824730 1844762 1866032 1888337 1911925
58294 1911925 1936178 1959057 1979029 1996482 2011999 2024649 2033965 2042292 2052646 2064910 2076678 2087475
58282 2087475 2099496 2114186 2130694 2148049 2166430 2185769 2205310 2225349 2247605 2273073 2300862
58271 2300862 2329496 2358005 2385650 2412212 2438749 2466533 2495127 2522901 2549298 2574978 2600068
58260 2600068 2624216 2648199 2673339 2699216 2723978 2747107 2769925 2793287 2816822 2840747 2866511
58249 2866511 2895184 2926739 2960956 2997465 3035098 3072886 3111496 3152017 3193942 3236237 3279546
58238 3279546 3324997 3371643 3417723 3463725 3511289 3559805 3607385 3654701 3704335 3756604 3809834
58227 3809834 3864755 3924580 3990062 4058282 4127314 4198546 4273458 4351558 4432613 4517559 4606075
58216 4606075 4696374 4788470 4884623 4985735 5090498 5198873 5312991 5433629 5559237 5689522
58206 5689522 5826742 5972506 6126605 6289649 6463161 6646242 6836095 7032998 7240983
58197 7240983 7462569 7696614 7942130 8199963 8469797 8750070 9042080 9349537 9672750
58188 9672750 10008134 10354927 10717273 11097880 11495004 11908182 12342110 12802311 13291293
58179 13291293 13810835 14363343 14949198 15567703 16222033 16917703 17654921 18429039 19240417
58170 19240417 20097003 21005178 21965774 22981691 24060891 25207779 26419793 27697455
58162 27697455 29050379 30488853 32017415 33641705 35373355 37222063 39190229 41280927
58154 41280927 43503825 45868818 48383451 51063255 53936234 57031534 60373348 63991739
58146 63991739 67928354 72224683 76917014 82051837 87696006 93926890 100830005 108518281
58138 108518281 117140792 126865841 137876311 150392912 164675105 180971692 199472753
58131 199472753 220301355 243507010 269041289 296742930 326241117 356573280 385614624
58124 385614624 409956544 425821523 430671719 424329702 408773348 386959547 361703245
58117 361703245 335194946 308977201 284014768 260771831 239354324 219675815 201566692
58110 201566692 184838702 169344518 155006646 141788645 129653300 118556066 108452989
58103 108452989 99289580 90990550 83476816 76685590 70563258 65049390 60080745 55602718
58095 55602718 51564962 47912741 44593780 41568962 38808347 36282893 33967931 31848098
58087 31848098 29909828 28133141 26497252 24988604 23596350 22305110 21099426 19971183
58079 19971183 18916328 17928309 17000513 16130996 15318844 14559260 13846999 13180551 12557989
58070 12557989 11972757 11418722 10895652 10404915 9943573 9507499 9096395 8710526 8345992
58061 8345992 7998386 7668088 7356942 7062550 6780739 6511112 6255366 6012421 5779687
58052 5779687 5557013 5345066 5141664 4943857 4751986 4568144 4392356 4223494 4061790
58043 4061790 3907105 3756920 3609500 3467022 3332305 3204620 3081931 2964923 2855254
58034 2855254 2752014 2653554 2560869 2475532 2396047 2319783 2246957 2179356 2116726 2057684 2002586
58023 2002586 1952171 1904845 1858500 1813515 1770989 1729726 1688194 1647708 1610225 1574570 1538367
58012 1538367 1502278 1468774 1438039 1408653 1380979 1355972 1331733 1305439 1278236 1254240 1234703
58001 1234703 1216843 1198552 1180641 1163816 1146754 1128225 1108681 1088948 1069293 1050226 1032380
57990 1032380 1015358 998368 982000 967595 955002 942698 930007 917557 905810 894826 885135
57979 885135 877105 869680 861195 851058 839422 826205 812067 799167 788763 778935 766983 753341
57967 753341 740755 730137 719794 708475 696674 684904 673155 662308 653847 647665 641953 635640
57955 635640 629305 623432 617484 611082 604712 598926 594042 590631 589008 588182 586580 583844 580909 578553
57941 578553 577057 576844 577905 578719 577189 572856 567236 562191 558884 557732 557986 557682 555407 552037 549656
57926 549656 549063 549385 549690 549675 549118 547834 546048 543974 541523 539070 537514 536636 534665 530835 527071 525427
57910 525427 525005 523372 520064 516606 513879 511765 510887 512215 514978 516993 517164 516043 514218 511925 509931
57895 509931 508899 508097 506562 505114 505201 506145 505821 503937 502228 501362 500193 498489 497949 499618 502405 505127
57879 505127 508247 512589 517932 523872 530735 538598 546446 553218 559014 564728 570992 577611 583438 587066
57865 587066 588483 589559 591711 593627 592932 589634 586019 583312 580470 576401 571318 565571 559032 552124
57851 552124 545659 539237 531597 522963 515076 508314 500950 492213 484090 478736 475674 472900 469376 465081
57837 465081 460033 454912 451707 451976 454645 456730 456171 453335 450079 448132 448159 449810 452441 455645 458828
57822 458828 460877 461340 461710 464141 468631 472673 474091 473097 471167 469066 466693 463912 460815 457738 455354
57807 455354 454051 452980 450658 446926 443475 442030 442686 444266 445537 445838 445308 444749 444676 444544 443676 442702
57791 442702 443024 445009 447919 451421 455584 459368 460812 459245 455983 452474 449184 446509 445023 444116 441975
57776 441975 437843 433048 428987 425430 421643 417874 414780 412452 410937 410590 411094 411240 410651 410623 412272 414842
57760 414842 416933 418463 420374 423149 426649 430649 434479 436719 436247 433343 429259 425223 422158 420424
57746 420424 419349 418027 417008 417872 420407 421856 420249 417161 415540 415859 416280 415956 416068 417459 419009
57731 419009 419042 417355 415268 414188 414457 415404 416305 417179 418381 419560 419803 418978 418058 417758 417738 417775 418783 421787
57713 421787 426495 431657 436260 439654 441184 440726 439309 438368 438419 438925 439111 438479 436912 434748 432484 430193
57697 430193 427718 425583 424858 425742 427114 427911 428154 428231 428196 428432 429893 432785 435846 437838 438984 440079
57681 440079 441033 441387 441544 442330 443760 445200 446310 446914 446478 444663 442021 439235 436200 432809 430098 429430
57665 429430 430636 431979 431963 430510 428535 426986 426086 425048 422880 419872 417665 417304 417977 418393 418507 418894
57649 418894 419244 418750 417504 416265 415189 413921 412659 411937 411588 411052 410593 411068 412565 414324 415886 417220
57633 417220 417772 416650 414043 411365 409635 408567 407649 407336 408537 411396 415074 418647 422058 426217 432092
57618 432092 439660 448101 457223 468184 482332 499822 520047 543084 569942 601444 637396 676692
57606 676692 717582 757607 793314 820099 833196 830485 815005 793409 770608 746512 718768 687550
57594 687550 656074 627080 600735 576126 553153 532448 514520 499557 487336 477005 467582 458851
57582 458851 451201 444621 438771 434043 431552 431473 432131 431360 428534 424898 422146 420997 420999 421346 421645 421961 422381
57565 422381 422864 423234 422850 420529 415714 409758 405022 402351 400484 398354 396637 396250 396640 396985 397997 400759
57549 400759 404318 406232 405620 404115 403523 403748 403382 401415 397955 393995 390828 389199 388852 389112 389585 389840
57533 389840 389007 386588 383396 380756 378995 377648 376897 377629 379919 382405 383583 383204 382345 382490 384434 387509
57517 387509 390086 391264 391800 392908 394716 396582 398337 400243 402087 403243 403350 402244 399842 397027 395873
57502 395873 397602 400748 402743 403013 403112 404127 405589 406942 408462 410413 412679 415584 419770 424893 429452
57487 429452 432292 433458 433568 433446 434342 437157 441190 444826 447761 451378 456671 462989 469113 474378 478292
57472 478292 480351 480938 481514 483331 486533 490744 495689 501006 506253 511233 515614 518533 519775 521142 525068
57457 525068 531623 538283 542966 545959 548616 551764 555910 561397 567544 572898 577011 580755 584420 587101
57443 587101 588675 590722 594375 598695 602315 605270 607978 609759 610001 609827 610914 613215 615258 616321 617096
57428 617096 618487 620732 623490 626052 627824 629218 631485 635096 639130 642879 647127 652905 659841 666693
57414 666693 672713 677634 681358 684728 689527 696319 703222 708354 712648 718439 725822 732501 737109 740821
57400 740821 745361 751058 757356 763866 770313 776545 783178 791258 800729 809994 817548 823501 829115 835384
57386 835384 842491 850128 857814 865083 871697 877757 883615 889748 896491 903775 911375 919622 929352 940700
57372 940700 952391 962801 971466 979041 986274 993712 1001976 1011304 1020903 1029682 1037676 1045980 1055128 1064407
57358 1064407 1073097 1081665 1091089 1101394 1111615 1121283 1131410 1143415 1157098 1170331 1181222 1190222
57346 1190222 1199372 1209728 1220536 1231023 1241801 1253888 1267271 1281244 1295560 1310408 1325733
57335 1325733 1341338 1357413 1374303 1391885 1409580 1426753 1443016 1458780 1475633 1495219 1517196
57324 1517196 1539351 1560387 1581471 1604037 1627258 1649241 1669802 1690330 1711359 1732167 1752723
57313 1752723 1774168 1796918 1819817 1841871 1863714 1886718 1911479 1937723 1964930 1992441 2019463
57302 2019463 2045554 2070934 2096156 2121646 2147437 2172981 2197473 2220924 2244640 2269901 2296414
57291 2296414 2322915 2349077 2375750 2403382 2431312 2458770 2485563 2511487 2536178 2560075 2584725
57280 2584725 2611516 2640537 2670841 2701136 2730082 2756935 2782522 2808925 2837614 2868218 2899330
57269 2899330 2929844 2959203 2987217 3014309 3041462 3069256 3097214 3124444 3150615 3176082 3201617
57258 3201617 3228271 3256848 3286950 3317096 3346301 3375118 3404553 3434534 3464221 3493487 3523253
57247 3523253 3554414 3587100 3621040 3655968 3691426 3726481 3759986 3791142 3819968 3847396 3874731
57236 3874731 3902724 3931272 3960256 3990459 4023141 4058621 4095650 4132465 4168364 4204165 4241287
57225 4241287 4280478 4321371 4363000 4404579 4445746 4486225 4525462 4562755 4597806 4631107 4663672
57214 4663672 4696210 4728573 4760131 4790639 4820473 4850105 4879840 4910325 4942690 4977547 5014071
57203 5014071 5050742 5087058 5123947 5162376 5202135 5242343 5282695 5323665 5365520 5407607 5448754
57192 5448754 5488158 5525614 5560947 5593735 5624003 5653014 5682634 5713649 5745308 5777124 5810629
57181 5810629 5848463 5891766 5939330 5989656 6043152 6101695 6166315 6235831 6307747 6380081 6452316
57170 6452316 6524926 6598155 6671085 6741732 6808159 6869676 6926974 6981000 7031911 7079357 7123602
57159 7123602 7165683 7206268 7245046 7281868 7317928 7354757 7392029 7427400 7458997 7487514 7515505
57148 7515505 7545077 7576604 7609176 7641715 7673877 7706299 7740041 7775787 7813675 7853558 7894784
57137 7894784 7935946 7975772 8014457 8053201 8092032 8128925 8161539 8189093 8212203 8231835 8249015
57126 8249015 8264591 8278334 8288883 8295100 8296584 8292236 8279778 8258170 8229667 8197907 8164590 8129618
57114 8129618 8093891 8059778 8028507 7998746 7968431 7936875 7904669 7872651 7841505 7811470 7781909
57103 7781909 7751761 7720795 7689981 7660610 7633565 7609251 7587330 7566547 7545714 7524880 7504838
57092 7504838 7485734 7467185 7449354 7432353 7414616 7393496 7367830 7338352 7305064 7265873 7218670
57081 7218670 7163272 7100214 7028943 6948580 6859529 6762905 6658987 6547529 6429154 6305136
57071 6305136 6176024 6041490 5901194 5754532 5599497 5432924 5252069 5055232 4840781
57062 4840781 4606631 4351175 4073958 3774616 3451392 3101315 2721911 2312162 1871302
57053 1871302 1396787 883894 327359 -277183 -933620 -1646292 -2419735 -3257962 -4165301
57044 -4165301 -5148059 -6214526 -7373438 -8633588 -10004877 -11497511 -13118317 -14868170
57036 -14868170 -16743994 -18742953 -20864260 -23108929 -25481398 -27992862 -30660785 -33503147
57028 -33503147 -36536994 -39792045 -43331958 -47255411 -51657199 -56568908 -61927883 -67600167
57020 -67600167 -73425513 -79227930 -84777672 -89752208 -93752866 -96384353 -97355395 -96554555
57012 -96554555 -94079760 -90218267 -85382131 -80017503 -74520359 -69186884 -64202560 -59652862
57004 -59652862 -55538833 -51794780 -48313311 -44977232 -41688574 -38384808 -35041326 -31666584
56996 -31666584 -28295007 -24977939 -21772744 -18733148 -15903472 -13315508 -10986099 -8916486
56988 -8916486 -7095008 -5501822 -4113078 -2904380 -1853864 -943239 -155923 524749 1114368
56979 1114368 1625513 2068775 2455115 2795434 3098211 3369777 3616927 3846862 4064120
56970 4064120 4270136 4466628 4655820 4834037 4987038 5096307 5151865 5158296 5129201 5078342
56960 5078342 5015841 4948525 4880008 4810571 4738922 4664378 4586619 4504012 4413874 4314622 4206604
56949 4206604 4090799 3968007 3839690 3708119 3574482 3437344 3294069 3143650 2987669
56940 2987669 2828885 2669624 2511247 2354163 2198027 2042438 1887720 1734982 1585645
56931 1585645 1441178 1302925 1171652 1047616 931637 825677 731535 649197 577308 514807
56921 514807 460860 413412 369503 327554 288081 251688 217859 186571 159585 138575 122780
56910 122780 109943 99031 90606 84876 81056 78782 78792 81715 87220 94836 104785 117403 132333 148780
56896 148780 166059 183222 198369 209002 213421 211823 206087 198483 190519 182821 175687 169293 163392
56883 163392 157552 152042 147956 145983 145479 145430 146009 148505 153882 162219 173521 188144 205906 225170
56869 225170 243186 257243 265618 267945 264922 257462 246059 231185 214183 197116 181360 166627
56857 166627 151692 135918 119887 104819 91755 81237 73310 67503 62911 58522 53666 48248 42690
56844 42690 37746 34137 32003 30580 28751 26258 24252 24449 27863 34421 43425 54059 65792 78777
56830 78777 93605 110282 127867 145681 164234 183883 202982 218795 230434 239562 247870 255151
56818 255151 260412 263471 264544 263567 261235 259829 261451 265855 271289 277224 284988 295854 309884 326882
56804 326882 347318 371706 399739 430500 463047 496334 528670 557514 580027 594301 600431 600160
56792 600160 595304 586984 576591 566492 558760 553555 549771 547050 546250 548107 552637 560141 571871 589139
56778 589139 612239 640490 672910 708570 746579 785730 823728 856717 880251 891378 890017 878421
56766 878421 859442 835154 806768 775528 743420 712715 684949 660788 640736 625273 614287
56755 614287 607304 604608 607119 614722 625812 639264 655657 675478 697064 717551 734883 747426
56743 747426 752665 748504 735714 717235 695113 669908 642972 616983 593481 571867 551735 534478
56731 534478 521330 511297 502446 494298 487710 483194 480698 480493 482957 487682 493664 500127 506330 510811
56717 510811 511678 507625 498386 484653 468075 450670 433308 415100 395103 374366 355346 339368
56705 339368 325506 312026 298196 284478 271601 259865 249078 238971 229744 222124 216608 212641
56693 212641 208824 204003 198067 191871 186624 183196 181517 180449 178463 174716 169605 164299 159748 156045
56679 156045 152712 149542 147047 145920 146265 147508 148965 150139 150627 150216 149191 148176 147568 147405 147790 148924
56663 148924 150479 151422 150915 149248 147578 146794 146860 147168 147249 147024 146562 145954 145618 146421 148955 152631 156048
56646 156048 158482 160411 162250 163393 163308 162888 163530 165084 165967 165427 164503 164408 165015 165610 166190 167149 168167
56629 168167 168250 166782 164069 161060 158907 158504 159947 162531 165540 168851 172505 175987 178447 179623 180202
56614 180202 181194 183081 185549 187881 189488 190110 189743 188597 187109 185661 184164 182310 180359 179167 179140
56599 179140 179695 180263 181248 183267 185959 188482 190856 193740 196971 199442 200524 200702 200692 200828 201451 202845
56583 202845 204486 205274 204989 204695 205270 206266 206682 206245 205561 205511 206685 208730 210089 209204 206307 203268 201434
56566 201434 200471 199511 198353 197078 195602 194267 193811 193971 193140 190394 187022 184982 184442 183808 181648 177763
56550 177763 173019 169105 167845 169650 172990 176151 178900 181574 183534 184016 183909 184875 186863 188218 188407
56535 188407 189017 191506 195354 199072 201890 203749 204759 205522 207143 209918 212568 213605 213046 212107 211719
56520 211719 212154 213624 216146 218931 220946 222214 223685 225600 226934 227021 226956 228534 232088 236190 239431
56505 239431 241764 243993 246637 249689 253047 256748 261020 266345 273177 281241 289221 295502 299268 300919
56491 300919 301593 302312 303207 303535 302848 302087 302757 304824 306327 305662 303383 300975 298760 296217 293760 292665
56475 292665 293247 294378 294936 294688 293669 291822 289522 287534 286186 285341 285180 285963 286927 286606 284619 282169
56459 282169 280481 279750 279865 280852 282108 282430 281581 280739 280592 280050 277822 274414 271451 269689 268634 267589
56443 267589 266111 263865 261044 258671 257686 257821 257923 257178 255604 253760 252468 252362 253172 253797 253489 252562
56427 252562 251558 250419 249030 247992 248074 249208 250647 251960 253422 255555 258361 260840 261538 260193 258499
56412 258499 258254 259036 259125 258563 259326 262149 265303 267437 269494 272304 274275 273534 270981 269082 268565 268362
56396 268362 268004 267884 267689 266830 266264 267773 271266 274633 276475 277346 278114 278798 279460 280658 282430 284005
56380 284005 284987 285776 286532 286814 286589 286592 287410 289097 291685 294938 297629 298420 297762 297641 299055 300959 302027
56363 302027 302160 301748 300770 299427 298533 298374 298164 297490 297490 299522 303315 307337 310541 312792 314005 314026 313421
56346 313421 313422 314707 316706 318416 319541 320480 321406 321927 321818 321603 321845 322125 321534 320287 319910 321337 323660
56329 323660 325499 326867 328680 330955 332780 333924 335246 337224 339053 339695 339213 338591 338540 338821 338715 338110
56313 338110 338092 340120 344382 349329 353177 355530 357207 358970 360878 362517 363355 363221 362739 362827 363469 363773
56297 363773 363634 364258 366277 368397 369105 368865 369253 370464 371135 370285 368154 365376 362661 361224 362247 365685
56281 365685 370414 375477 380476 385121 389411 393967 399215 404554 409229 413500 417847 421634 423932 425189
56267 425189 426714 428884 431358 434596 439390 445143 450425 455244 460858 467059 471582 472989 472744 473681 477351
56252 477351 483258 489629 494553 497338 499086 501296 504059 506553 508892 512091 516340 520823 525254 530153
56238 530153 535613 541195 547045 553675 560748 567606 574800 583306 592344 600029 606241 612740 620268 627930
56224 627930 635832 645700 657834 669881 680146 690146 702370 717130 733133 749659 766615 783645
56212 783645 800734 818794 838469 859268 880912 904507 931258 960828 991764 1022698 1052687
56201 1052687 1081800 1112180 1146995 1187237 1230874 1276207 1324515 1378104 1437216 1500598 1568028
56190 1568028 1640574 1719069 1803864 1895547 1994512 2100124 2211204 2326682 2444839 2562723
56180 2562723 2677583 2788437 2895270 2997129 3091760 3176477 3248651 3305991 3347154 3371684
56170 3371684 3379135 3369196 3342947 3302560 3249156 3182446 3103339 3015346 2922219 2825597 2726225 2625937
56158 2625937 2526735 2429034 2332598 2238461 2148309 2062578 1980674 1902505 1828442 1758233 1691353
56147 1691353 1628042 1568845 1513536 1461574 1413137 1368641 1327762 1289951 1255400 1224503 1196906
56136 1196906 1171915 1149133 1127917 1107148 1086774 1068762 1055174 1045755 1038413 1031420 1024103 1016197
56124 1016197 1007915 1000286 994197 989335 984929 981018 978164 976503 976045 977270 980408 984530 988257 991098
56110 991098 993574 996571 1001017 1007428 1015241 1023417 1032057 1042313 1054362 1066899 1079331 1092879 1108632
56097 1108632 1126005 1144254 1164003 1186043 1210005 1235438 1262807 1292194 1322538 1353633 1387404
56086 1387404 1425775 1468692 1515639 1567401 1624587 1686210 1751837 1823617 1903808 1991408 2083411
56075 2083411 2178086 2274419 2369298 2458076 2537891 2608563 2670887 2726149 2776801 2825239 2871762
56064 2871762 2915040 2953790 2986383 3010014 3022775 3026161 3023381 3015538 3001296 2979531 2949877 2911020
56052 2911020 2861020 2799775 2729579 2653421 2574363 2496099 2422017 2353486 2290497 2233608 2183672
56041 2183672 2140165 2101704 2068043 2039943 2017375 1999367 1985166 1974084 1964862 1956930 1951662 1950540
56029 1950540 1952615 1955550 1958594 1962723 1968466 1975579 1984352 1995357 2008259 2022491 2038478 2056509 2075207
56016 2075207 2092981 2110299 2128920 2149750 2173110 2199733 2229407 2259835 2289186 2318782 2351039
56005 2351039 2385915 2421680 2457874 2495018 2532767 2571116 2612057 2656976 2703617 2748847 2793367
55994 2793367 2840253 2889818 2939534 2988453 3038024 3088836 3140088 3192216 3246769 3303759 3362121
55983 3362121 3422446 3486108 3552213 3618754 3686397 3757660 3832794 3910073 3989844 4074440 4164045
55972 4164045 4256312 4350346 4447723 4549566 4655953 4768165 4888064 5015262 5148152 5287451
55962 5287451 5435352 5591703 5754684 5924705 6103964 6292995 6491882 6703921 6933205
55953 6933205 7178728 7435578 7701849 7979886 8271226 8575504 8894285 9230591 9584288
55944 9584288 9953104 10338641 10746311 11178987 11635797 12117343 12626751 13165274 13732353
55935 13732353 14330317 14963355 15631658 16332582 17068086 17845066 18667989 19537385 20455808
55926 20455808 21428590 22458289 23545317 24694713 25915493 27213147 28590201 30054165
55918 30054165 31616598 33283582 35055431 36936356 38936051 41062290 43322714 45735493
55910 45735493 48328689 51128615 54159282 57453105 61049975 64985784 69295893 74031479
55902 74031479 79259615 85049528 91478293 98652958 106709882 115793592 126061311 137711928
55894 137711928 150982645 166104688 183273988 202644917 224293214 248158088 274021131
55887 274021131 301430667 329377309 355838743 377769507 391966246 396402962 391045698
55880 391045698 377587697 358497128 336158199 312472425 288782741 265917283 244303770
55873 244303770 224126041 205440517 188223451 172402790 157900479 144648404 132568692
55866 132568692 121563890 111535981 102399872 94074868 86481621 79555944 73252909 67531208
55858 67531208 62343654 57645173 53396575 49554800 46070119 42898512 40008861 37374983
55850 37374983 34969578 32769309 30757085 28915134 27222613 25662631 24224478 22896457
55842 22896457 21663551 20514543 19444519 18447848 17515374 16640865 15823456 15060801 14345788
55833 14345788 13672740 13041086 12450239 11896377 11376940 10892866 10443288 10022641 9625799
55824 9625799 9251829 8900238 8567806 8251717 7952005 7668490 7398597 7140133 6892874
55815 6892874 6655666 6425073 6198307 5974489 5752349 5530403 5310356 5096399 4889921
55806 4889921 4688572 4491491 4301374 4120125 3946642 3780450 3623414 3475938 3335415
55797 3335415 3200396 3072674 2953194 2839588 2730210 2627301 2533531 2447988 2367865 2291643
55787 2291643 2218547 2147277 2077517 2010824 1948390 1889777 1834955 1785085 1739806 1696145 1651719
55776 1651719 1607088 1563801 1522420 1483597 1448522 1416771 1385966 1354995 1325478 1298846 1274312
55765 1274312 1250982 1229579 1210526 1192447 1174029 1155407 1136559 1116446 1094988 1073721 1053403
55754 1053403 1033212 1013367 995991 981957 969337 956513 944368 933834 923769 913213 903566
55743 903566 896495 891563 887709 885072 883492 881186 877035 872540 869581 867765 865840 864142 863693 864214 864887
55728 864887 865891 867573 869291 870428 871126 870676 866881 858693 847921 836568 823995 808687 791479
55715 791479 775044 761133 750081 742096 737281 734969 734286 734521 734084 730608 723389 714339 705191 695286
55701 695286 683542 670853 658695 646907 634847 623372 613550 604526 594706 584053 573341 562234
55689 562234 550203 538353 528165 519237 510371 502072 495760 491171 486844 482701 479822 477929 475401
55676 475401 471722 467799 463736 458471 452027 446161 442046 438675 434199 427804 419971 411836 404535 398413
55662 398413 392883 387695 383853 382246 381893 380913 378966 377356 376866 376905 376806 376704 377002 378102 380635 384695
55646 384695 388643 389797 386677 379975 371492 363020 356006 350949 346828 342007 336009 329796 324507 320757
55632 320757 318875 318619 318523 316682 312600 307574 303159 300044 298386 298132 298536 298269 296757 295002 294533 295712
55616 295712 297423 298379 298464 298581 299106 298975 297023 294094 292734 294203 296706 297411 295591 292831 290687 289248
55600 289248 287899 286450 285232 284632 284683 284913 284735 284193 284001 284621 285692 286596 287077 287134 287037 287719 290156 293832
55582 293832 296770 297788 297813 298279 299213 299794 299694 298606 295443 289542 282161 275383 269827 264597 258973 252922
55566 252922 246434 239836 234475 231578 230461 229120 226567 223416 220335 217300 214425 212245 210922 210107
55552 210107 209603 209231 208295 206362 204436 203943 204464 203866 201009 197039 193652 191339 189820 189002 188787 188729 188507
55535 188507 188137 187428 186031 184393 183765 184748 186405 187263 186692 185117 183486 182788 183474 185029 186606 188057
55519 188057 189706 191166 191518 191061 191854 195784 202521 209970 216416 221885 227645 234613 242062 248018 251307
55504 251307 253009 255117 257858 259264 257641 253580 249092 245484 242600 239579 235799 231341 226919 223194
55490 223194 220005 216531 212262 207518 203001 199149 195878 192570 188459 183545 179046 176449 176121 177153
55476 177153 178169 177853 175404 171509 168341 167367 167406 166187 163551 161515 161174 161454 161392 161685 162869 163640 162528
55459 162528 160125 158057 156510 154296 150986 147543 144921 143204 142138 141525 141097 140748 140856 141558 141808 140119
55443 140119 136402 132343 129737 128973 129284 129822 130193 130314 130099 129319 127872 126343 125917 127261 129593 131314
55427 131314 131506 130480 129152 128391 128664 129600 130019 129216 128184 128525 130054 130722 129530 128312 129391 132291
55411 132291 134339 134313 133757 134293 135231 134962 133600 132766 133084 133352 132392 130673 129590 129867 131158 132803 134394
55394 134394 135726 136579 136659 135822 134423 133254 132770 132578 132037 131121 130190 129164 127756 126314 125456 124821 123332
55377 123332 121020 119430 119581 120535 120750 120023 119226 118975 119552 121452 124767 128353 130720 131730 132622 134449
55361 134449 137082 139540 140705 140138 138810 138543 140042 142013 142968 143095 143297 143284 142248 140923 141068 142803
55345 142803 144139 143565 141697 139963 139026 139023 140117 141961 143537 144254 144509 144655 144247 142884 141048 139434
55329 139434 137965 136074 133575 130857 128519 127078 126636 126749 127015 127745 129387 131418 132737 133159 133472 133752
55313 133752 132843 130172 127125 125750 126580 128358 129498 129310 128086 126408 124431 121965 119481 118402 119524
55298 119524 121539 122373 121803 121347 121589 121384 120243 119776 121638 125176 128112 128784 127054 123990 121395 120657
55282 120657 121245 121172 119489 117220 115336 113373 111037 109537 109864 111083 111932 112930 115037 117279 117823 116847
55266 116847 116215 116643 117198 117501 118264 119421 119751 118995 118616 119680 121363 122352 122560 122645 122822 122984 123300 124044
55248 124044 125259 126865 128508 129261 128415 126783 126115 126782 127157 125878 123695 122259 122094 122790 124372 127016
55232 127016 129693 130509 128821 126167 124682 125048 126320 127287 127493 127117 126443 125794 125702 126551 127854 128324 127192
55215 127192 125305 124472 125671 128241 130817 132606 133641 134252 134699 135182 135964 137364 139546 142109 143946
55200 143946 143843 141561 138366 136242 136228 137335 137381 135134 131451 127953 125102 122370 120036 119424 120941 123103
55184 123103 124268 124385 124096 123071 120581 117189 114518 113422 113486 114129 115059 115770 115848 115879 116898 118805 120490
55167 120490 121676 123296 125527 126793 125627 122705 120093 119056 119390 120474 122113 124470 127608 131043
55153 131043 133685 134643 134277 133868 134020 134097 133650 133568 134999 137606 139736 140223 139388 138266 137332 136081 133729
55136 133729 130410 127571 126732 127763 129000 129306 129294 130013 131272 132081 132187 132052 131572 130083 127892 126734
55120 126734 128018 131154 134230 136017 136733 137027 136981 136398 135572 135185 135479 135997 136287 136452 136762 137102 137216 137213
55102 137213 137265 137056 136153 134857 134008 133904 134131 134514 135427 136853 138029 138555 139104 140363 141878 142656 142404
55085 142404 141421 139856 138008 136923 137469 138940 139741 139542 139534 140272 140589 139453 137850 137658 139223 141278 143020
55068 143020 144946 147339 149070 148710 146367 143653 141977 141369 141001 140361 139751 139915 141361 143919 146748 148793
55052 148793 149411 148703 147332 146043 145184 144554 143654 142185 140371 138850 138278 138960 140646 142610 144117 145026
55036 145026 145804 146807 147721 148000 147726 147714 148747 150944 153727 156143 157397 157493 157263 157362 157413 156691 155412 154478
55018 154478 153948 152852 150926 149597 150467 153343 156316 157357 155590 151785 148242 147399 149619 152812 154843
55003 154843 155584 155865 155436 153523 150845 149340 149739 150826 151420 151803 152769 154295 155763 156801 157405 157747
54987 157747 158065 158285 157768 156122 154173 153268 153633 154340 154884 155687 156898 157861 158052 157461 155911 153394 151436
54970 151436 152414 156515 160754 162189 160979 159086 157168 154514 151358 149269 149117 150063 150938 151585 152437 153516
54954 153516 154347 154625 154772 155760 158079 160766 161975 160832 158305 156056 155094 155734 157794 160181 161283 160718
54938 160718 159928 160223 161194 162054 163432 166229 169449 171124 171167 171508 173247 175208 175610 173772 169957 165013
54922 165013 160717 159108 160584 163439 165837 167347 168158 167984 166751 165631 166293 169130 172745 175134 175208
54907 175208 173470 171359 169739 168104 165736 163239 161992 162182 162548 162411 162808 164958 168461 171778 173788
54892 173788 174183 173044 171030 169633 170219 172637 175327 176860 177078 176790 176845 177675 179424 181998 184646 185754
54876 185754 183823 179140 174038 171018 170966 173471 177845 182800 186118 186523 185694 186630 189858 193014 194494
54861 194494 195460 197365 199535 200798 202046 205328 211145 218287 225780 233521 241255 248300 254176 258596
54847 258596 261194 262210 262832 263674 263353 259878 253180 245110 237283 230209 224179 219408 215291 210937 206629
54832 206629 203502 201788 200671 199895 199927 200324 199628 197503 195476 194850 195321 196447 198978 203408 208438 212388
54816 212388 215471 219252 224252 229367 233523 236802 239919 243386 247318 251496 255589 259550 263482 266874
54802 266874 268628 268304 266652 264250 260412 254403 247062 240021 233727 227512 221450 216715 213889 212073
54788 212073 210040 207369 204051 199877 194812 189476 184833 181687 180422 180622 180941 180137 178427 177066 176459
54773 176459 175612 173784 171727 170575 170309 170098 169662 169436 169608 169641 168783 166848 164715 164034 165786 168942 171324
54756 171324 172083 172383 173166 173511 172324 170553 170098 171132 172162 172521 173016 173976 174457 174048 173996 175604 178491
54739 178491 181249 182964 183376 182437 180646 179130 178520 178260 177743 177432 177983 178932 179350 179356 179852 181088 182620
54722 182620 184564 187660 191909 196122 199081 200464 200644 200377 200711 202197 204024 204938 205288 207091 211546
54707 211546 217361 222285 225522 228017 231088 235712 242610 251822 262096 271481 278789 284219 288566 292191
54693 292191 294708 295402 293906 290562 285944 280176 273256 266057 260028 255316 250097 242860 234833 228877
54679 228877 226131 225046 223851 222463 221306 219584 216185 211786 208604 207854 208469 208764 208580 209048 210711
54664 210711 212787 214412 215842 217977 221115 224863 229139 234511 241239 248519 255127 260537 264944 268413
54650 268413 270552 271023 269938 267706 264800 261674 258463 254757 250128 244998 240486 237111 234185 230919
54636 230919 227695 225613 224887 224349 222638 219433 215441 211626 208703 206962 206161 205703 205155 204479 203634 202265
54620 202265 200157 197717 195533 193596 191512 189458 188217 188016 187965 187159 185892 185227 185608 186455 187007 187097 187088
54603 187088 187440 188293 189268 189828 190088 190844 192382 193768 194052 193700 193810 194191 193410 190798 187155 183306 179382
54586 179382 176010 174646 175708 177529 178389 178678 179826 181946 183957 185406 186582 187197 186666 185629 185566 186695
54570 186695 187723 187900 187778 187611 186698 185118 184544 186156 188904 191036 192317 193360 193689 192277 189686 187932
54554 187932 187958 188580 188443 187907 188261 189745 191146 191241 190193 189452 190363 192796 195115 195554 193599 190075 186295
54537 186295 183342 181800 181601 182111 182688 183157 183747 184794 186633 189250 191780 192985 192757 192559 193584 195047
54521 195047 195312 194326 193621 193959 194399 194116 193787 194362 195481 196151 196348 196879 197947 198772 198540 197106 194932
54504 194932 192983 192420 193601 195467 196658 197170 198062 199553 200452 199875 198639 198285 199345 201293 203718 206619
54488 206619 209655 211943 212793 212179 210441 208097 206149 205932 208091 211828 215555 218302 220277 222127 223947
54473 223947 225206 225515 225251 225181 225490 225387 223928 221129 218114 216244 216221 217819 220046 221655 222003 221551 221159
54456 221159 220884 220007 218318 216585 215414 214421 213211 212412 212679 213182 212375 210245 208521 208347 209005 209483 210135
54439 210135 211789 213989 215275 214800 212692 209210 204783 200825 199224 200524 203394 206291 208855 211310
54425 211310 213412 214911 216444 218870 221808 223823 224324 224519 226009 228879 231729 233320 233684 233693 234067 235038
54409 235038 236621 238783 241275 243547 245084 245921 246650 247713 248772 249108 248829 249252 251616 255547 259253
54394 259253 261291 261676 261219 260422 259384 258220 257008 255537 253639 251516 249272 246442 242676 238766 236144
54379 236144 235240 235055 234541 233658 232683 231336 229440 227970 228467 231191 234526 236616 237298 238071 240121 242763
54363 242763 244130 243342 241446 239928 238876 237362 235259 233560 232669 231608 229581 227464 226693 227188 227528
54348 227528 227111 227032 228471 230964 232851 233154 232646 233075 235472 239168 242492 244437 245496 246738 248309 249181
54332 249181 248253 245451 241877 239241 238972 241330 245120 248460 250098 250116 249534 249314 249638 250010 250026 249896 249988
54315 249988 250121 249866 249570 250342 252728 255948 258767 260584 261347 261155 260540 260419 261015 261443 261169 261232 262976
54298 262976 266145 269465 272690 276483 280306 282128 280874 277927 275409 273872 272481 270747 269257 268926
54284 268926 270048 271907 273180 273105 272304 271942 272142 271969 270983 269740 268488 266452 263100 259216 256018 253884
54268 253884 252621 252222 252512 252616 251741 250223 249098 248832 248971 248728 247449 244985 242212 240680 241069 242338
54252 242338 242948 242422 241112 239071 236224 233291 231530 231596 233244 235794 238139 238805 237195 234673 233376
54237 233376 233931 235216 236220 237055 238052 239003 239608 239797 239383 238264 237166 237130 237950 238181 237238 236424 237105 238798
54219 238798 239984 240102 239659 238860 237365 235413 234175 234644 236729 239484 241730 242424 241159 238729 236858
54204 236858 236884 238661 240884 242375 242890 242705 241711 239416 236081 233433 233459 236276 239787 241855 242399 242931
54188 242931 244568 247236 250457 253819 256471 257223 255815 253515 251808 250856 249850 248438 246965 245557 244020
54173 244020 242735 242508 243055 242568 239667 235239 231563 230086 230749 232916 235793 238227 239366 239548 239500 238797
54157 238797 236545 233763 233292 236351 240572 242716 242277 241047 240069 238836 237156 235954 235866 236301 236325 235495
54141 235495 233635 230859 228196 227197 228307 230281 231586 231794 231289 230436 229634 229581 230711 232542 234036 234561
54125 234561 234310 233977 234070 234346 233924 232328 230324 229239 229499 230430 231483 232908 235021 237514 239757 241252
54109 241252 241659 241051 240334 240593 241709 242326 241562 240000 238647 237728 236994 236279 235082 232627 229355 227483
54093 227483 228714 231769 233624 233159 232309 233340 236152 238824 239903 239331 237671 235401 233096 231644 231732
54078 231732 233091 234608 235423 235770 236514 238004 239821 241544 243117 244379 244905 244671 244342 244529 245230 246207
54062 246207 247196 247408 245772 242530 239836 239690 241644 243583 244345 244368 243933 242348 239387 236406 235148 235906
54046 235906 237427 238376 238610 239233 241502 245351 249028 250636 250040 248726 247824 247094 246081 245383 246025 247976
54030 247976 249960 250691 249977 248821 248689 250531 254138 258403 262223 265087 266966 268116 269069 270337 271770
54015 271770 272569 272250 271336 270795 271016 271766 272930 274828 277616 280662 282824 283462 283289 284082 287266 292584
53999 292584 298286 302752 305832 308568 311908 316005 320676 326056 332451 339683 346955 353479 358978 363376
53985 363376 366400 368057 369264 371135 373415 374462 373410 371761 371969 374693 378322 381148 383102 385079
53971 385079 387291 388957 389538 389829 391574 395781 401453 406349 409211 410765 412234 413519 413651 412592 411498
53956 411498 411210 411427 411575 411610 411614 411192 409561 405922 399873 392102 384569 379037 375338 371956 368343 365451
53940 365451 363686 361794 358561 354508 350879 347830 344767 341810 339714 338674 338163 337681 336842 335081 332223
53925 332223 329043 326440 324382 322426 320747 319586 318212 315825 313178 311786 311468 310301 307427 304445
53911 304445 303354 304378 306612 309657 313508 317602 321113 323817 325882 327250 328051 329178 331539 334903
53897 334903 338240 341054 343626 346146 348439 350650 353461 357464 362765 369249 376654 384251 390996 396253
53883 396253 400066 402565 403596 403228 402332 402266 403951 407323 411568 415796 419618 423294 427395 432333 438132
53868 438132 444450 450736 456557 461898 467003 471783 475766 478947 482386 487425 494388 502559 511350 520836
53854 520836 531028 541300 551002 560258 569736 579922 590887 602424 613955 624567 633630 641228
53842 641228 647454 651392 651420 646782 638478 628468 618260 608356 598588 588598 578133 567221 556103
53829 556103 544984 533963 523187 512798 502618 492220 481524 471088 461588 453268 446097 440124
53817 440124 435287 431084 426881 422424 417645 412166 405625 398515 392065 387026 382995 379080 374844 370441
53803 370441 366398 363493 362249 362121 361714 360274 358490 357262 356252 354527 352241 350619 350244 350322 349839 348523
53787 348523 346405 343332 339529 335997 333671 332572 332219 332367 332784 332816 331961 330657 329864 329968 330640 331498 332316
53770 332316 332777 332730 332648 333199 334425 335925 337634 339614 341196 341375 340258 339121 338676 338233 337150 336155 336401
53753 336401 337948 340118 342760 346102 349674 352555 354705 357133 360672 365391 371244 378341 386180 393355
53739 393355 398556 401550 403105 404523 407346 412674 420163 428100 434851 439872 443115 444333 443742 442783 443051
53724 443051 444485 445415 444640 442708 440835 439126 436524 432405 427581 423373 419956 416205 411352 406227 402201
53709 402201 399242 396015 392037 388613 386971 386393 385272 383388 381763 380403 377781 373085 367739 363742
53695 363742 361242 358811 355640 352386 349870 347990 346264 344735 343786 343447 343347 343231 343181 343410 344101 345327
53679 345327 346910 348370 349307 349848 350480 351430 352452 353302 354162 355388 356991 358498 359214 358628 356951 355374
53663 355374 355369 357271 359956 362403 365183 369598 375557 381325 385551 388507 390894 392531 393176 393844 396020
53648 396020 399710 403445 406352 409356 413940 420336 427290 433212 437290 439912 442313 445627 450016 454771
53634 454771 459180 463041 466413 469338 471888 474090 475712 476508 476789 477292 478298 479271 479706 479880 480255 480302
53618 480302 478474 473639 466457 459248 454413 452848 453703 455426 456778 456954 455502 452739 449955 448428 448134
53603 448134 447977 447377 446960 447432 448360 448605 447705 446459 446195 447563 449857 451522 451717 451389 452299 454852 457551
53586 457551 458982 459665 461209 464032 466779 468064 468113 468381 469993 472871 476174 479186 481733 484069 486678
53571 486678 490093 494485 499335 503946 508514 514138 521248 528527 534239 538294 542047 546265 550450 554213
53557 554213 557921 561572 564399 566416 569181 574076 580804 588531 597406 607467 616933 623573 627690 632011
53543 632011 638299 645462 651416 655535 658607 661362 663845 665680 666446 666231 666046 667039 668924 669882 668464
53528 668464 665074 661188 657709 654666 652012 650014 648892 648439 647957 646446 643167 638225 632468 626874 622358
53513 622358 619816 619462 619965 619272 616815 614205 613187 613611 614052 613793 613355 613515 614719 617162 620567 623964
53497 623964 626491 628467 631031 634818 639607 645201 651809 659327 666956 673873 679928 685531 691307 697980
53483 697980 706053 715325 725168 735513 747121 760594 775520 790994 806707 823101 840677 859467
53471 859467 879107 899220 919883 941846 965959 992086 1018930 1045330 1071386 1097825 1124667
53460 1124667 1151398 1178402 1207159 1238527 1271609 1305062 1339006 1374773 1412971 1452775 1493226
53449 1493226 1534318 1576357 1619006 1661732 1704783 1748808 1793453 1837055 1878085 1916513 1953438
53438 1953438 1989659 2025055 2059273 2092628 2126016 2159957 2193884 2226598 2257542 2287472 2317611
53427 2317611 2348175 2377997 2405702 2431033 2454874 2478190 2501158 2523238 2543807 2562611 2579634
53416 2579634 2594517 2606163 2613183 2615015 2612592 2607623 2601126 2592769 2581621 2567212 2549682 2529263
53404 2529263 2506132 2480834 2454346 2427359 2399673 2370571 2339669 2307088 2272883 2236879 2199355
53393 2199355 2161587 2125279 2091376 2059571 2028978 1999142 1970407 1943424 1918396 1894889 1872540
53382 1872540 1851939 1834602 1821814 1813507 1808352 1804910 1802623 1801768 1802705 1805355 1809464 1815259 1823548 1835041
53368 1835041 1849750 1867382 1888093 1912292 1939699 1969280 2000494 2034010 2070602 2109764 2150190
53357 2150190 2191590 2235282 2282853 2334652 2389687 2446507 2504058 2562275 2622283 2685787 2753861
53346 2753861 2826311 2902255 2981060 3062548 3146520 3232472 3319833 3408344 3498118 3589259 3681368
53335 3681368 3773553 3865160 3956350 4047540 4138178 4226591 4311511 4393471 4474112 4553957 4631324
53324 4631324 4703651 4769524 4829070 4882752 4930533 4972215 5007622 5035838 5054932 5063525 5062554 5054533
53312 5054533 5040824 5020365 4991257 4952738 4905176 4849027 4784646 4712664 4633772 4548581 4458381
53301 4458381 4365624 4272650 4179943 4086416 3991396 3895724 3800924 3708022 3617241 3528326 3441013
53290 3441013 3355460 3271961 3189965 3108049 3025741 2944917 2868374 2797228 2730634 2667662 2608068
53279 2608068 2551428 2497080 2445225 2396653 2351075 2307327 2265708 2228453 2196823 2169206 2143301
53268 2143301 2118884 2096986 2077478 2059277 2042272 2027285 2014298 2002305 1990947 1981047 1973494 1968701
53256 1968701 1967117 1969045 1973784 1980055 1987471 1996678 2007971 2020782 2034776 2050481 2068508 2088948
53244 2088948 2111728 2136751 2163595 2191943 2222454 2256108 2292443 2329657 2367025 2406090 2448569
53233 2448569 2493952 2540107 2585506 2629734 2672288 2712134 2748425 2780793 2808922 2832681 2852844
53222 2852844 2870860 2887465 2901797 2912013 2916499 2914513 2906267 2892830 2875674 2855807 2833150 2806836
53210 2806836 2776151 2741211 2702861 2662079 2619574 2575794 2530949 2484775 2436498 2385557 2332472
53199 2332472 2278607 2224769 2170344 2114267 2056734 1999459 1944099 1890772 1838405 1786200 1734341
53188 1734341 1683362 1633493 1584943 1538362 1494439 1453023 1413151 1374028 1335691 1298677 1263448
53177 1263448 1230345 1199679 1171500 1145403 1120702 1096726 1073098 1050151 1029027 1010620 994150
53166 994150 977391 958722 938335 917126 895475 874013 854593 838716 825039 809916 791003
53155 791003 769527 748768 731141 716987 705141 693975 682445 670746 659670 649275 638754
53144 638754 627738 616844 606557 596412 585860 575173 564900 555147 546131 538686 533203 528562
53132 528562 523154 516742 510378 504787 499836 495428 491645 487927 483266 477592 471971 466990 461945 456254
53118 456254 450802 446971 444944 443824 442888 441707 439520 435817 431610 428850 428122 427920 426769 425092 424152
53103 424152 423948 423362 422009 420661 419811 419063 418287 418223 419229 420296 420180 418918 417351 415596 413137 410284
53087 410284 408328 407853 407775 406636 404361 402185 401151 401153 401291 400848 399969 399547 400300 401820 402791 402378 401197
53070 401197 400631 401289 402386 402601 401325 399081 397037 396233 397057 399105 401380 402817 403013 402523 402298 402780
53054 402780 403718 404851 406264 407827 408697 407873 405143 401269 397466 394946 394424 395385 396126 395326 393531 392437
53038 392437 392639 392862 391563 388634 385256 382627 381159 380493 379938 379142 378414 378072 377617 376163 373796 371751
53022 371751 370975 371145 371472 371789 372323 372941 373219 372986 372361 371537 370853 370634 370616 369938 368109 365603 363149 360962
53004 360962 359145 358295 358928 360587 362171 362962 362818 361673 359601 357214 355280 353825 352185 350026 347897
52989 347897 346702 346901 348162 349379 349189 347029 343913 341809 342040 344375 347625 350829 353693 356062 357354
52974 357354 356884 354866 352639 351435 351153 350919 350495 350269 350019 348988 347423 346660 346993 346743 344444 340965
52958 340965 338349 337485 338121 340141 343211 345830 346616 346319 346877 348604 350070 350716 351551 352902 353517 352844
52942 352844 352372 353463 355246 356046 355762 355426 355236 354556 353309 351982 350550 348692 346864 345986 346128 346713
52926 346713 347969 350907 355473 359838 362206 362634 362441 362389 362153 361286 359914 358470 357332 357035 358299 361305
52910 361305 365084 368285 370624 372930 375464 377026 376598 375310 375562 378165 381451 383483 384148 384617 385668
52895 385668 387125 388256 388196 386606 384412 383147 383061 382762 381325 379681 378924 378294 376271 373010 370028 367850
52879 367850 365667 363408 362321 362980 364191 364609 364229 363482 362076 359900 358176 358228 359381 359362 356959 353299
52863 353299 350198 348137 346451 344944 344336 344931 345585 344740 342408 340441 340520 342480 345036 347446 349601 350964
52847 350964 350750 349337 348318 348589 349264 349094 348199 347601 347670 347986 348429 349413 350998 352536 353370 353357 352563 350982
52829 350982 348854 346990 346460 347891 350896 354063 355705 355088 353052 351307 351046 352232 353937 355172 355551
52814 355551 355455 355542 356078 356984 358516 361297 365274 369176 371637 372589 372914 373017 372591 371683 371104 371479 372512
52797 372512 373399 373472 372358 370139 367563 365485 363800 361556 358401 355335 353568 353241 353635 354080 354064 353096
52781 353096 351239 349431 348553 348351 347835 346491 344538 342407 340656 340043 340725 341602 341460 340585 340117 339842 338155
52764 338155 334666 331389 330259 330535 330044 328392 327450 328647 331135 333037 333577 333420 333550 334450 336085 338132
52748 338132 340171 341889 343116 343697 343503 342690 341783 341234 340898 340053 338055 335052 332092 330349 330142 330736
52732 330736 331109 330875 330390 330213 330544 331003 330857 329743 328379 328179 329712 331868 333116 333474 334490 337053
52716 337053 339907 340812 338842 335130 331636 329583 328909 328628 327617 325486 323000 321453 321360 321874 321776 321062
52700 321062 321242 323812 328609 333956 338267 341081 342517 342430 340628 337595 334396 331901 330489 330329 331402
52685 331402 333196 334967 336463 338021 339842 341666 343285 344833 346320 347444 348263 349476 351470 353508
52671 353508 354542 354522 354251 354221 354389 354958 356389 358434 360119 361124 362388 364616 366767 366875 364248 360162
52655 360162 356421 353763 351703 349445 346814 344606 344061 345673 348560 351298 353276 354797 356094 356988 357609
52640 357609 358610 360213 361617 361901 361046 359542 357415 354409 350920 348019 346451 346139 346607 347352 347814 347610
52624 347610 347001 346716 347133 348027 349080 350151 351000 351398 351639 352265 353029 352880 351511 350257 350717 352842 355097
52607 355097 356267 356383 356017 355415 354602 353817 353529 354110 355542 357307 358636 359004 358472 357568 357033 357553 359285
52590 359285 361532 363410 364980 367023 369429 370712 369853 367771 366010 364657 362850 360865 360051 360651 361321
52575 361321 361286 361547 363140 365414 367055 367963 369027 370675 372820 375900 380672 386799 392509 396097 397409
52560 397409 397666 398059 398562 397971 395157 390436 385521 382038 380394 380098 380559 381102 380810 379200 376902 375042
52544 375042 373977 373110 371873 370386 369176 368677 368983 369764 370523 371302 372855 375588 378568 380336 380620 380525
52528 380525 380974 381734 382118 381858 381008 379827 379232 380488 383600 386567 387255 385856 384569 384874 386014 386382
52512 386382 385516 384162 383021 382224 381792 381796 381978 381780 381025 380169 379634 379177 378295 377136 376570 377159 378259 378501
52494 378501 377313 375832 375927 378137 380884 382049 381098 379188 377431 375901 374402 373232 372567 371767 370120
52479 370120 367845 365625 363636 361906 361221 362428 364925 367108 368518 370341 373413 376950 379888 382380
52465 382380 384956 387105 387819 387047 385607 384047 382557 381630 381679 382149 382097 381737 382473 385243 389579 394397 398860
52448 398860 402279 404095 404502 404510 405007 406086 407523 409353 411613 413944 415773 416611 415963 413441 409357 404912
52432 404912 401389 399272 398320 398213 398769 399688 400444 400575 400091 399577 399752 400673 401469 401158 399763 398342 397973
52415 397973 399004 401131 403690 405816 406897 407139 407341 408019 409089 410549 412924 416683 421471 426148 429456
52400 429456 430693 430234 429530 430080 432126 434649 436689 438070 438701 438024 435807 432908 430479 428727 427137
52385 427137 425655 424784 424536 424070 422670 420617 418785 417568 416385 414213 410702 406928 404830 405518 408079
52370 408079 410265 410409 408638 406526 405871 407520 410855 414313 416648 417739 418168 418361 418489 418828 419650 420871
52354 420871 422349 424454 427751 432111 436794 441559 447172 454492 463437 473047 482182 489956 495952 500304
52340 500304 503322 504855 504396 502025 498745 495506 492330 488878 485471 482842 481006 479047 476255 473032
52326 473032 470520 469595 470267 471716 472732 472345 470398 467686 465605 465447 467561 470969 474089 476217 478180
52311 478180 481271 485887 491492 497537 503751 509795 515439 521030 526913 532278 535507 536037 535094 534107 533281
52296 533281 532332 531743 532191 533352 534438 535695 538199 542207 546813 551324 555847 560280 564028 567323 571658
52281 571658 577869 584573 589739 593401 597641 604010 612151 621258 631742 644622 659825 676006 692047
52268 692047 708108 724963 742794 761030 779270 797857 817360 837733 858268 878280 897679
52257 897679 916960 936755 957197 977505 996414 1013366 1029075 1044560 1059965 1074850 1089193
52246 1089193 1103152 1116040 1126768 1135624 1144544 1155051 1166723 1178143 1188395 1196940 1203167 1207192
52234 1207192 1210383 1213847 1216870 1218000 1217299 1216201 1215334 1213831 1210915 1206897 1202329 1197461 1193075 1190774
52220 1190774 1191521 1194422 1197652 1200332 1203140 1207418 1213997 1222591 1232040 1241351 1250591 1260571 1271775 1284022
52206 1284022 1296978 1310320 1323428 1335628 1346845 1357348 1366950 1375241 1382683 1390501 1399203 1408042
52194 1408042 1416268 1424042 1431760 1439335 1446511 1453038 1458224 1461345 1463020 1465032 1468006 1470229 1469613 1465746
52180 1465746 1459063 1449224 1436027 1421262 1407870 1397245 1388697 1381418 1375502 1370813 1366311 1361097 1355242
52167 1355242 1349229 1343415 1338423 1335155 1333815 1333495 1333187 1332796 1332883 1333928 1336182 1339707 1344131 1348688 1352870
52152 1352870 1356827 1360969 1365455 1370178 1374937 1379486 1383679 1387762 1392348 1398079 1405299 1413670 1421777 1427683
52138 1427683 1430699 1432379 1434905 1438707 1442627 1446149 1449992 1454287 1457804 1459912 1461960 1465445 1469785 1473338
52124 1473338 1475935 1478693 1481543 1482800 1481705 1479830 1478983 1478655 1476700 1472085 1465869 1459517 1453184 1446107
52110 1446107 1438133 1430354 1424237 1420340 1417909 1415658 1412899 1410008 1407957 1407576 1409190 1412572 1416986 1421471
52096 1421471 1425482 1429234 1433172 1437111 1440326 1442664 1445145 1449019 1454309 1459658 1463666 1466073 1467657 1469297
52082 1469297 1471346 1473742 1476458 1479705 1483678 1488218 1493018 1498208 1504385 1511640 1519059 1525860 1532898 1542189
52068 1542189 1554776 1569848 1586240 1603952 1623562 1644948 1667574 1691695 1718211 1747255 1777670
52057 1777670 1808066 1837810 1866789 1894781 1921477 1946840 1971060 1994031 2014919 2032426 2045912
52046 2045912 2056334 2065508 2073929 2079809 2080982 2077473 2071395 2064548 2057189 2049268 2041669 2035423 2030380 2025528
52032 2025528 2020350 2015190 2010359 2005514 2000035 1993537 1985749 1976246 1964758 1951850 1938970 1927457 1917578
52019 1917578 1908856 1901343 1895951 1893306 1892868 1893756 1895976 1900082 1905986 1913044 1921193 1930920 1941856 1952413
52005 1952413 1961365 1969105 1976831 1985116 1993728 2002165 2009598 2014796 2017059 2017148 2016590 2016053 2014948 2012467 2008342
51990 2008342 2002539 1995015 1986083 1976424 1966274 1954976 1941817 1927018 1911339 1894905 1877151 1858023
51978 1858023 1838453 1819179 1799788 1779741 1759903 1741935 1726055 1710631 1694530 1678880 1665656
51967 1665656 1655255 1646402 1637792 1628569 1617653 1604259 1589319 1574952 1561889 1548551 1533432 1517384
51955 1517384 1502506 1489381 1476608 1462867 1448453 1434492 1421292 1407910 1393093 1376407 1358362
51944 1358362 1339581 1320200 1300411 1281254 1264029 1248788 1234109 1218710 1202678 1186746 1171002
51933 1171002 1155019 1138806 1123013 1108369 1095458 1084791 1076410 1069470 1062681 1055277 1047254 1038835
51921 1038835 1030112 1021176 1012181 1003120 993615 982977 970580 956541 942098 928865 917393 906809
51909 906809 896181 885874 877087 870301 864797 859790 855635 853650 854827 858909 864910 872363 881475 891791
51895 891791 901550 909361 915986 923076 930196 934696 935010 932569 929664 926817 923488 920108 917745 916435
51881 916435 915492 915230 916852 920693 925920 932110 939961 950184 962559 976226 990044 1002530 1012294
51868 1012294 1018788 1022255 1023091 1021834 1019266 1015568 1009669 1000469 988459 975097 960918 945527 929301
51855 929301 913601 899277 886340 875144 866404 859901 854779 851356 850941 853488 857355 862023 869052
51842 869052 879351 891492 904065 917681 932772 947148 957924 964605 968007 967398 961498 951673 941116
51829 941116 930624 917837 901243 882561 864378 847734 833167 821986 814622 809014 802457 794448
51817 794448 786504 780005 775575 773916 775582 779883 785112 790083 794753 799415 803928 807754 810275 811232
51803 811232 811214 811290 811514 810278 805982 799165 792040 786065 780934 776027 771705 768606 766538 764803 763224
51788 763224 762164 761705 761361 760556 759003 756581 753202 748914 743945 738493 732645 726647 721140 716825 713672
51773 713672 710611 706379 700753 694691 689189 684359 679882 675866 672708 670358 668388 666723 665660 665018
51759 665018 663995 662148 659981 658124 656438 654426 652155 650145 648539 647016 645512 644533 644719 646438 649699
51744 649699 653966 658011 660537 661204 660732 659879 658686 656917 654812 653031 651959 651285 650180 647893 644396
51729 644396 640437 636685 632893 628427 623658 620118 618887 619404 620358 621154 621798 621852 620587 618179 615780 614188
51713 614188 613190 612567 612925 614869 617866 620739 623311 626946 633286 642715 654184 666230 677920 688913
51699 688913 699030 708070 715874 722254 726799 729106 729315 727956 725040 719835 712153 703423 695722 689831
51685 689831 685014 680549 676447 672538 668115 663209 659290 657675 657871 658538 659739 662952 668818 676042 682923
51670 682923 689000 694552 699197 701916 702299 701140 699819 699418 700221 701540 702024 700624 697395 693127 688304
51655 688304 682993 677769 673991 672453 672063 670540 666572 660929 655523 651808 650178 650301 651574 653540 656265
51640 656265 660267 665659 671388 675613 676998 675705 673303 671778 672286 674445 676897 678802 680710 683604
51626 683604 687209 689644 688866 684340 677359 670046 663993 659485 655773 652079 648264 644589 641437 639688
51612 639688 640775 645365 651979 657808 661259 663228 665732 669909 675467 681304 686120 688995 689962 689833 689230
51597 689230 688258 687230 686960 687793 689145 690733 693643 699175 706911 714865 721431 726280 729492 730862 730365
51582 730365 728466 725514 721392 716142 710448 705101 700287 695703 691037 686079 680632 674686 668504 662277
51568 662277 655873 649272 643077 638263 635234 633325 631452 629314 627707 627394 627875 627751 626358 624430 622865
51553 622865 621543 620011 618799 619023 620704 622387 622734 621921 621235 621794 623872 627012 630619 634750 640332
51538 640332 648105 657278 665903 672882 679065 686105 694679 704119 713179 720656 725713 728193 728554 727259
51524 727259 724574 721205 718570 717769 718527 719785 721287 724063 729336 737369 747533 759309 773027 789479
51510 789479 808551 828361 846416 861979 876821 893333 912287 932770 953587 974082 994309
51499 994309 1015678 1041160 1073545 1113053 1157318 1203760 1250981 1297631 1341220 1379090 1409952
51488 1409952 1433626 1449808 1458103 1458979 1453456 1441615 1422417 1395617 1363241 1328318 1292358 1254829
51476 1254829 1215183 1174546 1134817 1096675 1059539 1023637 990954 963280 939864 918160 896807
51465 896807 876769 859240 843604 828341 813135 798873 785910 773564 761483 750366 740812 732395
51453 732395 724611 718028 713433 710078 705961 700205 694358 690640 689329 688591 686835 684559 683497 684393 686202
51438 686202 687431 687655 687351 686701 685292 683036 680663 678849 677238 674922 671713 668348 665446 662836 660102
51423 660102 657208 654168 650539 645861 640547 635855 632776 631086 629516 626758 622332 616605 610024 602571
51409 602571 594377 586723 581476 578952 577042 573494 568749 565331 564409 564354 563315 561960 562424 565172 568296
51394 568296 569902 570092 570325 571819 575120 580422 587429 595165 602629 609739 617237 625670 634945 644986
51380 644986 656251 668909 681618 691962 698676 703086 707564 712628 716497 717766 717487 717656 718301 717354
51366 717354 713339 706897 699415 691444 683189 675521 669258 663907 658266 652242 647125 643974 642532 641916
51352 641916 641581 641294 640850 640423 640944 643635 649188 657371 667061 676634 684831 691595 697721 703553 708656
51337 708656 713054 717964 724453 731906 738889 745320 752649 761723 771673 781409 791361 802904 816634 832092
51323 832092 848988 867972 890147 916321 946738 981126 1019022 1060296 1105280 1154111 1206186
51312 1206186 1260519 1316092 1371140 1422588 1467422 1504910 1536349 1562092 1579749 1586159 1580428 1564011
51300 1564011 1538337 1503814 1461295 1413186 1362282 1310137 1257278 1204556 1153460 1105202 1060123
51289 1060123 1018164 979503 944535 913471 886007 861268 838187 816242 795824 777531 761106
51278 761106 745495 730090 715502 702807 692318 683388 675121 666830 658117 649115 640734 634052 629259
51265 629259 625463 621573 617030 611666 605561 599447 594715 592268 591428 590436 588072 584542 581041 578865 578754
51250 578754 580336 582036 582152 580546 578965 579331 581850 585135 588063 591035 595223 600826 606433 610288 612017
51235 612017 612771 613560 613889 612512 609332 605811 603241 601185 598192 593768 588989 585163 582535 580711 579912
51220 579912 581114 584725 589594 593740 595959 596400 595758 594477 592904 591631 591186 591631 592825 594781 597364
51205 597364 599944 601885 603165 604059 604529 604640 605126 606443 607375 605965 602204 598553 597137 597543 598150 598495
51189 598495 599081 599712 599490 598123 595877 592491 587482 581566 576483 573253 571641 571359 572440 574239 575428
51174 575428 575647 576001 577294 578885 579852 580058 579236 576382 571425 566521 564122 564278 565211 566035 567312 569234
51158 569234 571006 572165 573013 573482 573060 572226 572442 574084 575776 576638 577859 580846 584912 588249 590509 593056
51142 593056 596990 602184 608023 613812 618525 621427 623181 625316 628291 630843 631433 629632 626034 621774
51128 621774 618348 616839 616794 616526 614995 612714 610530 608502 606585 605405 605320 605349 604271 602478 601675 602672
51112 602672 604399 605209 604453 602675 600936 600162 600582 601544 602226 602608 603388 604949 606888 608662 610230 611897
51096 611897 613854 615948 617640 618205 617322 615456 613388 611526 610037 609317 609612 610337 610565 610210 610027 610433
51080 610433 611183 612228 613747 615089 614867 612838 610689 610134 610884 611397 610961 610079 609262 608530 607880 607321 606523
51063 606523 605191 603742 603046 603615 605607 609201 614171 619353 623413 626105 628129 630017 631947 634353 637619
51048 637619 641288 644618 647869 651864 656293 659750 661789 663679 666586 670195 673774 677382 681118 684129
51034 684129 685497 685449 684760 683540 681640 679757 678983 679431 680227 680791 681378 682422 684017 685927 687531 687970
51018 687970 687022 685616 684889 684968 685354 686021 687220 688517 689220 689810 691782 695850 701219 706829 712292 717350
51002 717350 721617 725589 730932 738898 748986 759869 770981 782342 793379 803088 811400 819582 829197
50989 829197 841193 855745 872104 888425 902612 913922 923487 933039 943262 953362 961683 966594
50977 966594 967394 965002 961521 958567 955859 951587 944023 932554 917583 900230 882366 866230 853271
50964 853271 843344 835372 828700 823505 820059 818175 817603 818605 821798 827470 835093 843375 850860 857035
50950 857035 863085 871160 882338 895461 908337 920023 931556 944540 959498 975605 991518 1006256
50938 1006256 1019723 1032779 1046630 1061814 1077689 1093025 1107141 1120508 1134307 1149342 1165231
50927 1165231 1180638 1194401 1206432 1217515 1228448 1239646 1251433 1264143 1277640 1290925 1302520
50916 1302520 1311362 1317443 1321813 1326141 1332134 1341151 1354021 1370941 1391602 1415804 1444050 1477028
50904 1477028 1514307 1554124 1595154 1638017 1684239 1733943 1785612 1838121 1891797 1947001 2002606
50893 2002606 2056669 2107942 2156027 2200564 2241169 2278049 2312000 2343836 2374059 2402696 2428934
50882 2428934 2451434 2469841 2485746 2501274 2516605 2529570 2537702 2540101 2537447 2531139 2522637 2512640
50870 2512640 2500390 2484502 2465083 2444322 2424056 2403095 2377912 2346061 2308189 2266601 2222689
50859 2222689 2176354 2127518 2077250 2027123 1977875 1929219 1880989 1834074 1789910 1749182 1711410
50848 1711410 1675870 1642540 1611877 1583916 1558053 1533707 1510768 1489210 1468619 1448619 1429677
50837 1429677 1412962 1399095 1387277 1375948 1364163 1352154 1340824 1331176 1324110 1320041 1318414 1317900
50825 1317900 1317359 1316502 1315662 1315478 1316883 1320667 1326531 1333031 1338970 1344501 1350381 1356795 1363710 1371911 1382481
50810 1382481 1395397 1409752 1425604 1444448 1467330 1493306 1520347 1547254 1574399 1603343 1636136
50799 1636136 1674117 1716671 1761805 1808668 1858759 1913858 1973596 2036489 2102876 2175135 2254765
50788 2254765 2340799 2431765 2527875 2630109 2737920 2849298 2963093 3080147 3201615 3326732
50778 3326732 3452663 3576222 3695171 3807892 3912514 4007053 4090430 4162805 4224700 4276251
50768 4276251 4317623 4349627 4373266 4389031 4397513 4400653 4401386 4401731 4402080 4402833 4405697 4412266 4421556 4430049
50754 4430049 4434310 4432741 4424465 4407424 4378644 4336439 4281675 4216486 4142095 4058339 3965094 3863485
50742 3863485 3755465 3642945 3528102 3414115 3304404 3200604 3101889 3006834 2915680 2830431
50732 2830431 2753131 2684530 2624132 2570806 2523319 2480815 2443116 2410457 2382851 2359812 2340599
50721 2340599 2324486 2310816 2298930 2288070 2277261 2265479 2252178 2237585 2222334 2206899 2191507
50710 2191507 2176286 2161086 2145186 2127513 2107224 2084110 2058690 2032120 2005520 1978948 1951330
50699 1951330 1922015 1892199 1864110 1838821 1815663 1793933 1774344 1758374 1746756 1739182 1735087 1734153
50687 1734153 1736175 1740850 1747730 1756323 1766530 1779079 1795213 1815722 1840566 1869558 1902904 1940705
50675 1940705 1982457 2027652 2076682 2130497 2189331 2252138 2317233 2383210 2449295 2515256 2581059
50664 2581059 2646338 2710141 2771352 2829459 2884882 2938477 2990439 3039267 3081919 3115662 3140073
50653 3140073 3156732 3166832 3169939 3165660 3155613 3142679 3128864 3115060 3102576 3093351 3088334 3086879
50641 3086879 3088285 3092953 3101226 3111807 3122139 3129985 3134109 3133718 3127946 3115866 3096792 3070781 3039020
50628 3039020 3003273 2964661 2923395 2880080 2836782 2796184 2759808 2727450 2698200 2671731 2648945
50617 2648945 2631770 2622077 2620315 2625398 2636208 2652879 2676108 2705603 2739990 2778206 2820178 2865864
50605 2865864 2914097 2962838 3010570 3057320 3104275 3152239 3200420 3247053 3291419 3334900 3379761
50594 3379761 3427182 3476779 3527583 3578922 3630610 3682999 3736868 3792863 3851168 3912082 3976605
50583 3976605 4045827 4119981 4198757 4282253 4370665 4463014 4557061 4650691 4742658 4831920 4917139
50572 4917139 4997130 5070933 5137067 5193666 5240044 5277480 5307795 5331486 5347474 5353666 5346876 5323108
50560 5323108 5279709 5217982 5143364 5062898 4982488 4905792 4834571 4769788 4712766 4665322 4628442
50549 4628442 4601012 4580332 4563762 4549303 4534796 4517462 4494545 4463918 4423825 4372575 4309000
50538 4309000 4233148 4146400 4051020 3949451 3843675 3735065 3624952 3515203 3407979 3305064
50528 3305064 3207831 3117546 3034875 2958949 2887819 2820436 2757813 2701711 2652518 2608978 2569693
50517 2569693 2534258 2502912 2475780 2452838 2434299 2420617 2412047 2408334 2408833 2412962 2420551 2431754
50505 2431754 2446583 2464573 2485019 2507561 2532478 2560400 2591821 2626869 2665466 2707666 2753914
50494 2753914 2805070 2862013 2925025 2993361 3065494 3139845 3215383 3291689 3368714 3446567 3525327
50483 3525327 3604961 3685627 3768269 3854761 3947151 4046819 4154521 4270913 4396494 4531271
50473 4531271 4675188 4828973 4993853 5170180 5357085 5553850 5760935 5979046 6207671
50464 6207671 6445043 6688889 6936434 7184221 7428934 7668148 7899297 8117977 8318252
50455 8318252 8494680 8643312 8761013 8845265 8895049 8910789 8892781 8840640 8755011 8639173
50445 8639173 8498256 8337599 8162502 7978745 7792127 7607771 7430798 7267339 7123662
50436 7123662 7003864 6908933 6837975 6789593 6762015 6752587 6757459 6771264 6786929 6796442 6792423 6769045
50424 6769045 6721708 6646649 6541678 6407465 6247921 6068994 5876691 5675711 5469514 5261186
50414 5261186 5053716 4849356 4649357 4454800 4267357 4088736 3919734 3760544 3611790
50405 3611790 3474386 3348287 3232217 3125060 3026953 2938535 2859609 2789054 2725887 2669899
50395 2669899 2621233 2579610 2544088 2513540 2487387 2465749 2448769 2436009 2426894 2421557 2420538 2423429
50383 2423429 2428390 2433496 2438274 2443591 2450328 2458552 2467703 2477090 2486288 2495526 2505756 2518063 2532864
50370 2532864 2549873 2568779 2589799 2613580 2640888 2672421 2708639 2749509 2794480 2842958 2895046
50359 2895046 2951815 3014679 3084268 3159861 3240101 3324412 3413695 3509506 3612533 3721968 3836406
50348 3836406 3955203 4078507 4205709 4334139 4459985 4580641 4695587 4804705 4906479
50339 4906479 4998473 5078926 5146624 5199269 5233180 5245153 5234053 5200443 5145563 5071259 4980295
50328 4980295 4876089 4762422 4643595 4524055 4407170 4294841 4188949 4092663 4009479 3941138
50318 3941138 3887169 3846269 3817421 3799784 3792137 3792360 3796957 3801370 3801378 3794042 3776906 3747054 3702273
50305 3702273 3643026 3572042 3491772 3403335 3308087 3208773 3108213 3007651 2907191 2807181
50295 2807181 2708488 2612062 2519080 2431036 2348761 2271607 2198344 2128666 2063165 2002089 1945004
50284 1945004 1891729 1842997 1799958 1763311 1732792 1707175 1684977 1665575 1649444 1637013 1627827
50273 1627827 1621486 1618829 1621045 1627703 1636801 1646963 1658400 1671205 1683744 1693607 1699482 1701202 1698516
50260 1698516 1691059 1679596 1666206 1652730 1639545 1626334 1613663 1603090 1595618 1590473 1585747 1580168
50248 1580168 1574042 1568621 1564993 1563671 1564585 1566886 1569070 1570027 1570126 1570790 1572952 1576462 1580987 1586796 1594295
50233 1594295 1603322 1613194 1623044 1631962 1639568 1646840 1655543 1666212 1677478 1688260 1699777 1713973 1730526
50220 1730526 1747183 1763134 1780068 1798913 1816883 1829037 1832065 1825759 1811851 1793015 1772538 1753176
50208 1753176 1735723 1719495 1704393 1691599 1682060 1675140 1669245 1663192 1656690 1650233 1644985 1642108 1641530
50195 1641530 1641735 1641321 1640559 1640995 1643860 1649323 1656897 1665922 1675805 1686539 1699103 1714821 1734121 1756137
50181 1756137 1779560 1803637 1828482 1854848 1883627 1915129 1948666 1982948 2016759 2048908 2077846
50170 2077846 2102163 2121768 2138033 2152378 2165036 2175469 2183393 2188647 2190219 2186115 2174633 2155628
50158 2155628 2130439 2100729 2067482 2030948 1991317 1949375 1906602 1864825 1825762 1790546 1759352
50147 1759352 1731516 1706283 1683292 1661939 1640467 1616467 1588745 1558312 1527229 1496747 1466946
50136 1466946 1437746 1409671 1383579 1359945 1338402 1317851 1297284 1276763 1257398 1240039 1224348
50125 1224348 1209567 1195753 1183478 1172455 1161425 1149683 1138000 1127670 1119196 1112350 1107001 1103247
50113 1103247 1100902 1099383 1098111 1096808 1095534 1094655 1094692 1095955 1098409 1101924 1106381 1111388 1116321 1121061 1126408
50098 1126408 1133301 1141803 1151276 1161365 1172176 1183602 1195324 1207822 1222575 1240482 1260301 1279334
50086 1279334 1295718 1309614 1322212 1334298 1346191 1358450 1371698 1385502 1398116 1407958 1415306 1422320
50074 1422320 1431459 1444093 1460373 1479824 1501940 1526618 1554304 1585506 1620088 1657539 1698277
50063 1698277 1744241 1797492 1858214 1924481 1994007 2065601 2138757 2212254 2283755 2351010 2413488
50052 2413488 2472840 2531499 2590495 2648472 2702898 2752030 2795414 2832627 2862022 2880889 2886675
50041 2886675 2878192 2856162 2822796 2780446 2730468 2673536 2610894 2544592 2476338 2406892 2337150
50030 2337150 2269127 2205047 2145824 2091240 2041377 1996851 1957520 1921883 1888208 1855801 1824927
50019 1824927 1796025 1769212 1744162 1720228 1697137 1675550 1656263 1638753 1621462 1603971 1587827
50008 1587827 1574281 1562019 1548414 1532702 1516636 1501922 1488109 1473367 1456642 1438771 1422085
49997 1422085 1409009 1400276 1394317 1388942 1383649 1379537 1377077 1375252 1373289 1371934 1372159 1373724 1376035 1379495
49983 1379495 1384663 1390786 1396634 1402502 1409854 1418983 1428425 1436968 1444903 1452878 1460694 1467843 1474236 1479729
49969 1479729 1483805 1486547 1489190 1492938 1497792 1503103 1508546 1513638 1517147 1518370 1518773 1520947 1525644 1530857
49955 1530857 1534246 1535733 1537253 1540547 1545761 1551920 1558243 1564917 1572779 1582371 1593526 1606068 1620683
49942 1620683 1638757 1661458 1689189 1721619 1757711 1795941 1835180 1875317 1916308 1956798 1994718
49931 1994718 2029532 2062805 2095830 2127564 2155768 2179385 2198561 2212565 2219018 2215391 2200362 2173651
49919 2173651 2135734 2088291 2034001 1975042 1912289 1846640 1780425 1716509 1656372 1600150 1548408
49908 1548408 1502468 1462484 1426288 1391146 1356276 1323033 1293054 1266930 1244318 1224447 1206440
49897 1206440 1189861 1175202 1163378 1154605 1148128 1143088 1139251 1136872 1136451 1138879 1145236 1155812 1169390
49884 1169390 1183730 1196777 1207525 1216149 1223604 1230862 1238233 1245380 1251879 1257394 1261341 1262893 1261520
49871 1261520 1257121 1249455 1237948 1222408 1203575 1182720 1161161 1140365 1121800 1106054 1092530 1080567
49859 1080567 1070327 1061988 1054725 1047533 1040792 1035869 1033183 1031671 1030364 1029586 1030240 1032651 1036449 1040975
49845 1040975 1045463 1049473 1053621 1059277 1067033 1075795 1083884 1090956 1098627 1109309 1124278 1142322 1160243
49832 1160243 1175259 1187103 1197291 1206440 1213369 1217201 1219011 1220263 1220396 1217387 1210551 1201345 1191161
49819 1191161 1179599 1165785 1150513 1135889 1122890 1110290 1096434 1081410 1066762 1053391 1040755
49808 1040755 1028387 1017210 1008538 1002345 997610 994130 992862 994289 997594 1001914 1007407 1014322 1021820
49795 1021820 1028715 1035097 1042303 1051342 1061915 1072974 1083826 1094863 1107433 1122600 1139477 1155238
49783 1155238 1167410 1175966 1182507 1187784 1190944 1191227 1189386 1186933 1184468 1181266 1176375 1169758 1162170 1153978
49769 1153978 1144520 1133235 1121315 1111332 1104705 1100286 1096143 1092037 1089185 1088117 1088115 1088721 1090625 1094613
49755 1094613 1100429 1107055 1113685 1120355 1127978 1137618 1149165 1161030 1171912 1182364 1193452 1204172
49743 1204172 1211890 1215642 1217370 1219111 1220409 1219558 1216121 1210783 1203581 1193980 1182454 1170452 1158636
49730 1158636 1146329 1132974 1119077 1105276 1091326 1076707 1061813 1047921 1036026 1026075 1017335 1009313
49718 1009313 1002206 996465 992106 988650 985732 983462 982148 981946 982877 984826 987366 990009 992928 997056
49704 997056 1003082 1010628 1018813 1027408 1036988 1048080 1060528 1073543 1085970 1096577 1104562 1110008 1113715
49691 1113715 1116459 1118212 1117877 1113980 1106096 1095602 1084561 1073872 1063157 1052443 1042866 1035335 1029497
49678 1029497 1024783 1021447 1019463 1017307 1013334 1008089 1003771 1001412 1000038 998808 998518 1000224 1003493 1006966
49664 1006966 1010054 1013311 1017513 1023052 1030002 1038235 1047538 1057898 1069527 1082398 1095981 1109571 1122615
49651 1122615 1134650 1145244 1154106 1160969 1165400 1167231 1167186 1166541 1165983 1165341 1164377 1163050 1160767 1156437 1149908
49636 1149908 1142660 1136260 1130673 1124786 1118147 1111330 1104964 1099341 1094846 1091909 1090442 1090023 1090673 1092871
49622 1092871 1096712 1101616 1106948 1112439 1118053 1124034 1131236 1140821 1153365 1168537 1185581 1203536 1220967
49609 1220967 1236260 1248551 1257930 1264631 1268735 1271019 1273266 1276968 1281952 1286906 1291022 1294661 1298690
49596 1298690 1303614 1308981 1312954 1312808 1306719 1295111 1279672 1261362 1240403 1218056 1196835 1178253
49584 1178253 1161505 1145355 1130356 1117928 1107936 1098857 1090256 1083434 1079197 1076400 1073528 1070594 1068362
49571 1068362 1066458 1063544 1059119 1054068 1049326 1044822 1039892 1034156 1027828 1021551 1015961 1011084 1006295 1001221
49557 1001221 996315 992002 987715 982652 977298 973160 971000 970351 970826 972572 975023 976573 976514 976366 978213
49542 978213 982364 987652 993316 999222 1004582 1008043 1009343 1009657 1009882 1009592 1008343 1007176 1007862 1010875 1014860
49527 1014860 1018219 1020834 1024034 1028956 1035072 1040489 1043779 1045410 1047236 1050801 1056240 1062454 1067956 1071820
49513 1071820 1074401 1077107 1081044 1086007 1091317 1097307 1105080 1114685 1124623 1133718 1142789 1153704 1167058
49500 1167058 1181375 1194345 1204255 1210450 1213217 1213631 1213160 1212915 1213109 1213183 1212501 1210950 1208866 1206469 1203802
49485 1203802 1201389 1200443 1201614 1203685 1204457 1203176 1201361 1200865 1201958 1203974 1207053 1212067 1219015 1226588 1233599
49470 1233599 1240179 1247253 1255474 1265060 1276297 1289566 1304837 1321498 1338963 1357442 1377734 1399808
49458 1399808 1421624 1439979 1453000 1461633 1468468 1475369 1482469 1488909 1493878 1497231 1499829 1503250 1508494
49445 1508494 1514932 1521116 1526506 1531521 1535706 1536860 1532719 1523008 1509261 1493034 1474964 1455320 1434678
49432 1434678 1413959 1394243 1376572 1361509 1348843 1338048 1329050 1322172 1317220 1313073 1308567 1303607
49420 1303607 1299173 1296251 1294955 1294659 1294666 1294578 1294083 1292757 1290427 1287744 1286031 1286154 1287626 1289167 1290201 1291378
49404 1291378 1293341 1295519 1296856 1297602 1299394 1303105 1307365 1310081 1311039 1311937 1313883 1315898 1316282 1314594 1311672
49389 1311672 1308353 1304786 1300518 1294660 1286515 1276876 1268228 1262690 1259859 1257481 1254007 1249621 1245170 1241505
49375 1241505 1239972 1242009 1247498 1254530 1261577 1269061 1278100 1288644 1299908 1311989 1325907 1342334 1361393
49362 1361393 1383582 1409785 1440260 1474515 1512370 1554118 1598684 1641810 1676699 1697250 1701561
49351 1701561 1693105 1678513 1663616 1650885 1639998 1630223 1622043 1617097 1617078 1622500 1632069 1643483 1655185
49338 1655185 1667126 1679682 1692492 1704906 1716934 1728831 1740163 1750203 1759004 1767090 1774257 1779668
49326 1779668 1783075 1784889 1784967 1782474 1777198 1769989 1761538 1751692 1740416 1728492 1716856 1706128 1697203
49313 1697203 1691140 1687645 1684683 1680652 1676254 1673321 1672525 1673325 1675450 1678923 1682830 1685454 1685924 1684828 1683096
49298 1683096 1681155 1679187 1677245 1674921 1671776 1668257 1665201 1662132 1657196 1649552 1641059 1634623 1631255 1629542
49284 1629542 1627790 1625864 1624871 1625694 1628059 1630652 1631967 1631257 1628824 1625372 1621196 1616238 1610811 1605824 1602102
49269 1602102 1599705 1598024 1596300 1593888 1590324 1585642 1580675 1576657 1574347 1573704 1574533 1576990 1581112 1586127
49255 1586127 1590839 1594769 1598524 1603011 1608674 1615518 1623299 1631449 1639333 1647037 1655602 1666010 1678110
49242 1678110 1690886 1703644 1716564 1730181 1744677 1759601 1774053 1787320 1799757 1812944 1828468
49231 1828468 1846377 1864923 1881648 1894493 1902210 1904530 1902311 1897197 1890669 1883370 1875238 1866079 1855950
49218 1855950 1845187 1834156 1822857 1810750 1797224 1782461 1767751 1754706 1743995 1734861 1726083 1717462
49206 1717462 1710103 1705058 1702021 1699895 1698393 1698313 1700101 1702987 1705919 1708673 1711466 1714166 1716575 1719039
49192 1719039 1721993 1725350 1729197 1734792 1743842 1756718 1771995 1787488 1800891 1809812 1812667 1809979 1803744
49179 1803744 1795084 1783484 1768765 1752669 1737566 1724246 1711912 1699887 1688386 1677914 1668838 1661716
49167 1661716 1657336 1656088 1657448 1660173 1663014 1665463 1667958 1671212 1675393 1680286 1686211 1693962 1703521 1713511
49153 1713511 1722521 1730603 1738953 1748520 1759478 1771565 1784230 1796761 1809054 1822106 1836999 1853527
49141 1853527 1870573 1887686 1905336 1923514 1941103 1957144 1971972 1986528 2001114 2015508 2029890
49130 2029890 2044840 2060403 2075756 2089966 2102725 2114238 2124785 2134670 2144381 2154501 2165504 2177759
49118 2177759 2191611 2207138 2223865 2241098 2258794 2277853 2299219 2322987 2348917 2377749 2411180
49107 2411180 2450052 2492872 2536333 2576866 2611372 2637261 2653186 2660197 2661565 2660917 2660587 2661686 2664951
49094 2664951 2670828 2678969 2688484 2698992 2710969 2724708 2739159 2752264 2762435 2769563 2774753 2779567
49082 2779567 2785477 2793314 2802731 2812583 2822347 2832979 2845840 2861027 2877415 2894272 2912008 2931205
49070 2931205 2951801 2973688 2997316 3023000 3050005 3077111 3103866 3130720 3158089 3185891 3213885
49059 3213885 3241871 3269611 3297242 3325932 3357573 3393443 3433328 3476033 3520482 3566348 3614215
49048 3614215 3665550 3722338 3786397 3859147 3942148 4037333 4145508 4263415 4382474 4492360
49038 4492360 4588259 4675204 4763251 4855835 4942328 5003292 5024474 5006562 4962527 4906712 4845983
49027 4845983 4778815 4700400 4608523 4506225 4400286 4297368 4201258 4113088 4033223 3962147 3899800
49016 3899800 3845102 3796713 3753936 3716452 3683479 3653805 3626772 3602817 3582771 3566758 3553893
49005 3553893 3542993 3533430 3525312 3518941 3514209 3510681 3508307 3507684 3509189 3511937 3514269 3515554 3517009 3520263
48991 3520263 3525588 3532204 3539983 3549817 3562065 3575388 3587665 3597840 3606660 3615865 3626729 3639034
48979 3639034 3651340 3662677 3674071 3687987 3706068 3727835 3751546 3775587 3798806 3820420 3840365
48968 3840365 3859158 3876743 3892019 3904308 3914784 3925473 3937061 3948660 3959546 3970082 3980798
48957 3980798 3991773 4003349 4016418 4031158 4046025 4059050 4070179 4081794 4096715 4115885 4137970
48946 4137970 4160800 4182873 4203649 4222993 4240862 4257388 4272795 4287163 4300699 4314142 4328051
48935 4328051 4341451 4352063 4358607 4362159 4364481 4365702 4364770 4361677 4357715 4353565 4348627 4342751 4337413 4334351
48921 4334351 4333755 4334499 4335616 4336874 4338276 4339699 4341083 4342816 4345977 4351942 4361150 4372208 4382908 4392292
48907 4392292 4401173 4410623 4420855 4431751 4443330 4455033 4465496 4474004 4481643 4490236 4500622 4512727
48895 4512727 4526709 4542964 4561259 4580893 4601791 4624804 4651021 4681429 4717017 4758312 4804627
48884 4804627 4854357 4906125 4959358 5013974 5070220 5128698 5189890 5253571 5319240 5387009 5457409
48873 5457409 5530405 5605497 5682820 5763194 5846612 5931512 6016184 6100498 6185771 6273192 6362651
48862 6362651 6452774 6541799 6628814 6714463 6800229 6886859 6973816 7060198 7145303 7227999 7306581
48851 7306581 7380369 7450952 7520690 7590002 7657056 7720153 7779395 7835804 7889888 7941753 7991708
48840 7991708 8039678 8084367 8124121 8158774 8189804 8218366 8243869 8264970 8281417 8294155 8303901
48829 8303901 8310326 8312696 8310495 8303035 8289094 8267685 8239068 8204415 8164541 8119551 8069689 8015743
48817 8015743 7958261 7897019 7831962 7764114 7694677 7623442 7549142 7471523 7392019 7311795 7230049
48806 7230049 7145269 7057727 6969631 6882809 6797259 6712307 6628423 6547414 6471216 6400899 6336503
48795 6336503 6277446 6223207 6173727 6129043 6088720 6052287 6020198 5993475 5972031 5954301 5939298
48784 5939298 5928233 5922934 5923104 5926477 5931739 5940031 5953103 5971020 5992462 6016600 6043715 6074075
48772 6074075 6106916 6140822 6174934 6209609 6245803 6283760 6322512 6360931 6399023 6437711 6477460
48761 6477460 6517731 6557842 6597751 6637772 6678164 6719299 6761624 6804994 6848458 6891219 6933477
48750 6933477 6975962 7018984 7062353 7105844 7149176 7191854 7233665 7275217 7317379 7360297 7403501
48739 7403501 7446829 7490477 7534092 7576667 7617795 7658456 7699978 7742547 7785156 7826652 7866139
48728 7866139 7902464 7934293 7961171 7983960 8003526 8019193 8029172 8032529 8029953 8022210 8008421 7986513
48716 7986513 7955002 7913678 7862794 7802537 7733617 7657741 7576925 7492495 7404909 7314356 7221338
48705 7221338 7126706 7031239 6935159 6838288 6740988 6644634 6550574 6458763 6368189 6278719 6191625
48694 6191625 6107895 6026888 5947443 5869868 5796074 5727883 5665794 5609192 5557198 5509338 5465857
48683 5465857 5427366 5393868 5364235 5337067 5312066 5290196 5272434 5258653 5247820 5239166 5233044 5230460
48671 5230460 5231480 5234300 5236511 5237418 5238422 5240669 5243059 5243315 5240672 5236679 5233466 5231845 5231066 5229796 5227320
48656 5227320 5224319 5222448 5222754 5224616 5226648 5228329 5230041 5231707 5232383 5231402 5229184 5226660 5224509 5223087 5222385
48641 5222385 5221708 5220195 5218167 5217440 5219568 5224112 5229168 5233439 5237340 5242373 5249979 5260734 5273922 5287795
48627 5287795 5300798 5312758 5324588 5336748 5348414 5358275 5365686 5370775 5373927 5375750 5377299 5379445 5381698
48614 5381698 5382205 5379415 5373397 5364967 5353797 5338214 5316974 5290427 5259584 5224848 5186371 5144954
48602 5144954 5101515 5055728 5006401 4953565 4899328 4845957 4793589 4740500 4685288 4628059 4569675
48591 4569675 4510723 4451623 4393118 4336095 4281111 4228514 4178864 4132691 4089740 4048944 4009407
48580 4009407 3971114 3934326 3898511 3862359 3824919 3786435 3747936 3710242 3673449 3637245 3601600
48569 3601600 3567185 3535054 3505723 3478652 3452847 3427897 3404094 3381575 3359776 3337948 3315860
48558 3315860 3293850 3272536 3252786 3235549 3221138 3208682 3196784 3185025 3174585 3167144 3163251 3162026
48546 3162026 3162514 3164836 3169535 3176039 3182599 3188007 3192620 3197184 3201326 3204103 3205662 3207377 3210446 3215130
48532 3215130 3221171 3227860 3233683 3237054 3237735 3236609 3233771 3228000 3218574 3206510 3193181 3178697 3162546
48519 3162546 3145125 3127655 3110980 3095258 3080385 3066027 3051692 3037552 3024815 3014644 3007136
48508 3007136 3001881 2998833 2997896 2998337 2999574 3001942 3005736 3010003 3013399 3015784 3017779 3019031 3018023 3013540
48494 3013540 3005469 2994504 2981864 2968758 2954969 2938602 2918629 2897182 2877665 2860989 2845515
48483 2845515 2830478 2817048 2805486 2793501 2778618 2760521 2739994 2717207 2692575 2668097 2646070
48472 2646070 2626895 2609279 2592198 2575790 2560953 2548976 2540863 2536054 2532522 2529247 2527961 2531162
48460 2531162 2538706 2547449 2553772 2555194 2550058 2537687 2519568 2499155 2479549 2461861 2446093 2432651
48448 2432651 2422205 2414570 2408644 2403655 2400201 2400086 2405143 2415950 2431406 2449618 2469313 2490290 2512502
48435 2512502 2534757 2554407 2568206 2573645 2569963 2558439 2541851 2523344 2505175 2488031 2471370 2454571
48423 2454571 2437840 2421929 2407099 2392684 2377839 2362467 2347087 2331868 2316213 2299666 2283111
48412 2283111 2268535 2257153 2247959 2238757 2228589 2218492 2209670 2201915 2194575 2188196 2183819 2180864 2177357
48399 2177357 2172797 2169532 2170214 2174524 2179558 2183240 2186282 2190501 2196109 2201420 2204829 2206166 2205917 2203957
48385 2203957 2199916 2194443 2189023 2184199 2178886 2172071 2164409 2157221 2150381 2142315 2132007 2119935 2106876
48372 2106876 2092734 2077098 2060361 2043674 2027980 2013277 1998619 1982819 1965500 1947596 1930598
48361 1930598 1915349 1901811 1889606 1878127 1866270 1852983 1838368 1823642 1809723 1796391 1783160
48350 1783160 1770490 1759618 1751380 1745448 1740561 1735319 1729032 1722127 1715865 1711549 1709767 1710021 1710913 1710987
48336 1710987 1709561 1706709 1702544 1697059 1690714 1684432 1678609 1672726 1666345 1659848 1653760 1648046 1642585 1637486
48322 1637486 1632253 1625550 1616777 1607142 1598283 1590598 1583856 1578448 1574609 1571299 1567462 1563795 1561617 1560475
48308 1560475 1558648 1555691 1552612 1549709 1546249 1542464 1539946 1539474 1539876 1539609 1538346 1536771 1535885 1536572 1538749
48293 1538749 1540988 1542142 1543040 1545267 1548715 1552031 1555179 1559621 1566002 1573559 1581815 1590990 1600783 1610771
48279 1610771 1622133 1636843 1654885 1674153 1693335 1712936 1733438 1754753 1777774 1804245 1834698
48268 1834698 1868455 1905597 1946498 1989362 2030954 2070121 2108167 2145740 2182419 2219552 2260157
48257 2260157 2305317 2353748 2405405 2462072 2523780 2588430 2655930 2728976 2808641 2893003 2981443
48246 2981443 3076448 3179766 3290794 3410175 3540967 3684904 3841758 4013645 4205287 4418865
48236 4418865 4653929 4913632 5205094 5532372 5896305 6303354 6767015 7298558 7905920
48227 7905920 8605409 9424383 10387801 11511979 12813404 14306994 15990202 17850295 19892569
48218 19892569 22112288 24380796 26369502 27659411 27984646 27382325 26117132 24491748
48210 24491748 22729072 20968362 19292654 17737383 16302137 14976997 13756960 12635686
48202 12635686 11602565 10652050 9786214 9004607 8299756 7664728 7096710 6590530 6136160
48193 6136160 5725755 5357344 5029506 4737877 4478580 4249697 4047402 3865474 3700286
48184 3700286 3551946 3419308 3298355 3186612 3084732 2992449 2907240 2828261 2757372 2694814
48174 2694814 2637739 2584360 2535709 2491940 2450724 2410987 2374723 2343291 2315011 2288006 2262529
48163 2262529 2238861 2215592 2191380 2165953 2138307 2106601 2071045 2034333 1998104 1961477 1923971
48152 1923971 1887106 1852049 1818403 1786413 1757485 1731160 1704447 1675867 1647616 1622029 1598211
48141 1598211 1573886 1548363 1522084 1495403 1469504 1446396 1426108 1405753 1383224 1360239 1340014
48130 1340014 1323447 1309219 1296099 1283406 1270545 1257837 1246725 1237799 1229707 1221196 1212849 1205593
48118 1205593 1198969 1192415 1186897 1183631 1182168 1181129 1179745 1177367 1172713 1165370 1157229 1150846 1146985 1144899
48104 1144899 1144100 1144331 1144563 1143650 1141729 1139740 1137929 1135887 1133718 1132098 1131434 1131798 1133212 1135099 1135897 1134285
48088 1134285 1130749 1127224 1125325 1125336 1126634 1128460 1130359 1132209 1133777 1134363 1133390 1131400 1129841 1129754 1131071
48073 1131071 1133002 1134477 1134588 1133678 1133722 1136358 1140577 1143694 1144665 1145063 1146693 1149853 1154191 1159536 1165240
48058 1165240 1170218 1174449 1179215 1185372 1192614 1200724 1209970 1219838 1229237 1238644 1250122 1264205 1278645
48045 1278645 1291486 1303688 1317256 1332297 1347520 1362391 1377218 1392190 1407719 1424730 1443209
48034 1443209 1461410 1477792 1492762 1507380 1521638 1535437 1549849 1565470 1580513 1592614 1601986
48023 1601986 1611076 1621551 1633210 1645222 1656586 1665759 1671751 1675755 1680319 1686797 1694566 1702376 1709244
48010 1709244 1714464 1718126 1721462 1725494 1729595 1732539 1734555 1737029 1740577 1744800 1749530 1754792 1759701 1763026
47996 1763026 1764828 1766054 1766453 1764489 1759607 1753041 1745849 1737407 1726467 1712678 1696436 1678093 1658085
47983 1658085 1637304 1616788 1597091 1578041 1558813 1538443 1516834 1495085 1474284 1454174 1433618
47972 1433618 1412135 1390270 1368747 1348018 1328441 1309990 1291866 1273286 1254631 1237115 1221358
47961 1221358 1206947 1193264 1180001 1166984 1154253 1142142 1130655 1119088 1106999 1095078 1084118
47950 1084118 1073749 1063536 1054849 1049722 1047635 1045268 1040207 1033599 1028247 1025228 1023459 1021726 1019858
47937 1019858 1018182 1016860 1015918 1015320 1014892 1014492 1014235 1014330 1014739 1015225 1015743 1016538 1017710 1018777 1019028 1018447 1017906
47920 1017906 1017946 1017719 1016050 1013548 1012488 1014106 1016975 1018813 1018954 1018154 1016859 1014988 1012958 1011533 1010718
47905 1010718 1009859 1008810 1008145 1008328 1009483 1011654 1014313 1015965 1015477 1013669 1012307 1011531 1009707 1006131 1002627
47890 1002627 1001870 1004987 1011204 1018913 1026518 1033043 1038671 1044363 1050662 1057250 1063670 1069824 1075655 1081106
47876 1081106 1086541 1092448 1098476 1103512 1107010 1109592 1112139 1114940 1117816 1120208 1120987 1119324 1116186 1113855
47862 1113855 1113193 1112318 1108940 1103267 1097500 1092865 1088322 1082223 1074302 1065804 1058271 1052502 1048274 1044673
47848 1044673 1040741 1036023 1030742 1025677 1021794 1019658 1019009 1019086 1019508 1020602 1022729 1025428 1027457 1027863 1027238
47833 1027238 1027903 1032343 1040949 1051394 1060613 1067312 1072297 1076853 1081548 1086492 1091869 1097865 1104453 1111343
47819 1111343 1117758 1122417 1124415 1124294 1123707 1123916 1125043 1126671 1128345 1129330 1128799 1126840 1124708 1123440 1122525
47804 1122525 1120423 1116128 1109848 1102355 1094180 1085450 1076180 1066552 1056950 1047783 1039381 1032079 1026149 1021491
47790 1021491 1017589 1013983 1010566 1007234 1003795 1000658 999058 999749 1001780 1003479 1004542 1006264 1009701 1014550
47776 1014550 1019886 1024865 1028436 1029494 1028139 1026046 1024853 1024755 1025224 1026434 1029066 1033059 1037546 1041935 1046278
47761 1046278 1050505 1054112 1056977 1059997 1064360 1070312 1077028 1083782 1090932 1099524 1110164 1122679 1136804
47748 1136804 1152602 1169951 1188194 1206993 1227320 1250909 1278564 1309312 1341217 1372695 1403093
47737 1403093 1432454 1460916 1488154 1513286 1535387 1554032 1569280 1581252 1589770 1594269 1594150 1589641
47725 1589641 1582159 1573134 1562387 1548703 1532242 1515295 1499883 1485771 1471787 1457983 1444994 1432178
47713 1432178 1418167 1403030 1388265 1374838 1362755 1352446 1344730 1339099 1333655 1327280 1320640 1314640
47701 1314640 1309327 1304814 1301892 1300844 1300598 1299728 1297551 1293998 1289563 1285689 1283965 1284334 1285164 1285437 1285504 1285281
47685 1285281 1283597 1280519 1278663 1280466 1284996 1289005 1290603 1290644 1291061 1293196 1297465 1303464 1310233 1317057 1323845
47670 1323845 1330496 1336475 1341470 1345686 1349019 1350884 1351398 1351535 1351237 1348717 1342969 1335838 1330030 1325842 1321407
47655 1321407 1315480 1308169 1299420 1288708 1276289 1263244 1250240 1237481 1225731 1215909 1207642 1199696
47643 1199696 1191897 1185291 1180371 1176659 1174119 1173303 1173666 1173489 1172331 1172206 1175264 1181220 1187991 1194123 1199829
47628 1199829 1206260 1214461 1224634 1235925 1247364 1259106 1271959 1285612 1298456 1309609 1319887 1330000
47616 1330000 1338876 1344883 1347869 1348809 1348173 1345984 1343148 1341181 1340408 1339436 1336720 1331850 1325141 1316843 1307239
47601 1307239 1296835 1285856 1273879 1260481 1246104 1231890 1218742 1206949 1196737 1188756 1183477 1180120
47589 1180120 1176680 1171559 1165211 1159793 1157036 1156711 1157414 1158459 1160525 1164482 1170089 1176153 1181729 1186883
47575 1186883 1192332 1198719 1206424 1215813 1227217 1240554 1255184 1270387 1285955 1302334 1320207 1339933
47563 1339933 1361232 1383542 1407019 1433127 1463673 1498947 1537179 1576068 1614430 1651964 1688016
47552 1688016 1721435 1751561 1778460 1801961 1820916 1833642 1838743 1835555 1824379 1806560 1783786 1756888
47540 1756888 1725503 1689076 1647914 1603129 1556106 1508409 1461732 1417167 1374559 1333105 1292725
47529 1292725 1254430 1219223 1187091 1157270 1129109 1102330 1076829 1052833 1031134 1012477 996572
47518 996572 982277 968952 956963 946527 936895 927488 919220 913506 910048 906788 902297 897231 893144
47505 893144 890806 890066 890205 889717 886869 881677 876749 874911 876202 878146 878657 877613 875836 873903 872277
47490 872277 871482 871500 871540 870848 869383 867582 865958 864995 864839 864948 864616 863945 863672 863917 863838 862765 860903 858597
47472 858597 855717 852343 849326 847399 846175 844805 843300 842436 842520 842970 843123 842917 842764 843240 844881 847681
47456 847681 850659 852449 852566 851768 850978 850259 849112 847403 845424 843125 839846 835190 829968 825897 824159
47441 824159 824317 824763 824254 822943 821990 822259 823463 824487 824392 823108 821272 819651 818873 819466 821648 824819
47425 824819 827602 828899 828983 829145 830124 831228 831281 830250 829591 830964 834820 840233 845798 850552 854305 857390
47409 857390 860135 862453 864039 865019 866149 867999 870126 871613 872481 873865 876505 879714 882423 884654 887126
47394 887126 889757 891632 892493 893254 894780 897059 900011 904317 910726 919128 928969 940225 953272 968008
47380 968008 983645 999332 1014713 1030203 1047026 1066555 1089137 1113891 1139937 1167284 1196016
47369 1196016 1225265 1253883 1281580 1308375 1333293 1354890 1373110 1389319 1404108 1416139 1423679
47358 1423679 1426378 1424849 1419318 1409707 1396655 1381504 1365248 1348062 1329890 1311010 1291931 1273098
47346 1273098 1254770 1237018 1219842 1203493 1188545 1175445 1164075 1153996 1144978 1136938 1129543 1122446
47334 1122446 1116048 1111386 1108806 1107117 1104680 1101222 1098032 1096495 1097044 1099528 1103577 1108042 1110965 1111146
47320 1111146 1109544 1108309 1108594 1110039 1112079 1114610 1117229 1118926 1118918 1117080 1113301 1107376 1099870 1092041 1084283
47305 1084283 1075563 1065073 1053494 1041759 1029508 1015984 1001749 988147 975408 962544 949006
47294 949006 935263 921802 908662 896049 884454 874033 864698 856707 850153 843940 836542 828009 820089
47281 820089 813921 808744 803482 798645 795738 795302 796282 797093 796931 796401 797087 800003 804175 807349 808403 808510
47265 808510 809568 812164 815572 819025 822219 825074 827775 830792 834078 836463 836634 834778 832630 831710 831948
47250 831948 832085 830980 828321 824536 820454 816967 814647 813530 813347 814103 816280 820158 824869 828593 830146
47235 830146 830348 831378 834737 840107 846218 852371 858856 866162 874238 882609 890990 899403 907646 915086
47221 915086 921360 927029 932937 939090 945012 951161 958757 967716 975981 981891 986235 990756 995485 999120
47207 999120 1001485 1003800 1006482 1008519 1009408 1010062 1011121 1011758 1011117 1009742 1008612 1007640 1006244 1004689 1003751 1003475
47191 1003475 1003351 1003564 1005111 1008612 1013673 1019624 1026494 1035037 1045723 1057483 1067528 1073052 1073547 1071079
47177 1071079 1068052 1065147 1061768 1057856 1054499 1052919 1053466 1055573 1058387 1061486 1065293 1070690 1078021 1086525
47163 1086525 1094901 1102436 1109483 1116894 1124857 1132263 1137524 1140198 1141450 1142477 1142997 1141992 1139478 1136521
47149 1136521 1133692 1130587 1126842 1122534 1117539 1111716 1105964 1101755 1099076 1096072 1091446 1086151 1081938 1079290
47135 1079290 1077765 1077431 1078740 1081461 1084875 1088787 1093533 1099243 1105871 1113704 1123180 1134298 1146668 1159887
47121 1159887 1173632 1187841 1203087 1220086 1238425 1256515 1273332 1289485 1305950 1322594 1338616
47110 1338616 1353526 1366754 1377229 1384543 1389933 1394904 1399378 1402384 1403961 1404876 1404665 1401660 1395303 1387238
47096 1387238 1379579 1372817 1365813 1357319 1347289 1337113 1328492 1321713 1315280 1307819 1299903 1293255 1288537
47083 1288537 1284900 1281473 1278104 1274702 1270987 1267228 1264275 1262557 1261814 1261996 1263489 1265964 1267896 1267974 1266626
47068 1266626 1265485 1265473 1265862 1265166 1262599 1258568 1253954 1249203 1244152 1238389 1231430 1222860 1212971 1203092 1194397
47053 1194397 1186183 1176315 1163869 1150420 1138100 1127319 1117187 1107223 1097428 1087325 1076345 1065058
47041 1065058 1054885 1046542 1039598 1033531 1028364 1024236 1021025 1018479 1016386 1014762 1014006 1014364 1014997 1014537 1013045
47026 1013045 1012325 1013417 1014993 1015458 1015421 1016470 1018490 1020175 1021560 1023965 1027633 1031422 1034814 1038409 1042324
47011 1042324 1045923 1049142 1052272 1054502 1054770 1054200 1055294 1058086 1059490 1057541 1054125 1052226 1052486 1054051 1057024
46996 1057024 1061944 1067988 1073677 1078893 1084668 1091396 1098479 1105319 1111499 1116451 1120059 1123307 1127462 1132875
46982 1132875 1139201 1146249 1153913 1161801 1169589 1177207 1184207 1189877 1194649 1200362 1208122 1216735 1224341 1230765
46968 1230765 1237092 1243600 1249470 1254140 1257802 1260794 1263522 1266639 1270306 1273523 1275054 1274766 1273441 1271880
46954 1271880 1270982 1271867 1274626 1277404 1278092 1276717 1275070 1274285 1273998 1273659 1273325 1273106 1272922 1272990 1273614 1274501 1275136
46937 1275136 1275764 1277174 1279699 1283234 1287905 1293628 1299390 1304282 1309135 1315765 1324586 1334266 1343762 1353200
46923 1353200 1362527 1370967 1378431 1386066 1394622 1403580 1412701 1423104 1435561 1448708 1460390 1470311 1480105
46910 1480105 1490975 1502438 1513442 1523775 1534028 1544622 1555139 1564429 1571430 1576054 1579193 1581753
46898 1581753 1583895 1585369 1586277 1587247 1589090 1592426 1597303 1602946 1608168 1612267 1615391 1618123 1621185 1625546
46884 1625546 1632003 1640282 1649048 1657204 1664655 1671481 1677176 1681573 1685998 1692510 1701911 1713063 1724123
46871 1724123 1733952 1742426 1749876 1756308 1760920 1762676 1761679 1759381 1756819 1753125 1746826 1738287 1729548 1721618
46857 1721618 1713378 1703665 1693156 1683199 1673805 1664087 1654116 1645035 1637496 1631210 1625995 1622109 1619411 1617331
46843 1617331 1616110 1617044 1621019 1627647 1636426 1647768 1662043 1678397 1695674 1714050 1734482 1756609
46831 1756609 1778359 1798028 1815988 1833994 1853386 1874182 1895273 1915101 1932547 1947659 1961372
46820 1961372 1974322 1986103 1995816 2003183 2009048 2014870 2021645 2029142 2036358 2042993 2050158 2059170 2069916
46807 2069916 2081017 2091489 2101584 2112153 2123984 2137641 2152924 2168293 2181951 2193993 2206523
46796 2206523 2220984 2236244 2250088 2261750 2271871 2280539 2286823 2290333 2292015 2292820 2292337 2289515 2284480
46783 2284480 2278938 2274513 2271125 2267516 2263268 2259446 2256845 2254411 2250448 2245033 2239978 2236486 2234299 2233492
46769 2233492 2235454 2240967 2248432 2255435 2261576 2268466 2277193 2286973 2296365 2304826 2312860 2321162 2329820 2338056
46755 2338056 2344837 2349873 2353664 2356437 2357820 2357941 2357838 2357821 2356342 2351771 2344765 2337563 2331264 2325193 2318763
46740 2318763 2312375 2306279 2299951 2293143 2286518 2280846 2276422 2273548 2272503 2272586 2272246 2270791 2269210 2268783 2269708
46725 2269708 2271616 2274550 2278624 2283419 2288625 2294878 2303108 2313202 2323974 2334349 2344105 2353602 2363165
46712 2363165 2372660 2381396 2388687 2394855 2401490 2410313 2421753 2434748 2447848 2460403 2472830 2485831
46700 2485831 2499475 2513346 2527664 2543640 2562051 2581894 2601346 2619808 2638001 2656133 2673233
46689 2673233 2688434 2701668 2712816 2721565 2728787 2736626 2746072 2755476 2762609 2767320 2770917 2773798 2775285
$$ [...]
##END NTUPLES=NMR SPECTRUM
##END=
