
##TITLE=UV1055_TOCA01-ROVE100D_6100010_pmNMsA0UUi
##JCAMPDX= 6.0         $$ Bruker NMR JCAMP-DX V2.0
##DATA TYPE= NMR SPECTRUM
##DATA CLASS= NTUPLES
##ORIGIN= BRUKER
##OWNER= Administrator
$$ 1.72 TOPSPIN		Version 2.1
$$ 2012-05-13 03:22:08.578 -0500  Administrator@TOPSPIN
$$ Compression mode = diff/dup
##.OBSERVE FREQUENCY= 400.13188235
##.OBSERVE NUCLEUS= ^1H
##.ACQUISITION MODE= SIMULTANEOUS (DQD)
##.ACQUISITION SCHEME= undefined
##.AVERAGES= 8
##.DIGITISER RES= 22
##SPECTROMETER/DATA SYSTEM= spect
##.PULSE SEQUENCE= zg30
##.SOLVENT NAME= COFFEE_meoh
##.SHIFT REFERENCE= INTERNAL, COFFEE_meoh, 1, 14.98061
##AUDIT TRAIL= $$ (NUMBER, WHEN, WHO, WHERE, PROCESS, VERSION, WHAT)
$$ ##TITLE= Audit trail, TOPSPIN		Version 2.1
$$ ##JCAMPDX= 5.01
$$ ##ORIGIN= Bruker BioSpin GmbH
$$ ##OWNER= Administrator
$$ $$ C:\Bruker\TOPSPIN/data/COFFEE/nmr/UV1055_TOCA01-ROVE100D_6100010_pmNMsA0UUi/20/pdata/1/auditp.txt
$$ ##AUDIT TRAIL=  $$ (NUMBER, WHEN, WHO, WHERE, PROCESS, VERSION, WHAT)
(   1,<2012-05-13 03:22:01.281 -0500>,<Administrator>,<TOPSPIN>,<go>,<TOPSPIN 2.1>,
      <created by zg
	started at 2012-05-13 03:20:54.796 -0500,
	POWCHK enabled, PULCHK disabled,
       configuration hash MD5:
       AF F2 23 6B 01 CD 40 DD E5 A1 38 A0 06 EA F7 77
       data hash MD5: 64K
       A9 4E CC 57 C5 6C 0E C1 4A 17 9C EB 11 AC 85 2A>)
(   2,<2012-05-13 03:22:04.296 -0500>,<Administrator>,<TOPSPIN>,<proc1d>,<TOPSPIN 2.1>,
      <Start of raw data processing
       efp LB = 0 FT_mod = 6 PKNL = 1 PHC0 = 0 PHC1 = 0 SI = 32K 
       data hash MD5: 32K
       69 AE EF 97 68 35 71 8F 24 16 F9 49 40 F0 AD 0C>)
(   3,<2012-05-13 03:22:04.718 -0500>,<Administrator>,<TOPSPIN>,<proc1d>,<TOPSPIN 2.1>,
      <pk PHC0 = 214.6729 PHC1 = 0 
       data hash MD5: 32K
       01 48 B4 0E 24 CA A0 07 83 3D A1 A7 0F 9F B4 3A>)
(   4,<2012-05-13 03:22:04.781 -0500>,<Administrator>,<TOPSPIN>,<proc1d>,<TOPSPIN 2.1>,
      <abs ABSG = 1 
       data hash MD5: 32K
       6C 2D AA 00 CD 43 AB 1F C3 38 D9 14 BE DC 78 96>)
(   5,<2012-05-13 03:22:04.984 -0500>,<Administrator>,<TOPSPIN>,<proc1d>,<TOPSPIN 2.1>,
      <abs ABSG = 2 
       data hash MD5: 32K
       90 77 BF D2 A3 8F BE 22 9B 44 A3 A2 5F FE 77 FB>)
(   6,<2012-05-13 03:22:05.031 -0500>,<Administrator>,<TOPSPIN>,<proc1d>,<TOPSPIN 2.1>,
      <abs ABSG = 3 
       data hash MD5: 32K
       99 87 8D 15 C3 FA C3 DB 61 10 4E D1 CC 5D 5C 91>)
(   7,<2012-05-13 03:22:05.062 -0500>,<Administrator>,<TOPSPIN>,<proc1d>,<TOPSPIN 2.1>,
      <abs ABSG = 4 
       data hash MD5: 32K
       8B 0B B4 39 11 CF C7 FD D1 A6 FB 2E 67 F5 16 80>)
(   8,<2012-05-13 03:22:05.093 -0500>,<Administrator>,<TOPSPIN>,<proc1d>,<TOPSPIN 2.1>,
      <abs ABSG = 5 
       data hash MD5: 32K
       1F 3E 3C 8B 01 69 C6 0D 8B D0 B0 24 28 BA EF B4>)
$$ ##END=
$$ 
$$ $$ hash MD5
$$ $$ AA AE 50 58 E2 AE DD F7 E8 3B AC C7 DB D1 6F 86
##$RELAX= 
##$RELAX= 
##$RELAX= 
##$RELAX= 
##$RELAX= 
##$RELAX= 
##$RELAX= 
$$ Bruker specific parameters
$$ --------------------------
$$ [...]
150 150 150 150 150 150 150 150
##$TP07= 0
##$TPNAME0= <>
##$TPNAME1= <>
##$TPNAME2= <>
##$TPNAME3= <>
##$TPNAME4= <>
##$TPNAME5= <>
##$TPNAME6= <>
##$TPNAME7= <>
##$TPOAL= (0..7)
0.5 0.5 0.5 0.5 0.5 0.5 0.5 0.5
##$TPOFFS= (0..7)
0 0 0 0 0 0 0 0
##$TUNHIN= 0
##$TUNHOUT= 0
##$TUNXOUT= 0
##$USERA1= <user>
##$USERA2= <user>
##$USERA3= <user>
##$USERA4= <user>
##$USERA5= <user>
##$V9= 5
##$VALIST= <valist>
##$VCLIST= <CCCCCCCCCCCCCCC>
##$VD= 0
##$VDLIST= <DDDDDDDDDDDDDDD>
##$VPLIST= <PPPPPPPPPPPPPPP>
##$VTLIST= <TTTTTTTTTTTTTTT>
##$WBST= 2048
##$WBSW= 25
##$XGAIN= (0..3)
0 0 0 0
##$XL= 0
##$YL= 0
##$YMAX_a= 539050
##$YMIN_a= -636979
##$ZGOPTNS= <>
##$ZL1= 120
##$ZL2= 120
##$ZL3= 120
##$ZL4= 120
##$ABSF1= 14.98061
##$ABSF2= -5.57192
##$ABSG= 5
##$ABSL= 3
##$ALPHA= 0
##$AQORDER= 0
##$ASSFAC= 0
##$ASSFACI= 0
##$ASSFACX= 0
##$ASSWID= 0
##$AUNMP= <proc_prof1d_extract_pilot.lims>
##$AXLEFT= 0
##$AXNAME= <>
##$AXNUC= <1H>
##$AXRIGHT= 0
##$AXTYPE= 0
##$AXUNIT= <>
##$AZFE= 0.1
##$AZFW= 0.1
##$BCFW= 0
##$BC_mod= 0
##$BYTORDP= 0
##$COROFFS= 0
##$CY= 15
##$DATMOD= 1
##$DC= 0
##$DFILT= <>
##$DTYPP= 0
##$F1P= 0
##$F2P= 0
##$FCOR= 0.5
##$FTSIZE= 32768
##$FT_mod= 6
##$GAMMA= 0
##$GB= 0
##$INTBC= 1
##$INTSCL= 1
##$ISEN= 128
##$LB= 0
##$LEV0= 0
##$LPBIN= 0
##$MAXI= 10000
##$MC2= 0
##$MEAN= 0
##$ME_mod= 0
##$MI= 0
##$NCOEF= 0
##$NC_proc= -8
##$NLEV= 6
##$NOISF1= 0
##$NOISF2= 0
##$NSP= 0
##$NTH_PI= 0
##$NZP= 0
##$OFFSET= 14.98061
##$PC= 1
##$PHC0= 214.6729
##$PHC1= 0
##$PH_mod= 1
##$PKNL= yes
##$PPARMOD= 0
##$PPDIAG= 0
##$PPIPTYP= 0
##$PPMPNUM= 2147483647
##$PPRESOL= 1
##$PSCAL= 4
##$PSIGN= 0
##$PYNMP= <proc.py>
##$REVERSE= no
##$SF= 400.13
##$SI= 32768
##$SIGF1= 0
##$SIGF2= 0
##$SINO= 400
##$SIOLD= 32768
##$SPECTYP= <>
##$SREGLST= <1H.CDCl3>
##$SSB= 0
##$STSI= 32768
##$STSR= 0
##$SW_p= 8223.68421052632
##$SYMM= 0
##$S_DEV= 0
##$TDeff= 65536
##$TDoff= 0
##$TI= <>
##$TILT= no
##$TM1= 0
##$TM2= 0
##$TOPLEV= 0
##$USERP1= <user>
##$USERP2= <user>
##$USERP3= <user>
##$USERP4= <user>
##$USERP5= <user>
##$WDW= 1
##$XDIM= 32768
##$YMAX_p= 454412610
##$YMIN_p= -667757
##$CURPLOT= <Network HP LaserJet P1505>
##$CURPRIN= <$Network HP LaserJet P1505>
##$DFORMAT= <normdp>
##$LAYOUT= <+/1D_H.xwp>
##$LFORMAT= <normlp>
##$PFORMAT= <normpl>
##$SURQMSG= 1
$$ End of Bruker specific parameters
$$ ---------------------------------
##NTUPLES= NMR SPECTRUM
##VAR_NAME=  FREQUENCY,     SPECTRUM/REAL,   SPECTRUM/IMAG
##SYMBOL=    X,             R,               I
##VAR_TYPE=  INDEPENDENT,   DEPENDENT,       DEPENDENT
##VAR_FORM=  AFFN,          ASDF,            ASDF
##VAR_DIM=   32768,         32768,           32768
##UNITS=     HZ,            ARBITRARY UNITS, ARBITRARY UNITS
##FACTOR=    0.250966925370066, 1,           1
##FIRST=     8223.43324360095, -43979,       -197506
##LAST=      0,             -28797,          -376246
##MIN=       0,             -667757,         0
##MAX=       8223.43324360095, 454412610,    0
$$ Real data points
##PAGE= N=1
##DATA TABLE= (X++(R..R)), XYDATA
$$ [...]
19519c7853j2960o6303A12666g2590A02834a12242A17630Q1547a40073A25315
$$ -37853 -50813 -117116 112666 -72590 102834 -112242 117630 199177 -140073 125315
19508a66405q1095C2311h5750j01923N7409D2163a81759j34082D3474b96166P069
$$ -166405 -247500 32311 -85750 -187673 -130264 42163 -181759 -315841 43474 -296166 -289097
19497b89097N4919e1827B55736b2814F1089R1876b43126K7610H396K0264a16051
$$ -289097 -234178 -51827 255736 -22814 61089 152965 -243126 -215516 8396 28660 -116051
19485g1261C4948e766k80753L2140A06879b06023B8419a7068A22126e0769B6400
$$ -71261 34948 -5766 -286519 -254379 106879 -206023 28419 -17068 122126 -50769 26400
19473A6431O3642d8425k77361J45021p9101P7545F3259k4452h408l4079l1783
$$ 16431 80073 -48425 -325786 -180765 -259866 -182321 63259 38807 -8408 -42487 -74270
19462g4270c0850j9452o7283Q733G825J48029i3772A40985a18844B60040a88838
$$ -74270 -30850 -50302 -117585 -108852 7825 155854 -93772 140985 -118844 260040 -188838
19450b16667j99705c8751C5223M01104A61117b02077h382C7562d49568I4029a10930
$$ -216667 -416372 -38751 35223 436327 161117 -202077 -8382 37562 -449568 94029 -110930
19438i1387G3647a36058k917o0514g7819I2791L8225a65617P0602A02777J6832
$$ -91387 73647 -136058 -138975 -199489 -77819 92791 131016 -165617 -95015 102777 119609
19427A19609J08508c31762B71177a78553H6210b7516B18244a54524A54005c17826
$$ 119609 228117 -331762 271177 -178553 86210 -27516 218244 -154524 154005 -317826
19416c7548B13099a7115k05472K4756K9802e9986a9463o2320C0484a91303l7492
$$ -37548 213099 -17115 -222587 -197831 -168029 -59986 -19463 -81783 30484 -191303 -228795
19405b28795R8336l5981j08194Q8035B52577a76125A3455h8027a0328k88006A7544
$$ -228795 -130459 -166440 -274634 -186599 252577 -176125 13455 -88027 -10328 -298334 17544
19393A10366c0325A57707a76851E9464c14633H7055J3299a63853F6685J114d3937
$$ 110366 -30325 157707 -176851 59464 -314633 87055 100354 -163853 66685 67799 -43937
19381c15363g1134j2742A30413d87277A60664a51370H008c47862B16816d0547
$$ -315363 -71134 -83876 130413 -487277 160664 -151370 8008 -347862 216816 -40547
19370c48082J24902a8761k40764a1617j4370M781j58258h1582J1888j897A00586
$$ -348082 -223180 -18761 -259525 -11617 -25987 -21206 -179464 -81582 -69694 -71591 100586
19358A29390b2238k59833H4273g2536B4998a89384E9546J7019g3412B70534f6161
$$ 129390 -22238 -282071 84273 -72536 24998 -189384 59546 76565 -73412 270534 -66161
19346a89185p2791k4112A45896c771H2594A3741c5183e887C2438d7045l17106
$$ -189185 -261976 -286088 145896 -3771 82594 13741 -35183 -5887 32438 -47045 -364151
19335c64151i208q4030b8690o6870l19833K06777A79694B8338c42457J58579j2223
$$ -364151 -9208 -93238 -28690 -95560 -415393 -208616 179694 28338 -342457 -183878 -196101
19324a96101O3657A09594j1115k9760k5347a80977E0592c4930I6672D962d51288
$$ -196101 -132444 109594 98479 68719 43372 -180977 50592 -34930 96672 4962 -451288
19312c71310g5237k0374A58503k6747q415d5487B9860b06461I10J38075b3073
$$ -371310 -75237 -95611 158503 131756 123341 -45487 29860 -206461 910 138985 -23073
19300A07612a58400O0987j7374E9604o406a15658j2626A00669A3278a92607L4943
$$ 107612 -158400 -97413 -114787 59604 53198 -115658 -128284 100669 13278 -192607 -157664
19289a57664e8950H599a47714I2570f9835J6705A22423E9938a18402m0382p1702
$$ -157664 -58950 8599 -147714 92570 -69835 -53130 122423 59938 -118402 -158784 -230486
19278b30486A71198b11482C29395a54240d6299B6259b6871F2644J56835j9154
$$ -230486 171198 -211482 329395 -154240 -46299 26259 -26871 62644 219479 200325
19268B00325a32197j24737O9302A46139c31076e3411E8071h8581C9337a01510
$$ 200325 -132197 -256934 -187632 146139 -331076 -53411 58071 -88581 39337 -101510
19257a03573m3402N9781D4484b60852A9018a90285A30030a41445a4904k58660
$$ -103573 -146975 -87194 44484 -260852 19018 -190285 130030 -141445 -14904 -273564
19247b73564D6444e9015j41299f70C3751j3238K38261a40919e4139l28196c8681
$$ -273564 46444 -59015 -200314 -670 33751 20513 258774 -140919 -54139 -382335 -38681
19235G8705c39817E7037a81446L1542N6871B11574m1524a87399c2916I8380i6972
$$ 78705 -339817 57037 -181446 -149904 -93033 211574 170050 -187399 -32916 98380 -96972
19223C23258C862a73845A51125a63520F5198a28948j08648j700j03919k11312
$$ 323258 3862 -173845 151125 -163520 65198 -128948 -237596 -239296 -343215 -554527
19213e54527c1947j91987B3113c1530A30396d28483a21668j70974J5543j11512
$$ -554527 -31947 -223934 23113 -31530 130396 -428483 -121668 -292642 -277099 -388611
19203c88611D3692a93247i0865A36484f0645C43795F1064a14180j35928G3037
$$ -388611 43692 -193247 -90865 136484 -60645 343795 61064 -114180 -250108 73037
19192c3327A61400B3578e1207k05992i3334B12106D0362i6499k5081m157j10605
$$ -33327 161400 23578 -51207 -257199 -93334 212106 40362 -96499 -121580 -125737 -236342
19181b36342j06176a45968A96973d2407j1389g116j60966A8428g0008n286a4781
$$ -236342 -342518 -145968 196973 -42407 -53796 -7116 -168082 18428 -70008 -75294 -14781
19169b0446I0511B3563Q1838a29663j07433e5929b5181A78995c0531A58047b50290
$$ -20446 90511 23563 105401 -129663 -237096 -55929 -25181 178995 -30531 158047 -250290
19157B49111I8416a00508d711A0166b53035i0889k30778J01682e0472l46897d6638
$$ 249111 98416 -100508 -4711 10166 -253035 -90889 -321667 -219985 -50472 -397369 -46638
19145g80B12621B6747c60463H9996d10618a06021j83793J25864h1401a1641I6555
$$ -780 212621 26747 -360463 89996 -410618 -106021 -289814 -163950 -81401 -11641 96555
19133b61919j19798A71073a51662k53247B08932a04453p6779d5304B50542a89174
$$ -261919 -381717 171073 -151662 -404909 208932 -104453 -181232 -45304 250542 -189174
19122b12791a01854A09922J2135c9952a742j32581a3692j71342A07480b78883
$$ -212791 -101854 109922 122057 -39952 -1742 -134323 -13692 -185034 107480 -278883
19111a54597I7233d2494j45582g3861B3914a95676B38120m331o8334a45643A1103
$$ -154597 97233 -42494 -188076 -73861 23914 -195676 238120 233789 165455 -145643 11103
19099A83838a59764a6135A5059a92743d519k9127A21712J77937D1225J16867D787
$$ 183838 -159764 -16135 15059 -192743 -4519 -33646 121712 299649 41225 158092 4787
19087A26294J19789a91329k9677B1200O6362R5219j1578a2317j55938E7291k8295
$$ 126294 246083 -191329 -221006 21200 87562 182781 171203 -12317 -168255 57291 28996
19076B8996b76005A28634b42049m1675J04861g0699b0521j57844a5982B8319g5387
$$ 28996 -276005 128634 -242049 -283724 -178863 -70699 -20521 -178365 -15982 28319 -75387
19064A01800m6876Q117a3722I4094f9994I9684g7157o0269l9809M6728F6076a79112
$$ 101800 54924 63041 -13722 94094 -69994 99684 -77157 -137426 -177235 -130507 66076 -179112
19051b1018B40139e9945C5256f4222B3306P0252f5868D41768a45236A54461h1962
$$ -21018 240139 -59945 35256 -64222 23306 93558 -65868 441768 -145236 154461 -81962
19039b0853E6881J82587h1044F0766R5221a823A60484C0499b0940l76568n7646
$$ -20853 56881 239468 -81044 60766 155987 -1823 160484 30499 -20940 -397508 -455154
19028d55154a24461C77315B116b55199B9280b06875K5272A2482K53046a06940
$$ -455154 -124461 377315 2116 -255199 29280 -206875 -181603 12482 265528 -106940
19017a51965j3198C9399K66119j47905G8315a4040B50044f1964C4456K5183P0721
$$ -151965 -165163 39399 305518 157613 78315 -14040 250044 -61964 34456 59639 130360
19006A30360a9537j80156A72403b73023B43968B5897E943M61290j44283g2932
$$ 130360 -19537 -199693 172403 -273023 243968 25897 5943 467233 322950 -72932
18995B84141a96880d916k10211e3328j07706I4890a02085G5383a0127j29391e1078
$$ 284141 -196880 -4916 -215127 -53328 -161034 94890 -102085 75383 -10127 -139518 -51078
18983b4046k06562l0154Q8885k22701A35245h6090n2450O8567B46552b33892a0679
$$ -24046 -230608 -260762 -171877 -394578 135245 -86090 -138540 -69973 246552 -233892 -10679
18971c6300p0749f411A12203a32010p7348E4399P0289K88473A14436J1901b7448
$$ -36300 -107049 -6411 112203 -132010 -209358 54399 124688 413161 114436 126337 -27448
18959A91030b88588o7298e6984b7335j45933j93581J02976i9802d8427I9885b23892
$$ 191030 -288588 -355886 -56984 -27335 -173268 -366849 -263873 -99802 -48427 99885 -223892
18947a86094q8829D739f5904A68164B4318a75688e4992K2785G2986a31444r0246
$$ -186094 -274923 4739 -65904 168164 24318 -175688 -54992 -32207 72986 -131444 -221690
18936b21690J02609B7509f9149C8749j4231a7787p0812E7992A1344J42824f9953
$$ -221690 -119081 27509 -69149 38749 24518 -17787 -88599 57992 11344 154168 -69953
18924A67970h3480E906a46097A6992i218k36342A43596a91761B43077a64122d0806
$$ 167970 -83480 5906 -146097 16992 -9218 -245560 143596 -191761 243077 -164122 -40806
18912a94456B63018A6750a55055A28775b33913h516j53752i902j31173j27951
$$ -194456 263018 16750 -155055 128775 -233913 -8516 -162268 -9902 -141075 -269026
18902b69026O4395a8032j60520k0927h8046C0522J38513b82367A3756a45224A14363
$$ -269026 -204631 -18032 -178552 -199479 -88046 30522 169035 -282367 13756 -145224 114363
18890e784B38172B549i4554B45542B7780b38461C8012R0564J6601c2004A2728
$$ -5784 238172 2549 -94554 245542 27780 -238461 38012 128576 145177 -32004 12728
18878a6677n3902o9561p6508A69458N8931C8251K7655a81769f1137A1533b51819
$$ -16677 -70579 -140140 -216648 169458 228389 38251 65906 -181769 -61137 11533 -251819
18866g5081K3638k38304J05019G0130a6762a439C4452a40087K0008j21074a4772
$$ -75081 -51443 -289747 -184728 70130 -16762 -1439 34452 -140087 -120079 -241153 -14772
18854h7531o1064E2861a8973j55377r9190C2541e3173A13873a97098b4457A17683
$$ -87531 -148595 52861 -18973 -174350 -273540 32541 -53173 113873 -197098 -24457 117683
18842b95508a05678d0817B4335L6635J14427a017A0394N49631b15511e8210D82117
$$ -295508 -105678 -40817 24335 60970 175397 -1017 10394 560025 -215511 -58210 482117
18830h9474A74490a81769r0682A14299J7680H240e1238G7608b6774D7735a25426
$$ -89474 174490 -181769 -272451 114299 131979 8240 -51238 77608 -26774 47735 -125426
18818d5116l4479l5445A78783h4875C3843R8006a27668B79940E5418L6614a62028
$$ -45116 -79595 -115040 178783 -84875 33843 131849 -127668 279940 55418 92032 -162028
18806A38816E4179J91515J90640A75371O3240k6199j4055J18056b35003a03465
$$ 138816 54179 245694 436334 175371 238611 212412 198357 316413 -235003 -103465
18795B13351b5538A68477b71209E6941c52723H8192a69800h3605k795B01809i2241
$$ 213351 -25538 168477 -271209 56941 -352723 88192 -169800 -83605 -86400 201809 -92241
18783e17134H1652a2803j83027d4049B9828K09449c41003g7008p2191q3081B7341
$$ -517134 81652 -12803 -195830 -44049 29828 239277 -341003 -77008 -149199 -232280 27341
18771A14660b9292j0718j94303f7512j1536A34225L18096A9493a94165r5573p0884
$$ 114660 -29292 -40010 -234313 -67512 -79048 134225 452321 19493 -194165 -289738 -360622
18760c60622J43703h9028B7522f8277p3780A32052a27306d7889r1925e035j7454
$$ -360622 -216919 -89028 27522 -68277 -142057 132052 -127306 -47889 -139814 -5035 -22489
18749b2489C3232a4778C5691e8511j51681J4925f530l80481f1594o2239k4586
$$ -22489 33232 -14778 35691 -58511 -210192 -195267 -6530 -387011 -61594 -123833 -148419
18738a48419a6115k79979Q8449g8642F4630J24130b53987d8538j61186k77753
$$ -148419 -16115 -296094 -207645 -78642 64630 188760 -253987 -48538 -209724 -487477
18728d87477a61004n9434A2927b58524o7034P6889l37A32819D3380g319A22865
$$ -487477 -161004 -220438 12927 -258524 -325558 -248669 -249006 132819 43380 -7319 122865
18716G7292a6821q0533D2816R2848e5032m32348g4464j44247m9572j16613C0520
$$ 77292 -16821 -97354 42816 135664 -55032 -487380 -74464 -218711 -268283 -384896 30520
18704g5425B1615M3141O7662B7812J90984a77704A01166i2831A49058i7874B06365
$$ -75425 21615 64756 132418 27812 218796 -177704 101166 -92831 149058 -97874 206365
18692h4709q6408f0455k72824a11359m3014F3085j2321d0347j18052L8470l9589
$$ -84709 -171117 -60455 -333279 -111359 -154373 63085 50764 -40347 -158399 -119929 -159518
18681a59518M7259N4956q6277f1788k8963E1259B0616L94412k0951h9266H161
$$ -159518 -112259 -57303 -143580 -61788 -90751 51259 20616 415028 394077 -89266 8161
18669b54813J12444k5231F0922K2451B1754J06221A7427b48672c4350k84612H8166
$$ -254813 -142369 -167600 60922 83373 21754 127975 17427 -248672 -34350 -318962 88166
18657A31216c332A00335K875g1654L814b9368j02736M3808m9327e422j99086A24721
$$ 131216 -3332 100335 103210 -71654 -67840 -29368 -132104 -88296 -137623 -5422 -204508 124721
18644c53032a43352B2443c00619J05875J9691b4807D25043a57978A07896B5798
$$ -353032 -143352 22443 -300619 -194744 -175053 -24807 425043 -157978 107896 25798
18633A18649k9312a51737B50408J69382b37527B76375P4912a02287o1198j9251
$$ 118649 89337 -151737 250408 419790 -237527 276375 351287 -102287 -163485 -182736
18623a82736M3357E6567R375g3725D7883a86551C04845h2357o790A0314h4145
$$ -182736 -139379 56567 65942 -73725 47883 -186551 304845 -82357 -89147 10314 -84145
18611A56546a98538b0883m41254G2837B0871b4352A547L0972f2277C1613K4151
$$ 156546 -198538 -20883 -462137 72837 20871 -24352 1547 32519 -62277 31613 55764
18600E5764g2873J2292n3165A1343a75502K8873K5221j86641O9528M1375j27940
$$ 55764 -72873 -60581 -113746 11343 -175502 -146629 -121408 -308049 -238521 -197146 -325086
18589c25086b8550l58538J84410N4336B30883k8283e8622l13031A15388l8670
$$ -325086 -28550 -387088 -202678 -148342 230883 202600 -58622 -371653 115388 76718
18579G6718Q4081A113a25960l5684L2028J0822e1693j9987D7084A6942e9269C05303
$$ 76718 160799 1113 -125960 -161644 -129616 -118794 -51693 -71680 47084 16942 -59269 305303
18566b24802c2102F6915a50936A99353E5388J94502B6320e8725j01548I6308B1408
$$ -224802 -32102 66915 -150936 199353 55388 249890 26320 -58725 -160273 96308 21408
18554A14922g6936a3970q224j79573d9232b4121j72443C1489a44116r3143A70231
$$ 114922 -76936 -13970 -22194 -201767 -49232 -24121 -196564 31489 -144116 -237259 170231
18542D3391a03956p9801R550g2358N936k80263A06887M7294a76103e2711q0329
$$ 43391 -103956 -183757 -174207 -72358 -66422 -346685 106887 154181 -176103 -52711 -133040
18531a33040a0413j35493l47677h4722P718m8342i366k76001A08376c1204l73613
$$ -133040 -10413 -145906 -493583 -84722 -77004 -125346 -9366 -285367 108376 -31204 -404817
18520d04817A23842i3542A2140a76791m5704J2028B82044A00709m0543M12539
$$ -404817 123842 -93542 12140 -176791 -222495 -210467 282044 100709 60166 472705
18510D72705A60690a86429j44371A31852a96847L5669p7387J07503A73842P9257
$$ 472705 160690 -186429 -330800 131852 -196847 -161178 -238565 -131062 173842 253099
18500B53099E5460c07536B8140f5653o2215B02877a24016G0818q196g4953b7833
$$ 253099 55460 -307536 28140 -65653 -127868 202877 -124016 70818 62622 -74953 -27833
18488I890J44214c08455B61760A22634B6094d0786C70204a82259f2104I3531a53648
$$ 9890 154104 -308455 261760 122634 26094 -40786 370204 -182259 -62104 93531 -153648
18476B0740a29553A52962b67808B78771g0761D682b71319J08889A24324e5466
$$ 20740 -129553 152962 -267808 278771 -70761 4682 -271319 -162430 124324 -55466
18465a79581e7038D1429a43119q5163F2890b56172D2446a962j217l1677G3498
$$ -179581 -57038 41429 -143119 -228282 62890 -256172 42446 -1962 -3179 -34856 73498
18453a43162d7638j53619B20513d02845C8337h555k28307A77563b45281R6546
$$ -143162 -47638 -201257 220513 -402845 38337 -8555 -236862 177563 -245281 -148735
18443a48735A456J8089R3575a67987j35674a08445D7868i678k24753k8113e7971
$$ -148735 1456 19545 113120 -167987 -303661 -108445 47868 -9678 -234431 -262544 -57971
18431d6874k5889r5407b9957J0724j53845n0264d8537J7006q0203a6840k10239
$$ -46874 -72763 -168170 -29957 -19233 -173078 -223342 -48537 -31531 -111734 -16840 -227079
18420b27079A17816a37989l2903A08960m1639L32673b3947m3643C34492a86625
$$ -227079 117816 -137989 -170892 108960 67321 399994 -23947 -67590 334492 -186625
18409A57029f2857b796R54k01902A78371b57738i1283i782C43362A12622O5741
$$ 157029 -62857 -2796 -1842 -203744 178371 -257738 -91283 -9782 343362 112622 178363
18398A78363a31174A48202P6872b46214D0833d55861B88297d1359C6447N150g4236
$$ 178363 -131174 148202 225074 -246214 40833 -455861 288297 -41359 36447 41597 -74236
18386a86000A61281b69402h9937a5462E6651b24377b8901C9399J52663b18984
$$ -186000 161281 -269402 -89937 -15462 56651 -224377 -28901 39399 192062 -218984
18375A75d86293a79147b1965H0057g6647j75325Q6246e1379C5106b07115n4230
$$ 175 -486293 -179147 -21965 80057 -76647 -251972 -165726 -51379 35106 -207115 -261345
18364b61345D5947a8744A13239K22679e3882B631J63872f0509j6460j44520A92763
$$ -261345 45947 -18744 113239 335918 -53882 2631 166503 -60509 -76969 -221489 192763
18352A03876a65308q584n1163o2220e647C866b5919D9565a12034c4635j53558
$$ 103876 -165308 -173892 -225055 -287275 -5647 3866 -25919 49565 -112034 -34635 -188193
18341a88193C2238Q9759a11640L0162A55451c16168j29474A4276R6838a67369
$$ -188193 32238 121997 -111640 -81478 155451 -316168 -445642 14276 111114 -167369
18330b84786C70789I0284M9851h816B384J53834c27161f6005L0541j76266B6638
$$ -284786 370789 90284 140135 -8816 2384 156218 -327161 -66005 -35464 -211730 26638
18318B4758J76178a98015A94153C1845J17619B8424a9195A41622B2898a02038
$$ 24758 200936 -198015 194153 31845 149464 28424 -19195 141622 22898 -102038
18307A3665n719L08210c2508G5187d69334A87894d9594G4603L3884k0141a61749
$$ 13665 7946 316156 -32508 75187 -469334 187894 -49594 74603 108487 88346 -161749
18295C6272L17366b2545A65732i0940A23032a2065G2668b79774A41624d7311a2416
$$ 36272 353638 -22545 165732 -90940 123032 -12065 72668 -279774 141624 -47311 -12416
18283c57361J61280d0919B33578G3859C2954P4406B2347R6228b32880l7140j78044
$$ -357361 -196081 -40919 233578 73859 32954 107360 22347 118575 -232880 -270020 -448064
18272d48064a6977r4251A4646b0496q8966C22273A06636a32348R7Q753e0827j0312
$$ -448064 -16977 -111228 14646 -20496 -109462 322273 106636 -132348 -132251 -123498 -50827 -61139
18260f1139C4181b23680M8217h4924l3578K7290J4146j0381L4659b4220A13579
$$ -61139 34181 -223680 -175463 -84924 -118502 -91212 -77066 -87447 -52788 -24220 113579
18248A15363a89615A57029c35768e3207m20B53370a74663f5605R567j96429a17311
$$ 115363 -189615 157029 -335768 -53207 -53627 253370 -174663 -65605 -56038 -252467 -117311
18236c9226A00782B7255a07752i514j73441h2928j14525C8265J78089b45750A39437
$$ -39226 100782 27255 -107752 -9514 -182955 -82928 -197453 38265 216354 -245750 139437
18224B17597c85955b1685C3846J89235a06400B18081p1559b07389N0246C08331
$$ 217597 -385955 -21685 33846 223081 -106400 218081 146522 -207389 -157143 308331
18213b52726G3387b07590R8656a4441B71436b151j1848F256c58641A81052q6717
$$ -252726 73387 -207590 -108934 -14441 271436 -2151 -13999 6256 -358641 181052 94335
18202I4335h2792j562A7191a8056o2077l98041e6377B10154f1891C8868e2121
$$ 94335 -82792 -84354 17191 -18056 -80133 -478174 -56377 210154 -61891 38868 -52121
18190A66692d6279A5965R5645a81843j02584q0385A20513i3211m4967m3496A84592
$$ 166692 -46279 15965 111610 -181843 -284427 -364812 120513 -93211 -138178 -181674 184592
18178G4645Q946d40030A76935a94139q6189J27573j32191F2303c19654J14034
$$ 74645 83591 -440030 176935 -194139 -280328 -152755 -284946 62303 -319654 -205620
18168b05620A14331o291B3060M4873b00795r6914C0178L8716b5754A81928a10011
$$ -205620 114331 108040 23060 67933 -200795 -297709 30178 68894 -25754 181928 -110011
18156A31043m6962a00218A59576d36311H6520b7127B74679a62486B391L911R5198
$$ 131043 84081 -100218 159576 -436311 86520 -27127 274679 -162486 2391 6302 101500
18145A01500c65162a24032E2145A1332N1180B6208L8685K65417q9967A7083a70425
$$ 101500 -365162 -124032 52145 11332 62512 26208 64893 330310 240343 17083 -170425
18133a24387j92688a53027j20238h0257B27356e1354l8374B9178N4474c6063r0335
$$ -124387 -317075 -153027 -273265 -80257 227356 -51354 -89728 29178 83652 -36063 -126398
18122a26398o8443m7525g075G5107a1050o8234o8113O0198o4967I2252C2615b46986
$$ -126398 -194841 -242366 -7075 75107 -11050 -79284 -147397 -87199 -152166 92252 32615 -246986
18109a4311k6904F415J8604b22211B7816A3301K8460L65628k03187G7847a99931
$$ -14311 -41215 6415 25019 -222211 27816 13301 41761 407389 204202 77847 -199931
18097b07835A52183a74451B5053d10113A40978m5484k3506L0187a10065j02809
$$ -207835 152183 -174451 25053 -410113 140978 95494 71988 102175 -110065 -212874
18087b12874E3737a88369D08063a8017F4144P5455i5723k57205m6355a05934H4342
$$ -212874 53737 -188369 408063 -18017 64144 139599 -95723 -352928 -399283 -105934 84342
18075d6380A92765I3843g8102F6319b43516H2674J74652f3313l1649A85037A120
$$ -46380 192765 93843 -78102 66319 -243516 82674 257326 -63313 -94962 185037 1120
18063B55453b53645G5547K0418d341j75134g1863k65180C13826b7064j84163A54894
$$ 255453 -253645 75547 95965 -4341 -179475 -71863 -337043 313826 -27064 -211227 154894
18051A13591F003f1474o9027J9180b7521A29660g8578I4965a90559B5074a63231
$$ 113591 6003 -61474 -130501 -111321 -27521 129660 -78578 94965 -190559 25074 -163231
18039b1370A14935n7002a16267L3405D3572M5027P5839a03573H9295K08521c1299
$$ -21370 114935 57933 -116267 -82862 43572 88599 164438 -103573 89295 297816 -31299
18027A18705L7156D3497a50204c8585A64731m4217e36380b33505A95540a06872
$$ 118705 155861 43497 -150204 -38585 164731 120514 -536380 -233505 195540 -106872
18016a4573E310f5337M620b4214J050l03291b0081l9681m4051B3091b90581A38622
$$ -14573 5310 -65337 -60717 -24214 -23164 -326455 -20081 -59762 -103813 23091 -290581 138622
18003a02617I7355k2914a95496c3252j40823B5518b47610m3774e3501I7787k6191
$$ -102617 97355 74441 -195496 -33252 -174075 25518 -247610 -291384 -53501 97787 71596
17992G1596a55264L0770j47016c2058C17018a23295B53643d682A79342q8308h0957
$$ 71596 -155264 -124494 -271510 -32058 317018 -123295 253643 -4682 179342 91034 -80957
17980a38135E3755f6583M444j85354E0092b30709j12362a57794K7389F3423a40860
$$ -138135 53755 -66583 -62139 -247493 50092 -230709 -343071 -157794 -130405 63423 -140860
17968i6237A11832g0608K898o2668A64673p0074g1105A48403J98347A03254R4542
$$ -96237 111832 -70608 -67710 -130378 164673 94599 -71105 148403 346750 103254 197796
17957A97796a25680j57718l12678B7372a72839a6396M077j80384C5845c26892
$$ 197796 -125680 -283398 -596076 27372 -172839 -16396 -12319 -192703 35845 -326892
17946a00972k98283C07743j41677L170c5939B27601a56122B32275o3613n3847
$$ -100972 -399255 307743 166066 169236 -35939 227601 -156122 232275 168662 114815
17936A14815b88879F8908K395l4388b76733a19300I0253Q5623C9517b14975p4724
$$ 114815 -288879 68908 71303 36915 -276733 -119300 90253 175876 39517 -214975 -289699
17925b89699h949A0336P8519J58302q293I9139R954c69200M913B3177b1825L534
$$ -289699 -8949 10336 88855 247157 238864 99139 109093 -369200 -364287 23177 -21825 -18291
17913a8291i088I5185k9108j9036a91770B40384H4222A3497K11242J08426F6602
$$ -18291 -9088 95185 66077 47041 -191770 240384 84222 13497 224739 333165 66602
17901b27457H55b2728j35153M028G0422J96584a58501j09544B46044b110A55798
$$ -227457 855 -22728 -157881 -153853 70422 267006 -158501 -268045 246044 -2110 155798
17889B6276a96537i0460j0696J3476A02666c34841j6511B24844d1704m6632M1338
$$ 26276 -196537 -90460 -101156 -87680 102666 -334841 -351352 224844 -41704 -88336 -46998
17878d6998p8847B59697c0962k03186K1169a3321k90376C8151N9727j5143b74329
$$ -46998 -125845 259697 -30962 -234148 -212979 -13321 -303697 38151 97878 82735 -274329
17866c4524j32122B06605a04231A70754K5836O0788l1068c15947a22384A28573
$$ -34524 -166646 206605 -104231 170754 196590 257378 226310 -315947 -122384 128573
17855B704b68380A96233c11545C12534H7767b41337A57622m2664g6083A21654
$$ 2704 -268380 196233 -311545 312534 87767 -241337 157622 114958 -76083 121654
17844F1898Q740c69574d4988k35347j5300B8148i4242A03304A0923b4765A82384
$$ 61898 70638 -369574 -44988 -280335 -295635 28148 -94242 103304 10923 -24765 182384
17832e1212m18344K33336c4592l2272k35278C5714d16807B66334A6126J7473O8897
$$ -51212 -469556 -236220 -34592 -66864 -302142 35714 -416807 266334 16126 33599 102496
17821A02496C2784a0452A0743Q108J35752a06038L1116B29672b3708q1741n6104
$$ 102496 32784 -10452 10743 18851 154603 -106038 -74922 229672 -23708 -105449 -161553
17810a61553C5301h4614l2405b2277D7594J64418b24601D0925K24856b09872o3311
$$ -161553 35301 -84614 -117019 -22277 47594 212012 -224601 40925 265781 -209872 -273183
17799b73183j0751A51233G5378j565i2671A81912a56433g3615m0286D5460j7424
$$ -273183 -283934 151233 75378 73813 -92671 181912 -156433 -73615 -113901 45460 28036
17788B8036a7444j78633p6641A99285h0884D33434k04173q2189f7598N041o6947
$$ 28036 -17444 -196077 -272718 199285 -80884 433434 229261 147072 -67598 -62557 -129504
17777a29504E4581c767E7174a33700A06413a72384j06303d5352n3823K5209k5611
$$ -129504 54581 -3767 57174 -133700 106413 -172384 -278687 -45352 -99175 -73966 -99577
17766i9577A20189L50679i5912B27160B368N1297b179C3934a24939b5214B53529
$$ -99577 120189 470868 -95912 227160 2368 53665 -2179 33934 -124939 -25214 253529
17754a72073E0736K48952j20291b4854G7241K4713a27726K1170A3559J28703A6386
$$ -172073 50736 299688 179397 -24854 77241 101954 -127726 -106556 13559 142262 16386
17742a10860j03704H9527d21848A60905b67517q675B3149b87261D04193C2674
$$ -110860 -214564 89527 -421848 160905 -267517 -276192 23149 -287261 404193 32674
17731B11931k529b62860I5126h2930B83740b5673j44151I4727j1899a7661F4452
$$ 211931 209402 -262860 95126 -82930 283740 -25673 -169824 94727 82828 -17661 64452
17719C7888i7415B22439b4190B12965H1563l6495a02471F2481J37930I8544O133
$$ 37888 -97415 222439 -24190 212965 81563 45068 -102471 62481 200411 98544 104677
17708A04677a22617c5872k6213j38975I3233f9j75931A44789J05543m8725h1578
$$ 104677 -122617 -35872 -62085 -201060 93233 -69 -176000 144789 250332 201607 -81578
17696c4923b718C5268j6269J0875O2937a03886C18718I1747d46184a59060o060
$$ -34923 -2718 35268 18999 29874 92811 -103886 318718 91747 -446184 -159060 -165120
17685a65120C26956i2067B93564a80642A71593a8918l2493k07358B52681H6856
$$ -165120 326956 -92067 293564 -180642 171593 -18918 -51411 -258769 252681 86856
17674G6840c9169j33705K4308K7273C3961i9874M6553C6416K34147q1023b49384
$$ 76840 -39169 -172874 -148566 -121293 33961 -99874 -53321 36416 270563 189540 -249384
17662a637n9190A96775Q7052a65428C5883h9594a0842A32190O9432l9310l4035
$$ -1637 -60827 196775 283827 -165428 35883 -89594 -10842 132190 201622 162312 128277
17651A28277M5852a81936D9800N58a89814E1148A7462b86351F7539i5073B7107
$$ 128277 174129 -181936 49800 50358 -189814 51148 17462 -286351 67539 -95073 27107
17639C71625D3481J10608d8612q1850O17B14329p2226D7470K02218D0843A4733
$$ 371625 43481 154089 -48612 -130462 -129845 214329 142103 47470 249688 40843 14733
17627A6393c45331A39600I904M58660E5415J71885e8646l9828j1601a6920k05475
$$ 16393 -345331 139600 9904 468564 55415 227300 -58646 -98474 -110075 -16920 -222395
17616b22395A89979m3172b79623N2784F9849k3885J18007d59373C22300a06310
$$ -222395 189979 146807 -279623 -226839 69849 45964 163971 -459373 322300 -106310
17605h6680B40297b4097j3490B44583j2029a43785b216k80774B46923D3397L5557
$$ -86680 240297 -24097 -37587 244583 232554 -143785 -2216 -282990 246923 43397 78954
17594G8954J63380c72820b0678C15150b48447C7500J67111b3722j09297C45787
$$ 78954 242334 -372820 -20678 315150 -248447 37500 204611 -23722 -133019 345787
17583A56343L7357n4839D1715O2194a60587b7248n1476C4535B564a11680l5865
$$ 156343 193700 138861 41715 103909 -160587 -27248 -78724 34535 2564 -111680 -147545
17572a47545I9455N8715c6908A66056J43308A5475a51836B82716c32172M9690
$$ -147545 99455 158170 -36908 166056 309364 15475 -151836 282716 -332172 -282482
17562b82482F4405L19154H6136B1562J55617j6353F7680N9633b44202b7894j47013
$$ -282482 64405 383559 86136 21562 177179 160826 67680 127313 -244202 -27894 -174907
17551a74907h0507c3742q9153k895B39413A16473J47952F7837j8641f6411p0890
$$ -174907 -80507 -33742 -122895 -125790 239413 116473 264425 67837 49196 -66411 -137301
17540a37301A34069f8068j07394A44579J13666h8098D14086G4405J45579l1669
$$ -137301 134069 -68068 -175462 144579 258245 -88098 414086 74405 219984 188315
17530A88315q3100O347a13945A40874R9463G7L18179D3185e1516A10275K03570
$$ 188315 105215 111562 -113945 140874 240337 77 318256 43185 -51516 110275 313845
17519C13845A22227e6121C32336b7581o0407C40788a26013B23011b41511a03327
$$ 313845 122227 -56121 332336 -27581 -87988 340788 -126013 223011 -241511 -103327
17508D96991A91123f14597a9440A72134a36415B61061a5090k23085b3008F6684
$$ 496991 191123 -614597 -19440 172134 -136415 261061 -15090 -238175 -23008 66684
17497C2205O0547N0733c6487A66188a02818l98706i2252A15966J20482b35148
$$ 32205 92752 143485 -36487 166188 -102818 -501524 -92252 115966 236448 -235148
17486B02129a4382B5716K68612q2127d0968H6428A1502c7640C75042A3636J26536
$$ 202129 -14382 25716 294328 212201 -40968 86428 11502 -37640 375042 13636 140172
17475A40172f3431B61612h52n061A48535b17719B2602C129L81551A71601d92208
$$ 140172 -63431 261612 -852 -5913 148535 -217719 22602 3129 384680 171601 -492208
17463C29609H0080J34680J7559F8999a88861A67338e7879A89781b8590C80144
$$ 329609 80080 214760 232319 68999 -188861 167338 -57879 189781 -28590 380144
17452B05852j8432L11146B31202P2079b8415A29553K38682r9420A21837K05608
$$ 205852 187420 498566 231202 303281 -28415 129553 368235 268815 121837 327445
17442C27445D185M7788N0391K17084M5545j75641e2946A82214q3728M7493J1873
$$ 327445 4185 51973 102364 319448 364993 189352 -52946 182214 98486 145979 157852
17431A57852L24640p4085b392B55683c0586C65585A66879K18629A81783k8898
$$ 157852 482492 408407 -2392 255683 -30586 365585 166879 385508 181783 152885
17421A52885k4702K13064J89533A76241R6506j8845a89259A09314M9013J28295
$$ 152885 128183 341247 530780 176241 272747 253902 -189259 109314 158327 286622
17411B86622o1324l8979n2049K84719G5431K69814e6820A60076J22142F8270J96420
$$ 286622 225298 186319 134270 418989 75431 345245 -56820 160076 282218 68270 264690
17400B64690j29733e8533j5378B46248p6711a07893D2747e8897E4681e0152B02728
$$ 264690 134957 -58533 -73911 246248 169537 -107893 42747 -58897 54681 -50152 202728
17388g6315A49855l1455K8229n3224N6216K47338o1752H8855l7915J49896o9128
$$ -76315 149855 118400 146629 93405 149621 396959 335207 88855 50940 200836 131708
17377A31708e6459H1657L32978A87091p2790L06918j95824I2318b3999G0982K68688
$$ 131708 -56459 81657 414635 187091 114301 421219 225395 92318 -23999 70982 339670
17366C39670j6479c10065B33632J2889B8599J03392L12340B14816P7285e8893
$$ 339670 323191 -310065 233632 246521 28599 131991 444331 214816 292101 -58893
17355H2275K63962m1898j51482E4418L22248c8665A02228B9827J10749J50742
$$ 82275 346237 304339 152857 54418 376666 -38665 102228 29827 140576 291318
17345B91318a84988E9242J26734p8878J78577B329a59499C68528a4522j06863
$$ 291318 -184988 59242 185976 107098 285675 2329 -159499 368528 -14522 -121385
17335a21385C49568F9005a9082B15743I8615l1638J39113M0327h6410n2861B14190
$$ -121385 349568 69005 -19082 215743 98615 66977 206090 246417 -86410 -139271 214190
17323A43874J65632e7445G302J90979B7199O2514K13125M0587a1825C13235c7372
$$ 143874 309506 -57445 7302 198281 27199 89713 302838 343425 -11825 313235 -37372
17311C37263A8348a15540B84823r7627B3209a51983A8055K72443F5490R5789B3084
$$ 337263 18348 -115540 284823 187196 23209 -151983 18055 290498 65490 161279 23084
17299C09969K2120j5404A26706M03994A12469K44794A57726K18523m9664E8747
$$ 309969 332089 316685 126706 530700 112469 357263 157726 376249 326585 58747
17288F3287k5347J94190J68555i8669B55981f7399A51779J22255K71340j77837
$$ 63287 37940 232130 400685 -98669 255981 -67399 151779 274034 545374 367537
17278C67537b40756A2769K84373j18582H8177b6149r6184C36146a4266B58535
$$ 367537 -240756 12769 297142 178560 88177 -26149 -122333 336146 -14266 258535
17267D07320C2772J26372G0972j039K00112l6765a43895H9975g4248A80246J10169
$$ 407320 32772 159144 70972 69933 270045 233280 -143895 89975 -74248 180246 290415
17256B90415h411I2189J46498m7039J1774d546A81310J4558a9520B08705J29066
$$ 290415 -8411 92189 238687 191648 203422 -4546 181310 195868 -19520 208705 337771
17245C37771a6645I9453b31484C51696F5933N8356J95990p679J17118j06449F4658
$$ 337771 -16645 99453 -231484 351696 65933 124289 320279 312600 429718 323269 64658
17233A86116d7303C07443n7492J21063k8139F8051c0388B94005o3837L8387a49098
$$ 186116 -47303 307443 249951 371014 342875 68051 -30388 294005 230168 268555 -149098
17221B29378J72985j85024I5698P8038K3987R9452j39119o7289b09199A54752
$$ 229378 402363 217339 95698 173736 197723 297175 158056 90767 -209199 154752
17210C72094c5668A90778N8842m3220H2129J7256N769J01575L0945J39293F3792
$$ 372094 -35668 190778 249620 206400 82129 99385 105154 206729 237674 376967 63792
17198D12406j18301C9212M19671A49401J1678a104A94369K40431F0423h6329D48164
$$ 412406 294105 39212 458883 149401 161079 -1104 194369 434800 60423 -86329 448164
17186C63275K7503g4572A434L34597A65597R4656L11846A2274J87351b3553B37772
$$ 363275 390778 -74572 1434 336031 165597 260253 572099 12274 199625 -23553 237772
17174B17661o8754M05119B55544J6433J5502A29848P0840K34602j06355j49948
$$ 217661 148907 554026 255544 271977 287479 129848 200688 435290 328935 178987
17164A78987b8847A17882l7983J80553A09782a04284A74482M26694A80476K05087
$$ 178987 -28847 117882 79899 260452 109782 -104284 174482 601176 180476 385563
17154C85563P5557j52660K6434j23534q7937b8336A41035K4268J05014J84118
$$ 385563 461120 308460 334894 211360 123423 -28336 141035 165303 270317 454435
17144D54435A94204A1483J73522M40922B69383L6195A10061K19569m3035D2209
$$ 454435 194204 11483 185005 625927 269383 305578 110061 329630 286595 42209
17133C00926M9906j36357K40923P0214A66816P6856A9002b38809H9483N28451
$$ 300926 350832 214475 455398 525612 166816 243672 19002 -238809 89483 617934
17123F17934A56015J83736J72554A18550L68031A72464R9544j00454M07389E4014
$$ 617934 156015 339751 512305 118550 486581 172464 272008 171554 578943 54014
17112E41297k29721M2690l517K24735A06217L48386j47768J08786j65138J2137
$$ 541297 311576 354266 350749 575484 106217 454603 306835 415621 250483 262620
17102B62620K0698A24720K53691j84365K92451k38955J71308k3817A81217R9823
$$ 262620 283318 124720 378411 194046 486497 247542 418850 395033 181217 281040
17092B81040J02199j04222o8585l0269L26835J00676B34250A12479J54603K2718
$$ 281040 383239 279017 210432 180163 506998 607674 234250 112479 267082 289800
17082B89800o1177P8860I3800K08672J59188n0371A88809G1803J85017L04558
$$ 289800 228623 307483 93800 302472 461660 411289 188809 71803 256820 561378
17072E61378j68529k8174J05834K7853c421E62708o7606k35693P3741O5937j91318
$$ 561378 392849 364675 470509 498362 -3421 562708 495102 259409 333150 399087 207769
17061B07769L91211L14169l73352J07200k10087J29737j55087j55633M99620k94550
$$ 207769 598980 913149 539797 646997 436910 566647 411560 255927 755547 460997
17051D60997Q3918I6353M00265J90001k53310j9228J92072j11335p2159j2266
$$ 460997 544915 96353 496618 686619 433309 414081 606153 494818 422659 410393
17041D10393B00104M8279M9395L59232K74379D26946L71559k58312j96623r8119
$$ 410393 200104 248383 297778 657010 931389 426946 798505 540193 343570 245451
17031B45451A9432K56418L63024k02036K55746n2440k71395J25105j77002J23744
$$ 245451 19432 275850 638874 436838 692584 640144 368749 493854 316852 440596
17021D40596m6506n3918k8287L43090j71572n6936L78051k56043J34608j51408
$$ 440596 394090 340172 311885 654975 483403 426467 804518 548475 683083 531675
17011E31675j52980J39542L9318J28331C23868K38518r1068M46451l67293j6079
$$ 531675 378695 518237 557555 685886 323868 562386 471318 917769 550476 534397
17001E34397R6329j52085j50147M49210j83884k15358L44823l14141M08003r5162
$$ 534397 630726 478641 328494 777704 593820 378462 723285 409144 817147 721985
16991G21985p1426J98828k63484J47902o2479M5832O9956k23473j12692K5679
$$ 721985 650559 849387 585903 733805 671326 717158 787114 563641 450949 476628
16981D76628L51674C41764M68523K5456j83976j79555L03100K20911j89775k68613
$$ 476628 828302 341764 810287 835743 651767 472212 775312 996223 806448 537835
16971E37835K62625j30119p2906j125L73768l45583k9467J40969K63748k24220
$$ 537835 800460 670341 597435 596310 970078 624495 595028 735997 999745 775525
16961G75525L87028k69247j05816N7K21083p0614k73777K4495j45991M59129n2744
$$ 775525 1162553 893306 787490 787547 1008630 938016 664239 688734 542743 1001872 949128
16950I49128J95124l45276N0078J23573j53388L4930O1270j64703M21800l04715
$$ 949128 1144252 798976 849054 972627 819239 854169 915439 750736 1172536 867821
16940H67821J80712k71278M72353m79813N47009l7539n38376K72659R5615j31126
$$ 867821 1048533 777255 1249608 769795 1316804 1279265 740889 1013548 1109163 978037
16930I78037j25754L58643K22286o10438J77486K09210j79671q4840j95944L76123
$$ 978037 852283 1210926 1433212 822774 1000260 1209470 1029799 944959 749015 1125138
16920A125138j76691M58504l03658j36597J13244J39631j01620j14926p4792J43413
$$ 1125138 948447 1406951 1103293 966696 1079940 1219571 1117951 1003025 928233 1071646
16910A071646k81270K48903L06722j0362L07130p2033j65978R696J69511k41987
$$ 1071646 790376 1039279 1346001 1335639 1642769 1570736 1404758 1414454 1583965 1341978
16900A341978q953K85652k44164n5545J67805R4382r264J97574q5233j54027Q5247
$$ 1341978 1333025 1618677 1374513 1318968 1486773 1581155 1571891 1769465 1684232 1530205 1615452
16889A615452j10703l5808j34251K99102N32040m30915m0717l11795J69053J54033
$$ 1615452 1504749 1468941 1334690 1633792 2165832 1734917 1694200 1382405 1551458 1705491
16879A705491N29058m28856K32639k20495j62927Q3803K70779l0852L41414p8720
$$ 1705491 2234549 1805693 2038332 1817837 1654910 1738713 2009492 1978640 2320054 2241334
16869B241334q5775j63985l4748r1187p2107L55519L34432k27811J5583j0050
$$ 2241334 2155559 1991574 1956826 1865639 1793532 2149051 2483483 2255672 2271255 2261205
16859B261205m4450l74396M78875k21633L93567R3395K4862k36860K92745m16104
$$ 2261205 2216755 1842359 2321234 2099601 2493168 2586563 2611425 2374565 2667310 2251206
16849B251206N62690l87220L03455j11445L91559j70581j37387J54565R4016n8888
$$ 2251206 2813896 2426676 2730131 2618686 3010245 2839664 2702277 2856842 2950858 2891970
16839B891970m11318N61091J22738J34659j17255M52669p60165L79502j37025
$$ 2891970 2480652 3041743 3164481 3299140 3181885 3634554 2874389 3253891 3116866
16830C116866O1213K1687K00967N30323k4275l94363K50955j93183R2298K36071
$$ 3116866 3178079 3199766 3400733 3931056 3906781 3512418 3763373 3570190 3662488 3898559
16820C898559J66412Q6905j83246J55760K3302Q7112J43114k4095J6514N14147
$$ 3898559 4064971 4151876 3968630 4124390 4147692 4234804 4377918 4353823 4370337 4884484
16810D884484l09205M19429j51438K97076P4193p5177L06664K20820K12006k00305
$$ 4884484 4575279 4994708 4843270 5140346 5214539 5139362 5446026 5666846 5878852 5678547
16800E678547L71040j9783O94189m04182J32200j72853O42248k84901K84064L70057
$$ 5678547 6049587 6029804 6723993 6319811 6452011 6279158 6921406 6636505 6920569 7290626
16790G290626J0708K75064J34829K08133J81419j40676O88771j36188O55783k0803
$$ 7290626 7301334 7576398 7711227 7919360 8100779 7960103 8648874 8512686 9168469 9147666
16780I147666K29339J68510L93824J28651J80565L41360K78601R8877J59006Q46469
$$ 9147666 9377005 9545515 9939339 10067990 10248555 10589915 10868516 10967393 11126399 11972868
16770A1972868L85682n3238M77906L69502O60534L60793O80588M3980N67142N30779
$$ 11972868 12358550 12305312 12783218 13152720 13813254 14174047 14854635 14898615 15465757 15996536
16760A5996536O57095N97526K78479Q03220N87783M09584R10755O74462J016698
$$ 15996536 16653631 17251157 17529636 18332856 18920639 19330223 20240978 20915440 21932138
16751B1932138N65659R84886P16631J328464J066612N39936J458894J312255J228576
$$ 21932138 22497797 23482683 24199314 25527778 26594390 27134326 28593220 29905475 31134051
16742C1134051J441175J635101J317480J690505K028799J922258K062631J948371
$$ 31134051 32575226 34210327 35527807 37218312 39247111 41169369 43232000 45180371
16734D5180371K401909K577107K700686K721191L697776K922343L568803L707687
$$ 45180371 47582280 50159387 52860073 55581264 59279040 62201383 65770186 69477873
16726F9477873M199795M752224M546895M641966N752162N750080N765736O453768
$$ 69477873 73677668 78429892 82976787 87618753 93370915 99120995 104886731 111340499
16718A11340499O534638P375735P068305P455360P731165P468610P729091P147851
$$ 111340499 117875137 125250872 132319177 139774537 147505702 154974312 162703403 169851254
16710A69851254P120381O572806N857755N151600L715295K801904J351229K57772
$$ 169851254 176971635 183544441 189402196 194553796 198269091 201070995 202422224 202679996
16702B02679996j277229k489396l849430m601240n947000o602788p245549p509515
$$ 202679996 201402767 198913371 195063941 190462701 184515701 177912913 170667364 163157849
16694A63157849p506751p896340p954948p692532p039610p176030o957221o403274
$$ 163157849 155651098 147754758 139799810 132107278 125067668 117891638 110934417 104531143
16686A04531143o226163n909691n398295n033798n064698l999735m598867l805017
$$ 104531143 98304980 92395289 86996994 81963196 76898498 72898763 68299896 64494879
16678F4494879l788548l152532l418959k539264k853729k973558k545938j699604
$$ 64494879 60706331 57553799 54134840 51595576 48741847 45768289 43222351 41522747
16670D1522747k456125j840122j904923j161147j955165j404037j420412j419416
$$ 41522747 39066622 37226500 35321577 34160430 32205265 30801228 29380816 27961400
16662B7961400j479512p02844j169553q60132j326533q69018o29183r62253q81889
$$ 27961400 26481888 25779044 24609491 23749359 22422826 21553808 20924625 19962372 19080483
16653A9080483p55460m97736n01916p68372k54711q82426m68056p50321r1237
$$ 19080483 18325023 17827287 17325371 16556999 16302288 15419862 14951806 14201485 14110248
16644A4110248p34946k99734n03010l01454l17893l89703o92502J63752l76795
$$ 14110248 13375302 13075568 12572558 12271104 11953211 11563508 10871006 11034758 10657963
16635A0657963l27211m53233j33934l62822l10895m70673o2088K09283r63437
$$ 10657963 10330752 9877519 9743585 9380763 9069868 8599195 8537107 8746390 7782953
16626G782953K39212k88235k29555j51566l56285L2277k09239L3172j40380n02462
$$ 7782953 8022165 7733930 7504375 7352809 6996524 7028801 6819562 6852734 6712354 6209892
16616F209892j5678j46201n5423k16445j09143N4690k71631n2449K4957l96330
$$ 6209892 6194214 6048013 5992590 5776145 5667002 5721692 5450061 5397612 5422569 5026239
16606E026239k12814j47391M6451L24445m7368j17689m29060Q8864n9511j71409
$$ 5026239 4813425 4666034 4712485 5036930 4989562 4871873 4442813 4531677 4472166 4300757
16596D300757n6416j26793k83111m5270L78173m03136L8547j62328r3220L41710
$$ 4300757 4244341 4117548 3834437 3789167 4167340 3764204 3802751 3640423 3547203 3888913
16586C888913k30994j91552l9870j76750k95735N68234l58673K02609j31587J44097
$$ 3888913 3657919 3466367 3426497 3249747 2954012 3522246 3163573 3366182 3234595 3378692
16576C378692j31210l66248M2599j74727N063r4896k8602J34413m73437O3654
$$ 3378692 3247482 2881234 2923833 2749106 2754169 2659273 2630671 2765084 2291647 2355301
16566B355301J71977k4819M7728R5972o74222N17978l25181j71441K64383l0948
$$ 2355301 2527278 2502459 2550187 2646159 1971937 2489915 2164734 1993293 2257676 2226728
16556B226728M5195m41359K32514J49638j18878O8511l08981J88945j84784j23030
$$ 2226728 2271923 1830564 2063078 2212716 2093838 2162349 1853368 2042313 1857529 1734499
16546A734499N3036O2472k6544N0902k81385K53032J04516j69507j04157j06589
$$ 1734499 1787535 1850007 1823463 1874365 1592980 1846012 1950528 1781021 1676864 1570275
16536A570275k26369K54542q9410p2817O8820j91084K11557J64792k88026k21892
$$ 1570275 1343906 1598448 1509038 1436221 1505041 1313957 1525514 1690306 1402280 1180388
16526A180388O64044o63968K81558l67843L8018P0337N7717J74706k50408r5004
$$ 1180388 1844432 1180464 1462022 1094179 1132197 1202534 1260251 1434957 1184549 1089545
16516A089545K09883P2374n8977k88188L60729m35460K73286J32776O3397l77023
$$ 1089545 1299428 1371802 1312825 1024637 1385366 949906 1223192 1355968 1419365 1042342
16506A042342p2171J14050l7720K66950j87740J36524k19672L40823m49875K5377
$$ 1042342 970171 1084221 1046501 1313451 1125711 1262235 1042563 1383386 933511 958888
16496I58888J0036o2780k64118K51822J37855Q7502J43780l21072k39220K71857
$$ 958888 968924 906144 642026 893848 1031703 1119205 1262985 941913 702693 974550
16486I74550j48642M8205M3058J54677l59355J89948q6086k26215J77111l0277
$$ 974550 825908 874113 917171 1071848 712493 902441 816355 590140 767251 736974
16476G36974M5718l12853K85847L250k26658J2556K88730q6534J91980q0140K2684
$$ 736974 782692 469839 755686 758936 532278 544834 833564 747030 939010 858870 881554
16465H81554l703k44887j39777M50392j48410l16307P0799J99516o3036M10824
$$ 881554 877851 632964 493187 943579 795169 478862 549661 749177 686141 1096965
16455A096965l98228O3950r2585J53870k72622k70257L51696r3191N7083j95270
$$ 1096965 698737 762687 670102 823972 551350 281093 632789 539598 596681 401411
16445D01411J96378J13347B98277J15793K23692j15438q309J77321k83349J91023
$$ 401411 597789 711136 298277 414070 637762 522324 514015 691336 407987 599010
16435E99010r8832p6427N6211o5386R3778A03064L03417J27592r2351K9143J595
$$ 599010 500178 423751 479962 414576 508354 103064 406481 534073 441722 470865 472460
16424D72460m0276K44356k85006K49050j63788R8887r4854K87776C56660K30789
$$ 472460 432184 676540 391534 640584 476796 575683 480829 768605 356660 587449
16414E87449l9290M03984D50541j69473R6537j58306L7530L42133J02230j49393
$$ 587449 548159 952143 450541 281068 377605 219299 256829 598962 701192 551799
16404E51799H6317M92447J7700j33988j71890J3733F3030O22870k45666o2695
$$ 551799 86317 578764 596464 462476 290586 304319 63030 685900 440234 377539
16394C77539K5205K18839j66929l9188J98841B21814J76538n0308A35268M8355
$$ 377539 402744 621583 454654 415466 614307 221814 398352 348044 135268 183623
16384A83623M75342l25804J5374a0000D35945j51046P915m3791m7753L2645K204
$$ 183623 658965 333161 348535 -10000 435945 284899 292814 249023 201270 233915 236119
16373B36119N8908K27133j25665j14461L3914J34060k02026J12514n6901k2971
$$ 236119 295027 522160 396495 282034 315948 450008 247982 360496 303595 280624
16363B80624l2319K11317A48024j2385R2465K85719j87821J3038J00491j45159
$$ 280624 248305 459622 148024 135639 228104 513823 326002 339040 439531 294372
16353B94372A13411K01784J87510J955j75111A58378J7720J44326h7210A59973
$$ 294372 113411 315195 502705 504660 329549 158378 176098 320424 -87210 159973
16342E91676B82106m1599L9361N29406A36160j9497k1900K03946H1318J82873
$$ 591676 282106 240507 279868 809274 136160 116663 94763 298709 81318 264191
16332B64191N2440A35539K85200p0912p8639J66048B10994L76148B83139j5792
$$ 264191 316631 135539 420739 349827 271188 437236 210994 587142 283139 267347
16322B67347H5662K63845j04292Q4758j46004r0998K05859M204Q152I5948L27986
$$ 267347 85662 349507 245215 329973 183969 92971 298830 303034 311186 95948 423934
16311D23934D6008K15375O2711j17899K9097Q3870J06678A81596K0614J16863
$$ 423934 46008 261383 324094 206195 235292 319162 425840 181596 202210 319073
16301C19073b57302B43411r2800B2929K3892R1467J80302j40715J01599K3685
$$ 319073 -257302 243411 150611 22929 46821 138288 318590 177875 279474 303159
16291C03159A19854D0554J21296b80867A29787k1512j3597R2162a3903I915J58524
$$ 303159 119854 40554 161850 -280867 129787 108275 94678 186840 -13903 9915 168439
16280A68439L0884J06123o5965N1637L6915A8447L79573A59719e7115F2873L26763
$$ 168439 199323 305446 239481 291118 328033 18447 398020 159719 -57115 62873 389636
16269C89636j23704G2447L0236l1190i4323B62726J294n4046o4893J22874p3593
$$ 389636 265932 72447 102683 71493 -94323 262726 264020 209974 145081 267955 194362
16258A94362n9127J66894A39866C9769Q5075J93546f5273C37591Q7891a42828
$$ 194362 135235 302129 139866 39769 124844 318390 -65273 337591 425482 -142828
16247a7316l50984a79295D2606J22288k9804a01083A23501J58235d9108B11490
$$ -17316 -368300 -179295 42606 164894 135090 -101083 123501 281736 -49108 211490
16236F2057K3760K06901b56253A32114n9052O0897R6681H7274A8160J40511L6561
$$ 62057 85817 292718 -256253 132114 73062 133959 230640 87274 18160 158671 195232
16225A95232D3832K03175C5200b6939C99665j89786H5371K20679j00837a89655
$$ 195232 43832 247007 35200 -26939 399665 209879 85371 306050 205213 -189655
16214B58892L9025a84210K1807C41060l0712j43691K7585a7630A75123g4344A26321
$$ 258892 297917 -184210 -162403 341060 310348 166657 194242 -17630 175123 -74344 126321
16202a47305B9660a52673f096o4590B04341b04804A77145J9482P2313p4189p2141
$$ -147305 29660 -152673 -6096 -70686 204341 -204804 177145 196627 268940 194751 122610
16191A22610Q4857b54534J22396I0193e1428A91049k5328b3737D20784D3865f4916
$$ 122610 207467 -254534 -132138 90193 -51428 191049 165721 -23737 420784 43865 -64916
16179A49290a20889D26302c07647A86482b1594A77905h9052J7498B01241f038
$$ 149290 -120889 426302 -307647 186482 -21594 177905 -89052 -71554 201241 -6038
16168C88432D4372P0064c12565a15331A29295c0325F9017J68858n4966f7788E1804
$$ 388432 44372 114436 -312565 -115331 129295 -30325 69017 237875 182909 -67788 51804
16156I0867l7980L3010J48965b7098C34357J4109h2621b6682j9362j10907g8149
$$ 90867 52887 85897 234862 -27098 334357 348466 -82621 -26682 -46044 -156951 -78149
16144f8784g603A85571k08m1391P5584J14599F7218A8105M4243a41093B34450
$$ -68784 -7603 185571 185363 143972 219556 334155 67218 18105 62348 -141093 234450
16132D94M67472H3309a72808A75188G0444J44363I8837d49789C04574j38033b00194
$$ 494 467966 83309 -172808 175188 70444 214807 98837 -449789 304574 166541 -200194
16120f9750k46114b8931A23947d9228r0923B6018K54593k3852b97516A58012a55652
$$ -69750 -315864 -28931 123947 -49228 -140151 26018 280611 256759 -297516 158012 -155652
16108a23089H9103g3804c0943D467J46617b2773l41419I1397a21132I6366a210
$$ -123089 89103 -73804 -30943 4467 151084 -22773 -364192 91397 -121132 96366 -1210
16096a165D6005K8748a27586p5563C08749a45530c3796B4634J96867a2673k60908
$$ -1165 46005 74753 -127586 -203149 308749 -145530 -33796 24634 221501 -12673 -273581
16085b73581B28045A6321a24411A59189A2469J4581a37462A88661n1179B1516
$$ -273581 228045 16321 -124411 159189 12469 27050 -137462 188661 137482 21516
16074a59917E4406J15630B9551b353D7598d01987B5401b68224H1723k1351d48111
$$ -159917 54406 170036 29551 -2353 47598 -401987 25401 -268224 81723 60372 -448111
16062A57506A6522d10543e5428A818a98013B37962a9851m7583A1337a44859F7322
$$ 157506 16522 -410543 -55428 1818 -198013 237962 -19851 -67434 11337 -144859 67322
16050a6980o7091j64202D9576a13778B10401a53105P5722A24378K33061A73983
$$ -16980 -84071 -248273 49576 -113778 210401 -153105 -77383 124378 357439 173983
16039h6859l17246A3473J09776c06392A0966K01995m1319d2771B58525i7369q8884
$$ -86859 -404105 13473 123249 -306392 10966 212961 171642 -42771 258525 -97369 -186253
16028a86253b1827H0376C9388M9531J65324b12309c1496C6067R6409C7191K4239
$$ -186253 -21827 80376 39388 88919 254243 -212309 -31496 36067 132476 37191 61430
16017F1430K32677b49971F9087A6142a62450G1445m226l0562J64278I0241L5035
$$ 61430 294107 -249971 69087 16142 -162450 71445 67219 36657 200935 90241 125276
16006A25276b42708b584B1924b37722C0492E766c8651k06942A3666M5610a13774
$$ 125276 -242708 -2584 21924 -237722 30492 5766 -38651 -245593 13666 59276 -113774
15994a76348Q4072k50063g3955p2014E642P4134J57685j08864a8513j23974A94738
$$ -176348 -92276 -342339 -73955 -145969 5642 79776 237461 128597 -18513 -142487 194738
15982a23681B29293a7441A47424M355B5503N0534b42706j45639B16403l2571E8881
$$ -123681 229293 -17441 147424 151779 25503 76037 -242706 -388345 216403 183832 58881
15970d37494A49294J79969I3502J24356I5863l1922L6214a61160A52662h7684
$$ -437494 149294 329263 93502 217858 95863 63941 100155 -161160 152662 -87684
15959h6144A11955f8387I1880b53457A3342e7299I5648b12710C2581d6105k74640
$$ -86144 111955 -68387 91880 -253457 13342 -57299 95648 -212710 32581 -46105 -320745
15948c20745R2905M3080B5777b5507m28978G5908b15105A15258a30564o9170H1816
$$ -320745 -227840 -184760 25777 -25507 -454485 75908 -215105 115258 -130564 -199734 81816
15936C52850a97539o715h5611A03331b23286E442j784J01476R5515g3214A453
$$ 352850 -197539 -204254 -85611 103331 -223286 5442 3658 105134 200649 -73214 1453
15924c6549m0024e364E8262a31769k34201J69951P8308e303r2368Q726d2045C37255
$$ -36549 -76573 -5364 58262 -131769 -365970 -196019 -117711 -5303 -97671 -88945 -42045 337255
15911g9885l6632k52556a16140p6278g5996k23179D6431a9446B11727r6108a66957
$$ -79885 -116517 -369073 -116140 -192418 -75996 -299175 46431 -19446 211727 115619 -166957
15899B20460c8287E7922a81076e0706B13810C9302A0457J17104d60814a45697
$$ 220460 -38287 57922 -181076 -50706 213810 39302 10457 127561 -460814 -145697
15888g9526A12585K1126J79666G556M29108A36485a28863B41320a63023r8958
$$ -79526 112585 133711 313377 7556 436664 136485 -128863 241320 -163023 -261981
15878b61981j03428a26992J6430N4308j06063B6706J9835f637o2613O879r2834
$$ -261981 -365409 -126992 -110562 -56254 -162317 26706 46541 -6637 -69250 -62371 -155205
15867a55205p4374a10262C64554A8896J37955A1716i7482A6087h000m9415K2104
$$ -155205 -229579 -110262 364554 18896 156851 11716 -97482 16087 -8000 -57415 -35311
15856c5311A38097b06477B8222L1742a74406A03226l1013b88950b0146j85419
$$ -35311 138097 -206477 28222 59964 -174406 103226 72213 -288950 -20146 -205565
15846b05565F398a864C61512e1971p3943A08384i3976A23205J08342A03837c22374
$$ -205565 6398 -1864 361512 -51971 -125914 108384 -93976 123205 231547 103837 -322374
15834g5198G3890K59434c81313i8097A31000o2636d38878d348a475p248o5359
$$ -75198 73890 333324 -381313 -98097 131000 68364 -438878 -4348 -1475 -8723 -74082
15823g4082a1818p6078A30170J70735j13817a22461j71733A00357c4046E6855
$$ -74082 -11818 -87896 130170 300905 187088 -122461 -294194 100357 -34046 56855
15812b09182n4111c1320k92017A11285h7383B0439a9723A20178e617l91429A56121
$$ -209182 -263293 -31320 -323337 111285 -87383 20439 -19723 120178 -5617 -397046 156121
15800D254b15418A18170A7245b3913l21521J04865k7676k27525A30155i7050l1766
$$ 4254 -215418 118170 17245 -23913 -345434 -240569 -268245 -495770 130155 -97050 -128816
15789a28816A25102C3530a25156m0519k58916a17855a3471j36875B1080b07455
$$ -128816 125102 33530 -125156 -165675 -424591 -117855 -13471 -150346 21080 -207455
15778A73073Q620o9485a99659N5555J6423M1890p1897A38886a69266f002p4309
$$ 173073 181693 112208 -199659 -144104 -127681 -85791 -157688 138886 -169266 -6002 -80311
15767h0311D1139a35804g006C8831j0008P6200C2446a13756i966l9663k01787
$$ -80311 41139 -135804 -7006 38831 28823 105023 32446 -113756 -9966 -49629 -251416
15756b51416d2241I3740a59153k3533i728k86788E9764Q0573a04796n7202P4774
$$ -251416 -42241 93740 -159153 -182686 -9728 -296516 59764 140337 -104796 -161998 -87224
15745h7224A60084a19899D6780B213J07265a6296A53496k6717g4032k07221J3526
$$ -87224 160084 -119899 46780 2213 109478 -16296 153496 126779 -74032 -281253 -267727
15734b67727Q1251a6143F5779A4004g2287F445a1239B903b7459q9149C6641a67289
$$ -267727 -186476 -16143 65779 14004 -72287 6445 -11239 2903 -27459 -116608 36641 -167289
15721A72059C8256a58172a7270k01880K218Q3501j14476e15A03909K24031b73824
$$ 172059 38256 -158172 -17270 -219150 -216932 -133431 -247907 -515 103909 327940 -273824
15709a69653f7537A78082C7651J31984N6127a19166C6055a15774B61350m8110
$$ -169653 -67537 178082 37651 169635 225762 -119166 36055 -115774 261350 213240
15699B13240G3380a4127B0273J40036j24i8427j3572A11383a47397d7190j57350
$$ 213240 73380 -14127 20273 160309 160185 -98427 -111999 111383 -147397 -47190 -204540
15688b04540d3488k12689I0862d5341j8282p9166N4534A96722a33399c0364n9559
$$ -204540 -43488 -256177 90862 -45341 -63623 -142789 -88255 196722 -133399 -30364 -89923
15677h9923G8827a99430B9958J235d281B75674j33289o1212a54414c2375o7584
$$ -89923 78827 -199430 29958 31193 -4281 275674 142385 81173 -154414 -32375 -99959
15666i9959o2321f2392l16665E5690b46677H5430a30397B06182q5122j3466J10013
$$ -99959 -162280 -62392 -379057 55690 -246677 85430 -130397 206182 121060 107594 217607
15655B17607K765a6937E5997k2851O3332a76409B2264J03496f7598C58846d7496
$$ 217607 220372 -16937 55997 33146 96478 -176409 22264 125760 -67598 358846 -47496
15643b31085B36702C1142J7705a27029C4627R9105h5311l32574A60522h7153K5334
$$ -231085 236702 31142 48847 -127029 34627 133732 -85311 -417885 160522 -87153 -61819
15632f1819E7584M2275J62437n4658O633b76361c7885j48491P3855j95754L5309
$$ -61819 57584 99859 262296 207638 214271 -276361 -37885 -186376 -112521 -308275 -272966
15621b72966g8807K2260C67150A24708b88453g9851b9020j19321k58664A52003
$$ -272966 -78807 -56547 367150 124708 -288453 -79851 -29020 -148341 -407005 152003
15610a10810a4825C41202i1218k22081I2989i7178K3088j25569D1429J3916b15783
$$ -110810 -14825 341202 -91218 -313299 92989 -97178 -74090 -199659 41429 55345 -215783
15598a02638C01823D4356d1014B79331o5467e1344I8406e8674a4976l065G6851
$$ -102638 301823 44356 -41014 279331 213864 -51344 98406 -58674 -14976 -18041 76851
15586G0263a21023H0949b82974A06811M8450D6343N4413d1971J431B66362c09330
$$ 70263 -121023 80949 -282974 106811 155261 46343 100756 -41971 -40540 266362 -309330
15574A38191A4615O7509M4744J685A0989i9404A95980g2051n7936F626a91462
$$ 138191 14615 82124 126868 128553 10989 -99404 195980 -72051 -129987 6626 -191462
15562C4836J47352C8015a19100l40663B70470I9669M3124F4900a07115j24539
$$ 34836 182188 38015 -119100 -459763 270470 99669 142793 64900 -107115 -231654
15552b31654A56991a04214M7941k68659A81424l1512J35851M3656j58981j7117
$$ -231654 156991 -104214 -56273 -324932 181424 149912 285763 329419 170438 153321
15542A53321N7925F982M29891h3977M0728l20946c0876j80409j38252J57687a5114
$$ 153321 211246 6982 436873 -83977 -43249 -364195 -30876 -211285 -349537 -191850 -15114
15530A03747k0665I84a35269r3823A32670D9754a51910d1202l35975A67889a58956
$$ 103747 83082 984 -135269 -229092 132670 49754 -151910 -41202 -377177 167889 -158956
15518b3189B5004i3546j38741G0362f9555B4567a14617k32f828A4036f3431E5347
$$ -23189 25004 -93546 -232287 70362 -69555 24567 -114617 -114849 -6828 14036 -63431 55347
15505I4113j5981b00282d0895D4724M1111A6511b48910B61578L1766A45103b07347
$$ 94113 78132 -200282 -40895 44724 85835 16511 -248910 261578 293344 145103 -207347
15493a51591A63762d7826k70071A06484b0226k42781b9845j71503D9907a40347
$$ -151591 163762 -47826 -317897 106484 -20226 -263007 -29845 -201348 49907 -140347
15482h9360H5501K97082a81812j41141a17604p6917H7611N4094r805a00467A37751
$$ -89360 85501 382583 -181812 -322953 -117604 -194521 87611 141705 131900 -100467 137751
15470a19716L9963b1500k0822E0775a73853a4386B64322J38738g4727d209B32478
$$ -119716 -79753 -21500 -42322 50775 -173853 -14386 264322 403060 -74727 -4209 232478
15458f3390B36837A13834k3549b69884A98566h1919Q795j62540b0004N927A18932
$$ -63390 236837 113834 90285 -269884 198566 -81919 -73124 -235664 -20004 -14077 118932
15446a01365k259E9080O1873a75103N4183E1526i5582B59096J04476c15399m2904
$$ -101365 -103624 59080 120953 -175103 -120920 51526 -95582 259096 363572 -315399 -358303
15435c58303h965j70186r7242R5160D2645c43370A85441n0903f9459c2313k15163
$$ -358303 -8965 -179151 -276393 -181233 42645 -343370 185441 134538 -69459 -32313 -247476
15424b47476B32337K53063A53150C1325J55a02710M8159l3123b1081A71905g2030
$$ -247476 232337 485400 153150 31325 31480 -102710 -54551 -87674 -21081 171905 -72030
15412a27543H4224N1633k6822J01195a17462A82966h5610m8858D36847c34504
$$ -127543 84224 135857 109035 210230 -117462 182966 -85610 -134468 436847 -334504
15401B43298j05228E9030a21690a2590m0799j34905A41275b26788P8317P2814
$$ 243298 138070 59030 -121690 -12590 -53389 -188294 141275 -226788 -148471 -75657
15391g5657I5004J56113a74093d5282k22271b4881A8599c41296a54270n1698C98606
$$ -75657 95004 251117 -174093 -45282 -267553 -24881 18599 -341296 -154270 -205968 398606
15379i257A37788M914h3817C3087f3560C9544K4582c48536m2465A07405N4980
$$ -9257 137788 142702 -83817 33087 -63560 39544 64126 -348536 -391001 107405 162385
15368A62385d3814B4286i573I2148c84114D74710k28319B713J40026f5071A44626
$$ 162385 -43814 24286 -9573 92148 -384114 474710 246391 2713 142739 -65071 144626
15356A3185a74893D2290b09855b9996B05640l2725b82454G8394c8991A4772a49962
$$ 13185 -174893 42290 -209855 -29996 205640 172915 -282454 78394 -38991 14772 -149962
15344H0690L4291H030J3902a69845C48758A63593d53377b02266R4609A35103a17645
$$ 80690 114981 8030 21932 -169845 348758 163593 -453377 -202266 -107657 135103 -117645
15332a71102b7370C07809a53697C24428H4928m1312h5348j93174G0512a54417
$$ -171102 -27370 307809 -153697 324428 84928 43616 -85348 -278522 70512 -154417
15321d4811A06477D8441b66909b4197c459m3436B93004e8995l8558n5091o9780
$$ -44811 106477 48441 -266909 -24197 -3459 -46895 293004 -58995 -97553 -152644 -222424
15310b22424B5586J90558J4886I8167N2053d64576C37245a80985L9770F1614b0099
$$ -222424 25586 216144 231030 98167 150220 -464576 337245 -180985 -141215 61614 -20099
15298d09935c1572B59929k4794m3065m7284J34362j33120D3301b73818A15538
$$ -409935 -31572 259929 235135 192070 144786 279148 146028 43301 -273818 115538
15287B7534b5773A7738K31859F8240D03K88196b5943A51331L47403i5188M7217
$$ 27534 -25773 17738 249597 68240 403 288599 -25943 151331 498734 -95188 -47971
15276d7971A5418K18797g586k01152a02432c9067A76955A1086g318B96182g1627
$$ -47971 15418 234215 -7586 -208738 -102432 -39067 176955 11086 -7318 296182 -71627
15264C02984p4161c7794J5600n2132e911A19898b23299I2573J2779J02917D4113
$$ 302984 228823 -37794 -22194 -74326 -5911 119898 -223299 92573 105352 208269 44113
15252A06856l5032b794j29056e3203j31732b7664G3439E90a8095E26137d4222
$$ 106856 71824 -2794 -131850 -53203 -184935 -27664 73439 590 -18095 526137 -44222
15240A92425j0584p7086m205J32094L90269L22553K22961j09450J3915l21406
$$ 192425 181841 104755 100550 232644 622913 945466 1168427 1058977 1072892 751486
15230G51486j32554A71500K07770A62769i2007D28423J5048A61953Q8442C3685
$$ 751486 618932 171500 379270 162769 -92007 428423 443471 161953 250395 33685
15219B32151m774F2027C0442M26374j71325A41941R4054Q0351A9210L00121b63443
$$ 232151 227377 62027 30442 456816 285491 141941 235995 316346 19210 319331 -263443
15207B0492J26677b60513F6928l326J14443g7846C69712h1174B0971J44631D3456
$$ 20492 147169 -260513 66928 63602 178045 -77846 369712 -81174 20971 165602 43456
15195a98051b6281A30014j6361A6923J1159J69104E6186J72690C9186P0842b98735
$$ -198051 -26281 130014 113653 16923 28082 197186 56186 228876 39186 110028 -298735
15183b006B2222a97329A19343O321A7733P8435M612J8614a26908F4389O4402j9084
$$ -2006 22222 -197329 119343 125664 17733 96168 100780 119394 -126908 64389 128791 109707
15171A09707J191K10869A39303a1073B98919A18712b47258e8221j9885m7694B58064
$$ 109707 110898 321767 139303 -11073 298919 118712 -247258 -58221 -78106 -125800 258064
15159g6940k37376A5814Q1544D4683a96240A14820a52021D22555f6109A07773
$$ -76940 -314316 15814 97358 44683 -196240 114820 -152021 422555 -66109 107773
15148i7057A58156J10028b4743C10228A14936K17692A14405j2569f0359j91464
$$ -97057 158156 268184 -24743 310228 114936 332628 114405 101836 -60359 -251823
15138b51823d0139a8227j07625K4589C00829d3188B65156b7948C35796A9824e231
$$ -251823 -40139 -18227 -125852 -101263 300829 -43188 265156 -27948 335796 19824 -5231
15126A91225p4804d2037B7951L00447I281a17167B34807B7138L3911M6356b26143
$$ 191225 116421 -42037 27951 328398 9281 -117167 234807 27138 61049 107405 -226143
15114E13893A17725c6051J405A61547m0780O0628p9009c323B33739a64831C3597
$$ 513893 117725 -36051 -34646 161547 120767 181395 102386 -3323 233739 -164831 33597
15102i6052b4309A44090F7877d811D06155A78b6902C3647J61692I1885J12467
$$ -96052 -24309 144090 67877 -4811 406155 178 -26902 33647 195339 91885 204352
15091B04352F9823b42923A39267a51244B83850A06489K81001F9751R0169f0407
$$ 204352 69823 -242923 139267 -151244 283850 106489 387490 69751 159920 -60407
15080F6899R1667J34371C0220N61753A50702J81792a9609B96844o0518m3488L1826
$$ 66899 158566 292937 30220 591973 150702 332494 -19609 296844 236326 192838 224664
15069B24664i8234A81050A8319J910N0298b29550L6878E7467R6886p5456N9619
$$ 224664 -98234 181050 18319 20229 70527 -229550 -192672 57467 154353 78897 138516
15058A38516l9088l4077J66225F3382N3892K43403H8073B9180L87216j55374r1865
$$ 138516 99428 65351 231576 63382 117274 360677 88073 29180 416396 261022 169157
15047A69157n6083m4572J73689r2234J09470j03202J38572N0630j48071f7986
$$ 169157 113074 68502 242191 149957 259427 156225 294797 345427 197356 -67986
15036A98713e0092F3971g0962D41154j33305H4410J35819r9705J54675R2491q5520
$$ 198713 -50092 63971 -70962 441154 307849 84410 220229 120524 275199 367690 282170
15025B82170F0543O2526J51876j29602N7270J99658D8397M21250k19837b4359
$$ 282170 60543 123069 274945 145343 202613 402271 48397 469647 249810 -24359
15014A78687P9766j05103M7451J67903j75689n9246J80601K11975B35562Q8226
$$ 178687 258453 153350 200801 368704 193015 133769 314370 526345 235562 323788
15004C23788J11366m510j38703J29099j26431o6842J63704P6444G8022O0726A6259
$$ 323788 435154 430644 291941 421040 294609 227767 391471 467915 78022 138748 16259
14992A85536r1079L4378M30905J9759j92806n9128G5718J4064N5220K56355N6254
$$ 185536 94457 128835 559740 579499 386693 327565 75718 89782 145002 401357 457611
14981D57611r7498B3010K83257J40487A84143L1075M8669a54173h860B55109J1731
$$ 457611 360113 23010 306267 446754 184143 215218 263887 -154173 -8860 255109 266840
14970B66840M32001C11185J56193A56771g4225A5940J01344J52498L5899j15420
$$ 266840 698841 311185 467378 156771 -74225 15940 117284 269782 305681 190261
14960A90261L12161k08099J7907E4688j9502M41478A74103K52340j54881Q3456
$$ 190261 502422 294323 312230 54688 35186 476664 174103 426443 271562 355018
14950C55018o5579L1819L45443B06303G918M19376A53040K19791A81143L20188
$$ 355018 289439 321258 666701 206303 7918 427294 153040 372831 181143 501331
14940E01331k46526l1014j05274E9207L90315K77g8738C848J67277K39042m6324
$$ 501331 254805 223791 118517 59207 449522 449799 -78738 3848 171125 410167 363843
14929C63843A18367M965J45732j8158F9023L5595M31499g2828D23355o0323Q2085
$$ 363843 118367 123332 269064 250906 69023 104618 536117 -72828 423355 363032 445117
14918D45117A64880L44162k4078o7717H8712C7728L71902B9977K65015A00912
$$ 445117 164880 509042 484964 417247 88712 37728 409630 29977 294992 100912
14907D39008j8356a23318C72903o8999L5944M4247j17654K67228H9153L09991
$$ 439008 420652 -123318 372903 303904 339848 384095 266441 533669 89153 399144
14897C99144K08699A97497M0123K19781A00668L85445o9421j02749l1651j23462
$$ 399144 607843 197497 237620 457401 100668 486113 416692 313943 282292 158830
14887A58830M22361J22887F7711M07295I6059L28945O089C2463J80637J8247J8338
$$ 158830 581191 704078 67711 475006 96059 425004 431093 32463 213100 231347 249685
14876B49685j18639K08608J32480o4175J09466B52649J12111K80645j11272j02219
$$ 249685 131046 339654 472134 407959 517425 252649 364760 645405 534133 431914
14866D31914B07433R9827M8357o2872J82881A66128L61975l2529B19984K22K08791
$$ 431914 207433 307260 355617 292745 475626 166128 528103 495574 219984 220206 428997
14855D28997D2834L06581J32080L9817k59169Q2632A40662L82927k58853J69115
$$ 428997 42834 349415 481495 521312 262143 344775 140662 523589 264736 433851
14845D33851M5386D8531J93477q5509L25413j41395K5370L0819P2192j35684J55115
$$ 433851 479237 48531 242008 156499 481912 340517 365887 396706 468898 333214 488329
14834D88329j22206A35051L80569Q2916D1686j8258J76071L3906J61313Q532j6065
$$ 488329 366123 135051 515620 598536 41686 23428 199499 233405 394718 403250 387185
14823C87185J36646A60909K78998B08133K57912J89550A20930M15530C8470M57303
$$ 387185 523831 160909 439907 208133 466045 655595 120930 536460 38470 495773
14813D95773j57988J55707j58167L61475B44309N59296A62874K55454j06813K16510
$$ 495773 337785 493492 335325 696800 244309 803605 162874 418328 311515 528025
14803E28025m3596J17625k48286J92111K17936j71172B93520O73411m77153B43633
$$ 528025 484429 602054 353768 545879 763815 592643 293520 966931 489778 243633
14792E83332j1891A72755K99963m032J84188k92742J12864j22331J27169L6777
$$ 583332 571441 172755 472718 468686 652874 360132 472996 350665 477834 514611
14782E14611K8624J90255A75124M92153A68701M01318K2198l6858L16459J50582
$$ 514611 543235 733490 175124 667277 168701 570019 592217 555359 871818 1022400
14772A022400A50368M09950M2212B84349L13146J62334l17583M72756C69905N62796
$$ 1022400 150368 560318 602530 284349 597495 759829 442246 915002 369905 932701
14762I32701k87943J65435J13042D03389J75160k23069K08638k26470J33785L27770
$$ 932701 644758 810193 923235 403389 578549 355480 564118 337648 471433 799203
14752G99203j27912J48842k41510K20048k26352L9798Q7985n0237K90281q696
$$ 799203 671291 820133 578623 798671 572319 612117 700102 649865 940146 931450
14742I31450m05497k5281P7645N6551l3282N11737m61544j55735J75395N7958
$$ 931450 525953 500672 578317 634868 601586 1113323 651779 496044 671439 729397
14732G29397M7033l32964j0258L32221L36613l84862J23512l7206l7312o8980
$$ 729397 776430 443466 433208 765429 1102042 717180 840692 803486 766174 697194
14722F97194K57755j51371j52818J54367j44137K87233l3839j81028n5209K15811
$$ 697194 954949 803578 650760 805127 660990 948223 914384 733356 678147 893958
14712H93958q5595K2076L0232j3419J7541K20212K6886J9099j50963l9564o3579
$$ 893958 808363 830439 860671 847252 864793 1085005 1111891 1130990 980027 940463 876884
14701H76884J02128k50576K61170D57468L00582J96564j15596q949k62740K12300
$$ 876884 979012 728436 989606 457468 758050 954614 839018 830069 567329 779629
14691G79629j16848J54688Q5189J06024O0460k63122j57638N37659j51513M1893
$$ 779629 662781 817469 902658 1008682 1069142 806020 648382 1186041 1034528 1076421
14681A076421j53119l38412M00913L75074n04980J73596K6148k47925K87410l00491
$$ 1076421 923302 584890 985803 1360877 855897 1029493 1055641 807716 1095126 794635
14671G94635L46946K369k47574L89958l91959k3429J2142K92151N3522p1091p8013
$$ 794635 1141581 1143950 896376 1286334 894375 870946 883088 1175239 1228761 1157670 1079657
14660A079657Q3921M8015k03288M77539o43822M82605j04467j21459r0145l6590
$$ 1079657 1163578 1211593 1008305 1485844 842022 1324627 1220160 1098701 1008556 971966
14650I71966O1989J03123l78723M66077J31932m0863N9338l50490K47888k56945
$$ 971966 1033955 1137078 758355 1224432 1356364 1315501 1374839 1024349 1272237 1015292
14640A015292K45863m8705J05318j95140Q0589j10242Q2003R9693R7551m39967
$$ 1015292 1261155 1212450 1317768 1122628 1203217 1092975 1174978 1274671 1372222 932255
14630I32255R9818J76508n2385K65879j50743K71578k94452n4953J76575l98252
$$ 932255 1032073 1208581 1156196 1422075 1271332 1542910 1248458 1193505 1370080 971828
14620I71828M80540O5163n8187l82128L91973m61008M66789J29958k70101K15079
$$ 971828 1452368 1517531 1459344 1077216 1469189 1008181 1474970 1604928 1334827 1549906
14610A549906M628j91817R1022k10777n2941N08568l43302L3022N3528J17612
$$ 1549906 1554534 1362717 1453739 1242962 1190021 1698589 1355287 1388309 1441837 1559449
14600A559449K5450m2694j31662J46118J75578k43549O7608J59383k85926J59422
$$ 1559449 1584899 1542205 1410543 1556661 1732239 1488690 1556298 1715681 1429755 1589177
14590A589177R0657K07932l85474J40118J37109k90577K69928k83015M85184k54225
$$ 1589177 1679834 1887766 1502292 1642410 1779519 1488942 1758870 1475855 1961039 1706814
14580A706814R9538j47471J09890l9328k09261N87710m807j53533m6086L2788
$$ 1706814 1806352 1658881 1768771 1729443 1520182 2107892 2103085 1949552 1903466 1936254
14570A936254K71369j16134N3572k62778R7830r8095j06652M428L78705M45845
$$ 1936254 2207623 2091489 2145061 1882283 1980113 1882018 1775366 1779794 2158499 2604344
14560B604344n96573L80108j84913m1780J48766K39421Q3208j90565J19391j49742
$$ 2604344 2007771 2387879 2202966 2161186 2309952 2549373 2632581 2442016 2561407 2411665
14550B411665K46423J27770K19903n23881L80984M2386L76417O1878M10616L91203
$$ 2411665 2658088 2785858 3005761 2481880 2862864 2905250 3281667 3343545 3754161 4145364
14540D145364J09857K27224N95928M11862J105116J122134K600470L975480P034132
$$ 4145364 4255221 4482445 5078373 5490235 6595351 7717485 10317955 14293435 21327567
14531B1327567J0633399j311845j2229594p101629m406969j541170j287532j50697
$$ 21327567 31960966 30649121 18419527 11317898 6910929 5369759 4082227 3931530
14523C931530p72788l81236j03214J04134j43304k06298L69642l25748K71722
$$ 3931530 3158742 2777506 2674292 2778426 2635122 2428824 2798466 2472718 2744440
14514B744440Q0195k59150J17117k81174J12106J12994l04147O4619K11689l02530
$$ 2744440 2824635 2565485 2682602 2401428 2513534 2626528 2322381 2387000 2598689 2296159
14504B296159R5374J25181K98842K2571j09330O9028k52195L08027J17190j73913
$$ 2296159 2391533 2516714 2815556 2838127 2728797 2797825 2545630 2853657 2970847 2796934
14494B796934J57850M9231J68747q9945j02013o4661M57023q3118O18538o47903
$$ 2796934 2954784 3004015 3172762 3082817 2980804 2916143 3373166 3290048 3908586 3260683
14484C260683m1888P2795K73951j03916K9264j75058L85746K20480k16369J29405
$$ 3260683 3218795 3291590 3565541 3461625 3490889 3315831 3701577 3922057 3705688 3835093
14474C835093l43568J79689k04915L48686J3234J55234j00281k02508J13414O10461
$$ 3835093 3491525 3671214 3466299 3814985 3828219 3983453 3883172 3680664 3794078 4404539
14464D404539k84068Q3838J80306J58327j82526r495J64832J24028L6083j80098
$$ 4404539 4120471 4204309 4384615 4542942 4360416 4350921 4515753 4639781 4675864 4495766
14454D495766L7378J60620J26563r0577K3629O6768j28818L9937L23115k49361
$$ 4495766 4533144 4693764 4820327 4729750 4753379 4820147 4691329 4731266 5054381 4805020
14444D805020J08173L92363J28093L33909l38118J4886K84243l09054J67527J54185
$$ 4805020 4913193 5305556 5433649 5767558 5429440 5444326 5728569 5419515 5587042 5741227
14434E741227J26354K53349J25034n310l95455J44261N67813k91900J41606P1787
$$ 5741227 5867581 6120930 6245964 6240654 5845199 5989460 6557273 6265373 6406979 6478766
14424F478766L554P6340L74566M0316k01654L78331K52513l59766l725K48523
$$ 6478766 6482320 6558660 6933226 6973542 6771888 7150219 7402732 7042966 7039241 7287764
14414G287764L47442J04862l0980j2786J27360J51590n5235L22123q5923J19857
$$ 7287764 7635206 7740068 7709088 7696302 7823662 7975252 7920017 8242140 8156217 8276074
14404H276074M01334o9147j16938N85491Q3306j78218J97717N43572k42220M53315
$$ 8276074 8677408 8608261 8491323 9076814 9160120 8981902 9179619 9723191 9480971 9934286
14394I934286l4399j59439R6635Q6738L89320J85820K8245K49237J1620L99373
$$ 9934286 9899887 9740448 9837083 9923821 10313141 10498961 10527206 10776443 10788063 11187436
14384A1187436L44853J56308j97761J82919M83682J51309L15719P4092o399M25239
$$ 11187436 11532289 11688597 11490836 11673755 12157437 12308746 12624465 12698557 12692158 13117397
14374A3117397M04874J18079M36236J01327O8598M30904L55171K15207K79989
$$ 13117397 13522271 13640350 14076586 14177913 14246511 14677415 15032586 15247793 15527782
14365A5527782L44863L85301K73734Q2302M13409M86875J81853N20128K85619
$$ 15527782 15872645 16257946 16531680 16613982 17027391 17514266 17696119 18216247 18501866
14356A8501866L14110K22258N99285M02900K84279P55906L88717L37633P16081
$$ 18501866 18815976 19038234 19637519 20040419 20324698 21080604 21469321 21806954 22523035
14347B2523035K38222N76346L13602Q96848L74134J63243P58501P66800N11642
$$ 22523035 22761257 23337603 23651205 24548053 24922187 25085430 25843931 26610731 27122373
14338B7122373Q05633Q55846P50064N68483O17394J023076M97607N46896J444830
$$ 27122373 27928006 28783852 29533916 30102399 30719793 31742869 32240476 32787372 34232202
14329C4232202O13895R12526R78338J208967N48951J330191J104385J103633J276982
$$ 34232202 34846097 35758623 36736961 37945928 38494879 39825070 40929455 42033088 43310070
14320D3310070J153558J714265J124007J309481J250862J761876J554691K081611
$$ 43310070 44463628 46177893 47301900 48611381 49862243 51624119 53178810 55260421
14312E5260421J370019K129764J698505J920256K143156K395206K137743K652583
$$ 55260421 56630440 58760204 60458709 62378965 64522121 66917327 69055070 71707653
14304G1707653K717423K491978K689128L129724L107479L556089L235302L754909
$$ 71707653 74425076 76917054 79606182 82735906 85843385 89399474 92634776 96389685
14296I6389685L828805M326927M181539M341090M785421N223692N475796N655696
$$ 96389685 100218490 104545417 108726956 113068046 117853467 123077159 128552955 134208651
14288A34208651N785423O209457O922732P213248P513361P641821Q921910Q507610
$$ 134208651 139994074 146203531 153126263 160339511 167852872 175494693 184416603 192924213
14280A92924213R283178R590369J0784414J0969452J1008926J1854110J2775700
$$ 192924213 202207391 211797760 222582174 233551626 244560552 256414662 269190362
14273B69190362J3173931J3746231J4323885J3791035J3640740J3768498J2438926
$$ 269190362 282364293 296110524 310434409 324225444 337866184 351634682 364073608
14266C64073608J1492715J1195839J0153143R737715R317445Q590642Q153449
$$ 364073608 375566323 386762162 396915305 406653020 415970465 424561107 432714556
14259D32714556P518489O248967L887404K182442J860752k230125n951789n038563
$$ 432714556 440233045 446482012 450369416 452551858 454412610 452182485 446230696 441192133
14251D41192133o870120r119386j0096672j0048850j1540421j2097006j2813651
$$ 441192133 434322013 425202627 415105955 405057105 393516684 381419678 368606027
14244C68606027j3359170j3451320j2546182j2742211j3155236j2564871j2391768
$$ 368606027 355246857 341795537 329249355 316507144 303351908 290787037 278395269
14237B78395269j1763077j2034471j1468406j1002960j0593828j0152554r850763
$$ 278395269 266632192 254597721 243129315 232126355 221532527 211379973 201529210
14230B01529210r718786r522353r037537q089751q266359p134872o644899o727573
$$ 201529210 191810424 182288071 173250534 165160783 156894424 149759552 143114653 136387080
14222A36387080n904814n649241n174760n631529m591978m298336m118876l983162
$$ 136387080 130482266 124833025 119658265 114026736 109434758 105136422 101017546 97034384
14214I7034384l597279l832967l501985l205332l209772k667807k933447k519801
$$ 97034384 93437105 89604138 86102153 82896821 79687049 77019242 74085795 71565994
14206G1565994k229060k396354k596399j946064k459214j630065j903240j238850
$$ 71565994 69336934 66940580 64344181 62398117 59938903 58308838 56405598 55166748
14198E5166748j940328j965336j445906j216663j341368j316964r05491j552460
$$ 55166748 53226420 51261084 49815178 48598515 47257147 45940183 45034692 43482232
14190D3482232j350839j174167j083069j342071q62371r45555q47024r88353r13141
$$ 43482232 42131393 40957226 39874157 38532086 37669715 36724160 35877136 34888783 33975642
14181C3975642j390800P923r80733r33086p74064l52732q89559o44089r22162
$$ 33975642 32584842 32592765 31612032 30678946 29904882 29552150 28662591 28018502 27096340
14172B7096340o59664n74102n70976n11540r02617k68640j21142r47159p6253
$$ 27096340 26436676 25862574 25291598 24780058 23877441 23608801 23487659 22540500 22464247
14163B2464247o37293m48240k80092o49075m15052j15190n12655k32303n80834
$$ 22464247 21826954 21378714 21098622 20449547 20034495 19919305 19406650 19174347 18593513
14154A8593513k50996j55061m57551l77496p4109n33221l15166j02945m50144
$$ 18593513 18342517 18187456 17729905 17352409 17278300 16745079 16429913 16326968 15876824
14145A5876824m2568p98363Q5077m12876k0502m80704j69087l22026L1846k43469
$$ 15876824 15834256 15035893 15120970 14708094 14687592 14206888 14037801 13715775 13747621 13504152
14135A3504152k71058M6445n11497j36078k58546o4998k01291m81602J27370J0622
$$ 13504152 13233094 13279539 12768042 12631964 12373418 12308420 12107129 11625527 11752897 11763519
14125A1763519p69899K82365l02365k56291P5251J9777k48643k18507k05707m11585
$$ 11763519 10993620 11275985 10973620 10717329 10792580 10812357 10563714 10345207 10139500 9727915
14115I727915J43199k42819k88048J15515n47367n0425J68423j62294J23292m74457
$$ 9727915 9871114 9628295 9340247 9455762 8908395 8857970 9026393 8864099 8987391 8512934
14105H512934o0294Q2460j87061k05302k99918j7839K94865m35564J47035k58803
$$ 8512934 8452640 8535100 8348039 8142737 7842819 7824980 8119845 7684281 7831316 7572513
14095G572513k06343L46768n42033K30385o7958n50033J50439k74901j23292J29621
$$ 7572513 7366170 7712938 7170905 7401290 7333332 6783299 6933738 6658837 6535545 6665166
14085F665166m4062J53750j81830n91782K19207P7540P8678l36936k6805K32418
$$ 6665166 6621104 6774854 6593024 6001242 6220449 6297989 6376667 6039731 6012926 6245344
14075F245344n57199k1216K42857k16248j3226n139J10495j56091m09765J63093
$$ 6245344 5688145 5666929 5909786 5693538 5680312 5675173 5785668 5629577 5219812 5382905
14065E382905j03181N2999K5745j61342k20693O1537l09028L41189l42865j00423
$$ 5382905 5279724 5332723 5358468 5197126 4976433 5037970 4728942 5070131 4727266 4626843
14055D626843K21939l41049J73694j85493J13641j80162k28646J37032K76314
$$ 4626843 4848782 4507733 4681427 4495934 4609575 4429413 4200767 4337799 4614113
14046D614113l04980L6776J19668j15906k2400l26188K42310l50669J82647m9243
$$ 4614113 4309133 4345909 4465577 4349671 4327271 4001083 4243393 3892724 4075371 4026128
14036D026128o0486m9133J58680m81642L23899k06523k7293L0344n78510K96192
$$ 4026128 3965642 3916509 4075189 3593547 3917446 3710923 3683630 3713974 3135464 3431656
14026C431656K41368j79927K47369m62291R9464J6267j16377J34225J83216l74481
$$ 3431656 3673024 3493097 3740466 3278175 3377639 3393906 3277529 3411754 3594970 3220489
14016C220489O7061M4381l75794J14736L23508P633k25405k58588Q8552k37585
$$ 3220489 3287550 3331931 2956137 3070873 3394381 3402014 3176609 2918021 3006573 2768988
14006B768988L55846j04995j48191k9443K6885J57687j66772j92085J88586M2940
$$ 2768988 3124834 3019839 2871648 2842205 2869090 3026777 2860005 2667920 2856506 2899446
13996B899446l85599j76271M32608J68744n3789j16445j66881j16924j31311M7081
$$ 2899446 2513847 2337576 2770184 2938928 2885139 2768694 2601813 2484889 2353578 2400659
13986B400659K32504L28624o28379p704M97433K28501K16003q0981L53347K89400
$$ 2400659 2633163 2961787 2333408 2325704 2823137 3051638 3267641 3186660 3540007 3829407
13976C829407R15464J93828J754270L330182O188175J1282102M156137j0088942
$$ 3829407 4744871 4938699 6692969 10023151 16211326 27493428 31649565 21560623
13968B1560623o999467m485905k154470j649089r06030p14180k88787l74570j47265
$$ 21560623 14561156 10075251 7920781 6271692 5365662 4651482 4362695 3988125 3840860
13959C840860p18710K74601K2826m48472R2023j90554l55549K62425j02737j00085
$$ 3840860 3122150 3396751 3419577 2971105 3063128 2872574 2517025 2779450 2676713 2576628
13949B576628Q0019p38708L92163J84931l349Q8582k04571j2790o7773l7791l9815
$$ 2576628 2656647 1917939 2310102 2495033 2491684 2580266 2375695 2362905 2295132 2257341 2217526
13938B217526k01489M12803n46665M32621l29616M51894n62119L99640j46797
$$ 2217526 2016037 2428840 1882175 2314796 1985180 2437074 1874955 2274595 2127798
13929B127798J40058k13661L00402j14193m07041M2014O2300K0494k69248J21104
$$ 2127798 2267856 2054195 2354597 2240404 1833363 1875377 1937677 1958171 1688923 1810027
13919A810027k20259K95135l20038K7842L96331k55025K27327l46454L70360j40648
$$ 1810027 1589768 1884903 1564865 1592707 1989038 1734013 1961340 1614886 1985246 1844598
13909A844598l32996Q9700K93891m01382J50030N0307j69112K82458j31718R6307
$$ 1844598 1511602 1601302 1895193 1493811 1643841 1694148 1525036 1807494 1675776 1772083
13899A772083j24496o8823Q0719P3242k29231o6602K81888l18079J58750l2091
$$ 1772083 1647587 1578764 1659483 1732725 1503494 1436892 1718780 1400701 1559451 1527360
13889A527360O675p1351Q7751J7643o8305J50854n46591K64145K26104n19571
$$ 1527360 1534035 1462684 1550435 1568078 1499773 1650627 1104036 1368181 1594285 1074714
13879A074714O10873p5179k05450j81747K48467J23949k52966J13417R3993m38925
$$ 1074714 1685587 1610408 1404958 1223211 1471678 1595627 1342661 1456078 1550071 1111146
13869A111146J64030j73928Q5586m9342K45216k71344P7474J81664j21842J77101
$$ 1111146 1275176 1101248 1186834 1137492 1382708 1111364 1188838 1370502 1248660 1425761
13859A425761j39757N1364o4439k2770L25092n82109J55964k10387M72585j90324
$$ 1425761 1286004 1337368 1272929 1250159 1575251 993142 1149106 938719 1411304 1220980
13849A220980P0996j69951N5703l01579K30384k13180R1608L00680l39138K84991
$$ 1220980 1291976 1122025 1177728 876149 1106533 893353 984961 1285641 946503 1231494
13839A231494J98328k06446j30384r5176J1000L78601k88852q3608o6561J07712
$$ 1231494 1429822 1223376 1092992 997816 1008816 1387417 1098565 1014957 948396 1056108
13829A056108J95614j88020l4660l8333R1494L2791K21402n02889J11247L79258
$$ 1056108 1251722 1063702 1029042 990709 1082203 1114994 1336396 833507 944754 1324012
13819A324012J4538m25263j88076L34631J01868n8300j41934l71547L96303J31781
$$ 1324012 1338550 913287 725211 1059842 1161710 1103410 961476 589929 986232 1118013
13809A118013k42521K38064O5619j44093j55748K2855k03529N87383m02821q2699
$$ 1118013 875492 1113556 1179175 1035082 879334 902189 698660 1286043 883222 800523
13799H00523O6443N831k2895J20594j65752K96250l71740K02337k39970K75509
$$ 800523 866966 872797 849902 970496 804744 1100994 729254 931591 691621 967130
13789I67130j35759J21269q5135M3309o5524q7271J56313q6449K0894j34963K57382
$$ 967130 831371 952640 867505 910814 845290 758019 914332 827883 848777 713814 971196
13778I71196l21748L69142m16487k2992K8317M02577j03916k95888K69001q8938
$$ 971196 649448 1018590 602103 579111 607428 1010005 906089 610201 879202 790264
13768G90264Q4404P7386k01031j08595K47100k3925P7200k14000J40284P1841
$$ 790264 874668 952054 751023 642428 889528 865603 942803 728803 869087 940928
13758I40928j81896J08060k1268k67938K41581m6828j06700l0754J30540k17763
$$ 940928 759032 867092 845824 577886 819467 772639 665939 635185 765725 547962
13748E47962K82872C07321P00915k35916j32178J00359p1982Q5887J42669l26848
$$ 547962 830834 307321 1008236 772320 640142 740501 668519 754406 897075 570227
13738E70227N7700K93720k7516N1160D18038M93818j81643J56827p0896o3516
$$ 570227 627927 921647 894131 945291 418038 911856 730213 887040 816144 752628
13728G52628M1397J59962l21718J66149J01590J28953m25302q4630N32707m23067
$$ 752628 794025 953987 632269 798418 900008 1028961 603659 519029 1051736 628669
13718F28669K3229K18460C81914K78020L8093j39395R5220C24403J65426N3870
$$ 628669 651898 870358 381914 659934 698027 558632 653852 324403 489829 543699
13708E43699N81829n45986o1204J34656q1518M04151m44723l4500J60732J20491
$$ 543699 1125528 579542 518338 652994 571476 975627 530904 496404 657136 777627
13698G77627j44631O6333Q3730J66092l29653j47622Q4262M19722C99493R4662
$$ 777627 632996 699329 783059 949151 619498 471876 556138 975860 399493 494155
13688D94155J70889j37647L24849k24163j85566K86399k45469L15097j42058o5132
$$ 494155 665044 527397 852246 628083 442517 728916 483447 798544 656486 591354
13678E91354J61126k01475j80886A65462L70106j59822J56643J45746K6428m1734
$$ 591354 752480 551005 370119 165462 535568 375746 532389 678135 704563 662829
13668F62829K54216j87555j05474j34142B39893K33984K0399J19711k99721J46796
$$ 662829 917045 729490 624016 489874 239893 473877 494276 613987 314266 461062
13658D61062K67929l27904L9758J01737m9195L6860K40167B08771L11961J78542
$$ 461062 728991 401087 440845 542582 493387 530247 770414 208771 520732 699274
13648F99274j53592j41124L18152l57461J3843K20376k69078R6704A47208L52693
$$ 699274 545682 404558 722710 365249 379092 599468 330390 427094 147208 499901
13638D99901J22424C6479M05793j19622K20752K62779k06038k93353K57911j23166
$$ 499901 622325 36479 442272 322650 543402 806181 600143 306790 564701 441535
13628D41535J65055j28250j6279J27508A87533L18416j75880C2987O36760l03181
$$ 441535 606590 478340 462061 589569 187533 505949 330069 32987 669747 366566
13618C66566r1642N8108L00958B33687K39847M5671B11643K38089N0135B45930
$$ 366566 274924 333032 633990 233687 473534 519205 211643 449732 499867 245930
13607C84037L6101Q9643K2723j11389J21423l6332K6813o4376j20780k8195R6718
$$ 384037 420138 509781 532504 421115 542538 506206 533019 468643 347863 319668 416386
13596D16386k4745j34853L24921r5642Q1958A89138J47480j48444L48576j92344
$$ 416386 391641 256788 581709 486067 568025 189138 336618 188174 536750 344406
13586C44406J28866l2420A32669M80996J2173k77729K58078B16939L1242D5634
$$ 344406 473272 440852 132669 613665 625838 348109 606187 216939 248181 45634
13575C22765p0972R5825J98232B50894N32903A69981F3089M32443A87870L5433
$$ 322765 251793 347618 545850 250894 783797 169981 63089 495532 187870 223303
13565B23303J95080l012l9432O4353A97386D5899N44045B26940L72447k0823l4226
$$ 223303 418383 415371 375939 440292 197386 45899 589944 226940 599387 578564 544338
13554E44338n4177q9234p145n0878q3044L88894j19296B12684b3449D18931j73996
$$ 544338 490161 400927 393782 342904 259860 648754 529458 212684 -23449 418931 244935
13543B44935j01112L67782A20803d9330E59449j57092L6478j64191N3632e9891
$$ 244935 143823 511605 120803 -49330 559449 402357 438835 274644 328276 -59891
13532C52753J48119j31685K1363J12314j65534O9646j72315j11638L78625j59143
$$ 352753 500872 369187 390550 502864 337330 406976 234661 123023 501648 342505
13522C42505J01478j02394P1172K06068k57369M9739b4194F29506l08781A31885
$$ 342505 443983 341589 412761 618829 361460 411199 -24194 629506 320725 131885
13511D58555J26171j51901j74376I8471M1249K50037J65698B04922L84094A0956
$$ 458555 584726 432825 258449 98471 139720 389757 555455 204922 589016 10956
13500B29102A4166L40409O51C6638L25593K80915B95684F9581N5175A6512R8974
$$ 229102 14166 354575 355226 36638 362231 643146 295684 69581 124756 16512 115486
13489A15486L6966Q6785K76052j98748J9068A06915k3805P1500K25364B0692K51332
$$ 115486 152452 239237 515289 316541 335609 106915 83110 154610 379974 20692 272024
13478B72024J54788M5023O1305A58582J11833F5337J19594K1797O1517L34334
$$ 272024 426812 471835 533140 158582 270415 65337 184931 206728 268245 602579
13468F02579J9097m3121j69944j52900K06377g221E46763n0245l9031k22531A14313
$$ 602579 621676 578555 408611 255711 462088 -7221 546763 496518 457487 234956 114313
13456B85722J46922K93203A22814c5458D34617r1386l7522K0122J54143C1842
$$ 285722 432644 725847 122814 -35458 434617 343231 305709 325831 479974 31842
13445H4330h276C13576k3888Q4672j34954k8773K44520G9878J23319Q0820P0441
$$ 84330 -8276 313576 289688 374360 239406 210633 455153 79878 203197 284017 354458
13434C54458P5330J1914J35808B65455J10512A68314K17706P5078A02975K64103
$$ 354458 429788 441702 577510 265455 375967 168314 386020 461098 102975 367078
13424C67078j79734D9656k1505J14339K10697r6013K8280a02684E25434m9532
$$ 367078 187344 49656 28151 142490 353187 257174 285454 -102684 525434 475902
13414D75902B24439p8609m5518M85664h9830B74178A14990M1162k6470J20222
$$ 475902 224439 145830 100312 585976 -89830 274178 114990 156152 129682 249904
13404B49904n4436m9228G2803a55885A42825R4753J35219p1390B5544J34053L7344
$$ 249904 195468 146240 72803 -155885 142825 237578 372797 301407 25544 159597 196941
13393A96941n1703J22329j33141n5440a27777B74141P3589P3387I8575J98889
$$ 196941 145238 267567 134426 78986 -127777 274141 347730 421117 98575 297464
13383B97464m8995E2184P5253M75714D349J02193D8440J88549j06329R1773L72753
$$ 297464 248469 52184 127437 603151 4349 106542 48440 236989 130660 222433 595186
13372E95186B75643J31529l5647A36099j8347B1861g4213E42717B68670O0750
$$ 595186 275643 407172 371525 136099 117752 21861 -74213 542717 268670 329420
13362C29420c9320B25392j10304J96558l6950k8050J05873i1056E20487j41858
$$ 329420 -39320 225392 115088 311646 274696 246646 352519 -91056 520487 378629
13352C78629J6710j60389J47781j71403J2003r8221h1656B46150K26440g0288
$$ 378629 395339 234950 382731 211328 223331 125110 -81656 246150 472590 -70288
13341B69622K3754A733b2007E37066B09493N3063J38479A12730K10962K00272
$$ 269622 293376 1733 -22007 537066 209493 262556 401035 112730 323692 523964
13331E23964G823K72438J16255N4042k02526l0637k85F1962N15419m2412A48773
$$ 523964 7823 280261 396516 450558 248032 217395 217110 61962 577381 534969 148773
13319I4670J00743g5683E08021A39414J48267q0044k9888n3985n0838K42577e5134
$$ 94670 195413 -75683 508021 139414 287681 207637 177749 123764 72926 315503 -55134
13307A55741j6809L26474m6651r8002K90179A27654J22461o5777o3348c7234A90392
$$ 155741 138932 465406 418755 320753 610932 127654 250115 184338 120990 -37234 190392
13295D36089C4290J23591J47122c1531B42280c5576A18418J8152A7051M20477
$$ 436089 34290 157881 305003 -31531 242280 -35576 118418 136570 17051 437528
13285D37528B08618K50989a57160A49110O7003a04187B15856J31085B1883J59932
$$ 437528 208618 459607 -157160 149110 216113 -104187 215856 346941 21883 181815
13275A81815g1423m7601C65161H9849h7234A56079j0830b42925E43594E1554J49229
$$ 181815 -71423 -119024 365161 89849 -87234 156079 145249 -242925 543594 51554 200783
13264B00783D061J60574D8489N21141k81619b42912A84807o5866K7680L2352e8873
$$ 200783 4061 164635 48489 569630 288011 -242912 184807 118941 146621 178973 -58873
13252E53707I2076K05516K7245j49794N12821B0459J39418b4300B47057K2699
$$ 553707 92076 297592 324837 175043 687864 20459 159877 -24300 247057 269756
13242B69756C6594O9278M7477O3812m1586K88938a55139A5221e0588B73815J12385
$$ 269756 36594 105872 153349 217161 175575 464513 -155139 15221 -50588 273815 386200
13231C86200A63073E8439a20402B40305K544A16313L9326J72046L23152c7385
$$ 386200 163073 58439 -120402 240305 242849 116313 155639 327685 650837 -37385
13220B22148a7897C16124k9747a4338I690K64125a56006B95538n0383J26135A10166
$$ 222148 -17897 316124 286377 -14338 9690 273815 -156006 295538 245155 371290 110166
13208C21894E1501K45126j11438J31028L3974j53878H9060K57K06884D3072J00801
$$ 321894 51501 296627 185189 316217 350191 196313 89060 89317 296201 43072 143873
13197A43873a86025C11315j18815K2266q8122d9392C67575G7993L1690l9132p500
$$ 143873 -186025 311315 192500 214766 126644 -49392 367575 77993 109683 70551 63051
13186F3051R92k0078J04071E4389h0540I0513R7432J54586b11243I4992M01756
$$ 63051 64043 43965 148036 54389 -80540 90513 187945 342531 -211243 94992 496748
13175D96748c39638B5692d0704C14149A41997o9153Q635j2746J52580L3339J39663
$$ 496748 -339638 25692 -40704 314149 141997 72844 81479 68733 221313 254652 394315
13164C94315C8415a04215B24105L717j3691I5516j0304b08464A54540k5711A4042
$$ 394315 38415 -104215 224105 227822 214131 95516 85212 -208464 154540 128829 14042
13152i448H6790f3877F122N79286a39747D17770I0961d25943B42336g7412E8698
$$ -9448 86790 -63877 6122 585408 -139747 417770 90961 -425943 242336 -77412 58698
13140c3976A45901b0406k3723k0090m6875k907C35749E5361K15813p3982b53647
$$ -33976 145901 -20406 -44129 -64219 -111094 -114001 335749 55361 271174 197192 -253647
13128A00191K11578o1169C4727L47990F0281h0454A39099Q5796d348n8523A64080
$$ 100191 311769 250600 34727 382717 60281 -80454 139099 224895 -4348 -62871 164080
13116b7510F8264c53342A35392g6555B42162a72305I5050Q5439B3666b27250E6438
$$ -27510 68264 -353342 135392 -76555 242162 -172305 95050 180489 23666 -227250 56438
13104e9725r4169A41819K11435d9842J5358E48809a14826B7952P1629P1745F944
$$ -59725 -153894 141819 353254 -49842 -34484 548809 -114826 27952 99581 171326 6944
13092C44588a25037A17517M33580k61728c90332B62142q1887m8477o5280A3353
$$ 344588 -125037 117517 551097 289369 -390332 262142 180255 131778 66498 13353
13081b96330A38515b03169f5285A96018o3752M9313F5348k7433K21557f1929C61245
$$ -296330 138515 -203169 -65285 196018 132266 181579 65348 37915 259472 -61929 361245
13069h9173E9585J29959J40129b82972a23606A36904J61739G4997c1226C42088
$$ -89173 59585 189544 329673 -282972 -123606 136904 298643 74997 -31226 342088
13058B11359A2346J59747E3778a0183H2200b46998A42713n202B9826M9815f4549
$$ 211359 12346 172093 53778 -10183 82200 -246998 142713 137511 29826 79641 -64549
13046B14067b69275a22906A02886M38782k10233E9782a49018A53641A2994D643
$$ 214067 -269275 -122906 102886 541668 331435 59782 -149018 153641 12994 4643
13035B8236J76166L6278C9427j0951a16932I9449J21562k885q2340J63438a32821
$$ 28236 204402 240680 39427 28476 -116932 99449 221011 218126 135786 299224 -132821
13023a78161A70219d2833B34000a03886g04C30113a47100B25844h1285C35663
$$ -178161 170219 -42833 234000 -103886 -704 330113 -147100 225844 -81285 335663
13012f7770A02731N1569a08650A50609J05476a5757C00069o7581q8136o9663J27283
$$ -67770 102731 154300 -108650 150609 256085 -15757 300069 232488 144352 74689 201972
13001B01972G8383J27687J37930d4306I5483a45C54241E7747R982Q4306m5668
$$ 201972 78383 206070 344000 -44306 95483 -145 354241 57747 67729 152035 106367
12990A06367m4335d804j11800A78984H995c3155A00737L53155k17387F5558b83571
$$ 106367 62032 -4804 -116604 178984 8995 -33155 100737 453892 236505 65558 -283571
12978B79771a37690E56378f3230A91992Q4421q7452q7144b91031h330k91992C21504
$$ 279771 -137690 556378 -63230 191992 276413 188961 101817 -291031 -8330 -300322 321504
12966D9968Q3796g989A60340A0673b6205C75438a2928A19664a47343b5775k99649
$$ 49968 133764 -7989 160340 10673 -26205 375438 -12928 119664 -147343 -25775 -325424
12955c25424F6611c7305B56854J56902a12181A96714j582a23765B88399d21914
$$ -325424 66611 -37305 256854 413756 -112181 196714 195132 -123765 288399 -421914
12944B59307D9910J91405J28650j38828I6196d9616q0476H6642J0296a41171B23083
$$ 259307 49910 241315 369965 231137 96196 -49616 -130092 86642 96938 -141171 223083
12932B74201b94777A77734F170N9714N8683D5377K38885a48704B83563j25988
$$ 274201 -294777 177734 6170 65884 124567 45377 284262 -148704 283563 157575
12922A57575d08104H3775K50589b28739A48996a57424m2289B0616J6584J86159
$$ 157575 -408104 83775 334364 -228739 148996 -157424 -199713 20616 37200 223359
12912B23359j6314n2566d04108b5272j83461A3203a112j6910B11158B012K3646
$$ 223359 207045 154479 -404108 -25272 -208733 13203 -1112 -18022 211158 2012 25658
12901B5658N1716k7162L07374a88163B53738i7689A73024J64635g9752B05324
$$ 25658 77374 50212 357586 -188163 253738 -97689 173024 337659 -79752 205324
12890A75313E4469a85090A40514a49253F8715L28237I6822e9333k06380i2864
$$ 175313 54469 -185090 140514 -149253 68715 396952 96822 -59333 -265713 -92864
12879d82H35K1660a4651j56514A01614J12814a82254A82589E335J05958A5448
$$ -482 835 22495 -14651 -171165 101614 214428 -182254 182589 5335 111293 15448
12867I5773b22302J9892R6376A80090a01407B89135B9921e0610j45513e573r6507
$$ 95773 -222302 -202410 -106034 180090 -101407 289135 29921 -50610 -196123 -5573 -102080
12856a02080B16969A08039j8746a9487j05792a3285A43658C9938J25759o4271
$$ -102080 216969 108039 89293 -19487 -125279 -13285 143658 39938 165697 101426
12846A01426b65025Q8161B74971a07276q1209i637A02956H707J14826b6635B72425
$$ 101426 -265025 -176864 274971 -107276 -188485 -9637 102956 8707 123533 -26635 272425
12834E3940a14008n322A08882A5147J65516M4653c0698m6983D02398A90045D3549
$$ 53940 -114008 -119330 108882 15147 180663 225316 -30698 -77681 402398 190045 43549
12822b47062A95806l9958a59704B57587E243h6624C4468K8741f2391C87795e329
$$ -247062 195806 155848 -159704 257587 5243 -86624 34468 63209 -62391 387795 -5329
12810a48315i784o0502q7418A03910a53215N3218n5301B097a28656C22072e4582
$$ -148315 -9784 -70286 -157704 103910 -153215 -99997 -155298 2097 -128656 322072 -54582
12798A08607a43825B70905a00946A5591d1302b0202A22870e1020j38713A467a1461
$$ 108607 -143825 270905 -100946 15591 -41302 -20202 122870 -51020 -189733 1467 -11461
12786C37155C2156K62365e8692G0165J53054e3514J1819F3310a3041K712j68693
$$ 337155 32156 294521 -58692 70165 223219 -53514 -41695 63310 -13041 -10329 -179022
12775a79022B00834k5853B0596N6416D817M5827a21493C7247a6659j31126A9820
$$ -179022 200834 174981 20596 77012 4817 50644 -121493 37247 -16659 -147785 19820
12763E1123b19975j63419J72264N7028A00076R277J61442f0227j72435A91768
$$ 51123 -219975 -383394 -211130 -154102 100076 109353 270795 -60227 -232662 191768
12752c6497E3811b43966A27084a2882j6664k7787B82203r6894J90752A4216O6918
$$ -36497 53811 -243966 127084 -12882 -29546 -57333 282203 185309 376061 14216 81134
12741H1134J33017a62414I1921b9966n3042c0823B7135K79860h9832I838J85504
$$ 81134 214151 -162414 91921 -29966 -83008 -30823 27135 306995 -89832 9838 195342
12730A95342o7202d9012A5698c51566a61207p7904A05893a92821I4953K72007
$$ 195342 128140 -49012 15698 -351566 -161207 -239111 105893 -192821 94953 366960
12720C66960A02102Q2215n2507a55546m0457F5973K20929J10365C5508P8053b22381
$$ 366960 102102 184317 131810 -155546 -196003 65973 286902 397267 35508 113561 -222381
12708A31975g3812a9796B64269p6461M3703l4158h1349A12102b22629e5153R313
$$ 131975 -73812 -19796 264269 187808 231511 197353 -81349 112102 -222629 -55153 -45840
12697d5840E06354D2177a8335o0867D93762a68924A29403J9699P9787j2539O2395
$$ -45840 506354 42177 -18335 -79202 493762 -168924 129403 149102 228889 216350 278745
12686B78745i4023J8354l1431G5212J3293a37951A08074b15339b2159A2572i7094
$$ 278745 -94023 -75669 -107100 75212 88505 -137951 108074 -215339 -22159 12572 -97094
12674A36315n9924J57696g7413A37163J70041A06275M6408F2778k8131h7434j18550
$$ 136315 76391 234087 -77413 137163 307204 106275 152683 62778 34647 -87434 -205984
12663b05984d1447A34753J97040B1910O9937b93051B1567G14b5813E4560f30B02811
$$ -205984 -41447 134753 331793 21910 91847 -293051 21567 714 -25813 54560 -630 202811
12650f0157b8196A39216J54481j17835a6570A6786c9553n5658B31252d8627C25804
$$ -60157 -28196 139216 293697 175862 -16570 16786 -39553 -95211 231252 -48627 325804
12638A57161a05554A61692j2644D9650n680J12496b1165F38983k92604A34981
$$ 157161 -105554 161692 149048 49650 43970 156466 -21165 638983 346379 134981
12627F9834a1032A79136j7294a3069j18278A84409P1339m7786Q8413e0892A804
$$ 69834 -11032 179136 161842 -13069 -131347 184409 255748 207962 296375 -50892 1804
12615b53760C48066A09850l9334c7696A20408J51295b4390A81259J9873B8499
$$ -253760 348066 109850 70516 -37696 120408 271703 -24390 181259 201132 28499
12604D54375H7596k7153J3275f7733H4931o66Q7408M5248b03514C920K889b84584
$$ 454375 87596 60443 73718 -67733 84931 84265 171673 216921 -203514 3920 6809 -284584
12591A51219A725J29170A6558K20744a5753B99989p4547l9820p2491D4889L26043
$$ 151219 1725 130895 16558 237302 -15753 299989 225442 185622 113131 44889 370932
12580C70932C7971P8369b97902a20201E5006P5421k2633j3701J67430e4179B97277
$$ 370932 37971 116340 -297902 -120201 55006 130427 107794 94093 261523 -54179 297277
12568a4647l4077j7259L0616D64182a21878m8183g3567A11445B0032M3049a22962
$$ -14647 -48724 -65983 -35367 464182 -121878 -170061 -73567 111445 20032 63081 -122962
12556a66794C83661j84854I490b88117B2267b5562A4938h7611K4480l4772b0663
$$ -166794 383661 198807 9490 -288117 22267 -25562 14938 -87611 -63131 -97903 -20663
12544a12411K9816A51391C6576Q5302D6449a25731J9741C01270k4185q8583r0272
$$ -112411 -82595 151391 36576 121878 46449 -125731 -105990 301270 277085 188502 98230
12533I8230a05140a7851n3544l7050D5552a57024B4674b65813J10495L9388A91801
$$ 98230 -105140 -17851 -71395 -108445 45552 -157024 24674 -265813 -155318 -115930 191801
12521D4190L2112a18690A35114D0078b18524D9024A6963J360J07692h8553C32375
$$ 44190 76302 -118690 135114 40078 -218524 49024 16963 18323 126015 -88553 332375
12509C36254a13415N203H2859k2933L48998h355k4749A89301K21093f4712j32302
$$ 336254 -113415 -108212 82859 59926 408924 -8355 -33104 189301 410394 -64712 -197014
12498a97014A65515a21901E0034O8351a70652l3827B0969g4427a9251k0864a8547
$$ -197014 165515 -121901 50034 118385 -170652 -204479 20969 -74427 -19251 -40115 -18547
12486g1538D37051b19473H1307a87707A39035o6842M1723b81688A14681J25816
$$ -71538 437051 -219473 81307 -187707 139035 72193 113916 -281688 114681 240497
12476B40497G0008K14153a43047e2046B50571b19273A18928Q0194a95841f1917
$$ 240497 70008 284161 -143047 -52046 250571 -219273 118928 199122 -195841 -61917
12465b90621i5802C5882M2943L8400C2640c6879J7068j80824O802H5373a77774
$$ -290621 -95802 35882 78825 117225 32640 -36879 -19811 -200635 -193833 85373 -177774
12453b09502B86619b27554c3942A79072a1876I7072J7837B7571L6820P7407F9975
$$ -209502 286619 -227554 -33942 179072 -11876 97072 114909 27571 64391 141798 69975
12441A98968g8513A33692N0697E9643e7283A57547a25119a9526A62674a64693
$$ 198968 -78513 133692 184389 59643 -57283 157547 -125119 -19526 162674 -164693
12430a33517m8767m2803B08723D3397J15326k7393e501H1369R303f2604o8544
$$ -133517 -182284 -225087 208723 43397 158723 131330 -5501 81369 90672 -62604 -131148
12419a31148j48700c514D8762J67463J57362A58204a52660A3204K01128I288a73680
$$ -131148 -279848 -3514 48762 216225 373587 158204 -152660 13204 214332 9288 -173680
12407f1866A21547d967A66101b4109E2732b39371E4739A5410M3032K83406c5928
$$ -61866 121547 -4967 166101 -24109 52732 -239371 54739 15410 58442 341848 -35928
12395B191g8526F3365K59337j31938H2352a09634A61347g6129A8512e0361K341
$$ 2191 -78526 63365 322702 190764 82352 -109634 161347 -76129 18512 -50361 -48020
12384d8020E5420b23587B01304q1078a27734c2985j15012Q230q997l9212A28542
$$ -48020 55420 -223587 201304 120226 -127734 -32985 -147997 -139767 -148764 -187976 128542
12372h479j41587p3356I7708i8623b4504I0758L8169a35833B76905q4866a02929
$$ -8479 -150066 -223422 97708 -98623 -24504 90758 128927 -135833 276905 192039 -102929
12360a40271o7221f163B69910a3654r3760H6959K32189A7562J29779k3770a68996
$$ -140271 -207492 -6163 269910 -13654 -107414 86959 319148 17562 147341 123571 -168996
12348i5373A51263d7731l5742j02780f8591b2114H8623a29813c9724D84430A7777
$$ -95373 151263 -47731 -83473 -186253 -68591 -22114 88623 -129813 -39724 484430 17777
12336C1701g2325A03783P651d5910C98997o9750D7452K2986K41535a20051c8915
$$ 31701 -72325 103783 111434 -45910 398997 329247 47452 70438 311973 -120051 -38915
12324E23260B42570g7817A12286h2999a435j24046D5036K51730a79828A5426J36709
$$ 523260 242570 -77817 112286 -82999 -1435 -125481 45036 296766 -179828 15426 152135
12313A52135J67056A43506J1803i5958j25654A2889e9510r9438A00032a95893
$$ 152135 319191 143506 155309 -95958 -221612 12889 -59510 -158948 100032 -195893
12302c17077A72659I792J44361R0933k6239D5589h6742J9092A21200B2288d839
$$ -317077 172659 9792 154153 245086 218847 45589 -86742 -67650 121200 22288 -4839
12290B19707g8872q6548p8974K0836R3832F1865Q1045o2093R8775Q127c36733
$$ 219707 -78872 -165420 -244394 -223558 -129726 61865 142910 80817 179592 187719 -336733
12278D8911J14871C1157a7928A22877b31465B2962c11548A69444b5038D00623
$$ 48911 163782 31157 -17928 122877 -231465 22962 -311548 169444 -25038 400623
12267a17231I1715K08687b38045a16685B3573L82372A69695h7663H8790d14070
$$ -117231 91715 300402 -238045 -116685 23573 405945 169695 -87663 88790 -414070
12256a75339D394K6346R9807e5658A79406h4232q4155N6147D2709A084N52374
$$ -175339 4394 30740 130547 -55658 179406 -84232 -168387 -112240 42709 1084 553458
12245E53458c3058a1176A45677K6280k4537a45583A92797E9787c6840g155C27936
$$ 553458 -33058 -11176 145677 171957 147420 -145583 192797 59787 -36840 -7155 327936
12233b48748A85810J2235q2175g1778m2734B14422o4285E7811L329J93880b87042
$$ -248748 185810 198045 115870 -71778 -114512 214422 150137 57811 61140 255020 -287042
12221A30292D9313a1234m6010E0293R5986a46874A41419a1401E14423j86865o3622
$$ 130292 49313 -11234 -57244 50293 146279 -146874 141419 -11401 514423 327558 263936
12210B63936I1819R6075Q3172j12517M41261a13039B55206A15242C9352J76779
$$ 263936 91819 187894 271066 158549 599810 -113039 255206 115242 39352 216131
12200B16131a12177G2239b34215B67161J10111j36237j1439A5840J68906a26743
$$ 216131 -112177 72239 -234215 267161 377272 241035 229596 15840 184746 -126743
12189g6743c5123B51726H5406J29711K30864A03619J99894H3506K58973j58818
$$ -76743 -35123 251726 85406 215117 445981 103619 303513 83506 342479 183661
12179A83661J22995a24120e3267C66780A82929e7469C87094A91268j3775D4149
$$ 183661 306656 -124120 -53267 366780 182929 -57469 387094 191268 177493 44149
12168A74187a8813o5901C24739A33966o6454C0273K15240N7397q3823Q9951a96414
$$ 174187 -18813 -84714 324739 133966 67512 30273 245513 302910 219087 309038 -196414
12156a03234B07593c1297I2080B0871K398J97719b47966a04054A05314e0830k4982
$$ -103234 207593 -31297 92080 20871 23269 220988 -247966 -104054 105314 -50830 -75812
12145g5812A94815G8495a01794i002k87394B75890f2651G5287K26723c9353B90524
$$ -75812 194815 78495 -101794 -9002 -296396 275890 -62651 75287 302010 -39353 290524
12133B72323A15325J77650c404B25223j04447a7620B64382c9207D4092J32330
$$ 272323 115325 292975 -3404 225223 120776 -17620 264382 -39207 44092 176422
12123A76422g8740n0326B22988R8810e7443b8335A7628K29648k1730b4508A14861
$$ 176422 -78740 -129066 222988 321798 -57443 -28335 17628 247276 225546 -24508 114861
12111I0778g7624m4809E3619b40379C30260j23314E803L82273A83633a16370B9415
$$ 90778 -77624 -122433 53619 -240379 330260 206946 5803 388076 183633 -116370 29415
12099g8761A39799C4705b75194c7031C0117j1605J79007I5247c57432A66964i1636
$$ -78761 139799 34705 -275194 -37031 30117 18512 197519 95247 -357432 166964 -91636
12087a31261M9969D9758b24000A88717b52175J12586k50902e7393k6539j66122
$$ -131261 -81292 49758 -224000 188717 -252175 -139589 -390491 -57393 -83932 -250054
12077b50054B5136P6188K63535F5655b05001d5164l6374B79406q2629b36303A11026
$$ -250054 25136 101324 364859 65655 -205001 -45164 -81538 279406 196777 -236303 111026
12065B1217J97943H4481b54574f5385L2680F1120k3503I602J76239K2804K64542
$$ 21217 219160 84481 -254574 -65385 -32705 61120 37617 9602 185841 208645 473187
12054D73187P85821n47023A78048d4q7836A49365G3894a70653b828j60685H7260
$$ 473187 1259008 711985 178048 -44 -87880 149365 73894 -170653 -2828 -163513 87260
12042a7407A10292a39327D40260A5768b86787c0797j05252c8362D6767i8810B20998
$$ -17407 110292 -139327 440260 15768 -286787 -30797 -136049 -38362 46767 -98810 220998
12030C02999j00124m3506b8994G3597a33539b697k3263l2445k09941l3592i7994
$$ 302999 202875 159369 -28994 73597 -133539 -2697 -25960 -58405 -268346 -301938 -97994
12018B23881N8120b22370A15621k8774a74603c5471j93880b3464e778j22933C0143
$$ 223881 282001 -222370 115621 86847 -174603 -35471 -229351 -23464 -5778 -128711 30143
12006A52754J46075I7802b324A8997O053J18757J83321B4937L4324M9150a04956
$$ 152754 298829 97802 -2324 18997 25050 143807 327128 24937 59261 108411 -104956
11994B76712f8782K6922D3291h4860k2485o0427A33666f9919A5664b74009B0029
$$ 276712 -68782 -41860 43291 -84860 -107345 -167772 133666 -69919 15664 -274009 20029
11982D3663N32711C1212J62453b58729g0479r55F1722a50470e2599G9851K875
$$ 43663 576374 31212 193665 -258729 -70479 -71434 61722 -150470 -52599 79851 82726
11971H2726C3696L82352a50977H8621a9487B12525h7055l7458B36916j12664M7931
$$ 82726 33696 416048 -150977 88621 -19487 212525 -87055 -124513 236916 124252 172183
11960A72183F1410f164A37606K35064a24686A13249b17921h2975k77431a08999
$$ 172183 61410 -6164 137606 372670 -124686 113249 -217921 -82975 -360406 -108999
11949A95681B2041f8124b2922a1393C28649c19884A2549a962j87040N9563A25065
$$ 195681 22041 -68124 -22922 -11393 328649 -319884 12549 -1962 -189002 -129439 125065
11937D9769c0038j34578j36462h1239j04920B05035a27780A13028e3600E4596
$$ 49769 -30038 -164616 -301078 -81239 -186159 205035 -127780 113028 -53600 54596
11926F6945J67981a56464A14332M390a02281A2199J52243b01012o3720A79876
$$ 66945 234926 -156464 114332 118722 -102281 12199 164442 -201012 -264732 179876
11915G4164h2753j803A95537b72704a34232j09548g4717g404a735k04170f225
$$ 74164 -82753 -84556 195537 -272704 -134232 -243780 -74717 -7404 -1735 -205905 -6225
11903D30221a18211C01682A9127B832K60878E6489K2628a73452d9263A68530b97385
$$ 430221 -118211 301682 19127 2832 263710 56489 79117 -173452 -49263 168530 -297385
11891c7048j27683n4136L0821B19492a66228B60954A08222b86566i228m89335
$$ -37048 -164731 -218867 -188046 219492 -166228 260954 108222 -286566 -9228 -498563
11881d98563A01813a89929g5066B0126a86893D8954b8909j48909G9567b17337
$$ -498563 101813 -189929 -75066 20126 -186893 48954 -28909 -177818 79567 -217337
11870h4480E8314k6530c61927B00558i1282l8538H0267K98513N7568I5698a58497
$$ -84480 58314 31784 -361927 200558 -91282 -129820 80267 378780 436348 95698 -158497
11858C63870c84640A58505a01618B72420D5476L83578f9163p5486j07040R0616
$$ 363870 -384640 158505 -101618 272420 45476 429054 -69163 -144649 -251689 -161073
11848a61073A69287a52007E7036a63154H877c1779l10861J23824k24179M6456
$$ -161073 169287 -152007 57036 -163154 8877 -31779 -342640 -218816 -442995 -396539
11838c96539E03793a86247d0946A20399a51369B62827A03290a52278j56251B45598
$$ -396539 503793 -186247 -40946 120399 -151369 262827 103290 -152278 -308529 245598
11827B79867H187P906K22114p0792a54779B48568a31923p5820L1463A6705c67216
$$ 279867 8187 16093 238207 167415 -154779 248568 -131923 -207743 -176280 16705 -367216
11815e0117l4450K7271k40705r830J25723g6186A44189c29127J13821A44122a78816
$$ -50117 -84567 -57296 -298001 -307831 -182108 -76186 144189 -329127 -215306 144122 -178816
11803C7943a0558J39o9021F1528A4755n690a9602C056K7259R3166a33206H9247
$$ 37943 -10558 -10419 -79440 61528 14755 9065 -19602 3056 30315 123481 -133206 89247
11790A5934J45497p9666c87142C2137J05630J1081d9320j61099B50375q5237l2332
$$ 15934 161431 81765 -387142 32137 137767 148848 -49320 -210419 250375 165138 132806
11779A32806b25398G2580a195k7557D3924c35844E9285K36465L8287A1674b3479
$$ 132806 -225398 72580 -1195 -28752 43924 -335844 59285 295750 334037 11674 -23479
11767B65921i7193j15563o9558A81416o3066J399j2378M1309b20390C55974D7256
$$ 265921 -97193 -212756 -282314 181416 118350 119749 107371 148680 -220390 355974 47256
11755h5283o3389d477j9243l1074j11041A35288A1107f524D0110D610J89498a35386
$$ -85283 -148672 -4477 -23720 -54794 -165835 135288 11107 -6524 40110 4610 194108 -135386
11742A64302B7849M97576d8957e914A7448b99353a32820j36665A77650b75899
$$ 164302 27849 525425 -48957 -5914 17448 -299353 -132820 -269485 177650 -275899
11731A34443n1103C152c50674E6824P1102J04642q3415c161j25687H411L38200
$$ 134443 83340 3152 -350674 56824 127926 232568 149153 -3161 -128848 8411 346611
11720C46611j54831b52308A0028b92289E3570K69634j43406A6650E975b0904B39475
$$ 346611 191780 -252308 10028 -292289 53570 323204 179798 16650 5975 -20904 239475
11708A15226c2903B53149J12170D7215J39059d3269j04025Q526M4252r9902h2497
$$ 115226 -32903 253149 365319 47215 186274 -43269 -147294 -138768 -94516 -194418 -82497
11696a12708A4906K76249A41373a08178I6080i6264G0195J8757J83765Q145F7752
$$ -112708 14906 291155 141373 -108178 96080 -96264 70195 88952 272717 280862 67752
11684a26974d0550G2324f0280a9736j89782D4805f9007E3464a38209d9337j91093
$$ -126974 -40550 72324 -60280 -19736 -209518 44805 -69007 53464 -138209 -49337 -240430
11673b40430F4270Q6975J01128L6380b56142P3876b9249B57009a0117C22341j42867
$$ -240430 64270 151245 252373 288753 -256142 -182266 -29249 257009 -10117 322341 179474
11662A79474R8433B3757J56684b7460A16191L4612J04742a78877a3494D70976
$$ 179474 277907 23757 180441 -27460 116191 150803 255545 -178877 -13494 470976
11651F658a57434j81538A77824c0860j56820b4470R059E3865R7974F9763l4243
$$ 6658 -157434 -338972 177824 -30860 -187680 -24470 -15411 53865 151839 69763 35520
11640C5520J05085a29725e6050F9549N7776a62667A03539a36885N3281K3289j88348
$$ 35520 140605 -129725 -56050 69549 127325 -162667 103539 -136885 -83604 -60315 -248663
11629b48663Q278d6010B7412a19953D7550J8795f1234F4132K38495f2441C7912
$$ -248663 -240385 -46010 27412 -119953 47550 66345 -61234 64132 302627 -62441 37912
11617a68749G2958d40714B23600a46945K4173r610A55189J0662a35559H5249a82134
$$ -168749 72958 -440714 223600 -146945 -122772 -132382 155189 165851 -135559 85249 -182134
11605A00486a01414B38959a99638k1902G2406P9480l9631h3681p3200E8062b82424
$$ 100486 -101414 238959 -199638 -221540 72406 151886 112255 -83681 -156881 58062 -282424
11593h8924j00893b9177N688k2937k5946p5565L495B45520e981E3242g3246j63161
$$ -88924 -189817 -29177 -23489 -46426 -72372 -147937 -144442 245520 -5981 53242 -73246 -236407
11581b36407b2711E961e2592m7130B13473A2325a35988L7787L4814F9744R1935
$$ -236407 -22711 5961 -52592 -99722 213473 12325 -135988 -98201 -63387 69744 161679
11570A61679d7274A62240A2486a8888C45696c10805C77751a31927n4709a3292
$$ 161679 -47274 162240 12486 -18888 345696 -310805 377751 -131927 -186636 -13292
11559a14270A33359M9811e2057p6551D8561O6794J6848k0889C9119J02984J1160
$$ -114270 133359 183170 -52057 -128608 48561 115355 132203 111314 39119 142103 153263
11548A53263l8979j3237n944g8710A85179a55322k7500E474J91067d2541j6244
$$ 153263 114284 101047 95103 -78710 185179 -155322 -182822 5474 196541 -42541 -58785
11537e8785m4716A29168c59338I0197J88001A0353J64955p6131a41755A60233
$$ -58785 -103501 129168 -359338 90197 278198 10353 175308 99177 -141755 160233
11526B26928d0179r711E04759a02033p1749I3970c095q0019I6039C397K49754
$$ 226928 -40179 -49890 504759 -102033 -173782 93970 -3095 -83114 96039 3397 253151
11515B53151l2176a00144p9983P2621B01549J34887h8941K6964B13980A9086R0045
$$ 253151 220975 -100144 -180127 -107506 201549 336436 -88941 -61977 213980 19086 109131
11504A09131K0934C0915b78983d1317C49098j46690l7018b27152d6539A63947
$$ 109131 130065 30915 -278983 -41317 349098 202408 165390 -227152 -46539 163947
11493D7086M07261j34566A27494b83842I544h4209G6406N8620a51817A76001l5785
$$ 47086 454347 319781 127494 -283842 9544 -84209 76406 135026 -151817 176001 140216
11482A40216J82256H837K46092j4030A00344O1687L3530J0593M7248o5505J39742
$$ 140216 322472 8837 254929 240899 100344 162031 195561 206154 253402 187897 327639
11471C27639G4502J877R4361q2019J16243J59574a7587A01141j3518J07326J19631
$$ 327639 74502 76379 170740 88721 204964 364538 -17587 101141 87623 194949 314580
11460C14580A15873R2402J03368I7740C7275M00980I6359d2571A0758J35480J7232
$$ 314580 115873 208275 311643 97740 37275 438255 96359 -42571 10758 146238 163470
11449A63470a96789A03137k6398a80144C36071j59737a1868C16876H6623a03796
$$ 163470 -196789 103137 76739 -180144 336071 176334 -11868 316876 86623 -103796
11438B1532b7003A46875K2632k9880L9198A7390P3608a8446A95098n5017F9943
$$ 21532 -27003 146875 169507 139627 178825 17390 90998 -18446 195098 140081 69943
11426a19162G6497g7953d583F897J47038D5522e12j05945j55344A48343N4972
$$ -119162 76497 -77953 -4583 6897 153935 45522 -512 -106457 -261801 148343 203315
11415B03315p5576b83697B37552C7438J43548F5918b3896A55514b1n9763F6109
$$ 203315 127739 -283697 237552 37438 180986 65918 -23896 155514 -21 -59784 66109
11403D026b57402I6413b01024R017g8966r5858h7260k09732q5992B19441c4396
$$ 4026 -257402 96413 -201024 -192007 -78966 -174824 -87260 -296992 -382984 219441 -34396
11391E9535a48492c8190J128j9732k0271B07255m2997b50764A97241b5714r7179
$$ 59535 -148492 -38190 -37062 -56794 -77065 207255 164258 -250764 197241 -25714 -122893
11380a22893c7423A13658b00327I159J09338c07270H8877b85167d4723F2553E414
$$ -122893 -37423 113658 -200327 9159 118497 -307270 88877 -285167 -44723 62553 5414
11368f22021b00933I9063a0212A21596L0564e4342L226A77153e6630n993j30954
$$ -622021 -200933 99063 -10212 121596 152160 -54342 -51116 177153 -56630 -62623 -193577
11357a93577J4584a1836r3028A69636n4500d7913C14688A5744a51620F0510c10135
$$ -193577 -178993 -11836 -104864 169636 115136 -47913 314688 15744 -151620 60510 -310135
11345b83716D2027Q1644b79579J32059H577b41672h9706m0859j91721H377e2565
$$ -283716 42027 123671 -279579 -147520 8577 -241672 -89706 -130565 -322286 8377 -52565
11333B57035h5239c8503B868K14070c57287A36307E4237f6553C02675i1818j72678
$$ 257035 -85239 -38503 2868 216938 -357287 136307 54237 -66553 302675 -91818 -264496
11322b64496J15289H3149e1336I2841c50015e9169l82161A7359M8953N7828L31434
$$ -264496 -149207 83149 -51336 92841 -350015 -59169 -441330 17359 66312 124140 455574
11311D55574c24464C66865b00687k9228N0189a3375B06637p2437c035j3912C3554
$$ 455574 -324464 366865 -200687 -229915 -179726 -13375 206637 134200 -3035 -16947 33554
11299B11086d8417G6030a90186f813l85645i2876A03939c7965J2063k34230A83724
$$ 211086 -48417 76030 -190186 -6813 -392458 -92876 103939 -37965 -25902 -260132 183724
11287A99465a55035e4931j26212a311k73620A38043f8972F6738b95675c5321m94
$$ 199465 -155035 -54931 -181143 -1311 -274931 138043 -68972 66738 -295675 -35321 -35815
11276c5815k63238j12871A33096b46853N8914O6909C49010a21638e0957J5619
$$ -35815 -299053 -411924 133096 -246853 -187939 -121030 349010 -121638 -50957 -35338
11266c5338C1470J91575j00919c31312a7716k07597A46841n5978M0673K1788k2459
$$ -35338 31470 223045 122126 -331312 -17716 -225313 146841 90863 131536 153324 130865
11255A30865e17752b00034O0748n336F0670b12658E6729h7695E9164g4487o2516
$$ 130865 -517752 -200034 -139286 -144622 60670 -212658 56729 -87695 59164 -74487 -137003
11244a37003M1886I905a61873j01327A65707b93332O8971j37722c776l97029B96602
$$ -137003 -95117 9905 -161873 -263200 165707 -293332 -224361 -362083 -3776 -400805 296602
11232A42551b35233h189k33609b9317J0240B8960c4676A51943l0041a71127j07500
$$ 142551 -235233 -8189 -241798 -29317 -19077 28960 -34676 151943 121902 -171127 -278627
11221b78627A3548L36081a87912k2885d5870k9044m5467A79679C8996a96210P0339
$$ -278627 13548 349629 -187912 -210797 -45870 -74914 -120381 179679 38996 -196210 -125871
11210a25871M6188I4059e9553k77347a32124d8803J7815C0236a10843j07617H4524
$$ -125871 -79683 94059 -59553 -336900 -132124 -48803 -30988 30236 -110843 -218460 84524
11198a43069g0002d792k36292A88976b8146k82707J23555P3119L0206J7367A14470
$$ -143069 -70002 -4792 -241084 188976 -28146 -310853 -187298 -114179 -83973 -66606 114470
11186b60632d4532j14667B0292J81379H3131A1613a02199B80865j01686a47032
$$ -260632 -44532 -159199 20292 201671 83131 11613 -102199 280865 179179 -147032
11175B23170a65261A61630a99256L4614j2217H1559b30710E04470i5223E122c23630
$$ 223170 -165261 161630 -199256 -164642 -176859 81559 -230710 504470 -95223 5122 -323630
11163A67914J27790r7261A2579J16163a5310k84525A47436a56053A07679k2477
$$ 167914 295704 198443 12579 128742 -15310 -299835 147436 -156053 107679 85202
11153H5202d22680C11943a10437H2665l7405a228l83174h7737C766c8746j46392
$$ 85202 -422680 311943 -110437 82665 45260 -1228 -384402 -87737 3766 -38746 -185138
11142a85138C26159B9282Q1351k0970J46931K4415d4207l6470B3149J38906a69432
$$ -185138 326159 29282 110633 89663 236594 261009 -44207 -80677 23149 162055 -169432
11130a60456f2612b2299j10404a1818G8371G726a87430I4222b36435b491j61092
$$ -160456 -62612 -22299 -132703 -11818 78371 7726 -187430 94222 -236435 -2491 -163583
11119a63583B49985h1720G5734a45183D4202h7841A61781C223N7793R2728J5070
$$ -163583 249985 -81720 75734 -145183 44202 -87841 161781 3223 61016 153744 168814
11108A68814a71421M2667A21140j6778L66394g4513q6833e3408A86087b30471
$$ 168814 -171421 -128754 121140 104362 470756 -74513 -161346 -53408 186087 -230471
11097B95688h5432B377c25639a15310c4300B50999A0287g8902I697N7454L77074
$$ 295688 -85432 2377 -325639 -115310 -34300 250999 10287 -78902 9697 67151 444225
11086D44225A25636A188L9153L264M41209A85179E4463g7199A59122m327a21169
$$ 444225 125636 1188 40341 43605 484814 185179 54463 -77199 159122 154795 -121169
11074B54023m9281J19189B8092K08451d0008m2897B74734m3837A03431M37719
$$ 254023 204742 323931 28092 236543 -40008 -82905 274734 230897 103431 541150
11064E41150k25506c26662A31927E0995J63780Q8011A43664L02054a44459B71102
$$ 541150 315644 -326662 131927 50995 214775 302786 143664 445718 -144459 271102
11053A56961L35212C9417P5488K73593J33731j68948M7627J45479l6093J47110
$$ 156961 492173 39417 114905 388498 522229 353281 400908 546387 510294 657404
11043F57404J4915C07954K21872O4453J39340j56639k6538J73555K6722k49100
$$ 657404 672319 307954 529826 594279 733619 576980 550442 723997 750719 501619
11033E01619L38335k55495J31201r4255O0903J43579k25550K56504j89264j84272
$$ 501619 839954 584459 715660 621405 682308 825887 600337 856841 667577 483305
11023D83305K30111J06940k23196J15627k83937K24490p2502k31904N51750j37012
$$ 483305 713416 820356 597160 712787 428850 653340 580838 348934 900684 763672
11013G63672j60720j21934R0746k4862J9482K36580m00571L00614k57252J08889
$$ 763672 602952 481018 571764 546902 566384 802964 402393 703007 445755 554644
11003E54644j13028B01217K71444M61628k65918j23280q3863k7630J06249k3461
$$ 554644 441616 201217 472661 934289 668371 545091 461228 433598 539847 516386
10993E16386J22244j84180q2400M8169K93231m0249R8887C26205K93476m0905
$$ 516386 638630 454450 372050 420219 713450 673201 772088 326205 619681 578776
10983E78776q9148Q8039m6820K01324C09471K81303B52111K74485Q9708k80256
$$ 578776 489628 577667 530847 732171 309471 590774 252111 526596 616304 336048
10973C36048N71641M4248k04971K31473j72849N06994k62714L21026k34844M64501
$$ 336048 907689 951937 746966 978439 805590 1312584 1049870 1370896 1136052 1600553
10963A600553l61051R39354j35438J8872P6528M20941k05817L49771m62966R3268
$$ 1600553 1239502 2178856 2043418 2062290 2138818 2559759 2353942 2703713 2240747 2334015
10953B334015k88379j53113K07857m88861k07010J23672l0560l30103J627R1006
$$ 2334015 2045636 1892523 2100380 1611519 1404509 1528181 1497621 1167518 1169145 1260151
10943A260151j16021P1250J60438j62599j16888l1779l34356j41250m1704J57957
$$ 1260151 1144130 1215380 1375818 1213219 1096331 1064552 730196 588946 547242 705199
10933G05199C43210J56436p5745A68954b19423C09668m3363j07375a18006A08952
$$ 705199 343210 499646 423901 168954 -219423 309668 266305 158930 -118006 108952
10922A03797i6328F0573K50397d5293H4080A3162c20722A95994a08367j40534
$$ 103797 -96328 60573 310970 -45293 84080 13162 -320722 195994 -108367 -248901
10912b48901I993P7287a01260j25195A52644N0363b15964g4389A26260a14268
$$ -248901 9993 87280 -101260 -226455 152644 203007 -215964 -74389 126260 -114268
10901B5238K2386m342d20229d1765A99737l4642K25614j29621R9701b01647e9740
$$ 25238 47624 43282 -420229 -41765 199737 165095 390709 261088 360789 -201647 -59740
10889E8972M9534J12848Q2984G221b5169j6941G347a02398A23529k9526e4976
$$ 58972 108506 221354 304338 7221 -25169 -42110 7347 -102398 123529 94003 -54976
10877B89253I7504a72647E0609k3277a60387K7969m3038d5203G4769a11714B93787
$$ 289253 97504 -172647 50609 27332 -160387 -132418 -175456 -45203 74769 -111714 293787
10865a32819k6340k1220B42866f6499n8917A0641a21502r081A37914D3583j148
$$ -132819 -159159 -180379 242866 -66499 -125416 10641 -121502 -130583 137914 43583 42435
10854D2435a25704A71874R1914h2224G1428k0397a34762L4778A94698c6207E5113
$$ 42435 -125704 171874 263788 -82224 71428 51031 -134762 -99984 194698 -36207 55113
10842d09397A14624e2479n700A97845a24927A2658a85051J8654m2258B2781m503
$$ -409397 114624 -52479 -58179 197845 -124927 12658 -185051 -166397 -208655 22781 18278
10831A8278K72669B3894J39992l403E4804R3461f0889D3266i8459J6489G1425
$$ 18278 290947 23894 163886 160483 54804 148265 -60889 43266 -98459 -81970 71425
10819F0280b8988l3925j92839B10088b95523a9414C3575J6035i0846j28837A09152
$$ 60280 -28988 -62913 -255752 210088 -295523 -19414 33575 49610 -90846 -219683 109152
10807D1574a49756D5807c13205A32823c14300j10284E6228h2581b6510E9142J43333
$$ 41574 -149756 45807 -313205 132823 -314300 -424584 56228 -82581 -26510 59142 202475
10796B02475a23720j54078o992h2273A2551K11905E1021b0916E4840a53927k46835
$$ 202475 -123720 -277798 -284790 -82273 12551 224456 51021 -20916 54840 -153927 -400762
10785d00762a30833m0127E1115b6643C6158J23287c3234k13890F1011c36289A00271
$$ -400762 -130833 -170960 51115 -26643 36158 159445 -33234 -247124 61011 -336289 100271
10773F8504k7618a1282a536j05581j26788f0132J5055A45563m998a87113E7689
$$ 68504 40886 -11282 -1536 -107117 -233905 -60132 -45077 145563 140565 -187113 57689
10761G538b64495a25070H8561O9823f7512b3123j31521E5725O694h4933G683N6844
$$ 7538 -264495 -125070 88561 158384 -67512 -23123 -154644 55725 62419 -84933 7683 64527
10749F4527o330d7451c544k7035A60321d262B45588a53747A16980a22496j91581
$$ 64527 58197 -47451 -3544 -30579 160321 -4262 245588 -153747 116980 -122496 -314077
10738c14077F332d5997q7565o856J5391e5355k74779A10599A6642c2777B42079
$$ -314077 6332 -45997 -133562 -140418 -125027 -55355 -330134 110599 16642 -32777 242079
10726d8871K3603j16434B18503j5463e6143r2086N1985p0074J7552A2896a01169
$$ -48871 -25268 -141702 218503 203040 -56143 -148229 -96244 -166318 -148766 12896 -101169
10714c41862a04365j50306N6882B29739d5137n9828b8712l04525E3739f2877a559
$$ -341862 -104365 -254671 -197789 229739 -45137 -104965 -28712 -333237 53739 -62877 -1559
10702B18739m3286F1868K03995C2508a05860F8009a33862p9217k4339L5747a5135
$$ 218739 175453 61868 265863 32508 -105860 68009 -133862 -213079 -237418 -201671 -15135
10690a46433d1220n8479q4640h5338A58984c6486q8712M9666H1840c07938H1874
$$ -146433 -41220 -99699 -184339 -85338 158984 -36486 -125198 -75532 81840 -307938 81874
10678a00959B3152b42090C54686e3179o8449e926n6895F3946b63465I2697c42644
$$ -100959 23152 -242090 354686 -53179 -121628 -5926 -62821 63946 -263465 92697 -342644
10666b40510A02208b27859B06220b42417h2121g617j51511c0433O324k17880i9164
$$ -240510 102208 -227859 206220 -242417 -82121 -7617 -159128 -30433 -24109 -241989 -99164
10654A77887a17258B10477c7325B75292i7566j38765c9433B11222a51921j01622
$$ 177887 -117258 210477 -37325 275292 -97566 -236331 -39433 211222 -151921 -253543
10644b53543J4171l5198a304A18003M3240Q6208I361b67413B29264c7849B07826
$$ -253543 -239372 -274570 -1304 118003 161243 247451 9361 -267413 229264 -37849 207826
10632A83722a80073B75741i8639Q241E3857K29878f2657A29946B0666K00048b29024
$$ 183722 -180073 275741 -98639 -90398 53857 283735 -62657 129946 20666 220714 -229024
10620a43374r0973e2990b3585j14055A75029l7364c34421a00951D9528J64876
$$ -143374 -234347 -52990 -23585 -137640 175029 137665 -334421 -100951 49528 214404
10610B14404F963b48355d4288n9548k5668e5477n8094a4362k56797B02462F9537
$$ 214404 6963 -248355 -44288 -103836 -129504 -55477 -113571 -14362 -271159 202462 69537
10598a07375j166A4501J26233E5540J3850e5249J8634B48055a46330O1159J2298
$$ -107375 -108541 14501 140734 55540 69390 -55249 -36615 248055 -146330 -85171 -72873
10587g2873A73674B9752b39792i3583B4522a80835B12454K5762j15557a94088
$$ -72873 173674 29752 -239792 -93583 24522 -180835 212454 238216 122659 -194088
10576B28708d3483j11122A01148M7394F8305a22165d5567k23274n7352A40059
$$ 228708 -43483 -154605 101148 148542 68305 -122165 -45567 -268841 -326193 140059
10565c10550j8602a9249p6281c4864n5956A80793H2425c18652A40645B5876a6773
$$ -310550 -329152 -19249 -95530 -34864 -90820 180793 82425 -318652 140645 25876 -16773
10553A1640J57843J2578o7665a741j29339a1710m6605I1582a85472j64205A11740
$$ 11640 169483 182061 114396 -1741 -131080 -11710 -58315 91582 -185472 -349677 111740
10541a55801F3670h2298F6497g6350k7451c0392j08788D7761f5803p8562D7784
$$ -155801 63670 -82298 66497 -76350 -103801 -30392 -139180 47761 -65803 -144365 47784
10529a20519A78965o1839d0744j13262B0647b64517G4165M2208c4822l35336A0385
$$ -120519 178965 117126 -40744 -154006 20647 -264517 74165 116373 -34822 -370158 10385
10517h485I8508e4940A10189N7503a47202a3550D01978d35261B51928b173j16099
$$ -8485 98508 -54940 110189 167692 -147202 -13550 401978 -435261 251928 -2173 -118272
10506a18272C51454b20979H3838e1722H276e1395B1911b9506G4660a46415d2726
$$ -118272 351454 -220979 83838 -51722 8276 -51395 21911 -29506 74660 -146415 -42726
10494A32368g9466A17761b2034C52909b2483A32218i2540I0798J15513B803g2014
$$ 132368 -79466 117761 -22034 352909 -22483 132218 -92540 90798 206311 2803 -72014
10482a45629A01641B8713J54663c66632A6274e17707h777l47434I9204b03990
$$ -145629 101641 28713 183376 -366632 16274 -517707 -8777 -356211 99204 -203990
10471B82691B2606b06027C52940q9613n2584J80710G7118J1160b9200A18430l4369
$$ 282691 22606 -206027 352940 263327 210743 391453 77118 88278 -29200 118430 84061
10460H4061N0827b40101B7595K357K53261A04065a80905A23653J16494b89158
$$ 84061 134888 -240101 27595 29952 283213 104065 -180905 123653 240147 -289158
10449a57271P0271j11715e8864j35862k13507c5058j52518O0669G0132a47551
$$ -157271 -87000 -198715 -58864 -194726 -408233 -35058 -187576 -126907 70132 -147551
10438c81966a66681l48260i2785k1786A06548m1999a76498G0117J39584I7229
$$ -381966 -166681 -514941 -92785 -114571 106548 64549 -176498 70117 209701 97229
10427B9657h7904A79495E4762O778h0910G6878f6830q4839A3141b49568k34494
$$ 29657 -87904 179495 54762 61540 -80910 76878 -66830 -151669 13141 -249568 -484062
10416d84062K11563A2121C6L8988J47632a40733A89972E9841h6573a3930j6545
$$ -484062 -272499 12121 36 39024 186656 -140733 189972 59841 -86573 -13930 -30475
10405c0475F929a69292A92895b17965A04078b86581e5127D7298L85827A92417
$$ -30475 6929 -169292 192895 -217965 104078 -286581 -55127 47298 433125 192417
10394b48047K4783J4314H1225C2269b49959C23582A40456a87694G8710p347g0160
$$ -248047 -223264 -208950 81225 32269 -249959 323582 140456 -187694 78710 71363 -70160
10382H2416J22046a32490Q315D41714b4039E5213K72814K2643A13290d6612C82028
$$ 82416 204462 -132490 -124175 441714 -24039 55213 328027 350670 113290 -46612 382028
10370D6816f1994A25474J4870J0637J81936G6957J55900I3003K9126D8937b2226
$$ 46816 -61994 125474 140344 150981 332917 76957 232857 93003 122129 48937 -22226
10358C60624J47418m2133A92451J30308J12051j40283q4093R0598L36218j02887
$$ 360624 508042 465909 192451 322759 434810 294527 210434 301032 637250 534363
10348E34363D6665M04865k13183J4228J21534P7333A24981N9082K49666L1698
$$ 534363 46665 451530 238347 252575 374109 451442 124981 184063 433729 465427
10338D65427B29841A10476N37848j64045k3136Q177A81399a48513A33437n4256
$$ 465427 229841 110476 648324 484279 461143 469320 181399 -148513 133437 79181
10328G9181N1299O7616A2623K98478C9872h4081c2785E9617d5322C9493M21363
$$ 79181 130480 198096 12623 311101 39872 -84081 -32785 59617 -45322 39493 460856
10317D60856A49822D0186P3667a10361F9542B6887b22353C53758A0105L04126
$$ 460856 149822 40186 113853 -110361 69542 26887 -222353 353758 10105 314231
10307C14231p1411J69630A15364J33576a80201B07876r1904R5834r8721a46560
$$ 314231 242820 412450 115364 248940 -180201 207876 115972 211806 113085 -146560
10296A25092a28002K2127A91039q8124b26945e6136K0575p033N89m7706K1748
$$ 125092 -128002 -105875 191039 102915 -226945 -56136 -35561 -42594 -42005 -89711 -67963
10285f7963C74498a29140j15844C4418J75826k3527J56890a93086o0139A63407
$$ -67963 374498 -129140 -244984 34418 210244 186717 343607 -193086 -253225 163407
10274D1801a40743F6484K2172l975J12683k7440a05285K5095m5686A82549F7a98465
$$ 41801 -140743 66484 88656 84681 197364 169924 -105285 -80190 -125876 182549 67 -198465
10261b06459B311b89530C03399A35575r453E9473A0004a4995D0398J3775D286
$$ -206459 2311 -289530 303399 135575 126122 59473 10004 -14995 40398 54173 4286
10249h4635H724P2338K28217j15052H5742O3552D1163h077C43596J5972A3568
$$ -84635 8724 81062 309279 194227 85742 149294 41163 -8077 343596 359568 13568
10237a27289j20643D9823k1334i509j96447C31534a83347b3536k32234j12626
$$ -127289 -247932 49823 28489 -9509 -205956 331534 -183347 -23536 -255770 -368396
10227c68396D9310r775K1248K9853a97255L443L2326o7930A14033k4989b56683
$$ -368396 49310 39535 60783 90636 -197255 -193812 -161486 -229416 114033 89044 -256683
10215f1610L0362o6389m65468B0644P4445Q3972Q1781a42054j44399i1368o3793
$$ -61610 -31248 -97637 -563105 20644 95089 179061 260842 -142054 -286453 -91368 -155161
10204a55161k02856R2371Q2858A29564f7902m0450b8867A47873A8753K59870j21186
$$ -155161 -358017 -265646 -182788 129564 -67902 -108352 -28867 147873 18753 278623 157437
10193A57437h6731A23357i9628j1387I5619d10063c9281j60271c2544A08530k8354
$$ 157437 -86731 123357 -99628 -111015 95619 -410063 -39281 -199552 -32544 108530 80176
10182H0176b6934b782m8872C15066a94932A52137O9548B253d8073B38305c79136
$$ 80176 -26934 -2782 -51654 315066 -194932 152137 221685 2253 -48073 238305 -379136
10170g4214A64586e6158A01121e3518l3028A00820d11891A93596h6705j12664
$$ -74214 164586 -56158 101121 -53518 -86546 100820 -411891 193596 -86705 -199369
10160a99369O993A15994D3605b01102l6390c8930k3422j9380j51173K3312B08214
$$ -199369 -192376 115994 43605 -201102 -237492 -38930 -62352 -81732 -232905 -209593 208214
10148C2829J91279a33052A6460b02867M0353o0407O9654K5249l8526e6717A7074
$$ 32829 224108 -133052 16460 -202867 -162514 -222921 -153267 -128018 -166544 -56717 17074
10136b11335p1076p0995q2361E0232a37237E9897b5858r2893q0452B09726q3608
$$ -211335 -282411 -353406 -435767 50232 -137237 59897 -25858 -118751 -199203 209726 126118
10125A26118c21136J47179k18864a66252l6158d7863l55021a28774N6672c1385
$$ 126118 -321136 -173957 -392821 -166252 -202410 -47863 -402884 -128774 -72102 -31385
10114a98973J9772A07982a78742c5114k83464J49786k9389B6320a39296m38466
$$ -198973 -179201 107982 -178742 -35114 -318578 -168792 -198181 26320 -139296 -577762
10104e77762g7144J6870k25922B57953c5394k40570e8389C0411a26503B2605d63589
$$ -577762 -77144 -60274 -286196 257953 -35394 -275964 -58389 30411 -126503 22605 -463589
10092b68332A88292F6438d6407k77B6835a23486O1683B875a5518o0109c2679j49035
$$ -268332 188292 66438 -46407 -46684 26835 -123486 -61803 2875 -15518 -75627 -32679 -181714
10080a81714N1874d3541O159j41045B47698f1693j06767L3277j9434F8654A8707
$$ -181714 -129840 -43541 -37382 -178427 247698 -61693 -168460 -135183 -154617 68654 18707
10068I8530c71950J27127A34244b5778E458R8514e0110l0775r9497H0038e1668
$$ 98530 -371950 -244823 134244 -25778 5458 103972 -50110 -80885 -180382 80038 -51668
10056c671j24236D1317b5593j31760j0523A24341M2102a68548g6863j60886k06029
$$ -3671 -127907 41317 -25593 -157353 -167876 124341 166443 -168548 -76863 -237749 -443778
10045d43778A37761a2140A9736a7327H667M79257d249p0168q7628r322A3330J04941
$$ -443778 137761 -12140 19736 -17327 8667 487924 -4249 -74417 -162045 -171367 13330 118271
10033A18271b28233N0557k12431E8565c07629B73696H2674d11913J75094g4414
$$ 118271 -228233 -177676 -390107 58565 -307629 273696 82674 -411913 -236819 -74414
10022a24469k77165J56564h2001A91753c6843A43554c517B6601a81543B67786
$$ -124469 -401634 -245070 -82001 191753 -36843 143554 -3517 26601 -181543 267786
10011e6326H2936j9968k1619J90193e6329A68321a2401n2264K1214A6590a29594
$$ -56326 82936 62968 41349 231542 -56329 168321 -12401 -64665 -43451 16590 -129594
9999e9808A09679Q3920G331c3715q152H6106N9705E0150b47903H1371g9265j53520
$$ -59808 109679 193599 7331 -33715 -41867 86106 145811 50150 -247903 81371 -79265 -232785
9987b32785P8536j75305B38198a62470A19384B6240J20543a77438G6866o438E742
$$ -232785 -154249 -329554 238198 -162470 119384 26240 146783 -177438 76866 70428 5742
9975E7561J0528C1627a13373B766a66256j20563J13141f597j27393B14965f17892
$$ 57561 68089 31627 -113373 2766 -166256 -286819 -173678 -6597 -133990 214965 -617892
9963B31466d8013H282b30619n353R2104b8133j48965f641E1702M9440i1737d399
$$ 231466 -48013 8282 -230619 -235972 -143868 -28133 -177098 -6641 51702 101142 -91737 -4399
9950a14207A39999b79209i5218c1402k77218a40790K1021e2292B2981c56893c3622
$$ -114207 139999 -279209 -95218 -31402 -308620 -140790 -119769 -52292 22981 -356893 -33622
9938A96766i2095H3561j2401g4732L912B79053a65448b9666k03848g3045G9346
$$ 196766 -92095 83561 71160 -74732 -70820 279053 -165448 -29666 -233514 -73045 79346
9926A176K68837a58713o375i891l79277D115a06047j8959k1891N4669r3795R0016
$$ 1176 270013 -158713 -165088 -9891 -389168 4115 -106047 -125006 -146897 -92228 -186023 -96007
9914i6007k59646a22720a0312n2291A56540B8141K00151a79080E9416e072C62305
$$ -96007 -355653 -122720 -10312 -62603 156540 28141 228292 -179080 59416 -5072 362305
9902E2684B4426a70059l4734A22787m1757d53643O1831J85529B37714f5404j68082
$$ 52684 24426 -170059 -204793 122787 81030 -453643 -391812 -206283 237714 -65404 -233486
9891b33486o0713J11032G2405d7146m42114A04785C8065g2718L2697o7588k3052
$$ -233486 -294199 -183167 72405 -47146 -489260 104785 38065 -72718 -40021 -107609 -130661
9880a30661k0863B12556a81772g7847B29897a40129N2997l2568j41031E0139c78345
$$ -130661 -151524 212556 -181772 -77847 229897 -140129 -87132 -119700 -260731 50139 -378345
9868c2199H8491a84705b8785A90940b55991a1952m6396g121k25565b4048j01460
$$ -32199 88491 -184705 -28785 190940 -255991 -11952 -58348 -7121 -232686 -24048 -125508
9857a25508j44674P0004A48208a20819A77561o3223a33156D23K13390E1882a17123
$$ -125508 -270182 -200178 148208 -120819 177561 114338 -133156 423 213813 51882 -117123
9845a3292j36783L5577H8212c4457k77742a48974a0089G9696J66193a29235p9122
$$ -13292 -150075 -114498 88212 -34457 -312199 -148974 -10089 79696 245889 -129235 -208357
9834b08357J02359L8429K0025F7085e6913A86029a54710f4999I0544a47674N0147
$$ -208357 -105998 -67569 -47544 67085 -56913 186029 -154710 -64999 90544 -147674 -97527
9823i7527r4162B558L9380b24761A56337e2602k04528l28163H1913L4145a52892
$$ -97527 -191689 2558 41938 -224761 156337 -52602 -257130 -585293 81913 116058 -152892
9811a26064n9894K8280H6663k6118a90593j793B0726a03586L4602B5630N3405
$$ -126064 -185958 -157678 86663 60545 -190593 -192386 20726 -103586 -68984 25630 79035
9800G9035J29987i1479A35082m5232b66824A71274G4555P9744p5525l2006h6732
$$ 79035 209022 -91479 135082 89850 -266824 171274 74555 154299 78774 46768 -86732
9788b69558A34134a14989A00267e2442l0292J4118j15274a0511B37576c6281J6940
$$ -269558 134134 -114989 100267 -52442 -82734 -68616 -183890 -10511 237576 -36281 -19341
9777a9341j39518A51026d75102a42155n274M8836B82606a9644H8995a61023e0530
$$ -19341 -158859 151026 -475102 -142155 -147429 -98593 282606 -19644 88995 -161023 -50530
9765a11145A69441c5203D7803f8154k89542a16313r8995j16289b6494G4046F383
$$ -111145 169441 -35203 47803 -68154 -357696 -116313 -215308 -331597 -26494 74046 6383
9753A47680c43481E4892f8738p6315j47118A82385C0613A417c1017r4538E096
$$ 147680 -343481 54892 -68738 -145053 -292171 182385 30613 1417 -31017 -125555 5096
9741d2869o4308k78436b9839r0485k84776J88445K9779n1420p657c4812p4592
$$ -42869 -107177 -385613 -29839 -120324 -405100 -216655 -186876 -238296 -245953 -34812 -109404
9730a09404B7479a19491E9343j8381a74464q3409N5914h0145m5716j58244i8482
$$ -109404 27479 -119491 59343 40962 -174464 -257873 -201959 -80145 -125861 -284105 -98482
9718a61878e7564j62673C20063a41508f9215B16610a0556A1927K1463a05817L3920
$$ -161878 -57564 -220237 320063 -141508 -69215 216610 -10556 11927 33390 -105817 -71897
9707g1897l11697I1908c1719C625a48728E3174J3126J54741a00053r6694h1980
$$ -71897 -383594 91908 -31719 3625 -148728 53174 66300 221041 -100053 -196747 -81980
9695E2770a92957g8942B05009a5524A35319d8920D7751a05533A80320c37258A45846
$$ 52770 -192957 -78942 205009 -15524 135319 -48920 47751 -105533 180320 -337258 145846
9683F2746h9819r9765P779j5766a7392j55969k01641B12267a56758B21231b15811
$$ 62746 -89819 -189584 -181805 -197571 -17392 -173361 -375002 212267 -156758 221231 -215811
9671d149l4790j16837O9188j1677C26282d6245A87762b01450B35040r7081k8312
$$ -4149 -38939 -155776 -86588 -98265 326282 -46245 187762 -201450 235040 137959 109647
9660A09647a25794L0884k68138a62573p325C1038f6983C39431d13993B05505e02898
$$ 109647 -125794 -94910 -363048 -162573 -169898 31038 -66983 339431 -413993 205505 -502898
9648b16382L4154C20018I8706i6033B6390B961g4186k72173a3508A50246a60235
$$ -216382 -182228 320018 98706 -96033 26390 2961 -74186 -346359 -13508 150246 -160235
9636i0746j60880A6108J54921b714m2879n5152K4011b2424n1995j9766A12785
$$ -90746 -251626 16108 171029 -2714 -45593 -100745 -76734 -22424 -74419 -94185 112785
9624e8305p1969B35562a9139o0096J4853D4257A5421e0821B59118b24021Q762
$$ -58305 -130274 235562 -19139 -79235 -64382 44257 15421 -50821 259118 -224021 -215259
9613b15259Q9066r5239A8395J54730a55565J2511m3162E9794b03912P3800L6165
$$ -215259 -126193 -221432 18395 173125 -155565 -143054 -186216 59794 -203912 -130112 -93947
9602i3947l9449F5909K6043i2586j17945P7114A2856a8540k62095J32003E11143
$$ -93947 -133396 65909 91952 -92586 -210531 -133417 12856 -18540 -280635 -148632 511143
9590a99083A96630b12232A23037a62689a9339j71170q810k03318d9526J342E5865
$$ -199083 196630 -212232 123037 -162689 -19339 -190509 -199319 -402637 -49526 -48184 55865
9578f1491j1802a9397j37931j76909d0494o0333M8433A33876L08173a2683G4579
$$ -61491 -73293 -19397 -157328 -334237 -40494 -100827 -52394 133876 442049 -12683 74579
9566B40605G0501K68799b04827O6134B68385b73884H5926d08536D78446a84296
$$ 240605 70501 339300 -204827 -138693 268385 -273884 85926 -408536 478446 -184296
9555f5339A14910k9203e4247q1169C85310e18833h486r859o6319p2504g7078k80236
$$ -65339 114910 85707 -54247 -135416 385310 -518833 -8486 -18345 -84664 -157168 -77078 -357314
9543c57314c9812E8335L52868F1991d6906A73765B1749J6779e0935k7884k25654
$$ -357314 -39812 58335 411203 61991 -46906 173765 21749 38528 -50935 -78819 -304473
9532c04473g0077k75866d8909A37397e2714k71004e6485e292A19108G5N8043b24418
$$ -304473 -70077 -345943 -48909 137397 -52714 -323718 -56485 -5292 119108 75 58118 -224418
9519g121k31435P8645n3531b9798j00856M9902k9226l9364e87A27700n7311h2648
$$ -7121 -238556 -159911 -213442 -29798 -130654 -80752 -109978 -149342 -587 127700 70389 -82648
9506d6430k61165N7350B87420H0750c28913G1570b36948P1460j73893b3272k46809
$$ -46430 -307595 -250245 287420 80750 -328913 71570 -236948 -165488 -339381 -23272 -270081
9495b70081E056O3644g7881B8942q347h2446j9592o1999D9095P8841D0993Q3677
$$ -270081 5056 68700 -77881 28942 20595 -82446 -102038 -164037 49095 127936 40993 124670
9483A24670a40425A71278a44086k3337f4721j5008k10894F840b64825O7927f2869
$$ 124670 -140425 171278 -144086 -167423 -64721 -79729 -290623 6840 -264825 -196898 -62869
9471A13441K13735f8051o6706G3526f6487n5389J5800k1013K8040M842G812a82520
$$ 113441 327176 -68051 -134757 73526 -66487 -121876 -106076 -127089 -99049 -94207 7812 -182520
9458A5501c25460J52504q1939h9212A64733b97461J18987c587A08331b0845G6866
$$ 15501 -325460 -172956 -254895 -89212 164733 -297461 -178474 -3587 108331 -20845 76866
9446B59971e2427B00832c02523B182a43899b9355C9895J92098b10082l3994C3097
$$ 259971 -52427 200832 -302523 2182 -143899 -29355 39895 231993 -210082 -244076 33097
9434a92925f6726n6679m7022K8447n4397N0662j91182g4552k44841A66141a18847
$$ -192925 -66726 -123405 -170427 -141980 -196377 -145715 -336897 -74552 -319393 166141 -118847
9422a27726b7443A52776a7690g419k69803M3672N6747A06612b96285G7434a3623
$$ -127726 -27443 152776 -17690 -7419 -277222 -233550 -176803 106612 -296285 77434 -13623
9410G3733b2291j01452H2441g2140r468C18599a87047B57207a20122d5556l478
$$ 73733 -22291 -123743 82441 -72140 -81608 318599 -187047 257207 -120122 -45556 -49034
9399d9034l58562h3909L7963j01504F6293a63086a261j14374e0460j25136d6724
$$ -49034 -407596 -83909 -45946 -147450 66293 -163086 -1261 -115635 -50460 -175596 -46724
9387F5060J6740a14225j67269J19799a4661A25734a78825F0932f9681H6770b36045
$$ 65060 81800 -114225 -281494 -161695 -14661 125734 -178825 60932 -69681 86770 -236045
9375D4355b43837g1907l4802D474f055F3928b53494a04039D3055d9612j5534k57840
$$ 44355 -243837 -71907 -106709 4474 -6055 63928 -253494 -104039 43055 -49612 -65146 -322986
9363c22986P3553N2540D6837a29980q9167J1784m5201C8467L23J52946i3558K1876
$$ -322986 -249433 -196893 46837 -129980 -219147 -207363 -252564 38467 38790 191736 -93558 -71682
9351g1682j90738A00690b32218c0180G2962L378g1842B01168a23843E1055Q1234
$$ -71682 -262420 100690 -232218 -30180 72962 76340 -71842 201168 -123843 51055 132289
9340A32289a80432d8916j02552A18321h7003A51919b01307A43503L19987a08613
$$ 132289 -180432 -48916 -151468 118321 -87003 151919 -201307 143503 463490 -108613
9329b3498j16393r8244b9057C69171c30237e1192G8954b555A04085c6555A84717
$$ -23498 -139891 -238135 -29057 369171 -330237 -51192 78954 -2555 104085 -36555 184717
9317I6353a40511k350a6337j8928J5909l1965B09367G7730A1394a48593j79601
$$ 96353 -140511 -142861 -16337 -35265 -19356 -51321 209367 77730 11394 -148593 -328194
9306c28194A65541J72386b73815l72063a08272A69986A9056b52643P0954q1192
$$ -328194 165541 337927 -273815 -645878 -108272 169986 19056 -252643 -181689 -262881
9296b62881D5602R7158a02731c3006j74579B19608b11096A68050p4325d82375
$$ -262881 45602 142760 -102731 -33006 -207585 219608 -211096 168050 93725 -482375
9285b12099N6106k34289g0730b3021A29764c60490C9844a33468Q592F6355i4427
$$ -212099 -155993 -390282 -70730 -23021 129764 -360490 39844 -133468 -124876 66355 -94427
9273f1752q2397A71419A6121c4082h857j14532e1171j15913N8046B91182g7157
$$ -61752 -144149 171419 16121 -34082 -8857 -123389 -51171 -167084 -109038 291182 -77157
9261A50551i5783J2402l84047D6338c60052A31049a13891F1582P3012P1316a4606
$$ 150551 -95783 -83381 -467428 46338 -360052 131049 -113891 61582 134594 205910 -14606
9249b7117G3358a77212A32376d10868a52015b7900k39391o0516g0273a9242o3300
$$ -27117 73358 -177212 132376 -410868 -152015 -27900 -267291 -327807 -70273 -19242 -82542
9238h2542C1950a17630b5692A14263C0351O9005a72367A13699Q5046C2031e0219
$$ -82542 31950 -117630 -25692 114263 30351 99356 -172367 113699 198745 32031 -50219
9226b37782H5882a98414C90191q3668A8442g198j86245D7186c51182C303a17087
$$ -237782 85882 -198414 390191 306523 18442 -7198 -193443 47186 -351182 3303 -117087
9214A8720c03971a04644A03195a95306j02528g4653I2186l2150K29858c61505
$$ 18720 -303971 -104644 103195 -195306 -297834 -74653 92186 60036 289894 -361505
9203H7082i7015M841C05462k4562b85303R5065e7059E9081a93424j73169g9811
$$ 87082 -97015 -92174 305462 280900 -285303 -190238 -57059 59081 -193424 -366593 -79811
9191a1524l44290G0817k7357a60356N4084k06968E6001D695b54978A8601a71960
$$ -11524 -355814 70817 43460 -160356 -106272 -313240 56001 4695 -254978 18601 -171960
9179B76544a34838N8448O326B34060d5791B148d17001D8278O0226k2905c50792
$$ 276544 -134838 -76390 -70064 234060 -45791 2148 -417001 48278 108504 85599 -350792
9167A73824d1997j69536b9902P449k25440J02277J0115A13760N0898M3814J3621
$$ 173824 -41997 -211533 -29902 -22453 -247893 -145616 -135501 113760 164658 208472 222093
9156B22093b9023j46307d5735H8403R1772J19502D2457b66381g7623j04050A70588
$$ 222093 -29023 -175330 -45735 88403 180175 299677 42457 -266381 -77623 -181673 170588
9144A65114m0082b09984d7377H1057a523H6734i5453A09172c2332n9716j7755
$$ 165114 125032 -209984 -47377 81057 -1523 86734 -95453 109172 -32332 -92048 -109803
9133a09803K2323J9948l56092E18269G3184P5790b0340m095j29713R54k17856
$$ -109803 -87480 -67532 -423624 518269 73184 148974 -20340 -24435 -154148 -153194 -371050
9122c71050M93B3882a22947b2809M904j88590R2253p3394j23597j7803b4915j36391
$$ -371050 -370557 23882 -122947 -22809 -17905 -206495 -114242 -187636 -311233 -329036 -24915 -161306
9110a61306N7778j95825a43070e8086m2346D00096c53472E2432e8816D97454B0872
$$ -161306 -103528 -299353 -143070 -58086 -100432 400096 -353472 52432 -58816 497454 20872
9098b96421F4245c78070a82208D1961M54887F0942a63302l6844i7603A52613e3038
$$ -296421 64245 -378070 -182208 41961 496848 60942 -163302 -200146 -97603 152613 -53038
9086D6286K92538b03257j94685I5722a48940L5374k6309l1247b1573k09545i8050
$$ 46286 338824 -203257 -397942 95722 -148940 -113566 -139875 -171122 -21573 -231118 -98050
9074A92421F7977J96849I4281b4808j12853j98863J45137j05310E6341a98713
$$ 192421 67977 264826 94281 -24808 -137661 -336524 -191387 -296697 56341 -198713
9063b85378H9029B5364d1238l37621a3934q3641j02459A7680b17771J08705j53938
$$ -285378 89029 25364 -41238 -378859 -13934 -97575 -200034 17680 -217771 -109066 -263004
9052b63004a22410L1267k22472J45764A9079J05184P3745b16960J05049B84065
$$ -263004 -122410 -91143 -313615 -167851 19079 124263 198008 -216960 -111911 284065
9041a01546p614B5205J00385a3411j49181G2699a35697d4940m18547c9689j60757
$$ -101546 -109160 25205 125590 -13411 -162592 72699 -135697 -44940 -463487 -39689 -200446
9030b00446P4733B0815a71952r7498c9021F0854e9801a1701r0704p615j4849Q474
$$ -200446 -125713 20815 -171952 -269450 -39021 60854 -59801 -11701 -102405 -110020 -124869 -116395
9018a16395B29573m3464c79345c3023j58864l0634B8630e3498q0326K1351j11649
$$ -116395 229573 186109 -379345 -33023 -191887 -222521 28630 -53498 -133824 -112473 -224122
9007b24122C50601B6315J93828b59764h8735A83411K0988b84804A77958b0074
$$ -224122 350601 26315 220143 -259764 -88735 183411 204399 -284804 177958 -20074
8996A2102K966a86282j21143L8288i8140q5209a017j69717M5000k0133A7909c9157
$$ 12102 15068 -186282 -307425 -269137 -98140 -183349 -1017 -170734 -125734 -145867 17909 -39157
8983i0792k54740A9043J25764g3742b7906p5997d8660B09766G1812b55845I3041
$$ -90792 -345532 19043 144807 -73742 -27906 -103903 -48660 209766 71812 -255845 93041
8971a3801B3183R6619e9716E4321b34810a0605A99586a79943d9669A53875a5369
$$ -13801 23183 119802 -59716 54321 -234810 -10605 199586 -179943 -49669 153875 -15369
8959G3158b38123j21493b1074j03672b7882k53688B32561J6713b28186B72978
$$ 73158 -238123 -359616 -21074 -124746 -27882 -281570 232561 249274 -228186 272978
8948A98738a41873e2233j17643r2946E6452i1055o0300f0736K1908h913r9437
$$ 198738 -141873 -52233 -169876 -262822 56452 -91055 -151355 -60736 -38828 -8913 -108350
8937a08350F2272b7446j40797B88862a1967A47569c25208H0965e3891j83273d025
$$ -108350 62272 -27446 -168243 288862 -11967 147569 -325208 80965 -53891 -237164 -4025
8925A17296f0226j04737C46477d7599A21744e5062G73014k59943C1321M0314J10660
$$ 117296 -60226 -164963 346477 -47599 121744 -55062 773014 513071 31321 71635 182295
8914A82295K43500j60565K58068J49459M93269L6188R79330K006438M675272m24612
$$ 182295 425795 265230 523298 672757 1166026 1202214 2181544 4187982 8863254 8438642
8904H438642C992940j925964H22701l28017L31890m8666l83292J51952b4131m0991
$$ 8438642 3992940 2066976 822701 494684 826574 777908 394616 546568 -24131 -65122
8894f5122D25905j39181r2680J70447A4325c08836A02530d2630j07795A17787
$$ -65122 425905 286724 194044 364491 14325 -308836 102530 -42630 -150425 117787
8883A7212c7652A35265C256a75038K8859M7404n3256r875D0997K8880b26930A88589
$$ 17212 -37652 135265 3256 -175038 -146179 -98775 -152031 -161906 40997 69877 -226930 188589
8870F2060B8572a71266r2707J17632j41831E3239J2031a26118B16997a70868e404
$$ 62060 28572 -171266 -263973 -146341 -288172 53239 65270 -126118 216997 -170868 -5404
8858B8476J03098k1990K1311A7839a25100r6302D5626b31288q2603J51495e2182
$$ 28476 131574 109584 130895 17839 -125100 -221402 45626 -231288 -313891 -162396 -52182
8846I1894f5858j23440B2707P3296a55211p730e5018k75107A5364J12409b67067
$$ 91894 -65858 -189298 22707 96003 -155211 -162941 -55018 -330125 15364 127773 -267067
8834b93877i7601j24521h6029a5102D0680b22341O1913n5598B08604c25716D3104
$$ -293877 -97601 -222122 -86029 -15102 40680 -222341 -160428 -216026 208604 -325716 43104
$$ [...]
##END NTUPLES=NMR SPECTRUM
##END=
