
##TITLE=UV1055_TOCA01-ROVE100D_6100010_pmNMsA0UUi
##JCAMPDX= 6.0         $$ Bruker NMR JCAMP-DX V2.0
##DATA TYPE= NMR SPECTRUM
##DATA CLASS= NTUPLES
##ORIGIN= BRUKER
##OWNER= Administrator
$$ 1.72 TOPSPIN		Version 2.1
$$ 2012-05-13 03:35:11.906 -0500  Administrator@TOPSPIN
$$ Compression mode = diff/dup
##.OBSERVE FREQUENCY= 400.13188235
##.OBSERVE NUCLEUS= ^1H
##.ACQUISITION MODE= SIMULTANEOUS (DQD)
##.ACQUISITION SCHEME= undefined
##.AVERAGES= 64
##.DIGITISER RES= 22
##SPECTROMETER/DATA SYSTEM= spect
##.PULSE SEQUENCE= noesygpps1d.comp
##.SOLVENT NAME= COFFEE_meoh
##.SHIFT REFERENCE= INTERNAL, COFFEE_meoh, 1, 14.96682
##AUDIT TRAIL= $$ (NUMBER, WHEN, WHO, WHERE, PROCESS, VERSION, WHAT)
$$ ##TITLE= Audit trail, TOPSPIN		Version 2.1
$$ ##JCAMPDX= 5.01
$$ ##ORIGIN= Bruker BioSpin GmbH
$$ ##OWNER= Administrator
$$ $$ C:\Bruker\TOPSPIN/data/COFFEE/nmr/UV1055_TOCA01-ROVE100D_6100010_pmNMsA0UUi/22/pdata/1/auditp.txt
$$ ##AUDIT TRAIL=  $$ (NUMBER, WHEN, WHO, WHERE, PROCESS, VERSION, WHAT)
(   1,<2012-05-13 03:35:06.828 -0500>,<Administrator>,<TOPSPIN>,<go>,<TOPSPIN 2.1>,
      <created by zg
	started at 2012-05-13 03:23:36.687 -0500,
	POWCHK enabled, PULCHK disabled,
       configuration hash MD5:
       AF F2 23 6B 01 CD 40 DD E5 A1 38 A0 06 EA F7 77
       data hash MD5: 64K
       36 90 61 47 34 9F C9 E7 EC 58 39 A1 FB BA F8 13>)
(   2,<2012-05-13 03:35:09.578 -0500>,<Administrator>,<TOPSPIN>,<proc1d>,<TOPSPIN 2.1>,
      <Start of raw data processing
       efp LB = 0.3 FT_mod = 6 PKNL = 1 PHC0 = 0 PHC1 = 0 SI = 128K 
       data hash MD5: 128K
       D8 ED B8 FB D2 A9 48 10 F6 28 5D 09 C6 0B 59 A9>)
(   3,<2012-05-13 03:35:10.843 -0500>,<Administrator>,<TOPSPIN>,<proc1d>,<TOPSPIN 2.1>,
      <pk PHC0 = 36.80969 PHC1 = 0 
       data hash MD5: 128K
       12 67 A8 5D F9 A0 D0 CD 53 D5 A8 6D 4D 02 BD 13>)
(   4,<2012-05-13 03:35:11.562 -0500>,<Administrator>,<TOPSPIN>,<proc1d>,<TOPSPIN 2.1>,
      <abs ABSG = 1 
       data hash MD5: 128K
       13 09 31 77 52 1E 90 26 23 CE EB F1 CF 99 F9 B4>)
(   5,<2012-05-13 03:35:11.625 -0500>,<Administrator>,<TOPSPIN>,<proc1d>,<TOPSPIN 2.1>,
      <abs ABSG = 2 
       data hash MD5: 128K
       87 80 CA FD 59 5D 9A 63 CC B5 24 E2 87 CF 28 58>)
(   6,<2012-05-13 03:35:11.703 -0500>,<Administrator>,<TOPSPIN>,<proc1d>,<TOPSPIN 2.1>,
      <abs ABSG = 3 
       data hash MD5: 128K
       18 DC D4 FE 0B 07 06 28 49 1F F4 F3 DA 69 ED 98>)
(   7,<2012-05-13 03:35:11.765 -0500>,<Administrator>,<TOPSPIN>,<proc1d>,<TOPSPIN 2.1>,
      <abs ABSG = 4 
       data hash MD5: 128K
       5F 23 25 77 37 88 DD 72 5E 78 37 F6 25 5E 00 7A>)
(   8,<2012-05-13 03:35:11.828 -0500>,<Administrator>,<TOPSPIN>,<proc1d>,<TOPSPIN 2.1>,
      <abs ABSG = 5 
       data hash MD5: 128K
       B9 15 C4 5C D4 B7 9C 76 81 E2 FB 68 E3 7A 5A 93>)
$$ ##END=
$$ 
$$ $$ hash MD5
$$ $$ 83 24 1F 24 8D 45 0C 3E 8F BC 4E 40 B6 44 5C CA
##$RELAX= 
##$RELAX= 
##$RELAX= 
##$RELAX= 
##$RELAX= 
##$RELAX= 
##$RELAX= 
##$RELAX= 
$$ [...]
##$TP07= 0
##$TPNAME0= <>
##$TPNAME1= <>
##$TPNAME2= <>
##$TPNAME3= <>
##$TPNAME4= <>
##$TPNAME5= <>
##$TPNAME6= <>
##$TPNAME7= <>
##$TPOAL= (0..7)
0.5 0.5 0.5 0.5 0.5 0.5 0.5 0.5
##$TPOFFS= (0..7)
0 0 0 0 0 0 0 0
##$TUNHIN= 0
##$TUNHOUT= 0
##$TUNXOUT= 0
##$USERA1= <user>
##$USERA2= <user>
##$USERA3= <user>
##$USERA4= <user>
##$USERA5= <user>
##$V9= 5
##$VALIST= <valist>
##$VCLIST= <CCCCCCCCCCCCCCC>
##$VD= 0
##$VDLIST= <DDDDDDDDDDDDDDD>
##$VPLIST= <PPPPPPPPPPPPPPP>
##$VTLIST= <TTTTTTTTTTTTTTT>
##$WBST= 2048
##$WBSW= 25
##$XGAIN= (0..3)
0 0 0 0
##$XL= 0
##$YL= 0
##$YMAX_a= 10606572
##$YMIN_a= -5541171
##$ZGOPTNS= <>
##$ZL1= 120
##$ZL2= 120
##$ZL3= 120
##$ZL4= 120
##$ABSF1= 14.96682
##$ABSF2= -5.585711
##$ABSG= 5
##$ABSL= 3
##$ALPHA= 0
##$AQORDER= 0
##$ASSFAC= 0
##$ASSFACI= 0
##$ASSFACX= 0
##$ASSWID= 0
##$AUNMP= <proc_prof1d_extract.lims>
##$AXLEFT= 0
##$AXNAME= <>
##$AXNUC= <1H>
##$AXRIGHT= 0
##$AXTYPE= 0
##$AXUNIT= <>
##$AZFE= 0.1
##$AZFW= 0.1
##$BCFW= 0
##$BC_mod= 0
##$BYTORDP= 0
##$COROFFS= 0
##$CY= 15
##$DATMOD= 1
##$DC= 0
##$DFILT= <>
##$DTYPP= 0
##$F1P= 0
##$F2P= 0
##$FCOR= 0.5
##$FTSIZE= 131072
##$FT_mod= 6
##$GAMMA= 0
##$GB= 0
##$INTBC= 1
##$INTSCL= 1
##$ISEN= 128
##$LB= 0.3
##$LEV0= 0
##$LPBIN= 0
##$MAXI= 10000
##$MC2= 0
##$MEAN= 0
##$ME_mod= 0
##$MI= 0
##$NCOEF= 0
##$NC_proc= -3
##$NLEV= 6
##$NOISF1= 0
##$NOISF2= 0
##$NSP= 0
##$NTH_PI= 0
##$NZP= 0
##$OFFSET= 14.96682
##$PC= 1
##$PHC0= 36.80969
##$PHC1= 0
##$PH_mod= 1
##$PKNL= yes
##$PPARMOD= 0
##$PPDIAG= 0
##$PPIPTYP= 0
##$PPMPNUM= 2147483647
##$PPRESOL= 1
##$PSCAL= 4
##$PSIGN= 0
##$PYNMP= <proc.py>
##$REVERSE= no
##$SF= 400.130005519922
##$SI= 131072
##$SIGF1= 0
##$SIGF2= 0
##$SINO= 400
##$SIOLD= 131072
##$SPECTYP= <>
##$SREGLST= <1H.CDCl3>
##$SSB= 0
##$STSI= 131072
##$STSR= 0
##$SW_p= 8223.68421052632
##$SYMM= 0
##$S_DEV= 0
##$TDeff= 65536
##$TDoff= 0
##$TI= <>
##$TILT= no
##$TM1= 0
##$TM2= 0
##$TOPLEV= 0
##$USERP1= <user>
##$USERP2= <user>
##$USERP3= <user>
##$USERP4= <user>
##$USERP5= <user>
##$WDW= 1
##$XDIM= 131072
##$YMAX_p= 446086838
##$YMIN_p= -113250701
##$CURPLOT= <Network HP LaserJet P1505>
##$CURPRIN= <$Network HP LaserJet P1505>
##$DFORMAT= <normdp>
##$LAYOUT= <+/1D_H.xwp>
##$LFORMAT= <normlp>
##$PFORMAT= <normpl>
##$SURQMSG= 1
$$ End of Bruker specific parameters
$$ ---------------------------------
##NTUPLES= NMR SPECTRUM
##VAR_NAME=  FREQUENCY,     SPECTRUM/REAL,   SPECTRUM/IMAG
##SYMBOL=    X,             R,               I
##VAR_TYPE=  INDEPENDENT,   DEPENDENT,       DEPENDENT
##VAR_FORM=  AFFN,          ASDF,            ASDF
##VAR_DIM=   131072,        131072,          131072
##UNITS=     HZ,            ARBITRARY UNITS, ARBITRARY UNITS
##FACTOR=    0.0627417313425165, 1,          1
##FIRST=     8223.62146879498, -3263,        -101784
##LAST=      0,             -1432,           -102719
##MIN=       0,             -113250701,      0
##MAX=       8223.62146879498, 446086838,    0
$$ Real data points
##PAGE= N=1
##DATA TABLE= (X++(R..R)), XYDATA
$$ [...]
61366E33569K143L702L663K026Q33J505L045L360J821j35p85K12J996L672M732
$$ 533569 535712 539414 543077 545103 545936 547441 550486 553846 555667 555532 554747 554959 556955 560627 565359
61351E65359M751L585J955J040J065Q54n62k425l176k625k048k026j557o2R91
$$ 565359 570110 573695 575650 576690 577755 578609 578047 575622 572446 569821 567773 565747 564190 564128 565119
61336E65119j23k551l520j967P3L05r01j578j044l45j94j44K00M28L74O62J493
$$ 565119 564996 562445 558925 556958 557031 557336 556435 554857 553813 553468 553274 553130 553330 553758 554132 554794 556287
61319E56287J924J226K47K86J164J594J178P79Q81R58P42R64K122L506M250M581
$$ 556287 558211 559437 559684 559970 561134 562728 563906 564685 565566 566524 567266 568230 570352 573858 578108 582689
61303E82689N147N709N472M452L549L342L561L780L963M284M938O168P912R388
$$ 582689 587836 593545 599017 603469 607018 610360 613921 617701 621664 625948 630886 637054 644966 654354
61289F54354R586Q418P007O698P864R629J0519R567P182M865L773L758M026M222
$$ 654354 663940 672358 679365 686063 693927 703556 714075 723642 730824 735689 739462 743220 747246 751468
61275G51468M293L820K623J721K508M659O050N196K852O56q06j763k111j638q91
$$ 751468 755761 759581 762204 763925 766433 771092 777142 782338 785190 785846 785040 783277 781166 779528 778637
61260G78637n78m09M23J733K595L041M126N901O816N954M696M921O498Q019R359
$$ 778637 778059 777650 778073 779806 782401 785442 789568 795469 802285 808239 812935 817856 824354 832373 841732
61245H41732J1638J4589J5998J4538J1683R605Q404O819M720L154K272J058p43
$$ 841732 853370 867959 883957 898495 910178 919783 928187 935006 939726 942880 945152 946210 945467
61232I45467k162k915m248o959r814j1056j0670r958r503q815p792p214p483p769
$$ 945467 943305 940390 936142 929183 919369 908313 897643 887685 878182 869367 861575 854361 846878 839109
61218H39109o971n125l366k496j894j45L048O059O977N867M522M079L986L616
$$ 839109 832138 827013 823647 821151 819257 819112 822160 828219 835196 841063 845585 849664 853650 857266
61204H57266L474L958M256L800L809N733Q719J0429J0238R805J0192J0127Q036
$$ 857266 860740 864698 868954 872754 876563 882296 891015 901444 911682 921487 931679 941806 949842
61191I49842M528J784J080J887K976L655L953M111M030L199J367p65j933j556
$$ 949842 954370 956154 957234 959121 962097 965752 969705 973816 977846 981045 982412 981647 979714 978158
61177I78158l67L18k48j717k972l012j787j37J202K246L183L783L862L795L843
$$ 978158 977791 978109 977861 976144 973172 970160 968373 968236 969438 971684 974867 978650 982512 986307 990150
61162I90150L513K544J992L092N261O592O394N909O247O940O999O298N196L797
$$ 990150 993663 996207 998199 1001291 1006552 1013144 1019538 1025447 1031694 1038634 1045633 1051931 1057127 1060924
61148A060924K366J689K209L268L851L687L199K939L494N317P990J0121J0695
$$ 1060924 1063290 1064979 1067188 1070456 1074307 1077994 1081193 1084132 1087626 1092943 1100933 1111054 1121749
61135A121749J0322J0660J2675J5595J7485J6888J4354J2186J2015J2721J1677
$$ 1121749 1132071 1142731 1155406 1171001 1188486 1205374 1219728 1231914 1243929 1256650 1268327
61124A268327Q126M188K144J882J787J036m4j222k667m139m901m602l759l288
$$ 1268327 1276453 1280641 1282785 1284667 1286454 1287490 1287446 1286224 1283557 1279418 1274517 1269915 1266156 1262868
61110A262868l743m929o028o377o229o418p226q131q794r605j0943j2508j3650
$$ 1262868 1259125 1254196 1248168 1241791 1235562 1229144 1221918 1213787 1204993 1195388 1184445 1171937 1158287
61097A158287j3915j3148j1771j1040j1949j3475j3090r773n536l101k981l794
$$ 1158287 1144372 1131224 1119453 1108413 1096464 1082989 1069899 1060126 1054590 1051489 1048508 1044714
61085A044714m582n453o452p257q000r169j0454j0641r011o316m090l199l172
$$ 1044714 1040132 1034679 1028227 1020970 1012970 1003801 993347 982706 973695 967379 963289 960090 956918
61072I56918k806j382O53K451L958N724P639Q856R350J0450J3096J6360J8568
$$ 956918 954112 952730 953383 955834 959792 965516 973155 982011 991361 1001811 1014907 1031267 1049835
61059A049835J9295J9498K0224K1928K4480K7051K8531K8808K9057L0118L1265
$$ 1049835 1069130 1088628 1108852 1130780 1155260 1182311 1210842 1239650 1268707 1298825 1330090
61048A330090L1390L0602K9638K8542K7178K6241K6178K5654K2838J8052J3492
$$ 1330090 1361480 1392082 1421720 1450262 1477440 1503681 1529859 1555513 1578351 1596403 1609895
61037A609895J0230P150L131j308n162q387j1421j4216j6561j8626k0562k2070
$$ 1609895 1620125 1627275 1630406 1629098 1623936 1615549 1604128 1589912 1573351 1554725 1534163 1512093
61025A512093k2875k3156k3159k2907k2484k2037k1274j9748j7868j6889j7283
$$ 1512093 1489218 1466062 1442903 1419996 1397512 1375475 1354201 1334453 1316585 1299696 1282413
61014A282413j7750j6535j3443r987p656o478n214k715R28M470O767P913Q999
$$ 1282413 1264663 1248128 1234685 1224698 1217042 1210564 1205350 1202635 1203563 1208033 1214800 1222713 1231712
61001A231712J0886J3477J6158J8630K1121K4065K7605L1522L5516L9458M3153
$$ 1231712 1242598 1256075 1272233 1290863 1311984 1336049 1363654 1395176 1430692 1470150 1513303
60990A513303M6169M8405N0703N4094N8479O2894O7240P2489P8797Q4756Q9549
$$ 1513303 1559472 1607877 1658580 1712674 1771153 1834047 1901287 1973776 2052573 2137329 2226878
60979B226878R4460J00950J08257J14653J20395J27377J36009J44477J51431J57723
$$ 2226878 2321338 2422288 2530545 2645198 2765593 2892970 3028979 3173456 3324887 3482610
60969C482610J64789J72749J80999J89734J99934K12405K27395K44797K64343
$$ 3482610 3647399 3820148 4001147 4190881 4390815 4603220 4830615 5075412 5339755
60960E339755K85865L09459L35311L63946L97440M39877M95429N66024O51649
$$ 5339755 5625620 5935079 6270390 6634336 7031776 7471653 7967082 8533106 9184755
60951I184755P52360Q68639J000414J147170J308123J480519J660031J846827
$$ 9184755 9937115 10805754 11806168 12953338 14261461 15741980 17402011 19248838
60943A9248838K046308K248139K394308K380511K118334J617332J005096M54694
$$ 19248838 21295146 23543285 25937593 28318104 30436438 32053770 33058866 33513560
60935C3513560Q4031q3355q3753K6917J68593K21643O3062l52035r42957j545936
$$ 33513560 33597591 33514236 33430483 33457400 33625993 33847636 33910698 33558663 32615706 31069770
60925C1069770k011087k271057k341147k277875k140390j971976j796251j621767
$$ 31069770 29058683 26787626 24446479 22168604 20028214 18056238 16259987 14638220
60917A4638220j451017j287112j133851r93059q64990p50728o52206n70054n02669
$$ 14638220 13187203 11900091 10766240 9773181 8908191 8157463 7505257 6935203 6432534
60908F432534m47234m00749l60497l24728k93027k65475k41534k19997j99771
$$ 6432534 5985300 5584551 5224054 4899326 4606299 4340824 4099290 3879293 3679522
60899C679522j80434j62372j46442j33146j22017j12331j04188r8060r3315q8327
$$ 3679522 3499088 3336716 3190274 3057128 2935111 2822780 2718592 2620532 2527217 2438890
60889B438890q2189p5408o8692o2134n5935n0736m6740m3360m0180l7371l4887
$$ 2438890 2356701 2281293 2212601 2150467 2094532 2043796 1997056 1953696 1913516 1876145 1841258
60878A841258l2312k9794k8057k7102k6127k5091k4883k5320k4665k2162j9628
$$ 1841258 1808946 1779152 1751095 1723993 1697866 1672775 1647892 1622572 1597907 1575745 1556117
60867A556117j9063j9822j9673j7821j5393j3485j2169j1175j0160q431n478j909
$$ 1556117 1537054 1517232 1497559 1479738 1464345 1450860 1438691 1427516 1417356 1408925 1403447 1401538
60855A401538R44K418L046L949O055R455J3082J5506J6536J7517J9580K2329K4682
$$ 1401538 1402482 1404900 1407946 1411895 1417950 1427405 1440487 1455993 1472529 1490046 1509626 1531955 1556637
60842A556637K6276K7289K7739K7712K7641K7549K6620K4258K1026J7869J5024
$$ 1556637 1582913 1610202 1637941 1665653 1693294 1720843 1747463 1771721 1792747 1810616 1825640
60831A825640J2214R086M983o64p005j2071j5304j8491k3043k7718l0568l1916
$$ 1825640 1837854 1846940 1851923 1851259 1844254 1832183 1816879 1798388 1775345 1747627 1717059 1685143
60819A685143l3499l5526l6652l6387l5532l4474l2861l0926k9385k8049k6162
$$ 1685143 1651644 1616118 1579466 1543079 1507547 1473073 1440212 1409286 1379901 1351852 1325690
60808A325690k4030k2696k2026k0912j9449j8845j9004j8259j6236j4929j5714
$$ 1325690 1301660 1278964 1256938 1236026 1216577 1197732 1178728 1160469 1144233 1129304 1113590
60797A113590j7076j6809j5120j3965j4149j4847j5587j6951j9066k0647k0217
$$ 1113590 1096514 1079705 1064585 1050620 1036471 1021624 1006037 989086 970020 949373 929156
60786I29156j7810j4964j3200j2645j2196j0867q870p293o861p419q464r804j1475
$$ 929156 911346 896382 883182 870537 858341 847474 838604 831311 824450 817031 808567 798763 787288
60773G87288j3255j4474j4397j2883j0686q832p585o361m824l555l224l534l437
$$ 787288 774033 759559 745162 732279 721593 712761 705176 698815 693991 690436 687212 683678 680241
60760F80241k254k88J430J853Q53l24k16J061J900J524J149K160M017N079M679
$$ 680241 677987 677699 679129 680982 681835 681511 681295 682356 684256 685780 686929 689089 693106 698185 702864
60745G02864L433K019P93J17l1l34j119j566r19J79O42M66J09q05k557l901l458
$$ 702864 706297 708316 709109 709226 709195 708861 707742 706176 705257 705436 706078 706544 706653 705848 703291 699390 695932
60728F95932k138k145l725m932m766m442n107o176o644o470n945n126m492m793
$$ 695932 693794 691649 687924 682992 678226 673784 668677 662501 655857 649387 643442 638316 633824 629031
60714F29031n683n852n064m552m880m914l828k548k177k373k449k720l431l446
$$ 629031 623348 617496 612432 607880 603000 598086 594258 591710 589533 587160 584711 581991 578560 575114
60700E75114j665R00K016J042l30j31J894M368N721N556M757M286M084L655L400
$$ 575114 573449 574349 576365 577407 577077 576946 578840 583208 588929 594485 599242 603528 607612 611267 614667
60685F14667M218N745O303N099L365K602K545J713n96l477n209m784l075k384
$$ 614667 618885 624630 630933 636032 639397 641999 644544 646257 645661 642184 636975 632191 629116 626732
60671F26732l955o266o963o094n691o387o751o333o692q274q852o869m268l743
$$ 626732 622777 616511 609548 603454 597763 591376 584625 578292 571600 563326 554474 547605 543337 539594
60657E39594m818n096m148l648m194m515l706k310j050j94p7q24j566j288l09
$$ 539594 534776 529680 525532 521884 517690 513175 509469 507159 506109 505915 505838 505014 503448 502160 501851
60642E01851K71K98L98M66j33j035j123k40P43J475K330L088K907J836J036J259
$$ 501851 502122 502420 502818 503284 503151 502116 500993 500753 501496 502971 505301 508389 511296 513132 514168 515427
60626E15427K147L120L878M102L763L681M586N851O274N885N609N530N120M866
$$ 515427 517574 520694 524572 528674 532437 536118 540704 546555 552829 558714 564323 569853 574973 579839
60612E79839N751P143P281O086N337N563N064K877N90o8M03P24R64J638K121J716
$$ 579839 585590 592733 600014 606100 611437 617000 622064 624941 625531 625463 625866 626590 627554 629192 631313 633029
60596F33029J189J534K097J609L39m14m57n87p79j44J282K225J758Q3k183m424
$$ 633029 634218 635752 637849 639458 639797 639383 638926 638339 637560 637416 638698 640923 642681 642764 640581 636157
60580F36157n822n978n730o251p343p847p676p898q549p986n337k368j593l204
$$ 636157 630335 624357 618627 612376 605033 597186 589510 581612 573063 565077 559740 557372 555779 552575
60566E52575n037n239l902k096m35R82J945K185J882J555J421J183P08M21P56
$$ 552575 547538 542299 538397 536301 535866 536848 538793 540978 542860 544415 545836 547019 547727 548148 548904
60551E48904J435J887K131K550K825K074M75l00Q30K576K738J125j94M47K560
$$ 548904 550339 552226 554357 556907 559732 561806 562281 561981 562811 565387 568125 569250 569056 569503 572063
60536E72063M624N749N706M406K343Q07O75J242J147K34l91m2Q10J643K634L780
$$ 572063 576687 582436 588142 592548 594891 595698 596373 597615 598762 598996 598605 598563 599373 601016 603650 607430
60520F07430M190L290K273L088N910Q697R741R734J0453J2135J3361J3455J3581
$$ 607430 611620 614910 617183 620271 626181 634878 644619 654353 664806 676941 690302 703757 717338
60507G17338J4911J6685J7185J6033J4416J3097J1307Q052L668n53l801o143p687
$$ 717338 732249 748934 766119 782152 796568 809665 820972 829024 832692 832139 828338 822195 814508
60494H14508q087o988m536j256K291N617Q336J0205J1118J1162J0973J1715J4127
$$ 814508 806421 799433 794897 793641 795932 801549 809885 820090 831208 842370 853343 865058 879185
60481H79185J7478K0127K1343K1895K2456K2194J9818J5489J0676O359K525o94
$$ 879185 896663 916790 938133 960028 982484 1004678 1024496 1039985 1050661 1057020 1059545 1058851
60469A058851k756l930n444p554q684p535n170l783m045m937n629n878m960k041
$$ 1058851 1056095 1052165 1046721 1039167 1030483 1022948 1017778 1013995 1009950 1005013 999384 993506 988546 986505
60455I86505K001M852N546N613O785Q968J1495J4858J9644K4710K8202L0099L2207
$$ 986505 988506 993358 998904 1004517 1011302 1020270 1031765 1046623 1066267 1090977 1119179 1149278 1181485
60442A181485L5806M0622M6015N1705N7159O1553O4715O6887O7418O4985N9478
$$ 1181485 1217291 1257913 1303928 1355633 1412792 1474345 1539060 1605947 1673365 1738350 1797828
60431A797828N2184M3439L1702J6095j410j7873l2447m5916n7790o6099p0195
$$ 1797828 1850012 1893451 1925153 1941248 1939838 1921965 1889518 1843602 1785812 1719713 1649518
60420A649518p1920p3155p3665p2168o8515o3683n8278n2247m5876m0112l5724
$$ 1649518 1577598 1504443 1430778 1358610 1290095 1226412 1168134 1115887 1070011 1029899 994175
60409I94175l2657l0369k8423k6620k4822k2817k0365j7478j4646j2608j1628
$$ 994175 961518 931149 902726 876106 851284 828467 808102 790624 775978 763370 751742
60398G51742j1138j0300q960p830p645q176q241o951m886l703m301n693o137n159
$$ 751742 740604 730304 721344 713514 705869 697693 689452 682501 677615 673912 669611 663918 657781 652622
60384F52622l958l877n003o216o188m335j448N78L43j527l009l028k427k428k878
$$ 652622 648664 644787 639784 633568 627380 623045 621597 622175 622518 620991 617982 614954 612527 610099 607221
60369F07221k743j704n63k03p05j390j466q19k09l75j031j324j179j187j170k03
$$ 607221 604478 602774 602211 602008 601303 599913 598447 597628 597419 597044 596013 594689 593510 592323 591153 590950
60353E90950J533K384J625Q35J673L478M549M659M557M002K385Q10J146L021L983
$$ 590950 592483 594867 596492 597327 599000 602478 607027 611686 616243 620245 622630 623440 624586 627607 631590
60338F31590K947J425Q83R89J092J464K048J943J180J303K790L661K341M12N22
$$ 631590 634537 635962 636845 637834 638926 640390 642438 644381 645561 646864 649654 653315 655656 656068 656590
60323F56590K593M203M176L679L918M740N741P077Q491Q787P106M237K121K242
$$ 656590 659183 663386 667562 671241 675159 679899 685640 692717 701208 709995 717101 721338 723459 725701
60309G25701M358O597O999N473L820L471L733L080J562Q47J988M157N753O044
$$ 725701 730059 736656 743655 749128 752948 756419 760152 763232 764794 765641 767629 771786 777539 783583
60295G83583N582N484O302P500Q206Q566R554J1147J1772J0317P622M965K098
$$ 783583 789165 794649 800951 808451 816657 825223 834777 845924 857696 868013 875635 880600 882698
60282H82698j679n445p488p803p851p927o812m260j916j128j483k151l107m126
$$ 882698 881019 875574 868086 860283 852432 844505 837693 833433 831517 830389 828906 826755 823648 819522
60268H19522m145k858j747k136l064k607p78L01p97k979l945k662j66J866K955
$$ 819522 815377 812519 810772 808636 805572 802965 802187 802488 801691 798712 794767 792105 791939 793805 796760
60253G96760M066O127Q812J1254J3452J6019J8781K0720K1519K2040K2811K3038
$$ 796760 800826 806953 815765 827019 840471 856490 875271 895991 917510 939550 962361 985399
60241I85399K1676J8673J4517R320L111l614j0318j6875k2856k6891k7688k5511
$$ 985399 1007075 1025748 1040265 1049585 1052696 1049082 1038764 1021889 999033 972142 944454 918943
60229I18943k2021j8734j6091j3876j1918j0344r312q544p280n167l013k038k313
$$ 918943 896922 878188 862097 848221 836303 825959 816647 808103 800823 795656 792643 790605 788292
60216G88292k800l033l641m732n058l691j726j082k125l475l836l074j789p61
$$ 788292 785492 782459 778818 774086 769028 765337 763611 762529 760404 756929 753093 750019 748230 747469
60202G47469o93j729l215m423n198n372m188j257K190M057L493J585J42K26J596
$$ 747469 746776 745047 741832 737409 732211 726839 722651 721394 723584 727641 731134 732719 732861 733087 734683
60187G34683K803K219j90k417k583j095L10J093K049L187L367K328J474J827K533
$$ 734683 737486 739705 739515 737098 734515 733420 733730 734823 736872 740059 743426 745754 747228 749055 751588
60172G51588K217Q64n38j305j257l36J080K158K548K731K925K622J912K156M074
$$ 751588 753805 754669 754131 752826 751569 751233 752313 754471 757019 759750 762675 765297 767209 769365 773439
60157G73439O089O094M313K818K625L047L734N342P651Q948Q303P060O902P591
$$ 773439 779528 785622 789935 792753 795378 798425 802159 807501 815152 824100 832403 839463 846365 853956
60143H53956P839P371O797O143N196M827O286R023J0695R850P494N559M785M575
$$ 853956 861795 869166 875963 882106 887302 892129 898415 907438 918133 927983 935477 941036 945821 950396
60129I50396M124L025J446K50K87J160J284k31k454l983m759n642o737p224o751
$$ 950396 954520 957545 958991 959241 959528 960688 961972 961741 959287 955304 950545 944903 938166 930942 924191
60114I24191o065o073o872p780p896o684m578k960k989m337n477n222l798k438
$$ 924191 918126 912053 905181 897401 889505 882821 878243 875283 872294 867957 862480 857258 853460 851022
60100H51022k196k917l285k263o18j63j098j237J023M025M754K870R39Q28J826
$$ 851022 848826 845909 842624 840361 839743 839580 838482 837245 838268 842293 847047 849917 850856 851684 853510
60085H53510K621L161L758M107M226M976O569P740P546O747O292N743M622M105
$$ 853510 856131 859292 863050 867157 871383 876359 882928 890668 898214 904961 911253 916996 921618 925723
60071I25723N298O810O158L455J451J707K707K426J075K98Q63K233L598M372M149
$$ 925723 931021 937831 943989 947444 948895 950602 953309 955735 956810 957108 957971 960204 963802 968174 972323
60056I72323L057J958J715K311K989L080K515J717J146Q01K32p01j359j139n96
$$ 972323 975380 977338 979053 981364 984353 987433 989948 991665 992811 993612 993844 993143 991784 990645 990049
60041I90049j003k622m148m222k979j818j919l182m292l855j915l15r58l580n879
$$ 990049 989046 986424 982276 978054 975075 973257 971338 968156 963864 960009 958094 957779 956821 953241 947362
60026I47362o067m632l269k732k343j287K09J127Q44m2m09j70o00k507m781n711
$$ 947362 941295 936663 933394 930662 928319 927032 927241 928368 929212 929170 928761 928591 927991 925484 920703 914992
60010I14992n412n563o800p940q248q738j0248j1573j0982q777o873o314o526
$$ 914992 909580 904017 897217 889277 881029 872291 862043 850470 839488 830711 823838 817524 810998
59997H10998o759o857o631n749m487l689l678l945l922l354j887O39L295M458
$$ 810998 804239 797382 790751 785002 780515 776826 773148 769203 765281 761927 760040 760679 763974 768432
59983G68432L645K239J937K968M241M731M256L424L165L950N165N651N088M321
$$ 768432 772077 774316 776253 779221 783462 788193 792449 795873 799038 802988 808153 813804 818892 823213
59969H23213M010L638K253l23l589o979r722j0640r170o484m677m787o180p741
$$ 823213 827223 830861 833114 832791 829202 822223 812501 801861 792691 786207 781530 776743 770563 762822
59955G62822q784q777p271m759k788k462l167l524l252l343m369n521n626m641
$$ 762822 754038 745261 737990 733231 730443 727981 724814 721290 718038 714695 710326 704805 699179 694538
59941F94538l601l379l954m681m824l810j636P44J886J234j33n61M86K131L310
$$ 694538 690937 687558 683604 678923 674099 670289 668653 669397 671283 672517 672384 671823 672309 674440 677750
59926F77750L726L638L331L020K783K358J463M88L34J162J863J283l78j942k616
$$ 677750 681476 685114 688445 691465 694248 696606 698069 698557 698891 700053 701916 703199 702821 700879 698263
59911F98263k445j782j073r15j496k108j932j126m12J52R21J382N02j362k308
$$ 698263 695818 694036 692963 692048 690552 688444 686512 685386 684974 685126 686047 687429 687931 686569 684261
59896F84261j401j11k68j493j989j187k21P6K66J045J989K134J431R46J713L478
$$ 684261 682860 682749 682481 680988 678999 677812 677591 677667 677933 678978 680967 683101 684532 685478 687191 690669
59880F90669M792M443K747J123M40L84M34O14R57J222J702L275N743P186O246
$$ 690669 695461 699904 702651 703774 704214 704598 705032 705646 706603 707825 709527 712802 718545 725731 731977
59865G31977M176L105L013K323J033R89K788M714N511O103P370Q127P081N426
$$ 731977 736153 739258 742271 744594 745627 746616 749404 754118 759629 765732 773102 781229 788310 793736
59851G93736N376O772P124M962J549r55j695j202m25j43o66j590k198k216j838
$$ 793736 799112 805884 813008 817970 819519 818564 816869 815667 815242 815099 814433 812843 810645 808429 806591
59836H06591j150r9J003J617J734J916K538L435M444N659O900P459O847N508M466
$$ 806591 805441 805342 806345 807962 809696 811612 814150 817585 822029 827688 834588 842047 848894 854402 858868
59821H58868M379N215O602Q001Q613P732N687M039M077N076M868K507m15j834
$$ 858868 863247 868462 875064 883065 891678 899410 905097 909136 913213 918289 923157 925664 925249 923415
59807I23415j888k329l747m892m789l977l108j808J62J846K306K091K445L738
$$ 923415 921527 919198 915451 910559 905770 901793 898685 896877 897039 898885 901191 903282 905727 909465
59793I09465N574P592R014Q410N412K045P12J251J544O64l88r74j789l171m295
$$ 909465 915039 922631 931645 940055 945467 947512 948224 949475 951019 951683 951295 950321 948532 945361 941066
59778I41066m748n319o371p000o751o704p724q805q647p722p247o890n288k560
$$ 941066 936318 930999 924628 917628 910877 904173 896449 887644 878997 871275 864028 857138 851850 849290
59764H49290m84ol4O86J610J098j437m693o594o124m240k930l186m078m093k981
$$ 849290 848806 848800 848766 849452 851062 852160 850723 846030 839436 833312 829072 826142 822956 818878 814785 811804
59748H11804j721j077j094j823l407n201n913n137m055l891m316m190l389k965
$$ 811804 810083 809006 807912 806089 802682 797481 791568 786431 782376 778485 774169 769979 766590 763625
59734G63625l489m195m088l250k593k600k825k502j356K70J741K513K415J796
$$ 763625 760136 755941 751853 748603 746010 743410 740585 738083 736727 736997 738738 741251 743666 745462
59720G45462J356J583K210K430J777P27J05J2k79j145j794j166N90K169K679K505
$$ 745462 746818 748401 750611 753041 754818 755545 755650 755662 755383 754238 752444 751278 751868 754037 756716 759221
59704G59221K325J990R93l45r81m70N09J077J133J223J801K820L741L972L466
$$ 759221 761546 763536 764529 764184 763203 762733 763242 764319 765452 766675 768476 771296 775037 779009 782475
59689G82475K925L003L435L490L247L574M653N436N135M439M406M640L670J096
$$ 782475 785400 788403 791838 795328 798575 802149 806802 812238 817373 821812 826218 830858 834528 835624
59675H35624j514k230q10J160J944J361P27J129J988J955R88N97J628K860K670
$$ 835624 834110 831880 831070 832230 834174 835535 836262 837391 839379 841334 842322 842919 844547 847407 850077
59660H50077J227j06q57j562k130j771o56j60q59j584j079L26J489K021K188J972
$$ 850077 851304 851198 850341 848779 846649 844878 844222 844062 843203 841619 840540 840866 842355 844376 846564 848536
59644H48536J224L68J00M66R56J312J684K109K379K373K112J584R46P00J141J728
$$ 848536 849760 850128 850228 850694 851650 852962 854646 856755 859134 861507 863619 865203 866149 866849 867990 869718
59628H69718J584O39k84o73j042k132l700m647m260l053k182k232k791l087k830
$$ 869718 871302 871941 871657 870984 869942 867810 864110 859463 855203 852150 849968 847736 844945 841858 839028
59613H39028k419k575l687n261n989m962k998k092l115m603m696l615l072l472
$$ 839028 836609 834034 830347 825086 819097 814135 811137 809045 805930 801327 796631 793016 789944 786472
59599G86472l339j755O6O45M66J048K492L339K746J544R09J006J305J577J901
$$ 786472 783133 781378 781444 782089 782555 783603 786095 789434 792180 793724 794633 795639 796944 798521 800422
59584H00422K108J668K26j842l463l613k269m97O20Q54M20p46k522l801l316j394
$$ 800422 802530 804198 804424 802582 799119 795506 793237 792740 793360 794214 794634 793888 791366 787565 784249 782855
59568G82855J94N43O18J268J505O1k120k827j778j086k038l252k965j630q18o79
$$ 782855 783049 783592 784210 785478 786983 787044 784924 782097 780319 779233 777195 773943 770978 769348 768530 767851
59552G67851k68K77j95j702k850k848k323j768q71J32R8j049j529j21J825K170
$$ 767851 767583 767860 767665 765963 763113 760265 757942 756174 755303 755435 755533 754484 752955 752834 754659 756829
59536G56829Q33n44r81p07K8J144K017K049J786K150K741K349J003L3MJ1p59k007
$$ 756829 757662 757118 756137 755430 755458 756602 758619 760668 762454 764604 767345 769694 770697 770730 770734 770745 769986 767979
59518G67979l195m183m725m426l525k721k119j354o79o37p17J15J417J627P34
$$ 767979 764784 760601 755876 751450 747925 745204 743085 741731 741052 740415 739698 739813 741230 742857 743591
59503G43591N76J780K474J239n26p30M99J599K000K021J521M78P7J331L365M704
$$ 743591 744167 745947 748421 749660 749134 748404 748903 750502 752502 754523 756044 756522 756599 757930 761295 765999
59487G65999N546O810P814P220O002O820J0054J2882J3210J2591J3902J7404K0391
$$ 765999 771545 778355 786169 793389 799391 806211 816265 829147 842357 854948 868850 886254 906645
59474I06645K0011J5490Q265Q65m615p600q598q007o008l521k004j815j766p85
$$ 906645 926656 942146 950411 951276 946661 939061 930463 922456 916448 912927 910923 909108 907342 906557
59460I06557P95K155L160L829L476J500j383l606m360m151l989m555n888p310
$$ 906557 907352 909507 912667 916496 919972 921472 920089 916483 912123 907972 903983 899428 893540 886230
59446H86230p887p513p176p643q281p909o513n085m044k880j468n91o24q09m97
$$ 886230 878343 870830 863654 856011 847730 839821 833308 828223 824179 821299 819831 819240 818616 817807 817310
59431H17310k87r36j874j938j223p76o13M42K631M384M400L514L516M930O966
$$ 817310 817023 816087 814213 812275 811052 810276 809663 810105 812736 817120 821520 825034 828550 833480 840446
59416H40446Q940J0561J1362J1071J0176R115P417M896L015L248M376L605O34
$$ 840446 849386 859947 871309 882380 892556 901671 909088 913984 916999 920247 924623 928228 928862
59403I28862j589r28J214K494L064M564O996Q633Q662Q102Q204R104J0057J0168
$$ 928862 927273 926345 927559 930053 933117 937681 944677 953310 961972 970074 978278 987382 997439 1007607
59389A007607R118P876Q159J0351J2564J2647J0469P303L856K09l034n161o520
$$ 1007607 1016725 1024601 1032760 1043111 1055675 1068322 1078791 1086094 1089950 1090159 1087125 1081964 1075444
59376A075444p845q798q654q022q138q760q615p850p952q929q754o377l363j364
$$ 1075444 1067599 1058801 1050147 1042125 1033987 1025227 1016612 1008762 1000810 991881 983127 976750 973387 972023
59362I72023M11L688Q299J2395J4844J6148J7335J9044K1459K4422K7688L1340
$$ 972023 972434 976122 984421 996816 1011660 1027808 1045143 1064187 1085646 1110068 1137756 1169096
59350A169096L5175L7241L4143K4197R916l718j3300j8509k0196j8623j3938p181
$$ 1169096 1204271 1241512 1275655 1299852 1309768 1306050 1292750 1274241 1254045 1235422 1221484 1214303
59338A214303k7N837Q481N831k639j4241k4258k9549l0681l0205k9505k8237k6130
$$ 1214303 1214276 1220113 1228594 1234425 1231786 1217545 1193287 1163738 1133057 1102852 1073347 1045110 1018980
59325A018980k3830k1676j9008j5446j1791q814o108l218r91l88n57K84K273L757
$$ 1018980 995150 973474 954466 939020 927229 918415 912307 909089 908098 907710 907153 907437 909710 913467
59311I13467L747K963K234J471P34R01K413M447O112P568R137J0206J0001Q876
$$ 913467 917214 920177 922411 923882 924616 925517 927930 932377 938489 946057 955194 965400 975401 984277
59297I84277P925P719Q081Q805R851J1105J2467J4008J5657J6938J7412J7180
$$ 984277 992202 999921 1008002 1016807 1026658 1037763 1050230 1064238 1079895 1096833 1114245 1131425
59285A131425J6693J6269J5927J5473J4697J3788J3349J3523J3268J1374Q122
$$ 1131425 1148118 1164387 1180314 1195787 1210484 1224272 1237621 1251144 1264412 1275786 1283908
59274A283908N091L170J687l12k896n770q837j1715j3573j4140j4207j4452j4528
$$ 1283908 1288999 1292169 1293856 1293544 1290648 1284878 1276041 1264326 1250753 1236613 1222406 1207954 1193426
59261A193426j3910j2945j2262j1756j0939r866q923q025o677m646k150M26K642
$$ 1193426 1179516 1166571 1154309 1142553 1131614 1121748 1112825 1104800 1098123 1093477 1091327 1091753 1094395
59248A094395M172N070N713O426P632J0010J3378J5509J3431O618k034q874j2308
$$ 1094395 1098567 1103637 1109350 1115776 1123408 1133418 1146796 1162305 1175736 1182354 1180320 1171446 1159138
59235A159138j2827j1818j1029j1698j3070j2997j0988r240r470j0203q945n816
$$ 1159138 1146311 1134493 1123464 1111766 1098696 1085699 1074711 1065471 1056001 1045798 1036853 1031037
59223A031037l047j797j497j709k423k744j533O20J998K399L345N349P046P495
$$ 1031037 1027990 1026193 1024696 1022987 1020564 1017820 1016287 1016907 1018905 1021304 1024649 1029998 1037044 1044539
59209A044539P500P994Q701R223R778J0057Q924O276L877L101L041K029k7k150
$$ 1044539 1052039 1060033 1068734 1077957 1087735 1097792 1106716 1112992 1116869 1119970 1123011 1125040 1125013 1122863
59195A122863m173o595r059j0424j0336r577q965q705q809r143r193q427p073
$$ 1122863 1118690 1112095 1103036 1092612 1082276 1072699 1063734 1055029 1046220 1037077 1027884 1019457 1012384
59182A012384n865n027l992k188K30K428L535L478L293M099N558N991M552K491
$$ 1012384 1006519 1001492 997500 995312 995542 997970 1001505 1004983 1008276 1012375 1017933 1023924 1028476 1030967
59168A030967J473J338N97j258l228m444m938m710l344j232M3o11k358l538l678
$$ 1030967 1032440 1033778 1034375 1033117 1029889 1025445 1020507 1015797 1012453 1011221 1011264 1010653 1008295 1004757 1001079
59153A001079l541l599l404k492j136p9O0p83j788j557N88L549N419N509M715
$$ 1001079 997538 993939 990535 988043 986907 986828 986888 986105 984317 982760 983348 986897 992316 997825 1002540
59138A002540L850K662J016o0M74K042L062K961K529K319J863P40n01j022p01
$$ 1002540 1006390 1009052 1010068 1010008 1010482 1012524 1015586 1018547 1021076 1023395 1025258 1025998 1025497 1024475 1023774
59123A023774P3J006J890K411K469K390K482K709L083L841M798N147M501L683
$$ 1023774 1023847 1024853 1026743 1029154 1031623 1034013 1036495 1039204 1042287 1046128 1050926 1056073 1060574 1064257
59109A064257L765M658N460N909O459P042O827N550M131L515L466L115K273J560
$$ 1064257 1068022 1072680 1078140 1084049 1090508 1097550 1104377 1109927 1114058 1117573 1121039 1124154 1126427 1127987
59095A127987J526K092K698K674J588l72k433l947m925n659o020n634m719m263
$$ 1127987 1129513 1131605 1134303 1136977 1138565 1138193 1135760 1131813 1126888 1121229 1115209 1109575 1104856 1100593
59081A100593n121p094r003r632q688p022n939n942o217n591l997k608k410l138
$$ 1100593 1095472 1088378 1079375 1069743 1061055 1054033 1048094 1042152 1035935 1030344 1026347 1023739 1021329 1018191
59067A018191l794l732k878j421J85J284J791K543M078N444N378M587N268P959
$$ 1018191 1014397 1010665 1007787 1006366 1006551 1007835 1009626 1012169 1016247 1021691 1027069 1031656 1036924 1044883
59053A044883J0364J0397Q968Q316Q629Q279O946O204O709O864N361L435L104
$$ 1044883 1055247 1065644 1074612 1082928 1091557 1099836 1106782 1112986 1119695 1126559 1131920 1135355 1138459
59040A138459M208M752L715J918K14j609l592m648l998k859l283n279o395m852
$$ 1138459 1142667 1147419 1151134 1153052 1153266 1151657 1148065 1143417 1139419 1136560 1133277 1127998 1121603 1116751
59026A116751k135j170k531l960l820l305m406p037r496j0855j1320j0928r520
$$ 1116751 1114616 1113446 1110915 1106955 1103135 1099830 1095424 1088387 1078891 1068036 1056716 1045788 1036268
59013A036268p942p609q660r762r896r096p410m704j961j147k846n159n841m659
$$ 1036268 1028326 1020717 1012057 1002295 992399 983303 975893 971189 969228 968081 965235 960076 954235 949576
58999I49576k900j551q29p22j015j227j199j271j490j344p33l48m84m24L68J335
$$ 949576 946676 945125 944296 943574 942559 941332 940133 938862 937372 936028 935295 934947 934463 934039 934407 935742
58983I35742J842K180K735L067K721K164J942J699J067O46J081J851K249K814
$$ 935742 937584 939764 942499 945566 948287 950451 952393 954092 955159 955805 956886 958737 960986 963800
58969I63800M494O848Q481R001R209R672J0255J0948J1894J2659J2529J1675J1155
$$ 963800 968294 975142 983623 992624 1001833 1011505 1021760 1032708 1044602 1057261 1069790 1081465 1092620
58956A092620J1659J2835J3670J3069J0534P019M509L967M231L775K724K094J945
$$ 1092620 1104279 1117114 1130784 1143853 1154387 1161406 1165915 1169882 1174113 1177888 1180612 1182706 1184651
58943A184651J670J467J913K688L240M213O385Q650R106P939P286Q087R247J0095
$$ 1184651 1186321 1187788 1189701 1192389 1195629 1199842 1206227 1214877 1223983 1231922 1239208 1247295 1256542 1266637
58929A266637J1299J2671J2352R589O456N300N808O081N484M810M503M368M753
$$ 1266637 1277936 1290607 1302959 1312548 1319004 1324304 1330112 1336193 1341677 1346487 1350990 1355358 1360111
58916A360111O431R208J1753J3149J3853J4839J6254J7371J7738J7902J8605J9420
$$ 1360111 1366542 1375750 1387503 1400652 1414505 1429344 1445598 1462969 1480707 1498609 1517214 1536634
58904A536634J9068J7422J6237J6972J8562J8728J6969J4735J2791J0306O970
$$ 1536634 1555702 1573124 1589361 1606333 1624895 1643623 1660592 1675327 1688118 1698424 1705394
58893A705394M199L147K814J273j894n339p609q250p713o919o632o921p270p344
$$ 1705394 1709593 1712740 1715554 1716827 1714933 1709594 1701985 1693735 1686022 1679103 1672471 1665550 1658280 1650936
58879A650936p200o897o521o566p455q708r554j0366j2228j4872j6360j5539j3628
$$ 1650936 1643736 1636839 1630318 1623752 1616297 1607589 1598035 1587669 1575441 1560569 1544209 1528670 1515042
58866A515042j2661j3094j3688j3004j0433o613l368k467l776n243n199l893k410
$$ 1515042 1502381 1489287 1475599 1462595 1452162 1445549 1442181 1439714 1435938 1430695 1425496 1421603 1419193
58853A419193j136K3R52J797L310N737Q027R098R392J0225J2011J4020J5580J6596
$$ 1419193 1418057 1418080 1419032 1420829 1424139 1429876 1437903 1447001 1456393 1466618 1478629 1492649 1508229 1524825
58839A524825J7107J7016J6382J5493J4719J4387J4526J4617J4048J2975J2131
$$ 1524825 1541932 1558948 1575330 1590823 1605542 1619929 1634455 1649072 1663120 1676095 1688226
58828A688226J1665J0892R554Q513Q677R699J0289R440P069L873P30k060m855
$$ 1688226 1699891 1710783 1720337 1728850 1737527 1747226 1757515 1766955 1774024 1777897 1778627 1776567 1771712
58815A771712p552r042q864q910j1681j6777k0985k2315k2160k2678k3923k4651
$$ 1771712 1764160 1755118 1746254 1737344 1725663 1708886 1687901 1665586 1643426 1620748 1596825 1572174
58803A572174k4361k3100k0680j7568j5448j5456j6652j7398j7301j6627j5132
$$ 1572174 1547813 1524713 1504033 1486465 1471017 1455561 1438909 1421511 1404210 1387583 1372451
58792A372451j2976j1658j2277j3737j4325j4167j4402j4750j3978j2191j0662
$$ 1372451 1359475 1347817 1335540 1321803 1307478 1293311 1278909 1264159 1250181 1237990 1227328
58781A227328r777r042q811r891j1514j1833j0596r328q669p551n573m075m062
$$ 1227328 1217551 1208509 1199698 1189807 1178293 1166460 1155864 1146536 1137867 1130316 1124743 1120668 1116606
58768A116606m746n155n622o512o855n561l186j222j35Q07K150L490M046L445
$$ 1116606 1111860 1106705 1101083 1094571 1087716 1082155 1078969 1077747 1077612 1078419 1080569 1084059 1088105 1091550
58754A091550K099J003R33J682K388K545K144J061q05k643l122k060r08j063k448
$$ 1091550 1093649 1094652 1095585 1097267 1099655 1102200 1104344 1105405 1104600 1101957 1098835 1096775 1095867 1094804 1092356
58739A092356m183n806p200q012q032p763p851q153q029p328o461n625m644l626
$$ 1092356 1088173 1082367 1075167 1067155 1059123 1051360 1043509 1035356 1027327 1019999 1013538 1007913 1003269 999643
58725I99643l126l355l646l120j696l6J381K617L656M015L413K326J263o3k035
$$ 999643 996517 993162 989516 986396 984700 984664 986045 988662 992318 996333 999746 1002072 1003335 1003272 1001237
58710A001237l867m334l826m245o263p979p353m946k974k419k528k658k988l352
$$ 1001237 997370 993036 989210 984965 978702 970723 963370 958424 955450 953031 950503 947845 944857 941505
58696I41505k906j481j45K41J87P36J988L014K982J964Q66Q19K434N252P852Q757
$$ 941505 938599 937118 936973 937214 937401 938137 940125 943139 946121 948085 948951 949770 952204 957456 965308 974065
58680I74065P548N364M130M964P287R713J1489J2602J2898J2225J1380J1515J2173
$$ 974065 981613 986977 991107 996071 1003358 1013071 1024560 1037162 1050060 1062285 1073665 1085180 1097353
58667A097353J1346Q343N359M891O574P800O876M301J580J20Q30L385O026P191
$$ 1097353 1108699 1117042 1122401 1127292 1133866 1141666 1148542 1152843 1154423 1154543 1155373 1158758 1164784 1171975
58653A171975P146P076P131O653N819N443N336M469K733R75p66l390o765r385
$$ 1171975 1179121 1186197 1193328 1199981 1205800 1211243 1216579 1221048 1223781 1224756 1223990 1220600 1213835 1204450
58639A204450j0660j2089j5116j8864k1115k0926j9388j8200j8202j9034j9655
$$ 1204450 1193790 1181701 1166585 1147721 1126606 1105680 1086292 1068092 1049890 1030856 1011201
58628A011201j9174j7451j4965j2339j0230r208r179r179q394p132o247n953n996
$$ 1011201 992027 974576 959611 947272 937042 927834 918655 909476 901082 893950 887703 881750 875754
58615H75754o303o525n466k415J214L092K841K260K585L195L413L968N649P701
$$ 875754 869451 862926 857460 855045 856259 859351 862192 864452 867037 870232 873645 877613 883262 890963
58601H90963Q616P858O033L880J820J07j072j564j267n74n93k071m154n134m528
$$ 890963 899579 907437 913470 917350 919170 919277 918205 916641 915374 914800 914207 912136 907982 902848 898320
58586H98320l512l216l496l693l625l481l490l963m884n365m452k541j010l52
$$ 898320 894808 891592 888096 884403 880778 877297 873807 869844 864960 859595 855143 852602 851592 851240
58572H51240J98R70J207N16l32p08j096j949k627k270r48Q16K824M863O337P026
$$ 851240 851438 852408 853615 854131 853799 853091 851995 850046 847419 845149 844201 845017 847841 852704 859041 866067
58556H66067P619Q804J0398J1821J2731J2754J1487R350P660P080O731N502L519
$$ 866067 873686 882490 892888 904709 917440 930194 941681 951031 958691 965771 972502 978004 981523
58543I81523J664L88k30K0R62J563Q97o92k096k729k708k241j557j066q41k05
$$ 981523 983187 983575 983345 983365 984327 985890 986787 986095 983999 981270 978562 976321 974764 973698 972857 972652
58527I72652J503L941O041P153P529P857Q700J0197J1975J3475J4445J4857J4510
$$ 972652 974155 978096 984137 991290 998819 1006676 1015376 1025573 1037548 1051023 1065468 1080325 1094835
58514A094835J3272J1728J0839J0939J1673J2891J4573J5931J5998J5474J6486
$$ 1094835 1108107 1119835 1130674 1141613 1153286 1166177 1180750 1196681 1212679 1228153 1244639
58503A244639J9689K2950K4067K3635K3799K5058K5901K5205K3337K0957J8244
$$ 1244639 1264328 1287278 1311345 1334980 1358779 1383837 1409738 1434943 1458280 1479237 1497481
58492A497481J5553J3502J1827R238N147P79k248l997n847q268j0110j0447j0229
$$ 1497481 1513034 1526536 1538363 1547601 1552748 1553527 1551279 1547282 1541435 1533167 1523057 1512610 1502381
58479A502381j1127j3336j5735j7974k0838k4062k5574k4165k1622k0485k0480
$$ 1502381 1491254 1477918 1462183 1444209 1423371 1399309 1373735 1349570 1327948 1307463 1286983
58468A286983j9167j5866j2803j1993j2736j2956j1693r503p480o505o611o677
$$ 1286983 1267816 1251950 1239147 1227154 1214418 1201462 1189769 1180266 1172786 1166281 1159670 1152993
58456A152993n480l327j742j402j577j764k441l690m491m149l360k992k872k437
$$ 1152993 1147513 1144186 1142444 1141042 1139465 1137701 1135260 1131570 1127079 1122930 1119570 1116578 1113706 1111269
58442A111269j746j105n57j92j09L16J817L527L412J152q56m92J425K720K836
$$ 1111269 1109523 1108418 1107861 1107669 1107560 1107876 1109693 1113220 1116632 1117784 1116928 1116436 1117861 1120581 1123417
58427A123417K826L313M009M760N720O827Q086R883J2168J3970J4673J5062J6058
$$ 1123417 1126243 1129556 1133565 1138325 1144045 1150872 1158958 1168841 1181009 1194979 1209652 1224714 1240772
58414A240772J7048J6742J5213J3727J2752J1369Q716N144J653j119l184m889
$$ 1240772 1257820 1274562 1289775 1303502 1316254 1327623 1336339 1341483 1343136 1342017 1338833 1333944
58402A333944o388p352p287o085m016j308J662L981M897M912N186N876O168N898
$$ 1333944 1327556 1320204 1312917 1306832 1302816 1301508 1303170 1307151 1312048 1316960 1322146 1328022 1334190 1340088
58388A340088N727N475L966J074j641l125m162n642o988p397p315p415p331o617
$$ 1340088 1345815 1351290 1355256 1356330 1354689 1351564 1347402 1341760 1334772 1327375 1320060 1312645 1305314 1298697
58374A298697n864n546m772k642PJ660K342L400N465P774R303R600Q856P929P950
$$ 1298697 1292833 1287287 1282515 1279873 1279880 1281540 1283882 1287282 1292747 1300521 1309824 1319424 1328280 1336209 1344159
58359A344159R237J0844J1548J0830Q800N971L298J496J41j566l163l495k958
$$ 1344159 1353396 1364240 1375788 1386618 1395418 1401389 1404687 1406183 1406324 1404758 1401595 1398100 1395142
58346A395142l325m994o285o136n579n649n706m833l270j449O67K461K831K301
$$ 1395142 1391817 1386823 1380538 1374402 1368823 1363174 1357468 1352635 1349365 1347916 1348583 1351044 1353875 1356176
58332A356176K901M983O465O271N943O506O536N174M206M954N775N148M578N651
$$ 1356176 1359077 1364060 1370525 1376796 1382739 1389245 1395781 1400955 1405161 1410115 1415890 1421038 1425616 1431267
58318A431267O732N834M449N026O473N965L790K735L643N113O711Q928J0748J0769
$$ 1431267 1437999 1443833 1448282 1453308 1459781 1465746 1469536 1472271 1475914 1481027 1487738 1496666 1507414 1518183
58304A518183J0267J1708J4584J6091J5700J5664J6974J8166J8384J8569J9073
$$ 1518183 1528450 1540158 1554742 1570833 1586533 1602197 1619171 1637337 1655721 1674290 1693363
58293A693363J8854J7520J5908J4330J2410J0644J0029J0214J0144J0118J1132
$$ 1693363 1712217 1729737 1745645 1759975 1772385 1783029 1793058 1803272 1813416 1823534 1834666
58282A834666J2715J3723J4612J6380J8060J8059J7280J7935J9832K0921K1032
$$ 1834666 1847381 1861104 1875716 1892096 1910156 1928215 1945495 1963430 1983262 2004183 2025215
58271B025215K1803K3234K3659K3126K3358K4307K4093K2586K1818K2418K2780
$$ 2025215 2047018 2070252 2093911 2117037 2140395 2164702 2188795 2211381 2233199 2255617 2278397
58260B278397K2168K1635K1482K0844K0142K0912K2755K3437K2475K1639K1664
$$ 2278397 2300565 2322200 2343682 2364526 2384668 2405580 2428335 2451772 2474247 2495886 2517550
58249B517550K1583K1715K3955K8222L1757L2995L3332L4273L5446L6351L7559
$$ 2517550 2539133 2560848 2584803 2613025 2644782 2677777 2711109 2745382 2780828 2817179 2854738
58238B854738L9320M1072M2736M4587M5935M6127M6399M8271N0769N2049N2833
$$ 2854738 2894058 2935130 2977866 3022453 3068388 3114515 3160914 3209185 3259954 3312003 3364836
58227C364836N5003N7649N8282N7349N7577N9411O1165O3106O6909P1408P3732
$$ 3364836 3419839 3477488 3535770 3593119 3650696 3710107 3771272 3834378 3901287 3972695 4046427
58216D046427P4629P7800Q3682Q8824R1803R4818R8865J02435J05698J10863J17585
$$ 4046427 4121056 4198856 4282538 4371362 4463165 4557983 4656848 4759283 4864981 4975844 5093429
58205E093429J23100J27600J34175J42651J49309J53817J60464J70898J81563
$$ 5093429 5216529 5344129 5478304 5620955 5770264 5924081 6084545 6255443 6437006
58196F437006J90279J99354K10134K20250K28862K38955K52047K65985K80319
$$ 6437006 6627285 6826639 7036773 7257023 7485885 7724840 7976887 8242872 8523191
58187H523191K98215L20588L44082L67403L94010M25889M60317M95317N32497
$$ 8523191 8821406 9141994 9486076 9853479 10247489 10673378 11133695 11629012 12161509
58178A2161509N71956O10308O46278O82391P19045P53543P87075Q25271Q69445
$$ 12161509 12733465 13343773 13990051 14672442 15391487 16145030 16932105 17757376 18626821
58169A8626821R14926R60765J012836J074075J140152J208302J281527J360194
$$ 18626821 19541747 20502512 21515348 22589423 23729575 24937877 26219404 27579598
58161B7579598J438964J516851J601091J696341J799445J909384K031768K168278
$$ 27579598 29018562 30535413 32136504 33832845 35632290 37541674 39573442 41741720
58153D1741720K312959K465174K635013K829887L048110L292073L573847L899908
$$ 41741720 44054679 46519853 49154866 51984753 55032863 58324936 61898783 65798691
58145F5798691M264911M669920N132554N670675O292997P016047P872429Q891201
$$ 65798691 70063602 74733522 79866076 85536751 91829748 98845795 106718224 115609425
58137A15609425J0089119J1490084J3125241J4994872J7050922J9226088K1452000
$$ 115609425 125698544 137188628 150313869 165308741 182359663 201585751 223037751
58130B23037751K3659968K5838869K8078564L0338667L1944398L1387724K7017277
$$ 223037751 246697719 272536588 300615152 330953819 362898217 394285941 421303218
58123D21303218J8294952O488668n914757j6551313k4145303k8571921l0379936
$$ 421303218 439598170 446086838 440172081 423620768 399475465 370903544 340523608
58116C40523608l0327424k9116123k7264025k5087014k2773519k0462341j8254964
$$ 340523608 310196184 281080061 253816036 228729022 205955503 185493162 167238198
58109A67238198j6203082j4327489j2644403j1160962r863840q732858p756680
$$ 167238198 151035116 136707627 124063224 112902262 103038422 94305564 86548884
58102H6548884o923323o208088n584586n038083m557917m127926l735764l382395
$$ 86548884 79625561 73417473 67832887 62794804 58236887 54108961 50373197 46990802
58094D6990802l071651k798081k553563k337050k148161j978913j821318j676928
$$ 46990802 43919151 41121070 38567507 36230457 34082296 32103383 30282065 28605137
58086B8605137j550183j438047j334265j238651j154316j079980j011997r50208
$$ 28605137 27054954 25616907 24282642 23043991 21889675 20809695 19797698 18847490
58078A8847490q95705q46388p99897p57119p18286o79947o40200o02304n68606
$$ 18847490 17951785 17105397 16305500 15548381 14830095 14150148 13509948 12907644 12339038
58069A2339038n35858n01263m68273m41182m18482l96874l77465l62475l49518
$$ 12339038 11803180 11301917 10833644 10392462 9973980 9577106 9199641 8837166 8487648
58060H487648l34844l19214l05503k93292k80690k68626k58584k48595k36165
$$ 8487648 8152804 7833590 7528087 7234795 6954105 6685479 6426895 6178300 5942135
58051E942135k22876k11691k01902j91055j79809j70690j63794j57536j51990
$$ 5942135 5719259 5507568 5305666 5114611 4934802 4764112 4600318 4442782 4290792
58042D290792j47886j44063j39225j34476j30982j27090j21014j14397j09901
$$ 4290792 4142906 3998843 3859618 3725142 3594160 3467070 3346056 3231659 3121758
58033C121758j07097j03939j00407r7611r5045r1796q8819q7063q5110q1400p6839
$$ 3121758 3014661 2910722 2810315 2712704 2617659 2525863 2437044 2349981 2264871 2183471 2106632
58022B106632p2629o7722o1301n5418n1949m9310m5502m2054m1147m1039l8534
$$ 2106632 2034003 1966281 1904980 1849562 1797613 1748303 1702801 1660747 1619600 1578561 1540027
58011A540027l4351l1825l1505l1181l0282l0148l0435k9203k6441k4111k2844
$$ 1540027 1505676 1473851 1442346 1411165 1380883 1350735 1320300 1291097 1264656 1240545 1217701
58000A217701k1715k0900k1286k1800k0341j7384j5516j5436j5403j4657j4334
$$ 1217701 1195986 1175086 1153800 1132000 1111659 1094275 1078759 1063323 1047920 1033263 1018929
57989A018929j4639j4078j2215j0668j0639j1509j2405j3299j4071j4170j3594
$$ 1018929 1004290 990212 977997 967329 956690 945181 932776 919477 905406 891236 877642
57978H77642j2825j1782j0228r028r456j1387j3586j5355j6511j6326j4285j1536
$$ 877642 864817 853035 842807 833779 824323 812936 799350 783995 767484 751158 736873 725337
57966G25337r908r829j0486j1331j1887j1207r318q208r223j0571r739p431o307
$$ 725337 715429 705600 695114 683783 671896 660689 651371 643163 633940 623369 613630 606199 599892
57953E99892o668o456n156m425m612m022k309j612l056m718m457k813j666j673
$$ 599892 593224 586768 581612 577187 572575 568553 566244 564632 561576 556858 552401 549588 547922 546249
57939E46249k257k844l000k496k037k788m495n208l699j153K86k02j756k981k968
$$ 546249 543992 541148 538148 535652 533615 530827 526332 521124 517425 516272 516558 516356 514600 511619 508651
57924E08651j830n95p7L2L22L44q13k819m295m651m574m672m810m781m504l666
$$ 508651 506821 506226 506149 506181 506503 506847 506034 503215 498920 494269 489695 485023 480213 475432 470928 467262
57908D67262k272j281j402j568j66K221L126J437j182k534k183j193q79k091m455
$$ 467262 464990 463709 462307 460739 460573 462794 465920 467357 466175 463641 461458 460265 459386 457295 452840
57893D52840o040n066k131M79J678K222K470J529p13k524k361o57J287K917M055
$$ 452840 446800 441734 439603 440082 441760 443982 446452 447981 447268 444744 442383 441726 443013 445930 449985
57878D49985M221L540L362M848P415R371R674Q503O686N034L769K437Q34j59K79
$$ 449985 454206 457746 461108 465956 473371 482742 492416 500919 507605 512639 516408 518845 519679 519520 519799
57863E19799J127M23j857l554l553l457m898o783o839m875k814k090k540l489
$$ 519799 520926 521349 519492 515938 512385 508928 504030 497247 490408 485533 482719 480629 478089 474600
57849D74600m437m721l863k596k493m166o370p180n822l309j613k097m355o516
$$ 474600 470163 465442 461579 458983 456490 452324 445954 438774 432952 429643 428030 425933 421578 415062
57835D15062o899n453l499k277j917j644q03L19P92K42m51j39J151K316K675K612
$$ 415062 408163 402710 399211 396934 395017 393373 392570 392889 393681 393923 393472 393333 394484 396800 399475 402087
57819D02087K563K208J094m16j439j533j096r06j372k057j904l75J648K513J463
$$ 402087 404650 406858 407952 407536 406097 404564 403468 402562 401190 399133 397229 396854 398502 401015 402478
57804D02478q02l129m868n607m800k384N33K362K499J784J416J703K031J897J435
$$ 402478 401676 398547 393679 388072 383272 380888 381421 383783 386282 388066 389482 391185 393216 395113 396548
57789C96548Q70k2j354k498k871l082m053n045m166j458K57j144m148n680m979
$$ 396548 397418 397396 396042 393544 390673 387591 383538 378493 374327 372869 373126 371982 367834 362154 357175
57774C57175l590k503j549j106j912l073k549j71J818J790N46n24j100j002M14
$$ 357175 353585 351082 349533 348427 346515 343442 340893 340722 342540 344330 344876 344352 343252 342250 342664
57759C42664K630L555K248O70R49K157J698p87l049l516l175l796n605p309p631
$$ 342664 345294 348849 351097 351767 352716 354873 356571 355784 352735 349219 346044 342248 336643 329334 321703
57744C21703o348m199k075k76J307K401K339J078l93j078q56l4J184K299K436
$$ 321703 315355 311156 309081 308805 310112 312513 314852 315930 315537 314459 313603 313569 314753 317052 319488
57729C19488J515P53J131J961J952J093M19L17M08R00K467M517N023L018L22l43
$$ 319488 321003 321756 322887 324848 326800 327893 328312 328629 329037 329937 332404 336921 341944 344962 345284 344941
57713C44941J443L427L576K315J450J621J794J150L22L02Q50P79m95k406l933
$$ 344941 346384 349811 353387 355702 357152 358773 360567 361717 362039 362341 363191 363970 363475 361069 357136
57698C57136m141k434P77L791M938M319L438L282L584L806L650K590L36j942k327
$$ 357136 352995 350561 351338 355129 360067 364386 367824 371106 374690 378496 382146 384736 385072 383130 380803
57683C80803n99J244J535O93k90j592l537n063m733k841j122p08j273j884j823
$$ 380803 380204 381448 382983 383676 383386 381794 378257 373194 368461 365620 364498 363790 362517 360633 358810
57668C58810j002l31j081l145m578l819j653J6N36M11l56k189m430n561n059l725
$$ 358810 357808 357477 356396 353251 348673 344854 343201 343217 343753 344164 343808 341619 337189 331628 326569 322844
57652C22844k257p11N17O59j69q68r46j127j913k611k421j590p85n4P79J211N39
$$ 322844 320587 319876 320393 321052 320883 320015 319069 317942 316029 313418 310997 309407 308622 308568 309347 310558 311097
57635C11097r20j838j339m3O87L54k08p8M92O32K68J69M77L80k55m9K158N584
$$ 311097 310177 308339 307000 306957 307644 307998 307790 307712 308204 308836 309104 309273 309750 310130 309875 309826 311984 317568
57617C17568Q610J0926J3308J5811J7787J9469K2025K5790K9838L3569L7334M0744
$$ 317568 326178 337104 350412 366223 384010 403479 425504 451294 481132 514701 552035 592779
57605E92779M1617L7592K8261J5196O13j3297k4483l1642l4861l5324l4386l2921
$$ 592779 634396 671988 700249 715445 716058 702761 678278 646636 611775 576451 542065 509144
57593E09144l1051k8291k4377k0098j6839j5017j3660j1836r878q597p922p075
$$ 509144 478093 449802 425425 405327 388488 373471 359811 347975 338097 329500 321578 314503
57581C14503n812m702m194m015l609k704j286N61K501L848L976K854J086o01j709
$$ 314503 308691 303989 299795 295780 292171 289467 288181 288742 291243 295091 299067 301921 303007 302406 300697
57566C00697j901j058K51P20m90k442l118j785K8L68r18k461l292l506l371k872
$$ 300697 298796 297738 297989 298709 298219 295777 292659 290874 290902 291270 290352 287891 284599 281093 277722 274850
57550B74850k233j963k068j962j432j042j309j920k151j731j009n16m67n86m27
$$ 274850 272617 270654 268586 266624 265192 264150 262841 260921 258770 257039 256030 255514 255047 254461 254034
57535B54034j22n06k079l983m667l584j682k80j1p94j995k505j484N39J898J556
$$ 254034 253912 253406 251327 247344 242677 239093 237411 237131 237120 236326 234331 231826 230342 230881 232779 234335
57519B34335J17j166j780j883j569r59p27j592l154l874k598Q7K335K839J942
$$ 234335 234452 233286 231506 229623 228054 227095 226368 224776 221622 217748 215150 215237 217572 220411 222353
57504B22353R65O99Q14O36qp22r22j94J215K162J646L97N06K783N293N576L721
$$ 222353 223318 224017 224831 225467 225459 224737 223815 223621 224836 226998 228644 229041 229547 232330 237623 243199 246920
57487B46920K039K011K827K877J595l20j475o05K203N045O040N538N331N890N941
$$ 246920 248959 250970 253797 256674 258269 257949 256474 255869 258072 263117 269157 274695 280026 285916 291857
57472B91857N001M349M740N002M173L466M436O187O394M707L295L806N271N611
$$ 291857 296858 301207 305947 310949 315122 318588 323024 329211 335605 340312 343607 347413 352684 358295
57458C58295M321K985L431N732P999Q173N990L068J084M01M90Q08Q87L19o79j316
$$ 358295 362616 365601 369032 374764 382763 390936 396926 399994 401078 401479 401969 402777 403664 403983 403304 401988
57442D01988j431j898l168m175l713k271j331j205r17m8O26N61L42O86J385J710
$$ 401988 400557 398659 395491 391316 387603 385332 384001 382796 381879 381831 382457 383018 383360 384046 385431 387141
57426C87141J405Q79P79J516K829L830L976L792L994M151L286J832J665L527N614
$$ 387141 388546 389425 390204 391720 394549 398379 402355 406147 410141 414292 417578 419410 421075 424602 430216
57411D30216N681L825J964J091M31o86j463p10J506L899N091M411K182j18n96
$$ 430216 435897 439722 441686 442777 443208 442522 441059 440349 441855 445754 450845 455256 457438 457320 456724
57396D56724J301M030N581N569M976M357L506K752L021M167M647L688K624L078
$$ 456724 458025 462055 467636 473205 478181 482538 486044 488796 491817 495984 500631 504319 506943 510021
57382E10021M803O438P451Q022P833O609N327N187N624N125L885L657M795N463
$$ 510021 514824 521262 528713 536735 544568 551177 556504 561691 567315 572440 576325 579982 584777 590240
57368E90240M507L231L346M726O352Q010R708J0549R689P811O344N677N173M447
$$ 590240 594747 597978 601324 606050 612402 620412 630120 640669 650358 658169 664513 670190 675363 679810
57354F79810L687L229L563N189P630R262Q985P463O030N190N054O134Q350J0066
$$ 679810 683497 686726 690289 695478 703108 712370 721355 728818 734848 740038 745092 751226 759576 769642
57340G69642R660P684O152O056O842P857Q895R515R282Q622Q327Q321Q051P794
$$ 769642 779302 786986 793138 799194 806036 813893 822788 832303 841585 850207 858534 866855 874906 882700
57326H82700Q275R271R922J0275J0957J1491J0612Q512P129P661R251J0627J1583
$$ 882700 890975 900246 910168 920443 931400 942891 953503 962015 969144 976805 986056 996683 1008266
57313A008266J2139J1730J0257Q940Q941R872J0667J1250J2326J3823J4641J3980
$$ 1008266 1020405 1032135 1042392 1051332 1060273 1070145 1080812 1092062 1104388 1118211 1132852 1146832
57301A146832J2217J0444R547R886J1391J3556J5399J5843J4636J2824J1815J1941
$$ 1146832 1159049 1169493 1179040 1188926 1200317 1213873 1229272 1245115 1259751 1272575 1284390 1296331
57289A296331J2509J3155J4137J4972J4294J1957J0080J0571J2511J3630J3559
$$ 1296331 1308840 1321995 1336132 1351104 1365398 1377355 1387435 1398006 1410517 1424147 1437706
57278A437706J3748J4627J4957J4183J3441J3761J4770J5687J6308J6611J6604
$$ 1437706 1451454 1466081 1481038 1495221 1508662 1522423 1537193 1552880 1569188 1585799 1602403
57267A602403J6792J7565J8113J7401J6257J6576J8263J9015J7755J6102J5519
$$ 1602403 1619195 1636760 1654873 1672274 1688531 1705107 1723370 1742385 1760140 1776242 1791761
57256A791761J5170J4064J3321J4361J6282J7069J6525J6139J6662J7488J8005
$$ 1791761 1806931 1820995 1834316 1848677 1864959 1882028 1898553 1914692 1931354 1948842 1966847
57245A966847J8112J7682J6858J6510J7236J8299J8627J8394J8487J8965J9332
$$ 1966847 1984959 2002641 2019499 2036009 2053245 2071544 2090171 2108565 2127052 2146017 2165349
57234B165349J9802K0904K2096K2255K1446K0876K1045K1301K1435K2410K4863
$$ 2165349 2185151 2206055 2228151 2250406 2271852 2292728 2313773 2335074 2356509 2378919 2403782
57223B403782K7759K9236K8498K6487K4866K4495K4785K4638K3878K3334K3482
$$ 2403782 2431541 2460777 2489275 2515762 2540628 2565123 2589908 2614546 2638424 2661758 2685240
57212B685240K3758K3618K3455K3824K4446K4763K4853K4977K4781K3786K2352
$$ 2685240 2708998 2732616 2756071 2779895 2804341 2829104 2853957 2878934 2903715 2927501 2949853
57201B949853K1337K1117K1488K2076K2210K1136J9225J8251J9422K1695K3161
$$ 2949853 2971190 2992307 3013795 3035871 3058081 3079217 3098442 3116693 3136115 3157810 3180971
57190C180971K3548K4089K5358K6644K7381K7756K7888K7643K7504K8352L0093
$$ 3180971 3204519 3228608 3253966 3280610 3307991 3335747 3363635 3391278 3418782 3447134 3477227
57179C477227L1482L1669L1113L0569L0037K9121K7741K6157K4681K3552K2627
$$ 3477227 3508709 3540378 3571491 3602060 3632097 3661218 3688959 3715116 3739797 3763349 3785976
57168C785976K1144J8464J5106J2444J1164J0611R906R198R466J1404J4741J8562
$$ 3785976 3807120 3825584 3840690 3853134 3864298 3874909 3884815 3894013 3903479 3914883 3929624 3948186
57156C948186K2213K5916L0289L5234L9638M2557M4332M6102M8558N1585N4631
$$ 3948186 3970399 3996315 4026604 4061838 4101476 4144033 4188365 4234467 4283025 4334610 4389241
57145D389241N6822N7015N4638N0482M6073M2172L8434L4588L1303K9416K8572
$$ 4389241 4446063 4503078 4557716 4608198 4654271 4696443 4734877 4769465 4800768 4830184 4858756
57134D858756K7252K4503K1298J9306J8237J5570R756K476l729r152j5995k4180
$$ 4858756 4886008 4910511 4931809 4951115 4969352 4984922 4994678 4997154 4993425 4984273 4968278 4944098
57122D944098l0851l4516l7031m0294m3387m4681m4731m5051m5564m5266m4124
$$ 4944098 4913247 4878731 4841700 4801406 4758019 4713338 4668607 4623556 4577992 4532726 4488602
57111D488602m2453l9681l5745l2550l1920l3072l4122l5062l7021l9543m1084
$$ 4488602 4446149 4406468 4370723 4338173 4306253 4273181 4239059 4203997 4166976 4127433 4086349
57100D086349m1607m2350m3444m4127m4758m6254m7778m7462m5237m2675m0230
$$ 4086349 4044742 4002392 3958948 3914821 3870063 3823809 3776031 3728569 3683332 3640657 3600427
57089C600427l7042l3412l0852k9432k7519k4554k1937k0749k0604k1043k2024
$$ 3600427 3563385 3529973 3499121 3469689 3442170 3417616 3395679 3374930 3354326 3333283 3311259
57078C311259k2803k2382k1374k1619k3893k7959l4700m5908o1772q0855j02526
$$ 3311259 3288456 3266074 3244700 3223081 3199188 3171229 3136529 3090621 3028849 2947994 2845468
57067B845468j27164j53981j81091k07961k35544k63950k92381l21208l51590
$$ 2845468 2718304 2564323 2383232 2175271 1939727 1675777 1383396 1062188 710598
57058G10598C27408h7572m48060m84517n23998n64458o06182o51451p00473p51610
$$ 710598 327408 -87572 -535632 -1020149 -1544147 -2108605 -2714787 -3366238 -4066711 -4818321
57048d818321q05587q65524r32827j007548j092789j193985j313410j450296j605876
$$ -4818321 -5623908 -6489432 -7422259 -8429807 -9522596 -10716581 -12029991 -13480287 -15086163
57039a5086163j781902j973282k168958k362311k555720k755473k969965l212664
$$ -15086163 -16868065 -18841347 -21010305 -23372616 -25928336 -28683809 -31653774 -34866438
57031c4866438l495339l813195m144258m466308m768508n053660n351369n727138
$$ -34866438 -38361777 -42174972 -46319230 -50785538 -55554046 -60607706 -65959075 -71686213
57023g1686213o231672o794878p177093p069328o271458m785758k772208m62093
$$ -71686213 -77917885 -84712763 -91889856 -98959184 -105230642 -110016400 -112788608 -113250701
57015a13250701J883772M000506N679497O831157P484642P730856P671602P402475
$$ -113250701 -111366929 -107366423 -101686926 -94855769 -87371127 -79640271 -71968669 -64566194
57007f4566194P006556O544833O056320N569705N108124M682305M288536L917863
$$ -64566194 -57559638 -51014805 -44958485 -39388780 -34280656 -29598351 -25309815 -21391952
56999b1391952L563546L220387K885067K560592K255632J976920J725690J502082
$$ -21391952 -17828406 -14608019 -11722952 -9162360 -6906728 -4929808 -3204118 -1702036
56991a702036c94296G47507R98579Q72000P59898O62082N77086N02874M38551
$$ -1702036 -394296 747507 1746086 2618086 3377984 4040066 4617152 5120026 5558577
56982E558577L83553L36616K96767K63827K37104K15052J96875J82963J73051
$$ 5558577 5942130 6278746 6575513 6839340 7076444 7291496 7488371 7671334 7844385
56973G844385J65380J58222J50669J41070J25907J01543O7300K7298j0388l7605
$$ 7844385 8009765 8167987 8318656 8459726 8585633 8687176 8754476 8781774 8771386 8733781
56963H733781n1081n4078n2694n1144n1016n3213n8284o5432p3164q0791q7990
$$ 8733781 8682700 8628622 8575928 8524784 8473768 8420555 8362271 8296839 8223675 8142884 8054894
56952H054894r3680r7093r9381j02403j06279j09887j12974j15828j17525j16834
$$ 8054894 7961214 7864121 7764740 7662337 7556058 7446171 7333197 7217369 7099844 6983010
56942F983010j14562j12845j12336j12278j13067j16272j21981j28538j35130
$$ 6983010 6868448 6755603 6643267 6530989 6417922 6301650 6179669 6051131 5916001
56933E916001j42372j49916j55901j59505j62038j64839j67955j71459j75960
$$ 5916001 5773629 5623713 5467812 5308307 5146269 4981430 4813475 4642016 4466056
56924D466056j81093j85475j89058j93532j99342k04171k05657k03896j99822
$$ 4466056 4284963 4099488 3910430 3716898 3517556 3313385 3107728 2903832 2704010
56915B704010j92690j81102j65703j49173j33749j19831j06764r4141q2318p2018
$$ 2704010 2511320 2330218 2164515 2015342 1881593 1761762 1654998 1560857 1478539 1406521
56905A406521o3296n5089m6485l8263l2016k7731k3587j8468j3356r803q344q981
$$ 1406521 1343225 1288136 1241651 1203388 1171372 1143641 1120054 1101586 1088230 1078427 1070083 1061102
56893A061102j1887j6592k1534k5344k7879k9366k9429k7790k5220k2943k1468
$$ 1061102 1049215 1032623 1011089 985745 957866 928500 899071 871281 846061 823118 801650
56882H01650k0451j9218j7132j4036j0559p344m029O4M189O553O782O611P449
$$ 801650 781199 761981 744849 730813 720254 712910 708881 708945 713134 719687 726469 733080 740529
56869G40529Q386P441L713k418j0012j7509k2984k5609k6321k6171k4857k1726
$$ 740529 748915 756356 760069 757651 747639 730130 707146 681537 655216 629045 604188 582462
56857E82462j7584j4328j3029j3193j3512j2770j0455p214m436k917k309k069
$$ 582462 564878 550550 537521 524328 510816 498046 487591 480377 475941 473024 470715 468646
56845D68646k180k508k380j472l53N88J942M160O284O912O056N181N548P192R225
$$ 468646 466466 463958 461578 460106 459753 460341 462283 466443 472727 479639 485695 490876 496424 503616 512841
56830E12841J0607J0955J1042J2139J4386J6403J6896J5920J3913J0499N416J06
$$ 512841 523448 534403 545445 557584 571970 588373 605269 621189 635102 645601 651017 651123
56818F51123l070l323k247j921k852l882l620j718J026L584N642P524R402J1233
$$ 651123 648053 644730 642483 640562 637710 633828 630208 628490 629516 633100 638742 646266 655668 666901
56804F66901J3414J6751K1318K6006K9574L1558L1680K9055K2929J4004M433l711
$$ 666901 680315 697066 718384 744390 773964 805522 837202 866257 889186 903190 907623 903912
56792I03912r752j4334j8091k0460k0173j7086j2882r102n278k40N273R217J1465
$$ 903912 894160 879826 861735 841275 821102 804016 791134 782032 776754 776514 781787 791004 802469
56779H02469J4401J9576K5705L0904L5312M0032M4672M7246M5638L8314K4929
$$ 802469 816870 836446 862151 893055 928367 968399 1013071 1060317 1105955 1144269 1169198
56768A169198P638r197k2098l0731l6283l8951l8474l5923l2966k9889k5872k0756
$$ 1169198 1176836 1167639 1145541 1114810 1078527 1039576 1001102 965179 932213 902324 876452 855696
56756H55696j5099r147l236J542M723P897J2787J8381K1923K2532K1688K0134
$$ 855696 840597 831450 828214 829756 834479 842376 855163 873544 895467 917999 939687 959821
56744I59821J6576R945J129q188j6843k3817k8168l0133l1069l1636l1153k9140
$$ 959821 976397 986342 987471 979283 962440 938623 910455 880322 849253 817617 786464 757324
56732G57324k6189k2728j8335j3082q301n042k711j79K528M632N918O685O831
$$ 757324 731135 708407 690072 676990 668689 663647 660936 660757 663285 667917 673835 680520 687351
56719F87351N969M231K108m99m358r756j5587k0008k2104k2641k2802k2446k0518
$$ 687351 693320 697551 699659 699160 694802 685046 669459 649451 627347 604706 581904 559458 538940
56706E38940j7280j4743j4184j4454j3969j3114j3066j3163j1844r631q698r252
$$ 538940 521660 506917 492733 478279 464310 451196 438130 424967 413123 403492 394794 385542
56694C85542q912o547m308m349n433m772k119Jk56k012l223l119k592k656l005
$$ 385542 376630 370083 365775 361426 355993 351221 349102 349103 348847 346835 343612 340493 337901 335245 332240
56679C32240k433o29R86R65k43j030r03p17q30o19m6op05j107o94l19o86j257
$$ 332240 329807 329178 330164 331129 330886 329856 328953 328236 327406 326787 326741 326735 326030 324923 324229 323910 323224 321967
56661C21967j439j445j254j41J788L011K632J713J448J326M49n80o30N8N00O23
$$ 321967 320528 319083 317829 317688 319476 322487 325119 326832 328280 329606 330055 329475 328845 328903 329403 330026
56645C30026Q55Q27M8p33m96K68K79m64q18m26qM7j8j91n58n21M38J420R95o29
$$ 330026 330881 331708 331756 331023 330527 330795 331074 330610 329792 329366 329358 329405 329387 329196 328638 328117 328555 329975 330970 330341
56625C30341j697j274k29K80J9o73j367j488q85l82o77q78M39K729L716K435N17
$$ 330341 328644 327370 327141 327421 327440 326767 325400 323912 323027 322645 321968 321090 321529 324258 327974 330409 330926
56608C30926k33L5L94J045K733M975O257N861M602L741L760M303M870N300N613
$$ 330926 330693 330728 331122 332167 334900 339875 346132 351993 356595 360336 364096 368399 373269 378569 384182
56593C84182N623N092M170L233K114K61j930k927k033p89j181k998m220l743k365
$$ 384182 389805 394897 399067 402300 404414 404675 402745 399818 397785 396996 395815 392817 388597 384854 382489
56578C82489j314j100j745k869l485k906j825j307j038j16P23k79k893m755m837
$$ 382489 381175 380075 378330 375461 371976 369070 367245 365938 364900 364784 365507 365228 362335 357580 352743
56563C52743m734n438n165k263J508K954J693J96J52R96J788K393K456J111j401
$$ 352743 348009 342571 337406 335143 336651 339605 341298 341494 341646 342642 344430 346823 349279 350390 348989
56548C48989l158k613n31R29O50o38j674k064k233k453k405j736p26kL39Q47J815
$$ 348989 345831 343218 342687 343616 344266 343628 341954 339890 337657 335204 332799 331063 330337 330335 330674 331521 333336
56531C33336K608K217L97j872l047k322m20J114J610J866K645L246K505P58m02
$$ 333336 335944 338161 338558 336686 333639 331317 330897 332011 333621 335487 338132 341378 343883 344641 344239
56516C44239k22N64J220J811K280K124J505J412K111K669K625K860L949M963N019
$$ 344239 344017 344581 345801 347612 349892 352016 353521 354933 357044 359713 362338 365198 369147 374110 379129
56501C79129M822N373O195O204N522N020M737M141L366K793J992N59n56k08R12
$$ 379129 383951 389324 395519 401723 407245 412265 417002 421143 424509 427302 429294 429853 429297 429089 430001
56486D30001J064M6p26o19m92q28r30l18N11J149J648J583L18j350j589l05J81
$$ 430001 431065 431111 430385 429766 429274 428446 427516 427198 427709 428858 430506 432089 432407 431057 429468 429163 429344
56469D29344j631m066m544l021j556j310j576j428q77m25n24j459k956m053m044
$$ 429344 427713 423647 419103 416082 414526 413216 411640 410212 409335 408910 408386 406927 403971 399918 395874
56454C95874l237k214r35N74J323N19q03q59J64J10j975m179m168k221o70q75
$$ 395874 392637 390423 389488 390062 391385 391904 391101 390242 390406 390516 388541 384362 380194 377973 377303 376428
56438C76428j947k265j275L99J832K453K145J149j45j350k074k008j259m98m99
$$ 376428 374481 372216 370941 371340 373172 375625 377770 378919 378774 377424 375350 373342 372083 371585 371086
56423C71086j438k674l226k465n57J642L159L496K731J250k88r48j29J573K701
$$ 371086 369648 366974 363748 361283 360726 362368 365527 369023 371754 373004 372716 371768 371639 373212 375913
56408C75913K550J861J420P65p07j941j143J473L415L014J471P43P01k28k213
$$ 375913 378463 380324 381744 382509 381802 379861 378718 380191 383606 386620 388091 388834 389535 389307 387094
56393C87094l564l017j165P15K041K842L178L165K887K039K67j878l045k471p07
$$ 387094 383530 380513 379348 380063 382104 384946 388124 391289 394176 396215 396482 394604 391559 389088 388381
56378C88381J227K714L351K814J404N6p40j376k062k121j075K68P69N56P35J677
$$ 388381 389608 392322 395673 398487 399891 399947 399207 397831 395769 393648 392573 392841 393610 394166 394901 396578
56362C96578K597K790K422J870R88m74k098k935k500j331l87L4M74J272J789J174
$$ 396578 399175 401965 404387 406257 407245 406771 404673 401738 399238 397907 397520 397554 398028 399300 401089 402263
56346D02263l25j516j620q69J19Q78R97M07j25K11R35P97r7o9J623L369L292J615
$$ 402263 401938 400422 398802 397933 398052 398930 399927 400334 400209 400420 401355 402152 402055 401986 403609 406978 410270 411885
56328D11885j86j470k368k501j439o2J46q72j635j132J90J495K613L843N421P238
$$ 411885 411699 410229 407861 405360 403921 403859 404005 403133 401498 400366 400556 402051 404664 408507 413928 421166
56312D21166Q691Q971P979O534N155L325Q38r95p52J009K436K928L498M699N619
$$ 421166 429857 438828 446807 453341 458496 461821 462659 461664 460912 461921 464357 467285 470783 475482 481101
56297D81101N228L610J634K50J24J055J898J875J693K218K656J522p20j745l72
$$ 481101 486329 489939 491573 491823 491947 493002 494900 496775 498468 500686 503342 504864 504144 502399 502027
56282E02027K035L514L535K686J691J200J523K115K261K329L183M322M169K553
$$ 502027 504062 507576 511111 513797 515488 516688 518211 520326 522587 524916 528099 532421 536590 539143
56268E39143J367K140M241O019O605N982M587L231K421J492k62j656o69K253M131
$$ 539143 540510 542650 546891 552910 559515 565497 570084 573315 575736 577228 576966 575310 574641 576894 581025
56253E81025L508K364K792L946M014L285L203L773M098M412N456O578O604O157
$$ 581025 584533 586897 589689 593635 597649 600934 604137 607910 612008 616420 621876 628454 635058 641215
56239F41215O951Q915R907Q505N583K942J707K213M203O775Q838R858R769Q614
$$ 641215 648166 657081 666988 675493 681076 684018 685725 687938 692141 698916 707754 717612 727381 735995
56225G35995O991O248P186Q975J0310J1231J2629J4381J5411J5543J5926J7332
$$ 735995 742986 749234 756420 765395 775705 786936 799565 813946 829357 844900 860826 878158
56213H78158J9071K0047K0166K0278K1089K2504K4001K5522K7724L0810L3463
$$ 878158 897229 917276 937442 957720 978809 1001313 1025314 1050836 1078560 1109370 1142833
56202A142833L4119L3538L4676L9215M5399N0353N3430N6135N9672O4104O9276
$$ 1142833 1176952 1210490 1245166 1284381 1329780 1380133 1433563 1489698 1549370 1613474 1682750
56191A682750P5129Q1348Q7680R4251J00869J06791J12029J17814J24562J30472
$$ 1682750 1757879 1839227 1926907 2021158 2122027 2228818 2340847 2458661 2583223 2713695
56181B713695J33519J33736J31841J26874J17509J04944R1908P8863O3550M4561
$$ 2713695 2847214 2980950 3112791 3239665 3357174 3462118 3554026 3632889 3696439 3741000
56171C741000K3228J663j9048l8117n4513o8093p9926r0760j00187j07588j12781
$$ 3741000 3764228 3765891 3746843 3708726 3654213 3586120 3506194 3415434 3315247 3207659 3094878
56160C094878j15531j15775j14495j12909j10622j06268j00253r4927r1292q7449
$$ 3094878 2979347 2863572 2749077 2636168 2525546 2419278 2319025 2224098 2132806 2045357
56150B045357q1573p4839o9851o7067o4397n9940n3960m8142m3762m0708l8023
$$ 2045357 1963784 1888945 1819094 1752027 1687630 1627690 1573730 1525588 1481826 1441118 1403095
56139A403095l5144l2353k9832k7044k3726k0833j9195j7839j5187j1691r598
$$ 1403095 1367951 1335598 1305766 1278722 1254996 1234163 1214968 1197129 1181942 1170251 1160653
56128A160653r832j0838j0900r997q781p279n465l893k886j986q82Q6P61J495
$$ 1160653 1150821 1139983 1129083 1119086 1110305 1103026 1097561 1093668 1090782 1088796 1087914 1088000 1088761 1090256
56114A090256K272K653K975M219O177P246O823O398P275Q592Q865Q338Q301R017
$$ 1090256 1092528 1095181 1098156 1102375 1108552 1115798 1122621 1129019 1136294 1144886 1153751 1162089 1170390 1179407
56100A179407R746J0346J1417J3134J5018J6800J8586K0201K1182K1640K2624
$$ 1179407 1189153 1199499 1210916 1224050 1239068 1255868 1274454 1294655 1315837 1337477 1360101
56089A360101K5358K9996L5235L9470M2677M6614N2494N9174O4728O9184P4130
$$ 1360101 1385459 1415455 1450690 1490160 1532837 1579451 1631945 1691119 1755847 1825031 1899161
56078A899161P9942Q5272Q9245R2075R3056R0169Q2768P2965O3280N4569M7139
$$ 1899161 1979103 2064375 2153620 2245695 2338751 2428920 2511688 2584653 2647933 2702502 2749641
56067B749641M1942L9011L6234L1576K5379J8935J2032L933m188j0228j4308j8956
$$ 2749641 2791583 2830594 2866828 2898404 2923783 2942718 2954750 2958683 2954495 2944267 2929959 2911003
56055B911003k5904l4456m3276n2140o1095o9075p4407p6334p5392p2442o7810
$$ 2911003 2885099 2850643 2807367 2755227 2694132 2625057 2550650 2474316 2398924 2326482 2258672
56044B258672o1550n4242m7019m0535l4423k8380k3231j9872j7445j3920q771
$$ 2258672 2197122 2142880 2095861 2055326 2020903 1992523 1969292 1949420 1931975 1918055 1909284
56033A909284l844j140p19j222j378m94J579M264O692Q667J0522J2140J3168J4201
$$ 1909284 1905440 1904300 1903581 1902359 1900981 1900487 1902066 1906330 1913022 1921689 1932211 1944351 1957519 1971720
56019A971720J6341J9341K1692K2885K3909K5047K5098K3671K2550K3473K5878
$$ 1971720 1988061 2007402 2029094 2051979 2075888 2100935 2126033 2149704 2172254 2195727 2221605
56008B221605K8049K9295K9906L0122L0325L1223L2869L4364L5282L6394L8272
$$ 2221605 2249654 2278949 2308855 2338977 2369302 2400525 2433394 2467758 2503040 2539434 2577706
55997B577706M0404M2380M4635M7280M9551N1199N2928N4764N5679N5577N5772
$$ 2577706 2618110 2660490 2705125 2752405 2801956 2853155 2906083 2960847 3016526 3072103 3127875
55986C127875N6569N6458N4937N4079N5601N8389O0622O2557O5265O8329P0815
$$ 3127875 3184444 3240902 3295839 3349918 3405519 3463908 3524530 3587087 3652352 3720681 3791496
55975C791496P3149P6070P9034Q1534Q4620Q9244R4396R8690J02511J06789J11160
$$ 3791496 3864645 3940715 4019749 4101283 4185903 4275147 4369543 4468233 4570744 4677533 4788693
55964D788693J15190J19991J26516J33588J39777J45928J53761J63166J72919
$$ 4788693 4903883 5023874 5150390 5283978 5423755 5569683 5723444 5886610 6059529
55955F059529J82850J93275K03537K13283K24121K37867K54102K71204K88710
$$ 6059529 6242379 6435654 6639191 6852474 7076595 7314462 7568564 7839768 8128478
55946H128478L07016L26184L46806L70609L98410M28899M60842M94570N29851
$$ 8128478 8435494 8761678 9108484 9479093 9877503 10306402 10767244 11261814 11791665
55937A1791665N64662N97963O31070O64441O96181P26144P58352P96319Q38964
$$ 11791665 12356327 12954290 13585360 14249801 14945982 15672126 16430478 17226797 18065761
55928A8065761Q84160R33059R87403J045857J107036J173084J245932J322787
$$ 18065761 18949921 19882980 20870383 21916240 23023276 24196360 25442292 26765079
55920B6765079J399885J478326J562235J653819J754103J865193J987440K117904
$$ 26765079 28164964 29643290 31205525 32859344 34613447 36478640 38466080 40583984
55912D0583984K256343K409251K583769K782367L008457L271256L578397L929510
$$ 40583984 42840327 45249578 47833347 50615714 53624171 56895427 60473824 64403334
55904F4403334M324956M775790N297658N901777O601616P422159Q392333R534583
$$ 64403334 68728290 73504080 78801738 84703515 91305131 98727290 107119623 116654206
55896A16654206J0871383J2431058J4231269J6262623J8498473K0904424K3419382
$$ 116654206 127525589 139956647 154187916 170450539 188949012 209853436 233272818
55889B33272818K5939589K8314784L0261982L1161343K9976070K5630866J7768395
$$ 233272818 259212407 287527191 317789173 348950516 378926586 404557452 422325847
55882D22325847P271581l992456j4053221k1645512k6438263k8763883k9228375
$$ 422325847 429597428 425604972 411551751 389906239 363467976 334704093 305475718
55875C05475718k8441369k6885929k4889852k2667848k0379117j8148182j6057494
$$ 305475718 277034349 250148420 225258568 202590720 182211603 164063421 148005927
55868A48005927j4150592j2448556j0957016r664712q550404p593479o773821
$$ 148005927 133855335 121406779 110449763 100785051 92234647 84641168 77867347
55861G7867347o067552n452177m913191m439535m017354l635315l291676k988372
$$ 77867347 71799795 66347618 61434427 56994892 52977538 49342223 46050547 43062175
55853D3062175k721393k483394k271682k086126j922198j773322j637944j517588
$$ 43062175 40340782 37857388 35585706 33499580 31577382 29804060 28166116 26648528
55845B6648528j409888j309845j216372j131604j055032r83985r18824q62149
$$ 26648528 25238640 23928795 22712423 21580819 20525787 19541802 18622978 17760829
55837A7760829q13439p69134p27395o88402o50830o12397n73531n36741n02784
$$ 17760829 16947390 16178256 15450861 14762459 14111629 13499232 12925701 12388960 11886176
55828A1886176m70667m40611m13829l90341l69937l53973l43051l34267l23774
$$ 11886176 11415509 10974898 10561069 10170728 9800791 9446818 9103767 8769500 8445726
55819H445726l10924k97275k83425k69951k59282k52753k47448k39812k31013
$$ 8445726 8134802 7837527 7554102 7284151 7024869 6772116 6524668 6284856 6053843
55810F053843k24773k21104k16298k08365j98616j88440j78279j69370j62802
$$ 6053843 5829070 5607966 5391668 5183303 4984687 4796247 4617968 4448598 4285796
55801D285796j57085j50037j42629j37619j34706j30837j25144j19922j16297
$$ 4285796 4128711 3978674 3836045 3698426 3563720 3432883 3307739 3187817 3071520
55792C071520j12543j07493j02587r9424r7582r5874r3901r1746q9445q6892q3260
$$ 3071520 2958977 2851484 2748897 2649473 2551891 2456017 2362116 2270370 2180925 2094033 2010773
55781B010773p7210o9098o1740n7136n3757m9317m4607m1735m0082l7405l4001
$$ 2010773 1933563 1864465 1802725 1745589 1691832 1642515 1597908 1556173 1516091 1478686 1444685
55770A444685l2034l1295k9387k6042k3560k2759k2027k0803k0533k1590k2443
$$ 1444685 1412651 1381356 1351969 1325927 1302367 1279608 1257581 1236778 1216245 1194655 1172212
55759A172212k2621k3317k4374k3844k1455j9380j8420j6577j2826r390q533r574
$$ 1172212 1149591 1126274 1101900 1078056 1056601 1037221 1018801 1002224 989398 980008 971475 961901
55747I61901j0704j1503j1927j1024q516o005m885m526l872l387l914m936n323
$$ 961901 951197 939694 927767 916743 908227 902222 897337 892811 888939 885552 881638 876702 871379
55734H71379m748l405j447M91J360J145J031J578J995J703J034r6k452n759q455
$$ 871379 866631 863226 861779 862270 863630 864775 865806 867384 869379 871082 872116 872020 869568 863809 855354
55719H55354r898j1105j2532j3078j2236j1266j0976j0154p529l781l00K373L614
$$ 855354 845456 834351 821819 808741 796505 785239 774263 764109 756580 752799 752499 754872 758486
55706G58486J970k866q613j2582j4300j4730j4233j2875j1719j1934j3230j4396
$$ 758486 760456 757590 748977 736395 722095 707365 693132 680257 668538 656604 643374 628978
55694F28978j4869j4676j3721j2207j1020j0718j0792j0660j0341r561p616n115
$$ 628978 614109 599433 585712 573505 562485 551767 540975 530315 519974 510413 502797 497682
55682D97682m100n193o123m731j960p6O39J199J153q59m202o349o036m497l479
$$ 497682 493582 488389 482266 477535 475575 475499 476138 477337 478490 477631 473429 467080 461044 456547 453068
55667D53068l588m706o479q176r223r810j0114r400p137m456k957k477j630j45
$$ 453068 449480 444774 438295 430119 420896 411086 400972 391572 384435 379979 377022 374545 372915 372770
55653C72770J143K296M257O737Q147P931P057N786L066j022m228m867m157m386
$$ 372770 373913 376209 380466 387203 395350 403281 410338 416124 419190 418168 413940 409073 404916 400530
55639D00530n973p667q578q592p583n815m664n343p130q154p879p412p262o327
$$ 400530 394557 386890 378312 369720 362137 356322 351658 346315 339185 331031 323152 315740 308478 302151
55625C02151l837r90L82J31l76l56l36o77n29R71L108M119L259J606O36N76N05
$$ 302151 298314 297324 297706 297837 297461 297105 296769 296092 295563 296534 299642 303761 307020 308626 309262 309838 310343
55608C10343l10j675k914l564l531k867j697l55P03J366K069L126L820K845Q0
$$ 310343 310033 308358 305444 301880 298349 295482 293785 293430 294133 295499 297568 300694 304514 307359 307439
55593C07439k617l191j693N1Q98J357J949K015R81j66kJ183J637N10j078j679
$$ 307439 304822 301631 299938 299989 300887 302244 304193 306208 307189 307023 307021 308204 309841 310351 309273 307594
55577C07594j248p91r47j613k613l949n370o319o522o270n886n272m362l672l846
$$ 307594 306346 305555 304608 302995 300382 296433 291063 284744 278222 271952 266066 260794 256432 252760 248914
55562B48914m648n005m167k417o27L42j24j857l338k779m37J166L30j508j862
$$ 248914 244266 239261 235094 232677 232050 232392 232268 230411 227073 224294 223857 225023 225353 223845 221983
55547B21983p39m35k089m372n676n814n091l540j755j035j593j873p09R29J509
$$ 221983 221244 220809 218720 214348 208672 202858 197767 194227 192472 191437 189844 187971 187262 188191 189700
55532A89700J145R57J019M74o79j430j272p09j13P63J910K605K327J596J486K452
$$ 189700 190845 191802 192821 193295 192616 191186 189914 189205 189092 189855 191765 194370 196697 198293 199779 202231
55516B02231L948N114N726O242O837O830N698M358M405N824O525M654O88l265
$$ 202231 206179 211293 217019 223261 230098 236928 242626 246984 251389 257213 263738 268392 269080 265815
55502B65815n527n789m842m044m377n336n453m320l321l626m500m521l623k789
$$ 265815 260288 254499 249657 245613 241236 235900 230447 226127 222806 219180 214680 210159 206536 203747
55488B03747k435k378k738l667m429m127l082k457k592k718k151q76O83J613P54
$$ 203747 201312 198934 196196 192529 188100 183973 180891 178434 175842 173124 170973 170097 170780 172393 173147
55473A73147j785l782l042j60K165K494J904J838K278K477K101J187p6j029r79
$$ 173147 171362 167580 164538 164378 166543 169037 170941 172779 175057 177534 179635 180822 180746 179717 178738
55458A78738k38K34M34J443L599N635O194N180L208P06j716k982k564j274m09
$$ 178738 178500 178734 179168 180611 184210 189845 196039 201219 204427 205133 203417 200435 197871 196597 196188
55443A96188n12j281k137k522k215j726j801k339k491k039j788k259k896l074
$$ 196188 195676 194395 192258 189736 187521 185795 183994 181655 179164 177125 175337 173078 170182 167108
55429A67108k960k819k302j198k13j93r80j631j371k6J891L211K971J543K00o85
$$ 167108 164148 161329 159027 157829 157616 157423 156443 154812 153441 153415 155306 158517 161488 163031 163231 162546
55413A62546j881l363l590j772N07J286Q29P07J116R68J66j56K41K36o61j380
$$ 162546 160665 157302 153712 151940 152447 153733 154562 155269 156385 157353 157519 157363 157604 157840 157179 155799
55397A55799j081n02o60j240j174k18R29J598J563Q04m37j490j709j108k82J53
$$ 155799 154718 154216 153556 152316 151142 150924 151853 153451 155014 155818 155381 153891 152182 151074 150792 150945
55381A50945n8p86j600j996j811j319q00k45L60P07M37l15r11q59l36J34M39J051
$$ 150945 150887 150101 148501 146505 144694 143375 142575 142330 142690 143397 143834 143519 142608 141749 141413 141547 141986 143037
55363A43037K196L160K941J583K63j76j12k26l79j38J52j58p28n35M44J005M70
$$ 143037 145233 148393 151334 152917 153180 153004 152892 152666 152287 152149 152301 152143 151415 150880 151324 152329 152799
55346A52799l38m12J6J75O2J53L28Q8l64k89L22O65L43k29q59j945l319l690k193
$$ 152799 152461 152049 152065 152240 152302 152455 152783 152871 152507 152218 152540 153205 153548 153319 152460 150515 147196 143506 141313
55327A41313J52J563J698J691K159K373J597J67j200k227k737k328j131j83k05
$$ 141313 141465 143028 144726 146417 148576 150949 152546 152713 151513 149286 146549 144221 143090 142907 142702
55312A42702n50k03O50J062Q71P00O52K54l53m64k83r61k656l835l275j685l71
$$ 142702 142152 141949 142599 143661 144532 145232 145884 146138 145785 145321 145038 144077 141421 137586 134311 132626 132255
55295A32255O40J913K836K127m2j884k215j693j547j885j880j069O3O56L82k01
$$ 132255 132895 134808 137644 139771 139729 137845 135630 133937 132390 130505 128625 127556 127619 128275 128657 128456
55279A28456k97J26K92j66m25M51J964K554J453n28k115k716k418j524l99P31
$$ 128456 128159 128285 128577 128411 127986 128437 130401 132955 134408 133880 131765 129049 126631 125107 124708 125439
55263A25439K049L644M746M213K109J07k24Q63J722J184l82j673j757q96j90l52
$$ 125439 127488 131132 135878 140091 142200 142307 142083 142946 144668 145852 145470 143797 142040 141144 140954 140602
55247A40602q90q02J04J101J581J506R43J7m92L79K285L535L132J925J014J05
$$ 140602 139712 138910 139014 140115 141696 143202 144145 144162 143670 144049 146334 149869 153001 154926 155940 156045
55231A56045j428k705k173j3J747J730N42n53j176j598j902k029j997j638n94
$$ 156045 154617 151912 149739 149726 151473 153203 153745 153192 152016 150418 148516 146487 144490 142852 142258
55216A42258R38J978J734M96p85j449j388p77KM30K35l06o26k99P34K035K765
$$ 142258 143196 145174 146908 147404 146619 145170 143782 143005 143007 143437 143672 143366 142740 142441 143175 145210 147975
55199A47975K313J020o5k78J44O26Q61P17J48n62r10q20o78n95k32M50R52J141
$$ 147975 150288 151308 151243 150965 151109 151735 152596 153313 153461 152899 151989 151169 150491 149896 149664 150114 151066 152207
55181A52207J517K143K109Q63p22j492j515j437j060Q6J199R01n18j140j38R94
$$ 152207 153724 155867 157976 158839 158117 156625 155110 153673 152613 152699 153898 154799 154281 153141 153003 153997
55165A53997O10r45k240k743k756k223q81O19J074L56k58K64J387J737P69p01
$$ 153997 154607 153662 151422 148679 145923 143700 142819 143438 144512 144868 144610 144874 146261 147998 148767 148066
55149A48066j508j291n29K56R15J252P86n09j513q35J394L328L242J207j327k997
$$ 148066 146558 145267 144738 144994 145909 147161 147947 147438 145925 145090 146484 149812 153054 154261 152934 149937
55133A49937l207k047k48J065J199M67l46q47j055r35m21L19J035J685K193K187
$$ 149937 146730 144683 144435 145500 146699 147166 146820 145973 144918 143983 143562 143881 144916 146601 148794 150981
55117A50981J438K85p71j656k302k078m20J957L382K880J059p59j626j231J37
$$ 150981 152419 152704 151933 150277 147975 145897 145477 147434 150816 153696 154755 153996 152370 151139 151276
55102A51276J448J424k03k148k723j510L27J271Q44m1n2J095K184J772j7j433
$$ 151276 152724 154148 153945 151797 149074 147564 147891 149162 150006 149965 149913 151008 153192 154964 154947 153514
55086A53514j024P04J889J331m07j811j977j240m60N2O48J602K689L630M355M491
$$ 153514 152490 153194 155083 156414 156007 154196 152219 150979 150519 150571 151219 152821 155510 159140 163495 167986
55070A67986L148J27k923l668j732O44J040o97k822l755l131j353Q03K227K030
$$ 167986 171134 171261 168338 164670 162938 163582 164622 163925 161103 157348 154217 152864 153667 155894 157924
55055A57924N11q91r75L8Q29L74j034k084j684P9K150L494L718K968J705O78N31
$$ 157924 158435 157544 156569 156607 157436 157810 156776 154692 153008 153087 155237 158731 162449 165417 167122 167800 168331
55038A68331J080J373P57l86j210j288n94P83K259K569R90j320k227j036P86J564
$$ 168331 169411 170784 171541 171155 169945 168657 168063 168846 171105 173674 174664 173344 171117 170081 170867 172431
55022A72431J230P85P21P56O62N27L99K35J54K32J91j76n41m90k68l93p76r53
$$ 172431 173661 174446 175167 175923 176585 177112 177511 177746 177900 178132 178323 178147 177606 177116 176848 176455 175679 174726
55004A74726j081j624k050j141R01J943N90j590j851K37K476K938J762k9j820
$$ 174726 173645 172021 169971 168830 169731 171674 172264 170674 168823 169060 171536 174474 176236 176207 174387
54989A74387l102l238k503k209k801k778p62K074L191J982L65p3O5m22j206j063
$$ 174387 171285 168047 165544 163335 160534 157756 156994 159068 162259 164241 164606 164533 164598 164176 162970 161907
54973A61907J36J264J523J167O64J13k27J94J263J739O26j270k046j006N24R31
$$ 161907 162043 163307 164830 165997 166661 166774 166547 166741 168004 169743 170369 169099 167053 166047 166571 167502
54957A67502Q1j075j914k351k175j106N65K217L608M626M574K900O01m78l1L73
$$ 167502 167583 166508 164594 162243 160068 158962 159527 161744 165352 169978 174552 177452 178053 177575 177544 177917
54941A77917j06j75J267K796K193k83k128j886n72K96N00N40N77N97P39R65R49
$$ 177917 177811 177636 178903 181699 183892 183609 181481 179595 179023 179319 179819 180359 180936 181533 182272 183237 184186
54924A84186O44L02j05p61j218p15M65R75K42o91p98o07j177k170k069k29K065
$$ 184186 184830 185132 185027 184266 183048 182333 182798 183773 184015 183324 182526 181919 180742 178572 176503 176274 178339
54907A78339K841J445p21j436J64K704M170M166L822L675K874R42q50j003Q5O92
$$ 178339 181180 182625 181904 180468 180632 183336 187506 191672 195494 199169 202043 202985 202135 201132 201217 201909
54891B01909J43m96j93N59M57q93k458k893j958o66n9j03l7M69J026J251J104
$$ 201909 202052 201556 201363 201922 202379 201486 199028 196135 194177 193511 193452 193349 193312 193781 194807 196058 197162
54874A97162M99o69j932k368j578KJ858L614M532L893K347J614K217K620J666
$$ 197162 197661 196992 195060 192692 191114 191116 192974 196588 201120 205013 207360 208974 211191 213811 215477
54859B15477O12J303L183L952L009K422M069P142R237R062P408N840N009M157
$$ 215477 216089 217392 220575 224527 227536 229958 234027 241169 250406 259468 266876 272716 277725 281882
54845B81882K141j027l881n021m651m158m414n091n521n571n471n287m782l757
$$ 281882 284023 282996 279115 274094 269443 265285 260871 255780 250259 244688 239217 233930 229148 225391
54831B25391k472j713k095l152l545k447l29J802L302L779L024J690J198J986
$$ 225391 222919 221206 219111 215959 212414 209967 209638 211440 214742 218521 221545 223235 224433 226419
54817B26419K577J429p12j601l45J763L218L925M638N743O957P601O987N045K539
$$ 226419 228996 230425 229713 228112 227767 229530 232748 236673 241311 247054 254011 261612 268599 273644 276183
54802B76183K89j587l143l914l672l355m072n400n863n020l865l186k836k674
$$ 276183 276472 274885 271742 267828 264156 260801 256729 251329 245466 240446 236581 233395 230559 227885
54788B27885k905l168k633j497j149k202l460l549k756k354k780l277l047k119
$$ 227885 224980 221812 219179 217682 216533 214331 210871 207322 204566 202212 199432 196155 193108 190989
54774A90989j200r04j073r47k38M26O49J126K384L288K319l6j787k166k023j598
$$ 190989 189789 188885 187812 186865 186627 187053 187702 188828 191212 194500 196819 196783 194996 192830 190807 189209
54758A89209j37J828K239O34p18j32R96O98m67q49o56j038j394k55J705K196P56
$$ 189209 189072 190900 193139 193773 193055 192923 193919 194617 194150 193301 192645 191607 190213 189958 191663 193859 194615
54741A94615o72q64p18r56n63J279L213L137Q76j607k409j403N6O88M90L38M54
$$ 194615 193943 193079 192361 191405 190842 192121 195334 198471 199347 197740 195331 193928 193984 194672 195162 195500 195954
54724A95954k0j369k154r41J368K439J710J064J997L586M018K993J690J201J724
$$ 195954 195934 194565 192411 191470 192838 195277 196987 198051 200048 203634 207652 210645 212335 213536 215260
54709B15260K825L723L729L005K551L105M429N996P755R659J0908J0423Q053M966
$$ 215260 218085 221808 225537 228542 231093 234198 238627 244623 252378 262037 272945 283368 291421 296387
54695B96387K793K397L155L423K095k46k196l408m838o886q405q200o830n813
$$ 296387 299180 301577 304732 308155 310250 310004 307808 304400 299562 292676 284271 276071 269241 263428
54681B63428n573n227m305l520l423l336k382j044p29j787k793k097K63K641L476
$$ 263428 257855 252628 248323 244803 241380 238044 235662 234618 233889 232102 229309 227212 227475 230116 233592
54666B33592K623J195M36O59J047O43k61j53J718L928M410L141K133K643L877
$$ 233592 236215 237410 237846 238505 239552 240195 239934 239781 241499 245427 249837 252978 255111 257754 261631
54651B61631M775N499O124N357K246j752m222m848n236n929n664l925k377k750
$$ 261631 266406 271905 278029 283386 285632 283880 279658 274810 269574 263645 257981 254056 251679 248929
54637B48929m579o038o171n419m545l878l300k541j682j399k079k734j877K41
$$ 248929 244350 238312 232141 226722 222177 218299 214999 212458 210776 209377 207298 204564 202687 202928
54623B02928J555R74PN75K227K939K067Q85L86O3q43k027k726k768k402j685o54
$$ 202928 204483 205457 205464 206039 208266 211205 213272 214157 214543 214606 213763 211736 209010 206242 203840 202155 201501
54606B01501J73J24p37j523j483q43m79q32j386j209Q1J948L304L240J766R4l04
$$ 201501 201674 201798 201061 199538 198055 197212 196733 195901 194515 193306 193387 195335 198639 201879 203645 203739 203435
54589B03435O80J491Q20o28j090j70P77O94Ln19q44j055p66J1L25l49r42j36J621
$$ 203435 204115 205606 206426 205798 204708 204538 205315 206009 206012 205493 204649 203594 202828 202839 203164 202815 201873 201737 203358
54570B03358K690K500J929J533P65o57j768j495j99P04L50q28j841k193k067j699
$$ 203358 206048 208548 210477 212010 212775 212118 210350 208855 208656 209360 209710 208882 207041 204848 202781 201082
54554B01082q78O62K486L569L354K257Q96n38j763j973q07P81J536J511J603J747
$$ 201082 200204 200866 203352 206921 210275 212532 213428 212890 211127 209154 208347 209128 210664 212175 213778 215525
54538B15525R47p90j906j316J49J047J100Q55L58n86j352r45L96J050j86k720
$$ 215525 216472 215682 213776 212460 212609 213656 214756 215611 215969 215383 214031 213086 213482 214532 214346 211626
54522B11626m743m792k765P3J938J862M78p06q24k81N5k12q22j184p11O86K348
$$ 211626 206883 202091 199326 199399 201337 203199 203677 202971 202147 201866 201921 201709 200887 199703 198992 199678 202026
54505B02026L411L690L608L267K279P36m58o87m47m12l38K62R69J066R88J788
$$ 202026 205437 209127 212735 216002 218281 219017 218559 217872 217425 217013 216675 216937 217906 218972 219960 221748
54489B21748L140L369J883J98k78k32j008k263k547j671q35m83K87J919L381L644
$$ 221748 224888 228257 230140 230338 230060 229828 228820 226557 224010 222339 221504 221021 221308 223227 226608 230252
54473B30252K956J960N97j146k242j558M42J988J912O37o89j357j407j340j636
$$ 230252 233208 235168 235765 234619 232377 230819 231261 233249 235161 235798 235109 233752 232345 231005 229369
54458B29369k161k110j023K88L97j008k615k998k194j371j199j071r1J575K641
$$ 229369 227208 225098 224075 224363 224760 223752 221137 218139 215945 214574 213375 212304 212213 213788 216429
54443B16429K091L11j279j599o80O75J640J810J387J082J440K148K326J577L63
$$ 216429 218520 218831 217552 215953 215273 215948 217588 219398 220785 221867 223307 225455 227781 229358 229721
54428B29721p25j528j961j694o26P42J801K287K104J249L63M68J499J915P79m76
$$ 229721 228996 227468 225507 223813 223187 223929 225730 228017 230121 231370 231733 232201 233700 235615 236394 235918
54412B35918L09K961N019M870L372K056J116N1q85j005m10J08J21k21p55j479
$$ 235918 236227 239188 244207 249077 252449 254505 255621 255672 254787 253782 253372 253480 253601 253380 252625 251146
54396B51146k121k184j451k45Q25J284J135Q10N67N1j052k014j665j72P34p4j597
$$ 251146 249025 246841 245390 245145 245970 247254 248389 249199 249766 249817 248765 246751 245086 244914 245648 245574 243977
54379B43977k173j665j216j332j440j038j84J109K849M375M699L636J869rj594
$$ 243977 241804 240139 238923 237591 236151 235113 234929 236038 238887 243262 247961 251597 253466 253457 251863
54364B51863k053p88J124J682N30o42q26j130k362k967j144J991L460K279L47
$$ 251863 249810 249022 250146 251828 252358 251716 250890 249760 247398 244431 243287 245278 248738 251017 251364
54349B51364m40j97J11K39M85J066K082L256L649K676J367J225J862J484k6p11
$$ 251364 250924 250727 250838 251077 251562 252628 254710 257966 261615 264291 265658 266883 268745 270229 270203 269492
54333B69492M9P5k048m045k957L69K474K189J511J712J514j43j936k122r69N0
$$ 269492 269541 269616 267568 263523 260566 260935 263409 265598 267109 268821 270335 270192 268256 266134 265165 265215
54317B65215L55L55L61M27O03N93j26j190j256K23J971K542K143J819J649R83
$$ 265215 265570 265925 266286 266713 267316 267909 267783 266593 265337 265560 267531 270073 272216 274035 275684 276667
54301B76667j6m70j91J07O2P5L72O59R05J635K964L962L589K041O53M30R58J027
$$ 276667 276651 276181 275990 276097 276159 276234 276606 277265 278170 279805 282769 286731 290320 292361 293014 293444 294402 295429
54283B95429J98p14r24r44j761l161l862l396k774k900l410l625l627l655l321
$$ 295429 295627 294913 293989 293045 291284 288123 284261 280865 278091 275191 271781 268156 264529 260874 257553
54268B57553k380j562j635k196k264j603o67K19Q01O26j98o89l89k54r94j401
$$ 257553 255173 253611 251976 249780 247516 245913 245246 245465 246266 246892 246694 246005 245616 245362 244368 242967
54252B42967m9K010K229K00j663j346N87K381K982K049k94k861l838k766j044
$$ 242967 242918 244928 247157 247357 245694 244348 244935 247316 250298 252347 252053 249192 245354 242588 241544
54237B41544O9Q63J908K669K420J574J010Q36P19P38R63Q26j39j271j471o03M28
$$ 241544 241613 242476 244384 247053 249473 251047 252057 252893 253612 254350 255313 256139 256000 254729 253258 252655 253083
54220B53083P79K86o90j574j966k015j987j549k33J290J544L76m52M33K119K749
$$ 253083 253862 254148 253458 251884 249918 247903 245916 244367 244134 245424 246968 247344 246892 247325 249444 252193
54204B52193J841K83j085j731j082P54K411K629J816J208R71L95m29n27L80J407
$$ 252193 254034 254317 253232 251501 250419 251173 253584 256213 258029 259237 260208 260603 260174 259647 260027 261434
54188B61434J637P67j107l296m375l487j747j085j655j799o93M85N35lQ8Q25J239
$$ 261434 263071 263838 262731 259435 255060 251573 249826 248741 247086 245287 244594 245079 245614 245611 245699 246524 247763
54171B47763Q66J68k26j84p8m82j595k825l200k319o42J085K211K200R74o07j336
$$ 247763 248629 248797 248571 248387 248309 247827 246232 243407 240207 237888 237246 238331 240542 242742 243716 243109 241773
54154B41773q57J37R19J288J183N69j20k16K29M15p3q44j587k514l480l630k537
$$ 241773 240916 241053 241972 243260 244443 245012 244892 244676 244905 245320 245247 244403 242816 240302 236822 233192 230655
54137B30655r39K61J082J896K448K331J956K025K295J865P26O8O95J762J677J05
$$ 230655 229716 229977 231059 232955 235403 237734 239690 241715 244010 245875 246601 246669 247364 249126 250803 250908
54121B50908j459j286O27K545K934K009J015M27l66j663k587k118m58J150J811
$$ 250908 249449 248163 248790 251335 254269 256278 257293 257720 257354 255691 253104 250986 250528 251678 253489
54106B53489J824K121K987L422K054j059l987m848l929l046k999k763j445K53
$$ 253489 255313 257434 260421 263843 265897 264838 260851 256003 252074 249028 246029 243266 241821 242074
54092B42074J170J327J443J460P41n02j017m1J603K282J147j062k645k416p43
$$ 242074 243244 244571 246014 247474 248215 247713 246696 246655 248258 250540 251687 250625 247980 245564 244821
54077B44821R46J740K053K681L451L346J874j48j344j147k46K79J23j38j12j97
$$ 244821 245767 247507 249560 252241 255692 259038 260912 260764 259420 258273 258027 258306 258429 258291 258179 257982
54061B57982p82j270p41N89J432J126M33L31P36R44P81P26J133J747J904J154
$$ 257982 257200 255930 255189 255778 257210 258336 258769 259100 259836 260780 261561 262287 263420 265167 267071 268225
54045B68225p6o60o0P54N35l10j94J126J925J011n36j091p56p08j165j368j040
$$ 268225 268149 267489 267429 268183 268718 268408 268214 269340 271265 272276 271740 270649 269893 269185 268020 266652 265612
54028B65612n47J62J363K545K709J850J063J030J260J068O05N04R26J217O10o19
$$ 265612 265065 265227 266590 269135 271844 273694 274757 275787 277047 278115 278720 279224 280150 281367 281977 281358
54012B81358r05R56L827M969L380J256J165K774L723K965J601Q37Q09J402K628
$$ 281358 280453 281409 285236 290205 293585 294841 296006 298780 302503 305468 307069 307906 308715 310117 312745
53997C12745M021M903N486O526P799Q111P008N223L372J429k44q88p26j008k100
$$ 312745 316766 321669 327155 333681 341480 349591 356599 361822 365194 366623 366379 365491 364765 363757 361657
53982C61657k783k109p30L77J390K907M679N904O147N351L764K384K520M204N862
$$ 361657 358874 356765 356035 356412 357802 360709 365388 371292 377439 382790 386554 388938 391458 395662 401524
53967D01524O171N372M125K407L95o89M7J782L072L470L006J161k036m761n212
$$ 401524 407695 413067 417192 419599 419994 419305 419352 421134 424206 427676 430682 431843 429807 425046 419834
53952D19834m265m333n695o086m399k736l535o087p445o143l609j999j853k240
$$ 419834 415569 411236 405541 399455 395056 392320 388785 382698 375253 369110 365501 363502 361649 359409
53938C59409k400k497k849l179l093k867l018l200k428p68J50q15k497k695r53
$$ 359409 357009 354512 351663 348484 345391 342524 339506 336306 333878 333110 333260 332445 329948 327253 326300
53923C26300J008J507N40q74j932k202j468l8J245J797J828J790J639J040O5p15
$$ 326300 327308 328815 329355 328481 326549 324347 322879 322841 324086 325883 327711 329501 331140 332180 332245 331530
53907C31530q08j41J137K916M924O385O310M603K557J784K515L534L837L635L416
$$ 331530 330722 330581 331718 334634 339558 345943 352253 356856 359413 361197 363712 367246 371083 374718 378134
53892C78134K830J338n34j495j011K10J286K149L278M825O196O459N263L366J979
$$ 378134 380964 382302 381768 380273 379262 379472 380758 382907 386185 391010 397206 403665 408928 412294 414273
53877D14273J633K101L288N244P080P151N159L144L167M776N972O050N927O054
$$ 414273 415906 418007 421295 426539 433619 440770 445929 449073 452240 457016 462988 469038 474965 481019
53863D81019N736M827M475N529P332Q750R516R945J0191J0331J0656J1330J2119
$$ 481019 486755 491582 496057 501586 508918 517668 527184 537129 547320 557651 568307 579637 591756
53850E91756J2856J3600J4133J3806J2155R139M737r14o693j0685j1824j0915
$$ 591756 604612 618212 632345 646151 658306 667445 672182 671268 664575 653890 642066 631151
53838F31151r638r005r036r354r577r568r622j0106j0754j0843j0250r611r264
$$ 631151 621513 612508 603472 594118 584541 574973 565351 555245 544491 533648 523398 513787 504523
53825E04523q844q339q566r799j0680r566o766m420m061m994n426m714l995m520
$$ 504523 495679 487340 478774 468975 458295 448729 441963 437543 433482 428488 423062 418348 414353 409833
53811D09833n809o092m683l178l542n452o595n499l049j108n89j223k201k588
$$ 409833 404024 397932 393249 390071 386529 381077 374482 368983 365934 364826 364237 363014 360813 358225
53797C58225j876o06J68K56L69O26K15r54j552p19L65K7j592k859k916k351j859
$$ 358225 356349 355743 355911 356167 356536 357162 357377 356423 354871 354152 354517 354544 352952 350093 347177 344826 342967
53780C42967j276j69J279K206J732p4j816j975o75M63M46l2j46k86r38j329m47
$$ 342967 341691 341522 342801 345007 346739 346665 344849 342874 342199 342662 343108 343076 342930 342644 341706 340377 339930
53763C39930J273K544K981L052K831K129J459J534K060K229K172K676L610M004
$$ 339930 341203 343747 346728 349780 352611 354740 356199 357733 359793 362022 364194 366870 370480 374484
53749C74484L591L060K748K363K030K400L440M313M573M545M423M108L954M466
$$ 374484 378075 381135 383883 386246 388276 390676 394116 398429 403002 407547 411970 416078 420032 424498
53735D24498N128M834L672K955L154L249K648K285K910L526K662M52j553k139
$$ 424498 429626 434460 438132 441087 444241 447490 450138 452423 455333 458859 461521 461973 460420 458281
53721D58281j396l55k08j335k771l217k748k685l581m467m589m615n312o113o017
$$ 458281 456885 456530 456322 454987 452216 448999 446251 443566 439985 435518 430929 426314 421002 414889 408872
53706D08872n107m160l536l410m289o081p188o006l065n40L02J8n86j614l103
$$ 408872 403765 399605 396069 392659 388370 382289 375101 369095 366030 365490 365792 365810 365224 363610 360507
53691C60507l959k807K38L271M288L006Q78o13j254j531j409n05P48J271Q38L44
$$ 360507 356548 353741 353979 357250 361538 364544 365422 364809 363555 362024 360615 360110 360858 362129 362967 363311
53675C63311K82L5p04r92qJ531K437K825L623M725M984L972K654K122K389K617
$$ 363311 363593 363628 362924 361932 361924 363455 365892 368717 372340 377065 382049 386021 388675 390797 393186 395803
53659C95803K066Q28j58k3Q41J137N93N72K068L939M419L655L249L713M037L745
$$ 395803 397869 398697 398539 398516 399357 400494 401087 401659 403727 407666 412085 415740 418989 422702 426739 430484
53643D30484L636M093M236L548L008L641M827N133M167K652J173j12o57L61K753
$$ 430484 434120 438213 442449 445997 449005 452646 457473 462606 466773 469425 470598 470486 469829 470190 472943
53628D72943M897N195L838K489K200K217J308k60j043p35q38k419m238m327k768
$$ 472943 477840 483035 486873 489362 491562 493779 495087 494827 493784 493049 492211 489792 485554 481227 478459
53613D78459j444j307j473j181j065j717k229j392L75J364P16o51j242n20Q06
$$ 478459 477015 475708 474235 473054 471989 470272 468043 466651 467026 468390 469106 468455 467213 466693 467499
53598D67499J578J270M55J13L58K15r60k206j897J60K267K824K155J731K036K053
$$ 467499 469077 470347 470802 470915 471273 471488 470528 468322 466425 466585 468852 471676 473831 475562 477598 479651
53582D79651R32o63j259j90J979M093N052M481L404L644N556O977N830L260K323
$$ 479651 480583 479920 478661 478471 480450 484543 489595 494076 497480 501124 506680 513657 519487 522747 525070
53567E25070L598M443L322K370L948O743P656O327N084N042M990M263M088N341
$$ 525070 528668 533111 536433 538803 542751 549494 557150 563477 568561 573603 578593 582856 586944 592285
53553E92285O983P712P653P454P067O356N895O177O738O696N604L577J308R1O94
$$ 592285 599268 606980 614633 622087 629154 635510 641405 647582 654320 661016 666620 670197 671505 671596 672290
53538F72290K073K436J778J748K663K580L42k225k850k093k230l729m831m395
$$ 672290 674363 676799 678577 680325 682988 685568 685910 683685 680835 678742 676512 672783 667952 663557
53524F63557l328k996l530m063l830k797j766j756k792l633l262k231j764j944
$$ 663557 660229 657233 653703 649640 645810 643013 641247 639491 636699 633066 629804 627573 625809 623865
53510F23865j751p05N37J237J388J390J516J778J970J911J894K519L748M599M367
$$ 623865 622114 621409 621946 623183 624571 625961 627477 629255 631225 633136 635030 637549 641297 645896 650263
53495F50263L563L097L044L035L203L826M444M459M364N242P149Q960R869J0112
$$ 650263 653826 656923 659967 663002 666205 670031 674475 678934 683298 688540 695689 704649 714518 724630
53481G24630J0219J0444J1027J2254J3973J5674J7037J8019J8610J9042J9873
$$ 724630 734849 745293 756320 768574 782547 798221 815258 833277 851887 870929 890802
53470H90802K1176K2080K2003K1763K2414K3492K3887K4167K6119K9778L2675
$$ 890802 911978 934058 956061 977824 1000238 1023730 1047617 1071784 1097903 1127681 1160356
53459A160356L2881L1405L0660L1578L3357L5171L6949L8795M0521M1815M2500
$$ 1160356 1193237 1224642 1255302 1286880 1320237 1355408 1392357 1431152 1471673 1513488 1555988
53448A555988M2720M2985M3588M3934M3126M1271L9467L8300L7288L6153L5486
$$ 1555988 1598708 1641693 1685281 1729215 1772341 1813612 1853079 1891379 1928667 1964820 2000306
53437B000306L5492L5106L3394L1173L0108L0537L1227L1099L0293K9474K8935
$$ 2000306 2035798 2070904 2104298 2135471 2165579 2196116 2227343 2258442 2288735 2318209 2347144
53426B347144K8582K8188K7494K6363K5027K3896K2955K1549J8966J5237J1305
$$ 2347144 2375726 2403914 2431408 2457771 2482798 2506694 2529649 2551198 2570164 2585401 2596706
53415B596706Q177N788K948j288o378j0873j4065j6505j9088k2215k5771k9074
$$ 2596706 2604883 2610671 2613619 2612331 2605953 2595080 2581015 2564510 2545422 2523207 2497436 2468362
53403B468362l0880l0405k8651k7792k8888l0929l2446l3073l3113l2673l2029
$$ 2468362 2437482 2407077 2378426 2350634 2321746 2290817 2258371 2225298 2192185 2159512 2127483
53392B127483l1894l2291l2037l0306k8141k7172k7305k6857k4763k1467j7832
$$ 2127483 2095589 2063298 2031261 2000955 1972814 1945642 1918337 1891480 1866717 1845250 1827418
53381A827418j4350j1479r570q098n944k842K84K702M810P263R883J2131J4140
$$ 1827418 1813068 1801589 1792019 1783921 1777977 1775135 1775419 1778121 1782931 1790194 1800077 1812208 1826348
53368A826348J6571J9513K2212K3958K5051K6588K9430L3355L7391M0739M3301
$$ 1826348 1842919 1862432 1884644 1908602 1933653 1960241 1989671 2023026 2060417 2101156 2144457
53357B144457M5292M6857M8202M9798N2060N4949N8146O1420O4633O7641P0484
$$ 2144457 2189749 2236606 2284808 2334606 2386666 2441615 2499761 2561181 2625814 2693455 2763939
53346B763939P3498P6898Q0391Q3421Q5643Q7078Q7952Q8526Q8828Q8590Q7843
$$ 2763939 2837437 2914335 2994726 3078147 3163790 3250868 3338820 3427346 3516174 3604764 3692607
53335C692607Q7418Q8086Q9258Q9596Q9092Q9130Q9855Q8956Q4411P7337P0663
$$ 3692607 3780025 3868111 3957369 4046965 4136057 4225187 4315042 4403998 4488409 4565746 4636409
53324D636409O5744O1832N7979N3511M7140L8067K8010J9983J4454Q684N80q748
$$ 4636409 4702153 4763985 4821964 4875475 4922615 4960682 4988692 5008675 5023129 5031813 5032393 5023645
53312E023645j7263k4875l2638m0715m8862n7766o7961p8014q5700r0643r4321
$$ 5023645 5006382 4981507 4948869 4908154 4859292 4801526 4733565 4655551 4569851 4479208 4384887
53301D384887r7558r9580r9686r8460r6969r5659r4426r3041r1219q8830q6185
$$ 4384887 4287329 4187749 4088063 3989603 3892634 3796975 3702549 3609508 3518289 3429459 3343274
53290C343274q3724q1403p8942p6418p4110p1851o9281o6545o4042o1630n8772
$$ 3343274 3259550 3178147 3099205 3022787 2948677 2876826 2807545 2741000 2676958 2615328 2556556
53279B556556n5418n1904m8122m3656l8804l4501l1169k8516k6513k5412k4590
$$ 2556556 2501138 2449234 2401112 2357456 2318652 2284151 2252982 2224466 2197953 2172541 2147951
53268B147951k2705j9611j6999j6173j6162j5063j2583j0029q153o387m257k303
$$ 2147951 2125246 2105635 2088636 2072463 2056301 2041238 2028655 2018626 2010473 2004086 1999829 1997526
53256A997526j151m50P39K873N684Q650J1330J3421J4834J5862J7218J9651K3198
$$ 1997526 1996375 1995925 1996664 1999537 2005221 2013871 2025201 2038622 2053456 2069318 2086536 2106187 2129385
53243B129385K6777K8977K9610L0084L1761L4312L6458L8064M0391M3864M6697
$$ 2129385 2156162 2185139 2214749 2244833 2276594 2310906 2347364 2385428 2425819 2469683 2516380
53232B516380M6686M3896M0507L8162L6520L4675L2801L1390K9647K6005K0370
$$ 2516380 2563066 2606962 2647469 2685631 2722151 2756826 2789627 2821017 2850664 2876669 2897039
53221B897039J4513R658M799j562q768j4526j7815j9899k2282k5169k8415l2522
$$ 2897039 2911552 2921210 2926009 2924447 2915679 2901153 2883338 2863439 2841157 2815988 2787573 2755051
53209B755051l7429m1534m3378m3732m4576m6419m8148m9261n0497n2077n3145
$$ 2755051 2717622 2676088 2632710 2588978 2544402 2497983 2449835 2400574 2350077 2298000 2244855
53198B244855n3510n4306n5941n6929n6005n4167n3197n2999n2016m9711m7035
$$ 2244855 2191345 2137039 2081098 2024169 1968164 1913997 1860800 1807801 1755785 1706074 1659039
53187A659039m4783m3011m1974m2078m2690m2394m0748l8649l6758l4775l2499
$$ 1659039 1614256 1571245 1529271 1487193 1444503 1402109 1361361 1322712 1285954 1251179 1218680
53176A218680l0294k8108k5363k2415k0712k0705k0952k0240j9312j9243j9285
$$ 1218680 1188386 1160278 1134915 1112500 1091788 1071083 1050131 1029891 1010579 991336 972051
53165I72051j8009j5859j4739j5405j6731j7562j7765j7455j6572j5582j5410
$$ 972051 954042 938183 923444 908039 891308 873746 855981 838526 821954 806372 790962
53154G90962j6229j7178j7452j6882j5431j3230j1271j0841j1852j2753j2521
$$ 790962 774733 757555 740103 723221 707790 694560 683289 672448 660596 647843 635322
53143F35322j1722j1172j0722r977r294r207r560r924j0064r546p795n400m255
$$ 635322 623600 612428 601706 591729 582435 573228 563668 553744 543680 534134 526339 520939 516684
53130E16684n314o995p097n643m447m357m515m232l965m142m289l935l358k916
$$ 516684 511370 504375 497278 491635 487188 482831 478316 474084 470119 465977 461688 457753 454395 451479
53116D51479k444j797j354j479j878j908j275l42L0q15k232k371l45J937J595
$$ 451479 449035 447238 445884 444405 442527 440619 439344 439002 439032 438217 435985 433614 433269 435206 436801
53101D36801j411l917l646k054j844k908k681k8L061M017K471rj953k939l153
$$ 436801 435390 431473 427827 425773 423929 421021 418340 418312 421373 425390 427861 427852 425899 422960 419807
53086D19807k806k010r13J28N77J13r92k112k727k551j424L41J679J565K79o37
$$ 419807 417001 414991 414078 414206 414783 414896 413904 411792 409065 406514 405090 405431 407110 408675 408954 408317
53070D08317j28J133J624Q45k67q29j162j970k731j887R60L864M458K823J276
$$ 408317 408189 409322 410946 411791 411524 410695 409533 407563 404832 402945 403905 407769 412227 415050 416326
53055D16326J315K012J931J249Q18L24r85k294j977l98j0j879l823l331j135k83
$$ 416326 417641 419653 421584 422833 423651 423975 422990 420696 418719 418321 418311 416432 412609 409278 408143 407860
53039D07860k068m476m727k316P96K216J091j336k791k066k24O08k78j368r66
$$ 407860 405792 401316 396589 394273 395069 397285 398376 397040 394249 392183 391959 392567 392289 390921 389955
53024C89955N13R98n22k507k662q34Q33O53o31j266r41p29r87q53Q9J010J226
$$ 389955 390468 391466 390944 388437 385775 384941 385774 386427 385796 384530 383589 382860 381873 381020 381109 382119 383345
53007C83345J171J284J070J54p78j070j266j980k396j374N29J666J663J559J683
$$ 383345 384516 385800 386870 387024 386246 385176 383910 381930 379534 378160 378689 380355 382018 383577 385260
52992C85260J068o61k315k655j781n09O42J287J013q0j392k642l843m413l485
$$ 385260 386328 385667 383352 380697 378916 378407 379049 380336 381349 381269 379877 377235 373392 368979 365494
52977C65494j488pL85P64J642J811M88r32q06K57N63O3k6L85K21n38o14L66J107
$$ 365494 364006 363999 364384 365148 366790 368601 369089 368157 367351 367608 368171 368234 368208 368593 368814 368276 367662 368028 369135
52958C69135N87o09j276r49Q6J089J064k87j661j415J95J334J295J272K016K402
$$ 369135 369722 369113 367837 366888 366974 368063 369127 368840 367179 365764 365959 367293 368588 369860 371876 374278
52942C74278J355l08j176j249j255r14N14K463L366K632J145j74j148j689j434
$$ 374278 375633 375325 374149 372900 371645 370731 371245 373708 377074 379706 380851 380677 379529 377840 376406
52927C76406m16O63J131Q54N4p96q95K30J803K244Q87j152k188j550K67K384L925
$$ 376406 375990 376653 377784 378638 378692 377896 377001 377231 379034 381278 382165 381013 378825 377275 377542 379926 383851
52910C83851M051K568N97j11J008K641L208K819K826L556L497J374j802l733l562
$$ 383851 387902 390470 391067 390956 391964 394605 397813 400632 403458 407014 410511 411885 410083 406350 402788
52895D02788k500j828j530j274j512k617l741l676k654k132k668l069k095k70
$$ 402788 400288 398460 396930 395656 394144 391527 387786 384110 381456 379324 376656 373587 371492 371222
52881C71222Q15O64M35J152K064J477r55l503m176k852j173o52j298j952j538
$$ 371222 372037 372701 373136 374288 376352 377829 376874 373371 369195 366343 365170 364518 363220 361268 359730
52866C59730l3J430J509j6j985l157l377l084k226n47J375K491K656K630K635
$$ 359730 359697 361127 362636 362620 360635 357478 354101 351017 348791 348244 349619 352110 354766 357396 360031
52851C60031J972M02j151j755j445o94K07P76L87o36r25J67J396J132o19k394
$$ 360031 362003 362405 361254 359499 358054 357360 357567 358343 358730 358094 357169 357336 358732 359864 359245 356851
52835C56851k925j921J24K058K613J681O12O05J240J418R43L83k7m23p59j102
$$ 356851 353926 352005 352129 354187 356800 358481 359093 359698 360938 362356 363299 363682 363655 363232 362473 361371
52819C61371j774k355j425J488M523N443M341K980K050Q51o83j552j231j75J273
$$ 361371 359597 357242 355817 357305 361828 367271 371612 374592 376642 377493 376810 375258 374027 373852 375125
52804C75125K902L776L012J422O46O65J10j071j472j033j407k768k883p93J070
$$ 375125 378027 381803 384815 386237 386883 387548 387658 386587 385115 384082 382675 379907 377024 376231 377301
52789C77301K47k167l471l189k674k223j238n23j722m433o147n411l322j582o41
$$ 377301 377548 375381 371910 368721 366047 363824 362586 362063 360341 355908 349761 344350 341028 339446 338805
52774C38805r1M56J228K043J976M37j415j636j8J588J771J051M52M6m06n59k39
$$ 338805 338714 339170 340398 342441 344417 344854 343439 341803 341785 343373 345144 346195 346647 346693 346287 345728 345489
52757C45489j30p03j220q42n7J32mP21K288L149K444J338J273J802J383o0q46
$$ 345489 345359 344656 343436 342594 342537 342669 342665 343386 345674 348823 351267 352605 353878 355680 357063 357003 356157
52740C56157m9J042Q10m19j183j237j576k291k128o43O77L00j375k764k990k175
$$ 356157 356108 357150 357960 357541 356358 355121 353545 351254 349126 348483 349160 349460 348085 345321 342331 340156
52724C40156o90Q33J428P98qR5P88J120J153J583K176K072J443J313J659J245
$$ 340156 339466 340299 341727 342525 342517 342612 343400 344520 345673 347256 349432 351504 352947 354260 355919 357164
52708C57164k44j375j032l7K38r8N8Q05J035J14j223j870j614j010m10L56J350
$$ 357164 356920 355545 354513 354476 354714 354616 354674 355479 356514 356628 355405 353535 351921 350911 350501 350857 352207
52691C52207K008J675M99o91j445j992k291j586M20K571L367K734J831J274P22
$$ 352207 354215 355890 356389 355698 354253 352261 349970 348384 348804 351375 354742 357476 359307 360581 361303
52676C61303J08J34J143K424L219L660M158M423L718J866m69k344l116k689j471
$$ 361303 361411 361545 362688 365112 368331 371991 376149 380572 384290 386156 385687 383343 380227 377538 376067
52661C76067j11Q42J079N93k51r58j469k168l035l303k438r75K22J025J613J606
$$ 376067 375956 376798 377877 378470 378219 377261 375792 373624 370589 367286 364848 363873 364095 365120 366733 368339
52645C68339P05k57k23M36M83p0J5R72J452O10o52j139p74K3J140K168K269J423
$$ 368339 369044 368787 368564 369000 369483 369413 369428 370400 371852 372462 371810 370671 369897 369920 371060 373228 375497 376920
52627C76920P96J033J309Q27J15j01k00p22j273j435j732k348k191p53J90j168
$$ 376920 377716 378749 380058 380885 381000 380899 380699 379977 378704 377269 375537 373189 370998 370245 370435 369267
52611C69267l470l516o82K203K685J339O1m36l14N23J955K877K316R40L95J234
$$ 369267 365797 362281 361599 363802 366487 367826 367887 367451 367137 367660 369615 372492 374808 375748 376143 377377
52595C77377K394K761K453K282K350J772n4k322l415k601p49O56Q12r7j242j565
$$ 377377 379771 382532 384985 387267 389617 391389 391335 389013 385598 382997 382248 382904 383716 383619 382377 380812
52579C80812n53J014J770J448J098J243R83k80j385r05P69K152K715K815K255
$$ 380812 380259 381273 383043 384491 385589 386832 387815 387535 386150 385245 386014 388166 390881 393696 395951
52564C95951P21q27r22J82P77K66k01J59O32N24J62j43p05j420j445n80J88J61
$$ 395951 396672 395845 394923 395105 395882 396148 395947 396106 396738 397262 397424 397281 396576 395156 393711 393131 393319 393480
52546C93480k73p45j400j697l83K276L785K318p81k780k767j822r16k25J92M16
$$ 393480 393207 392462 391062 389365 388982 391258 395043 397361 396580 393800 391033 389211 388295 388070 388262 388678
52530C88678R16J536R88j250l323l041r41N51P02J087K528L668L361K591K753
$$ 388678 389594 391130 392118 390868 387545 384504 383563 384114 384816 385903 388431 392099 395460 398051 400804
52515D00804L343K769P59j315k232k082j685j606j804j913j715j339j010o95k75
$$ 400804 404147 406916 407675 406360 404128 402046 400361 398755 396951 395038 393323 391984 390974 390279 390004
52500C90004R8K27K58L13J9r18j786j457J9J299J518J251J261J253O04l38o57
$$ 390004 390102 390329 390587 390900 390919 390001 388215 386758 386777 388076 389594 390845 392106 393359 393963 393625 392968
52483C92968k53N3l71j367k440l126k909j469P36K525K979K222J173O46P58J051
$$ 392968 392715 392768 392397 391030 388590 385464 382555 381086 381822 384347 387326 389548 390721 391367 392125 393176
52467C93176J072Q59Q25J163J500J298M78n47j362j828j891j406l71Q64J820K297
$$ 393176 394248 395107 395932 397095 398595 399893 400371 399824 398462 396634 394743 393337 392966 393830 395650 397947
52451C97947K410K288K013J851K150K808L211L031K828L273L954L636J858l54
$$ 397947 400357 402645 404658 406509 408659 411467 414678 417709 420537 423810 427764 431400 433258 432904
52437D32904j719k061j973j777j457j254j517j985j968j267m04J27K65O5l58n08
$$ 432904 431185 429124 427151 425374 423917 422663 421146 419161 417193 415926 415522 415649 415914 415979 415621 415113
52421D15113J57J292J753J087L06N59J481J609L69j132j427l57R25J237M44n51
$$ 415113 415270 416562 418315 419402 419708 420267 421748 423357 423726 422594 421167 420810 421735 422972 423416 422865
52405D22865o34O04K551M096M598M305L767L076K105J367J874L598M707L313j26
$$ 422865 422231 422835 425386 429482 434080 438385 442152 445228 447333 448700 450574 454172 458879 462192 462066
52390D62066l070l827l210k872l044k906k397k374l106l800l850l607l607l742
$$ 462066 458996 455169 451959 449087 446043 443137 440740 438366 435260 431460 427610 424003 420396 416654
52376D16654l495k517q38J002K079J922J263J179J569J399N70L00J187K062J713
$$ 416654 413159 410642 409804 410806 412885 414807 416070 417249 418818 420217 420787 421087 422274 424336 426049
52361D26049P30O23J708L044L940M359M185L319K508K799L957M609M222L880M498
$$ 426049 426779 427402 429110 432154 436094 440453 444638 447957 450465 453264 457221 461830 466052 469932 474430
52346D74430N399N569N555O802R292J0947R744N723O09l881o850p893p026n182
$$ 474430 479829 485398 490953 497755 507047 517994 527738 533461 534070 530189 523339 515446 508420 503238
52332E03238m024m490n620n487l461j080k37r19j397n53P56J013J21m93K18J732
$$ 503238 499214 494724 489104 483617 480156 479076 478839 477920 476523 475970 476726 477739 477860 477367 477585 479317
52316D79317K935L666M582N705O040M977L383K693L271M310N117N700O104O017
$$ 479317 482252 485918 490500 496205 502245 507222 510605 513298 516569 520879 525996 531696 537800 543817
52302E43817N324M385L375J999L00p84l23J361K946L451K997K437K590L663M916
$$ 543817 549141 553526 556901 558900 559200 558416 558093 559454 562400 565851 568848 571285 573875 577538 582454
52287E82454N190M203L167L562N459P574Q865R343R328Q755P676O905P544R815
$$ 582454 587644 591847 595014 598576 604035 611609 620474 629817 639145 647900 655576 662481 670025 679840
52273F79840J2655J4595J5063J4831J5121J6232J7388J7986J8527J9748K1389
$$ 679840 692495 707090 722153 736984 752105 768337 785725 803711 822238 841986 863375
52262H63375K2576K3204K3978K5000K5356K4511K3235K2467K1942K0743J8789
$$ 863375 885951 909155 933133 958133 983489 1008000 1031235 1053702 1075644 1096387 1115176
52251A115176J6944J5743J4813J3617J2153J0742R542Q555P833P423P260P223
$$ 1115176 1132120 1147863 1162676 1176293 1188446 1199188 1208730 1217285 1225118 1232541 1239801 1247024
52239A247024P193P045O687O153N457M413K752N89j439k606k722k301k155k809
$$ 1247024 1254217 1261262 1267949 1274102 1279559 1283972 1286724 1287313 1285874 1283268 1280546 1278245 1276090 1273281
52225A273281m141n487o030n280l344r18J108K334L290M996P884J1174J3442J3873
$$ 1273281 1269140 1263653 1257623 1252343 1248999 1248081 1249189 1251523 1254813 1259809 1267693 1278867 1292309 1306182
52211A306182J2922J1858J1731J2713J4219J5499J6073J5797J4765J3348J2079
$$ 1306182 1319104 1330962 1342693 1355406 1369625 1385124 1401197 1416994 1431759 1445107 1457186
52200A457186J1105R814P495M597K773L115M694N470M589L053K007J249Mj579
$$ 1457186 1468291 1478105 1485600 1490197 1492970 1496085 1500779 1506249 1510838 1513891 1515898 1517147 1517151 1515572
52186A515572k631l013l522m526n380n658o157p920j0659j2893j3631j3224j2535
$$ 1515572 1512941 1509928 1506406 1501880 1496500 1490842 1484685 1476765 1466106 1453213 1439582 1426358 1413823
52173A413823j1848j0763q801o039l327j776j680k088j884j112o44p15o73k43
$$ 1413823 1401975 1391212 1382411 1376372 1373045 1371269 1369589 1367501 1365617 1364505 1363861 1363146 1362473 1362230
52159A362230K4oO91K906N734P369P103N793M685M543N636P588R227R362P889
$$ 1362230 1362254 1362248 1362939 1365845 1371579 1378948 1386051 1391844 1396529 1401072 1406708 1414296 1423523 1432885 1440774
52144A440774N708L629K015J352K107L796M952M572L138J922J670K242L043L538
$$ 1440774 1446482 1450111 1452126 1453478 1455585 1459381 1464333 1468905 1472043 1473965 1475635 1477877 1480920 1484458
52130A484458L563L446L570L766L516K781K095J792J627J384J244J106J37k433
$$ 1484458 1488021 1491467 1495037 1498803 1502319 1505100 1507195 1508987 1510614 1511998 1513242 1514348 1514485 1512052
52116A512052o114r140r780p849n130m011n137o569o010l716k149k549l320k443
$$ 1512052 1505938 1496798 1487018 1479169 1474039 1470028 1464891 1458322 1452312 1448596 1446447 1443898 1440578 1438135
52102A438135l02J208J563K045L498N089N641N161M544M365M465M373L778K679
$$ 1438135 1437833 1439041 1440604 1442649 1446147 1451236 1456877 1462038 1466582 1470947 1475412 1479785 1483563 1486242
52088A486242J335J40l69L64K283M239M899M529M900O831Q713Q681P400P137Q467
$$ 1486242 1487577 1487717 1487348 1487712 1489995 1494234 1499133 1503662 1508562 1515393 1524106 1532787 1540187 1547324 1555791
52073A555791R805J0217J0695J1925J2818J2665J3081J5954K0277K3180K3831
$$ 1555791 1565596 1575813 1586508 1598433 1611251 1623916 1636997 1652951 1673228 1696408 1720239
52062A720239K4323K6406K9255L1240L2330L3453L4442L4090L1927K8825K5909
$$ 1720239 1744562 1770968 1800223 1831463 1863793 1897246 1931688 1965778 1997705 2026530 2052439
52051B052439K3743K2346K1112J8701J4148Q346L509P61r61l239o274r199j1397
$$ 2052439 2076182 2098528 2119640 2138341 2152489 2160835 2164344 2165105 2164144 2160905 2154631 2145432 2134035
52038B134035j2619j2587j1626j1112j2013j3166j2408r446o296m643m258m471
$$ 2134035 2121416 2108829 2097203 2086091 2074078 2060912 2048504 2039058 2032762 2028119 2023861 2019390
52026B019390n662q114j0537j1207j0022q237o524m528k154l8J465K725M027N107
$$ 2019390 2013728 2005614 1995077 1983870 1973848 1965611 1959087 1954559 1952405 1952367 1953832 1956557 1960584 1965691
52012A965691N919P086R068J1242J2358J1915J0836J0660J1968J3620J3787J1756
$$ 1965691 1971610 1978696 1987764 1999006 2011364 2023279 2034115 2044775 2056743 2070363 2084150 2095906
52000B095906Q423N099K445N96o04j934m470q034j0889j1846j1996j3089j4965
$$ 2095906 2104329 2109428 2111873 2112469 2111865 2109931 2105461 2097427 2086538 2074692 2062696 2049607 2034642
51987B034642j6030j5829j5537j5947j6696j7657j9425k1861k3587k3725k2986
$$ 2034642 2018612 2002783 1987246 1971299 1954603 1936946 1917521 1895660 1872073 1848348 1825362
51976A825362k2451k2236k1954k1379k0091j7624j4598j2539j1874j1326j0102
$$ 1825362 1802911 1780675 1758721 1737342 1717251 1699627 1685029 1672490 1660616 1649290 1639188
51965A639188r239r617j0130r517q901j0435j3920j6758j7233j6166j5197j4970
$$ 1639188 1629949 1620332 1610202 1600685 1591784 1581349 1567429 1550671 1533438 1517272 1502075 1487105
51953A487105j5284j5691j5628j4950j4589j5612j7536j8696j8486j8054j8411
$$ 1487105 1471821 1456130 1440502 1425552 1410963 1395351 1377815 1359119 1340633 1322579 1304168
51942A304168j9086j9192j8693j7918j6796j5338j4181j3874j4092j4155j3778
$$ 1304168 1285082 1265890 1247197 1229279 1212483 1197145 1182964 1169090 1154998 1140843 1127065
51931A127065j2932j1532r797q369p668p629q279r738j1183j0931q474n654m735
$$ 1127065 1114133 1102601 1092804 1084435 1076767 1069138 1060859 1051121 1039938 1029007 1020533 1014879 1010144
51918A010144n758o952p389p985r832j2526j4593j4953j3870j2708j2675j3408
$$ 1010144 1004386 997434 990045 982060 972228 959702 945109 930156 916286 903578 890903 877495
51906H77495j3083j0382o081k108N20K078K997L497M237N962Q252R642R333P990
$$ 877495 864412 854030 847949 845841 846361 848439 851436 854933 859170 865132 873384 883026 892359 900349
51892I00349O601N475M666M291L925K679N17j409k371l017l918m212k902o02J402
$$ 900349 906950 912425 917091 921382 925307 927986 928503 927094 924723 921706 917788 913576 910674 910072 911474
51877I11474L197N860R274J1876J2712J2430J1974J1447J0596R281P239M314J223
$$ 911474 914671 920531 929805 941681 954393 966823 978797 990244 1000840 1010121 1017360 1021674 1022897
51864A022897r80k537m961q918j3197j6261j7714j7730j6333j4136j2586j2244
$$ 1022897 1021917 1019380 1014419 1005501 992304 976043 958329 940599 924266 910130 897544 885300
51852H85300j1674r301n658k576p37P02K477M619P176J0180J2863J4040J3307
$$ 885300 873626 864325 858667 856091 855354 856056 858533 863152 870328 880508 893371 907411 920718
51839I20718J0993P291K571j693l908m355m884o330p603p785p723q694j0507j1940
$$ 920718 931711 939002 941573 939880 935972 931617 926733 920403 912800 905015 897292 888598 878091 866151
51825H66151j2438j2470j2494j2239j1170r511q451q805r334p491k726K032L735
$$ 866151 853713 841243 828749 816510 805340 795829 787378 778573 769239 761748 759022 761054 764789
51812G64789L180L482N238N889M188K329K516L922M658M576M152K538r53m784
$$ 764789 767969 771451 776689 782578 786766 789095 791611 795533 800191 804767 808919 811457 810504 805720
51798H05720o903p476p704p143m731j716o29j527k033j216o79j242j395k29N18
$$ 805720 798817 791341 783637 776494 771763 770047 769418 767891 765858 764642 763963 762721 761326 761097 761615
51783G61615r26l498m818m447l929m347n359o194o306n339l552k169k384l930
$$ 761615 760689 757191 752373 747926 743997 739650 734291 728097 721791 716452 712900 710731 708347 704417
51769G04417n208m835k830m69P66M00n96r19n28o62k105m078n259n212m443l606
$$ 704417 699209 694374 691544 691075 691841 692241 691645 690726 690198 689536 687431 683353 678094 672882 668439 664833
51753F64833l150l232l491l225k231j085k98L86J493L003M394N069M535K640M4
$$ 664833 661683 658451 654960 651735 649504 648419 648121 648507 650000 653003 657397 662466 667001 669641 669685
51738F69685k020k979l493m423n580n908m735k501n00jj214k833l128j833n38
$$ 669685 667665 664686 661193 656770 651190 645282 640547 638046 637546 637545 636331 633498 630370 628537 627999
51723F27999q31k457l725l359j483Q10K390K711K050J250J064J784L216M726N398
$$ 627999 627168 624711 620986 617627 616144 616954 619344 622055 624105 625355 626419 628203 631419 636145 641543
51708F41543M732L302K289K343L262M666O288P740Q779R771J1033J1807J1014
$$ 641543 646275 649577 651866 654209 657471 662137 668425 676165 684944 694715 705748 717555 728569
51695G28569R069P563O761M961J080l505o756q438r500j0063r505p950o378n391
$$ 728569 737638 745201 751962 756923 758003 754498 747742 739304 729804 719741 710236 702286 695908 690517
51681F90517m955m926m985m550l700l379l701k913L85M689P088P010O538P001
$$ 690517 685562 680636 675651 671101 667401 664022 660321 657408 657793 662482 669570 676580 683118 690119
51667F90119P347O377M632L088J566l64k119l021l683n079o730p140o006m831
$$ 690119 697466 703843 708475 711563 713129 712765 710646 707625 703942 698863 692133 684993 678987 674156
51653F74156n019o030o045m245j924j017j712k176r42J122K055J567J349K506
$$ 674156 669137 663107 657062 652817 650893 649876 648164 645988 645046 646168 648223 649790 651139 653645
51639F53645M004M230L174K147J887J879J356K84o47n77Q39K825L745K533j39
$$ 653645 657649 661879 665053 667200 669087 670966 672322 672606 671959 671382 672221 675046 678791 681324 681185
51624F81185k605l987m628m735l649j155J149J083j482m219m977l885k302p17
$$ 681185 678580 674593 669965 665230 661581 660426 661575 662658 661176 656957 651980 648095 645793 645076
51610F45076J204L133M130M086L885M016M187M421N126N867N452L784K157J189
$$ 645076 646280 649413 653543 657629 661514 665530 669717 674138 679264 685131 690583 694367 696524 697713
51596F97713Q4j161q12J858M558M901L946M455O497P435O023L857K472J383l19
$$ 697713 697797 696636 695824 697682 702240 707141 711087 715542 722039 729474 735497 739354 741826 743209 742890
51581G42890k417m449o405p853p941o980o524p157p735p523p440q229q957q458
$$ 742890 740473 736024 729619 721766 713825 706845 700321 693164 685429 677906 670466 662237 653280 644822
51567F44822o975n277l450j737j136j836k190q65J047J662J143J173K065K280
$$ 644822 637847 632570 629120 627383 626247 624411 622221 621356 622403 624065 625208 626381 628446 630726
51553F30726P32j878m175n360n312m367l159j944k42K322N185P441Q774R049P885
$$ 630726 631458 629580 625405 620045 614733 610366 607207 605263 605021 607343 612528 619969 628743 637792 645677
51538F45677N740M636O194R243J0892R975Q061P081P321P950Q060O700L149j918
$$ 645677 651417 656053 662247 671490 682382 692357 700418 707499 714820 722770 730830 737530 740679 738761
51524G38761o274p940o920m832l136j987m94K081N367Q230J0211J2085J4593J7152
$$ 738761 732487 724547 717627 712795 709659 707672 707178 709259 714626 722856 733067 745152 759745 776897
51510G76897J8608J8780J8512J8616J9548K1504K3751K4435K2535J9766J8958
$$ 776897 795505 814285 832797 851413 870961 892465 916216 940651 963186 982952 1001910
51499A001910K0682K3088K5140K8004L2532L7271M0279M1503M1915M1214L7966
$$ 1001910 1022592 1045680 1070820 1098824 1131356 1168627 1208906 1250409 1292324 1333538 1371504
51488A371504L1625K3177J3929M650m171j2181j9427k6149l2280l7440m1314m3645
$$ 1371504 1403129 1426306 1440235 1444885 1440714 1428533 1409106 1382957 1350677 1313237 1271923 1228278
51476A228278m4083m2514l9494l5994l2822l0424k8899k7888k6680k4850k2624
$$ 1228278 1184195 1141681 1102187 1066193 1033371 1002947 974048 946160 919480 894630 872006
51465H72006k0398j8165j5780j3483j1766j0816j0341r906r237q378p660p393
$$ 872006 851608 833443 817663 804180 792414 781598 771257 761351 752114 743736 736076 728683
51453G28683p440p257o375m683k527p69m55j605k557j527J015K632K004O27O21
$$ 728683 721243 713986 707611 702928 700401 699632 699177 697572 695015 693488 694503 697135 699139 699766 700387
51438G00387J791K078L99k181m022m597m463m396m776n263m971l534j953j682
$$ 700387 702178 704256 704655 702474 698452 693855 689392 684996 680220 674957 669986 666452 664499 662817
51424F62817k745l525k866j689j820l573n426o100o083o499p147o718m905l165
$$ 662817 660072 656547 653681 651992 650172 646599 641173 635073 628990 622491 615344 608626 603721 600556
51410F00556k786l182l071k668l218m573m858l135r92m17j133j294k27R11J036
$$ 600556 597770 594588 591517 588849 585631 581058 576200 573065 572073 571656 570523 569229 569002 569913 570949
51395E70949N17L36Q64J926L462N538P796R293R123P421N644N416O967R121J0936
$$ 570949 571466 571802 572666 574592 578054 583592 591388 600681 609804 617225 622869 628285 635252 644373 655309
51380F55309J2532J3891J3884J1565P857M654K460K96k119l539l118j888j546
$$ 655309 667841 681732 695616 707181 715038 719692 722152 722448 720329 716790 713672 711784 710238
51367G10238k498l873m845n188n036m900n467o634p106n851l712k627l189m024
$$ 710238 707740 703867 699022 693834 688798 683898 678431 671797 664691 658840 655128 652501 649312 645288
51353F45288l781k665j503k46J556L445M443M651N168O245O712N983N437O538
$$ 645288 641507 638842 637339 637093 638649 642094 646537 651188 656356 662601 669313 675296 680733 687271
51339F87271Q306Q280N982L861M215O418Q082Q021P097O710P504R234J1058J2130
$$ 687271 695577 703857 709839 713700 717915 724333 732415 740436 747533 754243 761747 770981 782039 794169
51325G94169J2639J3975J7056K0794K3255K4291K5964L0119L6353M2661M7381
$$ 794169 806808 820783 837839 858633 881888 906179 932143 962262 998615 1041276 1088657
51314A088657N0177N1797N3342N5241N6569N5612N1338M4064L4762K4338J3578
$$ 1088657 1138834 1190631 1243973 1299214 1355783 1411395 1462733 1506797 1541559 1565897 1579475
51303A579475L077p135j7283k7031l5607m2897m9597n5719n9832o0656n8811n6045
$$ 1579475 1582552 1575417 1558134 1531103 1495496 1452599 1403002 1347283 1287451 1226795 1167984 1111939
51291A111939n3069m9102m3571l7339l1966k8249k5845k3960k2037j9754j6804
$$ 1111939 1058870 1009768 966197 928858 896892 868643 842798 818838 796801 777047 760243
51280G60243j3138r599p695q100r583j0177r339q131p367o789o395o950q345q791
$$ 760243 747105 737506 729811 721711 712128 701951 692612 684481 677114 670325 663930 656980 648635 639844
51266F39844p083m630l645m050m078l466l791n411o306m913k298l32Q03J832K438
$$ 639844 632761 628131 624486 620436 616358 612892 609101 603690 597384 592471 590173 589841 590644 592476 594914
51251E94914J910J026J282K422K538J009l11M12K426L375K224K45o55J14J521
$$ 594914 596824 597850 599132 601554 604092 605101 604790 605202 607628 611003 613227 613472 612817 612931 614452
51236F14452K152J592P38O39J102P91j153m036o373p330p097o252n277m402l315
$$ 614452 616604 618196 618934 619573 620675 621466 620313 616277 609904 602574 595477 589225 583948 579546 576231
51221E76231j337J524L884M260L026K099K436K860K047N96O6N79Q26J62o70j035
$$ 576231 574894 576418 580302 584562 587588 589687 592123 594983 597030 597626 597692 598271 599097 599259 598589 597554
51205E97554j142r04N29L117N028M638K770J569J584J355r5j779k223j386m65
$$ 597554 596412 595508 596037 599154 604182 608820 611590 613159 614743 616098 616003 614224 612001 610615 610150
51190F10150m53j370k509l008k572j808j629k078k341j984j486j291r81l4J183
$$ 610150 609697 608327 605818 602810 600238 598430 596801 594723 592382 590398 588912 587621 586640 586606 587789
51175E87789J827J675J148L74j002k985m659m871l502j847j386k053k185p58R12
$$ 587789 589616 591291 592439 592813 591811 588826 584167 579296 575794 573947 572561 570508 568323 567565 568477
51160E68477P08j188k222r02J213J889J275J058J582J658R77Q72K313M569O281
$$ 568477 569185 567997 565775 564873 566086 567975 569250 570308 571890 573548 574525 575397 577710 582279 588560
51145E88560O849O389N414M858N351O052N334L161J479J566K129J299o39j864
$$ 588560 595409 601798 607212 612070 617421 623473 628807 631968 633447 635013 637142 638441 637802 635938
51131F35938j779j448j474j090J71J158L50k165m646n466m567l242k654k629k035
$$ 635938 634159 632711 631237 630147 630318 631476 631826 629661 625015 619549 614982 611740 609086 606457 604422
51116F04422l98J268J668R14L34O55J134O60q01k133k182p85J055K000J690J150
$$ 604422 604024 605292 606960 607874 608208 608863 609997 610657 609856 607723 605541 604756 605811 607811 609501 610651
51100F10651J599K945L964L810K776J554M68l13n16j52K69L29O1n56j806l428
$$ 610651 612250 615195 619159 622969 625745 627299 627767 627454 626938 626786 627055 627384 627445 626889 625083 621655
51084F21655m245l387j540k25K4L9N95J455K015K135J991J572Q12r3q34j329j667
$$ 621655 617410 614023 612483 612258 612282 612321 612916 614371 616386 618521 620512 622084 622896 622803 621969 620640 618973
51067F18973j868j843j472o68M12J205J232P68N87Q57Q54K35r4Q56K474L059K055
$$ 618973 617105 615262 613790 613122 613534 614739 615971 616739 617326 618183 619037 619272 619178 620034 622508 625567 627622
51050F27622Q26Q84K095L217L676M040M898N914O141N081L338K251K673L993M698
$$ 627622 628448 629332 631427 634644 638320 642360 647258 653172 659313 664394 667732 669983 672656 676649 681347
51035F81347M093L081K847L187K824J168r40k323k597k133j423r73j278k306l152
$$ 681347 685440 688521 691368 694555 697379 698547 697607 695284 692687 690554 689131 688158 686880 684574 681422
51020F81422k671o36J826L206K927J732P31K65k1k10J51J096J815J792J833L064
$$ 681422 678751 678115 679941 683147 686074 687806 688537 688802 688781 688571 688722 689818 691633 693425 695258 698322
51004F98322N220P075Q295R671J1410J2550J2637J2621J3218J3448J2015R435
$$ 698322 703542 710617 718912 728583 739993 752543 765180 777801 791019 804467 816482 825917
50992H25917P574P427Q455R900J1581J3402J4965J5867J5756J4234J1360Q105
$$ 825917 833491 840918 849373 859273 870854 884256 899221 915088 930844 945078 956438 964543
50980I64543N536L688J895L8j414k426l514m961o834r601j3529j7496j9667j9516
$$ 964543 970079 973767 975662 975700 974286 971860 968346 963385 956551 946950 933421 915925 896258 876742
50966H76742j8024j5767j2398q393n520m494l674j404J547L377M077N120O894
$$ 876742 858718 842951 830553 822160 816640 812146 808472 807068 808615 811992 816069 821189 828083
50953H28083Q307Q829R238J0108J0966J1415J1905J2858J3913J4546J4759J4705
$$ 828083 836390 845219 854457 864565 875531 886946 898851 911709 925622 940168 954927 969632
50941I69632J4283J3480J2598J1922J1655J2249J4024J6214J7244J6464J4965
$$ 969632 983915 997395 1009993 1021915 1033570 1045819 1059843 1076057 1093301 1109765 1124730
50930A124730J4114J3929J3506J2518J1511J1044J1238J2058J3278J4196J4033
$$ 1124730 1138844 1152773 1166279 1178797 1190308 1201352 1212590 1224648 1237926 1252122 1266155
50919A266155J2819J1424J0503R809Q766P481O851P723J0181J3749J8035K3005
$$ 1266155 1278974 1290398 1300901 1310710 1319476 1326957 1333808 1341531 1351712 1365461 1383496 1406501
50907A406501K8547L4018L8507M1598M3790M6118M9364N3505N7754O1144O3194
$$ 1406501 1435048 1469066 1507573 1549171 1592961 1639079 1688443 1741948 1799702 1860846 1924040
50896A924040O4108O4335O4105O3330O1656N8547N3706M7752M2012L7196L2634
$$ 1924040 1988148 2052483 2116588 2179918 2241574 2300121 2353827 2401579 2443591 2480787 2513421
50885B513421K7474K2208J8163J5650J3784J2107J1099J0555Q712M163j977o911
$$ 2513421 2540895 2563103 2581266 2596916 2610700 2622807 2633906 2644461 2653173 2657336 2655359 2648448
50873B648448q983q925q632r576j2292j6489k1378k6270l0936l5225l8697m1223
$$ 2648448 2639465 2630540 2621908 2612332 2600040 2583551 2562173 2535903 2504967 2469742 2431045 2389822
50861B389822m3586m6675n0220n3070n4600n5116n4882n3747n1872m9940m8297
$$ 2389822 2346236 2299561 2249341 2196271 2141671 2086555 2031673 1977926 1926054 1876114 1827817
50850A827817m6588m4438m1787l8381l3944k9277k6079k4970k4482k2837k0031
$$ 1827817 1781229 1736791 1695004 1656623 1622679 1593402 1567323 1542353 1517871 1495034 1475003
50839A475003j7323j5443j4306j3859j3915j3583j2105j0158r007q423o899m040
$$ 1475003 1457680 1442237 1427931 1414072 1400157 1386574 1374469 1364311 1355304 1346881 1339982 1335942
50827A335942j373j57L12J419L189M454M458L517K521K314L213M661N801O660
$$ 1335942 1334569 1334412 1334724 1336143 1339332 1343786 1348244 1351761 1354282 1356596 1359809 1364470 1370271 1376931
50813A376931Q062J0153J2034J3425J5452J8792K2169K4009K4786K6142K8396
$$ 1376931 1384993 1395146 1407180 1420605 1436057 1454849 1477018 1501027 1525813 1551955 1580351
50802A580351L0628L2829L5990M0061M3811M7033N1047N6353O1600O5759O9739
$$ 1580351 1610979 1643808 1679798 1719859 1763670 1810703 1861750 1918103 1979703 2045462 2115201
50791B115201P4699Q0250Q5542R0877R6884J03244J09698J17052J25379J32289
$$ 2115201 2189900 2270150 2355692 2446569 2543453 2646697 2756395 2873447 2998826 3131115
50781C131115J35408J35939J37280J40084J41235J38200J31851J23760J13173
$$ 3131115 3266523 3402462 3539742 3679826 3821061 3959261 4091112 4214872 4328045
50772D328045R8726Q1746O5500N1667L9417K7705J6763P128j207q101j2726j4376
$$ 4328045 4426771 4508517 4574017 4625684 4665101 4692806 4709569 4716697 4715490 4707389 4694663 4680287
50760D680287j3359j0721p526m609k520j471j719m014r249j7515k8022m0074n3538
$$ 4680287 4666928 4656207 4648681 4644072 4641552 4640081 4638362 4634348 4625099 4607584 4579562 4539488 4485950
50747D485950o8047q2379r5150j05922j15111j22974j29082j32587j32729j29203
$$ 4485950 4417903 4335524 4240374 4134452 4019341 3896367 3767285 3634698 3501969 3372766
50737C372766j22599j14544j06884j00305r3871q6150p6774o6810n7565m9356
$$ 3372766 3250167 3135623 3028739 2928434 2834563 2748413 2671639 2604829 2547264 2497908
50727B497908m1594l4025k7476k2991k0390j8204j5242j1960r911j0016j1618
$$ 2497908 2456314 2422289 2394813 2371822 2351432 2333228 2317986 2306026 2296115 2286099 2274481
50716B274481j3230j3853j3561j3128j3262j4103j5329j6652j8132j9881k1627
$$ 2274481 2261251 2247398 2233837 2220709 2207447 2193344 2178015 2161363 2143231 2123350 2101723
50705B101723k2942k3890k5038k6694k8399k9359k9206k8072k6290k4265k2343
$$ 2101723 2078781 2054891 2029853 2003159 1974760 1945401 1916195 1888123 1861833 1837568 1815225
50694A815225k0425j7884j4411j0750p923n676k485K523Q235J2691J5172J6537
$$ 1815225 1794800 1776916 1762505 1751755 1743832 1738156 1735671 1738194 1746429 1759120 1774292 1790829
50682A790829J7841J9468K1662K5012K9800L5289M0269M4336M8273N3119N9032
$$ 1790829 1808670 1828138 1849800 1874812 1904612 1939901 1980170 2024506 2072779 2125898 2184930
50671B184930O5054O9857P2685P3736P3727P3185P2286P1252P0404O9546O7701
$$ 2184930 2249984 2319841 2392526 2466262 2539989 2613174 2685460 2756712 2827116 2896662 2964363
50660B964363O4109N9323N4642N0352M5266L8336K9963K1179J2181K685o688j4472
$$ 2964363 3028472 3087795 3142437 3192789 3238055 3276391 3306354 3327533 3339714 3342399 3335711 3321239
50648C321239j9799k2805k3505k1505j7299j2696r154o397l500n04J972L896N231
$$ 3321239 3301440 3278635 3255130 3233625 3216326 3203630 3194476 3188079 3184579 3184075 3186047 3189943 3195174
50635C195174M740R98n497j2691j9595k7049l5472m3393m9095n2461n4208n4282
$$ 3195174 3199914 3200912 3195415 3182724 3163129 3136080 3100608 3057215 3008120 2955659 2901451 2847169
50623B847169n2188m8306m3701l8947l3962k8616k2731j5909q203n22O407J3028
$$ 2847169 2794981 2746675 2702974 2664027 2630065 2601449 2578718 2562809 2554606 2554084 2560491 2573519
50611B573519K0047K7074L3274L8722M3830M7787M9301M8856M8487M8851M8225
$$ 2573519 2593566 2620640 2653914 2692636 2736466 2784253 2833554 2882410 2930897 2979748 3027973
50600C027973M5356M1871M0494M1684M3409M3899M3456M3498M4804M7038M9529
$$ 3027973 3073329 3115200 3155694 3197378 3240787 3284686 3328142 3371640 3416444 3463482 3513011
50589C513011N2064N4926N8274O1859O5561O9840P4939P9891Q3383Q5701Q8612
$$ 3513011 3565075 3620001 3678275 3740134 3805695 3875535 3950474 4030365 4113748 4199449 4288061
50578D288061R2766R6286R6897R4612R1260Q7844Q3648P7681O9980O1222N1952
$$ 4288061 4380827 4477113 4574010 4668622 4759882 4847726 4931374 5009055 5079035 5140257 5192209
50567E192209M2449L2937K3629J4602N253o222k1914m1749o2317p9039q9320r3044
$$ 5192209 5234658 5267595 5291224 5305826 5311079 5304857 5282943 5241194 5178877 5099838 5010518 4917474
50555D917474r0907q3864p3958o3640n3567m2510l0144j8616j0276n224k577l158
$$ 4917474 4826567 4742703 4668745 4605105 4551538 4509028 4478884 4460268 4449992 4444768 4442191 4439033
50543D439033q963k0068l3872m7908o1997p6811r1359j03060j10135j13088j13804
$$ 4439033 4430070 4410002 4376130 4328222 4266225 4189414 4098055 3994995 3884860 3771772 3657968
50532C657968j13668j12762j10504j06610j01312r4831q7239p9026p1287o4786
$$ 3657968 3544300 3431538 3321034 3214424 3113112 3018281 2931042 2852016 2780729 2715943
50522B715943n9095n3334m7575m2672l8659l4339k8901k3160j8417j4705j0939
$$ 2715943 2656848 2603514 2555939 2513267 2474608 2440269 2411368 2388208 2369791 2355086 2344147
50511B344147o514j800K721O904J0389J2528J3322J3949J5923J9863K5161L0484
$$ 2344147 2337633 2335833 2338554 2345458 2355847 2368375 2381697 2395646 2411569 2431432 2456593 2487077
50499B487077L4651L7632M0805M5561N1377N6050N8427O0076O3309O8057P1937
$$ 2487077 2521728 2559360 2600165 2645726 2697103 2753153 2811580 2871656 2934965 3003022 3074959
50488C074959P3372P3378P3826P5051P6024P6294P6774P8655Q2338Q7540R3936
$$ 3074959 3148331 3221709 3295535 3370586 3446610 3522904 3599678 3678333 3760671 3848211 3942147
50477C942147J01375J09790J19128J29286J39991J50892J61937J73551J86248
$$ 3942147 4043522 4153312 4272440 4401726 4541717 4692609 4854546 5028097 5214345
50468E214345J99878K13357K25186K34446K41298K46433K50038K51322K49191
$$ 5214345 5414223 5627580 5852766 6087212 6328510 6574943 6824981 7076303 7325494
50459G325494K43184K33543K20351K02966J80603J53299J21962Q7538N0642J2240
$$ 7325494 7568678 7802221 8022572 8225538 8406141 8559440 8681402 8768940 8819582 8831822
50449H831822k5853o1727r4602j24822j52491j76342j94078k03693k04734j98581
$$ 8831822 8805969 8744242 8649640 8524818 8372327 8195985 8001907 7798214 7593480 7394899
50439G394899j87408j72437j53279j29452j02310p4640m8367k3654o88J8622L1538
$$ 7394899 7207491 7035054 6881775 6752323 6650013 6575373 6527006 6503352 6502664 6521286 6552824
50428F552824L6384L2738K0465j95k7720n9555r3245j26521j56652j81100j99288
$$ 6552824 6589208 6621946 6642411 6642216 6614496 6554941 6461696 6335175 6178523 5997423 5798135
50417E798135k12577k21992k26837k26216k20925k12941k03465j92519j80158
$$ 5798135 5585558 5363566 5136729 4910513 4689588 4476647 4273182 4080663 3900505
50408C900505j67078j53900j40700j27670j15626j05404r6911q9177q1274p2949
$$ 3900505 3733427 3579527 3438827 3311157 3195531 3090127 2993216 2904039 2822765 2749816
50398B749816o4405n5921m7852m0666l4584k9227k4023j8880j4042r489n112j526
$$ 2749816 2685411 2629490 2581638 2540972 2506388 2477161 2453138 2434258 2420216 2410727 2405615 2404089
50386B404089K78N28R60K714M770N566N541O633R421J2169J2997J1905J0269R438
$$ 2404089 2404367 2404895 2405855 2408569 2413339 2418905 2424446 2431079 2440500 2452669 2465666 2477571 2487840 2497278
50372B497278J0186J2618J6019J9364K2387K5566K9028L2345L5589L9508M4244
$$ 2497278 2507464 2520082 2536101 2555465 2577852 2603418 2632446 2664791 2700380 2739888 2784132
50361B784132M8888N2808N6419O0173O3955O8084P3720Q1238Q9274R6419J02779
$$ 2784132 2833020 2885828 2942247 3002420 3066375 3134459 3208179 3289417 3378691 3475110 3577889
50350C577889J08847J14041J17850J21275J25217J28098J27254J22454J15996
$$ 3577889 3686736 3800777 3918627 4039902 4165119 4293217 4420471 4542925 4658921
50341D658921J09218J00969Q9973P6748O2290M6443K8685R282j1292l2995n5260
$$ 4658921 4768139 4869108 4959081 5035829 5098119 5144562 5173247 5182529 5171237 5138242 5082982
50330E082982p6254r4298j09261j21571j30386j34002j31804j24838j14545j01822
$$ 5082982 5006728 4912430 4803169 4681598 4551212 4417210 4285406 4160568 4046023 3944201
50320C944201q7210p1302n4863l8958k4804j2965k952N707J2195J4804J2573N864
$$ 3944201 3856991 3785689 3730826 3691868 3667064 3654099 3651147 3656854 3669049 3683853 3696426 3702290
50308C702290m492j7750l2909m8634o3967p8484r1399j01193j06820j08906j09146
$$ 3702290 3697798 3680048 3647139 3598505 3534538 3456054 3364655 3263462 3156642 3047736 2938590
50297B938590j08540j06788j03279r8176r2422q7049q2529p8485p3997o8388o1914
$$ 2938590 2830050 2723262 2619983 2521807 2429385 2342336 2259807 2181322 2107325 2038937 1977023
50286A977023n5479m9845m5255m1516l7850l2948k6206j9128j4307j2370j0834
$$ 1977023 1921544 1871699 1826444 1784928 1747078 1714130 1687924 1668796 1654489 1642119 1631285
50275A631285p017j318L684O784R149J1794J3863J4158J2896J0901Q051L771j450
$$ 1631285 1624268 1622950 1626634 1633418 1642567 1654361 1668224 1682382 1695278 1706179 1714230 1718001 1716551
50262A716551o185r545j1663j2859j3153j2710j2086j1754j1613j1129r972q540
$$ 1716551 1710366 1700821 1689158 1676299 1663146 1650436 1638350 1626596 1614983 1603854 1593882 1585342
50250A585342p662p498o965m982k125j50L19N04J525K870L605L998M909O244P140
$$ 1585342 1577680 1570182 1563217 1558235 1556110 1555960 1556279 1556783 1558308 1561178 1564783 1568781 1573690 1579934 1587074
50235A587074P229O812O258O104P086R100J0682J0623R639R305R955J0773J1419
$$ 1587074 1594303 1601115 1607373 1613477 1620563 1629663 1640345 1650968 1660607 1669912 1679867 1690640 1702059
50222A702059J2147J2724J2898J3597J5966J9061K0052J6967J0032N47r733j8132
$$ 1702059 1714206 1726930 1739828 1753425 1769391 1788452 1808504 1825471 1835503 1836050 1826317 1808185
50210A808185k2133k1927k0286j9118j7630j4778j1664j0091r854r183p295n174
$$ 1808185 1786052 1764125 1743839 1724721 1707091 1692313 1680649 1670558 1660704 1651521 1644226 1639052
50198A639052m062m170m615m060j658J979N232P127Q104Q942R900J1287J3663
$$ 1639052 1634990 1630820 1626205 1622145 1620487 1622466 1627698 1634825 1642929 1651871 1661771 1673058 1686721
50185A686721J6671J8798J9343J9785K2021K5813K9193L0950L1626L2167L2576
$$ 1686721 1703392 1722190 1741533 1761318 1783339 1809152 1838345 1869295 1900921 1933088 1965664
50174A965664L1956K9401K5015K0363J7334J6151J5065J2542Q876N062J021l911
$$ 1965664 1997620 2027021 2052036 2072399 2089733 2105884 2120949 2133491 2142367 2147429 2148450 2144539
50162B144539r528j5083k0621k6798l3550m0011m5473m9360n0506m7900m2329
$$ 2144539 2135011 2119928 2099307 2072509 2038959 1998948 1953475 1904115 1853609 1805709 1763380
50151A763380l6224l1533k8287k5413k2224j9037j6917j6971j9379k3010k6269
$$ 1763380 1727156 1695623 1667336 1641923 1619699 1600662 1583745 1566774 1547395 1524385 1498116
50140A498116k8280k9079k9097k8746k8171k6995k4792k2075j9975j8608j6782
$$ 1498116 1469836 1440757 1411660 1382914 1354743 1327748 1302956 1280881 1260906 1242298 1225516
50129A225516j4040j1788j1275j1659j1506j1093j1369j1681j0744r322r283j0048
$$ 1225516 1211476 1199688 1188413 1176754 1165248 1154155 1142786 1131105 1120361 1111039 1101756 1091708
50117A091708q842n117j976j857l185l122j680q98j199j149j84P11J074J767L196
$$ 1091708 1082866 1077749 1075773 1073916 1070731 1067609 1065929 1065031 1063832 1062683 1062499 1063210 1064284 1066051 1069247
50102A069247M375M470M164M764O543Q650J0185J0959J1494J2579J4575J7014
$$ 1069247 1073622 1078092 1082256 1087020 1093563 1102213 1112398 1123357 1134851 1147430 1162005 1179019
50090A179019J9105K0592K1633K1910K0679J8070J5557J4389J3926J2397R274
$$ 1179019 1198124 1218716 1240349 1262259 1282938 1301008 1316565 1330954 1344880 1357277 1366551
50079A366551O030M447M867O528Q864J1754J4987J8236K1614K5555L0140L4936
$$ 1366551 1372581 1377028 1381895 1388423 1397287 1409041 1424028 1442264 1463878 1489433 1519573 1554509
50067A554509L9368M2909M5313M7377N1011N7215O4086O8240O8623O7555O7384
$$ 1554509 1593877 1636786 1682099 1729476 1780487 1837702 1901788 1970028 2038651 2106206 2173590
50056B173590O7529O5937O2217N7914N4393N1903N0302M9081M6815M1897L3976
$$ 2173590 2241119 2307056 2369273 2427187 2481580 2533483 2583785 2632866 2679681 2721578 2755554
50045B755554K3825J2021j149j4687k7165l8194m8452n8006o5707p0551p2592
$$ 2755554 2779379 2791400 2790251 2775564 2748399 2710205 2661753 2603747 2538040 2467489 2394897
50034B394897p2198o9474o4947n9903n5348n1211m7055m2902l8950l5137l1567
$$ 2394897 2322699 2253225 2188278 2128375 2073027 2021816 1974761 1931859 1892909 1857772 1826205
50023A826205k8813k7172k5936k4054k1322j8514j6502j5596j5630j6243j6886
$$ 1826205 1797392 1770220 1744284 1720230 1698908 1680394 1663892 1648296 1632666 1616423 1599537
$$ [...]
##END NTUPLES=NMR SPECTRUM
##END=
