
##TITLE=UV1059_TOCA01-ROVE100D_6301442_wicUDnTAwC
##JCAMPDX= 6.0         $$ Bruker NMR JCAMP-DX V2.0
##DATA TYPE= NMR SPECTRUM
##DATA CLASS= NTUPLES
##ORIGIN= BRUKER
##OWNER= Administrator
$$ 1.72 TOPSPIN		Version 2.1
$$ 2012-06-06 04:59:32.718 -0500  Administrator@TOPSPIN
$$ Compression mode = diff/dup
##.OBSERVE FREQUENCY= 400.13188235
##.OBSERVE NUCLEUS= ^1H
##.ACQUISITION MODE= SIMULTANEOUS (DQD)
##.ACQUISITION SCHEME= undefined
##.AVERAGES= 64
##.DIGITISER RES= 22
##SPECTROMETER/DATA SYSTEM= spect
##.PULSE SEQUENCE= noesygpps1d.comp
##.SOLVENT NAME= COFFEE_meoh
##.SHIFT REFERENCE= INTERNAL, COFFEE_meoh, 1, 14.98061
##AUDIT TRAIL= $$ (NUMBER, WHEN, WHO, WHERE, PROCESS, VERSION, WHAT)
$$ ##TITLE= Audit trail, TOPSPIN		Version 2.1
$$ ##JCAMPDX= 5.01
$$ ##ORIGIN= Bruker BioSpin GmbH
$$ ##OWNER= Administrator
$$ $$ C:\Bruker\TOPSPIN/data/COFFEE/nmr/UV1059_TOCA01-ROVE100D_6301442_wicUDnTAwC/12/pdata/1/auditp.txt
$$ ##AUDIT TRAIL=  $$ (NUMBER, WHEN, WHO, WHERE, PROCESS, VERSION, WHAT)
(   1,<2012-06-06 04:59:27.546 -0500>,<Administrator>,<TOPSPIN>,<go>,<TOPSPIN 2.1>,
      <created by zg
	started at 2012-06-06 04:47:57.359 -0500,
	POWCHK enabled, PULCHK disabled,
       configuration hash MD5:
       D5 CA 7A 23 FE 6B EE E2 50 67 74 61 24 F7 5E 3B
       data hash MD5: 64K
       E7 DC 11 A3 BA FC A9 00 CF 84 B1 DA 38 E3 FA 4F>)
(   2,<2012-06-06 04:59:30.453 -0500>,<Administrator>,<TOPSPIN>,<proc1d>,<TOPSPIN 2.1>,
      <Start of raw data processing
       efp LB = 0.3 FT_mod = 6 PKNL = 1 PHC0 = 0 PHC1 = 0 SI = 128K 
       data hash MD5: 128K
       D3 5B 89 F3 02 46 B4 39 6E 63 7E A2 3B 04 6E 36>)
(   3,<2012-06-06 04:59:31.656 -0500>,<Administrator>,<TOPSPIN>,<proc1d>,<TOPSPIN 2.1>,
      <pk PHC0 = 27.88879 PHC1 = 0 
       data hash MD5: 128K
       78 13 3F F7 74 96 4F 1D 91 B3 28 01 78 96 8B 4B>)
(   4,<2012-06-06 04:59:32.359 -0500>,<Administrator>,<TOPSPIN>,<proc1d>,<TOPSPIN 2.1>,
      <abs ABSG = 1 
       data hash MD5: 128K
       58 07 41 BE A8 B5 54 49 7F E7 39 C7 33 95 00 1B>)
(   5,<2012-06-06 04:59:32.453 -0500>,<Administrator>,<TOPSPIN>,<proc1d>,<TOPSPIN 2.1>,
      <abs ABSG = 2 
       data hash MD5: 128K
       01 9B 1A 98 10 7C 17 02 66 8F 0B 9E DB 5E 56 14>)
(   6,<2012-06-06 04:59:32.500 -0500>,<Administrator>,<TOPSPIN>,<proc1d>,<TOPSPIN 2.1>,
      <abs ABSG = 3 
       data hash MD5: 128K
       91 BD 61 9D 89 94 01 E5 A2 C8 F5 5A 2C 92 70 79>)
(   7,<2012-06-06 04:59:32.562 -0500>,<Administrator>,<TOPSPIN>,<proc1d>,<TOPSPIN 2.1>,
      <abs ABSG = 4 
       data hash MD5: 128K
       63 D8 B1 2F 03 46 B6 1D 37 AD 0E CC 98 1E 40 5E>)
(   8,<2012-06-06 04:59:32.625 -0500>,<Administrator>,<TOPSPIN>,<proc1d>,<TOPSPIN 2.1>,
      <abs ABSG = 5 
       data hash MD5: 128K
       F3 AA 0A B3 F5 B0 1E 3D 41 91 8E 66 E3 B1 FE DB>)
$$ ##END=
$$ 
$$ $$ hash MD5
$$ $$ 4B 17 38 CD AE 99 84 71 C8 33 B3 6B 1A 9D DB 01
##$RELAX= 
##$RELAX= 
##$RELAX= 
##$RELAX= 
##$RELAX= 
##$RELAX= 
##$RELAX= 
##$RELAX= 
$$ [...]
150 150 150 150 150 150 150 150
##$TP07= 0
##$TPNAME0= <>
##$TPNAME1= <>
##$TPNAME2= <>
##$TPNAME3= <>
##$TPNAME4= <>
##$TPNAME5= <>
##$TPNAME6= <>
##$TPNAME7= <>
##$TPOAL= (0..7)
0.5 0.5 0.5 0.5 0.5 0.5 0.5 0.5
##$TPOFFS= (0..7)
0 0 0 0 0 0 0 0
##$TUNHIN= 0
##$TUNHOUT= 0
##$TUNXOUT= 0
##$USERA1= <user>
##$USERA2= <user>
##$USERA3= <user>
##$USERA4= <user>
##$USERA5= <user>
##$V9= 5
##$VALIST= <valist>
##$VCLIST= <CCCCCCCCCCCCCCC>
##$VD= 0
##$VDLIST= <DDDDDDDDDDDDDDD>
##$VPLIST= <PPPPPPPPPPPPPPP>
##$VTLIST= <TTTTTTTTTTTTTTT>
##$WBST= 2048
##$WBSW= 25
##$XGAIN= (0..3)
0 0 0 0
##$XL= 0
##$YL= 0
##$YMAX_a= 9914794
##$YMIN_a= -6112922
##$ZGOPTNS= <>
##$ZL1= 120
##$ZL2= 120
##$ZL3= 120
##$ZL4= 120
##$ABSF1= 14.98061
##$ABSF2= -5.57192
##$ABSG= 5
##$ABSL= 3
##$ALPHA= 0
##$AQORDER= 0
##$ASSFAC= 0
##$ASSFACI= 0
##$ASSFACX= 0
##$ASSWID= 0
##$AUNMP= <proc_prof1d_extract.lims>
##$AXLEFT= 0
##$AXNAME= <>
##$AXNUC= <1H>
##$AXRIGHT= 0
##$AXTYPE= 0
##$AXUNIT= <>
##$AZFE= 0.1
##$AZFW= 0.1
##$BCFW= 0
##$BC_mod= 0
##$BYTORDP= 0
##$COROFFS= 0
##$CY= 15
##$DATMOD= 1
##$DC= 0
##$DFILT= <>
##$DTYPP= 0
##$F1P= 0
##$F2P= 0
##$FCOR= 0.5
##$FTSIZE= 131072
##$FT_mod= 6
##$GAMMA= 0
##$GB= 0
##$INTBC= 1
##$INTSCL= 1
##$ISEN= 128
##$LB= 0.3
##$LEV0= 0
##$LPBIN= 0
##$MAXI= 10000
##$MC2= 0
##$MEAN= 0
##$ME_mod= 0
##$MI= 0
##$NCOEF= 0
##$NC_proc= -2
##$NLEV= 6
##$NOISF1= 0
##$NOISF2= 0
##$NSP= 0
##$NTH_PI= 0
##$NZP= 0
##$OFFSET= 14.98061
##$PC= 1
##$PHC0= 27.88879
##$PHC1= 0
##$PH_mod= 1
##$PKNL= yes
##$PPARMOD= 0
##$PPDIAG= 0
##$PPIPTYP= 0
##$PPMPNUM= 2147483647
##$PPRESOL= 1
##$PSCAL= 4
##$PSIGN= 0
##$PYNMP= <proc.py>
##$REVERSE= no
##$SF= 400.13
##$SI= 131072
##$SIGF1= 0
##$SIGF2= 0
##$SINO= 400
##$SIOLD= 131072
##$SPECTYP= <>
##$SREGLST= <1H.CDCl3>
##$SSB= 0
##$STSI= 131072
##$STSR= 0
##$SW_p= 8223.68421052632
##$SYMM= 0
##$S_DEV= 0
##$TDeff= 65536
##$TDoff= 0
##$TI= <>
##$TILT= no
##$TM1= 0
##$TM2= 0
##$TOPLEV= 0
##$USERP1= <user>
##$USERP2= <user>
##$USERP3= <user>
##$USERP4= <user>
##$USERP5= <user>
##$WDW= 1
##$XDIM= 131072
##$YMAX_p= 233272855
##$YMIN_p= -297266425
##$CURPLOT= <Network HP LaserJet P1505>
##$CURPRIN= <$Network HP LaserJet P1505>
##$DFORMAT= <normdp>
##$LAYOUT= <+/1D_H.xwp>
##$LFORMAT= <normlp>
##$PFORMAT= <normpl>
##$SURQMSG= 1
$$ End of Bruker specific parameters
$$ ---------------------------------
##NTUPLES= NMR SPECTRUM
##VAR_NAME=  FREQUENCY,     SPECTRUM/REAL,   SPECTRUM/IMAG
##SYMBOL=    X,             R,               I
##VAR_TYPE=  INDEPENDENT,   DEPENDENT,       DEPENDENT
##VAR_FORM=  AFFN,          ASDF,            ASDF
##VAR_DIM=   131072,        131072,          131072
##UNITS=     HZ,            ARBITRARY UNITS, ARBITRARY UNITS
##FACTOR=    0.0627417313425165, 1,          1
##FIRST=     8223.62146879498, 975,          -34327
##LAST=      0,             1844,            -34450
##MIN=       0,             -297266425,      0
##MAX=       8223.62146879498, 233272855,    0
$$ Real data points
##PAGE= N=1
##DATA TABLE= (X++(R..R)), XYDATA
$$ [...]
62178A094094k9526l2969l5167l5767l5030l3308l0956k8593k6810k5474k3842
$$ 1094094 1064568 1031599 996432 960665 925635 892327 861371 832778 805968 780494 756652
62167G56652k1558j9155j7278j5832j4253j2312j0336q727p557o530n250l630
$$ 756652 735094 715939 698661 682829 668576 656264 645928 637201 629644 623114 617864 614234
62155F14234k080j082o11k25L19Q96J438K035K596K913L154L754M657N288N527
$$ 614234 612154 611072 610461 610236 610555 611451 612889 614924 617520 620433 623587 627341 631998 637286 642813
62140F42813O019P131Q236Q638Q628Q992R858J0767J1560J2479J3563J4607J5592
$$ 642813 648832 655963 664199 672837 681465 690457 700315 711082 722642 735121 748684 763291 778883
62127G78883J6574J7267J7357J7143J7238J7695J7952J7676J7007J6029J4592
$$ 778883 795457 812724 830081 847224 864462 882157 900109 917785 934792 950821 965413
62116I65413J2926J1786J1733J2629J4046J5751J7564J9111K0124K0888K2119
$$ 965413 978339 990125 1001858 1014487 1028533 1044284 1061848 1080959 1101083 1121971 1144090
62105A144090K4319K7143K9391K9786K8061K5088K1780J8130J3791R209N386K608
$$ 1144090 1168409 1195552 1224943 1254729 1282790 1307878 1329658 1347788 1361579 1370788 1376174 1378782
62093A378782J62k558n436q319j1436j4689j7201j8277j8338j8213j7925j6841
$$ 1378782 1378944 1376386 1370950 1362631 1351195 1336506 1319305 1301028 1282690 1264477 1246552 1229711
62081A229711j4867j2680j0785r010p099n257l824k708j439K43K030L242L551
$$ 1229711 1214844 1202164 1191379 1182369 1175270 1170013 1166189 1163481 1162042 1162285 1164315 1167557 1171108
62068A171108L480L954N197O462P136P675Q881J0571J1766J2125J2397J3257J4476
$$ 1171108 1174588 1178542 1183739 1190201 1197337 1205012 1213893 1224464 1236230 1248355 1260752 1274009 1288485
62055A288485J5551J6435J7219J7681J7742J7887J8557J9428J9902J9964K0003
$$ 1288485 1304036 1320471 1337690 1355371 1373113 1391000 1409557 1428985 1448887 1468851 1488854
62044A488854K0111K0207K0587K1569K2767K3512K3967K4931K6545K8055K9096
$$ 1488854 1508965 1529172 1549759 1571328 1594095 1617607 1641574 1666505 1693050 1721105 1750201
62033A750201L0283L2088L3981L5262L6032L6637L6718L5739L4117L3026L3091
$$ 1750201 1780484 1812572 1846553 1881815 1917847 1954484 1991202 2026941 2061058 2094084 2127175
62022B127175L3942L4986L6073L7329L8765M0079M0617L9750L7689L5648L4667
$$ 2127175 2161117 2196103 2232176 2269505 2308270 2348349 2388966 2428716 2466405 2502053 2536720
62011B536720L4539L4378L4005L4003L4530L4959L4819L4324L3696L2677L0993
$$ 2536720 2571259 2605637 2639642 2673645 2708175 2743134 2777953 2812277 2845973 2878650 2909643
62000B909643K8779K6145K2860J8885J4750J1012P646M343J093j945m849p782
$$ 2909643 2938422 2964567 2987427 3006312 3021062 3032074 3039720 3044063 3045156 3043211 3038362 3030580
61988C030580j0632j3140j5236j6920j8073j8725j9277k0040k0632k0367j9165
$$ 3030580 3019948 3006808 2991572 2974652 2956579 2937854 2918577 2898537 2877905 2857538 2838373
61977B838373j7720j6616j5749j4705j3460j2374j1663j1109j0387r559r058r178
$$ 2838373 2820653 2804037 2788288 2773583 2760123 2747749 2736086 2724977 2714590 2705031 2695973 2686795
61965B686795r668j0002r942r644r238q599p717o999o944p512q073q035p303o168
$$ 2686795 2677127 2667125 2657183 2647539 2638301 2629702 2621985 2614986 2608042 2600530 2592457 2584422 2577119 2570951
61951B570951m904l705k804k387k280j902q68N39J673K248K426K240J450Q1j396
$$ 2570951 2566047 2562342 2559538 2557151 2554871 2552969 2552101 2552640 2554313 2556561 2558987 2561227 2562677 2562758 2561362
61936B561362k785m605p324j0559j3606j6378j9190k1805k3579k4486k5238k6227
$$ 2561362 2558577 2553972 2546648 2536089 2522483 2506105 2486915 2465110 2441531 2417045 2391807 2365580
61924B365580k7118k7681k8209k8737k8626k7518k6136k5425k5301k4927k4046
$$ 2365580 2338462 2310781 2282572 2253835 2225209 2197691 2171555 2146130 2120829 2095902 2071856
61913B071856k3285k3067k2895k1968k0273j8696j8053j8190j8168j7319j5906
$$ 2071856 2048571 2025504 2002609 1980641 1960368 1941672 1923619 1905429 1887261 1869942 1854036
61902A854036j4598j3577j2587j1608j0921j0542j0125r569r031q293o772m509
$$ 1854036 1839438 1825861 1813274 1801666 1790745 1780203 1770078 1760509 1751478 1743185 1736413 1731904
61890A731904k448j243l83R06K525L915N187O877Q888J0559J1835J3402J5454
$$ 1731904 1729456 1728213 1727830 1728736 1731261 1735176 1740363 1747240 1756128 1766687 1778522 1791924 1807378
61877A807378J7012J7041J5810J4671J4646J5569J6529J6843J6490J5756J4728
$$ 1807378 1824390 1841431 1857241 1871912 1886558 1902127 1918656 1935499 1951989 1967745 1982473
61866A982473J3366J1982J1213J1376J2066J2696J3295J4591J7282K1464K6609
$$ 1982473 1995839 2007821 2019034 2030410 2042476 2055172 2068467 2083058 2100340 2121804 2148413
61855B148413L1996L7310M2954M9634N7484O5830P3917Q1641Q9274R6844J04179
$$ 2148413 2180409 2217719 2260673 2310307 2367791 2433621 2507538 2589179 2678453 2775297 2879476
61844B879476J11413J18999J27255J36214J45926J56510J67837J79277J89927
$$ 2879476 2990889 3109888 3237143 3373357 3519283 3675793 3843630 4022907 4212834
61835D212834J98906K05436K08518K06493J96922J77314J46459J05201N6127K694
$$ 4212834 4411740 4617176 4825694 5032187 5229109 5406423 5552882 5658083 5714210 5716904
61825E716904n1327j02175j46646j82708k09696k28037k38774k43056k41902k36327
$$ 5716904 5665577 5563402 5416756 5234048 5024352 4796315 4557541 4314485 4072583 3836256
61815C836256k27486k16324k03266j88723j73740j59448j45806j31864j17575
$$ 3836256 3608770 3392446 3189180 3000457 2826717 2667269 2521463 2389599 2272024
61806B272024j04457r3727q4573p5233o5284n5846m7758m0617l3705k6981k0851
$$ 2272024 2167567 2073840 1989267 1914034 1848750 1792904 1745146 1704529 1670824 1643843 1622992
61795A622992j5525j0818o270j479L342P292R763J1295J2829J4246J4421J2753
$$ 1622992 1607467 1596649 1590379 1588900 1592242 1599534 1609297 1620592 1633421 1647667 1662088 1674841
61783A674841R873O683L431J9l414o598r343j1344j2137j1565r999p896n491l028
$$ 1674841 1684714 1691397 1694828 1694847 1691433 1684835 1675492 1664148 1652011 1640446 1630447 1622551 1617060 1614032
61769A614032q08J188L283N405O800O795N450L213K59l436p639j1879j5810j9215
$$ 1614032 1613224 1614412 1617695 1623100 1629900 1636695 1642145 1645358 1645617 1642181 1634542 1622663 1606853 1587638
61755A587638k1826k3420k4047k3964k3409k2496k1192j9254j6453j2980r391
$$ 1587638 1565812 1542392 1518345 1494381 1470972 1448476 1427284 1408030 1391577 1378597 1369206
61744A369206o004k536J441N882J0297J4223J7509K0402K3528K7519L2294L6942
$$ 1369206 1363202 1360666 1362107 1367989 1378286 1392509 1410018 1430420 1453948 1481467 1513761 1550703
61732A550703M0703M3914M7618N2283N7378O2261O7063P2494P9039Q6636R4958
$$ 1550703 1591406 1635320 1682938 1735221 1792599 1854860 1921923 1994417 2073456 2160092 2255050
61721B255050J03759J13011J23010J34318J47348J61935J77498J93761K11061
$$ 2255050 2358809 2471820 2594830 2729148 2876496 3038431 3215929 3409690 3620751
61712C620751K29841K49985K70961K92506L14786L37803L60882L82726M01613
$$ 3620751 3850592 4100577 4371538 4664044 4978830 5316633 5677515 6060241 6461854
61703F461854M15190M20293M13239L90557L49743K90004K12857J22229K4000p4752
$$ 6461854 6877044 7297337 7710576 8101133 8450876 8740880 8953737 9075966 9099966 9025214
61693I025214j66764k46190l10109l58587l92908m13890m22053m18995m07805
$$ 9025214 8858450 8612260 8302151 7943564 7550656 7136766 6714713 6295718 5887913
61684E887913l91847l73306l52849l30424l06272k81379k57125k34560k14049
$$ 5887913 5496066 5122760 4769911 4439487 4133215 3851836 3594711 3360151 3146102
61675C146102j95426j78302j62175j46750j32351j19710j09070r9740r0885q2404
$$ 3146102 2950676 2772374 2610199 2463449 2331098 2211388 2102318 2002578 1911693 1829289
61665A829289p4729o7984o1878n6329n1703m8316m5970m4122m2381m0810l9752
$$ 1829289 1754560 1686576 1624698 1568369 1516666 1468350 1422380 1378258 1335877 1295067 1255315
61654A255315l9232l8586l7078l4910l3103l2129l1220k9473k7120k5050k3525
$$ 1255315 1216083 1177497 1140419 1105509 1072406 1040277 1009057 979584 952464 927414 903889
61643I03889k2041k0267j8393j6668j5245j4411j4316j4509j4298j3566j2773
$$ 903889 881848 861581 843188 826520 811275 796864 782548 768039 753741 740175 727402
61632G27402j2195j1681j1104j0547j0096r898j0210j0885j1074j0156q725p873
$$ 727402 715207 703526 692422 681875 671779 661881 651671 640786 629712 619556 610831 602958
61620F02958p712p471o887o420o068n221l927l202l472l793l248k265j834k094
$$ 602958 595246 587775 580888 574468 568400 563179 559252 556050 552578 548785 545537 543272 541438 539344
61606E39344k545l021l665m225m291l952l589l129k158p29M61P79K38n61q39j76
$$ 539344 536799 533778 530113 525888 521597 517645 514056 510927 508769 508040 508501 509280 509518 508957 508118 507942
61590E07942J158K484L451M286N206N996O350O304O019N512M790M019L247K311
$$ 507942 509100 511584 515035 519321 524527 530523 536873 543177 549196 554708 559498 563517 566764 569075
61576E69075J255M35N3o1L1N77J513K202K237K079K341K903L220L159K852K129
$$ 569075 570330 570765 570818 570757 570788 571365 572878 575080 577317 579396 581737 584640 587860 591019 593871 596000
61560E96000P93p21j795k571l739n304o422o676o763p495q589r126q859q503q630
$$ 596000 596793 596072 594277 591706 587967 582663 576241 569565 562802 555307 546718 537592 528733 520230 511600
61545E11600q850q426p414o729o998p710p799o857n482m470m002l678l057k087
$$ 511600 502750 494324 486910 480181 473183 465473 457674 450817 445335 440865 436863 433185 430128 428041
61531D28041j157p11p44p51l38L02Q06J203J734K356K922L605M523N216N257N210
$$ 428041 426884 426173 425429 424678 424340 424642 425448 426651 428385 430741 433663 437268 441791 447007 452264 457474
61515D57474N989P333Q047P928Q210R609J1165J1771J1846J2450J3580J4476J4963
$$ 457474 463463 470796 478843 486771 494981 504590 515755 527526 539372 551822 565402 579878 594841
61502E94841J5296J5111J3839J2011J0974J1196J1810J1942J1605J1154J0725
$$ 594841 610137 625248 639087 651098 662072 673268 685078 697020 708625 719779 730504
61491G30504J0469J0565J0738J0340R226P970P045O316N569M907M317L359J792
$$ 730504 740973 751538 762276 772616 781842 789812 796857 803173 808742 813649 817966 821325 823117
61478H23117L6j396k621m054n557o438o288n434m480l652k748j599l36Q12J841
$$ 823117 823153 821757 819136 815082 809525 803087 796799 791365 786885 783233 780485 778886 778550 779362 781203
61463G81203K946M294N990Q162J0733J3106J4621J5543J7136K0303K4410K7974
$$ 781203 784149 788443 794433 802595 813328 826434 841055 856598 873734 894037 918447 946421
61451I46421L0378L2339L4841L8174M2162M6736N1888N7381O2880O8237P3354
$$ 946421 976799 1009138 1043979 1082153 1124315 1171051 1222939 1280320 1343200 1411437 1484791
61440A484791P7943Q1758Q5001Q8087R0722R1521Q8962Q2763P3845O2992N0049
$$ 1484791 1562734 1644492 1729493 1817580 1908302 1999823 2088785 2171548 2245393 2308385 2358434
61429B358434L4907J8658L024j1204k4389l6672m7161n4806n9525o2066o3176
$$ 2358434 2393341 2411999 2415023 2403819 2379430 2342758 2295597 2240791 2181266 2119200 2056024
61418B056024o3192o2070n9579n5698n1026m6364m1865l7103l2087k7442k3294
$$ 2056024 1992832 1930762 1871183 1815485 1764459 1718095 1676230 1639127 1607040 1579598 1556304
61407A556304j8841j3581q247l807j33L540P296J0585J3288J5882J8632K1328
$$ 1556304 1537463 1523882 1515635 1511828 1511695 1515235 1522531 1533116 1546404 1562286 1580918 1602246
61395A602246K3746K5730K6928K7127K6857K7011K7851K8817K9249K8923K7995
$$ 1602246 1625992 1651722 1678650 1705777 1732634 1759645 1787496 1816313 1845562 1874485 1902480
61384A902480K6909K6151K5625K4545K2533K0419J9187J8408J6770J4060J1500
$$ 1902480 1929389 1955540 1981165 2005710 2028243 2048662 2067849 2086257 2103027 2117087 2128587
61373B128587R894Q491O255L440J227K65J73K18j20j016k331l696m865n973p332
$$ 2128587 2138481 2146972 2153227 2156667 2157894 2158159 2158332 2158550 2158430 2157414 2155083 2151387 2146522 2140549 2133217
61358B133217r018j0697j1816j2056j1623j1008j0441r814r218r087r538r969
$$ 2133217 2124199 2113502 2101686 2089630 2078007 2066999 2056558 2046744 2037526 2028439 2018901 2008932
61346B008932r873r664j0077j0955j1434j1183j0761j0658j0627j0188r188p677
$$ 2008932 1999059 1989395 1979318 1968363 1956929 1945746 1934985 1924327 1913700 1903512 1894324 1886647
61334A886647n709l434r06K299O716J2104J7409K1990K6427L1838L8639M6267
$$ 1886647 1880938 1877504 1876598 1878897 1885613 1897717 1915126 1937116 1963543 1995381 2034020 2080287
61322B080287N3906O1120O7883P4217P9979Q5085Q9776R4295R8078R9741R8273
$$ 2080287 2134193 2195313 2263196 2337413 2417392 2502477 2592253 2686548 2784626 2884367 2982640
61311B982640R3867Q7042P7465O4438M8478L1391J4644j538j7277l1976m4718
$$ 2982640 3076507 3163549 3241014 3305452 3353930 3385321 3399965 3398427 3381150 3349174 3304456
61300C304456n5247o4144p2125p9395q5500q9736r1846r2237r1341q9022q5123
$$ 3304456 3249209 3185065 3112940 3033545 2948045 2858309 2766463 2674226 2582885 2493863 2408740
61289B408740q0318p5721p1683o7620o3064n8224n3464m8925m4795m1331l8357
$$ 2408740 2328422 2252701 2181018 2113398 2050334 1992110 1938646 1889721 1844926 1803595 1765238
61278A765238l5358l2128k8793k5121k0637j5581j0948p253m029r01J687L438
$$ 1765238 1729880 1697752 1668959 1643838 1623201 1607620 1596672 1589419 1585390 1584489 1586176 1589614
61266A589614N116P656J0838J3514J4942J5295J5161J5070J5268J5433J4809J3120
$$ 1589614 1594730 1602386 1613224 1626738 1641680 1656975 1672136 1687206 1702474 1717907 1732716 1745836
61254A745836J1118R764R024Q000O168L968K193J123L85n64j882l181l975m288
$$ 1745836 1756954 1766718 1775742 1783742 1789910 1793878 1796071 1797194 1797579 1797015 1795133 1791952 1787977 1783689
61240A783689m622n329o358p696r619j2239j5073j7420j8959j9799k0176k0318
$$ 1783689 1779067 1773738 1767380 1759684 1750065 1737826 1722753 1705333 1686374 1666575 1646399 1626081
61228A626081k0317k0020j9183j7918j6666j5547j4180j2338j0472r155q274p228
$$ 1626081 1605764 1585744 1566561 1548643 1531977 1516430 1502250 1489912 1479440 1470285 1462011 1454783
61216A454783n836m679m382m745m780l756k109j031j019j282q88RP67J604L355
$$ 1454783 1448947 1444268 1439886 1435141 1430361 1426605 1424496 1423465 1422446 1421164 1420276 1420285 1421052 1422656 1426011
61201A426011O011Q577J0629J2873J5691J8111J9031J8747J8543J9190K0587K2357
$$ 1426011 1432022 1440599 1451228 1464101 1479792 1497903 1516934 1535681 1554224 1573414 1594001 1616358
61189A616358K4066K5195K5659K6166K7426K9146L0319L0262K8795K5626K0334
$$ 1616358 1640424 1665619 1691278 1717444 1744870 1774016 1804335 1834597 1863392 1889018 1909352
61178A909352J3014M334n110j5086k5232l4738m2723m8806n3192n6224n7919n8004
$$ 1909352 1922366 1926700 1921590 1906504 1881272 1846534 1803811 1755005 1701813 1645589 1587670 1529666
61166A529666n6518n4192n1883m9735m7344m4687m2112l9447l5979l1760k8045
$$ 1529666 1473148 1418956 1367073 1317338 1269994 1225307 1183195 1143748 1107769 1076009 1047964
61155A047964k5751k4203k2192j9690j7537j5832j3755j0912p928n501l673k203
$$ 1047964 1022213 998010 975818 956128 938591 922759 909004 898092 890164 884663 880990 878787
61143H78787j093m14o3J49M44J142K451M168N886P391Q578R218R276R279R757
$$ 878787 877694 877280 877217 877366 877810 878952 881403 885571 891457 898848 907426 916644 925920 935199 944956
61128I44956J0396J0302R131P367N448L274Q08j449l003l940m625n161n499n883
$$ 944956 955352 965654 974785 982152 987600 990874 991682 990233 987230 983290 978665 973504 968005 962122
61114I62122o729q112r701j1172j2466j3585j4395j4781j4978j5463j6451j7558
$$ 962122 955393 947281 937580 926408 913942 900357 885962 871181 856203 840740 824289 806731
61102H06731j8162j8027j7430j6709j5952j5160j4481j4066j3924j3905j3722
$$ 806731 788569 770542 753112 736403 720451 705291 690810 676744 662820 648915 635193
61091F35193j2945j1379r507q167p581p104o172n121m661m912n426n920o476p108
$$ 635193 622248 610869 601362 593195 585614 578510 572338 567217 562556 557644 552218 546298 539822 532714
61077E32714p622p890p943p750p201o292n113l754k394j367q33m89J88J426K993
$$ 532714 525092 517202 509259 501509 494308 488016 482903 479149 476755 475388 474555 474066 474254 475680 478673
61062D78673M329M767M012K773K462L704N404N872M830L619L436M076M618M713
$$ 478673 483002 487769 491781 494554 497016 500720 506124 511996 516826 520445 523881 527957 532575 537288
61048E37288M661M672M675M701M919N196N059M328L444K924K698K261J398L71
$$ 537288 541949 546621 551296 555997 560916 566112 571171 575499 578943 581867 584565 586826 588224 588595
61034E88595n82j569k684l716m433m904n281n554n752n989o045n419m201l473
$$ 588595 588013 586444 583760 580044 575611 570707 565426 559872 554120 548131 542086 536667 532466 528993
61020E28993m049n209n515m694l763l405l208k704k124j753j365p49j59K01M57
$$ 528993 524944 519735 514220 509526 505763 502358 499150 496446 494322 492569 491204 490455 490296 490497 490954
61005D90954N87L24j12L2R25J747J915J897K247K549K132J247P41R27J471K095
$$ 490954 491541 491865 491753 491785 492710 494457 496372 498269 500516 503065 505197 506444 507185 508112 509583 511678
60989E11678K736L350M037M927N586N173L749K760L387N047O381P189Q294R849
$$ 511678 514414 517764 521801 526728 532314 537487 541236 543996 547383 552430 558811 566000 574294 584143
60975E84143J1026J1410J1696J2686J4325J5977J7199J8010J8727J9702K1027
$$ 584143 595169 606579 618275 630961 645286 661263 678462 696472 715199 734901 755928
60964G55928K2500K3962K5514K7258K9121L0978L2704L4047L4928L5882L7570
$$ 755928 778428 802390 827904 855162 884283 915261 947965 982012 1016940 1052822 1090392
60953A090392L9802M1768M3284M4928M6873M8694N0629N3689N7990O2312O6034
$$ 1090392 1130194 1171962 1215246 1260174 1307047 1355741 1406370 1460059 1518049 1580361 1646395
60942A646395P0193P5605Q1395Q6486R1385R7090J03403J09800J16969J25973
$$ 1646395 1716588 1792193 1873588 1960074 2051459 2148549 2251952 2361752 2478721 2604694
60932B604694J36779J49039J63330J80174J98902K19151K42283K69647L00725
$$ 2604694 2741473 2890512 3053842 3234016 3432918 3652069 3894352 4163999 4464724
60923D464724L35023L74148M19652M70489N25706N88144O61998P48556Q48717
$$ 4464724 4799747 5173895 5593547 6064036 6589742 7177886 7839884 8588440 9437157
60914I437157R67712J110916J275972J456141J647495J833911J954918J908806
$$ 9437157 10404869 11515785 12791757 14247898 15895393 17729304 19684222 21593028
60906B1593028J623202J138474O08276J99828j0579m8651K4689J58542K88745
$$ 21593028 23216230 24354704 24962980 25162808 25152229 25103578 25128267 25286809 25575554
60897B5575554L09156J14821l07472q44234j326128j637956j766584j764672j691274
$$ 25575554 25884710 25999531 25692059 24847825 23521697 21883741 20117157 18352485 16661211
60888A6661211j585065j468206j352636j240869j129894j018095r07094p98990
$$ 16661211 15076146 13607940 12255304 11014435 9884541 8866446 7959352 7160362
60880G160362o95870o01528n20047m52264l95850l48519l09052k75812k46885
$$ 7160362 6464492 5862964 5342917 4890653 4494803 4146284 3837232 3561420 3314535
60871C314535k21785k00927j83374j67066j51217j36674j23850j12142j01565
$$ 3314535 3092750 2891823 2708449 2541383 2390166 2253492 2129642 2017500 1915935
60862A915935r3102q7084q2617p8860p5527p2139o8190o4195o1091n8478n4953
$$ 1915935 1822833 1735749 1653132 1574272 1498745 1426606 1358416 1294221 1233130 1174652 1119699
60851A119699n0411m6399m3776m1522l8574l5409l3012l1282k9398k7047k4511
$$ 1119699 1069288 1022889 979113 937591 899017 863608 830596 799314 769916 742869 718358
60840G18358k2144k0263j9088j8374j7537j6405j5287j4274j3062j1673j0517
$$ 718358 696214 675951 656863 638489 620952 604547 589260 574986 561924 550251 539734
60829E39734r641q588p328o495o451o733o785o551o055n124l902l030k838k892
$$ 539734 530093 521505 514177 507682 501231 494498 487713 481162 475107 469983 466081 463051 460213 457321
60815D57321k714k537k905l842m819n332n318n133n241n675n933n646n155n014
$$ 457321 454607 452070 449165 445323 440504 435172 429854 424721 419480 413805 407872 402226 397071 392057
60801C92057n087m743l782k597j477m92J6l37j153j390n68P51J840K560L106L682
$$ 392057 386970 382227 378445 375848 374371 373879 373895 373558 372405 371015 370447 371198 373038 375598 378704 382386
60785C82386M557N829O969P271O914O834P350P689P182O199N422M890M259L478
$$ 382386 386943 392772 399741 407012 413926 420760 428110 435799 442981 449180 454602 459492 463751 467229
60771D67229K670J844J135R09J209J428R82l4j139j980k278j776p40q6n21j732
$$ 467229 469899 471743 472878 473787 474996 476424 477406 477372 476233 474253 471975 470199 469459 469373 468852 467120
60755D67120k820l253l121k788k609k791l200l496l616l810m097m137l871l724
$$ 467120 464300 461047 457926 455138 452529 449738 446538 443042 439426 435616 431519 427382 423511 419787
60741D19787l867l785l084k237j974k291k518k192j342j94R52J739K107K394K798
$$ 419787 415920 412135 409051 406814 404840 402549 400031 397839 396497 396303 397255 398994 401101 403495 406293
60726D06293L020K843K706L146L944M427M438M431M678N041N428N954O543O892
$$ 406293 409313 412156 414862 418008 421952 426379 430817 435248 439926 444967 450395 456349 462892 469784
60712D69784O961O986O965O593N883N320N238N368N256M793M145L487K980K768
$$ 469784 476745 483731 490696 497289 503172 508492 513730 519098 524354 529147 533292 536779 539759 542527
60698E42527K754K628K297K077K194K381K233J810J503J437J321R16L54q4l40
$$ 542527 545281 547909 550206 552283 554477 556858 559091 560901 562404 563841 565162 566078 566432 566348 566008
60683E66008n32p02p56p26j007k098l936n579n935m956l822l637m227m587m340
$$ 566008 565476 564774 564018 563292 562285 560187 556251 550672 544737 539781 535959 532322 528095 523508 519168
60668E19168m172m676n399n336m165k545j389j094j420j780j650r32L6P94J012
$$ 519168 514996 510320 504921 499585 495420 492875 491486 490392 488972 487192 485542 484610 484646 485440 486452
60653D86452M80p16j940k348j822j220j254j599j629j626k357l580l989k875j061
$$ 486452 486932 486216 484276 481928 480106 478886 477632 476033 474404 472778 470421 466841 462852 459977 458916
60638D58916J42K38m69j477k252k338j908j707k179k923l435l792m232m581m682
$$ 458916 459058 459296 458827 457350 455098 452760 450852 449145 446966 444043 440608 436816 432584 428003 423321
60623D23321m830n223n424n028m440m269m371m269m116m350m625m079k692j437
$$ 423321 418491 413268 407844 402816 398376 394107 389736 385467 381351 377001 372376 368297 365605 364168
60609C64168r92j073j205j314j345j025k68O73J644K630L264L076K364K127K767
$$ 364168 363176 362103 360898 359584 358239 357214 356946 357619 359263 361893 365157 368233 370597 372724 375491
60594C75491L569L852L882M185M616M814N004N610O385O627O150N348M511L622
$$ 375491 379060 382912 386794 390979 395595 400409 405413 411023 417408 424035 430185 435533 440044 443666
60580D43666K838K520K745L144L379L380L192K865K685L079M187N665O956P669
$$ 443666 446504 449024 451769 454913 458292 461672 464864 467729 470414 473493 477680 483345 490301 497970
60566D97970P719P323O885O698O740O888P162P546P679P169O184N332M785M073
$$ 497970 505689 513012 519897 526595 533335 540223 547385 554931 562610 569779 575963 581295 586080 590153
60552E90153K909J752J128Q36M13R3M10R71N66j165k999l710l664m096n278o392
$$ 590153 593062 594814 595942 596778 597191 597284 597694 598665 599231 598066 595067 591357 587693 583597 578319 571927
60536E71927o943p225p394p052o127n251m847m522l841l063k562k029j003K65
$$ 571927 564984 557759 550365 543313 537186 531935 527088 522566 518725 515662 513100 511071 510068 510333
60522E10333J092J345J520K008K742L456L881L794L271K764K663K934L491M460
$$ 510333 511425 512770 514290 516298 519040 522496 526377 530171 533442 536206 538869 541803 545294 549754
60508E49754N717O595O611O264O447P222P799P622O881N995N100M176L284K637
$$ 549754 555471 562066 568677 574941 581388 588610 596409 604031 610912 616907 622007 626183 629467 632104
60494F32104K595L386M599N331N213M942N373O524P969R664J1595J3146J3889
$$ 632104 634699 638085 642684 648015 653228 658170 663543 670067 678036 687700 699295 712441 726330
60481G26330J4698J6979K0776K4709K7834L0618L3845L7568M1336M4487M5853
$$ 726330 741028 758007 778783 803492 831326 861944 895789 933357 974693 1019180 1065033
60470A065033M4144L9155L2034K3957J5326O516j399p336j1058j2838j2798j1061
$$ 1065033 1109177 1148332 1180366 1204323 1219649 1226165 1224766 1217430 1206372 1193534 1180736 1169675
60458A169675q039m107M87N014Q160R171Q763Q313Q400Q604Q393P792P311P648
$$ 1169675 1161636 1157529 1158016 1163030 1171190 1180361 1189124 1197437 1205837 1214441 1222834 1230626 1237937 1245585
60444A245585R258J1979J5331J9276K4232L0131L6154M1836M7885N5265O3853
$$ 1245585 1254843 1266822 1282153 1301429 1325661 1355792 1391946 1433782 1481667 1536932 1600785
60433A600785P2677Q1182Q9583R8038J06203J13709J20662J27455J34503J42372
$$ 1600785 1673462 1754644 1844227 1942265 2048468 2162177 2282839 2410294 2544797 2687169
60423B687169J52094J65029J82089K02901K25798K48779K70074K87217K95752
$$ 2687169 2839263 3004292 3186381 3389282 3615080 3863859 4133933 4421150 4716902
60414D716902K89961K65583K21841J61131Q7668O937p4500j49880k13598k62103
$$ 4716902 5006863 5272446 5494287 5655418 5743086 5750023 5675523 5525643 5312045 5049942
60404E049942k94262l11360l16338l12333l01698k86223k67583k47191k25957
$$ 5049942 4755680 4444320 4127982 3815649 3513951 3227728 2960145 2712954 2486997
60395B486997k04580j83877j64541j46913j31135j17160j04519r2700q2007p3381
$$ 2486997 2282417 2098540 1933999 1787086 1655951 1538791 1434272 1341572 1259565 1186184
60385A186184o6898o1156n4816m8186m2558l8448l5327l2761l0794k9183k7182
$$ 1186184 1119286 1058130 1003314 955128 912570 874122 838795 806034 775240 746057 718875
60374G18875k4440k1560j9420j8140j7016j5408j3567j2453j2528j2999j2676
$$ 718875 694435 672875 653455 635315 618299 602891 589324 576871 564343 551344 538668
60363E38668j1502j0586j0533j0606r937q808p973p437o753o053n760n620n001
$$ 538668 527166 516580 506047 495441 485504 476696 468723 461286 454533 448480 442720 437100 432099
60350D32099m067l603l697l548k782k036j881j969j659r52k90Q5J75j1l22m02
$$ 432099 428032 424429 420732 417184 414402 412366 410485 408516 406857 405905 405615 405700 405875 405864 405542 405140
60334D05140j43P5p8l23k08J76L57K78L69P55Q95M26j03J05Q40R80O8r69j081
$$ 405140 404997 405072 404994 404671 404463 404639 404996 405274 405643 406398 407293 407719 407616 407721 408561 409541 409609 408640 407559
60315D07559n45l88p46p31JN30q7j509k540k479j605o74l27p42j476j798j407
$$ 407559 407014 406626 405880 405149 405150 405680 405593 404084 401544 399065 397460 396786 396459 395717 394241 392443 391036
60298C91036o81j39M5p8l68m83r9N63R34R78J322K175K860K803K391K258K292
$$ 391036 390355 390216 390261 390183 389815 389332 389233 389796 390730 391708 393030 395205 398065 400868 403259 405517 407809
60281D07809J960J294Q56R41J328J613J468Q49K19J36L93J81o06r48j62J007J466
$$ 407809 409769 411063 411919 412860 414188 415801 417269 418118 418337 418473 418866 419047 418441 417493 417331 418338 419804
60264D19804J236J000Q85O74O40J068J389R49L41P08J896K508J848O96Jj19J31
$$ 419804 421040 422040 422925 423599 424239 425307 426696 427645 427986 428694 430590 433098 434946 435642 435643 435524 435655
60247D35655P24J476J927J938J809J688J494J416J759K272K312J680O15q65k702
$$ 435655 436379 437855 439782 441720 443529 445217 446711 448127 449886 452158 454470 456150 456765 455900 453198
60232D53198m022l818k546j852k410l126k934k228j833j609r76p3N25Q12J273
$$ 453198 449176 445358 442812 440960 438550 435424 432490 430262 428429 426820 425844 425771 426296 427108 428381
60217D28381K128L204M308N257N783N857N829O055O603P455Q446Q943Q276O792
$$ 428381 430509 433713 438021 443278 449061 454918 460747 466802 473405 480860 489306 498249 506525 513317
60203E13317N744N789O294O535O756P423Q251Q784R288J0206J1227J1814J2312
$$ 513317 519061 524850 531144 537679 544435 551858 560109 568893 578181 588387 599614 611428 623740
60190F23740J3542J5410J6915J7563J8009J9094K0913K3021K5095K7206K9628
$$ 623740 637282 652692 669607 687170 705179 724273 745186 768207 793302 820508 850136
60179H50136L2518L5602L8333M0572M2783M5250M7376M8384M8438M8438M8714
$$ 850136 882654 918256 956589 997161 1039944 1085194 1132570 1180954 1229392 1277830 1326544
60168A326544M8572M7250M4805M1794L8522L4870L0647K5872K0743J5505J0301
$$ 1326544 1375116 1422366 1467171 1508965 1547487 1582357 1613004 1638876 1659619 1675124 1685425
60157A685425N226N27l391o360q616j0398j1566j1828j1200r822p523l991N86
$$ 1685425 1690651 1691178 1687787 1681427 1672811 1662413 1650847 1639019 1627819 1617997 1610474 1606483 1607069
60144A607069N482J0119J4558J9149K4007K8924L3629L7916M1651M4788M7368
$$ 1607069 1612551 1622670 1637228 1656377 1680384 1709308 1742937 1780853 1822504 1867292 1914660
60133A914660M9429N0922N1621N1128M9076M5502M0910L5837L0391K4411J7937
$$ 1914660 1964089 2015011 2066632 2117760 2166836 2212338 2253248 2289085 2319476 2343887 2361824
60122B361824J1233M405k622r613j5748k0138k2516k3312k3111k2274k0922j9021
$$ 2361824 2373057 2377462 2374840 2365227 2349479 2329341 2306825 2283513 2260402 2238128 2217206 2198185
60110B198185j6380j2895q983n540l150j412O05L271O094Q612J1075J3948J7013
$$ 2198185 2181805 2168910 2159927 2154387 2151237 2149825 2150430 2153701 2159795 2168407 2179482 2193430 2210443
60097B210443J9441K0627K0636J9836J8487J6699J4505J1905R044O380M378L024
$$ 2210443 2229884 2250511 2271147 2290983 2309470 2326169 2340674 2352579 2361623 2368003 2372381 2375405
60085B375405J904Q30K07O44K407N366R271J3933J9239K5081L1361L8053M5289
$$ 2375405 2377309 2378139 2378346 2378990 2381397 2386763 2396034 2409967 2429206 2454287 2485648 2523701 2568990
60072B568990N3279O2044P1319Q0803R0377R9962J09316J18140J26222J33327
$$ 2568990 2622269 2684313 2755632 2836435 2926812 3026774 3136090 3254230 3380452 3513779
60062C513779J39191J43872J47756J50820J52131J50561J45958J39066J30370
$$ 3513779 3652970 3796842 3944598 4095418 4247549 4398110 4544068 4683134 4813504
60053D813504J19512J05937Q9641P1160N1228L0656J0156j0015l0146n0536p0826
$$ 4813504 4933016 5038953 5128594 5199754 5250982 5281638 5291794 5281779 5251633 5201097 5130271
60042E130271q9777j05713j17465j25085j29478j31103j29381j23725j14838j04321
$$ 5130271 5040494 4934781 4817316 4692231 4562753 4431650 4302269 4178544 4063706 3959385
60032C959385r3173q1196o7890n3364l8387k4005j1101J07J0088J9045K6191L0494
$$ 3959385 3866212 3785016 3717126 3663762 3625375 3601370 3590269 3590376 3600464 3619509 3645700 3676194
60020C676194L1915L1138K8347K3325J6756J0153M071k468j0151j7988k4584l0087
$$ 3676194 3708109 3739247 3767594 3790919 3807675 3817828 3821899 3819431 3809280 3791292 3766708 3736621
60008C736621l5757m2058m8200n3486n8189o2858o7361p0959p3027p3548p2962
$$ 3736621 3700864 3658806 3610606 3557120 3498931 3436073 3368712 3297753 3224726 3151178 3078216
59997C078216p1633o9511o6321o1971n6661n0661m4317l8031l1900k5447j8189
$$ 3078216 3006583 2937072 2870751 2808780 2752119 2701458 2657141 2619110 2587210 2561763 2543574
59986B543574j0365k647M640J1432J7366K2223K6725L1818L7006M0638M2116M2591
$$ 2543574 2533209 2530562 2535202 2546634 2564000 2586223 2612948 2644766 2681772 2722410 2764526 2807117
59974B807117M2907M2103L8838L3210K6220J8256R274k13r465j8424k7258l5456
$$ 2807117 2850024 2892127 2930965 2964175 2990395 3008651 3017925 3017712 3008247 2989823 2962565 2927109
59962B927109m2425m8528n4359n9199o1457o0691n8127n5066n1622m7283m1873
$$ 2927109 2884684 2836156 2781797 2722598 2661141 2600450 2542323 2487257 2435635 2388352 2346479
59951B346479l5690k9221k2818j6346r227j297O695J3993K0904K8213L5888M3255
$$ 2346479 2310789 2281568 2258750 2242404 2233177 2231880 2238575 2252568 2273472 2301685 2337573 2380828
59939B380828N0198N7076O3535O8546P1766P3751P4602P3471O9784O4033N6819
$$ 2380828 2431026 2488102 2551637 2620183 2691949 2765700 2840302 2913773 2983557 3047590 3104409
59928C104409M8038L7605K6195J4654L156q385j9627l0014l9301m7273n3384n7199
$$ 3104409 3152447 3190052 3216247 3230901 3234057 3225672 3206045 3176031 3136730 3089457 3036073 2978874
59916B978874n8910n8953n7422n4259m9726m4205l7816l0593k2840j4878o693
$$ 2978874 2919964 2861011 2803589 2749330 2699604 2655399 2617583 2586990 2564150 2549272 2542579
59905B542579J762J0129J7896K4938L1428L7378M2599M6961N0339N2380N2771
$$ 2542579 2544341 2554470 2572366 2597304 2628732 2666110 2708709 2755670 2806009 2858389 2911160
59894B911160N1638M9424M6529M3268M0031L6989L3764K9786K5174K0922J8105
$$ 2911160 2962798 3012222 3058751 3102019 3142050 3179039 3212803 3242589 3267763 3288685 3306790
59883C306790J7080J7464J8707K0650K3676K8423L5124M3273N2107O1463P1887
$$ 3306790 3323870 3341334 3360041 3380691 3404367 3432790 3467914 3511187 3563294 3624757 3696644
59872C696644Q3770R6554J09032J20345J30467J39690J47817J53897J56611J54771
$$ 3696644 3780414 3876968 3986000 4106345 4236812 4376502 4524319 4678216 4834827 4989598
59862D989598J47587J34706J16199R2502O4404L3130M01l1875o2120q9277j12486
$$ 4989598 5137185 5271891 5388090 5480592 5544996 5578126 5578527 5546652 5484532 5395255 5282769
59851E282769j30869j43892j51846j55646j56063j53332j47439j38695j27875
$$ 5282769 5151900 5008008 4856162 4700516 4544453 4391121 4243682 4104987 3977112
59842C977112j15947j03622r1026p7813o3717m9023l4485k0782q209L219J3685
$$ 3977112 3861165 3757543 3666517 3588704 3524987 3475964 3441479 3420697 3412488 3415707 3429392
59831C429392K3622L3411M2724N0384N5234N7094N6435N3266M6769L6360K2634
$$ 3429392 3453014 3486425 3529149 3579533 3634767 3691861 3748296 3801562 3848331 3884691 3907325
59820C907325O823j0320k8568m7258o5060q0903r4582j06050j14757j20171j22614
$$ 3907325 3914148 3903828 3875260 3828002 3762942 3682039 3587457 3481407 3366650 3246479 3123865
59809C123865j22894j21390j18100j13482j08411j03168r7237r0285q2831p5600
$$ 3123865 3000971 2879581 2761481 2647999 2539588 2436420 2339183 2248898 2166067 2090467
59799B090467o8768o2139n5651m9284m2878l6402l0155k4452j9407j5221j2245
$$ 2090467 2021699 1959560 1903909 1854625 1811747 1775345 1745190 1720738 1701331 1686110 1673865
59788A673865j0433r173q033p288p265p561p489o994o552o331o092n835n974o780
$$ 1673865 1663432 1654259 1646226 1638938 1631673 1624112 1616623 1609629 1603077 1596746 1590654 1584819 1578845 1572065
59774A572065q120r820j1853j4051j6019j7501j8600j9375j9426j8181j5712j3030
$$ 1572065 1563945 1554125 1542272 1528221 1512202 1494701 1476101 1456726 1437300 1419119 1403407 1390377
59762A390377j1228j0194q539n287j350J285J824J368J323K000L165M972P600
$$ 1390377 1379149 1368955 1360416 1355129 1353779 1355064 1356888 1358256 1359579 1361579 1364744 1369716 1377316
59749A377316J0514J2967J4825J6273J7072J7004J6707J7173J8507J9891K0684
$$ 1377316 1387830 1400797 1415622 1431895 1448967 1465971 1482678 1499851 1518358 1538249 1558933
59738A558933K0780K0135J8763J7229J6263J5714J4738J3136J1739J1203J1202
$$ 1558933 1579713 1599848 1618611 1635840 1652103 1667817 1682555 1695691 1707430 1718633 1729835
59727A729835J1215J1495J2705J5019J8049K1430K5146K9375L4213L9563M5238
$$ 1729835 1741050 1752545 1765250 1780269 1798318 1819748 1844894 1874269 1908482 1948045 1993283
59716A993283N1353N8380O6498P5111Q3531R1936J01056J10994J20978J30365
$$ 1993283 2044636 2103016 2169514 2244625 2328156 2420092 2521148 2632142 2753120 2883485
59706B883485J38918J45740J48540J44519J31790J09882P9717M3784O127k8704
$$ 2883485 3022403 3168143 3316683 3461202 3592992 3702874 3782591 3826375 3832502 3803798
59696C803798n7213p7889r0996r7745r9457r7262r2276q5592p7731o8387n7271
$$ 3803798 3746585 3668696 3577700 3479955 3380498 3283236 3190960 3105368 3027637 2959250 2901979
59685B901979m5157l3483k2998j3309l787N620J4709K3461L1990M0409M8941N7824
$$ 2901979 2856822 2823339 2800341 2787032 2783245 2788865 2803574 2827035 2859025 2899434 2948375 3006199
59673C006199O7016P6325Q5831R5708J05752J15728J26132J37790J50563J63410
$$ 3006199 3073215 3149540 3235371 3331079 3436831 3552559 3678691 3816481 3967044 4130454
59663D130454J75946J89053K03418K18450K33369K48541K64703K81382K97084
$$ 4130454 4306400 4495453 4698871 4917321 5150690 5399231 5663934 5945316 6242400
59654F242400L10751L22092L30647L35496L36131L32804L25888L15580L02550
$$ 6242400 6553151 6875243 7205890 7541386 7877517 8210321 8536209 8851789 9154339
59645I154339K88340K74690K62732K53052K46057K41696K38845K35458K29668
$$ 9154339 9442679 9717369 9980101 10233153 10479210 10720906 10959751 11195209 11424877
59636A1424877K20698K08586J93130J73514J49068J20312Q9010N7314K6918j174
$$ 11424877 11645575 11854161 12047291 12220805 12369873 12490185 12579195 12636509 12663427 12662253
59626A2662253k6407m8161o5347p6776q2067q1847p6650o6109m9861k8901n098
$$ 12662253 12635846 12587685 12522338 12445562 12363495 12281648 12204998 12138889 12089028 12060127 12055029
59615A2055029K0559M8330P8348J09817J41873J74193K06279K36917K64775K88802
$$ 12055029 12075588 12123918 12202266 12312083 12453956 12628149 12834428 13071345 13336120 13624922
59605A3624922L07542L18837L20829L12424K92114K57356K06491J40982O4817
$$ 13624922 13932464 14251301 14572130 14884554 15176668 15434024 15640515 15781497 15846314
59596A5846314j7942j03936j89216k68789l38104l94421m36616m64503m78865
$$ 15846314 15828372 15724436 15535220 15266431 14928327 14533906 14097290 13632787 13153922
59587A3153922m81545m74812m60578m40301m15442l88030l60948l37493l20342
$$ 13153922 12672377 12197565 11736987 11296686 10881244 10493214 10132266 9794773 9474431
59578I474431l10880l09536l15991l28348l42526l53716l58928l57777l51040
$$ 9474431 9163551 8854015 8538024 8209676 7867150 7513434 7154506 6796729 6445689
59569F445689l39433l23979l06380k88112k69529k50433k31100k12220j94102
$$ 6445689 6106256 5782277 5475897 5187785 4918256 4667823 4436723 4224503 4030401
59560D030401j76695j60250j45392j32397j20853j10106r9796q9891q0516p1943
$$ 4030401 3853706 3693456 3548064 3415667 3294814 3184708 3084912 2995021 2914505 2842562
59550B842562o4515n8298n2915m7922m3418m0096l8461l8082l7935l7615l7841
$$ 2842562 2778047 2719749 2666834 2618912 2575494 2535398 2496937 2458855 2420920 2383305 2345464
59539B345464l9430m1958m3931m4287m3379m2346m1892m1800m1315l9723l6832
$$ 2345464 2306034 2264076 2220145 2175858 2132479 2090133 2048241 2006441 1965126 1925403 1888571
59528A888571l3239k9938k7409k5215k2666j9705j6753j3903j0773p193l616o53
$$ 1888571 1855332 1825394 1797985 1772770 1750104 1730399 1713646 1699743 1688970 1681777 1678161 1677508
59516A677508J530L207M707O249P993J0010J2284J4766J7272J9307K0268K0109
$$ 1677508 1679038 1682245 1686952 1693201 1701194 1711204 1723488 1738254 1755526 1774833 1795101 1815210
59504A815210J9634J9842K1071K2987K5207K7565K9949L2289L4843L8044M2004
$$ 1815210 1834844 1854686 1875757 1898744 1923951 1951516 1981465 2013754 2048597 2086641 2128645
59493B128645M6410N0983N5756O0824O6160P1764P7632Q3518Q9049R4261R9621
$$ 2128645 2175055 2226038 2281794 2342618 2408778 2480542 2558174 2641692 2730741 2825002 2924623
59482B924623J05215J10386J14370J16992J18456J18777J17780J15214J10483
$$ 2924623 3029838 3140224 3254594 3371586 3490042 3608819 3726599 3841813 3952296
59473C952296J02746R1956P9498O7199N5802M4914L4187K3881J4322N540k467
$$ 3952296 4055042 4146998 4226496 4293695 4349497 4394411 4428598 4452479 4466801 4472341 4469874
59462D469874r661j6202k2141k6755k8793k7639k3884j8540j2056m279N007J5700
$$ 4469874 4460213 4444011 4421870 4395115 4366322 4338683 4314799 4296259 4284203 4279924 4284931 4300631
59450D300631K7312L9219N1075O2751P3481Q1369Q4449Q2220P5396O4220M8035
$$ 4300631 4327943 4367162 4418237 4480988 4554469 4635838 4720287 4802507 4877903 4942123 4990158
59439D990158K6814K237k3438m8931p3806r7326j18210j35351j48107j56061j59163
$$ 4990158 5016972 5019209 4995771 4946840 4873034 4775708 4657498 4522147 4374040 4217979 4058816
59428D058816j58090j54047j47980j40212j30814j20113j08754r7349q6083p4715
$$ 4058816 3900726 3746679 3598699 3458487 3327673 3207560 3098806 3001457 2915374 2840659
59418B840659o3078n1553m0769l0893k1485j2118k744O552J5814K4982L3806M2098
$$ 2840659 2777581 2726028 2685259 2654366 2632881 2620763 2618019 2624571 2640385 2665367 2699173 2741271
59406B741271M9869N7079O3615O9515P4870P9392Q2441Q3587Q2595P8871P1594
$$ 2741271 2791140 2848219 2911834 2981349 3056219 3135611 3218052 3301639 3384234 3463105 3534699
59395C534699O0783M7630L3346J8105J514j6322l4712n2866o9861q4448r5616
$$ 3534699 3595482 3643112 3676458 3694563 3696077 3679755 3645043 3592177 3522316 3437868 3342252
59384C342252j03462j09016j13179j15958j16716j15017j11261j06585j01920
$$ 3342252 3238790 3129774 3016595 2900637 2783921 2668904 2557643 2451058 2349138
59375B349138r7175r1692q5421p9105p3197o7344o1292n5495n0363m5516m0538
$$ 2349138 2251963 2160271 2074850 1995745 1922548 1855204 1793912 1738417 1688054 1642538 1602000
59364A602000l5830l1975k8589k4815k0671j7027j4221j1597q572n367k431L38
$$ 1602000 1566170 1534195 1505606 1480791 1460120 1443093 1428872 1417275 1408703 1403336 1400905 1401243
59352A401243L386O903J0568J3611J4956J3838J0591O706L771K458K575L831O245
$$ 1401243 1404629 1411532 1422100 1435711 1450667 1464505 1475096 1481802 1485573 1488031 1490606 1494437 1500682
59339A500682R887J4416J9025K2715K4572K4046K1394J8048J6049J6594J9147
$$ 1500682 1510569 1524985 1544010 1566725 1591297 1615343 1636737 1654785 1670834 1687428 1706575
59328A706575K2375K5837L0167L5677M1601M7084N2297N8042O4655P1715P8732
$$ 1706575 1728950 1754787 1784954 1820631 1862232 1909316 1961613 2019655 2084310 2156025 2234757
59317B234757Q5668R2981J01253J10644J20630J30648J41005J52609J65683J79467
$$ 2234757 2320425 2413406 2514659 2625303 2745933 2876581 3017586 3170195 3335878 3515345
59307C515345J93432K07915K22881K36894K48158K56158K61307K63394K61312
$$ 3515345 3708777 3916692 4139573 4376467 4624625 4880783 5142090 5405484 5666796
59298E666796K54396K43215K29019K12993J96122J79086J62115J45273J28882
$$ 5666796 5921192 6164407 6393426 6606419 6802541 6981627 7143742 7289015 7417897
59289G417897J13256R8084Q2481O5645M7051K6169K518k3892n2507q2608j13421
$$ 7417897 7531153 7629237 7711718 7777363 7824414 7850583 7853101 7829209 7776702 7694094 7580673
59278G580673j43966j73107j99676k22302k39529k50703k56595k58536k57008
$$ 7580673 7436707 7263600 7063924 6841622 6602093 6351390 6094795 5836259 5579251
59269E579251k51572k42238k30244k17179k03755j89619j74312j58164j42304
$$ 5579251 5327679 5085441 4855197 4638018 4434263 4244644 4070332 3912168 3769864
59260C769864j27748j14556j02065q9948p8593o8346n8906m9822m1078l2748k4632
$$ 3769864 3642116 3527560 3425495 3335547 3256954 3188608 3129702 3079880 3038802 3006054 2981422
59249B981422j6781r919m646n34L287P014J0319J3246J6043J8359J9496J9476
$$ 2981422 2964641 2954722 2950076 2949542 2952829 2959843 2970162 2983408 2999451 3017810 3037306 3056782
59237C056782J8895J7751J5428J1964Q351N176J903j940n713q501j0420j2200
$$ 3056782 3075677 3093428 3108856 3120820 3129171 3134347 3136250 3134310 3128597 3120096 3109676 3097476
59225C097476j3770j4117j2594r729o471l041J104O338J2270J8153K3659K9016
$$ 3097476 3083706 3069589 3056995 3047266 3040795 3037754 3038858 3045196 3057466 3075619 3099278 3128294
59213C128294L4525M0235M6093N2044N7824O2873O6510O7874O5726N8980M7899
$$ 3128294 3162819 3203054 3249147 3301191 3359015 3421888 3488398 3556272 3621998 3680978 3728877
59202C728877L4455K1117R463q0p815j4555k1247k7985l3695l7337l9143m0098
$$ 3728877 3763332 3784449 3793912 3793832 3786017 3771462 3750215 3722230 3688535 3651198 3612055 3571957
59190C571957m0529m0027l8584l7006l6101l6029l6518l7215l7775l8095l8526
$$ 3571957 3531428 3491401 3452817 3415811 3379710 3343681 3307163 3269948 3232173 3194078 3155552
59179C155552l9534m1107m2727m3858m4222m3813m2894m1787m0345l7938l4237
$$ 3155552 3116018 3074911 3032184 2988326 2944104 2900291 2857397 2815610 2775265 2737327 2703090
59168B703090k9699k4839j9492j3254o285R19Q219J5783K3698L2101M1361N1558
$$ 2703090 2673391 2648552 2629060 2615806 2609521 2610440 2618659 2634442 2658140 2690241 2731602 2783160
59156B783160O2202P3020Q4440R6670J08884J20084J30172J39288J46665J51120
$$ 2783160 2845362 2918382 3002822 3099492 3208376 3328460 3458632 3597920 3744585 3895705
59146C895705J52070J48945J40301J25051J04284Q0319N4062K4810p304m0295
$$ 3895705 4047775 4196720 4337021 4462072 4566356 4646675 4700737 4725547 4718243 4677948
59136D677948p1964j01060j26350j46238j60126j69045j74105j75215j72054j65439
$$ 4677948 4605984 4504924 4378574 4232336 4072210 3903165 3729060 3553845 3381791 3216352
59126C216352j56977j47850j38462j28713j18252j07037r5935q6084p7531o9282
$$ 3216352 3059375 2911525 2773063 2644350 2526098 2419061 2323126 2237042 2159511 2090229
59116B090229o0908n3068m6188l9735l3372k7691k3100j8834j4007q941m648j454
$$ 2090229 2029321 1976253 1930065 1890330 1856958 1829267 1806167 1787333 1773326 1764385 1759737 1758283
59104A758283J202L939P003J0223J3019J4895J6212J7919K0290K2604K4410K6158
$$ 1758283 1759485 1763424 1770427 1780650 1793669 1808564 1824776 1842695 1862985 1885589 1909999 1936157
59092A936157K8146K9789L0645L1390L2849L4717L6081L6759L7213L7465L6949
$$ 1936157 1964303 1994092 2024737 2056127 2088976 2123693 2159774 2196533 2233746 2271211 2308160
59081B308160L5290L2690K9605K6433K3267J9682J5188J0120N488J583k456p122
$$ 2308160 2343450 2376140 2405745 2432178 2455445 2475127 2490315 2500435 2505923 2507506 2505050 2497928
59069B497928j1320j3562j3877j3567j3386j2818j1180q547n438k144J432N491
$$ 2497928 2486608 2473046 2459169 2445602 2432216 2419398 2408218 2399671 2394233 2392089 2393521 2399012
59057B399012J0020J4680J9109K3293K7391L1255L4649L7941M1885M6396N0358
$$ 2399012 2409032 2423712 2442821 2466114 2493505 2524760 2559409 2597350 2639235 2685631 2735989
59046B735989N3053N5133N7502N9959O1722O2927O4647O7447P0783P3891P6660
$$ 2735989 2789042 2844175 2901677 2961636 3023358 3086285 3150932 3218379 3289162 3363053 3439713
59035C439713P9309Q1582Q2576Q1342P7472P1001O1857M9709L4555J7041k124
$$ 3439713 3519022 3600604 3683180 3764522 3841994 3912995 3974852 4024561 4059116 4076157 4074033
59024D074033k2651m4014o4745q3250r9111j12651j23380j30195j33186j34027
$$ 4074033 4051382 4007368 3942623 3859373 3760262 3647611 3524231 3394036 3260850 3126823
59014C126823j34045j32941j29995j25489j20266j14713j08927j03156r7378r1155
$$ 3126823 2992778 2859837 2729842 2604353 2484087 2369374 2260447 2157291 2059913 1968758
59004A968758q4549p8523p3662o9196o4106n8624n3808n0102m7090m4307m1524
$$ 1968758 1884209 1805686 1732024 1662828 1598722 1540098 1486290 1436188 1389098 1344791 1303267
58993A303267l8563l5463l2682l0536k8763k6951k5044k3064k0905j8798j7357
$$ 1303267 1264704 1229241 1196559 1166023 1137260 1110309 1085265 1062201 1041296 1022498 1005141
58982A005141j6623j5743j4124j2293j0915r732q174o438n033l849k580j593j368
$$ 1005141 988518 972775 958651 946358 935443 925711 917537 911099 906066 902217 899637 898044 896676
58969H96676j368n05J345L129L932L776L155K355J332o1j747l176l685l295k748
$$ 896676 895308 894803 896148 899277 903209 906985 910140 912495 913827 913766 912019 908843 905158 901863 899115
58954H99115k544k495k372k331k279j677m43O67J108J252J405J131K07n83o63
$$ 899115 896571 894076 891704 889373 887094 885417 884974 885641 886749 888001 889406 890537 890744 890161 889498
58939H89498p83j872l480m531n073n946p113p687p493p309p509p511o804n610
$$ 889498 888715 886843 883363 878832 873759 867813 860700 853013 845520 838211 830702 823191 816387 810777
58925H10777m370l250k362j852j669j526j100r2J640L650N120N825O419P355Q195
$$ 810777 806407 803157 800795 798943 797274 795748 794648 794556 796196 799846 804966 810791 817210 824565 832760
58910H32760Q491Q667R287J0145J0787J1308J1862J2079J1828J1837J2606J3385
$$ 832760 841251 849918 859205 869350 880137 891445 903307 915386 927214 939051 951657 965042
58898I65042J3318J2823J2775J2998J2832J2574J2994J3847J4318J4607J5600
$$ 965042 978360 991183 1003958 1016956 1029788 1042362 1055356 1069203 1083521 1098128 1113728
58887A113728J7272J8780K0068K1867K4096K5745K6520K7277K8588L0039L1290
$$ 1113728 1131000 1149780 1169848 1191715 1215811 1241556 1268076 1295353 1323941 1353980 1385270
58876A385270L2738L4707L6851L8724M0275M1712M3453M6141M9961N4164N7988
$$ 1385270 1418008 1452715 1489566 1528290 1568565 1610277 1653730 1699871 1749832 1803996 1861984
58865A861984O1772O6284P1345P6169Q0740Q5721R1234R7011J03457J11221J19841
$$ 1861984 1923756 1990040 2061385 2137554 2218294 2304015 2395249 2492260 2595717 2706938 2826779
58854B826779J28235J36533J46038J57231J69165J80933J92442K03612K14277
$$ 2826779 2955014 3091547 3237585 3394816 3563981 3744914 3937356 4140968 4355245
58845D355245K25074K37006K49641K61102K70056K76476K80148K79977K75244
$$ 4355245 4580319 4817325 5066966 5328068 5598124 5874600 6154748 6434725 6709969
58836F709969K66024K51598K30055K00455J64179J23169P8096K9444k0645o9133
$$ 6709969 6975993 7227591 7457646 7658101 7822280 7945449 8023545 8052989 8032344 7963211
58826G963211j14089j54760j90138k18817k40408k55978k66733k72724k73299
$$ 7963211 7849122 7694362 7504224 7285407 7044999 6789021 6522288 6249564 5976265
58817E976265k68641k60511k51140k41388k30481k17839k04495j92026j80661
$$ 5976265 5707624 5447113 5195973 4954585 4724104 4506265 4301770 4109744 3929083
58808C929083j69531j58443j48131j38816j29876j21133j13177j06045r8762r0870
$$ 3929083 3759552 3601109 3452978 3314162 3184286 3063153 2949976 2843931 2745169 2654299
58798B654299q3377p7489p3130o9279o5170o0666n6040n1800m8222m4805m0714
$$ 2654299 2570922 2493433 2420303 2351024 2285854 2225188 2169148 2117348 2069126 2024321 1983607
58787A983607l5898l1158k6975k3039j9044j5138j1391p596l841m89K578N883
$$ 1983607 1947709 1916551 1889576 1866537 1847493 1832355 1820964 1813368 1809527 1809038 1811616 1817499
58775A817499R432J2732J5822J9269K2963K6111K8717L1913L6299M1021M5094
$$ 1817499 1826931 1839663 1855485 1874754 1897717 1923828 1952545 1984458 2020757 2061778 2106872
58764B106872M8721N2692N7331O2572O8273P3948P9021Q3823Q9541R6694J04543
$$ 2106872 2155593 2208285 2265616 2328188 2396461 2470409 2549430 2633253 2722794 2819488 2924031
58753B924031J12447J20834J30200J40069J49839J59857J70876J82928J95378
$$ 2924031 3036478 3157312 3287512 3427581 3577420 3737277 3908153 4091081 4286459
58744D286459K07669K19464K30537K40842K50223K57830K62533K64007K62472
$$ 4286459 4494128 4713592 4944129 5184971 5435194 5693024 5955557 6219564 6482036
58735F482036K57052K45487K26129J99367J66543J28368Q5226L8272j0519n8977
$$ 6482036 6739088 6984575 7210704 7410071 7576614 7704982 7790208 7828480 7817961 7758984
58725G758984j04871j46272j82348k13285k38911k58155k70396k76573k78267
$$ 7758984 7654113 7507841 7325493 7112208 6873297 6615142 6344746 6068173 5789906
58716E789906k76290k70803k62358k52068k41042k29982k19006k07708j95899
$$ 5789906 5513616 5242813 4980455 4728387 4487345 4257363 4038357 3830649 3634750
58707C634750j84288j73735j63834j53318j42087j31587j22800j15005j07206
$$ 3634750 3450462 3276727 3112893 2959575 2817488 2685901 2563101 2448096 2340890
58698B340890r9581r2738q6486q0286p4110o8155o2338n6777n1987m8030m4181
$$ 2340890 2241309 2148571 2062085 1981799 1907689 1839534 1777196 1720419 1668432 1620402 1576221
58687A576221m0070l6315l3363l0607k7347k3839k0710j8074j5846j4168j2881
$$ 1576221 1536151 1499836 1466473 1435866 1408519 1384680 1363970 1345896 1330050 1315882 1303001
58676A303001j1416r857r171r750j0763j1585j2733j4538j6069j6475j6370j6732
$$ 1303001 1291585 1281728 1272557 1262807 1252044 1240459 1227726 1213188 1197119 1180644 1164274 1147542
58664A147542j7383j7722j8117j9161k0285k0495k0013j9904k0427k0914k1029
$$ 1147542 1130159 1112437 1094320 1075159 1054874 1034379 1014366 994462 974035 953121 932092
58653I32092k1070k1269k1671k2365k3071k2993k1847k0479j9654j8902j7521
$$ 932092 911022 889753 868082 845717 822646 799653 777806 757327 737673 718771 701250
58642G01250j5996j5246j4991j4142j2503j0887r812r106q611q300p892p216o735
$$ 701250 685254 670008 655017 640875 628372 617485 607673 598567 589956 581656 573764 566548 559813
58629E59813o847p014o430n281m452m339m741n529o479o815n942m381l092k194
$$ 559813 552966 545952 539522 534241 529789 525450 520709 515180 508701 501886 495944 491563 488471 486277
58615D86277j193j58M14O26J075J856K618L436M684O133P028P115O862O704O739
$$ 486277 485084 484926 485340 485966 487041 488897 491515 494951 499635 505768 512796 519911 526773 533477 540216
58600E40216O974P187O698M996K529K89j244k234k842l132l422m071m983n733
$$ 540216 547190 554377 561075 566071 568600 568889 567645 565411 562569 559437 556015 551944 546961 541228
58586E41228o057n834m979l711k546j647o46O18J791K773M029N624O880P551Q429
$$ 541228 535171 529337 524358 520647 518101 516454 515808 516426 518217 520990 525019 530643 537523 545074 553503
58571E53503R977J1304J1509J1264J1864J3301J4479J5004J5655J7212J9703K2603
$$ 553503 563480 574784 586293 597557 609421 622722 637201 652205 667860 685072 704775 727378
58559G27378K5186K6957K8251K9993L2467L5019L7421M0493M4619M8736N1874
$$ 727378 752564 779521 807772 837765 870232 905251 942672 983165 1027784 1076520 1128394
58548A128394N4757N8605O3128O7043P0041P2856P5707P7893P8705P7752P4632
$$ 1128394 1183151 1241756 1304884 1371927 1441968 1514824 1590531 1668424 1747129 1824881 1899513
58537A899513O9196O1847N2811M1601K7918J2581l135j8398l2284m3420n1300
$$ 1899513 1968709 2030556 2083367 2124968 2152886 2165467 2162332 2143934 2111650 2068230 2016930
58526B016930n7177o2362o6364o7887o7032o5144o2953o0177n6577n2320m7595
$$ 2016930 1959753 1897391 1831027 1763140 1696108 1630964 1568011 1507834 1451257 1398937 1351342
58515A351342m2839l8789l5514l2079k8038k4317k1696j9445j6704j4083j2417
$$ 1351342 1308503 1269714 1234200 1202121 1174083 1149766 1128070 1108625 1091921 1077838 1065421
58504A065421j1126r352p702p082o771n627m350m565o246q092r922j2622j6100
$$ 1065421 1054295 1044943 1037241 1030159 1023388 1017761 1013411 1008846 1002600 994508 984586 971964 955864
58491I55864j9297k1891k4138k5380k4743k3047k1982k1707k1114k0134j9616
$$ 955864 936567 914676 890538 865158 840415 817368 795386 773679 752565 732431 712815
58480G12815j9244j7941j6246j5833j6510j6144j3960j1599j0267r146p442n948
$$ 712815 693571 675630 659384 643551 627041 610897 596937 585338 575071 565925 558483 552535
58468E52535n520n674n608n300m802l834k654k154k555l197l823m775n691n671
$$ 552535 547015 541341 535733 530433 525631 521797 519143 516989 514434 511237 507414 502639 496948 491277
58454D91277m926m739n385n719n234m840n061n059m142k784j509j43J166J586
$$ 491277 486351 481612 476227 470508 465274 460434 455373 450314 446172 443388 441879 441736 442902 444488
58440D44488R46K80L70Q17J091J396K009K796L762N067O304O784O742P076P887
$$ 444488 445434 445714 446084 446901 447992 449388 451397 454193 457955 463022 469326 476110 482852 489928 497815
58425D97815Q471Q748R291R851R419P897O241M781K895N58j457l098n124p315
$$ 497815 506286 515034 524325 534176 543595 551492 557733 562514 565409 565967 564510 561412 556288 548973
58411E48973q362p993p572p964q382p978p100o304n521m732m301m108l565k772
$$ 548973 540611 532618 525046 517082 508700 500722 493622 487318 481797 477065 472764 468656 465091 462319
58397D62319k439k476k075j355j345k140k682k618k733l221l280k753k453k426
$$ 462319 459880 457404 455329 453974 452629 450489 447807 445189 442456 439235 435955 433202 430749 428323
58383D28323j672r9J023J138J243K031K863L276L831M833N662O041O526P243P587
$$ 428323 426651 426552 427575 428713 429956 431987 434850 438126 441957 446790 452452 458493 465019 472262 479849
58368D79849P502P536P327N781L113R13k54j423l010l953l662k927k330j523o36
$$ 479849 487351 494887 502214 507995 511108 512021 511767 510344 507334 503381 499719 496792 494462 492939 492303
58353D92303m93q27k12J634L359M293N260O607P484P694Q137Q903R047Q728R223
$$ 492303 491810 490983 490771 492405 495764 500057 505317 511924 519408 527102 535239 544142 553189 561917 571140
58338E71140J0184R522O745L875K082J83k426m168m153m008n077o182n885m870
$$ 571140 581324 590846 597591 601466 603548 603731 601305 597137 592984 588976 583899 577717 571832 566962
58324E66962m301l857l098k773l117k758j000O57P99J49j42l55q79r53k29K31
$$ 566962 562661 558804 555706 552933 549816 547058 546058 546715 547514 547663 547521 547166 546287 545334 545105 545336
58308E45336o1P1J219K115J982K043L161M184M176M255N415O685P079P291P826
$$ 545336 545275 545346 546565 548680 550662 552705 555866 560050 564226 568481 573896 580581 587660 594951 602777
58293F02777P671O568O308P860R466R533R213R969J0873J0540R701R471Q982P043
$$ 602777 610448 617016 623324 631184 640650 650183 659396 669365 680238 690778 700479 709950 718932 725975
58279G25975M476K628J249j87p74J19J266J526J686K565L278L169L348M503N416
$$ 725975 730451 733079 734328 734141 733367 733486 734752 736278 737964 740529 743807 746976 750324 754827 760243
58264G60243N420N939P592Q495P627P164Q945J1291J2049J2156J3306J4534J4325
$$ 760243 765663 771602 779194 787689 795316 802480 811425 822716 834765 846921 860227 874761 889086
58251H89086J3832J4749J5987J5614J4277J3699J3546J2694J1835J2006J2274
$$ 889086 902918 917667 933654 949268 963545 977244 990790 1003484 1015319 1027325 1039599
58240A039599J1610J1111J1866J2686J2511J2658J4014J4594J2996J1630J3161
$$ 1039599 1051209 1062320 1074186 1086872 1099383 1112041 1126055 1140649 1153645 1165275 1178436
58229A178436J6306J8575K0532K3622K6378K6799K6367K7614K9745L0555L0726
$$ 1178436 1194742 1213317 1233849 1257471 1283849 1310648 1337015 1364629 1394374 1424929 1455655
58218A455655L2287L4658L6107L7394M0173M3634M6279M9047N3092N6703N8205
$$ 1455655 1487942 1522600 1558707 1596101 1636274 1679908 1726187 1775234 1828326 1885029 1943234
58207A943234N9460O2600O5755O6224O5351O5937O7179O6730O5392O5308O5921
$$ 1943234 2002694 2065294 2131049 2197273 2262624 2328561 2395740 2462470 2527862 2593170 2659091
58196B659091O6127O7900P3123P9506Q4317Q9329R7185J05973J12693J18996J27834
$$ 2659091 2725218 2793118 2866241 2945747 3030064 3119393 3216578 3322551 3435244 3554240 3682074
58185C682074J37562J45225J52655J63110J74943J85003J95310K09577K25935
$$ 3682074 3819636 3964861 4117516 4280626 4455569 4640572 4835882 5045459 5271394
58176E271394K40022K52472K66454K80805K92877L05228L21894L40990L58522
$$ 5271394 5511416 5763888 6030342 6311147 6604024 6909252 7231146 7572136 7930658
58167G930658L76319L98237M22207M44629M68803M99767N34622N67838O02167
$$ 7930658 8306977 8705214 9127421 9572050 10040853 10540620 11075242 11643080 12245247
58158A2245247O43713O90205P35695P83034Q39488R03523R68963J038693J120510
$$ 12245247 12888960 13579165 14314860 15097894 15937382 16840905 17809868 18848561 19969071
58149A9969071J213018J310523J418840J550980J710821J897336K120093K391125
$$ 19969071 21182089 22492612 23911452 25462432 27173253 29070589 31190682 33581807
58141C3581807K705158L049186L428788L862797M355904M901450N506099O181623
$$ 33581807 36286965 39336151 42764939 46627736 50983640 55885090 61391189 67572812
58133F7572812O918789P710276Q603547R695118J1071796J2777607J4755478J6639141
$$ 67572812 74491601 82201877 90805424 100500542 111572338 124349945 139105423 155744564
58125A55744564J7548221J6319672J2282883N962524j051982p042275j1064149
$$ 155744564 173292785 189612457 201895340 207857864 206805882 199763607 188699458
58118A88699458j3123648j3747973j3521999j2891853j2137702j1379657j0620528
$$ 188699458 175575810 161827837 148305838 135413985 123276283 111896626 101276098
58111A01276098r829033q994114q120720p219746o321565n474962m714345m040250
$$ 101276098 91447065 82452951 74332231 67112485 60790920 55315958 50601613 46561363
58103D6561363l439977k909907k446443k032623j651936j306068j001652p24739
$$ 46561363 43121386 40211479 37765036 35732413 34080477 32774409 31772757 31048018
58095C1048018m43596j30222K39785O94991J222181J679396J796010J345204L64462
$$ 31048018 30604422 30474200 30713985 31408976 32631157 34310553 36106563 37451767 37816229
58086C7816229q13754j784341k333270k500894k445185k296765k125551j968136
$$ 37816229 37002475 35218134 32884864 30383970 27938785 25642020 23516469 21548333
58078B1548333j836683j717260j590453j453711j314840j175829j036822r06614
$$ 21548333 19711650 17994390 16403937 14950226 13635386 12459557 11422735 10516121
58070A0516121p94988p00381o16307n43904m87314m42413m01228l63427l33504
$$ 10516121 9721133 9020752 8404445 7860541 7373227 6930814 6529586 6166159 5832655
58061E832655l10310k88844k69014k53606k40423k24994k08613j95589j84923
$$ 5832655 5522345 5233501 4964487 4710881 4470458 4245464 4036851 3841262 3656339
58052C656339j72429j58907j48584j41352j33807j26262j21633j18902j14452
$$ 3656339 3483910 3325003 3176419 3035067 2901260 2774998 2653365 2534463 2420011
58043B420011j08569j04199j00646r4807q7380q1563p6843p0241o2614n7501n4480
$$ 2420011 2311442 2207243 2106597 2011790 1924410 1842847 1766004 1695763 1633149 1575648 1521168
58032A521168m9834m3289l8256l5682l3240l0529k9626l0552l1053l0915l1788
$$ 1521168 1471334 1428045 1389789 1354107 1320867 1290338 1260712 1230160 1199107 1168192 1136404
58021A136404l3063l2530l0790l0444l1257l0681k8763k7850k7827k6360k3619
$$ 1136404 1103341 1070811 1040021 1009577 978320 947639 918876 891026 863199 836839 813220
58010H13220k2113k1844k0300j7293j5291j4790j3804j2129j1720j2477j2052
$$ 813220 791107 769263 748963 731670 716379 701589 687785 675656 663936 651459 639407
57999F39407j0289r665j0739j1273j0490j0207j1008j1189j0264r782r899q835
$$ 639407 629118 619453 608714 597441 586951 576744 565736 554547 544283 534501 524602 515767
57987E15767o565n397n998o363n569n118n536n202l692k997m007m847m098k870
$$ 515767 509202 503805 497807 491444 485875 480757 475221 470019 466327 463330 459323 454476 450378 447508
57973D47508k420k259j956k342l700m894n234n271n138m287l287l435m167l432
$$ 447508 445088 442829 440873 438531 434831 429937 424703 419432 414294 410007 406720 403285 399118 395686
57959C95686j171K25l47j241j154r98j553j874j309q94j465k232k423k479k682
$$ 395686 394515 394740 394393 393152 391998 391000 389447 387573 386264 385370 383905 381673 379250 376771 374089
57944C74089k405j645j477k149k409j570o01m10n67m31q3L48Q91J020K70m60R4
$$ 374089 371684 370039 368562 366413 364004 362434 361833 361423 360856 360425 360342 360690 361581 362601 362871 362411 362505
57927C62505J271J210k31j419j829k525l537l414k025j259k046l023l084k983
$$ 362505 363776 364986 364755 363336 361507 358982 355445 352031 350006 348747 346701 343678 340594 337611
57913C37611l399l540k859k180k031j658p93n31j397k224k050j515j392j326r74
$$ 337611 334212 330672 327813 325633 323602 321944 321151 320620 319223 316999 314949 313434 312042 310716 309742
57898C09742q64j213j354j135j344k035k126j416j297k467l679l736l125k650
$$ 309742 308878 307665 306311 305176 303832 301797 299671 298255 296958 294491 290812 287076 283951 281301
57884B81301k059j100m54n07n37j00J39j43r5P64J620J875K158K824K914J825
$$ 281301 279242 278142 277688 277181 276644 276544 276683 276540 276445 277209 278829 280704 282862 285686 288600 290425
57868B90425N52K02L67R4o31j379k148k851k978k594k580l237l825m080m756n911
$$ 290425 290977 291179 291546 291640 291009 289630 287482 284631 281653 279059 276479 273242 269417 265337 260581 254670
57852B54670o241n078l628l108l025k383j318m28L59J056R78r7j135j240q15m75
$$ 254670 248429 243351 239723 236615 233590 231207 229889 229461 229820 230876 231854 231757 230622 229382 228567 228092
57836B28092J0P79J167Q71O05O72L04n27l49J406K878K350R63Q97J978K238J097
$$ 228092 228102 228881 230048 230919 231524 232196 232500 231973 231624 233030 235908 238258 239221 240118 242096 244334 245431
57819B45431j69p85j275j923k178j897j771k166k622k735k696k755k820k758k580
$$ 245431 245262 244477 243202 241279 239101 237204 235433 233267 230645 227910 225214 222459 219639 216881 214301
57804B14301k297j899j344l75J197K823L417K631J379P21Q19J338K113K893L215
$$ 214301 212004 210105 208761 208386 209583 212406 215823 218454 219833 220554 221373 222711 224824 227717 230932
57789B30932L017K776K617K124J376J194J696J678L10j510k373k207j952k109
$$ 230932 233949 236725 239342 241466 242842 244036 245732 247410 247720 246210 243837 241630 239678 237569
57775B37569k525l113l851m460m732m803m653l909k670j777j694j864j727j568
$$ 237569 235044 231931 228080 223620 218888 214085 209432 205523 202853 201076 199382 197518 195791 194223
57761A94223j686j622j009m44o79j506k271k787l079k898k287j986k433k965k799
$$ 194223 192537 190915 189906 189462 188783 187277 185006 182219 179140 176242 173955 171969 169536 166571 163772
57746A63772k202j922j965j775j233p55o84j052j600j689p92O86J738K077K272
$$ 163772 161570 159648 157683 155908 154675 153920 153236 152184 150584 148895 148103 148789 150527 152604 154876
57731A54876K438J933P21k16l63l02l35J78J295J807J075K33M39J164J424J484
$$ 154876 157314 159247 159968 159752 159389 159087 158752 158930 160225 162032 163107 163340 163779 164943 166367 167851
57715A67851J922K234J834J490K124L044K951J972J167O09m13j725k413k384k393
$$ 167851 169773 172007 173841 175331 177455 180499 183450 185422 186589 187198 186785 185060 182647 180263 177870
57700A77870k705k931k969k971k687j925j280j367j749j644j181r16p09k58l4
$$ 177870 175165 172234 169265 166294 163607 161682 160402 159035 157286 155642 154461 153545 152836 152578 152544
57685A52544l93m94M71J581J382K03m12j72j14m60k81N88J140J022J111J853K449
$$ 152544 152151 151657 152128 153709 155091 155294 154882 154710 154596 154136 153855 154443 155583 156605 157716 159569 162018
57668A62018K267J819J765J930J850J501J085Q48J203K326L620M296M457M743
$$ 162018 164285 166104 167869 169799 171649 173150 174235 175083 176286 178612 182232 186528 190985 195728
57654A95728N071M760L857L235L288L528L669M021M676N217N478N866O651P667
$$ 195728 200799 205559 209416 212651 215939 219467 223136 227157 231833 237050 242528 248394 255045 262712
57640B62712Q724R720J0329J0304R950R781R821R935J0394J1334J2152J2379J2688
$$ 262712 271436 281156 291485 301789 311739 321520 331341 341276 351670 363004 375156 387535 400223
57627D00223J3876J5346J5998J6215J7473K0096K2946K5379K7956L1068L4365
$$ 400223 414099 429445 445443 461658 479131 499227 522173 547552 575508 606576 640941
57616F40941L7845M2041M6733N0936N4705N9543O6363P4220Q1672Q8355R4378
$$ 640941 678786 720827 767560 818496 873201 932744 999107 1073327 1154999 1243354 1337732
57605A337732R9034J00759R7760Q8463P2406N1377K8909P920j0699k7117m1156
$$ 1337732 1436766 1537525 1635285 1723748 1796154 1847531 1876440 1884360 1873661 1846544 1805388
57594A805388n2333o0564o6210o9806p1884p2633p1720o9099o5723o2586n9312
$$ 1805388 1753055 1692491 1626281 1556475 1484591 1411958 1340238 1271139 1205416 1142830 1083518
57583A083518n4861m9459m4459m0294l6074l1515k7605k4816k2198j8994j5811
$$ 1083518 1028657 979198 934739 894445 858371 826856 799251 774435 752237 733243 717432
57572G17432j3278j0929q321o087m770l693k047k16J138K380M179O213P811R244
$$ 717432 704154 693225 684904 678817 674047 670354 668307 668091 669229 671609 675788 682001 689812 699056
57558F99056J1236J3648J5890J8154K1089K4471K7390K9616L1824L4431L7146
$$ 699056 710292 723940 739830 757984 779073 803544 830934 860550 892374 926805 963951
57547I63951L9727M2374M5165M7601M8870M8245M5389M0535L4249K6694J7448
$$ 963951 1003678 1046052 1091217 1138818 1187688 1235933 1281322 1321857 1356106 1382800 1400248
57536A400248O412n464j6802k6878l5612m2841m8246n1871n4192n5576n5902n4877
$$ 1400248 1406660 1401196 1384394 1357516 1321904 1279063 1230817 1178946 1124754 1069178 1013276 958399
57524I58399n2513m9475m6794m4931m3132m0248l6246l2343k9496k7454k5526
$$ 958399 905886 856411 809617 764686 721554 681306 645060 612717 583221 555767 530241
57513E30241k3607k1870k0100j7937j5562j3602j2489j2123j1935j1183r660q141
$$ 530241 506634 484764 464664 446727 431165 417563 405074 392951 381016 369833 360173 352032
57501C52032p568p733p492o399n240m694m446m037l602l137k071m16O23K03o80
$$ 352032 344464 336731 329239 322840 317600 312906 308460 304423 300821 297684 295613 295197 295820 296023 295343
57486B95343m93O75J469J403J368K005K822L183L292L803M941O277P056O821N982
$$ 295343 294850 295525 296994 298397 299765 301770 304592 307775 311067 314870 319811 326088 333144 339965 345947
57471C45947N647O484P923Q912R196R420J0175J1553J3454J5800J8405K1034K3543
$$ 345947 351594 358078 366001 374913 384109 393529 403704 415257 428711 444511 462916 483950 507493
57458E07493K5754K7402K8518K9579L0985L2664L4436L6285L7909L8624L8141
$$ 507493 533247 560649 589167 618746 649731 682395 716831 753116 791025 829649 867790
57447H67790L6930L5122L1754K5894J8079R685J251p538j6382k3963k9248l2455
$$ 867790 904720 939842 971596 997490 1015569 1025254 1026505 1018967 1002585 978622 949374 916919
57435I16919l4541l6302l7979l9164l9057l7337l4761l2414l0506k8493k6091
$$ 916919 882378 846076 808097 768933 729876 692539 657778 625364 594858 566365 540274
57424E40274k3464k0599j7435j4556j2799j2008j1045r330p556o473n788m688
$$ 540274 516810 496211 478776 464220 451421 439413 428368 419038 411482 405009 399221 394533
57412C94533k928q74J120K858M239N418O808Q567J0265J1418J2146J3041J4463
$$ 394533 391605 390731 391851 394709 398948 404366 411174 419741 430006 441424 453570 466611 481074
57399D81074J6236J7954J9463K1025K2965K5234K7438K9394L1312L3174L4300
$$ 481074 497310 515264 534727 555752 578717 603951 631389 660783 692095 725269 759569
57388G59569L4053L2708L0971K8697K4843J8840J1366L498m381j2437k0534k7960
$$ 759569 793622 826330 857301 885998 910841 929681 941047 944545 940164 927727 907193 879233
57376H79233l3882l7815l9924m0983m1820m2524m2385m0792l8070l5260l3189
$$ 879233 845351 807536 767612 726629 684809 642285 599900 559108 521038 485778 452589
57365D52589l1826l0478k8480k5796k2997k0665j8910j7511j6302j5214j4155
$$ 452589 420763 390285 361805 336009 313012 292347 273437 255926 239624 224410 210255
57354B10255j3121j2293j1714j1048j0028q946q205p571o510n234m621m910n213
$$ 210255 197134 184841 173127 162079 152051 143105 134900 127329 120819 115585 110964 106054 100841
57341A00841m768m060m046m703n042m461l463k882k961l309l475l272k706j894
$$ 100841 96073 92013 87967 83264 78222 73761 70298 67416 64455 61146 57671 54399 51693 49799
57327D9799j127q40j343k489l640m168l993l546l197k836k165j266o81p94j318
$$ 49799 48672 47832 46489 44000 40360 36192 32199 28653 25456 22620 20455 19189 18508 17714 16396
57312A6396j576j294r74j274k162k924l018E79a544j774j412j043r00j121j547
$$ 16396 14820 13526 12552 11278 9116 6192 3174 579 -1544 -3318 -4730 -5773 -6673 -7794 -9341
57297i341j801j594r80l90k38m30n52n54q63j599k109j817j161j065j611j906
$$ -9341 -11142 -12736 -13716 -14106 -14344 -14774 -15326 -15880 -16743 -18342 -20451 -22268 -23429 -24494 -26105 -28011
57281b8011j339l87R5j52p98j491k016k161j902j550j387j174m62O20J260R01
$$ -28011 -29350 -29737 -29642 -29794 -30592 -32083 -34099 -36260 -38162 -39712 -41099 -42273 -42735 -42115 -40855 -39954
57265c9954k3n71l53K15O47R22J178J268R73M79K60N86J362K295K960K932K253
$$ -39954 -39977 -40548 -40901 -40686 -40039 -39117 -37939 -36671 -35698 -35219 -34959 -34373 -33011 -30716 -27756 -24824 -22571
57248b2571J662J882K760L497L727L754a483B271L686M058M984N896O298O338
$$ -22571 -20909 -19027 -16267 -12770 -9043 -5289 -1483 2271 5957 10015 14999 20895 27193 33531
57234C3531O317O241O273O930Q231R220R027Q093P521P610P737P494P096O739
$$ 33531 39848 46089 52362 59292 67523 76743 85770 93863 101384 108994 116731 124225 131321 138060
57220A38060O292N716N177M661L963L075K167J251L49j03L52J334J795J240K43
$$ 138060 144352 150068 155245 159906 163869 166944 169111 170362 170711 170608 170960 172294 174089 175329 175572
57205A75572m33q31j570k996m770o211o875o886o728o618o285n465m429l686l349
$$ 175572 175139 174308 172738 169742 164972 158761 151886 145000 138272 131654 125369 119904 115475 111789 108440
57190A08440l114k693k014j088r4N65O55M19J85j11o26j032p86J30J133J653J456
$$ 108440 105326 102633 100619 99531 99437 100002 100657 101076 101261 101150 100524 99492 98706 98836 99969 101622 103078
57173A03078O18l68o44L35K221M271O183Q001R488J0319J0723J1316J2327J3530
$$ 103078 103696 103328 102684 103019 105240 109511 115694 123695 133183 143502 154225 165541 177868 191398
57159A91398J4767J5914J6498J6166J5435J5269J5846J6504J6885J7280J7843
$$ 191398 206165 222079 238577 254743 270178 285447 301293 317797 334682 351962 369805
57148C69805J8236J8317J8375J8457J8099J7139J6089J5453J5125J4767J4297
$$ 369805 388041 406358 424733 443190 461289 478428 494517 509970 525095 539862 554159
57137E54159J3782J3266J2877J2747J2777J2866J3312J4434J5830J6716J6925
$$ 554159 567941 581207 594084 606831 619608 632474 645786 660220 676050 692766 709691
57126G09691J6949J6992J6769J6257J5815J5451J4817J4041J3629J3357J2264
$$ 709691 726640 743632 760401 776658 792473 807924 822741 836782 850411 863768 876032
57115H76032J0139Q024O845O385O095N992O191O306O066N866O142O717P253P756
$$ 876032 886171 894195 901040 907425 913520 919512 925703 932009 938075 943941 950083 956800 964053 971809
57101I71809Q178Q155P651P195O940O095L890O18k849o076r139j2148j5276j8853
$$ 971809 979987 988142 995793 1002988 1009928 1016023 1019913 1020531 1017682 1011606 1002467 990319 975043 956190
57087I56190k3021k7654l2796l8691m5228n2054n9276o7260p5579q3265r0370
$$ 956190 933169 905515 872719 834028 788800 736746 677470 610210 534631 451366 360996
57076C60996r8044j06590D1613h0071j28599j37348j48727j62786j79785j99445
$$ 360996 262952 156362 41613 -80071 -208670 -346018 -494745 -657531 -837316 -1036761
57066a036761k20334k41346k63294k87886l15694l46162l78974m14348m52623
$$ -1036761 -1257095 -1498441 -1761735 -2049621 -2365315 -2711477 -3090451 -3504799 -3957422
57057c957422m94645n41944n95557o55369p21604p96135q81197r77795j086658
$$ -3957422 -4452067 -4994011 -5589568 -6244937 -6966541 -7762676 -8643873 -9621668 -10708326
57048a0708326j209888j350184j509413j689759j895718k133316k408084k725790
$$ -10708326 -11918214 -13268398 -14777811 -16467570 -18363288 -20496604 -22904688 -25630478
57040b5630478l094809l525530m026816m603966n259263n992310o799440p674938
$$ -25630478 -28725287 -32250817 -36277633 -40881599 -46140862 -52133172 -58932612 -66607550
57032f6607550q615012r621823j0703194j1863889j3090265j4342904j5573141
$$ -66607550 -75222562 -84844385 -95547579 -107411468 -120501733 -134844637 -150417778
57025a50417778j6750068j7851597j8793675j9349115j9155905j7857871j5300421
$$ -150417778 -167167846 -185019443 -203813118 -223162233 -242318138 -260176009 -275476430
57018b75476430j1643611p313907k832477J369900N054163Q161562J0730531J2812927
$$ -275476430 -287120041 -294433948 -297266425 -295896525 -290842362 -282680800 -271950269 -259137342
57010b59137342J4438187J5624252J6401619J6821344J6941968J6807900J6436365
$$ -259137342 -244699155 -229074903 -212673284 -195851940 -178909972 -162102072 -145665707
57003a45665707J5824208J4971627J3905028J2681719J1376180J0061993Q800229
$$ -145665707 -129841499 -114869872 -100964844 -88283125 -76906945 -66844952 -58044723
56996e8044723P634384O588797N670824M876339M195213L614450L120307K700336
$$ -58044723 -50410339 -43821542 -38150718 -33274379 -29079166 -25464716 -22344409 -19644073
56988a9644073K344080K042171J785785J567242J380249J219383J080164R59617
$$ -19644073 -17299993 -15257822 -13472037 -11904795 -10524546 -9305163 -8224999 -7265382
56980g265382Q55685P65758O86766O16771N55317N01835M54715M12471L74758
$$ -7265382 -6409697 -5643939 -4957173 -4340402 -3785085 -3283250 -2828535 -2416064 -2041306
56971b041306L41601L12349K85951K61700K39154K17946a84575d924A57790J46662
$$ -2041306 -1699705 -1387356 -1101405 -839705 -600551 -382605 -184575 -4924 157790 304452
56961C04452J31156J16455J02831R0267P8877O8987O0431N2445M4614L7381L1302
$$ 304452 435608 552063 654894 745161 824038 893025 953456 1005901 1050515 1087896 1119198
56950A119198K6298K1830J7410J2792Q191M370J810k05k881o178q602q492m345
$$ 1119198 1145496 1167326 1184736 1197528 1205719 1210089 1211899 1211694 1208813 1202635 1194033 1185541 1181196
56937A181196N673K1520L6926L9827K1189j5618n5922q5080r8250r9859r6376
$$ 1181196 1186869 1208389 1245315 1285142 1306331 1290713 1234791 1149711 1051461 951602 855226
56926H55226r1223q5096p8266p1476o5462o0548n6661n3447n0412m7194m3789
$$ 855226 764003 678907 600641 529165 463703 403155 346494 293047 242635 195441 151652
56915A51652m0444l7309l4276H418a9756k5406k2960k0830j9135j7975j7009j5558
$$ 151652 111208 73899 39623 8418 -19756 -45162 -68122 -88952 -108087 -126062 -143071 -158629
56903a58629j3293j0509p634m736j791R57L191M954O449P592Q034P558O222M278
$$ -158629 -171922 -182431 -190065 -194801 -196592 -195635 -192444 -187490 -181041 -173449 -165415 -157857 -151635 -147357
56889a47357K232P94L25M09L46Qj59L1K47K66M19J112K280L498M466N108N540
$$ -147357 -145125 -144331 -144006 -143597 -143251 -143243 -143402 -143371 -143124 -142858 -142439 -141327 -139047 -135549 -131083 -125975 -120435
56872a20435O149P421R280J0687J0328P729L556j032n004p628q600q317p698p421
$$ -120435 -114286 -106865 -97585 -86898 -76570 -68841 -65285 -66317 -71321 -78949 -87549 -95866 -103564 -110985
56858a10985p444p368p024o497n780m740l445k220j351q32m58rN66J059J184R78
$$ -110985 -118429 -125797 -132821 -139318 -145098 -149838 -153283 -155503 -156854 -157686 -158144 -158153 -157587 -156528 -155344 -154366
56842a54366R86J695K901L880M256M371M688N194N590N833O172O724P293P603
$$ -154366 -153380 -151685 -148784 -144904 -140648 -136277 -131589 -126395 -120805 -114972 -108800 -102076 -94783 -87180
56828h7180P690Q002R104J0997J2660J2578J0099O152K409j67j758k916l795m123
$$ -87180 -79490 -71488 -62384 -51387 -38727 -26149 -16050 -9898 -7489 -7656 -9414 -12330 -16125 -20248
56814b0248l613k265m24J335K606L484M426N709a749G095J0550J2441J4459J6482
$$ -20248 -23861 -26126 -26550 -25215 -22609 -19125 -14699 -8990 -1749 7095 17645 30086 44545 61027
56800F1027J8455K0203K1147K0499J7838J3521Q442L462r37m566p286q839q918
$$ 61027 79482 99685 120832 141331 159169 172690 181132 184594 183657 179091 171805 162966 154048
56787A54048p367m516j292J204K510L168M175O103Q809J1914J5220J8670K2138
$$ 154048 146681 142165 140873 142077 144587 147755 151930 158033 166842 178756 193976 212646 234784
56774B34784K5434K8333L0372L0623K7934K1697J2637K799n618j1710j6056j9397
$$ 234784 260218 288551 318923 349546 377480 399177 411814 414613 408995 397285 381229 361832
56762C61832k1504k1740k0318j8285j6257j3924j1059q159n660l067L68M442Q149
$$ 361832 340328 318588 298270 279985 263728 249804 238745 230586 224926 221859 222227 226669 234818
56749B34818J0936J3291J5944J8882K1167K1337J8112J1293K272o648j3696j8449
$$ 234818 245754 259045 274989 293871 315038 336375 354487 365780 368052 361404 347708 329259
56737C29259k1296k2498k2068k0322j8074j6038j4236j2220r815p308m926k489
$$ 329259 307963 285465 263397 243075 225001 208963 194727 182507 172692 165384 160458 157969
56725A57969J64K718M779O502Q343J0221J1406J1162R095N068n42o406j0842j3174
$$ 157969 158133 160851 165630 172132 180475 190696 202102 213264 222359 227427 226885 220479 209637 196463
56711A96463j4013j4076j3446j2277j1312j0999j0764r904q768q201q201p904
$$ 196463 182450 168374 154928 142651 131339 120340 109576 99672 90904 82703 74502 66598
56699F6598o794n228l808k893k590k680k601k012j298j073j320j534j529j493
$$ 66598 59804 54576 50768 47875 45285 42605 40004 37992 36694 35621 34301 32767 31238 29745
56685B9745j406j049n57l63n31p10p21o89o56o00p41j221j474p34Q21J979J858
$$ 29745 28339 27290 26733 26370 25839 25129 24408 23719 23063 22463 21722 20501 19027 18293 19114 21093 22951
56668B2951P80k65n69m6P99J103L74q45j499j294q58o73n03q5K67J70k21m65l71
$$ 22951 23731 23466 22897 22851 23650 24753 25127 24282 22783 21489 20631 19958 19455 19370 19637 19807 19586 19121 18750
56649A8750r7J3l92j207j670j147q9M24J72qL36O54N58O48J435K182J782L25j051
$$ 18750 18653 18666 18274 17067 15397 14250 14161 14585 14757 14749 15085 15739 16297 16945 18380 20562 22344 22669 21618
56630B1618j595j419p89K14J278J812J541P94J04j48J21N86O06r6q58p32K64J006
$$ 21618 20023 18604 17815 18029 19307 21119 22660 23454 23558 23410 23531 24117 24723 24627 23769 23037 23301 24307
56612B4307O53k64n37K16J206J612J520J478J539J321Q23O03R26J296J196Q45
$$ 24307 24960 24696 24159 24375 25581 27193 28713 30191 31730 33051 33874 34477 35403 36699 37895 38740
56596C8740P36Q30P47N93Q41J457J727J151J11n58m02K03L35o09k075k705j901
$$ 38740 39476 40306 41053 41646 42487 43944 45671 46822 46933 46375 45973 46176 46511 45902 43827 41122 39221
56579C9221o12m4p5J83P15O80M7j44N63J247R46j15j139j743j741q51O94J854
$$ 39221 38609 38565 38490 38673 39388 40068 40115 39971 40534 41781 42727 42612 41473 39730 37989 37138 37832 39686
56561C9686J876J173N97L79L28N26J027J363J086N46M30P58R80Q95Q30R23Q78
$$ 39686 41562 42735 43332 43711 44039 44565 45592 46955 48041 48587 49017 49775 50755 51650 52480 53403 54281
56544E4281N21J81L30R55J400R47l22j378j324m42K63M08M25N47N14M06P49J460
$$ 54281 54802 54983 55313 56268 57668 58615 58293 56915 55591 55149 55412 55820 56245 56792 57306 57712 58461 59921
56526E9921J692J208R60J545K130J754R08P54J408K108K555K927K946K140R83
$$ 59921 61613 62821 63781 65326 67456 69210 70118 70872 72280 74388 76943 79870 82816 84956 85939
56511H5939O07J223J825J697J326J518K238K850L047L177L752M813N814O119N647
$$ 85939 86546 87769 89594 91291 92617 94135 96373 99223 102270 105447 109199 114012 119826 125945 131592
56496A31592M871M201L703L491L747M150L886K703J405Q90J182J812K505K903
$$ 131592 136463 140664 144367 147858 151605 155755 159641 162344 163749 164639 165821 167633 170138 173041
56482A73041K345P55q55j559j719k123k568k418k092k584l666l946k986k010k116
$$ 173041 175386 176141 175286 173727 172008 169885 167317 164899 162807 160223 156557 152611 149625 147615 145499
56467A45499k863l247l186l279l651l874l679l177k452j499n63j67n74j370j763
$$ 145499 142636 139389 136203 132924 129273 125399 121720 118543 116091 114592 114029 113862 113288 111918 110155
56452A10155j401p00k27J6L68P03N48L6m2N25Q21J01j060j546j198p35o21p53
$$ 110155 108754 108054 107827 107843 108211 108914 109462 109498 109456 109981 110802 110903 109843 108297 107099 106364 105743 104990
56434A04990j013j338j391p96K61J177J566J417Q85L09J26K82J81m41j070j270
$$ 104990 103977 102639 101248 100452 100713 101890 103456 104873 105758 106067 106193 106475 106656 106215 105145 103875
56418A03875j324j443j083R2J268J491J124J177J703J996J993K193K425J973R63
$$ 103875 102551 101108 100025 100117 101385 102876 104000 105177 106880 108876 110869 113062 115487 117460 118423
56403A18423M16Q09J593K303L059L814M096L777L293K952K750K831L334L779L541
$$ 118423 118839 119648 121241 123544 126603 130417 134513 138290 141583 144535 147285 150116 153450 157229 160770
56388A60770K927K787L058K709J432K70J81P76R99L92o56j465j570j143r36j372
$$ 160770 163697 166484 169542 172251 173683 173953 174134 174910 175909 176301 175645 174180 172610 171467 170531 169159
56372A69159j882j688j011o88q39r46j079j910l358m341m193l470l006l001l197
$$ 169159 167277 165589 164578 163890 163051 162105 161026 159116 155758 151417 147224 143754 140748 137747 134550
56357A34550l327l076k352j617j363j300q23j53k5l73l86J08L88J07k33k48o3
$$ 134550 131223 128147 125795 124178 122815 121515 120692 120539 120514 120141 119755 119863 120251 120358 120125 119877 119814
56340A19814L67J207J944J792J087R94J615J693O46n29r06r25j309j819j960j991
$$ 119814 120181 121388 123332 125124 126211 127205 128820 130513 131159 130630 129724 128799 127490 125671 123711 121720
56324A21720k356k765k596j729n23M96O87j52j077p70O69J695J416O50M57P49
$$ 121720 119364 116599 114003 112274 111751 112247 112934 112782 111705 110935 111604 113299 114715 115365 115822 116571
56308A16571R88J209J604J891J823J587J229M80m27o22J26R41J142J172J669K474
$$ 116571 117559 118768 120372 122263 124086 125673 126902 127382 126955 126333 126459 127400 128542 129714 131383 133857
56292A33857L104L372L113K147R74N38R36J306J292J425J710J298K17j15J024
$$ 133857 136961 140333 143446 145593 146567 147105 148041 149347 150639 152064 153774 155072 155289 155174 156198
56277A56198K426K913L107M013N071N093M203L435L042K535J908J622J806K357
$$ 156198 158624 161537 164644 168657 173728 178821 183024 186459 189501 192036 193944 195566 197372 199729
56263A99729L336M445M840M277L687L753L789L040K175K217K790K766K139J936
$$ 199729 203065 207510 212350 216627 220314 224067 227856 230896 233071 235288 238078 240844 242983 244919
56249B44919K562L432L987M166M062L904M048M410M385L921L825M322M292K989
$$ 244919 247481 250913 254900 259066 263128 267032 271080 275490 279875 283796 287621 291943 296235 299224
56235B99224J538J450K453L108L016K933L173L219K847K348J854J321J035J254
$$ 299224 300762 302212 304665 307773 310789 313722 316895 320114 322961 325309 327163 328484 329519 330773
56221C30773J646J896K403L555M836N550N921O472O963P011P192Q284R869J0916
$$ 330773 332419 334315 336718 340273 345109 350659 356580 363052 370015 377026 384218 392502 402371 413287
56207D13287J1437J2310J3777J5306J6762J8496K0343K1683K2592K3926K6164
$$ 413287 424724 437034 450811 466117 482879 501375 521718 543401 565993 589919 616083
56196F16083K8885L1489L3815L6138L8943M2463M5988M8218M8760M8745M9326
$$ 616083 644968 676457 710272 746410 785353 827816 873804 922022 970782 1019527 1068853
56185A068853N0285N0709N0198M8561M5188L9897L3743K7929K2467J6812J1166
$$ 1068853 1119138 1169847 1220045 1268606 1313794 1353691 1387434 1415363 1437830 1454642 1465808
56174A465808O023J190l665q058j1423j4216j7051j9446k0627k1028k1609k2284
$$ 1465808 1471831 1473021 1469356 1461298 1449875 1435659 1418608 1399162 1378535 1357507 1335898 1313614
56162A313614k2346k2117k2637k4049k5565k6854k8220k9602l0606l1378l2351
$$ 1313614 1291268 1269151 1246514 1222465 1196900 1170046 1141826 1112224 1081618 1050240 1017889
56151A017889l3232l3374l2918l2612l2594l2303l1398l0016k8382k6771k5416
$$ 1017889 984657 951283 918365 885753 853159 820856 789458 759442 731060 704289 678873
56140F78873k3956k1706j9062j7569j7737j8001j6914j5124j3846j2723j0842
$$ 678873 654917 633211 614149 596580 578843 560842 543928 528804 514958 502235 491393
56129D91393q819p858p633p005o129n897n924n132l851l302l320k584r98J60L92
$$ 491393 482574 474716 467083 460078 453949 448052 442128 436996 433145 429843 426523 423939 422941 423101 423493
56114D23493M99R16J254J482K029K688K927L099L889M845N039M862N463O685P318
$$ 423493 423992 424908 426162 427644 429673 432361 435288 438387 442276 447121 452160 457022 462485 469170 476488
56099D76488P206P302P795Q046Q299R528J1464J2621J2527J2308J2788J3556J4141
$$ 476488 483694 490996 498791 506837 515136 524664 536128 548749 561276 573584 586372 599928 614069
56086F14069J4683J5226J5584J5982J6794J7812J8888K0701K3578K6211K7210
$$ 614069 628752 643978 659562 675544 692338 710150 729038 749739 773317 799528 826738
56075H26738K7401K8802L1899L5695L9897M5034N0773N6169O1330O6886P1977
$$ 826738 854139 882941 914840 950535 990432 1035466 1086239 1142408 1203738 1270624 1342601
56064A342601P4745P4536P1871O6772N9321N1460M5824M2727M0232L6933L2643
$$ 1342601 1417346 1491882 1563753 1630525 1689846 1741306 1787130 1829857 1870089 1907022 1939665
56053A939665K6775J8635R234O13o671j3260j8760k2264k4949k9418l6368m4274
$$ 1939665 1966440 1985075 1994309 1994922 1988251 1974991 1956231 1933967 1909018 1879600 1843232 1798958
56041A798958n2177o0124o6902p0320p0226o8649o6544o2854n7259n1215m5692
$$ 1798958 1746781 1686657 1619755 1549435 1479209 1410560 1344016 1281162 1223903 1172688 1126996
56030A126996m0188l4505k9391k4970k0634j6570j3480j0839p650m615l196k927
$$ 1126996 1086808 1052303 1022912 997942 977308 960738 947258 936419 928769 924154 920958 918031
56018I18031k236j468k085l326k956j208n27j235j106N00J609J409J587L117M852
$$ 918031 915795 914327 912242 908916 905960 904752 904225 902990 901884 902384 903993 905402 906989 910106 914958
56003I14958O088P526R082R758J0120J1794J4162J4901J4051J4060J5480J6315
$$ 914958 921046 928572 937654 947412 957532 969326 983488 998389 1012440 1026500 1041980 1058295
55991A058295J6123J6804J8696J9819J9794K0639K2770K4150K4346K5379K7602
$$ 1058295 1074418 1091222 1109918 1129737 1149531 1170170 1192940 1217090 1241436 1266815 1294417
55980A294417K8786K8434K8898L1055L2967L3925L5674L8445M0052M0183M1269
$$ 1294417 1323203 1351637 1380535 1411590 1444557 1478482 1514156 1552601 1592653 1632836 1674105
55969A674105M3929M5970M7035M9585N4004N7529N9435O2318O6812P0183P1797
$$ 1674105 1718034 1764004 1811039 1860624 1914628 1972157 2031592 2093910 2160722 2230905 2302702
55958B302702P4640P9545Q3397Q5053Q7676R2953R8503J03199J09535J18299J26507
$$ 2302702 2377342 2456887 2540284 2625337 2713013 2805966 2904469 3007668 3117203 3235502 3362009
55947C362009J32995J40430J49504J57197J63098J71131J82437J93205K02337
$$ 3362009 3495004 3635434 3784938 3942135 4105233 4276364 4458801 4652006 4854343
55938D854343K14255K30924K47983K62273K76159K91075L04237L15483L29770
$$ 4854343 5068598 5299522 5547505 5809778 6085937 6377012 6681249 6996732 7326502
55929G326502L48799L67834L84775M04440M29640M56415M82592N12324N47537
$$ 7326502 7675301 8043135 8427910 8832350 9261990 9718405 10200997 10713321 11260858
55920A1260858N83991O20597O63050P13193P65064Q16807Q75472R44407J017876
$$ 11260858 11844849 12465446 13128496 13841689 14606753 15423560 16299032 17243439 18261315
55911A8261315J094503J183068J287912J402463J525436J669352J844876K052434
$$ 18261315 19355818 20538886 21826798 23229261 24754697 26424049 28268925 30321359
55903C0321359K297557K595497K949062L341421L763814M230006M751036N321953
$$ 30321359 32618916 35214413 38163475 41504896 45268710 49498716 54249752 59571705
55895E9571705N951351O676612P530404Q524251R686830J1073762J2700225J4498092
$$ 59571705 65523056 72199668 79730072 88254323 97941153 109014915 121715140 136213232
55887A36213232J6346446J8012509J8928624J8140830J4807350Q978170J845694
$$ 136213232 152559678 170572187 189500811 207641641 222448991 231427161 233272855
55880B33272855m908532j0079967j3361557j5061715j5641640j5495012j4923743
$$ 233272855 228364323 218284356 204922799 189861084 174219444 158724432 143800689
55873A43800689j4127879j3201543j2183361j1108958j0010785q908301p830229
$$ 143800689 129672810 116471267 104287906 93178948 83168163 74259862 66429633
55866F6429633o826715n938188n168831m505151l941112l470004l071243k724543
$$ 66429633 59602918 53664730 48495899 43990748 40049636 36579632 33508389 30783846
55858C0783846k425360k173121j956776j764573j596188j452919j326338j207768
$$ 30783846 28358486 26185365 24228589 22464016 20867828 19414909 18088571 16880803
55850A6880803j099342j005227r20977q41132p68738p07819o54269o02935n56405
$$ 16880803 15781461 14776234 13855257 13014125 12245387 11537568 10883299 10280364 9723959
55841I723959n18385m85285m52239m21098l95065l71608l47613l25563l07880
$$ 9723959 9205574 8720289 8268050 7846952 7451887 7080279 6732666 6407103 6099223
55832F099223k90972k71375k52209k37294k24238k09453j94794j83192j72632
$$ 6099223 5808251 5536876 5284667 5047373 4823135 4613682 4418888 4235696 4063064
55823D063064j60318j48158j38596j29590j19065j09821j04640j00832r4816q7866
$$ 4063064 3902746 3754588 3615992 3486402 3367337 3257516 3152876 3052044 2957228 2869362
55813B869362q2439p7018o9794o3350o0536n9495n7700n7199o0744o6200o9780
$$ 2869362 2786923 2709905 2640111 2576761 2516225 2456730 2399030 2341831 2281087 2214887 2145107
55802B145107p1688p3888p5234p3627p0259o7335o4121n9152n3710m9358m5004
$$ 2145107 2073419 1999531 1924297 1850670 1780411 1713076 1648955 1589803 1536093 1486735 1441731
55791A441731m0001l7032l8008m0257m0579m0043m0769m1291l9306l6118l3976
$$ 1441731 1401730 1364698 1326690 1286433 1245854 1205811 1165042 1123751 1084445 1048327 1014351
55780A014351l1815k7873k3965k2716k2898k1756j9771j8918j8377j6128j3012
$$ 1014351 982536 954663 930698 907982 885084 863328 843557 824639 806262 790134 777122
55769G77122j1170j0113q119n804m701m030k528j621l144n668o664o668p786r763
$$ 777122 765952 755839 747720 741916 737215 733185 730657 729036 725892 720224 713560 706892 699106 689343
55755F89343j1035j2033j3918j5653j5780j5461j6329j7089j5736j3400j2407
$$ 689343 678308 666275 652357 636704 620924 605463 589134 572045 556309 542909 530502
55744E30502j2218j0971r383r295r871r110p765p833q464p360n125m165m273l362
$$ 530502 518284 507313 497930 488635 478764 469654 461889 454056 445592 438232 433107 428942 424669 421307
55730D21307j740j519k293j708OJ81j590k857k611k455l053l048k070j612k164
$$ 421307 419567 418048 415755 414047 414053 414234 412644 409787 407176 404721 401668 398620 396550 394938 392774
55715C92774k507k433l328n416p119p658p918q293q148p787q405r593r359p252
$$ 392774 390267 387834 384506 379090 371971 364313 356395 348102 339954 332167 323762 314169 304810 297558
55701B97558n214m710n096n434n867o491o726o521o640p238p438o688n303l624
$$ 297558 292344 287634 282538 277104 271237 264746 258020 251499 244859 237621 230183 223495 218192 214568
55687B14568j867o84n56q48p52o68j225j678j034j30o19k235l145k744k089j780
$$ 214568 212701 212017 211461 210613 209861 209193 207968 206290 205256 205126 204507 202272 199127 196383 194294 192514
55671A92514j348p62o09p73o50n39j196k218k621k684l398m351m224l133k525
$$ 192514 191166 190404 189795 189022 188372 187833 186637 184419 181798 179114 175716 171365 167141 164008 161483
55656A61483k764k846k476k393k549j977p14N5OP7O13Q66O98R77J877K331J652
$$ 161483 158719 155873 153397 151004 148455 146478 145764 145819 145825 145902 146515 147381 148079 149056 150933 153264 154916
55639A54916M11o87j550k111k188k126k452k887k765k247j976j750r08J92N52
$$ 154916 155327 154640 153090 150979 148791 146665 144213 141326 138561 136314 134338 132588 131680 131872 132424
55624A32424K45L59J262K249K795K978K846K563K860M012M863M165K466J225O45
$$ 132424 132669 133028 134290 136539 139334 142312 145158 147721 150581 154593 159456 163621 166087 167312 167957
55609A67957l6p54r29j094k202l644l907l057k612l056l405l235l163l275k904
$$ 167957 167921 167167 166238 165144 162942 159298 155391 152334 149722 146666 143261 140026 136863 133588 130684
55594A30684k121j655j342m09P08P35j92o34k56j98q07j049n05q6k95n61p06j285
$$ 130684 128563 126908 125566 125157 125865 126600 126408 125774 125518 125320 124513 123464 122959 122873 122578 122017 121311 120026
55576A20026k072k007j125q03j556k287k233k019k160k211j942j886k124j977
$$ 120026 117954 115947 114822 114019 112463 110176 107943 105924 103764 101553 99611 97725 95601 93624
55562I3624j424j388k191l041l441l608l283j836N6N95o52k078k370j905j287
$$ 93624 92200 90812 88621 85580 82139 78531 75248 73412 73468 74063 73411 71333 68963 67058 65771
55547F5771l20Q14J077K95k14L65J094R24J83m49j116j873j917q35L85O72K69
$$ 65771 65451 66265 67342 67637 67423 67788 68882 69806 69989 69540 68424 66551 64634 63799 64184 64856 65125
55530F5125K8M7j07n13r16j013m82O41J442R79k29p09p6O48R09J260J839J840
$$ 65125 65153 65200 65093 64580 63664 62651 62169 62810 64252 65231 65002 64293 64217 64865 65774 67034 68873 70713
55512G0713J087N56P00O90O9l32J05O96P71P55J050J062L06o31j134j511k100
$$ 70713 71800 72356 73056 73746 73815 73483 73588 74284 75055 75810 76860 77922 78228 77597 76463 74952 72852
55495G2852k487k420k444k804k757j828p74m41o55r55j430k008j949r79m0m0o13
$$ 72852 70365 67945 65501 62697 59940 58112 57338 56897 56242 55287 53857 51849 49900 48921 48881 48841 48228
55478D8228q99p73n84l80j55j76n35r30j227j485j358m70M78L06p47j168n34o6
$$ 48228 47329 46556 45972 45592 45437 45261 44726 43796 42569 41084 39726 39256 39734 40040 39293 38125 37591 37525
55460C7525l47l41N13J053M27l05J3O86N08j53j82M26R93J537K285K568J647J31
$$ 37525 37178 36837 37350 38403 38830 38525 38538 39224 39732 39579 39397 39823 40816 42353 44638 47206 48853 48984
55442D8984p49p98p23q76j126j498j970k121j762j365j223r76n78o63j250j202
$$ 48984 48235 47437 46714 45838 44712 43214 41244 39123 37361 35996 34773 33797 33219 32556 31306 30104
55426C0104o4Q31J96j278k108k102j857j233R1J275J203K73k20k8R0r0j64k54
$$ 30104 30040 30871 31067 29789 27681 25579 23722 22489 22580 23855 25058 25331 25111 25083 25173 25083 24919 24665
55408B4665p94j395j199k89M61P48R13Q98L08n53q59m37J30M93O74M13n75j750
$$ 24665 23871 22476 21277 20988 21449 22197 23110 24008 24316 23763 22904 22467 22597 23090 23764 24177 23602 21852
55390B1852k088j340k27M71M65j77r48j026j93O64O27l4m74n58o51o24j27M84
$$ 21852 19764 18424 18197 18668 19133 18956 18008 16982 16789 17453 18080 18046 17572 17014 16363 15739 15612 16096
55372A6096N49K35K92Q52J311J297Q99J98o39j051p05j47p2k65j07K65L10J96
$$ 16096 16645 16880 17172 18024 19335 20632 21531 21729 21090 20039 19334 19187 19115 18850 18743 19008 19318 19514
55354A9514M93J005J014N13J54J16N8M2M11Q32O46J33K62J057J359N89l80n70
$$ 19514 20007 21012 22026 22539 22693 22809 22867 22909 23320 24152 24798 24931 25193 26250 27609 28198 27818 27248
55336B7248k39l18j066j855j960j261m11k95j096j924j832j002l60k32p3N07J156
$$ 27248 27009 26691 25625 23770 21810 20549 20138 19843 18747 16823 14991 13989 13629 13397 13324 13831 14987
55319A4987J367J100O79M42N85R36R54K46r33j903k175j654n99K95K13q68j931
$$ 14987 16354 17454 18133 18575 19160 20096 21050 21296 20363 18460 16285 14631 14032 14327 14540 13672 11741
55302A1741j996j155j16P32J267J212N61l5n5P1k53o14j38J035J804J597Q78K11
$$ 11741 9745 8590 8474 9206 10473 11685 12246 12211 12156 12227 11974 11360 11222 12257 14061 15658 16536 16747
55284A6747l72q89j126j053r06p78n66l61m10o04n33k3O64J149J128M40n98j171
$$ 16747 16375 15486 14360 13307 12401 11623 11057 10696 10286 9682 9149 9126 9790 10939 12067 12507 11909 10738
55266A0738p56J98P82O27O5m37o02l43J13L75M18O04R50R59N37L17N55N21k63
$$ 10738 9982 10180 10962 11589 11654 11217 10615 10272 10385 10760 11178 11782 12732 13691 14228 14545 15100 15621 15358
55247A5358r50n02O71J241P64l3m47m04j17P1k44r27j152n62Mk09n56l5R24J013
$$ 15358 14408 13906 14577 15818 16582 16549 16102 15698 15581 15652 15408 14481 13329 12767 12771 12562 12006 11971 12895 13908
55227A3908J01o56o06k03J01M23P45P51M65J71k43r62j399p82M50R55L16n08o27
$$ 13908 14009 13353 12747 12544 12645 13068 13813 14564 15029 15200 14957 13995 12596 11814 12264 13219 13535 13027 12400
55208A2400j84K94N33L31l51j001r80m33k3R5K42L83K97L37R34J503J086m5o66
$$ 12400 12216 12510 13043 13374 13023 12022 11042 10609 10586 10681 10923 11306 11603 11940 12874 14377 15463 15418 14752
55189A4752n34n63j058j173m68M10J014J714K465K373J173k1k48L4o7n24q19q39
$$ 14752 14218 13655 12597 11424 10956 11366 12380 14094 16559 18932 20105 20084 19836 19870 19803 19279 18460 17621
55171A7621o13N2R70J324P33q7l88l62m78m72J23R99J379R73J21o88r68m15O21
$$ 17621 17008 17060 18030 19354 20087 20000 19612 19250 18772 18300 18423 19422 20801 21774 21895 21207 20239 19824 20445
55152B0445J241J036N36K70L0m67p82l84L75O30J27n80r55r61q02n82k72J11L36
$$ 20445 21686 22722 23258 23528 23558 23091 22309 21925 22300 22930 23057 22477 21522 20561 19759 19177 18905 19016 19352
55133A9352J10l80l80N05J483J411L67m34l86k50q50j833k247j696n44N79J083
$$ 19352 19462 19082 18702 19207 20690 22101 22468 22034 21648 21398 20548 18715 16468 14772 14228 14807 15890
55116A5890P37j5l96k25J2k1j28j79l13m49l63l66j008j864j637J5J679J939J070
$$ 15890 16627 16612 16216 15991 16003 15982 15854 15675 15362 14913 14550 14184 13176 11312 9675 9690 11369 13308 14378
55097A4378L24K53N17P63Q57O01J4m26l75j89l56p25q52p24n95m54j63J42K58
$$ 14378 14702 14955 15472 16235 17092 17693 17707 17281 16906 16717 16361 15636 14784 14060 13465 13011 12848 12990 13248
55078A3248K55K18J7l33m58k35j11m09p00m68O0L22L62N84R08P95J57m44n14j61
$$ 13248 13503 13721 13738 13405 12947 12712 12601 12192 11492 11024 11084 11406 11768 12352 13260 14055 14212 13768 13254 13093
55058A3093J74J95k5j39J15O00R27J002J124J434J640J509J252J203J385J622
$$ 13093 13267 13462 13437 13298 13413 14013 14940 15942 17066 18500 20140 21649 22901 24104 25489 27111
55042B7111J816J875J674J245P88L66j07n17o08m55m47o28n68q7M03M95K65m8
$$ 27111 28927 30802 32476 33721 34509 34875 34768 34251 33643 33188 32741 32113 31545 31458 31861 32356 32621 32573
55024C2573l71n32k23M56Q97P45L63K32K56M5m96j121j565j670j455j145q69m25
$$ 32573 32202 31670 31447 31903 32800 33545 33908 34140 34396 34441 33945 32824 31259 29589 28134 26989 26120 25695
55006B5695K65O73K59n61q32l79J46M77R42J376J084J92j50M61Q80J59r77j294
$$ 25695 25960 26633 26892 26331 25499 25120 25266 25743 26685 28061 29145 29337 29187 29648 30528 30687 29710 28416
54988B8416p95k96p6R8J74N5J12N88R23N50j89o29p77q47m84N29J314Q64l75r98
$$ 28416 27621 27325 27249 27347 27521 27576 27688 28276 29199 29749 29560 28931 28154 27307 26823 27352 28666 29530 29155 28157
54968B8157n30K23N82O48O05M21L44P58J370J426Q74N27P98J052O22j81m79N3
$$ 28157 27627 27850 28432 29080 29685 30106 30450 31208 32578 34004 34878 35405 36203 37255 37877 37696 37217 37270
54950C7270Q64J103M34o45j219q44K7O29O70L89J03K2K12N00O26O72J012J613
$$ 37270 38134 39237 39671 39026 37807 36963 36990 37619 38289 38678 38781 38803 39015 39515 40141 40813 41825 43438
54932D3438J885J493Q38L72N8j37R5O53P32J5n44j21N08J6j345k026j434n88l79
$$ 43438 45323 46816 47654 48026 48084 47947 48042 48695 49427 49442 48898 48777 49285 49301 47956 45930 44496 43908 43529
54913D3529m42j28M22O75N22J50l20p29p99n15j87l6N7K53N28P75Q16L64n39j151
$$ 43529 43087 42959 43381 44056 44578 44728 44408 43679 42880 42365 42178 42142 42199 42452 42980 43755 44571 44935 44396 43245
54893D3245o72O74J736J771J189Q27R12J040R45R19J480K670L762L953L361L000
$$ 43245 42573 43247 44983 46754 47943 48770 49682 50722 51667 52586 54066 56736 60498 64451 67812 70812
54877G0812L555M614N461O113O978P872Q107P400O078M451K580O36j094k507l671
$$ 70812 74367 78981 84442 90555 97533 105405 113512 120912 126990 131441 134021 134657 133563 131056 127385
54862A27385m529n025n356n706n911n811n598n382m788l583k379j990k343k763
$$ 127385 122856 117831 112475 106769 100858 95047 89449 84067 79279 75696 73317 71327 68984 66221
54848F6221k998l160k950j955n87K54N09R74J928K721K946L022L277L388L159
$$ 66221 63223 60063 57113 55158 54571 54825 55334 56308 58236 60957 63903 66925 70202 73590 76749
54833G6749L079L569M302M738M826M745M505M161L924L631K650P34j462l167m308
$$ 76749 79828 83397 87699 92437 97263 102008 106513 110674 114598 118229 120879 121613 120151 116984 112676
54818A12676n168n670n600n270n259n633n804n232m002k754k152k316k672k507
$$ 112676 107508 101838 96238 90968 85709 80076 74272 69040 65038 62284 60132 57816 55144 52637
54804E2637j770j073q68r59r46p77o22m61j36L40P48Q88P28M47L51N43P05M61
$$ 52637 50867 49794 48926 47967 47021 46244 45622 45161 45025 45365 46113 47001 47729 48176 48527 49070 49775 50236
54786E0236n4l64m24p47j548k190j984j196q02j235j910k056j662j246j020o92
$$ 50236 50182 49818 49394 48647 47099 44909 42925 41729 40927 39692 37782 35726 34064 32818 31798 31106
54770C1106p6N07O48L73J3k16k23Q3N30N60j11q33p38l8K71J9J71J178K054J786
$$ 31106 31030 31537 32185 32558 32571 32355 32132 32215 32745 33305 33194 32361 31623 31585 31856 31875 32046 33224 35278 37064
54750C7064Q19K51K09L2l89m78j3O01R93J078P85J93j50K18R90J490J575J526
$$ 37064 37883 38134 38343 38375 37986 37508 37495 38096 39089 40167 40952 41145 40995 41213 42203 43693 45268 46794
54732D6794J384J165J318K180L144L341K972K990L573M007M073M445N466O525
$$ 46794 48178 49343 50661 52841 55985 59326 62298 65288 68861 72868 76941 81386 86852 93377
54718I3377O915O540N577M245L110K728K764K267J022j90q88j427k025k281k189
$$ 93377 100292 106832 112409 116654 119764 122492 125256 127523 128545 128355 127467 126040 124015 121734 119545
54703A19545k580l812m858m539l084j748j265j391j566j424q46o7M16L98K30L57
$$ 119545 116965 113153 108295 103756 100672 98924 97659 96268 94702 93278 92432 92365 92781 93179 93409 93766
54687I3766Q29J452K088K637L132L881N094O263O590O075N627N821O285O483O384
$$ 93766 94595 96047 98135 100772 103904 107785 112879 119142 125732 131807 137434 143255 149540 156023 162407
54672A62407O002N038L459J773K34j628m113o602q222q816q741q274p674p385
$$ 162407 168409 173447 176906 178679 178913 177285 173172 166570 158348 149532 140791 132517 124843 117458
54658A17458p490p366o439m990l794l257l321l802m331m401l916l335k896k229
$$ 117458 109968 102602 96163 91173 87379 84122 80801 76999 72668 68267 64351 61016 58120 55891
54644E5891j136k15m7k54l7O68J195J092M91k71q31q46l67N1j7l54n31n13l76
$$ 55891 54755 54540 54493 54239 54202 54870 56065 57157 57648 57377 56546 55700 55333 55384 55367 55013 54482 53969 53593
54625E3593kN61Q32O05M59R34J627J786J428J111R69Q32R31J608K451K659K225
$$ 53593 53591 54152 54984 55589 56048 56982 58609 60395 61823 62934 63903 64735 65666 67274 69725 72384 74609
54608G4609J878J872J802J622J927K868L635L508K744K035J551J044M40j17n72
$$ 74609 76487 78359 80161 81783 83710 86578 90213 93721 96465 98500 100051 101095 101535 101418 100846
54593A00846q92r39o84m18m00n25n15l19o5K87R30J803K430K390J889J683K254
$$ 100846 99954 99015 98331 97913 97513 96988 96473 96154 96089 96376 97306 99109 101539 103929 105818 107501 109755
54576A09755L253L982M358M888N669O048N725N585O678Q555R453Q289N795L428
$$ 109755 113008 116990 121348 126236 131905 137953 143678 149263 155941 164496 173949 182238 188033 191461
54562A91461J692J17j616l126m023m504n014n571n813n613n299n136m962m557
$$ 191461 193153 193270 191654 188528 184505 180001 174987 169416 163603 157990 152691 147555 142593 138036
54548A38036m100l851l620k981k087j690k182l043l525l506l320l077k628k086
$$ 138036 133936 130085 126465 123484 121397 119707 117525 114482 110957 107451 104131 101054 98426 96340
54534I6340j896k264k787k819k167j298q48r53j189j187j112j310j660j676j201
$$ 96340 94444 92180 89393 86574 84407 83109 82261 81308 80119 78932 77820 76510 74850 73174 71973
54519G1973o30l49k94k39j85l66r35j763k376k238j390o11n59q99q31l13r7m14
$$ 71973 71343 70994 70700 70461 70276 69910 68975 67212 64836 62598 61208 60597 60038 59139 58308 57995 57898 57484
54501E7484n10J82J085J209L81o95j284j142n12M4P7k54l90j75J0M6L99J282K093
$$ 57484 56974 57156 58241 59450 59831 59136 57852 56710 56198 56242 56319 56065 55675 55500 55510 55556 55955 57237 59330
54482E9330K164J638J119Q25N88M15N31R98J621K079K032J444Q98J118J994K654
$$ 59330 61494 63132 64251 65076 65664 66079 66610 67608 69229 71308 73340 74784 75682 76800 78794 81448
54466H1448K772K972L595L830K916J567J281K451L926M405L621K241J087N03J85
$$ 81448 84220 87192 90787 94617 97533 99100 100381 102832 106758 111163 114784 117025 118112 118615 118800
54451A18800l24j003j502j922k722l692l878k987k050j998k381k260j684j354
$$ 118800 118476 117473 115971 114049 111327 107635 103757 100770 98720 96722 94341 92081 90397 89043
54437H9043j386j388j334j395j241m74N06R24O60J14n83j312j375k75J150J559
$$ 89043 87657 86269 84935 83540 82299 81825 82331 83255 83915 84029 83446 82134 80759 80484 81634 83193
54421H3193R06L72N71R09Q00L97O7l0K93J003J364O93m53q06j34N95Q08Q99J063
$$ 83193 84099 84471 85042 85951 86751 87148 87215 87185 87478 88481 89845 90538 90085 89279 89145 89740 90548 91447 92510
54402I2510Q39K01n1M26Q56N93K8k29k86l79j99N07J266J447J066M95n5l82k33
$$ 92510 93349 93550 93499 93925 94781 95374 95402 95173 94887 94508 94309 94816 96082 97529 98595 99090 99035 98653 98420
54383I8420J12q9r57j624j512j248j636k390k621k109j296m53M00R92R07J75p54
$$ 98420 98532 98443 97486 95862 94350 93102 91466 89076 86455 84346 83050 82597 82997 83989 84896 85071 84317
54366H4317j397j384n53O44J274R05J33k68k99l56l91j16K96L65M2k65k37J72
$$ 84317 82920 81536 80983 81627 82901 83806 83939 83671 83372 83016 82625 82509 82805 83170 83212 82947 82710 82882
54348H2882R31J877K642L013L102K944K359J618J545K395L145K857K163K419L575
$$ 82882 83813 85690 88332 91345 94447 97391 99750 101368 102913 105308 108453 111310 113473 115892 119467
54333A19467M143L333K055J398J168O41o0k05K63N43O9q65j695k301k848l274
$$ 119467 123610 126943 128998 130396 131564 132205 132145 131940 132203 132746 132815 131950 130255 127954 125106 121832
54317A21832l299k924k533k388k236j725j062q48j263j747j691j158o85o10q62
$$ 121832 118533 115609 113076 110688 108452 106727 105665 104817 103554 101807 100116 98958 98273 97663 96801
54302I6801j218j434j291p99l31k61m87n64k35L33Q23J069J072R32Q03Q20R82
$$ 96801 95583 94149 92858 92059 91728 91467 90980 90416 90181 90514 91337 92406 93478 94410 95213 96033 97015
54285I7015J190J357J501J724K120K550K652K182J387P29K89k31q71j261j249
$$ 97015 98205 99562 101063 102787 104907 107457 110109 112291 113678 114407 114696 114465 113594 112333 111084
54270A11084j220j477j719j623j508j839k358k391j925j673j992k423k498k387
$$ 111084 109864 108387 106668 105045 103537 101698 99340 96949 95024 93351 91359 88936 86438 84051
54256H4051k390k348k033j705j697j760j437r04q23j355j911k067k076k257k407
$$ 84051 81661 79313 77280 75575 73878 72118 70681 69777 68954 67599 65688 63621 61545 59288 56881
54241E6881k228j853j525j130n63k57o50j319j405q62n15p63r98o08J59O73P25
$$ 56881 54653 52800 51275 50145 49582 49325 48675 47356 45951 45089 44574 43811 42813 42205 42364 43037 43762
54224D3762L34n37j581j953j230j81J08l77p38m60Q7L69K15k60p23p10j71K26
$$ 43762 44096 43559 41978 40025 38795 38614 38722 38345 37607 37147 37234 37603 37818 37558 36835 36125 35954 36180
54206C6180m9n08k32P52J511J475R74M80J51J59O35J159J090N20J26K4k91p57
$$ 36180 36131 35623 35391 36143 37654 39129 40103 40583 40734 40893 41528 42687 43777 44297 44423 44447 44156 43399
54188D3399o16J50M04m47j316q84N14J410J099J92l90k82K50N07o0j084j458p83
$$ 43399 42783 42933 43337 42890 41574 40690 41204 42614 43713 43905 43515 43233 43483 43990 43930 42846 41388 40605
54170D0605jm7m94l55L06N86K05k55m78p64j136j071l77L37M21k0l38n6P17J362
$$ 40605 40604 40557 40063 39708 40014 40600 40805 40550 40072 39308 38172 37101 36724 37061 37482 37462 37124 37068 37785 39147
54150C9147J272N05k23m00k59j57N3M50M07o19j906k148j253m41m31n50J5R99
$$ 39147 40419 40924 40701 40301 40042 39885 39938 40388 40795 40176 38270 36122 34869 34428 33997 33447 33462 34461
54132C4461J609J507P94l58j452j717j015k53k21n19l05L34O50N98Q44J411J270
$$ 34461 36070 37577 38371 38013 36561 34844 33829 33576 33355 32836 32531 32865 33515 34113 34957 36368 37638
54115C7638j70j978k761k391j928k004k017j154M15J712K057J567P30q4o23p02
$$ 37638 37468 35490 32729 30338 28410 26406 24389 23235 23650 25362 27419 28986 29716 29632 29009 28307
54099B8307m09j46k35n17n41o9O67J160J010K22o54q84k16P92J358J275R67P74
$$ 28307 27898 27752 27517 27000 26459 26390 27057 28217 29227 29449 28795 27911 27695 28487 29845 31120 32087 32861
54081C2861N24l8p08r79o75j68J37K65M85P94Q91O68L65J40j64n35m97J96Q49
$$ 32861 33385 33347 32639 31660 30985 30817 30954 31219 31704 32498 33389 34057 34422 34562 34398 33863 33366 33562 34411
54062C4411N02o83j473j206o06n50p35k91P08J263Q35n5o42p31m62L9N58P23M29
$$ 34411 34913 34230 32757 31551 30945 30395 29660 29369 30077 31340 32175 32120 31478 30747 30285 30324 30882 31605 32034
54043C2034M1p7kj1j41k74m12n51m14K85J267J770J344L39m90p25m49P8N89P42
$$ 32034 32075 31998 31996 31985 31844 31570 31158 30607 30193 30478 31745 33515 34859 35198 34708 33983 33534 33612 34201 34943
54023C4943L56k05k67L51J073J314J225J225J162N45m86j104q49j88K44M50P73
$$ 34943 35299 35094 34827 35178 36251 37565 38790 40015 41177 41722 41236 40132 39283 39095 39339 39789 40562
54006D0562J201J447J462J427J387J225R93Q84R67J124J193J025N84J32M7K76
$$ 40562 41763 43210 44672 46099 47486 48711 49704 50588 51555 52679 53872 54897 55481 55613 55660 55936
53990E5936K59k65o43m7J322K313K097R94p5m92k30M13J083J535J717J671J389
$$ 55936 56195 55930 55287 55240 56562 58875 60972 61966 61891 61399 61169 61582 62665 64200 65917 67588 68977
53973F8977R56P27J056J774K265K174J831J759K040K319K332K161J981J808J583
$$ 68977 69933 70660 71716 73490 75755 77929 79760 81519 83559 85878 88210 90371 92352 94160 95743
53958I5743J357J250J262J212R13M06NN1N74J196J423J103N72K75L08L03j41j060
$$ 95743 97100 98350 99612 100824 101737 102143 102148 102199 102773 103969 105392 106495 107067 107342 107650 107953 107812 106752
53940A06752k098k731k563j663o65k93o80j278j606j767k042k309k229j815j425
$$ 106752 104654 101923 99360 97697 97032 96739 96059 94781 93175 91408 89366 87057 84828 83013 81588
53925H1588j285j275j208j040q92j045j698k536k858k420j763j412j151n80J09
$$ 81588 80303 79028 77820 76780 75888 74843 73145 70609 67751 65331 63568 62156 61005 60425 60534
53910F0534N80J032J569J475K19j177j143J83J164J191J324K042K146Q47o18p83
$$ 60534 61114 62146 63715 65190 65409 64232 63089 63272 64436 65627 66951 68993 71139 71986 71368 70585
53894G0585j92l51j285j697j034J8Q47J402J478Q04r3k02N94J374J525J406J491
$$ 70585 70393 70042 68757 67060 66026 66044 66891 68293 69771 70575 70482 70280 70874 72248 73773 75179 76670
53877G6670J695J797J894K093K257K268K220K235K314K380K209J561O26N9K06
$$ 76670 78365 80162 82056 84149 86406 88674 90894 93129 95443 97823 100032 101593 102219 102278 102484
53862A02484O32Q31R93J469J979K090K007K114K084J444P18R39K077L055L313
$$ 102484 103116 103947 104940 106409 108388 110478 112485 114599 116683 118127 118845 119784 121861 124916 128229
53847A28229L355L531L419K775K158K085K250K014J226K32m86n27L9M74N8r58
$$ 128229 131584 135115 138534 141309 143467 145552 147802 149816 151042 151274 150788 150261 150300 150774 150832 149874
53831A49874j700j889k041k355k381j923j463j346j330j301j629k371k838k533
$$ 149874 148174 146285 144244 141889 139508 137585 136122 134776 133446 132145 130516 128145 125307 122774
53817A22774j948j846k243k544k409j998j701j871k515l085k978k338j887j844
$$ 122774 120826 118980 116737 114193 111784 109786 108085 106214 103699 100614 97636 95298 93411 91567
53803I1567j738j409j437k135k852k839k184j374n23L62Q77O83Q0m39q56j309
$$ 91567 89829 88420 86983 84848 81996 79157 76973 75599 75076 75438 76315 76998 77078 76639 75783 74474
53787G4474j489j052l73k13o86j155j139p93m67k19L4J98L4m95j025j070n99j51
$$ 74474 72985 71933 71560 71347 70661 69506 68367 67574 67107 66888 66922 67120 67154 66659 65634 64564 63965 63814
53769F3814j60l66k92mJ17J76N80J147J213P59M69N09K50l78m15O30J735J784
$$ 63814 63654 63288 62996 62992 63109 63285 63865 65012 66225 66984 67453 67962 68212 67834 67419 68049 69784 71568
53751G1568J203J192J856K254J948J397R69N84K90L55P08R97J246J763K365K490
$$ 71568 72771 73963 75819 78073 80021 81418 82387 82971 83261 83616 84324 85321 86567 88330 90695 93185
53735I3185K116J910K243K717K874K794K698K498K130J905K139K585K628K036
$$ 93185 95301 97211 99454 102171 105045 107839 110537 113035 115165 117070 119209 121794 124422 126458
53721A26458J323J203J722K019J261k03j007l64Q60J135Q0j253j769j456j015
$$ 126458 127781 128984 130706 132725 133986 133783 132776 132412 133272 134407 134487 133234 131465 130009 128994
53706A28994r12j089j330j586j948k447k873k956k684k362k231k206k178k237
$$ 128994 128082 126993 125663 124077 122129 119682 116809 113853 111169 108807 106576 104370 102192 99955
53692I9955k400k312j667p97m09o54r13n97N3K85k06q26p94j11L93J47l71k73
$$ 99955 97555 95243 93576 92779 92370 91716 90803 90206 90259 90544 90338 89512 88718 88607 89000 89147 88776 88503
53674H8503M86J032P88J86k2L29Q89J358J566J393R98Q53J200J678J830J639J274
$$ 88503 88989 90021 90809 90995 90973 91302 92191 93549 95115 96508 97506 98359 99559 101237 103067 104706 105980
53657A05980P17N7k27J43O45N62J4k86j57r7l41m45k1O09Q54N85J96K01P79J623
$$ 105980 106697 106754 106527 106670 107315 107877 107891 107605 107448 107351 107010 106565 106544 107153 108007 108592 108788 108989 109768 111391
53637A11391K083J801J158R06J314J915K165J998J710J577J669J856J895J653
$$ 111391 113474 115275 116433 117339 118653 120568 122733 124731 126441 128018 129687 131543 133438 135091
53623A35091J314J198J346J444J273R85Q58Q82P75L92p6l51m10l61j04N52J324
$$ 135091 136405 137603 138949 140393 141666 142651 143509 144391 145166 145558 145482 145131 144721 144360 144256 144808 146132
53606A46132J447O48k33j91N83R44L81l62n20k92k86n74q54j090j387j610j539
$$ 146132 147579 148227 147994 147803 148386 149330 149711 149349 148829 148537 148251 147677 146823 145733 144346 142736 141197
53589A41197j239q74m29J06N62Q92J259J600J519R48L54j0m19q56o69L02J025
$$ 141197 139958 139084 138655 138761 139323 140215 141474 143074 144593 145541 145895 145885 145466 144610 143941 144243 145268
53572A45268O48j22n9P17J088Q54R26J597J971J428O13M52J006J712K131K109
$$ 145268 145916 145794 145735 146452 147540 148394 149320 150917 152888 154316 154929 155381 156387 158099 160230 162339
53556A62339J742J524J989K969L711L866L782L673L273K567K152K431K946L030
$$ 162339 164081 165605 167594 170563 174274 178140 181922 185595 188868 191435 193587 196018 198964 201994
53542B01994K693K448K631L200L932M482M530M109L502K773J833J015J012J878
$$ 201994 204687 207135 209766 212966 216898 221380 225910 230019 233521 236294 238127 239142 240154 242032
53528B42032K711K764K412K492L068L387K881J738N43j52m7P42J638J971J499
$$ 242032 244743 247507 249919 252411 255479 258866 261747 263485 264028 263876 263829 264571 266209 268180 269679
53513B69679N34l12n44r9N90J009J065R57P30K94n6K39J149J819J573P82K58J46
$$ 269679 270213 269901 269357 269258 269848 270857 271922 272879 273609 273903 273847 274086 275235 277054 278627 279409 279667 279813
53495B79813j6l70m79q2M20N44M31O57J406K183K386J959J344R10P48Q94J408
$$ 279813 279797 279427 278948 278866 279286 279830 280261 280918 282324 284507 286893 288852 290196 291106 291854 292748 294156
53478B94156K054K324K110J985K463L185L384L048L033L958N460O669P086O863
$$ 294156 296210 298534 300644 302629 305092 308277 311661 314709 317742 321700 327160 333829 340915 347778
53464C47778O599O933Q078R606J0904J1790J2434J2825J2802J2598J2794J3559
$$ 347778 354377 361310 369388 378994 389898 401688 414122 426947 439749 452347 465141 478700
53452D78700J4402J4879J5138J5597J6450J7656J9009K0108K0650K0909K1560
$$ 478700 493102 507981 523119 538716 555166 572822 591831 611939 632589 653498 675058
53441F75058K2788K4026K4767K5122K5339K5284K4805K4203K3895K3911K4150
$$ 675058 697846 721872 746639 771761 797100 822384 847189 871392 895287 919198 943348
53430I43348K4728K5603K6165K5819K4875K4223K4248K4545K4747K4979K5258
$$ 943348 968076 993679 1019844 1045663 1070538 1094761 1119009 1143554 1168301 1193280 1218538
53419A218538K5028K3786K2001K0818K0724K0906K0210J8534J6775J5484J4181
$$ 1218538 1243566 1267352 1289353 1310171 1330895 1351801 1372011 1390545 1407320 1422804 1436985
53408A436985J2325J0362R119Q543P782O529N405M787M055K458J55k137m147o108
$$ 1436985 1449310 1459672 1468791 1477334 1485116 1491645 1497050 1501837 1505892 1508350 1508505 1506368 1502221 1496113
53394A496113q079r845j1378j2959j4681j6244j7338j8005j8611j9460k0510k1373
$$ 1496113 1488034 1478189 1466811 1453852 1439171 1422927 1405589 1387584 1368973 1349513 1329003 1307630
53382A307630k1715k1658k1664k1966k2347k2577k2734k2875k2665k1725k0290
$$ 1307630 1285915 1264257 1242593 1220627 1198280 1175703 1152969 1130094 1107429 1085704 1065414
53371A065414j9124j8707j8641j8048j6470j4293j2251j0637r152p519n897m489
$$ 1065414 1046290 1027583 1008942 990894 974424 960131 947880 937243 928091 920572 914675 910186
53359I10186l019j035J449M017O418Q678J0686J2237J3531J5099J7051J8846K0032
$$ 910186 907167 906132 907581 911598 918016 926694 937380 949617 963148 978247 995298 1014144 1034176
53346A034176K0767K1510K2517K3909K5754K7835K9672L1078L2355L3769L5237
$$ 1034176 1054943 1076453 1098970 1122879 1148633 1176468 1206140 1237218 1269573 1303342 1338579
53335A338579L6777L8720M1080M3146M4252M4746M5659M7441M9472N0777N0988
$$ 1338579 1375356 1414076 1455156 1498302 1542554 1587300 1632959 1680400 1729872 1780649 1831637
53324A831637N0607N0527N1237N2396N3231N3396N3205N2947N2385N1104M9076
$$ 1831637 1882244 1932771 1984008 2036404 2089635 2143031 2196236 2249183 2301568 2352672 2401748
53313B401748M6567M3790M0839L7770L4475L0787K6888K3377K0637J8337J5813
$$ 2401748 2448315 2492105 2532944 2570714 2605189 2635976 2662864 2686241 2706878 2725215 2741028
53302B741028J2740R173N266J160k991p156j1377j5476j9147k2547k6397l1185
$$ 2741028 2753768 2762941 2768207 2769367 2766376 2759220 2747843 2732367 2713220 2690673 2664276 2633091
53290B633091l6568m1769m6253m9778n2278n4121n5998n8059n9472n9380n8099
$$ 2633091 2596523 2554754 2508501 2458723 2406445 2352324 2296326 2238267 2178795 2119415 2061316
53279B061316n6816n6249n6153n5956n5412n4564n3535n2426n1200m9691m7871
$$ 2061316 2004500 1948251 1892098 1836142 1780730 1726166 1672631 1620205 1569005 1519314 1471443
53268A471443m5973m4155m2276m0226l8157l6167l4055l1756k9605k7819k5990
$$ 1471443 1425470 1381315 1339039 1298813 1260656 1224489 1190434 1158678 1129073 1101254 1075264
53257A075264k3604k0716j7707j4686j1732r367q085p523o729n201l146q97J260
$$ 1075264 1051660 1030944 1013237 998551 986819 977452 969367 961844 955115 949914 946768 945871 947131
53244I47131K828L475L721M526O067P531Q332Q874R837J1248J2676J3889J4971
$$ 947131 949959 953434 957155 961681 967748 975279 983611 992485 1002322 1013570 1026246 1040135 1055106
53231A055106J5986J6909J7780J8783K0164K1982K3794K4787K4650K4104K4107
$$ 1055106 1071092 1088001 1105781 1124564 1144728 1166710 1190504 1215291 1239941 1264045 1288152
53220A288152K4596K4654K3894K2953K2392K1834K0680J9130J7784J6580J4817
$$ 1288152 1312748 1337402 1361296 1384249 1406641 1428475 1449155 1468285 1486069 1502649 1517466
53209A517466J2209R439P430O455O047N610M816L542J694p23l409n850p770r404
$$ 1517466 1529675 1539114 1546544 1552999 1559046 1564656 1569472 1573014 1574708 1573985 1570576 1564726 1556956 1547552
53195A547552j1253j3590j6239j8797k1056k3220k5649k8180k9973l0462l0411
$$ 1547552 1536299 1522709 1506470 1487673 1466617 1443397 1417748 1389568 1359595 1329133 1298722
53184A298722l1283l3357l5133l5156l3744l2258l1219l0136k8874k7975k7511
$$ 1298722 1267439 1234082 1198949 1163793 1130049 1097791 1066572 1036436 1007562 979587 952076
53173I52076k6756k5415k4324k4236k4602k4298k3179k2156k1860k1835k1259
$$ 952076 925320 899905 875581 851345 826743 802445 779266 757110 735250 713415 692156
53162F92156k0002j8649j7659j6823j5657j4158j2804j1789j0693r221p838p182
$$ 692156 672154 653505 635846 619023 603366 589208 576404 564615 553922 544701 536863 529681
53150E29681p105o951o695o966p855q497q290p840q082q785q738p264n064l388
$$ 529681 522576 515625 508930 501964 494109 485612 477322 469482 461400 452615 443877 436613 431549 428161
53136D28161k875l278m079n020o100p231q062q241p829p326p184p350p350o872
$$ 428161 425286 422008 417929 412909 406809 399578 391516 383275 375446 368120 360936 353586 346236 339364
53122C39364o194n953o416p123p429p279p112p019o554n545m581m237m244m018
$$ 339364 333170 327217 320801 313678 306249 298970 291858 284839 278285 272740 268159 263922 259678 255660
53108B55660l634l662m145m482m351m125m242m649n009n020m474l431k410j964
$$ 255660 252026 248364 244219 239737 235386 231261 227019 222370 217361 212341 207867 204436 202026 200062
53094B00062k058k261k509k990l433l267k638k420k895l259k887k316k314k621
$$ 200062 198004 195743 193234 190244 186811 183544 180906 178486 175591 172332 169445 167129 164815 162194
53080A62194k433j720j231j342j641j622j260p90l93j23M9J00j79r08j640j668
$$ 162194 159761 158041 156810 155468 153827 152205 150945 150155 149762 149639 149688 149788 149609 148701 147061 145393
53064A45393j081q84j496j860r18N84R14k18j295j280r47j373k126j986q70j8
$$ 145393 144312 143428 141932 140072 139154 139738 140652 140434 139139 137859 136912 135539 133413 131427 130557 130539
53048A30539l20j288j858j634j072p22o20l71J96N68Qj427k629k560j429m11k72
$$ 130539 130219 128931 127073 125439 124367 123645 123025 122654 122850 123418 123426 121999 119370 116810 115381 114970 114698
53031A14698p38j176j352j286q55K5R58J281Q02M9k46J38P67J040P91N10Q19J692
$$ 114698 113960 112784 111432 110146 109291 109316 110274 111555 112357 112406 112160 112298 113065 114105 114896 115406 116225 117917
53013A17917K373K286J780J676K135K494K256J777J718K169K635K680K294J690
$$ 117917 120290 122576 124356 126032 128167 130661 132917 134694 136412 138581 141216 143896 146190 147880
52999A47880J030L47m60j444k370k781k508j910j491j420j645k131k738l093l006
$$ 147880 148910 149257 148797 147353 144983 142202 139694 137784 136293 134873 133228 131097 128359 125266 122260
52984A22260k838l019l349l302k890k695k921l052k616j783r76l33L7k68j359
$$ 122260 119422 116403 113054 109752 106862 104167 101246 98194 95578 93795 92819 92486 92523 92255 90896
52969I0896k443k441j323k75l43j286k061k071j575j022n85l60n50j142j724j930
$$ 90896 88453 86012 84689 84414 84071 82785 80724 78653 77078 76056 75471 75111 74561 73419 71695 69765
52953F9765j805j501q96k3M92R9o49n36O13J567J281K08n72p88q34p29j93M66
$$ 69765 67960 66459 65563 65540 66032 66131 65482 64946 65559 67126 68407 68615 68043 67255 66421 65692 65499 65965
52935F5965M57l80j315j720j670j416r15j72M32N56L31J25M9j2r1l8L06Q66J304
$$ 65965 66422 66042 64727 63007 61337 59921 59006 58834 59266 59822 60153 60278 60327 60315 60224 60186 60492 61358 62662
52916F2662J220N76k13p06q26p10m09MK83K60R9M7J40M03R89J728J926J202J60
$$ 62662 63882 64458 64245 63539 62713 62003 61594 61598 61881 62141 62240 62287 62427 62830 63819 65547 67473 68675 68835
52897F8835l37k91k92l64j7P23J177J015N88J73l52q66q52j94N37Q09O48K15m42
$$ 68835 68498 68207 67915 67551 67534 68257 69434 70449 71037 71210 70858 69992 69140 68946 69483 70292 70940 71155 70713
52878G0713j000q86K1J206K180K832L034K649K062J933K174K009J295Q92J310
$$ 70713 69713 68827 68848 70054 72234 75066 78100 80749 82811 84744 86918 88927 90222 91114 92424
52863I2424J908K025J997K378K912L069L011L158L282K913K165J463P74j51j079
$$ 92424 94332 96357 98354 100732 103644 106713 109724 112882 116164 119077 121242 122705 123479 123328 122249
52848A22249j553j574j382r32k96j41j014k327k892k414j719j553j870k312k672
$$ 122249 120696 119122 117740 116808 116512 116371 115357 113030 110138 107724 106005 104452 102582 100270 97598
52833I7598k771k439j843j420j376j479j415j147r00r57j310j482r75m2M91L15
$$ 97598 94827 92388 90545 89125 87749 86270 84855 83708 82808 81851 80541 79059 78084 78042 78533 78848
52817G8848K2Q1Q3m29j062j184r89j082j385j273o45p6Rk74o18o92j84P41J297
$$ 78848 78870 78951 79034 78605 77543 76359 75370 74288 72903 71630 70985 70909 70918 70644 70026 69334 69150 69891 71188
52798G1188R98M38M44Q45Q26K74k01l48m79o19m09P4K71N0r9R7L95O42R78J314
$$ 71188 72186 72624 73068 73913 74739 75013 74812 74464 73985 73366 72957 73031 73302 73352 73253 73350 73745 74387 75365 76679
52778G6679J372J222J142R51L00l89k95M48P68K79j89j1K91J17j51P4N13M74n0
$$ 76679 78051 79273 80415 81366 81666 81277 80982 81430 82198 82477 82288 82277 82568 82685 82534 82608 83121 83595 83545
52759H3545m49l01L31J087J403Q82n2l86K35R77R83M81J98K87L83L47K71L1m45
$$ 83545 83096 82795 83126 84213 85616 86498 86446 86060 86295 87272 88255 88736 88934 89221 89604 89951 90222 90253 89808
52740H9808p69m64L66J247J944K445K551K091J355Q52P68R28J135J189Q22Q6n46
$$ 89808 89039 88575 88941 90188 92132 94577 97128 99219 100574 101426 102194 103122 104257 105446 106268 106354 105808
52723A05808q35j234k089k815k615j796j490k103k879l132l040k902k502j795
$$ 105808 104973 103739 101650 98835 96220 94424 92934 90831 87952 84820 81780 78878 76376 74581
52709G4581j508k282l498l847k975j852j405j425j149m13K69M93K76j75n56l92
$$ 74581 73073 70791 67293 63446 60471 58619 57214 55789 54640 54227 54496 54989 55265 55090 54534 54142
52693E4142N05J426J254j49j557j786j050m36m60p55r22r49q20m34L0J86J1j88
$$ 54142 54647 56073 57327 57178 55621 53835 52785 52349 51889 51134 50212 49263 48443 48009 48039 48225 48236 48048
52675D8048l61p22j072q15J00Q82Q92M19M6k17p48j544k162k242j771r53q7N69
$$ 48048 47687 46965 45893 45078 45178 46060 46952 47371 47417 47200 46452 44908 42746 40504 38733 37780 37693 38262
52657C8262J010J332J366Q45M2k66K10Q53J034R34R67R20L21o62j354j473j255
$$ 38262 39272 40604 41970 42815 42857 42591 42801 43654 44688 45622 46589 47509 47830 47168 45814 44341 43086
52640D3086q33j53N08O20J35l50l79j75j78m29o20n31j73L52Q94J238J171O82
$$ 43086 42253 42100 42608 43228 43363 43013 42634 42459 42281 41852 41232 40701 40528 40880 41774 43012 44183 44865
52622D4865M1l96m92m45m46l40J64Q93J223Q44J72j72j9M13Q79J139R71N44M44
$$ 44865 44906 44510 44018 43573 43127 42787 42951 43844 45067 45911 46083 45911 45892 46305 47184 48323 49294 49838 50282
52603E0282Q93J223P20k64o89k02N09Q16R04J172J506J587J496J533J724J851
$$ 50282 51175 52398 53118 52854 52165 51963 52472 53288 54192 55364 56870 58457 59953 61486 63210 65061
52587F5061J864J884J938J977K033K076J772Q13n27j505j701j440j241j127p39
$$ 65061 66925 68809 70747 72724 74757 76833 78605 79418 78891 77386 75685 74245 73004 71877 71138
52572G1138p5L79J95m34r15q71m63k19n69j444k257k462k126j809j796j777j352
$$ 71138 71063 71442 71637 71203 70288 69417 68954 68735 68166 66722 64465 62003 59877 58068 56272 54495 53143
52555E3143o28j0K32J0o60j434j660j086l31j31l72l83m6J34k8j50m2j2k24m14
$$ 53143 52515 52505 52737 52747 52087 50653 48993 47907 47576 47445 47073 46690 46644 46778 46750 46600 46558 46546 46322 45908
52535D5908m40m42k96L36J170J373Q42N25R54J349R14J45q0Ql35q22n42L53O76
$$ 45908 45468 45026 44730 45066 46236 47609 48451 48976 49930 51279 52193 52338 52258 52266 51931 51109 50567 50920 51596
52516E1596L9n48k32N28Q13N02J80L21R18J493J388M41n01m38M41R19M64j20j4
$$ 51596 51635 51087 50855 51383 52196 52698 52878 53199 54117 55610 56998 57439 56938 56500 56941 57860 58324 58204 58190
52497E8190N11Q39J032J297J152Q3j326j861j130J97J460K487L003K525J179r1
$$ 58190 58701 59540 60572 61869 63021 63104 61778 59917 58787 58984 60444 62931 65934 68459 69638 69547
52481F9547n69n71p98j293j540j289p97l00K83R77J470J418R12M26K95L81L56
$$ 69547 68978 68407 67609 66316 64776 63487 62690 62390 62673 63650 65120 66538 67450 67876 68171 68552 68908
52464F8908J49jK2Kk36m60k96J67M03J04m66r06j154j298j229q21l25j49k79l30
$$ 68908 69057 69056 69078 69080 68844 68384 68088 68255 68658 68762 68296 67390 66236 64938 63709 62888 62563 62414 62135 61805
52444F1805j53J6N6K28O62J014Q84L40k57p09r43q38m03O1L62P42J434K065K025
$$ 61805 61652 61668 61724 61952 62614 63628 64512 64852 64595 63886 62943 62105 61702 61763 62125 62867 64301 66366 68391
52425F8391J338O02J74n7j15J92P24R01M93m0k53k87m63o94p62p34p44o14j10
$$ 68391 69729 70331 70505 70448 70333 70525 71249 72150 72643 72603 72350 72063 71600 70906 70144 69410 68666 68052 67942
52406F7942N83J075J230J138P81J60m16n37j99J79K83K08K72O38J108J272R59
$$ 67942 68525 69600 70830 71968 72749 72909 72493 71956 71757 71936 72219 72427 72699 73337 74445 75717 76676
52389G6676N17L68L30j84j173j830j520o20N4K64L91P44J252J626J531Q47jk44
$$ 76676 77193 77561 77891 77707 76534 74704 73184 72564 72618 72882 73273 74017 75269 76895 78426 79273 79272 79028
52371G9028K78P88N90N1J3O38J364J787J884J610R51L11J36K51J53q3O8N92Q47
$$ 79028 79306 80094 80684 80735 80748 81386 82750 84537 86421 88031 88982 89293 89429 89680 89833 89750 89818 90410 91257
52352I1257O28N91J289K317K825K518J783J096N90R6n13r99r53l97k6l63r76j009
$$ 91257 91885 92476 93765 96082 98907 101425 103208 104304 104894 104990 104477 103478 102525 102128 102102 101739 100763 99754
52334I9754l66K14K02j76m87n41k31M67J176J305P92K09nL3O5Qk43p73j210r00
$$ 99754 99388 99602 99804 99628 99141 98600 98369 98836 100012 101317 102109 102318 102313 102346 102411 102419 102176 101403 100193 99293
52314I9293K23J416K000K029J876J616J136N00m6k39Q2P19J089Q79O12R36J498
$$ 99293 99516 100932 102932 104961 106837 108453 109589 110089 110043 109804 109886 110605 111694 112573 113185 114121 115619
52297A15619J394O67L60Q23J198R14O12Q70J161R41Q48J605K568K558J682J017
$$ 115619 117013 117680 118040 118863 120061 120975 121587 122457 123618 124559 125407 127012 129580 132138 133820 134837
52281A34837Q25M40k34m38N3M56K51q0lK29K10J20K80M83L44l1j85N8M89Q88J169
$$ 134837 135662 136102 135868 135430 135483 135939 136190 136110 136107 136336 136546 136666 136946 137429 137773 137742 137557 137615 138104 138992 140161
52260A40161J309J355J484J870K526L222L614L502L045K651K523K555K736L234
$$ 140161 141470 142825 144309 146179 148705 151927 155541 159043 162088 164739 167262 169817 172553 175787
52246A75787L862L936L159K303K355L240M094M542M897N168M906M239M042M657
$$ 175787 179649 183585 186744 189047 191402 194642 198736 203278 208175 213343 218249 222488 226530 231187
52232B31187N263N121M728M996N773O050N452M674M386M420M272L910L720L856
$$ 231187 236450 241571 246299 251295 257068 263118 268570 273244 277630 282050 286322 290232 293952 297808
52218B97808L992L789L376L225L541M006M162L918L439K816K096J545J392J350
$$ 297808 301800 305589 308965 312190 315731 319737 323899 327817 331256 334072 336168 337713 339105 340455
52204C40455Q73j9o10l05P34J905K655K596J682N20LL09P13O90O31J034J599J780
$$ 340455 341328 341309 340699 340394 341128 343033 345688 348284 349966 350486 350489 350798 351511 352201 352832 353866 355465 357245
52186C57245J786K187K803K880K299J773J782K049K199K272K363K413K578L190
$$ 357245 359031 361218 364021 366901 369200 370973 372755 374804 377003 379275 381638 384051 386629 389819
52172C89819M007M174L389K506K414K827K848K330J877J735J538J219J270J837
$$ 389819 393826 398000 401389 403895 406309 409136 411984 414314 416191 417926 419464 420683 421953 423790
52158D23790K221J788R01M11N06O62N82N86R20J195Q67j2q46j207j176j007q24
$$ 423790 426011 427799 428700 429111 429617 430279 430861 431447 432367 433562 434429 434417 433571 432364 431188 430181 429357
52141D29357p13q19j159j537j785j922j872j333k09R38J355R59L47j2j57j29K80
$$ 429357 428644 427825 426666 425129 423344 421422 419550 418217 418008 418946 420301 421260 421607 421595 421438 421309 421589
52124D21589R35J101K85r69j626j380p92m32l63n02q12j089j052q35r06j340j598
$$ 421589 422524 423625 423910 422941 421315 419935 419143 418711 418348 417846 417034 415945 414893 414058 413152 411812 410214
52107D10214j363j046j155j493j520j215j032j109j134r80r69j267j519j339q61
$$ 410214 408851 407805 406650 405157 403637 402422 401390 400281 399147 398167 397198 395931 394412 393073 392212
52092C92212n06l73k93k86o19j295j840j804j261o52k84k14m54r35j305j170o78
$$ 392212 391706 391333 391040 390754 390135 388840 387000 385196 383935 383283 382999 382785 382331 381396 380091 378921 378243
52075C78243m78r33j580j744j384j047j146j627k212k599k490j875j205r35j009
$$ 378243 377765 376832 375252 373508 372124 371077 369931 368304 366092 363493 361003 359128 357923 356988 355979
52060C55979j116j317j817k255j957r52j01M5j84k95k64o4N90J584K213K252K448
$$ 355979 354863 353546 351729 349474 347517 346565 346464 346509 346325 346030 345766 345702 346292 347876 350089 352341 354789
52043C54789L269L921L556K849L136M375N280N374N467N946N994N100M169M237
$$ 354789 358058 361979 365535 368384 371520 375895 381175 386549 392016 397962 403956 409056 413225 417462
52029D17462N004N496N570N778O163O178N685N188N051N077M980M712M263L582
$$ 417462 422466 427962 433532 439310 445473 451651 457336 462524 467575 472652 477632 482344 486607 490189
52015D90189K858K397K065J328J05p51l52J011J936J337m90k250k898k329j178
$$ 490189 493047 495444 497509 498837 498942 498191 497839 498850 500786 502123 501633 499383 496485 494156 492978
52000D92978k66j26o93j310j347q57m23m20p38j211j763k061j612n43K91L48K3
$$ 492978 492712 492586 491893 490583 489236 488379 487956 487536 486798 485587 483824 481763 480151 479608 479899 480247 480270
51983D80270j71l62o51m92L91J046M47p54r74k5P05M70Q0J79J00p38j475j043
$$ 480270 480099 479737 479086 478594 478985 480031 480478 479724 478750 478725 479430 479900 479980 480159 480259 479521 478046 477003
51965D77003Q1M72l30j469k067k002j585j205j209j593j970k185k626l544m494
$$ 477003 477084 477556 477226 475757 473690 471688 470103 468898 467689 466096 464126 461941 459315 455771 451277
51950D51277n012n338n840o180n905n450n626o302o587o272o118o595p195p333
$$ 451277 446265 440927 435087 428907 423002 417552 411926 405624 399037 392765 386647 380052 372857 365524
51936C65524p162p139p309p492p697p969q040p616o860o353o501p062p344o953
$$ 365524 358362 351223 343914 336422 328725 320756 312716 305100 298240 291887 285386 278324 270980 264027
51922B64027o317o202o650o804o074m999m475m465m224l575l240l735m593m940
$$ 264027 257710 251508 244858 238054 231980 226981 222506 218041 213817 210242 207002 203267 198674 193734
51908A93734m434l455k642k439k862l582m269m778m891m219k808j508j180j619
$$ 193734 189300 185845 183203 180764 177902 174320 170051 165273 160382 156163 153355 151847 150667 149048
51894A49048j839j469j141j365j702j497r24p59j261j834j805j283r68j257j789
$$ 149048 147209 145740 144599 143234 141532 140035 139111 138352 137091 135257 133452 132169 131201 129944 128155
51879A28155k011j930j901j868j433p60o88j510k329k247j674j584j927j681m64
$$ 128155 126144 124214 122313 120445 119012 118252 117564 116054 113725 111478 109804 108220 106293 104612 104148
51864A04148Q66J322Q27k0n91n37L0N38N88M89O88Q79M03o03j294j359j265j214
$$ 104148 105014 106336 107163 107143 106552 106015 106045 106583 107171 107660 108348 109227 109630 109027 107733 106374 105109 103895
51846A03895q53k51j46p28j180r46n86p34r99p44k46j78m70n81n80r62j567j604
$$ 103895 103042 102791 102645 101917 100737 99791 99205 98471 97472 96728 96482 96304 95834 95253 94673 93711 92144 90540
51828I0540q48lK93J85J68L55M91L87O5k83m05j10N68J318J680J327M54j99j0
$$ 90540 89692 89689 89982 90167 90335 90690 91181 91568 91633 91350 90945 90835 91403 92721 94401 95728 96182 95983 95973
51809I5973P69J237R44L24j8jK64R28J985K766K477J122m85j566j864j465o57
$$ 95973 96742 97979 98923 99247 99229 99228 99492 100420 102405 105171 107648 108770 108285 106719 104855 103390 102733
51792A02733Pk4p60j519j509n67O42J178P43k3l03k6L48P17J408K261K453J625
$$ 102733 102740 102716 101956 100437 98928 98361 99003 100181 100924 100901 100598 100572 100920 101637 103045 105306 107759 109384
51774A09384O14M24R46J247Q99L86L59R45J719K021J497N34J0K73P62Q40N84L30
$$ 109384 109998 110422 111368 112615 113514 113900 114259 115204 116923 118944 120441 120975 120985 121258 122020 122860 123444 123774
51756A23774j4n54q14l56K95J96o48j311j286r36n57P7R59J443J109M85L65P59
$$ 123774 123760 123206 122392 122036 122331 122527 121879 120568 119282 118346 117789 117866 118825 120268 121377 121862 122227 122986
51738A22986R92O83J72%K44M80L62J29L49J075J543J080Q0l67K24J285K029K243
$$ 122986 123978 124661 124833 124833 125077 125557 125919 126048 126397 127472 129015 130095 130175 129808 130032 131317 133346 135589
51720A35589K108J801J531J586J990K351K326K070K021K284K538K511K356K399
$$ 135589 137697 139498 141029 142615 144605 146956 149282 151352 153373 155657 158195 160706 163062 165461
51706A65461K682K908K888K817K888K786J995O21n95j171j306j238p76J12Q20
$$ 165461 168143 171051 173939 176756 179644 182430 184425 185046 184451 183280 181974 180736 179960 180072 180892
51691A80892Q30M97M33M99K08k33k05J63J07m57p10k60K27R7l95o95q02r27r07
$$ 180892 181722 182219 182652 183151 183359 183126 182921 183084 183191 182734 182024 181764 181991 182088 181693 180998 180196 179269 178362
51672A78362n60k29l67q04r47n50P8N21N85L17n8k68k74k37j66J31N41N12l10
$$ 178362 177802 177573 177206 176402 175455 174905 174983 175504 176089 176406 176348 176080 175806 175569 175403 175534 176075 176587 176277
51653A76277j457k008j487k58Q54J175O83j8k99j77j43l94o14n66m34l60j44L25
$$ 176277 174820 172812 171325 171067 171921 173096 173779 173761 173462 173285 173142 172748 172134 171568 171134 170774 170630 170955
51635A70955P32P38N15N39J042J866K568K600J739N53M3N03J179J321J111J104
$$ 170955 171687 172425 172940 173479 174521 176387 178955 181555 183294 183847 183890 184393 185572 186893 188004 189108
51619A89108J247R90J21j087k355l501m180m112l575l231l377l663l610l182k779
$$ 189108 190355 191345 191466 190379 188024 184523 180343 176231 172656 169425 166048 162385 158775 155593 152814
51604A52814k797l150l250k657j736j300j486j555j027m30m46q59j016q47p33
$$ 152814 150017 146867 143617 140960 139224 137924 136438 134883 133856 133426 132980 132121 131105 130258 129525
51589A29525o62l22J42K60J06J48K97p8r95j547j091p2O80R12P66K38o34j367
$$ 129525 128863 128541 128683 128943 129049 129197 129494 129416 128421 126874 125783 125711 126391 127303 128069 128307 127673 126306
51571A26306j407q15j65J45J84J77K24L24M25L81N9m24o38j68Q90J813J884J161
$$ 126306 124899 124084 123919 124064 124248 124425 124649 124973 125398 125779 125838 125414 124776 124608 125498 127311 129195 130356
51553A30356M03J83L52N84R03J325J398Q03J11K59J290K313K737K820K934K998
$$ 130356 130759 130942 131294 131878 132781 134106 135504 136307 136418 136677 137967 140280 143017 145837 148771 151769
51537A51769K895K722K428J781J010P92J188J361P33j90p40j126j759k191j701
$$ 151769 154664 157386 159814 161595 162605 163397 164585 165946 166679 166489 165749 164623 162864 160673 158972
51522A58972o10J4j23k94k3L49N83J064J903K346J728O10K04Q59J675J713J084
$$ 158972 158362 158376 158253 157959 157936 158285 158868 159932 161835 164181 165909 166519 166723 167582 169257 170970 172054
51505A72054P19J251K329L013K744J827R95N46K15k73p75r93q68n91l00k7K18
$$ 172054 172773 174024 176353 179366 182110 183937 184932 185478 185693 185420 184645 183652 182784 182193 181893 181866 182084
51488A82084L93M72M39K97J56J74L27L30o7p34j290j546j724k107k575k660k070
$$ 182084 182477 182949 183388 183685 183841 184015 184342 184672 184605 183871 182581 181035 179311 177204 174629 171969 169899
51471A69899j125m53l20l37j5N93R75Q73N65L95K71q4o09r18q50o42n21l75q3
$$ 169899 168774 168321 168001 167664 167649 168242 169217 170090 170655 171050 171321 171237 170628 169710 168860 168218 167697 167322 167239
51452A67239J61J16o6QL83P39R03J012J080Q44K69k13l23l65n95n90J34J126J402
$$ 167239 167400 167516 167450 167458 167841 168580 169483 170495 171575 172419 172688 172475 172152 171787 171192 170602 170736 171862 173264
51433A73264Q45M26Q77J792K428K672K742K544J950J417J575K306K808K622K143
$$ 173264 174109 174535 175412 177204 179632 182304 185046 187590 189540 190957 192532 194838 197646 200268 202411
51418B02411K016K357K718K552J708O32R8M97J380J834J453P53N70J078J530J090
$$ 202411 204427 206784 209502 212054 213762 214394 214492 214989 216369 218203 219656 220409 220979 222057 223587 224677
51402B24677j00r57p46nK55k2q3J56j55j342k439k567k212k306k762k867k628
$$ 224677 224577 223620 222874 222869 223124 223102 223019 223175 223020 221678 219239 216672 214460 212154 209392 206525 203897
51385B03897k629k850k791k507k503k658k393j823j652j885j784j294j146j381
$$ 203897 201268 198418 195627 193120 190617 187959 185566 183743 182091 180206 178422 177128 175982 174601
51371A74601j098r9N61M00M70J512K425J875M67j18M84J251J579J690J465M02
$$ 174601 173503 173404 173965 174365 174835 176347 178772 180647 181114 180996 181480 182731 184310 186000 187465 187867
51355A87867j138j961j664j188j446k246k935l287l379l218k908k706k628k466
$$ 187867 186729 184768 183104 181916 180470 178224 175289 172002 168623 165405 162497 159791 157163 154697
51341A54697k260k314k590k646k292j817j468j188r53q60q47p95r46j552k179
$$ 154697 152437 150123 147533 144887 142595 140778 139310 138122 137169 136309 135462 134667 133721 132169 129990
51326A29990k081j312p31p96j136j450j889k243j842p33p3n71j425j534j065q50
$$ 129990 127909 126597 125866 125070 123934 122484 120595 118352 116510 115777 115704 115133 113708 112174 111109 110259
51310A10259r21o69j93k47r78j630j661j345j119j014r31r26r50p63k68L10O90
$$ 110259 109338 108669 108476 108229 107251 105621 103960 102615 101496 100482 99551 98625 97675 96912 96644 96954 97644
51293I7644P76O61N84P99J177J155M69k70k03O83J632K155K412K551K363J811
$$ 97644 98420 99081 99665 100464 101641 102796 103265 102995 102792 103475 105107 107262 109674 112225 114588 116399
51277A16399J342J355J709J957J746R37k89j237j156k20M09r8j181j681j445j472
$$ 116399 117741 119096 120805 122762 124508 125445 125156 123919 122763 122543 122952 122854 121673 119992 118547 117075
51261A17075k418l517l508k283j119j145k076k783k817k707k799k596j709q01
$$ 117075 114657 111140 107632 105349 104230 103085 101009 98226 95409 92702 89903 87307 85598 84797
51247H4797p83j390j473p02p2l80j044r88j34O56P65K90m20j079j324r02j57J84
$$ 84797 84014 82624 81151 80449 80377 79997 78953 77965 77831 78487 79252 79542 79122 78043 76719 75817 75660 75844
51229G5844k8q4O41J740K227J738Q95M28L40J78j48k16K38R09J249J056M71l50
$$ 75844 75816 75732 76373 78113 80340 82078 82973 83401 83741 83919 83771 83555 83793 84702 85951 87007 87478 87128
51211H7128j220j720j406m05M76N06k51j035j180p22k38k64p62j155r84m52k03
$$ 87128 85908 84188 82782 82377 82853 83359 83108 82073 80893 80171 79933 79669 78907 77752 76768 76316 76113
51194G6113n44j063j215r93p91p16m23K81R56R37J65o76r34p16o56r63j105n77
$$ 76113 75569 74506 73291 72298 71507 70791 70368 70649 71605 72542 72707 72031 71097 70381 69725 68762 67657 67080
51176F7080K74N83M3p80j222j190q91l55L56Q43Q01O26J000J857K334J901R98
$$ 67080 67354 67937 67980 67200 65978 64788 63897 63542 63898 64741 65542 66168 67168 69025 71359 73260 74258
51159G4258K44m19j253j851j484k50P92Q56K93m1J89O59R39P95K36l79m10M20
$$ 74258 74502 74083 72830 70979 69495 69245 70037 70893 71186 71145 71334 71993 72932 73727 73963 73584 73174 73594
51141G3594J537J991J460N30k7K2L43N05M15L90P79J417J641J110L08j42m21j069
$$ 73594 75131 77122 78582 79112 79085 79107 79450 79955 80370 80760 81539 82956 84597 85707 86015 85873 85452 84383
51123H4383j802j589k55Q90O14n86j222q11l19o15j330j572j171o94n26m78l04
$$ 84383 82581 80992 80737 81627 82241 81655 80433 79622 79303 78688 77358 75786 74615 73921 73395 72917 72613
51106G2613j30j34j17K80Q95J010K15r11j369q84j34J96J12L4J65M29P14R22R74
$$ 72613 72483 72349 72232 72512 73407 74417 74632 73721 72352 71468 71334 71530 71642 71676 71841 72270 72984 73906 74880
51087G4880R41R65R11M34m54j192j315j013p15n34l76l60o29r45r46o52l65k25
$$ 74880 75821 76786 77697 78131 77677 76485 75170 74157 73442 72908 72532 72172 71543 70598 69652 69000 68635 68410
51069F8410k40n20j010j193n79N36J317J385J065P29L84L1j31p9j12m70j005j403
$$ 68410 68170 67650 66640 65447 64868 65404 66721 68106 69171 69900 70284 70315 70184 70105 69993 69523 68518 67115
51051F7115j479j232q17m69j87L79J407K341K315J181k96j249j343o72M16J332
$$ 67115 65636 64404 63587 63118 62931 63310 64717 67058 69373 70554 70258 69009 67666 66994 67410 68742
51035F8742J575J274R74Q54O08J92J17P12J566K026J924J531J143R32R11Q57N28
$$ 68742 70317 71591 72565 73419 74027 74219 74336 75048 76614 78640 80564 82095 83238 84170 85081 85938 86466
51018H6466Q3n1J68K64k5l74m34l12k14m7K53M40M09N33J100J708J752J237P11
$$ 86466 86549 86498 86666 86930 86905 86531 86097 85785 85571 85524 85777 86217 86626 87159 88259 89967 91719 92956 93667
50999I3667N04M65L49P0k86n24m54k20k23n47p95p36q17j436k145k115j302n43
$$ 93667 94171 94636 94985 95055 94769 94245 93791 93571 93348 92801 92006 91270 90453 89017 86872 84757 83455 82912
50981H2912m06m99j24P96J623J703R78mo36p79p60q51j001j031q70m98Q1O45Q47
$$ 82912 82506 82007 81883 82679 84302 86005 86983 86979 86343 85564 84804 83953 82952 81921 81051 80553 80634 81279 82126
50962H2126O83N40O39P90Q70J138J705K125J912J227N93K00j18m27o23o01j84
$$ 82126 82809 83349 83988 84778 85648 86786 88491 90616 92528 93755 94348 94548 94430 94003 93380 92779 92595
50945I2595Q04K064K747K350J424R16J076J487J803J873J496P67M65J229K522
$$ 92595 93399 95463 98210 100560 101984 102900 103976 105463 107266 109139 110635 111402 111867 113096 115618
50930A15618L171K897K520K603K789K689K578K902L623M440N089N229M643L816
$$ 115618 118789 121686 124206 126809 129598 132287 134865 137767 141390 145830 150919 156148 160791 164607
50916A64607L757M817O228P102P435P683P890P843P793Q346R701J1358J2641J3250
$$ 164607 168364 173181 179409 186511 193946 201629 209519 217362 225155 233501 243202 254560 267201 280451
50902B80451J3382J3462J3800J4349J4948J5612J6374J6868J6559J5500J4455
$$ 280451 293833 307295 321095 335444 350392 366004 382378 399246 415805 431305 445760
50891D45760J4003J3922J3622J2897J1900J0727R379P989O742N668M751M040L572
$$ 445760 459763 473685 487307 500204 512104 522831 532210 540199 546941 552609 557360 561400 564972
50878E64972L265L060K931K743K297J642J049O10J29m95j227k276l998o198q102
$$ 564972 568237 571297 574228 576971 579268 580910 581959 582569 582698 582203 580976 578700 574702 568504 560402
50863E60402r367j0585j2350j4354j5981j7238j8404j9125j8799j7688j6757j6305
$$ 560402 551035 540450 528100 513746 497765 480527 462123 442998 424199 406511 389754 373449
50851C73449j5669j4462j3268j2648j2168j1033r308p817o995o490n885n262m797
$$ 373449 357780 343318 330050 317402 305234 294201 284893 277076 270081 263591 257706 252444 247647
50838B47647m253l246j914r04o36q03p68k93K90N56M31J53NJ16M07P46J159J756
$$ 247647 243394 240148 238234 237330 236694 235891 235123 234830 235120 235676 236107 236260 236265 236381 236788 237534 238693 240449
50820B40449K319K232J259K04K18J413K735L334L375L289L011K529K504L453M785
$$ 240449 242768 245000 246259 246463 246681 248094 250829 254163 257538 260827 263838 266367 268871 272324 277109
50805B77109N511N678O182P241Q131Q488Q928R954J1189J2156J3112J4443J5879
$$ 277109 282620 288298 294480 301721 309852 318340 327268 337222 348411 360567 373679 388122 404001
50792D04001J6949J7879J9223K0921K2458K3776K5360K7364K9314L0873L2289
$$ 404001 420950 438829 458052 478973 501431 525207 550567 577931 607245 638118 670407
50781F70407L3905L5607L6999L7799L7831L6948L5148L2673K9778K6628K3511
$$ 670407 704312 739919 776918 814717 852548 889496 924644 957317 987095 1013723 1037234
50770A037234K0857J8809J6944J4746J2271J0096Q631P737P099O769P147Q413
$$ 1037234 1058091 1076900 1093844 1108590 1120861 1130957 1139588 1147325 1154424 1161193 1168340 1176753
50758A176753J0114J1390J1595J0704R082P004M442J303k310o091r764j3232j6606
$$ 1176753 1186867 1198257 1209852 1220556 1229638 1236642 1241084 1242387 1240077 1233986 1224222 1210990 1194384
50745A194384k0009k3370k6386k8698l0067l0405k9807k8613k7178k5463k3014
$$ 1194384 1174375 1151005 1124619 1095921 1065854 1035449 1005642 977029 949851 924388 901374
50734I01374j9623j5789j2237r150o218l236j63L239P134J0968J3821J5550J6839
$$ 901374 881751 865962 853725 844575 838357 835121 834958 838197 845331 856299 870120 885670 902509
50721I02509J7949J8204J7191J5594J4178J2688J0592Q214O078L729M67l111n649
$$ 902509 920458 938662 955853 971447 985625 998313 1008905 1017119 1023197 1026926 1027393 1024282 1018633
50708A018633p111q879j1572j4203j5923j7237j8788k0178k1042k2093k3922k5507
$$ 1018633 1011522 1002643 991071 976868 960945 943708 924920 904742 883700 861607 837685 812178
50696H12178k5351k3700k2278k1946k1830k0847j8972j6768j4501j2182r839p431
$$ 812178 786827 763127 740849 718903 697073 676226 657254 640486 625985 613803 603964 596533
50684E96533m974k824j378l80R22K802M718O209P555R329J1644J4133J6419J8340
$$ 596533 591559 588735 587357 586977 587899 590701 595419 601628 609183 618512 630156 644289 660708 679048
50670F79048J9921K1273K2487K3561K4532K5467K6172K6132K5051K3265K1230
$$ 679048 698969 720242 742729 766290 790822 816289 842461 868593 893644 916909 938139
50659I38139J8933J6251J3599J1500R729P636N276L319J848J34k085l927m483
$$ 938139 957072 973323 986922 998422 1008151 1015787 1021063 1024382 1026230 1026364 1024279 1020352 1015869
50646A015869l906k973k093j214k04J145L077N360P145P819P623P070O180M789
$$ 1015869 1011963 1008990 1006897 1005683 1005479 1006624 1009701 1015061 1022206 1030025 1037648 1044718 1050898 1055687
50632A055687L193J861P09p20k408l780m446m516m092k880n80K532N677Q229J0245
$$ 1055687 1058880 1060741 1061450 1060730 1058322 1054542 1050096 1045580 1041488 1038608 1038028 1040560 1046237 1054466 1064711
50617A064711J2235J4481J6792J9100K1882K5588K9899L4148L8411M3356M8905
$$ 1064711 1076946 1091427 1108219 1127319 1149201 1174789 1204688 1238836 1277247 1320603 1369508
50606A369508N3872N7312N9491O0966O1413O0070N6948N2773M8044M2869L7589
$$ 1369508 1423380 1480692 1540183 1601149 1662562 1722632 1779580 1832353 1880397 1923266 1960855
50595A960855L2760K8456K4176J9583J4887J0413O172K063j826n242p940r792
$$ 1960855 1993615 2022071 2046247 2065830 2080717 2091130 2097302 2099365 2097539 2092297 2084357 2074565
50583B074565j0860j1320j1240j0539r244p560n585l210n48J854L488M338M600
$$ 2074565 2063705 2052385 2041145 2030606 2021362 2013802 2008217 2005007 2004459 2006313 2009801 2014139 2018739
50570B018739M290L378K061M78j531m043o715r230j1774j4574j7318j9490k0987
$$ 2018739 2023029 2026407 2028468 2028946 2027415 2023372 2016657 2007427 1995653 1981079 1963761 1944271 1923284
50557A923284k1866k1779k0366j8004j5430j2769r629o112k919l62J901L924N082
$$ 1923284 1901418 1879639 1859273 1841269 1825839 1813070 1803441 1797329 1794410 1794048 1795949 1799873 1804955
50544A804955M880L557J467j586n939j1417j7512k3884l0281l6234m1202m4958
$$ 1804955 1809835 1813392 1814859 1813273 1807334 1795917 1778405 1754521 1724240 1688006 1646804 1601846
50532A601846m7583m9276n0350n1056n1222n0264m7936m4809m1749l9085l6503
$$ 1601846 1554263 1504987 1454637 1403581 1352359 1302095 1254159 1209350 1167601 1128516 1092013
50521A092013l3642l0399k6853k3223j9963j7543j5905j4278j1781q294m627j701
$$ 1092013 1058371 1027972 1001119 977896 957933 940390 924485 910207 898426 890132 885505 883804
50509H83804L67K248M508O945Q986J0397J1408J2405J3767J5809J8460K1112K3244
$$ 883804 884171 886419 890927 897872 906858 917255 928663 941068 954835 970644 989104 1010216 1033460
50496A033460K5137K7519L0465L3264L5512L7834M1142M5462M9852N3360N5780
$$ 1033460 1058597 1086116 1116581 1149845 1185357 1223191 1264333 1309795 1359647 1413007 1468787
50485A468787N7508N8902N9798N9625N8000N5190N1853M8507M5490M3297M2439
$$ 1468787 1526295 1585197 1644995 1704620 1762620 1817810 1869663 1918170 1963660 2006957 2049396
$$ [...]
##END NTUPLES=NMR SPECTRUM
##END=
