
##TITLE=UV1061_TOCA01-ROVE100D_6301398_ybxjpoWIiW
##JCAMPDX= 6.0         $$ Bruker NMR JCAMP-DX V2.0
##DATA TYPE= NMR SPECTRUM
##DATA CLASS= NTUPLES
##ORIGIN= BRUKER
##OWNER= Administrator
$$ 1.72 TOPSPIN		Version 2.1
$$ 2012-06-06 05:36:25.828 -0500  Administrator@TOPSPIN
$$ Compression mode = diff/dup
##.OBSERVE FREQUENCY= 400.13188235
##.OBSERVE NUCLEUS= ^1H
##.ACQUISITION MODE= SIMULTANEOUS (DQD)
##.ACQUISITION SCHEME= undefined
##.AVERAGES= 64
##.DIGITISER RES= 22
##SPECTROMETER/DATA SYSTEM= spect
##.PULSE SEQUENCE= noesygpps1d.comp
##.SOLVENT NAME= COFFEE_meoh
##.SHIFT REFERENCE= INTERNAL, COFFEE_meoh, 1, 14.98061
##AUDIT TRAIL= $$ (NUMBER, WHEN, WHO, WHERE, PROCESS, VERSION, WHAT)
$$ ##TITLE= Audit trail, TOPSPIN		Version 2.1
$$ ##JCAMPDX= 5.01
$$ ##ORIGIN= Bruker BioSpin GmbH
$$ ##OWNER= Administrator
$$ $$ C:\Bruker\TOPSPIN/data/COFFEE/nmr/UV1061_TOCA01-ROVE100D_6301398_ybxjpoWIiW/12/pdata/1/auditp.txt
$$ ##AUDIT TRAIL=  $$ (NUMBER, WHEN, WHO, WHERE, PROCESS, VERSION, WHAT)
(   1,<2012-06-06 05:36:20.640 -0500>,<Administrator>,<TOPSPIN>,<go>,<TOPSPIN 2.1>,
      <created by zg
	started at 2012-06-06 05:24:50.453 -0500,
	POWCHK enabled, PULCHK disabled,
       configuration hash MD5:
       D5 CA 7A 23 FE 6B EE E2 50 67 74 61 24 F7 5E 3B
       data hash MD5: 64K
       54 3E 7C CF 4F B7 52 29 3B B3 B2 7A A0 EC 23 AE>)
(   2,<2012-06-06 05:36:23.500 -0500>,<Administrator>,<TOPSPIN>,<proc1d>,<TOPSPIN 2.1>,
      <Start of raw data processing
       efp LB = 0.3 FT_mod = 6 PKNL = 1 PHC0 = 0 PHC1 = 0 SI = 128K 
       data hash MD5: 128K
       F9 12 CA 8B F2 8C A4 AA 55 AC 70 CD 50 13 09 5D>)
(   3,<2012-06-06 05:36:24.734 -0500>,<Administrator>,<TOPSPIN>,<proc1d>,<TOPSPIN 2.1>,
      <pk PHC0 = 32.93152 PHC1 = 0 
       data hash MD5: 128K
       CE 28 9E 57 45 51 0A 41 4D 88 AF 52 5B A8 78 8C>)
(   4,<2012-06-06 05:36:25.468 -0500>,<Administrator>,<TOPSPIN>,<proc1d>,<TOPSPIN 2.1>,
      <abs ABSG = 1 
       data hash MD5: 128K
       85 6A D1 DF 45 D9 53 2F F7 0B 2C 02 BF BE 4F 99>)
(   5,<2012-06-06 05:36:25.562 -0500>,<Administrator>,<TOPSPIN>,<proc1d>,<TOPSPIN 2.1>,
      <abs ABSG = 2 
       data hash MD5: 128K
       8D AF A8 73 27 D1 F8 6B 69 BE 48 14 BC 2A 21 3F>)
(   6,<2012-06-06 05:36:25.609 -0500>,<Administrator>,<TOPSPIN>,<proc1d>,<TOPSPIN 2.1>,
      <abs ABSG = 3 
       data hash MD5: 128K
       5F ED F1 1D DE F5 F3 72 52 D9 78 A5 49 D0 FB FF>)
(   7,<2012-06-06 05:36:25.687 -0500>,<Administrator>,<TOPSPIN>,<proc1d>,<TOPSPIN 2.1>,
      <abs ABSG = 4 
       data hash MD5: 128K
       B4 0E 38 09 00 95 AD 9B 7F 6C A2 53 02 2C A9 B9>)
(   8,<2012-06-06 05:36:25.734 -0500>,<Administrator>,<TOPSPIN>,<proc1d>,<TOPSPIN 2.1>,
      <abs ABSG = 5 
       data hash MD5: 128K
       2A 5C 08 9C DB 15 24 18 F6 6B B0 EA E1 F9 10 36>)
$$ ##END=
$$ 
$$ $$ hash MD5
$$ $$ C6 9F 24 97 7F 5D 36 FA 5C 42 94 71 0F 39 47 D2
##$RELAX= 
##$RELAX= 
##$RELAX= 
##$RELAX= 
##$RELAX= 
##$RELAX= 
##$RELAX= 
##$RELAX= 
$$ [...]
150 150 150 150 150 150 150 150
##$TP07= 0
##$TPNAME0= <>
##$TPNAME1= <>
##$TPNAME2= <>
##$TPNAME3= <>
##$TPNAME4= <>
##$TPNAME5= <>
##$TPNAME6= <>
##$TPNAME7= <>
##$TPOAL= (0..7)
0.5 0.5 0.5 0.5 0.5 0.5 0.5 0.5
##$TPOFFS= (0..7)
0 0 0 0 0 0 0 0
##$TUNHIN= 0
##$TUNHOUT= 0
##$TUNXOUT= 0
##$USERA1= <user>
##$USERA2= <user>
##$USERA3= <user>
##$USERA4= <user>
##$USERA5= <user>
##$V9= 5
##$VALIST= <valist>
##$VCLIST= <CCCCCCCCCCCCCCC>
##$VD= 0
##$VDLIST= <DDDDDDDDDDDDDDD>
##$VPLIST= <PPPPPPPPPPPPPPP>
##$VTLIST= <TTTTTTTTTTTTTTT>
##$WBST= 2048
##$WBSW= 25
##$XGAIN= (0..3)
0 0 0 0
##$XL= 0
##$YL= 0
##$YMAX_a= 11087825
##$YMIN_a= -9390692
##$ZGOPTNS= <>
##$ZL1= 120
##$ZL2= 120
##$ZL3= 120
##$ZL4= 120
##$ABSF1= 14.98061
##$ABSF2= -5.57192
##$ABSG= 5
##$ABSL= 3
##$ALPHA= 0
##$AQORDER= 0
##$ASSFAC= 0
##$ASSFACI= 0
##$ASSFACX= 0
##$ASSWID= 0
##$AUNMP= <proc_prof1d_extract.lims>
##$AXLEFT= 0
##$AXNAME= <>
##$AXNUC= <1H>
##$AXRIGHT= 0
##$AXTYPE= 0
##$AXUNIT= <>
##$AZFE= 0.1
##$AZFW= 0.1
##$BCFW= 0
##$BC_mod= 0
##$BYTORDP= 0
##$COROFFS= 0
##$CY= 15
##$DATMOD= 1
##$DC= 0
##$DFILT= <>
##$DTYPP= 0
##$F1P= 0
##$F2P= 0
##$FCOR= 0.5
##$FTSIZE= 131072
##$FT_mod= 6
##$GAMMA= 0
##$GB= 0
##$INTBC= 1
##$INTSCL= 1
##$ISEN= 128
##$LB= 0.3
##$LEV0= 0
##$LPBIN= 0
##$MAXI= 10000
##$MC2= 0
##$MEAN= 0
##$ME_mod= 0
##$MI= 0
##$NCOEF= 0
##$NC_proc= -1
##$NLEV= 6
##$NOISF1= 0
##$NOISF2= 0
##$NSP= 0
##$NTH_PI= 0
##$NZP= 0
##$OFFSET= 14.98061
##$PC= 1
##$PHC0= 32.93152
##$PHC1= 0
##$PH_mod= 1
##$PKNL= yes
##$PPARMOD= 0
##$PPDIAG= 0
##$PPIPTYP= 0
##$PPMPNUM= 2147483647
##$PPRESOL= 1
##$PSCAL= 4
##$PSIGN= 0
##$PYNMP= <proc.py>
##$REVERSE= no
##$SF= 400.13
##$SI= 131072
##$SIGF1= 0
##$SIGF2= 0
##$SINO= 400
##$SIOLD= 131072
##$SPECTYP= <>
##$SREGLST= <1H.CDCl3>
##$SSB= 0
##$STSI= 131072
##$STSR= 0
##$SW_p= 8223.68421052632
##$SYMM= 0
##$S_DEV= 0
##$TDeff= 65536
##$TDoff= 0
##$TI= <>
##$TILT= no
##$TM1= 0
##$TM2= 0
##$TOPLEV= 0
##$USERP1= <user>
##$USERP2= <user>
##$USERP3= <user>
##$USERP4= <user>
##$USERP5= <user>
##$WDW= 1
##$XDIM= 131072
##$YMAX_p= 116404289
##$YMIN_p= -354664452
##$CURPLOT= <Network HP LaserJet P1505>
##$CURPRIN= <$Network HP LaserJet P1505>
##$DFORMAT= <normdp>
##$LAYOUT= <+/1D_H.xwp>
##$LFORMAT= <normlp>
##$PFORMAT= <normpl>
##$SURQMSG= 1
$$ End of Bruker specific parameters
$$ ---------------------------------
##NTUPLES= NMR SPECTRUM
##VAR_NAME=  FREQUENCY,     SPECTRUM/REAL,   SPECTRUM/IMAG
##SYMBOL=    X,             R,               I
##VAR_TYPE=  INDEPENDENT,   DEPENDENT,       DEPENDENT
##VAR_FORM=  AFFN,          ASDF,            ASDF
##VAR_DIM=   131072,        131072,          131072
##UNITS=     HZ,            ARBITRARY UNITS, ARBITRARY UNITS
##FACTOR=    0.0627417313425165, 1,          1
##FIRST=     8223.62146879498, 587,          -18665
##LAST=      0,             979,             -18651
##MIN=       0,             -354664452,      0
##MAX=       8223.62146879498, 116404289,    0
$$ Real data points
##PAGE= N=1
##DATA TABLE= (X++(R..R)), XYDATA
$$ [...]
62501A16978q84r35r06q40p80p44p30p91r99j273j315r42l98j16j88k90j70M2
62483A04719R8K1N9L61P43Q25L82l69q86q27l91J0K70N58Q31P98M63K90O12J126
62463A09693J317J187J222J662K232K564K652K658K590K377K122K064K301K734
62449A39375L267L884M467M765M698M572M784N320N751N737N354M865M371L815
62435B05025L133K292J291K81m46p89j074j682k577l371l852m116m242m151l910
62420A81812l813l970m040l622k830k188k029k191k275k101j817j693j790j896
62406A45557j757j362r20n66k50J03M25N90N32K60j53n03n38k03L15Q40J326J708
62388A45404J775J444J031R63J299J664J716J444J058P08M49K49J2l58p66r29
$$ y = [116978, 116094, 115159, 114253, 113413, 112633, 111889, 111159, 110368, 109369, 108096, 106781, 105839, 105441, 105325, 105137, 104847, 104677, 104719, 104817, 104838, 104897, 105258, 106001, 106826, 107208, 106839, 105953, 105126, 104735, 104745, 105015, 105573, 106404, 107202, 107665, 107955, 108567, 109693, 111010, 112197, 113419, 115081, 117313, 119877, 122529, 125187, 127777, 130154, 132276, 134340, 136641, 139375, 142642, 146526, 150993, 155758, 160456, 165028, 169812, 175132, 180883, 186620, 191974, 196839, 201210, 205025, 208158, 210450, 211741, 212022, 211576, 210787, 209713, 208031, 205454, 202083, 198231, 194115, 189873, 185722, 181812, 177999, 174029, 169989, 166367, 163537, 161349, 159320, 157129, 154854, 152753, 150936, 149243, 147453, 145557, 143800, 142438, 141518, 140952, 140702, 140805, 141230, 141820, 142352, 142612, 142459, 141956, 141418, 141215, 141530, 142370, 143696, 145404, 147179, 148623, 149654, 150617, 151916, 153580, 155296, 156740, 157798, 158506, 158955, 159204, 159216, 158858, 158092, 157163]
62372A57163o78k17M3o3k53j71J87M56L98K03K61P05J333J822J933J592J016O87
62354A66417R63J609K015J983K003K561L395L795L508K980K740K853L146L557
62340B03525M060M421M400M144M121M542N073N243N020M767M724M733M562M288
62326B67623M170M231M210L903L437L119L158L502L931M261M492M824N391O099
62312C26351O747P303P921Q665R468J0329J1419J2862J4497J6017J7268J8352
62300D67199J9451K0609K1702K2589K3270K3815K4097K3710K2344K0133J7458
62289G06377J4505J1257P909M864K228l52l186o109q801j1236j3570j5743j7471
62276F70672j8572j9078j9124j8933j8744j8587j8183j7301j6092j4886j3771
$$ y = [157163, 156485, 156268, 156311, 156248, 155995, 155824, 156011, 156467, 156865, 157068, 157329, 158034, 159367, 161189, 163122, 164714, 165730, 166417, 167380, 168989, 171004, 172987, 174990, 177551, 180946, 184741, 188249, 191229, 193969, 196822, 199968, 203525, 207585, 212006, 216406, 220550, 224671, 229213, 234286, 239529, 244549, 249316, 254040, 258773, 263335, 267623, 271793, 276024, 280234, 284137, 287574, 290693, 293851, 297353, 301284, 305545, 310037, 314861, 320252, 326351, 333098, 340401, 348322, 356987, 366455, 376784, 388203, 401065, 415562, 431579, 448847, 467199, 486650, 507259, 528961, 551550, 574820, 598635, 622732, 646442, 668786, 688919, 706377, 720882, 732139, 740048, 744912, 747140, 746788, 743602, 737493, 728692, 717456, 703886, 688143, 670672, 652100, 633022, 613898, 594965, 576221, 557634, 539451, 522150, 506058, 491172, 477401]
62265D77401j2624j1438j0319r234q080o953o048n303m464l532k792k345j923
62252C92346j321o86k26J48O14J112J469J727K080K552K972L237L394L450L318
62237D16186L042K897L115L555L810L655L304L145L339L736M107M342M394M289
62223D66916M185M333M781N323N820O438P376Q436R175R468R688J0254J1173J2176
62209E75542J3123J4113J5187J6170J6903J7540J8460J9805K1315K2676K3934
62198G74768K5304K6677K7638K8013K8039K7855K7159K5602K3218K0273J6837
62187A051383J2920Q776M744R71k438n178p108q656j0340j2010j3060j3381j3498
62174I93125j3660j3458j2563j1290j0043q724p119n494m280l412k464j360m26
$$ y = [477401, 464777, 453339, 443020, 433786, 425706, 418753, 412705, 407402, 402938, 399406, 396614, 394269, 392346, 391025, 390339, 390113, 390261, 390875, 391987, 393456, 395183, 397263, 399815, 402787, 406024, 409418, 412868, 416186, 419228, 422125, 425240, 428795, 432605, 436260, 439564, 442709, 446048, 449784, 453891, 458233, 462627, 466916, 471101, 475434, 480215, 485538, 491358, 497796, 505172, 513608, 522783, 532251, 541939, 552193, 563366, 575542, 588665, 602778, 617965, 634135, 651038, 668578, 687038, 706843, 728158, 750834, 774768, 800072, 826749, 854387, 882400, 910439, 938294, 965453, 991055, 1014273, 1034546, 1051383, 1064303, 1073079, 1077823, 1078794, 1076356, 1071178, 1064070, 1055414, 1045074, 1033064, 1020004, 1006623, 993125, 979465, 966007, 953444, 942154, 932111, 923387, 916268, 910774, 906494, 903082, 900618, 899258, 898832]
62161H98832J99P85J618K681L810M839N540N756N701N909O718P896Q912R490R750
62146I78436R980J0353J0904J1603J2391J3121J3620J3871J4091J4518J5176J5931
62134A133995J6692J7451J8117J8584J8963J9483K0130K0610K0772K0800K0826
62123A346423K0636J9951J8842J7566J6214J4756J3303J2060J1099J0428J0182
62112A511460J0439J0943J1364J1834J2833J4445J6070J7015J7152J6783J6119
62101A666457J5114J3675J1783R478O908M382K127K2k257m793p260r287j0876
62088A695473j2291j3634j4673j5180j5257j5231j5297j5367j5243j4791j3958
62077A534551j2783j1461j0317r591r278r190r113q878q419p828p310p033p010
$$ y = [898832, 899031, 899816, 901434, 904115, 907925, 912764, 918304, 924060, 929761, 935670, 942388, 950284, 959196, 968686, 978436, 988416, 998769, 1009673, 1021276, 1033667, 1046788, 1060408, 1074279, 1088370, 1102888, 1118064, 1133995, 1150687, 1168138, 1186255, 1204839, 1223802, 1243285, 1263415, 1284025, 1304797, 1325597, 1346423, 1367059, 1387010, 1405852, 1423418, 1439632, 1454388, 1467691, 1479751, 1490850, 1501278, 1511460, 1521899, 1532842, 1544206, 1556040, 1568873, 1583318, 1599388, 1616403, 1633555, 1650338, 1666457, 1681571, 1695246, 1707029, 1716507, 1723415, 1727797, 1729924, 1729946, 1727689, 1722896, 1715636, 1706349, 1695473, 1683182, 1669548, 1654875, 1639695, 1624438, 1609207, 1593910, 1578543, 1563300, 1548509, 1534551, 1521768, 1510307, 1499990, 1490399, 1481121, 1471931, 1462818, 1453940, 1445521, 1437693, 1430383, 1423350, 1416340]
62064A416340p124p156o859o180n453n175n463n909o059n883n678n635n753o003
62050A332010o394o867p312p638p775p688p498p479p745q031p983p590p120o763
62036A228127o510o353o265o049n489m703m074l720l312k549j556o34J86J082
62022A178181K082L019L833M698N771O962P992Q628Q880R008R303R758R912R141
62008A277168P171M361J421j073k905m032m478m528m908o419r246j2801j6330
61995A223401j9525k2389k4783k6409k7279k7762k8153k8387k8336k8133k7964
61984I34281k7707k7043k5895k4532k3219k1966k0667j9371j8187j7093j5940
61973F92661j4679j3469j2485j1715j1030j0379r888r688r721r741r517r069q672
$$ y = [1416340, 1409216, 1402060, 1395201, 1389021, 1383568, 1378393, 1372930, 1367021, 1360962, 1355079, 1349401, 1343766, 1338013, 1332010, 1325616, 1318749, 1311437, 1303799, 1296024, 1288336, 1280838, 1273359, 1265614, 1257583, 1249600, 1242010, 1234890, 1228127, 1221617, 1215264, 1208999, 1202950, 1197461, 1192758, 1188684, 1184964, 1181652, 1179103, 1177547, 1176913, 1177099, 1178181, 1180263, 1183282, 1187115, 1191813, 1197584, 1204546, 1212538, 1221166, 1230046, 1239054, 1248357, 1258115, 1268027, 1277168, 1284339, 1288700, 1290121, 1289048, 1286143, 1282111, 1277633, 1273105, 1268197, 1261778, 1252532, 1239731, 1223401, 1203876, 1181487, 1156704, 1130295, 1103016, 1075254, 1047101, 1018714, 990378, 962245, 934281, 906574, 879531, 853636, 829104, 805885, 783919, 763252, 743881, 725694, 708601, 692661, 677982, 664513, 652028, 640313, 629283, 618904, 609016, 599328, 589607, 579866, 570349, 561280, 552608]
61960E52608q582q770q976q954q599p889o890n882n220m893m402l322j832m30
61946D67967P48J933L155M103M623M944N177N017M200K949J637K50j453l436n379
61931D96435p082q563r829j0845j1624j2108j2063j1387j0429r663r143q618q066
61918C67015p675p291o465n192m069l504l145k472j609j078r60p84k08N36J030
61903C24129J205J369J820K615L622M677N647O470P177P910Q806R832J0789J1579
61889D07647J2348J3306J4486J5806J7253J8797K0231K1344K2192K2976K3682
61878F10068K4095K4197K4196K4096K3593K2559K1412K0651K0234J9575J8173
61867H52849J6022J3542J1219R338P932P001O700P201Q417J0057J1997J4405J7385
$$ y = [552608, 544026, 535256, 526280, 517326, 508727, 500838, 493948, 488066, 482846, 477953, 473551, 470229, 468397, 467967, 468715, 470648, 473803, 477906, 482529, 487473, 492650, 497667, 501867, 504816, 506453, 506703, 505250, 501814, 496435, 489353, 480790, 470961, 460116, 448492, 436384, 424321, 412934, 402505, 392842, 383699, 375081, 367015, 359340, 352049, 345584, 340392, 336323, 332819, 329674, 327202, 325593, 324515, 323555, 322771, 322563, 323099, 324129, 325334, 326703, 328523, 331138, 334760, 339437, 345084, 351554, 358731, 366641, 375447, 385279, 396068, 407647, 419995, 433301, 447787, 463593, 480846, 499643, 519874, 541218, 563410, 586386, 610068, 634163, 658360, 682556, 706652, 730245, 752804, 774216, 794867, 815101, 834676, 852849, 868871, 882413, 893632, 902970, 910902, 917903, 924603, 931804, 940221, 950278, 962275, 976680, 994065]
61854I94065K0750K4251K7805L1337L4634L7532M0077M2348M4233M5648M6769
61843A389449M7878M9062N0260N1517N2926N4376N5494N5804N4819N2069M7184
61832A960838L9853K9745J6761J538j4453k9690m3358n5182o4826p1868p6295
61821A693063p8529p8967p7795p5321p2045o8248o3829n8721n3268m7977m3057
61810I75306l8397l3828k9289k4844k0661j6910j3518j0166o611k978M21L500
61798G82025O498R669J2912J5853J8245K0292K2402K4610K6351K7013K6573K5522
61786A017965K4194K2434J9908J6539J2539Q243M050L12k776n166o730p273o815
61773A097424n739m429k953j222O51K295L334L564K926J471p22l596p088j0929
$$ y = [994065, 1014815, 1039066, 1066871, 1098208, 1132842, 1170374, 1210451, 1252799, 1297032, 1342680, 1389449, 1437327, 1486389, 1536649, 1588166, 1641092, 1695468, 1750962, 1806766, 1861585, 1913654, 1960838, 2000691, 2030436, 2047197, 2048735, 2034282, 2004592, 1961234, 1906052, 1841226, 1769358, 1693063, 1614534, 1535567, 1457772, 1382451, 1310406, 1242158, 1178329, 1119608, 1066340, 1018363, 975306, 936909, 903081, 873792, 848948, 828287, 811377, 797859, 787693, 781082, 778104, 778525, 782025, 788523, 798192, 811104, 826957, 845202, 865494, 887896, 912506, 938857, 965870, 992443, 1017965, 1042159, 1064593, 1084501, 1101040, 1113579, 1121822, 1125872, 1126184, 1123408, 1118242, 1111512, 1104239, 1097424, 1091685, 1087256, 1084303, 1083081, 1083732, 1086027, 1089361, 1092925, 1095851, 1097322, 1096600, 1093004, 1085916, 1074987]
61759A074987j4706j8141k1229k3922k5935k7077k7633k8008k8125k7508k6040
61748H06663k4169k2300k0313j7970j5457j3141j1044q912o740m786l043j097
61736F57691J298L810N946P659R306J1152J3162J5212J7253J9309K1491K4028
61724H07317K7071L0436L3786L7108M0798M5209N0221N5497O0962O6810P3138
61713A328353P9795Q6627R3601J00645J07487J13820J19453J24069J26856J26580
61703B407286J22111J12745R8099P7984N2825K4124n804l4742o1135q3850j01907
61692B607736j14778j22808j26916j27913j26328j22743j17852j12072j05459
61683A530867r8184r0753q3643p6930p0529o4455n8670n2926m7207m2062l8046
$$ y = [1074987, 1060281, 1042140, 1020911, 996989, 971054, 943977, 916344, 888336, 860211, 832703, 806663, 782494, 760194, 739881, 721911, 706454, 693313, 682269, 673357, 666617, 661831, 658788, 657691, 658989, 662799, 668745, 676404, 685710, 696862, 710024, 725236, 742489, 761798, 783289, 807317, 834388, 864824, 898610, 935718, 976516, 1021725, 1071946, 1127443, 1188405, 1255215, 1328353, 1408148, 1494775, 1588376, 1689021, 1796508, 1910328, 2029781, 2153850, 2280706, 2407286, 2529397, 2642142, 2740241, 2818225, 2871050, 2895174, 2889370, 2854628, 2793493, 2709643, 2607736, 2492958, 2370150, 2243234, 2115321, 1988993, 1866250, 1748398, 1636326, 1530867, 1432683, 1341930, 1258287, 1181357, 1110828, 1046373, 987703, 934777, 887570, 845508, 807462]
61672H07462l4937l1902k8515k5175k2429k0244j8194j6112j4257j2979j2379
61661E70339j2293j2467j2731j3073j3531j4011j4368j4596j4854j5207j5482
61650D17726j5418j4875j3884j2653j1514j0709j0159r574q855q232p878p660
61638B86315p337o912o506o103n614n122m809m681m571m426m356m345m194l844
61624B13495l536l490l505l195k543k008j954k189k201j796j306j168j448j836
61610A81320j963j632q67Q3Q05R62O02J23p2R1M06O90R72J425K067K647K842K659
61592A93160K483K688L263L895M344M566M593M510M479M545M422L701K386R99
61578B44034N4l48l63r6L40P20Q77R38J125J474J853K225K640L051L320L367L139
$$ y = [807462, 772525, 740623, 712108, 686933, 664504, 644260, 626066, 609954, 595697, 582718, 570339, 558046, 545579, 532848, 519775, 506244, 492233, 477865, 463269, 448415, 433208, 417726, 402308, 387433, 373549, 360896, 349382, 338673, 328514, 318940, 310085, 301853, 293975, 286315, 278978, 272066, 265560, 259457, 253843, 248721, 243912, 239231, 234660, 230234, 225878, 221533, 217339, 213495, 209959, 206469, 202964, 199769, 197226, 195218, 193264, 191075, 188874, 187078, 185772, 184604, 183156, 181320, 179357, 177725, 176858, 176941, 177746, 178708, 179310, 179433, 179361, 179452, 179858, 180548, 181520, 182945, 185012, 187659, 190501, 193160, 195643, 198331, 201594, 205489, 209833, 214399, 218992, 223502, 227981, 232526, 236948, 240649, 243035, 244034, 244088, 243740, 243377, 243281, 243621, 244341, 245218, 246156, 247281, 248755, 250608, 252833, 255473, 258524, 261844, 265211, 268350]
61561B68350K513J402m9j563k986m288n412o233o718o893o781o533o455o651o727
61546B04976o252n391m734m469m222l787l444l312k937j984r47n63p88r17o08
61531A60621j94Q5M43J012J446J455J311J439J747J853J745J816K235K728L053
61516A82795L353L845M382M588M355M024M031M432M870M965M717M472M496M676
61502B44001M684M354L817L303K980K929L113L335L398L360L470L713L688L135
61488B93280K488K502L278L973L718K598J465R15P73N81K15j79n83j094j589j736
61472C10605j432j000q47r88j100r17m11L49J356K525L538M028M034M128M922
61457C28790O437Q113R459J0522J1647J2963J4367J5820J7390J8995K0460K1826
$$ y = [268350, 270863, 272265, 272216, 270653, 267667, 263379, 257967, 251734, 245016, 238123, 231342, 224809, 218354, 211703, 204976, 198724, 193333, 188599, 184130, 179908, 176121, 172677, 169365, 166428, 164444, 163497, 162934, 162146, 161229, 160621, 160427, 160512, 160955, 161967, 163413, 164868, 166179, 167618, 169365, 171218, 172963, 174779, 177014, 179742, 182795, 186148, 189993, 194375, 198963, 203318, 207342, 211373, 215805, 220675, 225640, 230357, 234829, 239325, 244001, 248685, 253039, 256856, 260159, 263139, 266068, 269181, 272516, 275914, 279274, 282744, 286457, 290145, 293280, 295768, 298270, 301548, 305521, 309239, 311837, 313302, 314217, 314990, 315571, 315786, 315607, 315024, 313930, 312341, 310605, 309173, 308173, 307326, 306338, 305238, 304321, 303910, 304259, 305615, 308140, 311678, 315706, 319740, 323868, 328790, 335227, 343340, 352799, 363321, 374968, 387931, 402298, 418118, 435508, 454503, 474963, 496789]
61445D96789K3351K5052K6582K7674K8449K8999K8941K7778K5511K2548J9051
61434G80725J4867J0082N246P78l459p731j1825j5143j7342j8583j9196j9324
61422F99095j8957j8125j6982j5760j4602j3421j1946j0072q107o526n434m471
61410E54692l274j960r34k93L55J387K675L781M569N346O318P198P599P608P676
61395F02743Q009Q384Q634Q955R572J0288J0636J0420R963R782J0086J0545J0577
61382G28594R894Q814P865P168O357N181L854K696J738Q82K28j13l67q57j490
61367G80444j810j665j458j639k227k950l644m310m962n561o063o353o284n883
61353G25635n436n205n131m976m697m524m619m855m998m977m849m579l990l076
$$ y = [496789, 520140, 545192, 571774, 599448, 627897, 656896, 685837, 713615, 739126, 761674, 780725, 795592, 805674, 810920, 811698, 808239, 800508, 788683, 773540, 756198, 737615, 718419, 699095, 680138, 662013, 645031, 629271, 614669, 601248, 589302, 579230, 571123, 564597, 559163, 554692, 551418, 549458, 548524, 548231, 548586, 549973, 552648, 556429, 560998, 566344, 572662, 579860, 587459, 595067, 602743, 610752, 619136, 627770, 636725, 646297, 656585, 667221, 677641, 687604, 697386, 707472, 718017, 728594, 738488, 747302, 755167, 762335, 768692, 773873, 777727, 780423, 782161, 783043, 783271, 783158, 782791, 781934, 780444, 778634, 776969, 775511, 773872, 771645, 768695, 765051, 760741, 755779, 750218, 744155, 737802, 731518, 725635, 720199, 714994, 709863, 704887, 700190, 695666, 691047, 686192, 681194, 676217, 671368, 666789, 662799, 659723]
61339F59723k144j506j055l45Q50K322L818N427P336R406J1336J3164J5270J7795
61325G41397K0381K2649K4642K6582K8396K9769L0549L0804L0574K9737K8204
61314A043684K5932K2789J8626J3613Q357L446r94n222r381j3312j6813j9821
61302A070904k2279k3969k4749k4880k4860k4908k4775k4139k2954k1356j9438
61291H12597j7315j5229j3368j1658r990q527p525o893o225n349m569m257m452
61278F97240m907n359n572n391m862m208l530k708j682o42K29R58J582J954J974
61263F65076J865J898J993J865J497J134R01P06N15M14L61J83j11k78k44k53m90
61246F77032p67q14p03p51j072j368j248o32J05M50J47o33j608k746m153n676
$$ y = [659723, 657579, 656073, 655018, 654673, 655523, 657845, 661663, 667090, 674426, 683832, 695168, 708332, 723602, 741397, 761778, 784427, 809069, 835651, 864047, 893816, 924365, 955169, 985743, 1015480, 1043684, 1069616, 1092405, 1111031, 1124644, 1133001, 1136447, 1135453, 1130231, 1120850, 1107538, 1090725, 1070904, 1048625, 1024656, 999907, 975027, 950167, 925259, 900484, 876345, 853391, 832035, 812597, 795282, 780053, 766685, 755027, 745037, 736510, 728985, 722092, 715867, 710518, 705949, 701692, 697240, 692333, 686974, 681402, 676011, 671149, 666941, 663411, 660703, 659021, 658379, 658608, 659566, 661148, 663102, 665076, 666941, 668839, 670832, 672697, 674194, 675328, 676229, 676935, 677450, 677864, 678225, 678408, 678297, 678019, 677775, 677522, 677032, 676265, 675451, 674748, 673997, 672925, 671557, 670309, 669677, 669782, 670232, 670379, 669746, 668138, 665392, 661239, 655563]
61230F55563o869p428p442p156o709o189n722n264m611l746l007k637k398j877
61216E84508j040j94N54J389K388L417M436N601O972Q352R612J0842J2064J3066
61202F61967J3679J4040J4324J4438J4177J3626J3087J2715J2400J1984J1439
61191H07876J0815J0180R514Q580O987M644K005l66k465m773p502j0264j2615
61178H22616j4582j6433j8154j9416j9974j9798j8965j7650j6245j5199j4580
61167F31620j4040j3222j2165j1175j0452r902r276q432p498o793o501o416o155
61154E09593n621n098m787m473l810k859k042j606j391j174j004j060j318j583
61140D71767j741j793j683j251m36N55J374J778J817J811K105K752L465L919M067
$$ y = [655563, 648694, 641266, 633824, 626668, 619959, 613770, 608048, 602784, 598173, 594427, 591420, 588783, 586385, 584508, 583468, 583274, 583828, 585217, 587605, 591022, 595458, 601059, 608031, 616383, 625995, 636837, 648901, 661967, 675646, 689686, 704010, 718448, 732625, 746251, 759338, 772053, 784453, 796437, 807876, 818691, 828871, 838385, 846965, 853952, 858596, 860601, 860235, 857770, 852997, 845495, 835231, 822616, 808034, 791601, 773447, 754031, 734057, 714259, 695294, 677644, 661399, 646200, 631620, 617580, 604358, 592193, 581018, 570566, 560664, 551388, 542956, 535458, 528665, 522164, 515748, 509593, 503972, 498874, 494087, 489614, 485804, 482945, 480903, 479297, 477906, 476732, 475728, 474668, 473350, 471767, 470026, 468233, 466550, 465299, 464863, 465418, 466792, 468570, 470387, 472198, 474303, 477055, 480520, 484439, 488506]
61125D88506M037L798L134K012P35l39j134j774k333k781l117l444l890m569n501
61110D73340o520p297p655p835q247q940r476r382q656p716o958o480o181n955
61096C66042n693n240m514l646k910k449k108j650r84j39Q54J904K773L291L616
61081C49147M008M281L848K458O05r85k052k724l082l172l253l587l953l853l226
61066C34460k566k246k126j975j897k033k184k061j731j515j538j695j904k133
61052C06856k184j838j245q84j010j381j600j570j429j255r57m65J83Q60J378
61037B93459J533J253P33K41k03q39j768k690l198l237l116l092l162l221l230
61022B69463l142k871k443k021j679j323r19o03m20j44L66Q50R64Q12Q26J176
$$ y = [488506, 492543, 496341, 499475, 501487, 502222, 501883, 500749, 498975, 496642, 493861, 490744, 487300, 483410, 478841, 473340, 466820, 459523, 451868, 444033, 435786, 426846, 417370, 407988, 399332, 391616, 384658, 378178, 371997, 366042, 360349, 355109, 350595, 346949, 344039, 341590, 339482, 337832, 336848, 336709, 337563, 339467, 342240, 345531, 349147, 353155, 357436, 361284, 363742, 364347, 363362, 361310, 358586, 355504, 352332, 349079, 345492, 341539, 337686, 334460, 331894, 329648, 327522, 325547, 323650, 321617, 319433, 317372, 315641, 314126, 312588, 310893, 308989, 306856, 304672, 302834, 301589, 300705, 299695, 298314, 296714, 295144, 293715, 292460, 291503, 291038, 291221, 292081, 293459, 294992, 296245, 296978, 297219, 297016, 296177, 294409, 291719, 288521, 285284, 282168, 279076, 275914, 272693, 269463, 266321, 263450, 261007, 258986, 257307, 255984, 255065, 254462, 254042, 253898, 254264, 255114, 256078, 256890, 257716, 258892]
61006B58892J600J825J856J814J740J628J513J391J220J065J071J251J434J472
60992B79772J410J449J765K328K829K905K587K313K381K578K611K600K796L033
60978C13357K981K784K909L395L780L835L813L904L976L997M192M626N036N328
60964C67913N722O266O640O716O825P218P638P807P905Q277Q951R677J0218J0420
60950D78193J0337J0395J1008J1971J2657J2942J3379J4288J5377J6424J7688
60939F24659J9290K0897K2386K4166K6404K8628L0553L2638L5305L8271M1229
60928I44426M4428M8056N1742N5352N9481O4498O9825P4883P9903Q5052Q9768
60917A667414R3994R9073J06241J15125J24918J36041J49160J63585J78383J94344
$$ y = [258892, 260492, 262317, 264173, 265987, 267727, 269355, 270868, 272259, 273479, 274544, 275615, 276866, 278300, 279772, 281182, 282631, 284396, 286724, 289553, 292458, 295045, 297358, 299739, 302317, 304928, 307528, 310324, 313357, 316338, 319122, 322031, 325426, 329206, 333041, 336854, 340758, 344734, 348731, 352923, 357549, 362585, 367913, 373635, 379901, 386541, 393257, 400082, 407300, 414938, 422745, 430650, 438927, 447878, 457555, 467773, 478193, 488530, 498925, 509933, 521904, 534561, 547503, 560882, 575170, 590547, 606971, 624659, 643949, 664846, 687232, 711398, 737802, 766430, 796983, 829621, 864926, 903197, 944426, 988854, 1036910, 1088652, 1144004, 1203485, 1267983, 1337808, 1412691, 1492594, 1577646, 1667414, 1761408, 1860481, 1966722, 2081847, 2206765, 2342806, 2491966, 2655551, 2833934, 3028278]
60907C028278K13084K35055K60300K90155L25853L66275M09769M57474N11976
60898F098219N73816O43353P25121Q24608R40749J068508J208408J358286J483016
60889A4924084J503871J346282J014452O10665K66858N5831k8688k1555N3550
60880A9725350J62580K25587J42443j27156n17254q99960j175489j319659j361175
60871A4855267j336535j271085j184017j091052r99663r09393q19020p30184o44787
60862E869531n63776m89474m25501l73103l29944k93279k62104k35662k12362
60853B684326j91287j72889j57230j43099j29656j17459j06981r7586q8793q1244
60843A398102p5506p1022o7018o3443o0270n6887n2998m9193m5972m2992l9899
$$ y = [3028278, 3241362, 3476417, 3736717, 4026872, 4352725, 4719000, 5128769, 5586243, 6098219, 6672035, 7315388, 8040509, 8865117, 9805866, 10874374, 12082782, 13441068, 14924084, 16427955, 17774237, 18788689, 19399354, 19666212, 19722043, 19693355, 19671800, 19725350, 19887930, 20113517, 20255960, 20128804, 19611550, 18711590, 17536101, 16216442, 14855267, 13518732, 12247647, 11063630, 9972578, 8972915, 8063522, 7244502, 6514318, 5869531, 5305755, 4816281, 4390780, 4017677, 3687733, 3394454, 3132350, 2896688, 2684326, 2493039, 2320150, 2162920, 2019821, 1890165, 1772706, 1665725, 1568139, 1479346, 1398102, 1322596, 1251574, 1184556, 1121113, 1060843, 1003956, 950958, 901765, 855793, 812801, 772902]
60832G72902l6992l4476l1935k9169k6741k5051k3607k1885k0103j8629j7287
60821D87027j5966j5070j4740j4364j3493j2581j2100j1695j0943j0204r936r753
60809C36182r058q112p592p493p272o768o217n665n065m685m719m780m410l839
60795B50507l599l648l526l156k854k704k492k153j762j250o00j11j9n2J05J91
60779B22877k26r63j400j341j115r87r49j032j266j411j143n51K1M82R68J373
60763B13337J386J009O32N62P44R77J147J246J395J736K176K375K194J913J806
60748B34635J744J486J107Q25O38M63M41P39J206J500J390P95j99j136j424j057
60732B43153p61j037j527j725j797k126k551k675k655k860l027k524j439o13n40
$$ y = [772902, 735910, 701434, 669499, 640330, 613589, 588538, 564931, 543046, 522943, 504314, 487027, 471061, 455991, 441251, 426887, 413394, 400813, 388713, 377018, 366075, 355871, 345935, 336182, 327124, 319012, 311420, 303927, 296655, 289887, 283670, 278005, 272940, 268255, 263536, 258756, 254346, 250507, 246908, 243260, 239734, 236578, 233724, 231020, 228528, 226375, 224613, 223363, 222763, 222652, 222633, 222581, 222686, 222877, 222651, 221688, 220288, 218947, 217832, 216845, 215896, 214864, 213598, 212187, 211044, 210493, 210514, 210996, 211964, 213337, 214723, 215732, 216364, 216926, 217670, 218647, 219794, 221040, 222435, 224171, 226347, 228722, 230916, 232829, 234635, 236379, 237865, 238972, 239797, 240435, 240898, 241339, 242078, 243284, 244784, 246174, 246969, 246770, 245634, 244210, 243153, 242392, 241355, 239828, 238103, 236306, 234180, 231629, 228954, 226299, 223439, 220412, 217888, 216449, 215836, 215296]
60717B15296q97j208j366j357j069n89k54k33l36l62k47R1O77J223J327J017P24
60700B12437P24R34J225J531J668J429R85P27P53Q78J127J742K618L179L026K346
60684B37329J549Q04P7o69j455k256k871l081k980k938l160l540l878m060m031
60669B04840l824l604l459l239k860k568k595k705k512k149k105k377k382j800
60655A66661j047p17r28j368j677j624j234q54q36j061j105q54o68q09j087j181
60639A49611j008o73l09p8n9j08o4n8k48l96r0N75J058J139J149J296J320J082
60621A54139R70J364K029K381K171J636J193J145J487J886K017J977K121K477
60607A78993K740K823L015L362L465L075K551K370K559K876L167L293L050K537
$$ y = [215296, 214399, 213191, 211825, 210468, 209399, 208810, 208556, 208323, 207987, 207625, 207378, 207469, 208146, 209369, 210696, 211713, 212437, 213161, 214095, 215320, 216851, 218519, 219948, 220933, 221660, 222413, 223291, 224418, 226160, 228778, 231957, 234983, 237329, 238878, 239682, 239759, 239090, 237635, 235379, 232508, 229427, 226447, 223509, 220349, 216809, 212931, 208871, 204840, 201016, 197412, 193953, 190714, 187854, 185286, 182691, 179986, 177474, 175325, 173220, 170843, 168461, 166661, 165614, 164897, 163969, 162601, 160924, 159300, 158066, 157212, 156376, 155315, 154210, 153356, 152688, 151879, 150792, 149611, 148603, 147930, 147621, 147543, 147484, 147376, 147312, 147254, 147006, 146610, 146520, 147095, 148153, 149292, 150441, 151737, 153057, 154139, 155109, 156473, 158502, 160883, 163054, 164690, 165883, 167028, 168515, 170401, 172418, 174395, 176516, 178993, 181733, 184556, 187571, 190933, 194398, 197473, 200024, 202394, 204953, 207829, 210996, 214289, 217339, 219876]
60593B19876K259K500K874K875K571K366K332K202J870J426Q43M9p52j240j426
60578B40625j629j973k225k185j937j712j656j782j974k006j751j332r53o76m18
60563B16416j60N4K30L92M82M30K79J59J71L95Q25J296J531J489J472J799K426
60546B29686L031L379L472L507L765M406N193N606N426N029M942N245N572N592
60532B93851N170M270K937J419J0j206k294l210l798m031m072m074m082m127m268
60517B72495m455m527m356l974l515l112k827k633k459k270k085j865j475q32
60503B32110m5O14Q97P47L93K24M70R32J216J215J206J403J639J658J540J595
60487B47814J957K439K813L026L150L262L389L547L775M132M632N210N797O449
$$ y = [219876, 222135, 224635, 227509, 230384, 232955, 235321, 237653, 239855, 241725, 243151, 243994, 244043, 243291, 242051, 240625, 238996, 237023, 234798, 232613, 230676, 228964, 227308, 225526, 223552, 221546, 219795, 218463, 217510, 216834, 216416, 216256, 216310, 216540, 216932, 217414, 217844, 218123, 218282, 218453, 218848, 219673, 220969, 222500, 223989, 225461, 227260, 229686, 232717, 236096, 239568, 243075, 246840, 251246, 256439, 262045, 267471, 272500, 277442, 282687, 288259, 293851, 299021, 303291, 306228, 307647, 307657, 306451, 304157, 300947, 297149, 293118, 289046, 284972, 280890, 276763, 272495, 268040, 263513, 259157, 255183, 251668, 248556, 245729, 243096, 240637, 238367, 236282, 234417, 232942, 232110, 232065, 232679, 233576, 234323, 234716, 234940, 235410, 236342, 237558, 238773, 239979, 241382, 243021, 244679, 246219, 247814, 249771, 252210, 255023, 258049, 261199, 264461, 267850, 271397, 275172, 279304, 283936, 289146, 294943, 301392]
60473C01392P254Q141Q926R545J0183J1074J2309J3826J5486J7186J8986K1073
60461D55381K3467K5849K7931K9939L2395L5384L8365M0734M2246M2737M1839
60450H36267L9270L5104K9566K2793J5111P288J42o008j1292j5818j9493k2211
60438I10719k3922k4615k4392k3523k2173k0230j7570j4416j1123p729l983J76
60426G17219M463Q575J2455J6125J9423K2053K3778K4472K4024K2265J9113J4838
60414I28803J0107N662J927r50k823l497l036j765J65K871O305J0038J3791J7884
60400I85482K2827K8559L4569M0686M7363N5055O3684P2814Q2222R2041J02487
60389A627789J13613J25350J37636J50308J62803J74048J82670J87202J85924
$$ y = [301392, 308646, 316787, 325713, 335258, 345441, 356515, 368824, 382650, 398136, 415322, 434308, 455381, 478848, 504697, 532628, 562567, 594962, 630346, 668711, 709445, 751691, 794428, 836267, 875537, 910641, 940207, 963000, 978111, 985399, 985541, 979533, 968241, 952423, 932930, 910719, 886797, 862182, 837790, 814267, 792094, 771864, 754294, 739878, 728755, 721026, 717043, 717219, 721682, 730257, 742712, 758837, 778260, 800313, 824091, 848563, 872587, 894852, 913965, 928803, 938910, 944572, 946499, 945549, 942726, 939229, 936193, 934428, 934593, 937464, 943769, 953807, 967598, 985482, 1008309, 1036868, 1071437, 1112123, 1159486, 1214541, 1278225, 1351039, 1433261, 1525302, 1627789, 1741402, 1866752, 2004388, 2154696, 2317499, 2491547, 2674217, 2861419, 3047343]
60380C047343J76774J58033J29389R2291M9282L235m2808q5708j22713j51984
60370C253134j72647j84714j89150j87732j82318j74240j64391j53579j42389
60361A701974j30977j19377j08005r7538q8290q0007p2283o4989n8250n2207m6843
60350G83208m2002l7621l3915l1104k8925k6771k4454k2483k1222k0206j8694
60339D75811j6676j4817j3530j2638j1903j1345j0903j0293r358q347p608p223
60327C41170p005o704o220n722n487n485n283m594l758l332l361l458l482l625
60313B73654l889l962l738l467l272k931k357j872j764j893j953j897j869j939
60299B36851k123k416k706k797k654k466k343k184j929j687j528j402j361j536
$$ y = [3047343, 3224117, 3382150, 3511539, 3603830, 3653112, 3656347, 3613539, 3527831, 3405118, 3253134, 3080487, 2895773, 2706623, 2518891, 2336573, 2162333, 1997942, 1844363, 1701974, 1570997, 1451620, 1343615, 1246077, 1157787, 1077780, 1005497, 940508, 882258, 830051, 783208, 741206, 703585, 669670, 638566, 609641, 582870, 558416, 535933, 514711, 494505, 475811, 459135, 444318, 430788, 418150, 406247, 394902, 383999, 373706, 364348, 356001, 348393, 341170, 334165, 327461, 321241, 315519, 310032, 304547, 299264, 294670, 290912, 287580, 284219, 280761, 277279, 273654, 269765, 265803, 262065, 258598, 255326, 252395, 250038, 248166, 246402, 244509, 242556, 240659, 238790, 236851, 234728, 232312, 229606, 226809, 224155, 221689, 219346, 217162, 215233, 213546, 212018, 210616, 209255, 207719]
60285B07719j810j797j401r85p91n72j06K92K12j40j52K92O71N57J11k47l10r8
60267B01445L05P55J030J034R52J064J473K015K427K554K410K095J677J251J005
60252B23492J065J241J131O63L05N11J027J147O83K82O21J471J936J488N42p4
60236B37531j4L33L55j65r41j564j863j928j880j779j742j935k309k484k074j199
60220B16342l79M5K22M15N77N31L88M38O99Q85Q56Q08R26J163J472J953K554K908
60202B32803K712K151J741J774K159K642L029L228L294L442L845M472N180N877
60188B78349O521P053P504Q051Q808R636J0321J0863J1473J2335J3476J4729J5743
60175D14862J6214J6236J6276J6591J6804J6331J5078J3448J1843J0383R049P787
$$ y = [207719, 205909, 204112, 202711, 201726, 200935, 200363, 200257, 200549, 200761, 200621, 200469, 200761, 201432, 201989, 202100, 201853, 201543, 201445, 201750, 202505, 203535, 204569, 205521, 206585, 208058, 210073, 212500, 215054, 217464, 219559, 221236, 222487, 223492, 224557, 225798, 226929, 227592, 227897, 228408, 229435, 230582, 231265, 231547, 232168, 233639, 235575, 237063, 237605, 237531, 237517, 237850, 238205, 238040, 237099, 235535, 233672, 231744, 229864, 228085, 226343, 224408, 222099, 219615, 217541, 216342, 215963, 216008, 216230, 216645, 217222, 217753, 218141, 218579, 219278, 220163, 221019, 221827, 222753, 223916, 225388, 227341, 229895, 232803, 235515, 237666, 239407, 241181, 243340, 245982, 249011, 252239, 255533, 258975, 262820, 267292, 272472, 278349, 284870, 291923, 299427, 307478, 316286, 325922, 336243, 347106, 358579, 370914, 384390, 399119, 414862, 431076, 447312, 463588, 480179, 496983, 513314, 528392, 541840, 553683, 564066, 573115, 580902]
60163E80902O528N318M279L330K099M63j080j966k312k605k808k419j392l74K20
60148E88183P50J672K828L790M585N621P062Q663J0139J1412J2537J3591J4620
60135F85453J5492J5995J6030J5696J5035J3933J2393J0692R071P427N541L480
60123H26238J535j65j733l269m671n756o428o708o651o261n483m318k867j181
60109G72282Q45L322O086Q795J1288J3663J5941J7948J9605K1105K2635K4091
60097I37606K5153K5486K4732K2601J9191J5063J0783O474K030k392o332r453
60085A070942j1739j3282j4030j3809j2541j0433p955n536l209o49K331N501Q557
60072I94148J1617J5112J9195K3496K7486L0953L4038L6958L9761M2283M4320
$$ y = [580902, 587430, 592748, 597027, 600357, 602456, 602919, 601839, 599873, 597561, 594956, 592148, 589729, 588337, 587963, 588183, 588933, 590605, 593433, 597223, 601808, 607429, 614491, 623154, 633293, 644705, 657242, 670833, 685453, 700945, 716940, 732970, 748666, 763701, 777634, 790027, 800719, 809790, 817217, 822758, 826238, 827773, 827608, 825875, 822606, 817935, 812179, 805751, 799043, 792392, 786131, 780648, 776330, 773463, 772282, 773127, 776449, 782535, 791330, 802618, 816281, 832222, 850170, 869775, 890880, 913515, 937606, 962759, 988245, 1012977, 1035578, 1054769, 1069832, 1080615, 1087089, 1089119, 1086727, 1080395, 1070942, 1059203, 1045921, 1031891, 1018082, 1005541, 995108, 987153, 981617, 978408, 977759, 980090, 985591, 994148, 1005765, 1020877, 1040072, 1063568, 1091054, 1122007, 1156045, 1193003, 1232764, 1275047, 1319367]
60061A319367M5811M6905M7684M7876M6953M4678M1426L7836L4113K9846K4618
60050A767113J8551J2075N332j844r348j6610k3145k8964l4212l8604m1612m3119
60038A565613m3508m3164m2152m0414l7958l4821l1067k6893k2573j8233j3837
60027A210993r414n137j120K586N863Q526J0537J1969J2760J2717J1818J0305
60015A282403Q419O279M049J983J49j687l723n802p514q532q812q657q540q674
60001A241341q741q221o974n298l427j342R33L183N325P530R834J1925J3491J4569
59987A274128J5293J5518J4926J3387J1055Q270N504L224J590L49q62k249l920
59974A356213n915q069j0091j1986j4115j6623j9044k0844k2106k3353k4788k6097
$$ y = [1319367, 1365178, 1412083, 1459767, 1507643, 1554596, 1599274, 1640700, 1678536, 1712649, 1742495, 1767113, 1785664, 1797739, 1803071, 1801227, 1791879, 1775269, 1752124, 1723160, 1688948, 1650344, 1608732, 1565613, 1522105, 1478941, 1436789, 1396375, 1358417, 1323596, 1292529, 1265636, 1243063, 1224830, 1210993, 1201579, 1196442, 1195322, 1197908, 1203771, 1212297, 1222834, 1234803, 1247563, 1260280, 1272098, 1282403, 1290822, 1297101, 1301150, 1303133, 1303282, 1301595, 1297872, 1292070, 1284556, 1276024, 1267212, 1258555, 1250015, 1241341, 1232600, 1224379, 1217405, 1212107, 1208680, 1207338, 1208271, 1211454, 1216779, 1224309, 1234143, 1246068, 1259559, 1274128, 1289421, 1304939, 1319865, 1333252, 1344307, 1352577, 1358081, 1361305, 1362895, 1363244, 1362382, 1360133, 1356213, 1350298, 1342229, 1332138, 1320152, 1306037, 1289414, 1270370, 1249526, 1227420, 1204067, 1179279, 1153182]
59962A153182k6903k7114k6764k5872k4549k3001k1314j9321j6887j4158j1450
59951I15849q927o502m074j700N56K866N437Q097J0362J2054J3623J5536J7596
59938I80773J9177K0018K0344K0312J9781J8669J7049J4835J1817Q214M706J708
59926A157403j079m107p351j0467j3242j5562j7234j8168j8513j8374j7599j6122
59914I99585j4234j2245j0113p693n132k694l63K028M454O788R078J1361J3335
59901I94155J4537J4882J4729J4515J4443J4456J4305J3697J2615J1331J0021
59890A143686Q538O778N038L741K980K558K318K277K542L375N068P560J0352J3090
59876A219901J5994J9431K3319K7248L1008L4646L8158M1502M4692M7519M9346
$$ y = [1153182, 1126279, 1099165, 1072401, 1046529, 1021980, 998979, 977665, 958344, 941457, 927299, 915849, 906922, 900420, 896346, 894646, 895202, 898068, 903505, 911602, 921964, 934018, 947641, 963177, 980773, 999950, 1019968, 1040312, 1060624, 1080405, 1099074, 1116123, 1130958, 1142775, 1150989, 1155695, 1157403, 1156324, 1152217, 1144866, 1134399, 1121157, 1105595, 1088361, 1070193, 1051680, 1033306, 1015707, 999585, 985351, 973106, 962993, 955300, 950168, 947474, 947111, 949139, 953593, 960381, 969459, 980820, 994155, 1008692, 1023574, 1038303, 1052818, 1067261, 1081717, 1096022, 1109719, 1122334, 1133665, 1143686, 1152224, 1159002, 1164040, 1167781, 1170761, 1173319, 1175637, 1177914, 1180456, 1183831, 1188899, 1196459, 1206811, 1219901, 1235895, 1255326, 1278645, 1305893, 1336901, 1371547, 1409705, 1451207, 1495899, 1543418, 1592764]
59865A592764M9582M8212M5475M1221L5095K7256J8364Q881j103j1286k0875k9095
59853A804491l5660m0656m4255m6611m7796m7738m6446m4225m1468l8267l4545
59842A336824l0485k6453k2503j8378j4016r709n659j766K001N387Q125J0267
59830A233635J2068J3678J4998J5700J5424J4052J1763Q696M695l25n936j1420
59818A327028j6430k1106k5597k9776l3387l6132l7710l8072l7659l7023l6301
59807I77835l5344l4241l3226l2084l0269k7735k5110k2858k0721j8318j5792
59796F82137j3577j1763j0078q282o375m534l066k242j967j809j488j158j041
59783F14757j058r96q35o55l79P0N10N89J69n89j449k303l184m152n116n799n956
$$ y = [1592764, 1642346, 1690558, 1736033, 1777254, 1812349, 1839605, 1857969, 1866850, 1865747, 1854461, 1833586, 1804491, 1768831, 1728175, 1683920, 1637309, 1589513, 1541775, 1495329, 1451104, 1409636, 1371369, 1336824, 1306339, 1279886, 1257383, 1239005, 1224989, 1215280, 1209621, 1207855, 1209856, 1215243, 1223368, 1233635, 1245703, 1259381, 1274379, 1290079, 1305503, 1319555, 1331318, 1340014, 1344709, 1344384, 1338448, 1327028, 1310598, 1289492, 1263895, 1234119, 1200732, 1164600, 1126890, 1088818, 1051159, 1014136, 977835, 942491, 908250, 875024, 842940, 812671, 784936, 759826, 736968, 716247, 697929, 682137, 668560, 656797, 646719, 638437, 632062, 627528, 624462, 622220, 620253, 618444, 616956, 615798, 614757, 613699, 612703, 611868, 611213, 610834, 610904, 611414, 612003, 612172, 611583, 610134, 607831, 604647, 600495, 595379, 589580, 583624]
59766E83624n721n529n652n950o150o161o011n636m966m136l419k897k356j529
59752E17511l85Q87K135L371M636N839O882P937R328J1072J2766J3992J4658J4708
59738F25337J3891J2146J0000Q183O908N935N186M857M870M693L909K675J499
59725G10089P92P30J311K358L666N279P446J0214J3239J6125J8805K1512K4481
59712H36047K7751L1168L4509L7589M0298M2460M3688M3417M1022L5986K8182
59701A242117J8188P123l868j3856k1925k7361l0253l1505l1769l0835k8480k5413
59689A022163k2618k0112j7160j3633j0209p279m484j529J388M191P205J0434
59677I48357J3290J5454J7456J9976K3004K6180K9405L2682L5780L8612M1583
$$ y = [583624, 577903, 572374, 566722, 560772, 554622, 548461, 542450, 536814, 531848, 527712, 524293, 521396, 519040, 517511, 517126, 518013, 520148, 523519, 528155, 533994, 540876, 548813, 558141, 569213, 581979, 595971, 610629, 625337, 639228, 651374, 661374, 669557, 676465, 682400, 687586, 692443, 697313, 702006, 705915, 708590, 710089, 710881, 711611, 712922, 715280, 718946, 724225, 731671, 741885, 755124, 771249, 790054, 811566, 836047, 863798, 894966, 929475, 967064, 1007362, 1049822, 1093510, 1136927, 1177949, 1213935, 1242117, 1260305, 1267428, 1263560, 1249704, 1227779, 1200418, 1170165, 1138660, 1106891, 1076056, 1047576, 1022163, 999545, 979433, 962273, 948640, 938431, 931152, 926668, 925139, 926527, 930718, 937923, 948357, 961647, 977101, 994557, 1014533, 1037537, 1063717, 1093122, 1125804, 1161584, 1200196, 1241779]
59666A241779M5139M9177N3379N7782O2590O7595P2362P6821Q1315Q6059R0937
59655A984935R5624R9618J02264J03141J02422J00597R7919R4409R0272Q6038
59645B957239Q2284P9428P7626P6651P5963P5108P3995P2566P0423O7040O2279
59634C770602N6365M9412M1299L2063K2196J2465L466m535j1424j6960k0719k2363
59622C911867k1940j9790j6252j1522n715J165R172J8147K7555L6918M6290N5943
59610D031838O5647P4709Q2698Q9605R5192R8671R9268R6515Q9869P8612O2546
59599D965170M2398J9159o439l3410n9994q4282j05200j22373j35399j43826j47792
59588D188012j48087j45567j40880j34607j27298j19383j11492j04786j00531
$$ y = [1241779, 1286918, 1336095, 1389474, 1447256, 1509846, 1577441, 1649803, 1726624, 1807939, 1893998, 1984935, 2080559, 2180177, 2282441, 2385582, 2488004, 2588601, 2686520, 2780929, 2871201, 2957239, 3039523, 3118951, 3196577, 3273228, 3349191, 3424299, 3498294, 3570860, 3641283, 3708323, 3770602, 3826967, 3876379, 3917678, 3949741, 3971937, 3984402, 3987868, 3983333, 3971909, 3954949, 3934230, 3911867, 3889927, 3870137, 3853885, 3842363, 3836648, 3837813, 3846985, 3865132, 3892687, 3929605, 3975895, 4031838, 4097485, 4172194, 4254892, 4344497, 4439689, 4538360, 4637628, 4734143, 4824012, 4902624, 4965170, 5007568, 5026727, 5020288, 4986878, 4926884, 4842602, 4737402, 4615029, 4479630, 4335804, 4188012, 4039925, 3894358, 3753478, 3618871, 3491573, 3372190, 3260698, 3155912, 3055381]
59579C055381r9273j00652j03916j08165j12195j14694j14983j13363j10511j06755
59569A970874j02014r6280q9865q3231p6691p0365o4284n8536n3221m8384m4004
59558A183999m0039l6413l3019k9834k6929k4254k1563j8762j6223j4461j3539
59547I08963j3096j2853j2750j2669j2491j2416j2757j3365j3737j3790j3955
59536G65084j4420j4781j4717j4391j3950j3182j2048j1005j0365r837r083q288
59524F19017p669o946n791m455l377k500j546n92J50Q08J556K151K368K617L461
59509E99252M725N734O274O624O860O849O882P493Q611R534R967J0416J1383J2716
59495G13320J4000J5133J6264J7531J9035K0813K2700K4436K5991K7567K9298
$$ y = [3055381, 2956108, 2855456, 2751540, 2643375, 2531180, 2416486, 2301503, 2188140, 2077629, 1970874, 1868860, 1772580, 1682715, 1599484, 1522793, 1452428, 1388144, 1329608, 1276387, 1228003, 1183999, 1143960, 1107547, 1074528, 1044694, 1017765, 993511, 971948, 953186, 936963, 922502, 908963, 895867, 883014, 870264, 857595, 845104, 832688, 819931, 806566, 792829, 779039, 765084, 750664, 735883, 721166, 706775, 692825, 679643, 667595, 656590, 646225, 636388, 627305, 619017, 611348, 604402, 598611, 594156, 590779, 588279, 586733, 586141, 586291, 587099, 588655, 590806, 593174, 595791, 599252, 603977, 609711, 615985, 622609, 629469, 636318, 643200, 650693, 659304, 668838, 678805, 689221, 700604, 713320, 727320, 742453, 758717, 776248, 795283, 816096, 838796, 863232, 889223, 916790, 946088]
59484I46088L1183L3218L5257L6845L7614L7775L7834L7814L7212L5702L3475
59473A340017L0847K7960K4883K1606J7909J3623R108N039J663j311m062o320
59461A480962p818q663r022q827p952o442m411j884J107M525Q368J2517J6545
59448A469005J9958K2641K4651K5649K4954K2276J8004J2672O449o35q335j6241
59436A621048k3964l1144l7444m2665m6721m9482n0776n0643m9335m7121m4228
59425A147525m0909l7388l3725k9948k6221k2638j9034j5288j1702q650n999l261
59413H92762l16K488M948P294R781J2417J5163J8013K0762K3022K4639K5766K6504
59400A083243K6750K6413K5444K3659K0894J7315J3216Q528K981l197r297j4873
$$ y = [946088, 977271, 1010489, 1045746, 1082591, 1120205, 1157980, 1195814, 1233628, 1270840, 1306542, 1340017, 1370864, 1398824, 1423707, 1445313, 1463222, 1476845, 1485953, 1490992, 1492655, 1491344, 1487282, 1480962, 1473144, 1464481, 1455459, 1446632, 1438680, 1432238, 1427827, 1425943, 1427050, 1431575, 1439943, 1452460, 1469005, 1488963, 1511604, 1536255, 1561904, 1586858, 1609134, 1627138, 1639810, 1646259, 1645624, 1637289, 1621048, 1597084, 1565940, 1528496, 1485831, 1439110, 1389628, 1338852, 1288209, 1238874, 1191753, 1147525, 1106616, 1069228, 1035503, 1005555, 979334, 956696, 937662, 922374, 910672, 902022, 896023, 892762, 892446, 894934, 899882, 907176, 916957, 929374, 944537, 962550, 983312, 1006334, 1030973, 1056739, 1083243, 1109993, 1136406, 1161850, 1185509, 1206403, 1223718, 1236934, 1245462, 1248443, 1245246, 1235949, 1221076]
59388A221076k0017k4750k8661l1435l3283l4556l5289l5377l4884l3896l2398
59377H76530l0512k8614k6915k5180k3103k0799j8654j6875j5301j3651j1770
59366F45156r789q028o693n651m667l703k756j619j32J390K506L355M457N863
59352F19689P077P990R212J1092J2916J3526J2487J0326P985O329N921O775Q373
59339G39698J0126J1857J3747J5997J8497K0644K1522K0700J8962J7862J8279
59328I27891J9772K1423K2912K4492K6376K8565L1047L3756L6466L9023M1601
59317A253324M4448M7492N0436N3202N6114N9630O3921O8676P3349P7689Q1957
59306A930238Q6447R0891R4630R7224R8603R8708R7386R4658R0708Q5556P9223
$$ y = [1221076, 1201059, 1176309, 1147648, 1116213, 1082930, 1048374, 1013085, 977708, 942824, 908928, 876530, 846018, 817404, 790489, 765309, 742206, 721407, 702753, 685878, 670577, 656926, 645156, 635367, 627339, 620646, 614995, 610328, 606625, 603869, 602250, 602118, 603508, 606014, 609369, 613826, 619689, 626766, 634756, 643968, 655060, 667976, 681502, 693989, 704315, 712300, 718629, 724550, 731325, 739698, 749824, 761681, 775428, 791425, 809922, 830566, 852088, 872788, 891750, 909612, 927891, 947663, 969086, 991998, 1016490, 1042866, 1071431, 1102478, 1136234, 1172700, 1211723, 1253324, 1297772, 1345264, 1395700, 1448902, 1505016, 1564646, 1628567, 1697243, 1770592, 1848281, 1930238, 2016685, 2107576, 2202206, 2299430, 2398033, 2496741, 2594127, 2688785, 2779493, 2865049, 2944272]
59295B944272P2165O5079N8195N1222M4083L7178L0704K4293J7502J0202K307
59284C357202o416j5959k5956l6213m6786n7333o6892p4766q1128q6361r0232
59273B769160r2234r2376r1114q8713q5271q1120p6770p2443o8048o3504n8801
59262A898766n3944m9134m4783m1051l7503l3623k9535k5916k3211k1233j9451
59251A519382j7505j5494j3852j2886j2405j1958j1458j1263j1592j2220j2874
59240A375875j3560j4352j5198j6124j7205j8196j8613j8425j8234j8426j8654
59229A188888j8430j7864j7296j6676j5741j4519j3164j1555r511p205m948k785
59217A039194o81J189K691M095N746P521R040J0160J0931J1217J0764R576P851
$$ y = [2944272, 3016437, 3081516, 3139711, 3190933, 3235016, 3272194, 3302898, 3327191, 3344693, 3354895, 3357202, 3350786, 3334827, 3308871, 3272658, 3225872, 3168539, 3101647, 3026881, 2945753, 2859392, 2769160, 2676926, 2584550, 2493436, 2404723, 2319452, 2238332, 2161562, 2089119, 2021071, 1957567, 1898766, 1844822, 1795688, 1750905, 1709854, 1672351, 1638728, 1609193, 1583277, 1560066, 1538833, 1519382, 1501877, 1486383, 1472531, 1459645, 1447240, 1435282, 1423824, 1412561, 1400969, 1388749, 1375875, 1362315, 1347963, 1332765, 1316641, 1299436, 1281240, 1262627, 1244202, 1225968, 1207542, 1188888, 1170458, 1152594, 1135298, 1118622, 1102881, 1088362, 1075198, 1063643, 1054132, 1046927, 1041979, 1039194, 1038513, 1039702, 1042393, 1046488, 1052234, 1059755, 1068795, 1078955, 1089886, 1101103, 1111867, 1121443, 1129294]
59204A129294N746L414J048j341l955o763r323j1303j2839j4073j4750j4663j4070
59191A036422j3236j1931r926p525n144k732l31J151O32j720m377n886n872m800
59177I64725l303j783k06J838M510P298R579J1411J3314J5475J7674J9895K2372
59164A082799K5063K7646L0056L2554L5279L8148M1162M4397M7706N0916N4119
59153A509845N7430O0546O3093O5233O7263O8740O8644O6466O2489N7014N0019
59142B196782M1580L1990K1250R213l564j5752k6398l5566m3519m9898n4218n6645
59130B015255n7805n8072n7516n6347n4874n3109n0795m7828m4472m1154l8177
59119A455106l5582l3179l0786k8412k6138k3879k1511j9199j7268j5749j4274
$$ y = [1129294, 1135040, 1138454, 1139502, 1138161, 1134206, 1127443, 1118120, 1106817, 1093978, 1079905, 1065155, 1050492, 1036422, 1023186, 1011255, 1001329, 993804, 988660, 985928, 985597, 986748, 987380, 985660, 981283, 975397, 969525, 964725, 961422, 959639, 959433, 961271, 965781, 973079, 982658, 994069, 1007383, 1022858, 1040532, 1060427, 1082799, 1107862, 1135508, 1165564, 1198118, 1233397, 1271545, 1312707, 1357104, 1404810, 1455726, 1509845, 1567275, 1627821, 1690914, 1756147, 1823410, 1892150, 1960794, 2027260, 2089749, 2146763, 2196782, 2238362, 2270352, 2291602, 2300815, 2297251, 2281499, 2255101, 2219535, 2176016, 2126118, 2071900, 2015255, 1957450, 1899378, 1841862, 1785515, 1730641, 1677532, 1626737, 1578909, 1534437, 1493283, 1455106, 1419524, 1386345, 1355559, 1327147, 1301009, 1277130, 1255619, 1236420, 1219152, 1203403, 1189129]
59108A189129j2574j0770r114p680o465n536m934m499l969l172k130j093l90j37
59094A116666j16j15k58q04j708k657l512m376n311o306p445q820j0255j1465
59080A053518j2459j3467j4452j5095j5288j5293j5283j5135j4781j4383j3995
59069H93887j3360j2296j0990r737q559p334o070m861l635k212n53J137K595L671
59055H21683M428N093N907O907P908Q675R133R372R443R233Q575P596O757O389
59041I27099O243N859N319N274O091P414Q719R951J1260J2416J2853J2151J0219
59028A040868P247L644k08m365r172j4474j9424k3367k6518k9298l1454l2460
59016H61019l2461l2155l1829l1156k9889k8227k6439k4621k2857k1225j9654
$$ y = [1189129, 1176555, 1165785, 1156671, 1148991, 1142526, 1136990, 1132056, 1127557, 1123588, 1120416, 1118286, 1117193, 1116803, 1116666, 1116550, 1116435, 1116177, 1115373, 1113665, 1111008, 1107496, 1103120, 1097809, 1091503, 1084058, 1075238, 1064983, 1053518, 1041059, 1027592, 1013140, 998045, 982757, 967464, 952181, 937046, 922265, 907882, 893887, 880527, 868231, 857241, 847504, 838945, 831611, 825541, 820680, 817045, 814833, 814280, 815417, 818012, 821683, 826111, 831204, 837111, 844018, 851926, 860601, 869734, 879106, 888549, 897782, 906357, 913953, 920710, 927099, 933342, 939201, 944520, 949794, 955885, 963299, 972018, 981969, 993229, 1005645, 1018498, 1030649, 1040868, 1048115, 1051759, 1051551, 1047186, 1038014, 1023540, 1004116, 980749, 954231, 924933, 893479, 861019, 828558, 796403, 764574, 733418, 703529, 675302, 648863, 624242, 601385, 580160, 560506]
59005E60506j8048j6536j5257j4081j2829j1618j0591r578q369p099n970m858
58993D25672l673k736k305k007j374o53l63l53r5L65N28M21N77J092J586K088
58977D18770L095M621O041P056Q021R113R982J0454J0783J0911J0225Q470O257
58964E23799M316K772J488M81l36j267k376l269l653l626l249k406j270l32K51
58949E11323P67J268J403J178J125J393J368O01n18j529k618m092n680o950p955
58934D91084q926r684r945r815r559r123q393p602p035o586o005n360m848m352
58920C83851l618k633j613p37j28J76M00R13J741K547L217M018N053O009O648
58905D05844P079P306P079O478O048N980N738M900L845L140K762K432K294K650
$$ y = [560506, 542458, 525922, 510665, 496584, 483755, 472137, 461546, 451968, 443599, 436500, 430530, 425672, 421999, 419263, 416958, 414951, 413577, 412924, 412561, 412208, 412113, 412478, 413006, 413427, 414004, 415096, 416682, 418770, 421865, 426486, 432527, 439583, 447604, 456717, 466699, 477153, 487936, 498847, 509072, 517542, 523799, 528115, 530887, 532375, 532856, 532520, 531253, 528877, 525608, 521955, 518329, 515080, 512674, 511404, 511072, 511323, 512090, 513358, 514761, 515939, 517064, 518457, 519825, 520426, 519908, 518379, 515761, 511669, 505989, 499039, 491084, 482158, 472474, 462529, 452714, 443155, 434032, 425639, 418037, 411002, 404416, 398411, 393051, 388203, 383851, 380233, 377600, 375987, 375250, 375122, 375298, 375698, 376611, 378352, 380899, 384116, 388134, 393187, 399196, 405844, 412923, 420229, 427308, 433786, 439834, 445814, 451552, 456452, 460297, 463437, 466199, 468631, 470925, 473575]
58891D73575L367M092M772N525O256O859P480Q165Q581Q521Q332Q404Q556Q432
58877E70917Q180Q235Q616Q976R176R423R915J0702J1747J2862J3833J4793J6149
58864G13524J7922J9574K0822K2080K3718K5427K6872K8456L0757L3578L6229
58853I98959L8581M1127M4216M7758N1577N5533N9358O2923O6516P0404P4320
58842A611272P7795Q0824Q3638Q5989Q7233Q7015Q5389Q2273P7322P0309O1273
58831B490332N0273L7463K3364Q673o121k0696l4518m6913n7502o6224p3001p7711
58819B227419q0455q1618q1659q0933p9596p7525p4563p0980o7400o4148o0996
58808A407546n7719n4485n1369m8022m4313m0805l8091l5920l3608l1079k8906
$$ y = [473575, 476942, 481034, 485806, 491331, 497587, 504446, 511926, 520091, 528672, 537193, 545525, 553929, 562485, 570917, 579097, 587332, 595948, 604924, 614100, 623523, 633438, 644140, 655887, 668749, 682582, 697375, 713524, 731446, 751020, 771842, 793922, 817640, 843067, 869939, 898395, 929152, 962730, 998959, 1037540, 1078667, 1122883, 1170641, 1222218, 1277751, 1337109, 1400032, 1466548, 1536952, 1611272, 1689067, 1769891, 1853529, 1939518, 2026751, 2113766, 2199155, 2281428, 2358750, 2429059, 2490332, 2540605, 2578068, 2601432, 2610105, 2603984, 2583288, 2548770, 2501857, 2444355, 2378131, 2305130, 2227419, 2146964, 2065346, 1983687, 1902754, 1823158, 1745633, 1671070, 1600090, 1532690, 1468542, 1407546, 1349827, 1295342, 1243973, 1195951, 1151638, 1110833, 1072742, 1036822, 1003214, 972135, 943229]
58797I43229k7433k6422k5499k4488k3299k1938k0547j9225j7838j6324j4891
58786G05325j3644j2270j0516q686p227o068m796l337j944p17M69J620K628L543
58772F44380M506N555O691Q012R464J0800J1992J3376J5096J6772J8094J9317
58760G84055K0801K2470K4191K6188K8553L0835L2745L4775L7435M0310M2718
58749A125076M4913M7717N1176N4577N7693O1036O4803O8485P1715P4719P7644
58738A799554Q0081Q1558Q1902Q0871P7938P2798O5688N6964M6653L4593K0890
58727B499490O084q960k3351l6585m8579n9154o7802p4243p8900q2308q4364q4667
58715A856661q3424q1350p8828p5760p2220o8640o5229o1772n8093n4351n0776
$$ y = [943229, 915796, 889374, 863875, 839387, 816088, 794150, 773603, 754378, 736540, 720216, 705325, 691681, 679411, 668895, 660209, 652982, 646914, 642118, 638781, 636837, 636120, 636589, 638209, 640837, 644380, 648886, 654441, 661132, 669144, 678608, 689408, 701400, 714776, 729872, 746644, 764738, 784055, 804856, 827326, 851517, 877705, 906258, 937093, 969838, 1004613, 1042048, 1082358, 1125076, 1169989, 1217706, 1268882, 1323459, 1381152, 1442188, 1506991, 1575476, 1647191, 1721910, 1799554, 1879635, 1961193, 2043095, 2123966, 2201904, 2274702, 2340390, 2397354, 2444007, 2478600, 2499490, 2505574, 2496614, 2473263, 2436678, 2388099, 2328945, 2261143, 2186900, 2108000, 2025692, 1941328, 1856661, 1773237, 1691887, 1613059, 1537299, 1465079, 1396439, 1331210, 1269438, 1211345, 1156994, 1106218]
58704A106218m7441m4322m1275l8082l4744l1642k9024k6623k4102k1617j9468
58693G47878j7470j5248j2919j0891r164p413n624l999k369l99J730L476M781
58680F72369O039P299Q109Q204P713O605M563J556j960n515q803j1446j3090j3884
58666F67759j4354j4731j4851j4694j4540j4553j4645j4836j5245j5789j6206
58655E03315j6449j6590j6486j5962j5196j4514j3911j3231j2612j2186j1589
58644C44589j0389q876p763p219o827o373n969n491m656l650k987k758k641k616
58630B66374k902l261l134k562k138k031j778j199o81m02l3N67J064J302J580
58615B50766K069K591L148M041N215O120O468O537O538O315N866N536N352M802
$$ y = [1106218, 1058777, 1014455, 973180, 935098, 900354, 868712, 839688, 813065, 788963, 767346, 747878, 730408, 715160, 702241, 691350, 682186, 674773, 669149, 665150, 662781, 662382, 664112, 667588, 672369, 678408, 685707, 693816, 702020, 709733, 716338, 720901, 722457, 720497, 714982, 706179, 694733, 681643, 667759, 653405, 638674, 623823, 609129, 594589, 580036, 565391, 550555, 535310, 519521, 503315, 486866, 470276, 453790, 437828, 422632, 408118, 394207, 380976, 368364, 356178, 344589, 334200, 325324, 317561, 310342, 303515, 297142, 291173, 285682, 281026, 277376, 274389, 271631, 268990, 266374, 263472, 260211, 257077, 254515, 252377, 250346, 248568, 247369, 246688, 246286, 246253, 246820, 247884, 249186, 250766, 252835, 255426, 258574, 262615, 267830, 273950, 280418, 286955, 293493, 299808, 305674, 311210, 316562, 321364]
58601C21364L563K004O43m30j369k216l021l867m662n186n442n645n825n817n613
58586B78481n285m705l841l155l107l345l057k091j093n23k46j8K76Q18J659K345
58570B53113K460K402K850L602L882L655L693M299N005N599O390P313P825P963
58556C20051Q484R675J0955J1963J3067J4400J5467J6131J7017J8419J9753K0633
58544D96015K1621K3210K4912K5952K6253K6120K5547K4404K2767K0580J7513
58533G54894J3552R219M893M75l968p932j1143j3829j6030j7352j7672j7430j6832
58520F60845j5582j3682j1728j0045q333o463m812l447j866NJ518K441L461N031
58506E97343O642P850R080J0701J2175J2875J2964J2615J1134P699K508l539r740
$$ y = [321364, 324927, 326931, 327574, 327144, 325775, 323559, 320538, 316671, 312009, 306823, 301381, 295736, 289911, 284094, 278481, 273196, 268491, 264650, 261495, 258388, 255043, 251986, 249895, 248802, 248279, 248033, 248015, 248291, 249109, 250768, 253113, 255573, 257975, 260825, 264427, 268309, 271964, 275657, 279956, 284961, 290560, 296950, 304263, 312088, 320051, 328535, 338210, 349165, 361128, 374195, 388595, 404062, 420193, 437210, 455629, 475382, 496015, 517636, 540846, 565758, 591710, 617963, 644083, 669630, 694034, 716801, 737381, 754894, 768446, 777665, 782558, 783033, 779065, 771133, 759990, 746161, 730131, 712779, 695107, 677677, 660845, 645263, 631581, 619853, 609808, 601475, 595012, 590200, 586753, 584887, 584892, 586410, 588851, 592312, 597343, 603985, 611835, 620915, 631616, 643791, 656666, 669630, 682245, 693379, 701078, 703586, 700047, 690307]
58493F90307j5584k0418k3850k6046k7203k7246k6473k5724k5313k4551k2924
58482D24975k0994j9460j8072j6275j4302j2752j1590j0322q841p413o209n356
58470B73389m995m894m457l586k909k769k679k243j827j787j794j554j418j627
58456B34850j698j234o88n65n75l00K2R9L16J064J939K378K526K773L010L070
58440B46987L318M066M926N444N812O374O997P579Q498R929J1319J2167J2737
58427C46153J3302J3466J2841J1720J0361Q456N976L709K138N48j867m764p331
58414D14708r492j1513j3148j4053j4419j4423j3762j2466j1341j0798j0104q724
58402B70465p409o962o821o043m861m067l582k878k173j937j829j271n93l99l77
$$ y = [690307, 674723, 654305, 630455, 604409, 577206, 549960, 523487, 497763, 472450, 447899, 424975, 403981, 384521, 366449, 350174, 335872, 323120, 311530, 301208, 292367, 284954, 278745, 273389, 268394, 263500, 259043, 255457, 252548, 249779, 247100, 244857, 243030, 241243, 239449, 237895, 236477, 234850, 233152, 231918, 231230, 230665, 230090, 229790, 229812, 229911, 230227, 231291, 233230, 235608, 238134, 240907, 243917, 246987, 250305, 254371, 259297, 264741, 270553, 276927, 283924, 291503, 300001, 309930, 321249, 333416, 346153, 359455, 372921, 385762, 397482, 407843, 416299, 422275, 425984, 428122, 428670, 426803, 422039, 414708, 405216, 393703, 380555, 366502, 352083, 337660, 323898, 311432, 300091, 289293, 279189, 270465, 263056, 256094, 249273, 243230, 238369, 234302, 230720, 227842, 225669, 223732, 221903, 220632, 220039, 219640, 219263]
58387B19263J21Q37J132J214J727K495K891K981L275L721L973M203M709N200N390
58372B63132N677O288O432N431L937K916K081O30j135k239k631l037l642m119
58358B79721m468m746m432l185j724q89l84M66J392J795K001K616L328L573L728
58343B78792M346M912M697M131L949L686K504Q14m42j423k768m020m330m103m278
58328B86467m563m085l233l096l459l189k262j624j362p59R3M33M03P95J460J599
58312B63618J338J493J943J924J605J798K386K613K651L205L965M065L790M079
58298C00473M722M769M403M640N456N919N998O392O958O985O779P157P728P479
58284C85858O655O232N910M636K763J615J241N94k68l40K40L38q6k3N93R26J110
$$ y = [219263, 219384, 220221, 221353, 222567, 224294, 226789, 229680, 232661, 235936, 239657, 243630, 247833, 252542, 257742, 263132, 268809, 275097, 281529, 286960, 290897, 293813, 295894, 296524, 295389, 293150, 290519, 287482, 283840, 279721, 275253, 270507, 266075, 262890, 261166, 260277, 259893, 260359, 261751, 263546, 265547, 268163, 271491, 275064, 278792, 283138, 288050, 292747, 296878, 300827, 304513, 307017, 307831, 307389, 305966, 303198, 299178, 294848, 290745, 286467, 281904, 277819, 274586, 271490, 268031, 264842, 262580, 260956, 259594, 258835, 258928, 259361, 259764, 260559, 262019, 263618, 264956, 266449, 268392, 270316, 271921, 273719, 276105, 278718, 281369, 284574, 288539, 292604, 296394, 300473, 305195, 309964, 314367, 319007, 324463, 330382, 336380, 342772, 349730, 356715, 363494, 370651, 378379, 385858, 392513, 398745, 404655, 409291, 412054, 413669, 414910, 415504, 415236, 414896, 415136, 415474, 415388, 415365, 415958, 416884, 417994]
58267D17994J984L218L735L759M459N779O681P193Q066Q859Q598P988Q567J0022
58253E06902J0755J0720J1212J2138J2118J1118J0368R903Q742P265O756O816
58241F24813N981M622M434N282N492N051N441O522O790O617P900J0396J1819J1801
58227G22961J2327J3964J5065J5192J5917J7671J9047J9772K1183K3286K4577
58216I20962K5207K7012L0030L2283L3415L5070L7327L8289L7672L7174L6841
58205A291282L4751L0781K7087K4345K1270J8167J7097J8057J8963J9716K2190
58194A543706K5998K8661L0305L3623L8789M3153M6352N0827N6724O1465O5020
58183B024623P0327P7713Q4227Q9278R5440J02928J08968J13545J19855J28216
$$ y = [417994, 419978, 423196, 426931, 430690, 435149, 440928, 447609, 454802, 462868, 471727, 480325, 488313, 496880, 506902, 517657, 528377, 539589, 551727, 563845, 574963, 585331, 595234, 603976, 611241, 617997, 624813, 630794, 635416, 639850, 645132, 650624, 655675, 661116, 667638, 674428, 681045, 688945, 699341, 711160, 722961, 735288, 749252, 764317, 779509, 795426, 813097, 832144, 851916, 873099, 896385, 920962, 946169, 973181, 1003211, 1035494, 1068909, 1103979, 1141306, 1179595, 1217267, 1254441, 1291282, 1326033, 1356814, 1383901, 1408246, 1429516, 1447683, 1464780, 1482837, 1501800, 1521516, 1543706, 1569704, 1598365, 1628670, 1662293, 1701082, 1744235, 1790587, 1841414, 1898138, 1959603, 2024623, 2094950, 2172663, 2256890, 2346168, 2441608, 2544536, 2653504, 2767049, 2886904, 3015120]
58173C015120J35632J42127J51094J62585J73069J82660J95281K10803K24668
58164D593039K36458K50654K67758K83302K97181L14871L37603L60739L83675
58155G325280M11360M44065M76510N09518N51155O03581O60652P21239P92205
58146A2495565Q75550R66907J069892J196289J348168J516273J699682J908533
58138B3076859K144187K399316K682426L016632L408024L844131M329020M884494
58130D9785089N515112O225213P063643Q022459Q790377Q704974P164144M187135
58122A05458146N17215k873765n364650o839182p468060p488998p139214o628903
58114F2172589o089482n562890n052423m561321m088481l628528l191177k799414
$$ y = [3015120, 3150752, 3292879, 3443973, 3606558, 3779627, 3962287, 4157568, 4368371, 4593039, 4829497, 5080151, 5347909, 5631211, 5928392, 6243263, 6580866, 6941605, 7325280, 7736640, 8180705, 8657215, 9166733, 9717888, 10321469, 10982121, 11703360, 12495565, 13371115, 14338022, 15407914, 16604203, 17952371, 19468644, 21168326, 23076859, 25221046, 27620362, 30302788, 33319420, 36727444, 40571575, 44900595, 49785089, 55300201, 61525414, 68589057, 76611516, 85401893, 94106867, 101271011, 105458146, 105975361, 103101596, 97736946, 90897764, 83429704, 75940706, 68801492, 62172589, 56083107, 50520217, 45467794, 40906473, 36817992, 33189464, 29998287, 27198873]
58106B7198873k462805k171079j915067j694355j503568j330838j172798j035037
58098A3913326r16591q09057p10785o26737n54522m85163m17430l57703l06467
58089H728871k58163k12556j72829j34424q9147l7981J3142O6614J28689J96269
58079H228485K62504L30378M06053M86162N69336O72528Q15818R99039J211765
58070A3982068J443436J639237J658259J348084P03507p9115p42173j151602j334945
58061A7466756j381864j357459j297037j225353j153780j077930r93164r03737
58053H076432q13694p21755o29753n45507m73390m10699l55633l10531k75175
58044C540295k44766k16750j93115j74565j58696j44842j34719j27295j18692
$$ y = [27198873, 24736068, 22564989, 20649922, 18955567, 17451999, 16121161, 14948363, 13913326, 12996735, 12187678, 11476893, 10850156, 10295634, 9810471, 9393041, 9035338, 8728871, 8470708, 8258152, 8085323, 7950899, 7861752, 7823771, 7836913, 7903527, 8032216, 8228485, 8490989, 8821367, 9227420, 9713582, 10282918, 10955446, 11771264, 12770303, 13982068, 15425504, 17064741, 18723000, 20071084, 20774591, 20695476, 19953303, 18801701, 17466756, 16084892, 14727433, 13430396, 12205043, 11051263, 9973333, 8980169, 8076432, 7262738, 6540983, 5911230, 5365723, 4892333, 4481634, 4126001, 3815470, 3540295, 3295529, 3078779, 2885664, 2711099, 2552403, 2407561, 2272842, 2145547, 2026855]
58035B026855j07923r7506q8117p7793o6906n8741n4506n2195n0829n1363n3183
58024A267793n3937n3260n2804n2513n0670m7536m5179m3658m1084l7417l4622
58013G55113l3042l1055k8387k6443k5364k3824k1759k0336j9385j7723j5755
58002D92040j4907j4827j3963j2536j2028j2196j1477j0025r405r629r314q511
57990C53222q520r114q767p513o859p014o790o123o091o526o195n199m822n108
57976B58581m943m355m355m705m249l273l096l548l254k251j931k441k562k120
57962B11498k145k636k502j759j529j765j264l7N66K33L0K73J66j81L35J665K423
57945B03371K240K300L160L973M263M680N474O003O074O284O605O245N104L905
$$ y = [2026855, 1918932, 1821426, 1733309, 1655516, 1588610, 1529869, 1475363, 1423168, 1372339, 1320976, 1267793, 1213856, 1160596, 1107792, 1055279, 1004609, 957073, 911894, 868236, 827152, 789735, 755113, 722071, 691016, 662629, 636186, 610822, 586998, 565239, 544903, 525518, 507795, 492040, 477133, 462306, 448343, 435807, 423779, 411583, 400106, 390081, 380676, 371047, 361733, 353222, 344702, 335588, 326821, 319308, 312449, 305435, 298645, 292522, 286431, 279905, 273710, 268511, 263689, 258581, 253638, 249283, 244928, 240223, 235974, 232701, 229605, 226057, 222803, 220552, 218621, 216180, 213618, 211498, 209353, 206717, 204215, 202456, 200927, 199162, 197898, 197861, 198427, 198660, 198690, 198963, 199129, 198948, 199283, 200948, 203371, 205611, 207911, 211071, 215044, 219307, 223987, 229461, 235464, 241538, 247822, 254427, 260672, 265776, 269681]
57931B69681K682P75j554l161l881m723n964o722o673o652p065p269o929o607
57917B05938o570o298n599m943m471l751k805k239k157k019j663j418j217o93
57903A60095r3L9m7K85P70O52J35J3R9m76j561k097j953k001k413k439k003j853
57885A45152k010j645p31k64n19n88LO40R30J271J753J880J695J898K512K729
57869A54706K359K115K180J867J050N28N36K64o39j476j861k415l469m370m617
57854A46758m629m725m559m084l970m410m529l710k574k006k024k191k331k317
57840I8699j926j355j175j380j274o22r1j41l77l37j65n6K02O89J066J150J192
57823I4099J333J395J403J600J823J604J014O06M42K3p35j310j492j580j602j246
$$ y = [269681, 272363, 273138, 271584, 268423, 264542, 259819, 253855, 247133, 240460, 233808, 226743, 219474, 212545, 205938, 199368, 193070, 187471, 182528, 178057, 174306, 171501, 169262, 167105, 165086, 163423, 162005, 160788, 160095, 160002, 160041, 159994, 160279, 161049, 161701, 161836, 161849, 161948, 161472, 159911, 157814, 155861, 153860, 151447, 149008, 147005, 145152, 143142, 141497, 140766, 140502, 139983, 139395, 139398, 140038, 140968, 142239, 143992, 145872, 147567, 149465, 151977, 154706, 157065, 159180, 161360, 163227, 164277, 164805, 165341, 165605, 164966, 163490, 161629, 159214, 155745, 151375, 146758, 142129, 137404, 132845, 128761, 124791, 120381, 115852, 112142, 109568, 107562, 105538, 103347, 101016, 98699, 96773, 95418, 94243, 92863, 91589, 90967, 90876, 90735, 90358, 90021, 89856, 89800, 90002, 90691, 91757, 92907, 94099, 95432, 96827, 98230, 99830, 101653, 103257, 104271, 104877, 105319, 105342, 104607, 103297, 101805, 100225, 98623, 97377]
57807I7377o76m49n17k72K86M85J82o5j11l89p50m05O57J398J312J136J509K022
57789A02730K135K025J953J730J326J106J063O95L8j72K04K89l88j125j228r88
57773A11393r05q82q20j051j587j787j442j231j533j676j119m25k73l25K1N24
57757I6882N97L29J70N3l32q49j121j181j262j349j375j491j779k004k039k054
57741H1195k097k011j918k101k248j666n00J56j92p06n16J50O60R70J222J209
57725G1607R64J136K044K987L199K874K624K521K376K362K604K665K132J268N35
57710A03898k1m12l52J53M31L1n98r05j124j700k382k638k526k436k389k234k118
57693H2678k156k024j525j093j192j553j673j581j551j454j054n74l39j77K36
$$ y = [97377, 96701, 96252, 95735, 95463, 95749, 96234, 96416, 96351, 96240, 95851, 95101, 94696, 95353, 96751, 98063, 99199, 100708, 102730, 104865, 106890, 108843, 110573, 111899, 113005, 114068, 114763, 114801, 114629, 114833, 115122, 114734, 113609, 112381, 111393, 110488, 109606, 108786, 107735, 106148, 104361, 102919, 101688, 100155, 98479, 97360, 96935, 96662, 96337, 96358, 96882, 97479, 97808, 97978, 98031, 97699, 96850, 95729, 94548, 93286, 91937, 90562, 89071, 87292, 85288, 83249, 81195, 79098, 77087, 75169, 73068, 70820, 69154, 68654, 68810, 68618, 67912, 67396, 67546, 68206, 69176, 70398, 71607, 72571, 73707, 75751, 78738, 81937, 84811, 87435, 89956, 92332, 94694, 97298, 99963, 102095, 103363, 103898, 103877, 103465, 103113, 103266, 103697, 103728, 103130, 102225, 101101, 99401, 97019, 94381, 91855, 89419, 87030, 84796, 82678, 80522, 78498, 76973, 75880, 74688, 73135, 71462, 69881, 68330, 66876, 65822, 65248, 64909, 64732, 64968]
57678F4968P75J100J189J148R09N61N21R13J217J044P70Q63J054Q58L92J07O0
57661G8449Q6K61O72J031J113J179J479J726J599J329J271J332J337J491J913
57646I6268K208K077J895K089K434K565K689L099L498L526L514L983M758N258
57632A39861N329N147M669L900L307L301L639L909M268M995N857O567P456Q896
57618B11101J0492J1662J2661J4176J6191J8162K0016K2163K4677K7262K9900
57607D18463L2779L5739L8435M0707M2034M0931L5897K7019J5964M556o010j4875
57595G11639k1547k6236k9485l1423l1957l1506l0761k9806k8253k6163k4117
57584D00385k2350k0595j8758j7069j5513j3780j1863j0134q773p632o625n747
$$ y = [64968, 65743, 66843, 68032, 69180, 70089, 70650, 71171, 72084, 73301, 74345, 75115, 75978, 77032, 77890, 78282, 78389, 78449, 78535, 78796, 79468, 80499, 81612, 82791, 84270, 85996, 87595, 88924, 90195, 91527, 92864, 94355, 96268, 98476, 100553, 102448, 104537, 106971, 109536, 112225, 115324, 118822, 122348, 125862, 129845, 134603, 139861, 145190, 150337, 155006, 158906, 162213, 165514, 169153, 173062, 177330, 182325, 188182, 194749, 202205, 211101, 221593, 233255, 245916, 260092, 276283, 294445, 314461, 336624, 361301, 388563, 418463, 451242, 486981, 525416, 566123, 608157, 649088, 684985, 712004, 727968, 732524, 726514, 711639, 690092, 663856, 634371, 602948, 570991, 539485, 508724, 478918, 450665, 424502, 400385, 378035, 357440, 338682, 321613, 306100, 292320, 280457, 270323, 261550, 253918, 247293, 241546]
57572B41546m830l774k896k453k098j356n07j76k63r0N34J169J639K227K975L555
57556B35202L977M668N743O786P542Q238R075J0005J1010J2110J3023J3384J3334
57543C54097J3312J3308J2838J1644R875P602M807J762j163m080p330j0665j3360
57530C92647j5150j6361j7134j7239j6753j6194j5773j5157j4177j3167j2394
57519B23148j1706j0940j0183r461q633p716o916o256n595m980m558m166l543
57506A28495k852k460k284j958j558j475j614j501j158j122j473j661j446j218
57492A04715j196j061o82m50n51n76k24J68K21J17K18N11P24P19M83J16o7J63
57474A03348N15M63K6k27o1K19M74R86J801K474K770L038L590M255M857N576O489
$$ y = [241546, 236716, 232942, 230046, 227593, 225495, 224139, 223632, 223456, 223193, 223103, 223637, 224806, 226445, 228672, 231647, 235202, 239179, 243847, 249590, 256376, 263918, 272156, 281231, 291236, 302246, 314356, 327379, 340763, 354097, 367409, 380717, 393555, 405199, 415074, 422676, 427483, 429245, 428082, 424002, 416672, 406007, 392647, 377497, 361136, 344002, 326763, 310010, 293816, 278043, 262886, 248709, 235542, 223148, 211442, 200502, 190319, 180858, 172225, 164509, 157593, 151337, 145742, 140762, 136204, 132038, 128495, 125643, 123183, 120899, 118941, 117383, 115908, 114294, 112793, 111635, 110513, 109040, 107379, 105933, 104715, 103519, 102458, 101776, 101326, 100775, 100199, 99975, 100143, 100364, 100481, 100699, 101210, 101934, 102653, 103136, 103252, 103185, 103348, 103863, 104326, 104352, 104125, 104064, 104283, 104757, 105743, 107544, 110018, 112788, 115826, 119416, 123671, 128528, 134104, 140593]
57457A40593P338Q041Q931J0121J1160J1659J1842J2076J2300J2221J1762J0930
57445B68974R647P966O116M101J643j229l947n994p392q381r065r584j0131j0574
57431B32150j0515r931r308q910q438p679o918o341n668m749l996l697l387k547
57417A40066j437p12m40j38M14R46J221J307J356J438J638K050K650L325L932
57402A57616M336M507M682N147N875O588P171P728Q204Q445Q639R178R988J0477
57388B58581J0337R951R715R420Q613P151N169K816L14k061m282o515q634j0168
57374B90407j0926j1226j1348j1184j0679j0088r571q944q158p521p214o944o474
57361A70130n938n461m847m027l314k870k389j649r69p25p77p83p05o22m73k26
$$ y = [140593, 147931, 155972, 164903, 175024, 186184, 197843, 209685, 221761, 234061, 246282, 258044, 268974, 278621, 286587, 292703, 296804, 298447, 297218, 293271, 287277, 279885, 271504, 262439, 252855, 242724, 232150, 221635, 211704, 202396, 193486, 185048, 177369, 170451, 164110, 158442, 153693, 149697, 146000, 142613, 140066, 138629, 137917, 137477, 137339, 137753, 138699, 139920, 141227, 142583, 144021, 145659, 147709, 150359, 153684, 157616, 161952, 166459, 171141, 176288, 182163, 188751, 195922, 203650, 211854, 220299, 228938, 238116, 248104, 258581, 268918, 278869, 288584, 298004, 306617, 313768, 318937, 321753, 322067, 320006, 315724, 309209, 300575, 290407, 279481, 268255, 256907, 245723, 235044, 224956, 215385, 206441, 198283, 190762, 183548, 176604, 170130, 164192, 158731, 153884, 149857, 146543, 143673, 141284, 139635, 138666, 137941, 137164, 136381, 135676, 135054, 134581, 134355]
57345A34355p6j27k34l25m67m54Q1R27J318R93N97O57Q69Q64R67J507K067K117
57327A45636J879J835J886J723J587J833K151J981J493J307J523J721J735J692
57313A69982J504J029O02O59J026J240J385J908K670K988K596J912J352J040J097
57298A92990J574K055K005J579J452J836K242K330K354K634L099L505L716L654
57284B27025L340L054L097L339L434L346L340L502L746M165M891N638N926N743
57270B83586N513N388N131M686M335M215M179M191M357M542M444M121L959M078
57256C46725M260M460M875N363N427M972M545M573M806M783M457M095L888L901
57242D11130M174M608M979N165N209N146M979M831M794M681M284L865L903M355
$$ y = [134355, 134279, 134152, 133918, 133593, 133126, 132672, 132753, 133680, 134998, 135991, 136588, 137245, 138114, 138978, 139945, 141452, 143519, 145636, 147515, 149350, 151236, 152959, 154546, 156379, 158530, 160511, 162004, 163311, 164834, 166555, 168290, 169982, 171486, 172515, 173117, 173776, 174802, 176042, 177427, 179335, 182005, 184993, 187589, 189501, 190853, 191893, 192990, 194564, 196619, 198624, 200203, 201655, 203491, 205733, 208063, 210417, 213051, 216150, 219655, 223371, 227025, 230365, 233419, 236516, 239855, 243289, 246635, 249975, 253477, 257223, 261388, 266279, 271917, 277843, 283586, 289099, 294487, 299618, 304304, 308639, 312854, 317033, 321224, 325581, 330123, 334567, 338688, 342647, 346725, 350985, 355445, 360320, 365683, 371110, 376082, 380627, 385200, 390006, 394789, 399246, 403341, 407229, 411130, 415304, 419912, 424891, 430056, 435265, 440411, 445390, 450221, 455015, 459696, 463980, 467845, 471748, 476103]
57228D76103M607M325L939M043M671N379N800N869N737N675N881O345O902P370
57214E52646P459O797N416M012L200K725J844M74p51j512k191l009l517l333k809
57199E67451k475k270j816j136o11m17l88l81m01m81o49r99j550k143k571k763
57183E46400k729k451j910j161k75O37J432K043K554L041L381L481L546L803M072
57168E65864M000L630L305L019K399J385M28k22r39k203l958n742p186q194q916
57153E46670r599j0294j0646j0280r398q546p797o733n267l914k987k123r46L58
57139D58498J455K405L382M260M995N889P058P997Q224P983P782P452O371M407
57125E38158K000o04l666p379j1499j5629j9522k3015k5957k8353l0414l2426
$$ y = [476103, 480710, 485035, 488974, 493017, 497688, 503067, 508867, 514736, 520473, 526148, 532029, 538374, 545276, 552646, 560105, 566902, 572318, 576330, 579530, 582255, 584099, 584573, 583822, 582310, 580119, 577110, 573593, 570260, 567451, 564976, 562706, 560890, 559754, 559143, 558726, 558338, 557957, 557556, 557075, 556426, 555427, 553877, 551734, 549163, 546400, 543671, 541220, 539310, 538149, 537874, 538511, 539943, 541986, 544540, 547581, 550962, 554443, 557989, 561792, 565864, 569864, 573494, 576799, 579818, 582217, 583602, 584030, 583808, 582869, 580666, 576708, 570966, 563780, 555586, 546670, 537071, 526777, 516131, 505851, 496453, 487907, 480110, 473377, 468110, 464196, 461209, 459086, 458140, 458498, 459953, 462358, 465740, 470000, 474995, 480884, 487942, 495939, 504163, 512146, 519928, 527380, 533751, 538158, 540158, 539554, 535888, 528509, 517010, 501381, 481859, 458844, 432887, 404534, 374120, 341694]
57113C41694l4606l7014l9450m1648m3682m5951m8614e69n3634n5719n7753n9577
57101b27252o0952o2125o3531o5097o6296o6850o6978o6955o6881o6827o6916
57090i46660o7240o7952o9318p1442p4120p7204q0865q5137q9566r3840r8404
57079a821748j03916j10309j17030j23967j31476j39625j48160j57121j66773
57070c020125j76990j87448j98358k10259k23152k36760k51595k68735k88505
57061e061927l10355l34243l61014l91187m24584m61474n02920n49474o00880
57052h998058o57626p21572p94341q76631r70134j078929j207915j361124j542708
57043a8209038j758115k012883k311467k658796l061945l529216m069707m696052
$$ y = [341694, 307088, 270074, 230624, 188976, 145294, 99343, 50729, -569, -54203, -109922, -167675, -227252, -288204, -350329, -413860, -478957, -545253, -612103, -679081, -746036, -812917, -879744, -946660, -1013900, -1081852, -1151170, -1222612, -1296732, -1373936, -1454801, -1539938, -1629504, -1723344, -1821748, -1925664, -2035973, -2153003, -2276970, -2408446, -2548071, -2696231, -2853352, -3020125, -3197115, -3384563, -3582921, -3793180, -4016332, -4253092, -4504687, -4773422, -5061927, -5372282, -5706525, -6067539, -6458726, -6883310, -7344784, -7847704, -8397178, -8998058, -9655684, -10377256, -11171597, -12048228, -13018362, -14097291, -15305206, -16666330, -18209038, -19967153, -21980036, -24291503, -26950299, -30012244, -33541460, -37611167, -42307219]
57035d2307219n425918o277931p266321q400816r689883j1141992j2764477j4559303
57027a17833860j6510844j8571131k0660340k2677230k4474204k5776978k6132459
57020b72637046k5015875k2101058j7501741j1769023n639709K55661N528069
57013c48880722R998146J3614826J6406437J8455328J9865439K0727716K1104504
57006b28708326K1035912K0555951J9708537J8557487J7185459J5682350J4131298
56999a01851332J2599677J1136024R771060Q521628P395389O393581N512357M744997
56991c5776619M084208L521775L046690K645660K306069K017643J771616J560222
56983a4822736J377480J219212J081757R61649Q56651P65886O88332O21979N64468
$$ y = [-42307219, -47733137, -54011068, -61277389, -69678205, -79368088, -90510080, -103274557, -117833860, -134344704, -152915835, -173576175, -196253405, -220727609, -246504587, -272637046, -297652921, -319753979, -337255720, -349024743, -354664452, -354408791, -348880722, -338882576, -325267750, -308861313, -290405985, -270540546, -249812830, -228708326, -207672414, -187116463, -167407926, -148850439, -131664980, -115982630, -101851332, -89251655, -78115631, -68344571, -59822943, -52427554, -46033973, -40521616, -35776619, -31692411, -28170636, -25123946, -22478286, -20172217, -18154574, -16382958, -14822736, -13445256, -12226044, -11144287, -10182638, -9325987, -8560101, -7871769, -7249790, -6685322]
56974f685322N13597M67129M23307L81952L44183L10695K81035K54549K31079
56965c477796K10444J92143J75827J61348J48325J36393J25900J17412J10503
56956b099501J03961R7324R1189Q5965Q1285P6829P2643O8454O3683N8412N3420
56945a246336M8966M4513L9904L5701L2043K8219K3825J9372J5290J1342P496
56934i39665M498K929K486K765L984O365R542J3033J6688K0281K3396K6026K8538
56921g79134L0757L2070L2576L2979L2782L0157K4589J8565J5263J5170J6023
56910d98203J5479J2855Q811M580J394l45j303k167k706k374j388l96N20J711
56896d63532L097M136M563M520M183L706L352L162K835K269J887J994K293K500
$$ y = [-6685322, -6171725, -5704596, -5281289, -4899337, -4555154, -4244459, -3963424, -3708875, -3477796, -3267352, -3075209, -2899382, -2738034, -2589709, -2453316, -2327416, -2210004, -2099501, -1995540, -1898216, -1807027, -1721062, -1639777, -1562948, -1490305, -1421851, -1358168, -1299756, -1246336, -1197370, -1152857, -1112953, -1077252, -1045209, -1016990, -993165, -973793, -958503, -947161, -939665, -935167, -932238, -929752, -926987, -923003, -916638, -907096, -894063, -877375, -857094, -833698, -807672, -779134, -748377, -716307, -683731, -650752, -617970, -587813, -563224, -544659, -529396, -514226, -498203, -482724, -469869, -461058, -456478, -455084, -455429, -456732, -458899, -461605, -463979, -465367, -465763, -465243, -463532, -460435, -456299, -451736, -447216, -443033, -439327, -435975, -432813, -429978, -427709, -425822, -423828, -421535, -419035]
56882d19035K895L679M386M608M779N473O357O714O691P059P974Q826R197R225
56868c31172R024Q442P481O364N258M257L601L392L329L113K901K950L089L043
56854b64928K956L051L084K758K323K232K426K575K712K994L150K864K424K341
56840b27038K525K560K558K939L572L886L781L700L806L804L599L462L563L830
56826a79453M265M818N077M615L645K760K160J672J368J467J773J859J778J932
56812a40264K368K778L159L783M587N267N903O816P868Q607R096R827J0753J1147
56798d8305J0549R218P498N459L253J232m35j722k317j870p68O9L11N43J300K427
56782a3558L559M640C65O843Q198J0022J2010J3449J4061J4163J3827J2563J0014
$$ y = [-419035, -416140, -412461, -408075, -403467, -398688, -393215, -386858, -380144, -373453, -366394, -358420, -349594, -340397, -331172, -322148, -313706, -306225, -299861, -294603, -290346, -286745, -283353, -280024, -276911, -274010, -271060, -267971, -264928, -261972, -258921, -255837, -253079, -250756, -248524, -246098, -243523, -240811, -237817, -234667, -231803, -229379, -227038, -224513, -221953, -219395, -216456, -212884, -208998, -205217, -201517, -197711, -193907, -190308, -186846, -183283, -179453, -175188, -170370, -165293, -160678, -157033, -154273, -152113, -150441, -149073, -147606, -145833, -143974, -142196, -140264, -137896, -135118, -131959, -128176, -123589, -118322, -112419, -105603, -97735, -89128, -80032, -70205, -59452, -48305, -37756, -28538, -21040, -15581, -12328, -11096, -11531, -13253, -15570, -17440, -18208, -18139, -17828, -17285, -15985, -13558, -9999, -5359, 365, 7208, 15406, 25428, 37438, 50887, 64948, 79111, 92938, 105501, 115515]
56769A15515O469K459j568n061p378q376q506q173p463o551n760n055m039k714
56755E3799j551o17P19K794N042O763Q012R196J0281J0855J0602R257O524K612
56741A34288j428m435o108o963p535p920p937p398o295m977l969l448l065k381
56727F0429j293J6J298K282K826L179L770M597N029M397K551j92l244n841p349
56712G2455p742p554p212o704n986n258m679m185l768l620l769l874l623A413
56697a031j931j630j590j610j386r50o35n60m97l30k25k03KM21O41L82o4k31n0
56678a1477J89K32kl95o29m71j03R5J23L01O35P09M02J48K75N41N79L91J30j79
56658h506m49m52k06n6j05K0M90Q57P05L05K06M54O83P31P47P78P16N55M30M73
$$ y = [115515, 121984, 124443, 122875, 117814, 110436, 102060, 93554, 85381, 77918, 71367, 65607, 60552, 56513, 53799, 52248, 51631, 52350, 55144, 60186, 66949, 74961, 84157, 94438, 105293, 115895, 125152, 131676, 134288, 132860, 128425, 122317, 115354, 107819, 99899, 91962, 84564, 78269, 73292, 69323, 65875, 62810, 60429, 59136, 59152, 60450, 62732, 65558, 68737, 72507, 77104, 82133, 86530, 89081, 88889, 85645, 79804, 72455, 64713, 57159, 49947, 43243, 37257, 31999, 27320, 23135, 19367, 15747, 11978, 8104, 4481, 1413, -1031, -2962, -4592, -6182, -7792, -9178, -10128, -10763, -11323, -11820, -12150, -12375, -12578, -12576, -12155, -11514, -11132, -11196, -11427, -11477, -11288, -11056, -11058, -11453, -12082, -12553, -12656, -12561, -12438, -12137, -11502, -10793, -10391, -10243, -9968, -9427, -8848, -8457, -8327, -8506, -8955, -9407, -9613, -9669, -9774, -9754, -9264, -8407, -7702, -7397, -7191, -6737, -6054, -5323, -4576, -3798, -3082, -2527, -2097, -1624]
56638a624P01A00J239J207J079J084J115Q59L45krN8L5J27M47P31Q11Q93J070
56619A1189J063P41M65N26O26L94J9p0J46L80N35O90P71O77O00Q10J258J657J812
56600B4289J652J163N36J09j0q9k24j07M29R43R23N11K29K05J50j5j6L09P86J165
56580C2938J389J495J491J342J028O42M27N74R29J115R99Q17P53O90N02K70N1
56563D7452k39o05q57r37r99j071r62o95o58j039j497j605j349r45m61O8M79O34
56545C4714O04M54J47k14l25r6J97L13K93K03m2l62m68k76n4N7K49O01Q89R99
56525C7883J136J350J343J014P18P11P80P36P62R75J085R09P24Q41J145J432J749
56508E5293K057K089J822J699J967K311K436K515K665K578K156J860K032K338
$$ y = [-1624, -923, 100, 1339, 2546, 3625, 4709, 5824, 6683, 7028, 7026, 7017, 7075, 7110, 7237, 7684, 8415, 9226, 10119, 11189, 12252, 12993, 13458, 13984, 14610, 15004, 15023, 14953, 15099, 15479, 16014, 16704, 17475, 18152, 18752, 19562, 20820, 22477, 24289, 25941, 27104, 27640, 27749, 27739, 27650, 27426, 27319, 27748, 28691, 29614, 30125, 30354, 30559, 30709, 30694, 30678, 30987, 31773, 32938, 34327, 35822, 37313, 38655, 39683, 40325, 40752, 41326, 42255, 43370, 44369, 45186, 45939, 46629, 47131, 47401, 47452, 47213, 46608, 45751, 44814, 43815, 42744, 41782, 41087, 40429, 39390, 37893, 36288, 34939, 33994, 33533, 33601, 34080, 34714, 35318, 35772, 35919, 35705, 35380, 35284, 35481, 35794, 36087, 36290, 36248, 35886, 35418, 35142, 35088, 35145, 35394, 35995, 36884, 37883, 39019, 40369, 41712, 42726, 43444, 44155, 44935, 45671, 46433, 47408, 48493, 49402, 50126, 50967, 52112, 53544, 55293, 57350, 59439, 61261, 62960, 64927, 67238, 69674, 72189, 74854, 77432, 79588, 81448, 83480, 85818]
56494H5818K433K553K905L100K801K391K300K221J741J219J236J563J508J018
56480A14807N88L87J73q0k63n54j147j718j859j820k141k743l111l129l097l052
56464I1241k802k453k270k151j845j554j624j878j872j668j627j668j446j114
56450F5269j156j536j740j600j388j140o43k7K98L33M42O41N78K05j23k25k16
56433E7972p9K62N33M01J06J28L29J40m64q75q04n94m75k80K9J46Ll6K49O46R39
56412E8276J155J270J139Q37O27N69N00M44N54P42P61O67P16Q98R79R87J133J328
56394G3582J300J137J157J318J289J049Q85Q39O94M85N22Q52J192J360J373J218
56378I0252R43Q28J008J133Q88N84O35P66M18k65n94l74o5L5N0M4n8j46p9r8m75
$$ y = [85818, 88251, 90804, 93709, 96809, 99610, 102001, 104301, 106522, 108263, 109482, 110718, 112281, 113789, 114807, 115395, 115782, 115955, 115875, 115612, 115058, 113911, 112193, 110334, 108514, 106373, 103630, 100519, 97390, 94293, 91241, 88439, 85986, 83716, 81565, 79720, 78166, 76542, 74664, 72792, 71124, 69497, 67829, 66383, 65269, 64113, 62577, 60837, 59237, 57849, 56709, 56066, 56039, 56337, 56670, 57112, 57753, 58331, 58536, 58413, 58188, 57972, 57893, 58155, 58688, 59089, 59195, 59323, 59652, 59792, 59328, 58453, 57649, 57055, 56580, 56300, 56329, 56475, 56478, 56442, 56691, 57337, 58276, 59431, 60701, 61840, 62677, 63304, 63873, 64373, 64817, 65371, 66113, 66874, 67541, 68257, 69155, 70134, 71121, 72254, 73582, 74882, 76019, 77176, 78494, 79783, 80832, 81717, 82556, 83250, 83735, 84257, 85109, 86301, 87661, 89034, 90252, 91195, 92023, 93031, 94164, 95052, 95636, 96271, 97037, 97455, 97190, 96596, 96222, 96157, 96192, 96242, 96286, 96228, 96082, 96003, 95905, 95430]
56357I5430r28j030r21r81j036p31l55m33p27o17k68l70p90o46K24R71J050Q66
56339H8708Q09P24N12M61N89N14K00O9J73K9m80q37p60o04o47p15o81o72o33l70
56319H6389j05k63o79p51m37k29j92O9M38L63p7k25q8l72j052j125k41O25O78
56300H2726M11N62Q93P79K54j79k87q9L87R41J221J225J254J349J311J286J550
56283I5594J724J159J58k26K65P91Q58R15J225J319J000P99R65J009P36O49R03
56266A09843Q92M10J44M82Q93J042J374K031K291J794J294J427J806J982K236
56251A29941K648K505J555P41Q24J242J244J163J549J945J698J162J024J118R72
56236A51331Q11R95J128P13J44O0L04L99M72P79R20N16P2K43P23Q07N82O34J010
$$ y = [95430, 94502, 93472, 92551, 91570, 90534, 89803, 89448, 89015, 88288, 87671, 87403, 87033, 86243, 85597, 85821, 86792, 87842, 88708, 89517, 90241, 90753, 91214, 91803, 92317, 92517, 92586, 92759, 92788, 92308, 91471, 90711, 90107, 89460, 88745, 88064, 87392, 86759, 86389, 86284, 86021, 85342, 84591, 84154, 83925, 83733, 83802, 84240, 84603, 84526, 84301, 84213, 83841, 82789, 81664, 81423, 82048, 82726, 83137, 83699, 84592, 85371, 85625, 85446, 85159, 85070, 85457, 86398, 87619, 88844, 90098, 91447, 92758, 94044, 95594, 97318, 98477, 98635, 98409, 98674, 99465, 100323, 101238, 102463, 103782, 104782, 105581, 106546, 107555, 108291, 108940, 109843, 110735, 111145, 111289, 111771, 112664, 113706, 115080, 117111, 119402, 121196, 122490, 123917, 125723, 127705, 129941, 132589, 135094, 136649, 137390, 138214, 139456, 140700, 141863, 143412, 145357, 147055, 148217, 149241, 150359, 151331, 152142, 153137, 154265, 154978, 155122, 155182, 155486, 155885, 156357, 157136, 158056, 158572, 158644, 158887, 159610, 160417, 160999, 161633, 162643]
56217A62643J357J648K061K415K556K772L224L512L423L490M090M730M972N310
56203B08203O259P277P588P468P708Q347Q898R354R999J0652J0967J1119J1415
56190C25254J1665J1599J1477J1521J1328J0556R580Q809P918O493M781L126J351
56177D35458n60j977k576l027l874m612m689m646n183n948o249o249o350o222
56163C73296n532m939n199n895o157o016n996o074o030o155o540o489n706n161
56149B91407n604o102n445m129l443l367k962k250k041k313k312j986j917k077
56135B45459j974j718j735j775j422j071j238j443j023m80o39j092r37m75n95
56120B27842j009p41L0K61j09j73K96P34J088J723K277K079J516J572K231K659
$$ y = [162643, 164000, 165648, 167709, 170124, 172680, 175452, 178676, 182188, 185611, 189101, 193191, 197921, 202893, 208203, 214462, 221739, 229327, 236795, 244503, 252850, 261748, 271102, 281101, 291753, 302720, 313839, 325254, 336919, 348518, 359995, 371516, 382844, 393400, 402980, 411789, 419707, 426200, 430981, 434107, 435458, 434898, 432921, 430345, 427318, 423444, 418832, 414143, 409497, 404314, 398366, 392117, 385868, 379518, 373296, 367764, 362825, 357626, 351731, 345574, 339558, 333562, 327488, 321458, 315303, 308763, 302274, 296568, 291407, 285803, 279701, 274256, 270127, 266684, 263317, 260355, 258105, 256064, 253751, 251439, 249453, 247536, 245459, 243485, 241767, 240032, 238257, 236835, 235764, 234526, 233083, 232060, 231580, 230941, 229849, 228912, 228437, 227842, 226833, 226092, 226122, 226383, 226274, 226101, 226397, 227131, 228219, 229942, 232219, 234298, 235814, 237386, 239617, 242276]
56104B42276K732K971L276L152K932L320M063M417M591N233N938N865N387N536
56090C01689O166O356O282O895Q009Q512Q324Q472R277J0131J0955J2242J3809
56077D17119J5053J6301J8315K0771K2850K4945K8073L1944L5495L8997M3639
56066G13502M9255N4452N8779O2638O5216O4747O0944N5221M8509M0902L3458
56055A307623K8027K4860K2368J9473J6315J2624P633J942k601n382p567j0013
56043A415302j2634j5981k1361k8813l6765m4040n0415n5165n7091n6322n4225
56032I82490n1322m7158m2205l7810l4081k9944k5380k1548j8606j5663j2906
56021F45867j1435j0827r412p203n969o069n827m529l443l194k715j549p37o51
$$ y = [242276, 245008, 247979, 251255, 254407, 257339, 260659, 264722, 269139, 273730, 278963, 284901, 290766, 296153, 301689, 307855, 314211, 320493, 327388, 335397, 343909, 352233, 360705, 369982, 380113, 391068, 403310, 417119, 432172, 448473, 466788, 487559, 510409, 535354, 563427, 595371, 630866, 669863, 713502, 762757, 817209, 875988, 938626, 1003842, 1068589, 1129533, 1184754, 1233263, 1274165, 1307623, 1335650, 1360510, 1382878, 1402351, 1418666, 1431290, 1438923, 1440865, 1438264, 1432882, 1425315, 1415302, 1402668, 1386687, 1365326, 1336513, 1299748, 1255708, 1205293, 1150128, 1093037, 1036715, 982490, 931168, 884010, 841805, 803995, 769914, 739970, 714590, 693042, 674436, 658773, 645867, 634432, 623605, 614193, 606990, 601021, 594952, 589125, 584596, 581153, 577959, 575244, 573695, 572958, 572307]
56007E72307k39Q37J545J596J983K893L327L229L717M778N212N125N901P421Q037
55992F27669P682Q127R658J0501J0102R997J0763J1128J0798J1140J2296J2701
55980G52562J2216J2588J4090J4900J4572J4826J6113J6810J6650J7373J9176
55969I21876K0206K0401K1927K4859K6520K6323K7004K9675L1978L2707L3929
55958A217405L6652L8788L9419M0761M3822M6326M7117M8411N1536N4624N6707
55947A721568N9785O4685O9300P2992P8170Q5385R1693R6088J01433J08760J15086
55936B664945J19371J24906J33053J40544J46073J53413J64582J76168J86069
55927D009124J97470K12235K26876K39336K53085K70229K87391L02962L21203
$$ y = [572307, 572068, 572905, 574450, 576046, 578029, 580922, 584249, 587478, 591195, 595973, 601185, 606310, 612211, 619632, 627669, 635351, 643478, 653136, 663637, 673739, 683736, 694499, 705627, 716425, 727565, 739861, 752562, 764778, 777366, 791456, 806356, 820928, 835754, 851867, 868677, 885327, 902700, 921876, 942082, 962483, 984410, 1009269, 1035789, 1062112, 1089116, 1118791, 1150769, 1183476, 1217405, 1254057, 1292845, 1332264, 1373025, 1416847, 1463173, 1510290, 1558701, 1610237, 1664861, 1721568, 1781353, 1846038, 1915338, 1988330, 2066500, 2151885, 2243578, 2339666, 2441099, 2549859, 2664945, 2784316, 2909222, 3042275, 3182819, 3328892, 3482305, 3646887, 3823055, 4009124, 4206594, 4418829, 4645705, 4885041, 5138126, 5408355, 5695746, 5998708, 6319911]
55918F319911L44456L68831L92510M20292M54535M90279N25214N65603O16081
55909A0497712O73059P34763Q07460Q94710R91956J099821J230315J390731J574599
55900A9895126J777931K008904K270469K551829K852039L193930L600160M078856
55892D2229244M649780N351054O189234P114022Q067592Q981975R623966R487880
55884A01694747Q035083N177760J496699k095896m917466o767261p769134q127872
55876H6726660q038248p682584p199691o654961o069286n463898m863775m284229
55868C6469988l739806l253793k841802k496599k201733j949359j734767j546544
55860A6705585j375159j222477j092539r80804q80950p93838p21083o57305n96909
$$ y = [6319911, 6664367, 7033198, 7425708, 7846000, 8300535, 8790814, 9316028, 9881631, 10497712, 11170771, 11905534, 12712994, 13607704, 14599660, 15699481, 16929796, 18320527, 19895126, 21673057, 23681961, 25952430, 28504259, 31356298, 34550228, 38150388, 42229244, 46879024, 52230078, 58419312, 65533334, 73600926, 82582901, 92206867, 101694747, 109729830, 114907590, 116404289, 114308393, 109390927, 102623666, 94854532, 86726660, 78688412, 71005828, 63806137, 57151176, 51081890, 45617992, 40754217, 36469988, 32730182, 29476389, 26634587, 24137988, 21936255, 19986896, 18252129, 16705585, 15330426, 14107949, 13015410, 12034606, 11153656, 10359818, 9638735, 8981430, 8384521]
55851H384521n41765m94862m52950m12405l76029l47090l22414k97873k75291
55842D863842k57613k42443k26414k11226j99498j89078j77005j64900j55213
55833C040452j46122j35289j24826j17525j11757j04795r7750r2633q7926q1559
55823A940270p5163p1015o7754o3206n8496n5378n2389m7651m2682l9514l6737
55812A330285l2167k6839k2649j8667j3498q824o912o905p223r224j4731k2040
55800A140606k8057l2524l6720l9976m1007m0920m1407m1546l9653l6714l4730
55789G27352l3218l0521k7182k4864k3243k0978j8456j6735j5089j2415r745q481
55777D86425p560n238k306n90L84K156L859L245L57k647m779o540p677p441o598
$$ y = [8384521, 7842756, 7347894, 6894944, 6482539, 6106510, 5759420, 5437006, 5139133, 4863842, 4606229, 4363786, 4137372, 3926146, 3726648, 3537570, 3360565, 3195665, 3040452, 2894330, 2759041, 2634215, 2516690, 2404933, 2300138, 2202388, 2109755, 2021829, 1940270, 1865107, 1794092, 1726338, 1663132, 1604636, 1549258, 1496869, 1449218, 1406536, 1367022, 1330285, 1298118, 1271279, 1248630, 1229963, 1216465, 1207641, 1200729, 1193824, 1186601, 1177377, 1162646, 1140606, 1112549, 1080025, 1043305, 1003329, 962322, 921402, 879995, 838449, 798796, 762082, 727352, 694134, 663613, 636431, 611567, 588324, 567346, 548890, 532155, 517066, 504651, 494906, 486425, 478865, 473627, 471321, 470731, 471115, 473271, 477130, 480375, 480732, 478085, 473306, 466766, 459089, 451648, 445050]
55762D45050o667p477p736p520p921q811r235r431j0307j1361j1356j0547j0144
55749C26537j0103r435q258p488p038o197n305n087m939l855k424j990k318k126
55735B49974j375j077j217r05k47j81o64q48p39j038j589j633j328j412j741j697
55719B32283j569j963k361j888j055j061j818k321k518l101l818l808l292l266
55705A98444l721l765l259k827k503j897j434j871k844l376l465l773m099l747
55691A55863l068l030l534l669l358l233l197k679k048k184k861l074k750k624
55677A14554k655k177j406j203j461j260n36r8j53k12l53j046j905k054j664j612
55661I4759j863j694j314j596k327k360j579j053j183j266j024r59j051o60R8
$$ y = [445050, 438383, 430906, 423170, 415650, 407729, 398918, 389683, 380252, 369945, 358584, 347228, 336681, 326537, 316434, 306999, 298741, 291253, 284215, 278018, 272713, 267626, 262687, 258832, 256408, 254418, 252100, 249974, 248599, 247522, 246305, 245400, 245153, 244972, 244308, 243460, 242721, 241683, 240094, 238461, 237133, 235721, 233980, 232283, 230714, 228751, 226390, 224502, 223447, 222386, 220568, 218247, 215729, 212628, 208810, 205002, 201710, 198444, 194723, 190958, 187699, 184872, 182369, 180472, 179038, 177167, 174323, 170947, 167482, 163709, 159610, 155863, 152795, 149765, 146231, 142562, 139204, 135971, 132774, 130095, 128047, 125863, 123002, 119928, 117178, 114554, 111899, 109722, 108316, 107113, 105652, 104392, 103856, 103758, 103605, 103393, 103040, 101994, 100089, 98035, 96371, 94759, 92896, 91202, 89888, 88292, 85965, 83605, 82026, 80973, 79790, 78524, 77500, 76541, 75490, 74830, 74928]
55646G4928L51O1J62Q85J389J272J033Q09R9j000j623j552j459j575j393r42r02
55629G0543j203r63j58J16n10r91n80J26M81Q01J426J912J885J762J900J947J561
55612H0055J002M97j29q37j202j215j458k111k642k732k669k583k199j612j376
55597E8789j534j510j150r10q21l49M27O40O9l75j18K06r2o61q67p49o11m12j38
55578D9834j45n46q83q77q42r85r60n85l13n15q91j018r49q44o12k38J5O0J05
55559C8811J52j11o54r73p98m07q3J34Q0m35j001r11k30J79l1k46J6L97M54L63
55539C4706M01M28K70O7r9m02p72q20m52l7K20M89P38O56L01J45K50J79j48k44
55519C5876P0L74M82P47J295J712J809J941K272K456K348K337K617K897L034L249
$$ y = [74928, 75279, 75340, 75502, 76387, 77776, 79048, 80081, 80890, 80989, 79989, 78366, 76814, 75355, 73780, 72387, 71445, 70543, 69340, 68377, 68219, 68335, 67825, 66834, 66254, 66380, 66861, 67662, 69088, 71000, 72885, 74647, 76547, 78494, 80055, 81057, 81554, 81425, 80588, 79386, 78171, 76713, 74602, 71960, 69228, 66559, 63976, 61777, 60165, 58789, 57255, 55745, 54595, 53685, 52864, 52515, 52942, 53582, 53651, 53276, 53158, 53364, 53272, 52611, 51744, 50995, 50384, 49972, 49834, 49689, 49143, 48260, 47383, 46541, 45556, 44596, 44011, 43698, 43183, 42292, 41274, 40325, 39481, 38869, 38631, 38646, 38706, 38811, 38963, 38852, 38198, 37225, 36427, 36020, 35937, 36071, 36151, 35716, 34715, 33804, 33574, 33753, 33722, 33476, 33492, 33889, 34343, 34706, 35107, 35535, 35805, 35872, 35773, 35371, 34599, 33779, 33327, 33290, 33510, 33999, 34737, 35393, 35694, 35839, 36089, 36268, 36120, 35876, 35946, 36320, 36802, 37549, 38844, 40556, 42365, 44306, 46578, 49034, 51382, 53719, 56336, 59233, 62267, 65516]
55503F5516L458L186K392J580Q78j42j435k237k248k150k509l037l395l796m282
55488E1779m301l637k932k742k743k491k173k024j752j225r53j216j400r49l38
55473B0903k85o08o29k95r0j72k78k95l02l01l12n07q43r30o21k87k47l19k85
55454A3297k61l00j51K29M33L02K04L24K80j40n12m82l40l49k24K10M40L2n84
55435A2408p56n47m02l37j37L3j65o22r47r81q01m82j64l0M3L70P97P69K12k56
55415H005l45m55o91m21N95J507J514R83O66N46K47p7j24j35l86m99j07L32K61
55396A1416J6J85M14p4j061j510r90o2O81J066R94M21k42m52k47j11j91k28j74
55377I851k33l73l20m6K08L20K92O8k76m05j59J63L09N18R54J132N79l60r20r02
$$ y = [65516, 68974, 72160, 74552, 76132, 77010, 76868, 75433, 73196, 70948, 68798, 66289, 63252, 59857, 56061, 51779, 47478, 43841, 40909, 38167, 35424, 32933, 30760, 28736, 26984, 25759, 24806, 23590, 22190, 21241, 20903, 20618, 20010, 19381, 19086, 18996, 18824, 18546, 18251, 17949, 17648, 17336, 16829, 15986, 15056, 14435, 14148, 13901, 13582, 13297, 13036, 12736, 12585, 12814, 13247, 13549, 13753, 14077, 14357, 14217, 13705, 13223, 12883, 12534, 12310, 12520, 12960, 12992, 12408, 11652, 11105, 10703, 10366, 10229, 10262, 10097, 9475, 8528, 7547, 6746, 6264, 6100, 6070, 6113, 6483, 7280, 8049, 8261, 8005, 7660, 7205, 6514, 6093, 6688, 8195, 9709, 10692, 11358, 11904, 12151, 12074, 11950, 11815, 11429, 10930, 10823, 11155, 11416, 11432, 11617, 12031, 11957, 10896, 9386, 8396, 8334, 9015, 10081, 11075, 11496, 11254, 10802, 10555, 10444, 10253, 10025, 9851, 9618, 9245, 8925, 8879, 9087, 9407, 9699, 9767, 9491, 9086, 8927, 9090, 9399, 9917, 10871, 12003, 12582, 12222, 11302, 10400]
55357A0400o17j99L59P70O90L37K12L94N49N18L64J47K1L08R60J323R84M16K62
55338A8198L65J85k33m52m55n37o33m91k60k39k99j99j50l61m29M8O07N18n0l70
55318A4763l28l71m85k93Jk21q67j179r23o19n36m11k38l66o59m91J91O69N75
55299H212L58L63K83j14m78m90l36k27j9L09L77Pl95m08j33J29L28N08N77M77
55279I328L07R9j83m40n06m36l66j73K91O97N86J42j5J47J4n97j051q79m31j87
55259F347m6K62N31L95n9l80l24l2K20K57J60K05N60R68J039P72M94L60K37P7
55239A2043l5j26k74l44k11r6k57m24j60L59N21K15o6j06k09m57m62q0K49J92
55219A0272m7k04l43n29n81m20k42j27N4K54K71J93L07M29Nr08j461j121l33K10
$$ y = [10400, 9783, 9584, 9943, 10713, 11403, 11740, 11952, 12346, 12895, 13413, 13777, 13924, 13945, 14253, 15213, 16536, 17520, 17936, 18198, 18563, 18748, 18515, 18063, 17608, 17071, 16438, 15947, 15687, 15448, 15149, 14950, 14800, 14439, 14010, 14058, 14665, 15183, 15133, 14763, 14435, 14064, 13579, 13286, 13287, 13066, 12199, 11020, 10097, 9478, 8942, 8531, 8293, 7927, 7268, 6777, 6968, 7637, 8212, 8570, 8933, 9216, 9102, 8624, 8134, 7798, 7571, 7552, 7861, 8238, 8245, 7850, 7442, 7309, 7438, 7766, 8274, 8851, 9328, 9635, 9734, 9551, 9111, 8605, 8169, 7803, 7630, 7921, 8618, 9204, 9346, 9331, 9478, 9492, 8895, 7844, 6965, 6534, 6347, 6301, 6563, 7094, 7489, 7430, 7050, 6726, 6694, 6914, 7171, 7331, 7536, 8096, 9064, 10103, 10875, 11369, 11729, 11966, 12043, 12008, 11882, 11608, 11264, 11053, 10957, 10700, 10276, 10116, 10475, 10996, 11211, 11145, 11039, 10830, 10373, 9911, 9831, 10080, 10272, 10225, 10021, 9678, 9149, 8568, 8148, 7906, 7779, 7833, 8087, 8358, 8551, 8858, 9287, 9292, 8384, 6923, 5802, 5469, 5679]
55199E679L93L73Q5m53q15o83l03p2K9J99L94M94N61N99L94o9m09l84k52k77k10
55178E273K50Q53J056P11J03m64q20q09m42JK45K87K78K77K90L47L89L10J78J61
55158H474J96P9j18p4J94L16K08K34N29P38O30M65M23K16l14p45o69k92j0K09
55138A0689N26P56O93N54N90O12L54L5m6p3l51o44n31j86j58m73o10l33L2J59
55118A1595Q4j03l68n25l62m0L6j67k23R0M44M44J60o5p0L1O6p7l81o63o92m61
55096H753k54l16n21n00j35K25J62k49m82k43J19J36q7n2L43O58N63K28r5m04
55076G849o89o90k86K07M09L66L64M78N80O06N52L49K7j47O0N06Q49R09P48M81
55056A3528K28J00Q6N0j0J05M52P33O50K85j6l9J79M80O62N78K84l7l09n34n79
$$ y = [5679, 6072, 6445, 6530, 6077, 5262, 4579, 4276, 4204, 4233, 4432, 4826, 5320, 5881, 6480, 6874, 6805, 6396, 6012, 5760, 5483, 5273, 5523, 6376, 7432, 8143, 8246, 7782, 6962, 6153, 5711, 5712, 5957, 6244, 6522, 6799, 7089, 7436, 7825, 8135, 8313, 8474, 8670, 8749, 8631, 8557, 8751, 9067, 9275, 9509, 10038, 10776, 11406, 11871, 12294, 12510, 12196, 11451, 10782, 10490, 10480, 10689, 11215, 11971, 12664, 13218, 13808, 14420, 14774, 14809, 14763, 14690, 14339, 13695, 13164, 12978, 12820, 12347, 11737, 11404, 11436, 11595, 11679, 11576, 11208, 10683, 10321, 10281, 10317, 10150, 9927, 10017, 10461, 10905, 11065, 11000, 10930, 10961, 11027, 10950, 10569, 9906, 9214, 8753, 8499, 8183, 7662, 7162, 7027, 7252, 7414, 7165, 6683, 6440, 6559, 6695, 6608, 6556, 6899, 7557, 8120, 8348, 8253, 7849, 7160, 6470, 6184, 6391, 6800, 7166, 7530, 8008, 8588, 9194, 9746, 10095, 10122, 9975, 10035, 10541, 11390, 12299, 13047, 13528, 13756, 13856, 13942, 13992, 13982, 14087, 14539, 15272, 15922, 16207, 16191, 16152, 16331, 16811, 17473, 18051, 18335, 18298, 17989, 17455, 16876]
55035A6876l10K4k9m00n06j38J71j3k89o5M94P31M63J04m1n3l0O8J88J81M0j57
55013A7309m18o83o62k16K38J73l03n72l81j13j17k26j07K37N21N05J89k05l92
54994A4777l13k26l06l19j7L22J89l13m58J08Q06Q93M07J1J02M79Q00R83J061
54975A8986R56N79O9k73k60J6K91L54J73o6j04J66N33O62M92K68J77R5j27l52
54955B2635l48j52K1J16K24L33L60M21O39Q22P12N07O29R41P99N3n55l64L25P41
54935B8859O33L62K35J86L5k76o29p85n99k98k61m63m86k21q3l03m68j89K63M17
54915B5929L62M72O78O19L02O1n6k78n54n12l2N57R03Q90N44M9k15j2L64M45K35
54894C0751J56L91P13R69J237J479J496J284J100J053R85Q91J022J428J757J725
$$ y = [16876, 16566, 16590, 16561, 16161, 15655, 15517, 15688, 15675, 15386, 15321, 15815, 16546, 17009, 17113, 17072, 17019, 16989, 17057, 17245, 17426, 17466, 17309, 16891, 16208, 15546, 15330, 15568, 15741, 15438, 14866, 14485, 14372, 14255, 14029, 13922, 14159, 14680, 15185, 15374, 15169, 14777, 14464, 14238, 13932, 13613, 13596, 13918, 14107, 13794, 13336, 13444, 14250, 15143, 15550, 15561, 15663, 16142, 16942, 17925, 18986, 19942, 20521, 20590, 20317, 20057, 20073, 20364, 20718, 20891, 20825, 20721, 20887, 21420, 22082, 22574, 22842, 23019, 23114, 22987, 22635, 22287, 22135, 22156, 22272, 22496, 22829, 23189, 23610, 24249, 25071, 25783, 26290, 26919, 27860, 28659, 28712, 28157, 27793, 28118, 28859, 29492, 29854, 30089, 30275, 30310, 30034, 29405, 28620, 28021, 27723, 27462, 26999, 26513, 26292, 26209, 25906, 25438, 25249, 25512, 25929, 26291, 26763, 27441, 28060, 28362, 28423, 28367, 28089, 27535, 27023, 26991, 27548, 28451, 29341, 29885, 29934, 29719, 29707, 30071, 30516, 30751, 30907, 31298, 32011, 32980, 34217, 35696, 37192, 38476, 39576, 40629, 41614, 42505, 43527, 44955, 46712, 48437]
54878D8437J526J546J872K332K828L400L955M215L955L257K429J698R79O1j055
54863H1435k072k727l025l148l240l334l334l078k607k330k577k991k850k083
54849D2039j449j431j486q84J52P74O38J59j66j64J90P65J161J099Q59R59J481
54832D4696K136K773L393L791L766L582L616L652L084J863N79m35j391k387l071
54817F9647l252l239l281l181k775k357k259k355k308k025j623j189q45p92j030
54802C7136j220j033n09Q0M67M88J67j69j39K20M56K85j30m98p65r71j097j142
54784C1626j163j124r74q68j030j323j355j062p89p09n74k47k2j36l69m29l90
54767A9062m45m95l63j34j8l6j12k55m03l17N2L92M39L87M75M95J37l59m00J00
$$ y = [48437, 49963, 51509, 53381, 55713, 58541, 61941, 65896, 70111, 74066, 77323, 79752, 81450, 82429, 82490, 81435, 79363, 76636, 73611, 70463, 67223, 63889, 60555, 57477, 54870, 52540, 49963, 46972, 44122, 42039, 40590, 39159, 37673, 36789, 36941, 37715, 38353, 38512, 38346, 38182, 38372, 39137, 40298, 41397, 42256, 43215, 44696, 46832, 49605, 52998, 56789, 60555, 64137, 67753, 71405, 74489, 76352, 76931, 76496, 75105, 72718, 69647, 66395, 63156, 59875, 56694, 53919, 51562, 49303, 46948, 44640, 42615, 40992, 39803, 38958, 38166, 37136, 35916, 34883, 34374, 34454, 34921, 35409, 35576, 35407, 35268, 35488, 35944, 36229, 36099, 35601, 34836, 33865, 32768, 31626, 30463, 29339, 28365, 27497, 26467, 25144, 23789, 22727, 21938, 21229, 20655, 20408, 20386, 20250, 19881, 19452, 19062, 18617, 18122, 17759, 17625, 17607, 17571, 17459, 17204, 16801, 16484, 16536, 16928, 17367, 17754, 18229, 18724, 18861, 18502, 18102, 18202]
54747A8202N66N99N16Q08J354J516R66J66j52K22Q33J160J178J171J252J243J056
54730C2656Q87R66J324J801K205K450K646L012L563L958L948L786L924M329M524
54715G5979M285L876L489K910K002J064L93k07j088k138k836k856k339j668j142
54700G9724q07m80K9O10R44R31Q36Q69Q98P21M21K13J07j9j89l79o25q83r12n72
54680H1437j24M4o4n3L45R70J486J729J736J567J205O21j09q68j606k374l139
54663H2803l663l780l647l559l517l279k823k468k438k596k701k654k414j938
54649D1326j421j233j466j731j647j294r61o77l32l1K9n7NK45L82K50M9M8K58
54630C1742N14P64J099J495J683J413Q42M64M88N22J29m72o01k1P58J171J166
$$ y = [18202, 18768, 19367, 19883, 20691, 22045, 23561, 24527, 24693, 24541, 24763, 25596, 26756, 27934, 29105, 30357, 31600, 32656, 33543, 34509, 35833, 37634, 39839, 42289, 44935, 47947, 51510, 55468, 59416, 63202, 67126, 71455, 75979, 80264, 84140, 87629, 90539, 92541, 93605, 93998, 93791, 92703, 90565, 87729, 84873, 82534, 80866, 79724, 78917, 78437, 78466, 79076, 80020, 80951, 81787, 82656, 83554, 84275, 84696, 84909, 85016, 84997, 84808, 84429, 83804, 82921, 82009, 81437, 81313, 81357, 81293, 81240, 81585, 82555, 84041, 85770, 87506, 89073, 90278, 90899, 90790, 89922, 88316, 85942, 82803, 79140, 75360, 71713, 68154, 64637, 61358, 58535, 56067, 53629, 51033, 48332, 45678, 43264, 41326, 39905, 38672, 37206, 35475, 33828, 32534, 31573, 30896, 30564, 30533, 30562, 30505, 30510, 30755, 31137, 31387, 31436, 31484, 31742, 32256, 33020, 34119, 35614, 37297, 38710, 39552, 40016, 40504, 41026, 41155, 40683, 40082, 40061, 40819, 41990, 43156]
54613D3156R59O44K95J91N10J019J350J404J325J166R24O99O32P54J055J561K121
54596E9765K340K021J513J362J700K193K541K737K906L161L589M148M576M621
54582I9173M342L983L580K916J886P27k20q63j439k198l083l703l751l374l019
54567I4957k899k850k736k690k778k726k293j718j468j606j709j449r86p38r12
54552F5399j315j561j404r76o57p12j063j437j592j448j105q37q74j126j294j260
54536D6738j175j133j057r58r93j044o55L04J213J362Q46L80L33M04K29j28m06
54519D4260n39n86n64m35k38l1K01M83P50Q61P15L83J01N2K02L58M09L99L92M29
54499D7602N75Q62J107J065P80N40M73L97K18J28K63M62N68P14J049J449J703
$$ y = [43156, 44115, 44759, 45054, 45245, 45755, 46774, 48124, 49528, 50853, 52019, 52943, 53642, 54274, 55028, 56083, 57644, 59765, 62105, 64126, 65639, 67001, 68701, 70894, 73435, 76172, 79078, 82239, 85828, 89976, 94552, 99173, 103515, 107498, 111078, 113994, 115880, 116607, 116387, 115524, 114085, 111887, 108804, 105101, 101350, 97976, 94957, 92058, 89208, 86472, 83782, 81004, 78278, 75985, 74267, 72799, 71193, 69484, 68035, 67049, 66311, 65399, 64084, 62523, 61119, 60143, 59486, 58774, 57711, 56274, 54682, 53234, 52129, 51292, 50418, 49292, 47998, 46738, 45563, 44430, 43373, 42415, 41422, 40378, 39723, 40027, 41240, 42602, 43448, 43828, 44161, 44565, 44794, 44666, 44260, 43721, 43135, 42571, 42136, 41898, 41867, 42068, 42551, 43301, 44162, 44877, 45260, 45361, 45413, 45615, 45973, 46382, 46781, 47173, 47602, 48177, 49039, 50146, 51211, 51991, 52531, 53004, 53401, 53619, 53747, 54010, 54472, 55040, 55754, 56803, 58252, 59955]
54482E9955J826J936K033K107K233K352K182J677J283J398J824K050J935J704
54468H6495J440J031N42J82p1m89j190j946k466k590k302j779j385j370j602j759
54452G0741j694j486j232j038j024j102r59n38k57m40p18n15P1M11L02K00M21
54435F1143O52N04J14m2K30O88R73R60Q38Q78J055J079Q74P72J021J333J288R77
54417G5337Q32R58J089J085J032R30O97M77M49M22J15k36j26L80O30L56J0j6N3
54398H4474p2k44k34j48j32n8J63L16K16L1r5l02o30p40m17n6j71o64j046j164
54378G9027j226j269j086o81l80l89n67p09p59p21n59l13j30j26k96n48p02n75
54360F7991j48L07M77L15J9k06k74j45J75N84R30J141J233J255J235J189J097
$$ y = [59955, 61781, 63717, 65750, 67857, 70090, 72442, 74624, 76301, 77584, 78982, 80806, 82856, 84791, 86495, 87935, 88966, 89508, 89690, 89619, 89130, 87940, 85994, 83528, 80938, 78636, 76857, 75472, 74102, 72500, 70741, 69047, 67561, 66329, 65291, 64267, 63165, 62206, 61668, 61411, 60971, 60253, 59738, 59809, 60220, 60522, 60722, 61143, 61795, 62299, 62413, 62371, 62601, 63289, 64262, 65222, 66060, 66938, 67993, 69072, 69946, 70718, 71739, 73072, 74360, 75337, 76169, 77127, 78216, 79301, 80333, 81263, 81960, 82437, 82886, 83308, 83423, 83187, 83061, 83441, 84071, 84427, 84437, 84421, 84474, 84402, 84158, 83924, 83776, 83644, 83586, 83749, 84065, 84281, 84312, 84217, 83915, 83285, 82545, 82128, 82072, 81901, 81237, 80191, 79027, 77801, 76532, 75446, 74765, 74385, 73996, 73429, 72720, 71961, 71240, 70681, 70368, 70238, 70112, 69816, 69268, 68566, 67991, 67843, 68150, 68627, 68942, 68961, 68755, 68481, 68336, 68511, 69095, 70025, 71166, 72399, 73654, 74889, 76078, 77175]
54343G7175R15O89N27M83N01N03M68L98K79J62J17J14Q0Jr2k79o52j053j186j022
54323G8128q69r03q94o03k12r6l10n49o05n69n85n92m57k45k23n33r15r23m73
54304F7572L7K44K92N23Q88J006P92N73N85O95P41P82Q43P60M76J97O2q1l35n30
54284G6122n25m65m65l99k42l31q42j371j470j366j558j883j697r59m41o33j077
54267F0398j099p92p26j043j287j151q35o76p11p88q73j012j146j157j079j067
54251D4956j117j036p46n07n75p86p44m20k82o32j124j184p57l35k94m85n53m11
54233C2968k87l77o26q03p46m96k35j18j34j81k02k25k88l57l52k46j37k11n41
54214B6406r53j126q94l94R5L99M96M35K62L3j76k54j22K11O18Q89R00P00M78
$$ y = [77175, 78090, 78779, 79306, 79789, 80290, 80793, 81261, 81659, 81938, 82100, 82217, 82331, 82411, 82412, 82320, 82041, 81389, 80336, 79150, 78128, 77259, 76356, 75462, 74859, 74647, 74551, 74241, 73692, 73087, 72518, 71933, 71341, 70884, 70639, 70416, 69883, 68968, 68045, 67572, 67609, 67853, 68145, 68668, 69556, 70562, 71354, 71927, 72512, 73207, 73948, 74730, 75573, 76333, 76809, 77006, 77068, 76987, 76652, 76122, 75597, 75132, 74667, 74268, 74026, 73695, 72853, 71482, 70012, 68646, 67088, 65205, 63508, 62549, 62108, 61475, 60398, 59299, 58507, 57781, 56738, 55451, 54300, 53465, 52789, 52078, 51290, 50417, 49405, 48259, 47102, 46023, 44956, 43839, 42803, 42057, 41550, 40975, 40189, 39445, 39025, 38743, 38111, 36987, 35803, 35046, 34711, 34417, 33932, 33379, 32968, 32681, 32304, 31678, 30875, 30129, 29633, 29398, 29280, 29146, 28965, 28763, 28538, 28250, 27893, 27541, 27295, 27158, 26947, 26406, 25453, 24327, 23433, 23039, 23134, 23533, 24029, 24464, 24726, 24759, 24583, 24329, 24207, 24418, 25036, 25925, 26825, 27525, 28003]
54195B8003M47O29P68N44n7o50q60p12m97l42j70J4L7j17k00l0K11J97j38n15
54175B6562o07l35J06M35N29M41K29j32n70p77m77J75O99P61M47J13P1L62O29
54156B8661L40n90j498j602r17j56J94K46J88o0m77p30o90p12r91j114o83n5R8
54137A9452k80o61p87q36q40n10J62O90P13M36K32J20p5k96l43k01p0p1j62k58
54117A6415k88j92L2K29K08j0j97j55Q5L04L01K0m18p90q77o14j33L13N29M79
54097A5241K51J2n7R2K56J57j77l20P8Q14J308J243Q37M82L49L84M74M90L10o1
54077B2163m63p50r11r59q57o04l39j68j1K95P11R75Q69M85J59J33L01L80L20
54058B1729L37N05N63L28O9J74N64P80N95K01j80m91o50n40l00k53m63o57o65
$$ y = [28003, 28450, 29079, 29847, 30391, 30334, 29684, 28824, 28112, 27615, 27273, 27103, 27117, 27154, 27037, 26837, 26807, 27018, 27215, 27077, 26562, 25955, 25620, 25726, 26161, 26690, 27131, 27360, 27228, 26658, 25881, 25404, 25579, 26278, 27039, 27486, 27599, 27670, 28032, 28661, 29001, 28411, 26913, 25311, 24394, 24238, 24432, 24678, 24866, 24806, 24329, 23599, 22909, 22197, 21206, 20092, 19409, 19354, 19452, 19172, 18511, 17724, 16888, 16048, 15538, 15700, 16390, 17103, 17539, 17771, 17891, 17816, 17520, 17177, 16976, 16906, 16835, 16673, 16415, 16127, 15935, 15967, 16196, 16404, 16394, 16197, 16042, 16127, 16431, 16732, 16752, 16334, 15544, 14667, 14053, 13920, 14233, 14762, 15241, 15492, 15504, 15447, 15539, 15795, 15952, 15775, 15455, 15533, 16347, 17655, 18898, 19735, 20217, 20566, 20950, 21424, 21914, 22224, 22163, 21700, 20950, 20039, 19080, 18223, 17619, 17280, 17112, 17101, 17396, 18107, 19082, 19951, 20436, 20595, 20728, 21029, 21409, 21729, 22066, 22571, 23134, 23462, 23531, 23705, 24269, 25049, 25644, 25845, 25665, 25174, 24524, 23984, 23684, 23431, 22968, 22311, 21646]
54039B1646n83m32p8L88N57K69j17k15m4J71L19K93k0l98l73R7M19K20j02n0J92
54018B2159K05J44L92P14N13j74o43n11j23J17J66R9o7j25J72O15O57K25j01M7
53998B4481L01J86j43j93J29M86N70L44q0m50m47PN95R50J029J021R96R11P98
53979C1491P46P13N54K93J48L14P41J130J139O74J06O1Q23J946K598K322J459
53962D7258P76P44J198J624J720J596J500J499J488J413J333J283J171R02N03
53947F6008J10j66l41n31p59q96q02n87n16o50p31n40k53k43o15j075j272j145
53929E4996q99p32o38m98l35l48o23r27j003r40r92j114j003o50m32n65q13r49
53911D1535j041j149j106q68p22p86p26l41j1q3j85K17Q62J025O14K36J96K08
$$ y = [21646, 21063, 20631, 20553, 20941, 21498, 21767, 21650, 21435, 21391, 21562, 21881, 22174, 22154, 21756, 21383, 21480, 21899, 22119, 22017, 21967, 22159, 22364, 22508, 22900, 23614, 24127, 23953, 23310, 22799, 22676, 22793, 22959, 23058, 22991, 22866, 23038, 23653, 24310, 24535, 24434, 24481, 24782, 24968, 24825, 24632, 24761, 25247, 25817, 26161, 26081, 25631, 25184, 25191, 25786, 26736, 27765, 28786, 29782, 30693, 31491, 32237, 32950, 33504, 33797, 33945, 34259, 35000, 36130, 37269, 37943, 38049, 38110, 38933, 40879, 43477, 45799, 47258, 48034, 48778, 49976, 51600, 53320, 54916, 56416, 57915, 59403, 60816, 62149, 63432, 64603, 65505, 66008, 66118, 65952, 65611, 65080, 64321, 63425, 62623, 62036, 61520, 60870, 60139, 59599, 59346, 59103, 58488, 57413, 56141, 54996, 54097, 53365, 52727, 52229, 51894, 51546, 50923, 49996, 48993, 48053, 47061, 45947, 44944, 44294, 43862, 43297, 42484, 41535, 40494, 39345, 38239, 37371, 36649, 35863, 35137, 34796, 34785, 34702, 34517, 34734, 35596, 36621, 37235, 37471, 37667, 37875]
53893C7875J68M57J192J814J830J486J311J324J163P64M70N38Q14R45P76N26N81
53876E4034J040J562J777J751J757J752J418P70K44J22J93J49qj37j89j03K36
53859F6368O95Q71O00K80L89Q88J332J526J699K083K528K656K302J681J201J099
53843H8198J333J731K114K267K055J644J407J405J251P13J87J42L66K47k87p18
53827A04055p82p61q84r67q99r13j176j490j656j762j846j696j276r58j029j276
53811H4684j384j443j710k096k269k151j964j893j930j970j870j513r89n76m48
53796F0478n09o35q34j109j326j410j402j281r15l72kj6k25l21k47q4P2P9j77
53777D9764n48o78n07l52l61k61J56O58R35R86Q75N07l1l61l28l03n39o91l94
$$ y = [37875, 38043, 38500, 39692, 41506, 43336, 44822, 46133, 47457, 48620, 49384, 49854, 50392, 51206, 52151, 52927, 53453, 54034, 55074, 56636, 58413, 60164, 61921, 63673, 65091, 65861, 66105, 66227, 66420, 66569, 66561, 66424, 66235, 66132, 66368, 67063, 67934, 68534, 68814, 69203, 70091, 71423, 72949, 74648, 76731, 79259, 81915, 84217, 85898, 87099, 88198, 89531, 91262, 93376, 95643, 97698, 99342, 100749, 102154, 103405, 104118, 104305, 104447, 104813, 105060, 104773, 104055, 103273, 102512, 101628, 100661, 99762, 98849, 97673, 96183, 94527, 92765, 90919, 89223, 87947, 86989, 85960, 84684, 83300, 81857, 80147, 78051, 75782, 73631, 71667, 69774, 67844, 65874, 64004, 62491, 61502, 60926, 60478, 59969, 59334, 58500, 57391, 56065, 54655, 53253, 51972, 51057, 50685, 50683, 50667, 50442, 50121, 49874, 49790, 49862, 49941, 49764, 49216, 48538, 48031, 47679, 47318, 47057, 47213, 47871, 48806, 49792, 50667, 51174, 51143, 50782, 50454, 50151, 49612, 48921, 48527]
53758D8527L5P5j71k17p2j78o00q85p25k76K56Q50J415J738J722J451R67L78M6
53739E4336K45P02Q91P68P64J074J396J477J432J392J288J132J144J391J589J453
53723G2474J019N05J26N9L68Q09R80P66M25J90M9o0r0m0MJ9Pk08p72j387j522
53702G3721j144q18r26j171j134q87p34p02o40o29p93r09o25n5K78R7l16n81o92
53683F1340q78j151j266j034o11l51m07n54m88k38j18k72m33l51j80k37m86n40
53665E1745k41J10J77Jj87l49n60o96n24j10K13L11M03O28P66O26M27M74O47O01
53645E4462L53K95N47P94P77O29N24M02K05J20L04O08Q27J007J279J576J721J644
53627F8074J374R45N22L55M34M23J96J08M54R47J071Q05N39M48L89L34M49P51
$$ y = [48527, 48562, 48637, 48466, 48249, 48177, 47999, 47399, 46514, 45789, 45513, 45769, 46619, 48034, 49772, 51494, 52945, 53912, 54290, 54336, 54581, 55283, 56174, 56942, 57706, 58780, 60176, 61653, 63085, 64477, 65765, 66897, 68041, 69432, 71021, 72474, 73493, 73998, 74124, 74183, 74551, 75360, 76340, 77106, 77531, 77721, 77770, 77710, 77620, 77580, 77584, 77603, 77610, 77402, 76630, 75243, 73721, 72577, 71759, 70833, 69662, 68528, 67641, 66907, 66205, 65565, 64936, 64143, 63234, 62609, 62554, 62832, 62929, 62613, 62032, 61340, 60462, 59311, 58045, 57011, 56400, 56049, 55642, 55088, 54600, 54362, 54244, 53972, 53539, 53188, 53008, 52771, 52285, 51745, 51504, 51614, 51791, 51792, 51605, 51256, 50696, 50000, 49476, 49366, 49579, 49890, 50293, 50921, 51687, 52313, 52740, 53214, 53861, 54462, 54815, 55110, 55657, 56451, 57228, 57857, 58381, 58783, 58988, 59108, 59412, 60020, 60847, 61854, 63133, 64709, 66430, 68074, 69448, 70393, 70915, 71270, 71704, 72127, 72323, 72431, 72885, 73832, 74903, 75708, 76247, 76695, 77084, 77418, 77867, 78618]
53609G8618J006J091J103J093R68O67K43k22n46m21J82P63P76L55J32L16M52J65
53591H6741k82m34k81j70k56l27j41K11L46k8o75r49n10K36O18N13L44M01N20
53572H5877M89L26J43j1q7o2q2k78m56l27J6J82J09J76N81J033J199J132J011
53553I0971Q64P32Q19J202J661J942K014J914J624J264J088J158J247J227J247
53538A10974J346J269R11O22P55J137J326J188R53Q47R29J163J399J441J290J193
53522A28743J269J314J138Q78P24O14M22K60K82L47K05j32m09m70l21l4K40K90
53504A35360J01m8N2K31K15Mk19l89m81l48N3M82O97P77Q34O83K10j96l9N47R76
53483A39502J057J141J398J519J303J056J152J518J820J932J970K051K215K464
$$ y = [78618, 79624, 80715, 81818, 82911, 83879, 84546, 84789, 84567, 84021, 83600, 83782, 84545, 85321, 85676, 85808, 86124, 86576, 86741, 86459, 86025, 85744, 85574, 85318, 84991, 84850, 85061, 85407, 85379, 84704, 83755, 83245, 83481, 84099, 84612, 84956, 85357, 85877, 86366, 86692, 86835, 86824, 86737, 86675, 86593, 86315, 85859, 85532, 85548, 85730, 85839, 86015, 86596, 87629, 88828, 89960, 90971, 91835, 92567, 93386, 94588, 96249, 98191, 100205, 102119, 103743, 105007, 106095, 107253, 108500, 109727, 110974, 112320, 113589, 114500, 115122, 115877, 117014, 118340, 119528, 120481, 121328, 122257, 123420, 124819, 126260, 127550, 128743, 130012, 131326, 132464, 133342, 134066, 134680, 135102, 135362, 135644, 135991, 136196, 136064, 135655, 135185, 134864, 134830, 135070, 135360, 135461, 135413, 135465, 135696, 135911, 135915, 135696, 135307, 134826, 134478, 134531, 135013, 135710, 136487, 137321, 138004, 138214, 138018, 137979, 138526, 139502, 140559, 141700, 143098, 144617, 145920, 146976, 148128, 149646, 151466, 153398, 155368, 157419, 159634, 162098]
53469A62098K764L106L549M130M660M857M724M618M830N297N761O113O438O883
53455B29828P486Q105Q532Q774R126R766J0384J0538J0336J0363J0894J1593J2121
53442C57846J2625J3403J4312J4913J4996J4744J4484J4489J4839J5312J5515
53431E17478J5354J5230J5505J5983J6169J5994J5922J6330J7047J7636J7872
53420F96520J7826J7652J7382J6945J6261J5354J4342J3272J2124J0980J0083
53409H58741R507Q916P972O928O455O789P351P416O883O085N145L892K354Q98
53395I45332k14j094j955k879l934n271o885q465r747j0848j1979j3006j3602
53382H55453j3805j4081j4738j5514j5932j5826j5461j5186j5133j5177j5125
$$ y = [162098, 164862, 167968, 171517, 175647, 180307, 185164, 189888, 194506, 199336, 204633, 210394, 216507, 222945, 229828, 237314, 245419, 253951, 262725, 271851, 281617, 292001, 302539, 312875, 323238, 334132, 345725, 357846, 370471, 383874, 398186, 413099, 428095, 442839, 457323, 471812, 486651, 501963, 517478, 532832, 548062, 563567, 579550, 595719, 611713, 627635, 643965, 661012, 678648, 696520, 714346, 731998, 749380, 766325, 782586, 797940, 812282, 825554, 837678, 848658, 858741, 868248, 877164, 885136, 892064, 898519, 905308, 912659, 920075, 926958, 933043, 938188, 942080, 944434, 945332, 945118, 944024, 942069, 939190, 935256, 929985, 923100, 914635, 904888, 894040, 882061, 869055, 855453, 841648, 827567, 812829, 797315, 781383, 765557, 750096, 734910, 719777, 704600, 689475]
53371F89475j4943j4770j4632j4231j3254j1823j0426r329q354p253o068m907
53359E59485l708k411j168n8J195K866M754O406P726Q987J0266J1334J2173J3154
53345F31001J4473J5787J6704J7390J8309J9560K0796K1750K2531K3342K4199
53334H45842K5071K6058K7268K8624K9896L0963L1924L2960L4137L5367L6522
53323A184632L7497L8180L8410L8165L7777L7723L8103L8403L8000L6800L5253
53312A598943L3728L2171L0378K8411K6515K4785K3070K1211J9269J7486J6071
53301A872038J4934J3626J1669R060O295L767J265j734n440r654j4224j9179k4323
53288A858100k9075l2943l5977l8536m0723m2336m3275m3764m4133m4497m4737
$$ y = [689475, 674532, 659762, 645130, 630899, 617645, 605822, 595396, 586067, 577713, 570460, 564392, 559485, 555777, 553366, 552198, 552140, 553335, 556201, 560955, 567361, 575087, 584074, 594340, 605674, 617847, 631001, 645474, 661261, 677965, 695355, 713664, 733224, 754020, 775770, 798301, 821643, 845842, 870913, 896971, 924239, 952863, 982759, 1013722, 1045646, 1078606, 1112743, 1148110, 1184632, 1222129, 1260309, 1298719, 1336884, 1374661, 1412384, 1450487, 1488890, 1526890, 1563690, 1598943, 1632671, 1664842, 1695220, 1723631, 1750146, 1774931, 1798001, 1819212, 1838481, 1855967, 1872038, 1886972, 1900598, 1912267, 1921327, 1927622, 1931389, 1932654, 1930920, 1925480, 1915826, 1901602, 1882423, 1858100, 1829025, 1796082, 1760105, 1721569, 1680846, 1638510, 1595235, 1551471, 1507338, 1462841, 1418104]
53277A418104m4702m4404m4036m3737m3382m2681m1603m0486l9657l9038l8271
53266I56107l7094l5481l3536l1442k9420k7567k5771k3918k2080k0331j8512
53255F50955j6415j4145j2022j0195q590p178o030n057m015k797j537l35Q53J983
53241E65475K864L420L851M363M930N477O109P015Q189R397J0379J1079J1672
53228F54220J2389J3233J3986J4540J5154J6095J7179J7914J8082J7880J7515
53217H28187J7004J6422J6012J5849J5668J5200J4461J3610J2733J1949J1380
53206I88475J0972J0472R793R091Q376P363N871M088K243K66j906m069o025p918
53192A037092r951j2055j4128j6381j8992k1609k3620k4855k5653k6259k6540
$$ y = [1418104, 1373402, 1328998, 1284962, 1241225, 1197843, 1155162, 1113559, 1073073, 1033416, 994378, 956107, 919013, 883532, 849996, 818554, 789134, 761567, 735796, 711878, 689798, 669467, 650955, 634540, 620395, 608373, 598178, 589588, 582410, 576380, 571323, 567308, 564511, 562974, 562639, 563492, 565475, 568339, 571759, 575610, 579973, 584903, 590380, 596489, 603504, 611693, 621090, 631469, 642548, 654220, 666609, 679842, 693828, 708368, 723522, 739617, 756796, 774710, 792792, 810672, 828187, 845191, 861613, 877625, 893474, 909142, 924342, 938803, 952413, 965146, 977095, 988475, 999447, 1009919, 1019712, 1028803, 1037179, 1044542, 1050413, 1054501, 1056744, 1057010, 1055104, 1051035, 1045010, 1037092, 1027141, 1015086, 1000958, 984577, 965585, 943976, 920356, 895501, 869848, 843589, 817049]
53181H17049k6340k5807k5254k4897k4686k4331k3563k2536k1758k1493k1445
53170E54939k1298k1251k1591k1992k1843k1147k0509k0183j9715j8710j7427
53159C29273j6311j5367j4344j3197j2073j1021j0001r107q441p933p373o644
53147A97461n783m933m339m199m433m669m605m256l790l295k864k701k894l193
53133A41507l238k983k731k731k906l025k987k854k653k309j797j297j106j381
53119A07509j953k470k649k466k129j890j807j714j482j251j273j532j724j684
53105H1485j545j389j065n33j35k05n61p43n90l07n8J20J09k05o28p97o74n71
53087G1708o55p60p22n78l62n5J38j08p12j118j003o53m78m56m01m29o98r67q14
$$ y = [817049, 790709, 764902, 739648, 714751, 690065, 665734, 642171, 619635, 597877, 576384, 554939, 533641, 512390, 490799, 468807, 446964, 425817, 405308, 385125, 365410, 346700, 329273, 312962, 297595, 283251, 270054, 257981, 246960, 236959, 227852, 219411, 211478, 204105, 197461, 191678, 186745, 182406, 178207, 173774, 169105, 164500, 160244, 156454, 153159, 150295, 147594, 144700, 141507, 138269, 135286, 132555, 129824, 126918, 123893, 120906, 118052, 115399, 113090, 111293, 109996, 108890, 107509, 105556, 103086, 100437, 97971, 95842, 93952, 92145, 90431, 88949, 87698, 86425, 84893, 83169, 81485, 79940, 78551, 77486, 76953, 76818, 76613, 76052, 75309, 74719, 74412, 74354, 74474, 74583, 74378, 73750, 72953, 72279, 71708, 71053, 70293, 69571, 68993, 68631, 68576, 68714, 68606, 67894, 66776, 65773, 65120, 64642, 64186, 63785, 63356, 62658, 61691, 60877]
53068F0877k90J19J87J86L69N96N89L68J66R7P9K6m7q4n9J5O5j4j91k45K8M52
53046F3289N74J73l80n69m29m98j018j524j465r70o31o59o75m03r8j32m27n74
53028E3584l75m0J26O5n2n4O7K01K64K33Q6j35j73K71J112J783J835J432J043
53009F1273Q44P20P45J095J515J420O80q4k87o4N0j51m92q10j050j110r36p50
52991F2608q10j034j093r08p66r08j195j343j275j149j113j144j137j074j012
52976D6647r69q72p22o83q80j170j234r66o05m87o85r56r80o77l25k87n52p10
52958C2887n03k29l34p44r77q34n51l25r3Q6o3n65r72r00m79r4Q2Q7k4r2P3L99
52936B5835N30L34J05L1r4l93m71J7O64P53K04l94o14n22k96JK13J66l2n9J24
$$ y = [60877, 60587, 60706, 60893, 61079, 61448, 62044, 62633, 63001, 63167, 63264, 63343, 63369, 63322, 63238, 63179, 63194, 63259, 63245, 63054, 62809, 62837, 63289, 63863, 64036, 63656, 63087, 62658, 62160, 61142, 59618, 58153, 57183, 56552, 55893, 55218, 54815, 54717, 54585, 54158, 53584, 53209, 53169, 53295, 53360, 53308, 53254, 53321, 53522, 53786, 54019, 54105, 53970, 53797, 54068, 55180, 56963, 58798, 60230, 61273, 62117, 62837, 63582, 64677, 66192, 67612, 68292, 68208, 67921, 67857, 67907, 67756, 67264, 66454, 65404, 64294, 63358, 62608, 61798, 60764, 59671, 58763, 57997, 57089, 55894, 54551, 53276, 52127, 51014, 49870, 48733, 47659, 46647, 45678, 44806, 44084, 43401, 42521, 41351, 40117, 39151, 38546, 38059, 37374, 36418, 35438, 34761, 34436, 34149, 33597, 32887, 32384, 32155, 31821, 31077, 30100, 29266, 28715, 28390, 28297, 28383, 28320, 27755, 26783, 25883, 25404, 25310, 25392, 25479, 25455, 25363, 25436, 25835, 26365, 26699, 26804, 26835, 26741, 26348, 25877, 25894, 26558, 27311, 27515, 27121, 26507, 25985, 25689, 25690, 25903, 26069, 26037, 25978, 26102]
52915B6102K41K00K25M16N43M22J56j12l61n10l65M6L52K87Rj60j36k6J12K35
52895B7676K16qk73l75k82j02J23L65N06M70L26K09J40R0R7J85K83L11L38M63
52875C0758O27O71N60M00K76K04K47M69P82R69R01P16O08O33P00P47Q19R33J019
52856D3039J008R33Q65P90O10K76j55n64q05p80n22l03m25q30j116j043q70j001
52838C9107j355j457j101o53n34o85p82p83r45j283j367q27O8O22M41j91o83p66
52820B6826o06m87m74m56l44j42J20M11O46O72L94q2m86o17n35m19l08j05J32
52801B4140J41j39l54j35L37N51L48R5J11K55K83K65M26O92P47M40Ok03k9L94
52781B8371P86R74R95R21O23p5r42j392j096l96J47L80N29O95P31N54K44j31n32
$$ y = [26102, 26343, 26543, 26768, 27184, 27727, 28149, 28305, 28193, 27832, 27322, 26957, 27003, 27355, 27642, 27651, 27491, 27355, 27329, 27441, 27676, 27892, 27884, 27611, 27236, 26954, 26852, 26975, 27340, 27846, 28316, 28642, 28851, 28991, 29081, 29178, 29363, 29646, 29957, 30295, 30758, 31385, 32056, 32616, 33016, 33292, 33496, 33743, 34212, 34994, 35963, 36864, 37580, 38188, 38821, 39521, 40268, 41087, 42020, 43039, 44047, 44980, 45845, 46635, 47245, 47521, 47366, 46802, 45997, 45217, 44695, 44392, 43967, 43137, 42021, 40978, 40108, 39107, 37752, 36295, 35194, 34541, 34007, 33322, 32540, 31757, 30812, 29529, 28162, 27335, 27403, 28025, 28466, 28275, 27592, 26826, 26220, 25733, 25259, 24803, 24459, 24317, 24437, 24848, 25494, 26166, 26560, 26478, 25992, 25375, 24840, 24421, 24113, 24008, 24140, 24281, 24142, 23788, 23653, 23990, 24541, 24889, 24984, 25095, 25350, 25633, 25898, 26324, 27016, 27763, 28203, 28209, 28006, 27977, 28371, 29157, 30131, 31126, 32047, 32670, 32595, 31653, 30261, 29165, 28769, 28916, 29296, 29825, 30520, 31251, 31805, 32049, 31918, 31386]
52762C1386p71o37k35K2o4k59k22O5L72N44N71M52J75j52k90r0L54Q07J090J182
52742C4300J100Q34M65K72N06J019J299J014L55j86l30j61R6K03k5n71j084j095
52724C8011n19J95M53Q2n26q06n47r5N6j73m46n11n17o84q99q56n04j12M3j16
52704C1529m99r11j110r95p33o10p00q57r06p64m23M1M25N51M50K98K09J85J59
52685B5339L6k43n51n99k89J03K24K5k95n94p91p97o24m71m42l08J04M77L41k13
52665B0432n84m44r0R7J47K51L85L92K81K27L64O27P72N66J07j67%K40Mo21r40
52644B2046n83M4L91L97L08J87l1k52l05j98m4J22K60K27j1k17j66J7M3j43l41
52623B1751m05l67k76j16J26M02O58Q45R28Q84P20M50J36n6j2J56K32K00K43L97
$$ y = [31386, 30615, 29978, 29743, 29765, 29701, 29442, 29220, 29285, 29657, 30201, 30772, 31224, 31399, 31247, 30957, 30867, 31221, 32028, 33118, 34300, 35400, 36234, 36699, 36971, 37477, 38496, 39795, 40809, 41164, 40978, 40648, 40487, 40583, 40786, 40761, 40190, 39106, 38011, 37492, 37687, 38140, 38222, 37696, 36890, 36343, 36248, 36304, 36131, 35685, 35174, 34657, 33973, 33074, 32218, 31714, 31602, 31645, 31529, 31030, 30119, 29009, 28014, 27281, 26671, 25971, 25114, 24208, 23444, 23021, 23062, 23487, 24038, 24488, 24786, 24995, 25180, 25339, 25375, 25132, 24581, 23982, 23693, 23796, 24020, 24045, 23750, 23156, 22365, 21568, 20944, 20473, 20031, 19723, 19827, 20304, 20645, 20432, 19848, 19404, 19314, 19411, 19558, 19809, 20194, 20586, 20867, 21094, 21458, 22085, 22857, 23423, 23530, 23363, 23363, 23603, 23607, 22986, 22046, 21463, 21507, 21898, 22295, 22603, 22790, 22759, 22507, 22202, 22004, 21960, 22082, 22342, 22569, 22558, 22341, 22175, 22192, 22235, 22092, 21751, 21346, 20979, 20703, 20587, 20713, 21115, 21773, 22618, 23546, 24430, 25150, 25600, 25736, 25680, 25668, 25824, 26056, 26256, 26499, 26896]
52603B6896M60L44K54L74N81O64O47P01Q64J011J008P60K97j21j54J94N01M66
52585C5747K93L48N64N53J81k20k70K5L25K87q1m71o10n98p09r08q43l94N0P1
52565C3340k24m38m25l31k38q4P4L1l16q14j178j182q31m22l01m25l62O5M43L39
52545B6721n4k25j34j91m96o26k70L32P28P62N36J78j96m35n16n57o29o11l83
52526B3934l9K02K39J54J14J89K40N3l27m93j23N37Q59N42q7m80l92KL55M08J94
52505B6081J4O6J70O9j04M1N12P85N13J0j83K1K73L60M19N68O48M33m8m96o80
52484B9472o53o44p07o21k45J80L12J98K14M85O90N61K60O8rp8j8K97O03M63j09
52463C0719n28l41K40O40N80K93J85M00P28P98M33j69n84n33j59J32P8k15m18
$$ y = [26896, 27356, 27700, 27954, 28328, 28909, 29573, 30220, 30921, 31785, 32796, 33804, 34564, 34861, 34740, 34586, 34780, 35281, 35747, 36040, 36388, 36952, 37505, 37686, 37466, 37196, 37221, 37546, 37833, 37752, 37281, 36671, 36073, 35364, 34456, 33613, 33219, 33269, 33340, 33116, 32678, 32253, 31922, 31684, 31600, 31674, 31705, 31389, 30575, 29397, 28215, 27384, 26962, 26661, 26236, 25874, 25939, 26382, 26721, 26667, 26442, 26308, 26117, 25621, 24995, 24725, 25057, 25785, 26547, 27083, 27261, 27065, 26630, 26114, 25557, 24928, 24317, 23934, 23895, 24097, 24336, 24490, 24604, 24793, 25033, 25086, 24759, 24266, 24143, 24680, 25539, 26081, 25994, 25514, 25122, 25124, 25479, 25887, 26081, 26095, 26161, 26331, 26400, 26296, 26337, 26849, 27634, 28147, 28157, 27974, 27995, 28268, 28628, 29047, 29615, 30263, 30696, 30648, 30152, 29472, 28819, 28175, 27468, 26847, 26602, 26782, 27094, 27292, 27506, 27991, 28681, 29242, 29502, 29570, 29561, 29483, 29465, 29762, 30365, 30828, 30719, 30191, 29850, 30090, 30730, 31310, 31603, 31788, 32188, 32916, 33714, 34147, 33978, 33394, 32861, 32702, 32834, 32912, 32697, 32279]
52444C2279l53j54m4n5m3M2P6k2j47j81j19k2J12K64L26K52J86K44K80P7k79m84
52422C2235m72n08p30q92o93j82L49O99P85N33L3l52l07OJ51M6L1K73M35K08j69
52401C1479k22P2K81J47j02j46J3J71K37K61K72K41J79J47J79K44K59J45p2j99
52381C3586l3L21M97K87j02k98k24p8rJ9M2%r4j03J8R8k6k47l39l18m08o64p86
52358C1139m74J69P31R41Q83P57N95L33nk79l78l08j54k7OnN7K07L08K45J15Q9
52336C4945J60J76R2L5P6J23O1o8j51j28j8J37K49K41J15k0p3l6O4K00L16L60
52314C6856L86M95O40O49M45J69j0o6j9J50L85N09M17K69L07N80Q92J037R36O79
52294D5706M84N31P17O94K90k21m48l81l16l43k16J81N36M43m6m37l38R7L65J59
$$ y = [32279, 31926, 31772, 31728, 31673, 31630, 31672, 31748, 31726, 31579, 31398, 31279, 31257, 31369, 31633, 31959, 32211, 32397, 32641, 32921, 32998, 32719, 32235, 31763, 31255, 30525, 29633, 28940, 28758, 29107, 29806, 30591, 31124, 31157, 30805, 30498, 30504, 30655, 30701, 30732, 31005, 31440, 31648, 31479, 31257, 31329, 31610, 31757, 31655, 31509, 31522, 31693, 31930, 32191, 32463, 32704, 32883, 33030, 33209, 33453, 33712, 33857, 33785, 33586, 33553, 33874, 34371, 34658, 34556, 34258, 34034, 33956, 33947, 33966, 34008, 34008, 33914, 33811, 33829, 33927, 33901, 33654, 33315, 32997, 32589, 31925, 31139, 30665, 30834, 31565, 32506, 33389, 34146, 34741, 35074, 35069, 34790, 34412, 34104, 33950, 33923, 33929, 33924, 33981, 34188, 34496, 34741, 34856, 34945, 35105, 35281, 35373, 35408, 35484, 35607, 35668, 35600, 35449, 35321, 35303, 35440, 35689, 35930, 36045, 36025, 35952, 35916, 35980, 36180, 36496, 36856, 37242, 37737, 38377, 39026, 39471, 39640, 39630, 39564, 39545, 39695, 40080, 40589, 41006, 41275, 41582, 42162, 43054, 44091, 45027, 45706, 46190, 46721, 47438, 48132, 48422, 48201, 47753, 47372, 47056, 46713, 46497, 46678, 47214, 47657, 47611, 47174, 46836, 46933, 47298, 47457]
52274D7457l36o79o14k30K03M54M02R0k41l44k16r8j01n7K02N62Q22R37R01N71
52254D9685q3o40n51J72Q67R87O99O24J074J771K200K091J588J055P56P29Q81
52237F3905J125J345J380J204J041J100J241J132P55N04O41R10R21P19O97R96
52221G9616J260J087N63J54J93N39Q02P75O04N58P33J011J198J182R72O85M66
52204I2398M12M83O08P78J016J239J263J012O63N01O21Q05P90O08N97R68J474
52187A06236J621J237O87M38N90Q92J124J297J451J471J198O85K61K67O93J165
52171A21313J306J135R49R31R84R58Q74Q28Q28Q76J023J254J397J315J114J042
52155A38127J204J507J788J917J825J581J391J426J622J741J621J321J050R79
$$ y = [47457, 47121, 46442, 45828, 45598, 45801, 46255, 46657, 46747, 46506, 46162, 45946, 45848, 45747, 45690, 45892, 46454, 47276, 48213, 49114, 49685, 49602, 48962, 48411, 48583, 49450, 50437, 51136, 51760, 52834, 54605, 56805, 58896, 60484, 61539, 62295, 63024, 63905, 65030, 66375, 67755, 68959, 70000, 71100, 72341, 73473, 74228, 74732, 75373, 76283, 77204, 77923, 78620, 79616, 80876, 81963, 82526, 82680, 82873, 83412, 84214, 84989, 85593, 86151, 86884, 87895, 89093, 90275, 91247, 91932, 92398, 92810, 93293, 93901, 94679, 95695, 96934, 98197, 99209, 99872, 100373, 100994, 101799, 102589, 103197, 103794, 104762, 106236, 107857, 109094, 109781, 110219, 110809, 111701, 112825, 114122, 115573, 117044, 118242, 118927, 119188, 119455, 120148, 121313, 122619, 123754, 124703, 125634, 126618, 127576, 128450, 129278, 130106, 130982, 132005, 133259, 134656, 135971, 137085, 138127, 139331, 140838, 142626, 144543, 146368, 147949, 149340, 150766, 152388, 154129, 155750, 157071, 158121, 159100]
52141A59100J091J202J179J131J216J378J407J275J132R91P40N22P17J346J842
52126A76269J732J254R59R60R64Q24O45M75K88K03L04L45L3m51o43m74l07l05
52108A83075k40jJ79J13q8k93m95n69l22J12K96R1j72l13n71j032j245q73l39
52089A77313k92o82q65n23j1J79q3o09j055j092o98l11m41j043j544j502j044
52072A65697o14n07p00j009j209j169r08n71l23k82n00r06j315j550j532j253
52056A51349q10m43l84n67o67n21l84n12p31o71l42j18j79k60r6K14M00M16M31
52037A46125N16N55M77M02N29Q82J275J500J504J386J254J157J100J114J238J478
52021A62492J745J835J599J159Q38Q31J022J208J395J613J684J402R00N42M48
$$ y = [159100, 160191, 161393, 162572, 163703, 164919, 166297, 167704, 168979, 170111, 171102, 171842, 172364, 173081, 174427, 176269, 178001, 179255, 180214, 181174, 182138, 182962, 183607, 184082, 184370, 184573, 184877, 185222, 185255, 184804, 184161, 183687, 183380, 183075, 182835, 182834, 183013, 183126, 183038, 182745, 182250, 181681, 181359, 181471, 181767, 181858, 181686, 181373, 180802, 179770, 178525, 177652, 177313, 177021, 176339, 175474, 174951, 174940, 175119, 175036, 174427, 173372, 172280, 171582, 171271, 170830, 169787, 168243, 166741, 165697, 165083, 164576, 163876, 162867, 161658, 160489, 159581, 159010, 158687, 158405, 157905, 156999, 155684, 154134, 152602, 151349, 150539, 150096, 149712, 149145, 148478, 147957, 147573, 147061, 146330, 145659, 145317, 145199, 145020, 144760, 144664, 144878, 145278, 145694, 146125, 146641, 147196, 147673, 148075, 148604, 149486, 150761, 152261, 153765, 155151, 156405, 157562, 158662, 159776, 161014, 162492, 164237, 166072, 167671, 168830, 169668, 170499, 171521, 172729, 174124, 175737, 177421, 178823, 179723, 180265, 180713]
52006A80713M47M74O91J081J317J211R88R55J076J156J118R67O61K86J15K08K22
51989A93686q6l92k44K41N23M17K25J10j35n70q17n75j25k7m51j083j519j584
51971A87594j296q00l72k96n98r80j067p65l45k17n62j149j527j413r58o00o07
51954A74042q22r21q24p25o94n52k83k66q02j531j763j354q22n74m60k83k99q02
51936A60265j556k054k159k139k101j884j506j301j517j952k219k179k046k118
51922A33534k472k899l107l042k938k971l024k903k675k576k665k742k652k465
51908I4403k326k299k345k392k348k193k031j998k080k132k022j746j380j056
51894F6055r28j044j276j432j420j269j045q26o65n70n31o19q83j148j130q11
$$ y = [180713, 181160, 181634, 182325, 183406, 184723, 185934, 186922, 187877, 188953, 190109, 191227, 192194, 192855, 193141, 193256, 193464, 193686, 193600, 193208, 192964, 193205, 193728, 194145, 194370, 194480, 194345, 193775, 192958, 192383, 192258, 192231, 191780, 190697, 189178, 187594, 186298, 185498, 185126, 184830, 184232, 183252, 182185, 181420, 181075, 180858, 180296, 179147, 177620, 176207, 175249, 174649, 174042, 173220, 172299, 171475, 170750, 170056, 169504, 169221, 168955, 168153, 166622, 164859, 163505, 162683, 162109, 161649, 161366, 161067, 160265, 158709, 156655, 154496, 152357, 150256, 148372, 146866, 145565, 144048, 142096, 139877, 137698, 135652, 133534, 131062, 128163, 125056, 122014, 119076, 116105, 113081, 110178, 107503, 104927, 102262, 99520, 96868, 94403, 92077, 89778, 87433, 85041, 82693, 80500, 78469, 76471, 74391, 72259, 70237, 68491, 67111, 66055, 65127, 64083, 62807, 61375, 59955, 58686, 57641, 56815, 56150, 55580, 55049, 54430, 53547, 52399, 51269, 50458]
51878E0458n11m61n24m93m19m34m76m14k82j25J23L78K94k48p38o21j30L0k84
51859D5123m94k22J85L05K17K01K32J64J18K66M32K81j52m46k85K37P58R36O47
51840D8503R5l08l37k00k67o05r10q85n59k14o5j01j82k21k59l52m50m55l37j69
51820D1722k7Q3J80K87L78L74K50J65L33O72P42K47n04r10p27k36K50O34P91N20
51800D5224j15o24o28l33k07k97k38J14M39M42L14L87N72M65j1l99l30j8J06N1
51780D4914J73N39P94P41O28P17Q97J005J136J359J415J061N38K92L91N46O47
51763E7793Q29J071J163J092J111J331J562J615J546J467J396J316J249J183J164
51748G6888J318J589J575R73J31k77j50j05n68j185j356j031o85p54j241j757
$$ y = [50458, 49947, 49486, 48962, 48469, 48050, 47616, 47140, 46726, 46444, 46319, 46442, 46820, 47114, 46866, 46128, 45507, 45377, 45407, 45123, 44629, 44407, 44592, 44897, 45114, 45315, 45547, 45711, 45829, 46095, 46527, 46808, 46656, 46210, 45925, 46162, 46920, 47856, 48503, 48598, 48290, 47953, 47753, 47486, 46881, 45971, 45086, 44527, 44313, 44248, 44147, 43965, 43744, 43485, 43133, 42683, 42228, 41891, 41722, 41695, 41778, 41958, 42245, 42623, 42997, 43247, 43412, 43745, 44417, 45159, 45406, 44902, 43992, 43265, 43029, 43279, 43913, 44704, 45224, 45109, 44485, 43857, 43524, 43317, 43020, 42782, 42896, 43335, 43777, 44091, 44478, 45050, 45515, 45504, 45105, 44775, 44757, 44863, 44914, 45087, 45626, 46420, 47161, 47789, 48506, 49403, 50408, 51544, 52903, 54318, 55379, 55917, 56209, 56600, 57146, 57793, 58622, 59693, 60856, 61948, 63059, 64390, 65952, 67567, 69113, 70580, 71976, 73292, 74541, 75724, 76888, 78206, 79795, 81370, 82343, 82474, 82197, 82047, 81942, 81374, 80189, 78833, 77802, 77117, 76363, 75122, 73365]
51732G3365j798j200m41k03o03j099j211j004p21l86j1J93J24M9K34N19O10N31
51714F6948N01N14L45o9n29p93p20l39M8K4m44q73q26m62k41k75l22k65k67m03
51694F1552m99m05k12j19k29n20q62j035q99n42k06o2q3q0J64O63J113J134P22
51675E9595K51k5k56o04q67p22k23K78N16M71K19r0k60k24j68k50l79m20m66o13
51655E5763o72m29n4O1j54m49o83q93r71o85r2L68L59nm06o23n69k73O3K06J46
51634E0008Q3P2l1k73m50l99j71J36N03Q03P25J97l69m45j0M67O13N10M36M59
51614E2864M25K48J2k14m93q69j139j040n93j37Q4J49K14K18P2p5j1J88K64J90
51594E0357J66J95J0m43p34m21L59J021J195J032Q73P93O22K75p5k42k63k60j84
$$ y = [73365, 71567, 70367, 69926, 69723, 69120, 68021, 66810, 65806, 65085, 64699, 64688, 64881, 65005, 65054, 65288, 65807, 66417, 66948, 67449, 67963, 68308, 68239, 67710, 66917, 66197, 65858, 65906, 65930, 65486, 64613, 63787, 63325, 63084, 62809, 62487, 62222, 61955, 61552, 61053, 60648, 60436, 60317, 60088, 59568, 58706, 57671, 56772, 56230, 56024, 55962, 55879, 55799, 55963, 56626, 57739, 58873, 59595, 59846, 59821, 59565, 58961, 58094, 57372, 57149, 57427, 57943, 58414, 58633, 58543, 58283, 58059, 57891, 57641, 57262, 56842, 56376, 55763, 55091, 54662, 54608, 54669, 54515, 54066, 53383, 52490, 51519, 50834, 50742, 51110, 51469, 51464, 51058, 50435, 49866, 49593, 49656, 49862, 50008, 50091, 50163, 50132, 49859, 49409, 49010, 48839, 48975, 49478, 50281, 51006, 51203, 50834, 50389, 50379, 50846, 51459, 51969, 52405, 52864, 53289, 53537, 53549, 53335, 52842, 51973, 50834, 49794, 49201, 49064, 49148, 49297, 49511, 49729, 49801, 49726, 49715, 49903, 50167, 50357, 50523, 50718, 50728, 50285, 49551, 49130, 49489, 50510, 51705, 52737, 53610, 54403, 55025, 55300, 55225, 54983, 54720, 54460, 54276]
51575E4276P9M04M73K32M1J52L53L30K09L37O32O49K58j02o1K20L68L02J82P8
51555E9412j8JK38N14M95J39k09j95J46M64M49R6l19m39j54K75M32K06j33k72
51535F1128k44l06n23o89o84o57p23o74k88J88K55j48n00m00j28k06o16q31n58
51516E3396r0J61K00L39O59Q66P07L55K63N86R45Q48K95k22l37j71n0m5K1K21
51496E8947L89L39O5k17k17J82P43J050R28O29N00N99P18O56L72m1l66l65k4L66
51476F5253M92L49J60J18K66N14O83O30M90N50Q13R33P19M70N06O74O51N03N13
51457G5287N82L02l02o80m64L2L02K43J32J98L93N18M16J12j84k99k78k57k24
51438G5829j43k04o13j172j362r92m94l94p34j089j055n65R1M75L54o7l62l45
$$ y = [54276, 54355, 54759, 55232, 55464, 55505, 55657, 56010, 56340, 56549, 56886, 57518, 58167, 58425, 58323, 58262, 58482, 58850, 59152, 59334, 59412, 59394, 59395, 59633, 60147, 60642, 60781, 60572, 60377, 60523, 60987, 61436, 61532, 61213, 60774, 60620, 60895, 61327, 61533, 61400, 61128, 60884, 60578, 60055, 59366, 58682, 58025, 57302, 56628, 56340, 56528, 56783, 56635, 56135, 55735, 55607, 55401, 54785, 53954, 53396, 53306, 53467, 53667, 54006, 54665, 55531, 56238, 56593, 56856, 57442, 58387, 59235, 59530, 59308, 58971, 58800, 58750, 58705, 58726, 58947, 59336, 59675, 59740, 59523, 59306, 59488, 60231, 61281, 62209, 62838, 63338, 63937, 64655, 65311, 65683, 65642, 65276, 64911, 64887, 65253, 65745, 66094, 66254, 66372, 66638, 67152, 67835, 68465, 68955, 69505, 70318, 71251, 71970, 72440, 72946, 73620, 74271, 74774, 75287, 75869, 76171, 75869, 75189, 74725, 74757, 75059, 75302, 75434, 75632, 76025, 76543, 76959, 77071, 76887, 76588, 76310, 76053, 75829, 75686, 75482, 74869, 73697, 72335, 71343, 70849, 70455, 69721, 68632, 67577, 67012, 67103, 67578, 67932, 67865, 67503, 67158]
51420F7158k30l05n89q82j007r20p18n35m08k46n7k9k70n97q02r66j167j140o28
51401E5662J6J40k51m77j95Q6j91q36j277j323j124p37k09J25ll38l82j63j74
51382D8349n82r02o62k6M45M84L13K45L03L04J48k2k0J33K09J8l91p75q94o73
51362D6004k84JQ0J25K80M35M20L35L71M04J42k88l05L37J108J295Q48L15J00
51343E1723O8n3k54k75k8K28J96j1P2N99J023P09j47o69l79K65N58L82J03k9j7
51322E4064R0K07J59j06l42l09j49j92m84p49p84o47n00m37n19p85j183j576j782
51303D3976j625j069l68P0M9k65n49n70k32L21O56M33j09l62j78q4m42q52p59
51284C8041k63P8O0o5j16j39j28KJ26M6j93l62m64o59q48p43l41K1J73K92M75
$$ y = [67158, 66928, 66623, 66034, 65152, 64145, 63225, 62507, 61972, 61564, 61318, 61261, 61232, 60962, 60365, 59563, 58597, 57430, 56290, 55662, 55678, 55818, 55567, 55090, 54895, 54981, 54790, 53954, 52677, 51354, 50230, 49493, 49284, 49409, 49406, 49068, 48686, 48523, 48349, 47767, 46865, 46203, 46177, 46622, 47106, 47419, 47664, 47967, 48271, 48419, 48397, 48377, 48510, 48719, 48737, 48346, 47571, 46677, 46004, 45720, 45721, 45801, 45926, 46206, 46641, 47061, 47396, 47767, 48171, 48313, 48025, 47720, 48057, 49165, 50460, 51308, 51623, 51723, 51791, 51738, 51484, 51209, 51181, 51409, 51605, 51594, 51666, 52265, 53288, 53997, 53850, 53181, 52802, 53067, 53625, 54007, 54110, 54081, 54064, 54154, 54361, 54520, 54414, 54072, 53763, 53614, 53422, 52938, 52189, 51405, 50758, 50258, 49821, 49302, 48517, 47334, 45758, 43976, 42351, 41282, 40914, 40984, 41033, 40768, 40219, 39649, 39417, 39738, 40394, 40827, 40718, 40356, 40178, 40094, 39652, 38800, 38041, 37778, 37856, 37916, 37851, 37735, 37596, 37468, 37470, 37596, 37642, 37449, 37087, 36623, 35964, 35116, 34373, 34032, 34053, 34226, 34518, 34993]
51263C4993N04K09k08m12l37j91j30r2J09M95P76O25J26k18j49ok09o09p24m41
51243C4111q7J21K06J27j98n17m00J06M65M16L05M69P27P88P75R09J007P01M8
51224D0079m91o19m83l49k65j49mK4j83m98o00k97J93M50L50J55Q3M7r1k28j58
51203C6966R7L05K94J13l1N3L18M30R8n20q95p32k30K70O49Q62P47K75j68j61
51183C8740J81L19K0l68m58l27k77k93o4M69R19R43P10O33P36O04K1o04o92k02
51163D1010L37M44R4m09p59p81n00j11J57K30J74M8j06j97j51m6K6J03K41L02
51143D0106J26j48k15n3O5K5lP5J25R0J41L50N31N96P14R29Q97L76l45p40o68
51122D2974l31J35O75J020Q61L03j80l51m18n86p18o26m34l95m78l73Q3O38Q59
$$ y = [34993, 35497, 35706, 35498, 35086, 34749, 34558, 34428, 34336, 34445, 34940, 35716, 36341, 36467, 36249, 36100, 36094, 35885, 35276, 34552, 34111, 34024, 34145, 34351, 34478, 34280, 33763, 33363, 33469, 33934, 34350, 34655, 35124, 35851, 36639, 37414, 38323, 39330, 40031, 40079, 39588, 38969, 38486, 38137, 37872, 37723, 37719, 37743, 37560, 37062, 36462, 36165, 36358, 36808, 37158, 37313, 37396, 37443, 37352, 37124, 36966, 37063, 37368, 37662, 37775, 37744, 37797, 38115, 38545, 38643, 38123, 37228, 36496, 36266, 36536, 37185, 38047, 38794, 39069, 38901, 38740, 38921, 39240, 39260, 38892, 38434, 38107, 37830, 37537, 37473, 37942, 38861, 39804, 40514, 41147, 41883, 42487, 42508, 41904, 41212, 41010, 41347, 41791, 41885, 41476, 40717, 39936, 39436, 39325, 39482, 39712, 39886, 39934, 39828, 39631, 39480, 39434, 39460, 39563, 39804, 40106, 40232, 40084, 39869, 39816, 39881, 39906, 39903, 39978, 40103, 40193, 40334, 40684, 41215, 41811, 42525, 43454, 44351, 44727, 44382, 43642, 42974, 42643, 42778, 43453, 44473, 45334, 45637, 45457, 45106, 44688, 44102, 43384, 42758, 42324, 41929, 41451, 41078, 41161, 41799, 42658]
51103D2658N38j28p22r35p49l88j06j2j9K8J70L08L62L87M54N16M85M18M36N13
51083D4214N08M37M88P08Q60P17L41k3k14j99j6K12L15K51J30L9n4j41r0J24K77
51062D8884K01K5n1j00l14n80n48j46K71L55J45r6k16k45k09p5R2J26n0k90l78
51041D6801l14l01m15m14q5L68N27L31J58K48L81K32j51m72n68m61j63K53N09
51022D6464L55p8l56k13J83M98N68M48K91J79N9j39l01j75K59O45O41L17Nj39
51002D9511j99k42k71l35m34l59M4N08N54J74j18K3L09K84m2k69j52J76M52N04
50982E0118L03m2l05k66R1N54Q33P75N52N13P94J073R40M90K82O28J166J336J042
50963F0877O62N26O07O97O67N13L15J84J84L07N11P67R50R02O03L01K65M84O93
$$ y = [42658, 43196, 43068, 42346, 41411, 40662, 40274, 40168, 40156, 40137, 40165, 40335, 40643, 41005, 41392, 41846, 42362, 42847, 43265, 43701, 44214, 44722, 45159, 45647, 46355, 47215, 47932, 48273, 48250, 48036, 47837, 47821, 48033, 48348, 48599, 48729, 48768, 48714, 48573, 48483, 48607, 48884, 49085, 49110, 49059, 48959, 48645, 48065, 47517, 47371, 47642, 47997, 48142, 48046, 47830, 47585, 47376, 47301, 47393, 47519, 47469, 47179, 46801, 46487, 46186, 45771, 45357, 45272, 45640, 46167, 46498, 46656, 46904, 47285, 47517, 47366, 46894, 46326, 45865, 45702, 45955, 46464, 46819, 46741, 46385, 46172, 46355, 46853, 47421, 47869, 48160, 48339, 48398, 48259, 47958, 47783, 48042, 48687, 49328, 49645, 49650, 49511, 49312, 49070, 48799, 48464, 48030, 47671, 47715, 48223, 48777, 48951, 48833, 48856, 49165, 49449, 49407, 49138, 48986, 49162, 49614, 50118, 50421, 50379, 50074, 49808, 49899, 50453, 51286, 52061, 52613, 53126, 53920, 54993, 55933, 56423, 56705, 57333, 58499, 59835, 60877, 61539, 62065, 62672, 63369, 64036, 64549, 64864, 65048, 65232, 65539, 66050, 66817, 67767, 68669, 69272, 69573, 69838, 70322, 71015]
50944G1015O40K53l34q29r46o72l18j54j10oO0j68o14q32n66q2K09K72L71O24
50924F7813Q39Q44P43P98J048J196R36L49q2N5O60J300J725K029K271K279J978
50907H6781J700J848K342K697K676K536K592K777K866K902L130L519L658L248
50893A25272K562K204K452L009L419L607L831M212M555M647M506M273M029L886
50879A76464M060M591N144N321N174N083N170N139M752M157L571K959K202J395
50865B35182O96N3p03j609k569l514m336m873n108n295n602n832n707n314m937
50850A80532m569m006l360l040l143l291l169k889k646k342j796j093m73o0J64
50835A44819K20J83J66J64R9O8L13P76R81O21jl87m78n21n52m16j91j31k31k13
$$ y = [71015, 71655, 71908, 71574, 70745, 69799, 69127, 68809, 68655, 68545, 68539, 68599, 68431, 67817, 66985, 66419, 66337, 66546, 66818, 67189, 67813, 68652, 69496, 70239, 71037, 72085, 73281, 74217, 74566, 74484, 74539, 75199, 76499, 78224, 80253, 82524, 84803, 86781, 88481, 90329, 92671, 95368, 98044, 100580, 103172, 105949, 108815, 111717, 114847, 118366, 122024, 125272, 127834, 130038, 132490, 135499, 138918, 142525, 146356, 150568, 155123, 159770, 164276, 168549, 172578, 176464, 180524, 185115, 190259, 195580, 200754, 205837, 211007, 216146, 220898, 225055, 228626, 231585, 233787, 235182, 235878, 235931, 235228, 233619, 231050, 227536, 223200, 218327, 213219, 207924, 202322, 196490, 190783, 185469, 180532, 175963, 171957, 168597, 165557, 162414, 159123, 155954, 153065, 150419, 148077, 146281, 145188, 144715, 144655, 144819, 145039, 145222, 145388, 145552, 145651, 145719, 146032, 146808, 147789, 148410, 148409, 148022, 147544, 147023, 146471, 146055, 145864, 145733, 145502, 145289]
50815A45289k6M9j18k75j80L1J12P8J57M14O63P00N36M25O49J202J727J871J725
50796A55029J745K189K809L198L290L397L795M408M902N053M996N103N560O135
50782B11609O485O610O831P325P912Q353Q657Q926R100R059Q913Q972R424J0147
50768C28323J0891J1531J2104J2635J3056J3313J3483J3703J3946J4049J4008
50757D71042J4043J4230J4189J3401J1859J0098Q538P074N408L539J700Oj561
50744E73566k919l925m565m983n237n267n063m677m029k944j410L27J998L530
50730E34402M976O391P872R595J1613J3706J5594J7281J8974K0674K2010K2569
50718G05657K2287K1355J9872J7757J5037J2011R036O260L661J254r12k977n224
$$ y = [145289, 145263, 145312, 145194, 144919, 144739, 144770, 144882, 144960, 145117, 145531, 146194, 146894, 147430, 147855, 148504, 149706, 151433, 153304, 155029, 156774, 158963, 161772, 164970, 168260, 171657, 175452, 179860, 184762, 189815, 194811, 199914, 205474, 211609, 218094, 224704, 231535, 238860, 246772, 255125, 263782, 272708, 281808, 290867, 299780, 308752, 318176, 328323, 339214, 350745, 362849, 375484, 388540, 401853, 415336, 429039, 442985, 457034, 471042, 485085, 499315, 513504, 526905, 538764, 548862, 557400, 564474, 569882, 573421, 575121, 575127, 573566, 570647, 566722, 562157, 557174, 551937, 546670, 541607, 536930, 532901, 529957, 528547, 528874, 530872, 534402, 539378, 545769, 553641, 563236, 574849, 588555, 604149, 621430, 640404, 661078, 683088, 705657, 727944, 749299, 769171, 786928, 801965, 813976, 823012, 829272, 832933, 834187, 833275, 830298, 825074]
50705H25074p790j0449j2886j5076j7251j9470k1444k2866k3777k4432k4839k4705
50693F00089k3846k2497k1072j9707j8211j6450j4606j2993j1694j0494r181p784
50681D11554o442n142l729k218r06J1P89J903L393M777N683O339P174Q195R031
50666D40412R496R776J0055J0295J0352J0141R588Q679P647O818O231N594M732
50653E49816L805L024K401J897J568J409J310J328J694K412L113L589M125M919
50639E86410N597N709N485N542N950O227O180O152O266O134N556N033N168N927
50625F67336O867P792Q774R779J0684J1605J2816J4338J5881J7228J8467J9834
50613H21401K1477K3397K5500K7749L0348L3617L7552M1644M5273M8227N0569
$$ y = [825074, 817284, 806835, 793949, 778873, 761622, 742152, 720708, 697842, 674065, 649633, 624794, 600089, 576243, 553746, 532674, 512967, 494756, 478306, 463700, 450707, 439013, 428519, 419338, 411554, 405112, 399970, 396241, 394023, 393117, 393128, 393917, 395820, 399213, 403990, 409673, 416012, 423186, 431381, 440412, 449908, 459684, 469739, 480034, 490386, 500527, 510115, 518794, 526441, 533259, 539490, 545084, 549816, 553621, 556645, 559046, 560943, 562511, 563920, 565230, 566558, 568252, 570664, 573777, 577366, 581491, 586410, 592007, 597716, 603201, 608743, 614693, 620920, 627100, 633252, 639518, 645652, 651208, 656241, 661409, 667336, 674203, 681995, 690769, 700548, 711232, 722837, 735653, 749991, 765872, 783100, 801567, 821401, 842878, 866275, 891775, 919524, 949872, 983489, 1021041, 1062685, 1107958, 1156185, 1206754]
50602A206754N2180N2679N1797M9582M6274M2199L7803L3475K9243K4886K0390
50591A647262J6060J2087Q228M123k25m528q619j2496j6063j9062k1346k2994
50579A582427k4029k4199k3243k1294j8881j6543j4539j2861j1370r923q498p305
50567A389742o622o504o745p218q011r174j0397j1316j1955j2624j3320j3518
50555A272338j2783j1356r880q621p217n200k635j42J592K275K089J421M92q10
50541A221563k767n473q631j1761j4647j7484k0548k3714k6473k8441k9731l0702
50529A001191l1489l1908l1738l0951k9655k8045k6334k4673k3001k1166j9154
50518G03077j7112j5150j3258j1457r796q220o560m756k949j231M67K163L693
$$ y = [1206754, 1258934, 1311613, 1363410, 1412992, 1459266, 1501465, 1539268, 1572743, 1601986, 1626872, 1647262, 1663322, 1675409, 1683637, 1687760, 1687535, 1683007, 1674388, 1661892, 1645829, 1626767, 1605421, 1582427, 1558398, 1534199, 1510956, 1489662, 1470781, 1454238, 1439699, 1426838, 1415468, 1405545, 1397047, 1389742, 1383120, 1376616, 1369871, 1362653, 1354642, 1345468, 1335071, 1323755, 1311800, 1299176, 1285856, 1272338, 1259555, 1248199, 1238319, 1229698, 1222481, 1217281, 1214646, 1214504, 1216096, 1218371, 1220460, 1221881, 1222373, 1221563, 1218796, 1213323, 1204692, 1192931, 1178284, 1160800, 1140252, 1116538, 1090065, 1061624, 1031893, 1001191, 969702, 937794, 906056, 875105, 845450, 817405, 791071, 766398, 743397, 722231, 703077, 685965, 670815, 657557, 646100, 636304, 628084, 621524, 616768, 613819, 612588, 613055, 615218, 618911]
50505F18911M921N947O920P800Q503R213J0239J1569J2849J3864J4876J6325J8341
50492G60278K0673K3040K5398K7839L0388L3021L5780L8672M1408M3377M4108
50481A123982M3746M2823M1632M0042L8011L5981L4496L3602L2895L2106L1337
50470A530653L0737L0168K9360K8276K7152K6288K5851K5915K6487K7468K8591
50459A836946K9529L0173L0670L1120L1225L0441K8489K5571K2007J7806J2738
50448B126715O700j10p295j4404k1071k7157l2744l7842m2129m5121m6519m6321
50436A812702m4679m1835l8133l3856k9073k3816j8399j3365r083n607l023j651
50424A550182j799l460o477j0803j6340k2579k8678l3994l8405m2053m4938m6893
$$ y = [618911, 623832, 629779, 636699, 644499, 653002, 662215, 672454, 684023, 696872, 710736, 725612, 741937, 760278, 780951, 803991, 829389, 857228, 887616, 920637, 956417, 995089, 1036497, 1079874, 1123982, 1167728, 1210551, 1252183, 1292225, 1330236, 1366217, 1400713, 1434315, 1467210, 1499316, 1530653, 1561390, 1591558, 1620918, 1649194, 1676346, 1702634, 1728485, 1754400, 1780887, 1808355, 1836946, 1866475, 1896648, 1927318, 1958438, 1989663, 2020104, 2048593, 2074164, 2096171, 2113977, 2126715, 2133415, 2133305, 2126010, 2111606, 2090535, 2063378, 2030634, 1992792, 1950663, 1905542, 1859023, 1812702, 1768023, 1726188, 1688055, 1654199, 1625126, 1601310, 1582911, 1569546, 1560463, 1554856, 1551833, 1550182, 1548383, 1544923, 1538446, 1527643, 1511303, 1488724, 1460046, 1426052, 1387647, 1345594, 1300656, 1253763]
50412A253763m7899m8221m8132m7654m6645m5107m3212m1113l8818l6388l4056
50401G76518l1970k9924k7549k4833k2232k0169j8555j6953j5175j3481j2180
50390E43497j1171j0047q625p115n770m572l430k505k029j800j281k54Q64J621
50376D87383K140K867L895M902N740O684Q004R581J1100J2415J3590J4721J5866
50363E98888J7078J8418J9875K1328K2545K3253K3413K3353K3524K4054K4724
50352H40453K5339K5929K6540K7057K7374K7567K7760K7941K8044K8062K7835
50341A139901K6994K5307K3048K0779J8753J6735J4356J1421P920L937l32m719
50329A304100r266j4115j9094k3639k7235k9824l1625l2696l2914l2262l0939
$$ y = [1253763, 1205864, 1157643, 1109511, 1061857, 1015212, 970105, 926893, 885780, 846962, 810574, 776518, 744548, 714624, 687075, 662242, 640010, 619841, 601286, 584333, 569158, 555677, 543497, 532326, 522279, 513654, 506539, 500769, 496197, 492767, 490262, 488233, 486433, 485152, 484898, 485762, 487383, 489523, 492390, 496285, 501187, 506927, 513611, 521615, 531196, 542296, 554711, 568301, 583022, 598888, 615966, 634384, 654259, 675587, 698132, 721385, 744798, 768151, 791675, 815729, 840453, 865792, 891721, 918261, 945318, 972692, 1000259, 1028019, 1055960, 1084004, 1112066, 1139901, 1166895, 1192202, 1215250, 1236029, 1254782, 1271517, 1285873, 1297294, 1305214, 1309151, 1308819, 1304100, 1294834, 1280719, 1261625, 1237986, 1210751, 1180927, 1149302, 1116606, 1083692, 1051430, 1020491]
50318A020491k9141k6931k4357k1539j8582j5510j2379r406o909n126m130l864
50306H42617m225n161o702q822j1279j3662j5712j7425j8843j9885k0505k0897
50294F79499k1244k1413k1127k0429j9656j8927j8006j6785j5566j4625j3780
50283D77941j2725j1596j0805j0412j0009r266q248p220o349n735n382n112m712
50270C70370m269m100m223m239l824l140k531k103j772j525j308q65n0Q09J215
50255C38445J155J098J335J665J843K005K449L162L877M494N205O187P267Q034
50241C88221Q222P955P556P167O647N897N030M150L117J827N79j47l60o39j455
50226D43767k642l730m524n153n758o374p022p662q106q193q008p725p322o652
$$ y = [1020491, 991350, 964419, 940062, 918523, 899941, 884431, 872052, 862646, 855737, 850611, 846481, 842617, 838392, 833231, 826529, 817707, 806428, 792766, 777054, 759629, 740786, 720901, 700396, 679499, 658255, 636842, 615715, 595286, 575630, 556703, 538697, 521912, 506346, 491721, 477941, 465216, 453620, 442815, 432403, 422394, 413128, 404880, 397660, 391311, 385576, 380194, 375082, 370370, 366101, 362001, 357778, 353539, 349715, 346575, 344044, 341941, 340169, 338644, 337336, 336471, 336421, 337230, 338445, 339600, 340698, 342033, 343698, 345541, 347546, 349995, 353157, 357034, 361528, 366733, 372920, 380187, 388221, 396443, 404398, 411954, 419121, 425768, 431665, 436695, 440845, 443962, 445789, 446368, 446221, 445861, 445222, 443767, 441125, 437395, 432871, 427718, 421960, 415586, 408564, 400902, 392796, 384603, 376595, 368870, 361548, 354896]
50212C54896n805n094m695m440m093l625l165k819k580k374k101j768j523j497
50198C09317j605j639j552j476j481j499j506j574j649j496j035n10k24j53p9
50183B91839P4J66Q7j10k82k74MM73Q94J106J201J297J308J082P21M74L54J33
50165C00547k29m09j58K72L51j42q68j298j143n05K80Q57R91O92K40OJ21L72N02
50146C00479N33O55Q28Q22O51P08J242J987K510K753K908K968K808K606K759L294
50130C30511L781L931L904L945M022M048M139M383M619M676M659M763M967N158
50116C91506N372N681N971O098O164O382O740P077P378P767Q250Q722R197R816
$$ y = [354896, 349091, 343997, 339302, 334862, 330769, 327144, 323979, 321160, 318580, 316206, 314105, 312337, 310814, 309317, 307712, 306073, 304521, 303045, 301564, 300065, 298559, 296985, 295336, 293840, 292805, 292295, 292071, 291918, 291839, 291913, 292079, 292166, 292056, 291774, 291500, 291504, 291977, 292871, 293977, 295178, 296475, 297783, 298865, 299586, 300060, 300414, 300547, 300318, 299909, 299751, 300023, 300374, 300232, 299364, 298066, 296923, 296418, 296698, 297555, 298546, 299238, 299478, 299484, 299605, 299977, 300479, 301012, 301667, 302495, 303317, 303968, 304676, 305918, 307905, 310415, 313168, 316076, 319044, 321852, 324458, 327217, 330511, 334292, 338223, 342127, 346072, 350094, 354142, 358281, 362664, 367283, 371959, 376618, 381381, 386348, 391506, 396878, 402559, 408530, 414628, 420792, 427174, 433914, 440991, 448369, 456136, 464386, 473108, 482305, 492121]
$$ [...]
##END NTUPLES=NMR SPECTRUM
##END=
