
##TITLE=UV1066_Cafestol_6114776_qL7CiwJWX0
##JCAMPDX= 6.0         $$ Bruker NMR JCAMP-DX V2.0
##DATA TYPE= NMR SPECTRUM
##DATA CLASS= NTUPLES
##ORIGIN= BRUKER
##OWNER= Administrator
$$ 1.72 TOPSPIN		Version 2.1
$$ 2012-05-14 19:52:54.875 -0500  Administrator@TOPSPIN
$$ Compression mode = diff/dup
##.OBSERVE FREQUENCY= 400.13188235
##.OBSERVE NUCLEUS= ^1H
##.ACQUISITION MODE= SIMULTANEOUS (DQD)
##.ACQUISITION SCHEME= undefined
##.AVERAGES= 8
##.DIGITISER RES= 22
##SPECTROMETER/DATA SYSTEM= spect
##.PULSE SEQUENCE= zg30
##.SOLVENT NAME= COFFEE_meoh
##.SHIFT REFERENCE= INTERNAL, COFFEE_meoh, 1, 14.98061
##AUDIT TRAIL= $$ (NUMBER, WHEN, WHO, WHERE, PROCESS, VERSION, WHAT)
$$ ##TITLE= Audit trail, TOPSPIN		Version 2.1
$$ ##JCAMPDX= 5.01
$$ ##ORIGIN= Bruker BioSpin GmbH
$$ ##OWNER= Administrator
$$ $$ C:\Bruker\TOPSPIN/data/COFFEE/nmr/UV1066_Cafestol_6114776_qL7CiwJWX0/10/pdata/1/auditp.txt
$$ ##AUDIT TRAIL=  $$ (NUMBER, WHEN, WHO, WHERE, PROCESS, VERSION, WHAT)
(   1,<2012-05-14 19:52:48.171 -0500>,<Administrator>,<TOPSPIN>,<go>,<TOPSPIN 2.1>,
      <created by zg
	started at 2012-05-14 19:51:41.718 -0500,
	POWCHK enabled, PULCHK disabled,
       configuration hash MD5:
       AF F2 23 6B 01 CD 40 DD E5 A1 38 A0 06 EA F7 77
       data hash MD5: 64K
       C2 00 3B E2 E0 FD 04 09 7D 7B 44 BC 63 F5 01 19>)
(   2,<2012-05-14 19:52:50.859 -0500>,<Administrator>,<TOPSPIN>,<proc1d>,<TOPSPIN 2.1>,
      <Start of raw data processing
       efp LB = 0 FT_mod = 6 PKNL = 1 PHC0 = 0 PHC1 = 0 SI = 32K 
       data hash MD5: 32K
       31 76 66 D6 6A 49 1D A3 86 96 05 BC 61 AA 1E 29>)
(   3,<2012-05-14 19:52:51.265 -0500>,<Administrator>,<TOPSPIN>,<proc1d>,<TOPSPIN 2.1>,
      <pk PHC0 = 215.2716 PHC1 = 0 
       data hash MD5: 32K
       24 EA AD 61 26 17 03 7A 3F 48 B5 ED 4D 01 CA A6>)
(   4,<2012-05-14 19:52:51.328 -0500>,<Administrator>,<TOPSPIN>,<proc1d>,<TOPSPIN 2.1>,
      <abs ABSG = 1 
       data hash MD5: 32K
       FD 94 69 23 32 A5 2C 14 47 DC F9 77 B2 C3 B7 44>)
(   5,<2012-05-14 19:52:51.343 -0500>,<Administrator>,<TOPSPIN>,<proc1d>,<TOPSPIN 2.1>,
      <abs ABSG = 2 
       data hash MD5: 32K
       4D 3F A0 C0 84 13 BE E0 B1 75 55 D3 48 FE 2C 97>)
(   6,<2012-05-14 19:52:51.375 -0500>,<Administrator>,<TOPSPIN>,<proc1d>,<TOPSPIN 2.1>,
      <abs ABSG = 3 
       data hash MD5: 32K
       92 A1 0D 72 FC F6 0A A9 AE 82 33 50 2C BE AB 8A>)
(   7,<2012-05-14 19:52:51.406 -0500>,<Administrator>,<TOPSPIN>,<proc1d>,<TOPSPIN 2.1>,
      <abs ABSG = 4 
       data hash MD5: 32K
       39 E2 3C 78 FB DF DA 6C 1F 98 6A 0E AD D5 83 63>)
(   8,<2012-05-14 19:52:51.437 -0500>,<Administrator>,<TOPSPIN>,<proc1d>,<TOPSPIN 2.1>,
      <abs ABSG = 5 
       data hash MD5: 32K
       71 81 D5 84 53 34 65 5D 65 AC 80 BF 25 41 A4 F8>)
$$ ##END=
$$ 
$$ $$ hash MD5
$$ $$ 9F 07 CB F9 FE 02 F5 50 0E EB 74 77 AF 8D 02 24
##$RELAX= 
##$RELAX= 
##$RELAX= 
##$RELAX= 
##$RELAX= 
##$RELAX= 
##$RELAX= 
$$ Bruker specific parameters
$$ --------------------------
$$ [...]
150 150 150 150 150 150 150 150
##$TP07= 0
##$TPNAME0= <>
##$TPNAME1= <>
##$TPNAME2= <>
##$TPNAME3= <>
##$TPNAME4= <>
##$TPNAME5= <>
##$TPNAME6= <>
##$TPNAME7= <>
##$TPOAL= (0..7)
0.5 0.5 0.5 0.5 0.5 0.5 0.5 0.5
##$TPOFFS= (0..7)
0 0 0 0 0 0 0 0
##$TUNHIN= 0
##$TUNHOUT= 0
##$TUNXOUT= 0
##$USERA1= <user>
##$USERA2= <user>
##$USERA3= <user>
##$USERA4= <user>
##$USERA5= <user>
##$V9= 5
##$VALIST= <valist>
##$VCLIST= <CCCCCCCCCCCCCCC>
##$VD= 0
##$VDLIST= <DDDDDDDDDDDDDDD>
##$VPLIST= <PPPPPPPPPPPPPPP>
##$VTLIST= <TTTTTTTTTTTTTTT>
##$WBST= 2048
##$WBSW= 25
##$XGAIN= (0..3)
0 0 0 0
##$XL= 0
##$YL= 0
##$YMAX_a= 569591
##$YMIN_a= -669775
##$ZGOPTNS= <>
##$ZL1= 120
##$ZL2= 120
##$ZL3= 120
##$ZL4= 120
##$ABSF1= 14.98061
##$ABSF2= -5.57192
##$ABSG= 5
##$ABSL= 3
##$ALPHA= 0
##$AQORDER= 0
##$ASSFAC= 0
##$ASSFACI= 0
##$ASSFACX= 0
##$ASSWID= 0
##$AUNMP= <proc_prof1d_extract_pilot.lims>
##$AXLEFT= 0
##$AXNAME= <>
##$AXNUC= <1H>
##$AXRIGHT= 0
##$AXTYPE= 0
##$AXUNIT= <>
##$AZFE= 0.1
##$AZFW= 0.1
##$BCFW= 0
##$BC_mod= 0
##$BYTORDP= 0
##$COROFFS= 0
##$CY= 15
##$DATMOD= 1
##$DC= 0
##$DFILT= <>
##$DTYPP= 0
##$F1P= 0
##$F2P= 0
##$FCOR= 0.5
##$FTSIZE= 32768
##$FT_mod= 6
##$GAMMA= 0
##$GB= 0
##$INTBC= 1
##$INTSCL= 1
##$ISEN= 128
##$LB= 0
##$LEV0= 0
##$LPBIN= 0
##$MAXI= 10000
##$MC2= 0
##$MEAN= 0
##$ME_mod= 0
##$MI= 0
##$NCOEF= 0
##$NC_proc= -8
##$NLEV= 6
##$NOISF1= 0
##$NOISF2= 0
##$NSP= 0
##$NTH_PI= 0
##$NZP= 0
##$OFFSET= 14.98061
##$PC= 1
##$PHC0= 215.2716
##$PHC1= 0
##$PH_mod= 1
##$PKNL= yes
##$PPARMOD= 0
##$PPDIAG= 0
##$PPIPTYP= 0
##$PPMPNUM= 2147483647
##$PPRESOL= 1
##$PSCAL= 4
##$PSIGN= 0
##$PYNMP= <proc.py>
##$REVERSE= no
##$SF= 400.13
##$SI= 32768
##$SIGF1= 0
##$SIGF2= 0
##$SINO= 400
##$SIOLD= 32768
##$SPECTYP= <>
##$SREGLST= <1H.CDCl3>
##$SSB= 0
##$STSI= 32768
##$STSR= 0
##$SW_p= 8223.68421052632
##$SYMM= 0
##$S_DEV= 0
##$TDeff= 65536
##$TDoff= 0
##$TI= <>
##$TILT= no
##$TM1= 0
##$TM2= 0
##$TOPLEV= 0
##$USERP1= <user>
##$USERP2= <user>
##$USERP3= <user>
##$USERP4= <user>
##$USERP5= <user>
##$WDW= 1
##$XDIM= 32768
##$YMAX_p= 431999303
##$YMIN_p= -608723
##$CURPLOT= <Network HP LaserJet P1505>
##$CURPRIN= <$Network HP LaserJet P1505>
##$DFORMAT= <normdp>
##$LAYOUT= <+/1D_H.xwp>
##$LFORMAT= <normlp>
##$PFORMAT= <normpl>
##$SURQMSG= 1
$$ End of Bruker specific parameters
$$ ---------------------------------
##NTUPLES= NMR SPECTRUM
##VAR_NAME=  FREQUENCY,     SPECTRUM/REAL,   SPECTRUM/IMAG
##SYMBOL=    X,             R,               I
##VAR_TYPE=  INDEPENDENT,   DEPENDENT,       DEPENDENT
##VAR_FORM=  AFFN,          ASDF,            ASDF
##VAR_DIM=   32768,         32768,           32768
##UNITS=     HZ,            ARBITRARY UNITS, ARBITRARY UNITS
##FACTOR=    0.250966925370066, 1,           1
##FIRST=     8223.43324360095, 63800,        -165676
##LAST=      0,             -84590,          -56806
##MIN=       0,             -608723,         0
##MAX=       8223.43324360095, 431999303,    0
$$ Real data points
##PAGE= N=1
##DATA TABLE= (X++(R..R)), XYDATA
$$ [...]
$$ plain form
19533 -112050 92269 -458729 224426 198157 41850 -67802 222323 -79687 399190 310478 58591
19521 194283 174067 -2765 -34009 -126746 -203541 45044 -228930 -172075 -4567 -51101 -63774 -299897
19509 -299897 -160463 -209968 88621 -40833 99563 -187070 -395747 -237163 -105417 -66941
19499 -66941 55092 -275402 -137627 -500312 -51789 -243867 64319 -50370 -163594 -133066 14917
19487 16922 -182768 -18870 -182234 54010 -63622 92900 -44078 198038 75625 -13065 -30294
19476 -30294 -147714 -150150 80039 -145100 50113 -320120 -6315 -52004 -218013 -8621 39666
19464 -106251 -13036 -27538 -194332 -147329 39653 -48010 -20479 139197 -46906 -309451 154382
19452 340479 -522980 20843 -161618 -298990 88988 -217687 72010 289704 -331486 -167326
$$ packed form
19533a12050I2269d58729B24426k6269D1850f7802B22323g9687C99190q8712E8591
19521A94283k0216b765l1244r2737p6795D5044b28930N6855d567m6534j2673k36123
19509b99897J39434m9505H8621d0833I9563a87070k08677J58584a05417L8476
19499f6941E5092b75402a37627l62685e1789j92078F4319e0370j13224L0528A4917
19487A6922a82768a8870j63364E4010f3622I2900d4078A98038G5625a3065j7229
19476c0294j17420k436H0039a45100E0113c20120f315m5689j66009h621C9666
19464a06251a3036j4502j66794M7003C9653d8010b0479A39197d6906k62545A54382
19452C40479e22980B0843a61618j37372H8988b17687G2010K17694c31486J64160
$$ plain form
19442 -167326 3634 -180112 386244 256267 116620 -94194 -239087 -73475 136436 14436
19431 -30933 28819 18246 18754 -28956 -343183 -72416 14401 -83152 84884 101110 258605 -132266
19418 86789 -10722 -195402 219470 363104 147191 -161305 153662 -64954 25234 -156336
19407 -236738 145322 -72625 119134 -31745 -33008 -93325 19037 -146058 156536 45617 169638
19396 169638 -64579 107576 29740 -252134 366224 52362 -65915 -226479 -228036 -308097 110016
19384 197304 -126987 41441 16273 -244400 206794 224553 81668 15774 37716 -120481 178341
19372 -112895 18447 199528 -126328 93743 -140169 -328750 -84450 -81576 35791 48314 191047
19361 191047 -547813 -22768 -156489 -4022 -407026 -165103 18953 15035 -57611 -308666 -66928
$$ packed form
19442a67326C634a80112C86244j29977A16620i4194j44893g3475A36436A4436
19431c0933B8819j0573N08b8956l14227g2416A4401h3152H4884J6226J57495a32266
19418H6789a0722j84680B19470J43634A47191a61305A53662f4954B5234a56336
19407b36738A45322g2625A19134c1745j263o0317A9037a46058A56536D5617J24021
19396A69638f4579A07576B9740b52134C66224E2362f5915j60564j557q0061A10016
19384A97304a26987D1441A6273b44400B06794J7759H1668A5774K1942a20481A78341
19372a12895A8447J81081a26328I3743a40169j88581h4450K874C5791J2523J42733
19361A91047e47813b2768j33721d022m03004a65103A8953l918e7611k51055f6928
$$ plain form
19349 -150115 -91655 -104331 -48227 -246210 129217 -86038 -192279 -84524 120706 -101340
19338 144794 193342 -213115 -87236 -70262 61430 71747 -96781 -158125 -37244 -258966 -230110
19327 -230110 -86229 76297 -93985 -82701 -414771 169413 319050 -199711 -227736 -145045 220596
19315 -59586 -109380 42294 -68195 224214 -159902 -90686 -117172 -57631 -11361 53020 269 148033
19303 148033 -180047 90509 -149480 110266 183340 -108727 -76544 -77244 -213813 -134742 -147013
19292 -147013 -173520 150252 270180 -166868 182642 65439 89140 -276240 -33940 -128802
19282 -128802 -56222 66296 -3593 89778 144953 9043 -105733 -36772 18452 -277987 198181
19270 -86564 -16877 244074 -61319 -209295 118034 181700 121411 12459 245360 194139 -538330
$$ packed form
19349a50115N8460j2676d8227j97983A29217h6038j06241h4524A20706a01340
19338A44794M8548b13115h7236J6974F1430J0317i6781o1344c7244k21722K8856
19327b30110h6229G6297i3985J1284l32070A69413J49637a99711k8025Q2691B20596
19315e9586m9794D2294f8195B24214a59902O9216k6486e7631a1361E3020B69J47764
19303A48033a80047I0509a49480A10266P3074a08727L2183p00j36569P9071j2271
19292a47013k6507A50252J19928a66868A82642F5439K3701b76240c3940r4862
19282a28802e6222F6296c593H9778N5175I043a05733c6772A8452b77987A98181
19270h6564a6877B44074f1319j47976A18034O3666o0289A2459K32901n1221e38330
$$ plain form
19258 -205165 -24297 35787 -142150 277739 -70039 326825 -37861 -123548 -128033 -66749 -191991
19247 -191991 39651 -89894 138536 -309690 -102508 395662 47742 173810 236420 -338935
19236 -31864 170510 -1928 -61820 305238 -71070 86478 248026 -125267 76155 -88995 225312
19224 -33791 30303 76734 -136604 234937 89609 109228 137346 101229 55058 -68977 16344
19212 147473 -197415 -98760 -413725 -11213 -9060 -162317 237886 159697 -331184 138969
19201 -556532 13678 416217 -226511 -92785 -230258 -57026 -89333 223269 -239783 -177734
19191 -177734 113071 -57406 -21261 -140236 295594 -159982 -118649 176385 -341676 40407
19180 67443 -229017 -263493 -274569 -42667 -98303 47652 -380296 -260521 -104776 -407008 37263
$$ packed form
19258b05165b4297C5787a42150B77739g0039C26825c7861q5687m485O1284j25242
19247a91991C9651h9894A38536c09690a02508C95662D7742J26068O2610c38935
19236c1864A70510a928n9892C05238g1070H6478J61548a25267G6155h8995B25312
19224c3791C0303M6431a36604B34937H9609J9619K8118l6117m6171f8977A6344
19212A47473a97415R8655l14965a1213K153j53257B37886p8189c31184A38969
19201e56532A3678M02539b26511i2785j37473e7026l2307B23269b39783O2049
19191a77734A13071e7406b1261j18975B95594a59982M1333A76385c41676D0407
19180F7443b29017l4476j1076d2667n5636D7652c80296J19775a04776l02232C7263
$$ plain form
19168 174852 173473 246198 173950 -152071 -382629 -18758 196221 -36168 -114997 166513 -109070
19156 42865 -129567 -78337 -95099 -85355 -347232 109953 17559 -75710 139541 72114 131793
19145 131793 -97153 -33896 92736 -361092 -254312 -224443 -108342 187276 -143449 -51597
19134 -85482 -105744 -16345 -165777 -114036 -39648 -148605 259181 -77946 84988 12522 -158372
19122 136064 -118674 184218 -403073 26484 -141511 187687 -264586 92406 137729 -112772
19111 -69366 210366 12118 -7689 -469913 89377 -8591 -72243 225322 -56262 100944 -402437
19099 161489 195920 -56922 -39130 109872 136264 80521 91930 -113549 59524 132031 161144
19088 161144 -337962 134944 -103245 -275239 -212801 299508 162691 21754 68250 55535
$$ packed form
19168A74852j379P2725p2248a52071k30558a8758A96221c6168p8829A66513a09070
19156D2865a29567N1230j6762R744k61877A09953A7559g5710A39541o7427N9679
19145A31793i7153c3896I2736c61092J06780K9869a08342A87276a43449e1597
19134h5482k0262a6345j49432N1741c9648j08957B59181g7946H4988A2522a58372
19122A36064a18674A84218d03073B6484a41511A87687b64586I2406M5323a12772
19111f9366B10366A2118g689m62224H9377h591o3652B25322e6262A00944d02437
19099A61489L4431e6922J7792A09872K6392n5743J1409a13549E9524P2507K9113
19088A61144c37962A34944a03245j71994O2438B99508j36817B1754M6496j2715
$$ plain form
19078 55535 -411309 41276 -9456 -76861 -18873 -469097 -84280 -15598 -214701 231764 264157
19067 264157 145991 -87725 -254992 133484 170526 -7919 20533 226182 -268296 -157480
19057 -157480 119072 242073 19389 -142789 194537 -61476 28954 -154635 38029 -294613
19046 -47455 28335 257260 -190171 -54843 396573 -22853 -227109 -14266 -29264 -193625 -157389
19035 -157389 -422512 -207344 155041 -162600 191186 -169378 43390 -258987 29242 182051
19025 182051 -248667 -169080 -129867 -404730 -88228 -237178 86630 -42639 -144667 178556
19014 -71827 89541 702 74158 -50433 248408 29796 -111169 -211305 -86520 65192 -230973
19002 33350 239287 -44918 -62893 -284235 -20188 -208436 -84269 230480 -91034 294738 -277262
$$ packed form
19078E5535d11309D1276i456o7405a8873m50224h4280a5598j99103B31764L2393
19067B64157j18166h7725j67267A33484L7042g919B0533K05649b68296J10816
19057a57480A19072J23001A9389a42789A94537f1476B8954a54635C8029b94613
19046d7455B8335K28925a90171e4843C96573b2853k04256a4266j4998j64361L6236
19035a57389k65123b07344A55041a62600A91186a69378D3390b58987B9242J52809
19025A82051b48667P9587L9213k74863h8228j48950H6630d2639j02028A78556
19014g1827H9541G02P3456e0433B48408B9796a11169j00136h6520F5192b30973
19002C3350K05937d4918j7975k21342b0188j88248h4269B30480i1034B94738b77262
$$ plain form
18990 -60643 347966 218534 -5925 -204630 -286233 -173286 -70984 389238 -40087 -146725 33675
18978 6493 8090 131720 -65438 366926 -304054 94702 -152418 -31862 -234036 25890 170851
18967 170851 -252011 2004 -361116 -445736 -553185 -128955 25008 -98593 20778 -154436 -48010
18955 -22910 -434209 52028 246240 79908 117332 -251269 29847 -115748 -119316 9147 -155494
18943 -130459 -458007 -172925 -16054 -157351 46278 -212474 -96690 -255251 197704 104727
18933 104727 -86547 -217149 213846 204503 99239 10268 44612 154210 -97336 -329797 162414
18921 -5651 -124934 -289366 28787 -290229 5232 53394 -124803 -113892 52266 -291607 -59095
18909 341846 -32701 -145363 200869 -116192 -141160 40184 -281241 276905 448580 -386987
$$ packed form
18990f0643C47966j29432e925j98705q1603J12947g0984C89238d0087j06638C3675
18978F493J597J23630f5438C66926c04054I4702a52418c1862k02174B5890J44961
18967A70851b52011B004c61116q4620j07449a28955B5008i8593B0778a54436d8010
18955b2910m11299E2028J94212G9908L7424b51269B9847a15748l568I147a55494
18943a30459l27548a72925a6054j41297D6278b12474i6690j58561A97704r2977
18933A04727h6547j30602B13846r343I9239A0268L4344J09598i7336k32461A62414
18921e651j19283j64432B8787b90229E232M8162a24803J0911E2266b91607e9095
18909C41846c2701j12662B00869a16192k4968D0184b81241B76905J71675c86987
$$ plain form
18898 -145190 34409 45191 -7485 40193 171661 75798 -80879 253903 130938 -165726 -20111
18886 -52633 -109487 34947 94399 269710 155287 -146226 135464 240276 -41685 -215027
18876 -215027 -114761 72889 -224666 138480 -60969 52860 22050 -273752 13215 -39277 15149
18864 -184444 -281726 -280621 -247885 -176709 6776 -167266 -145991 47332 -216598 171914 -32383
18852 -44120 -171203 -57418 -100946 63899 -68217 -63060 -64933 -204490 99643 326700 -142667
18840 -23424 -179471 260947 -571703 -33719 -324323 -212521 211218 -141407 188667 -48371
18829 330590 -7650 183563 -91009 -88688 98479 234953 238372 -118192 -66585 -158328 130403
18817 -72383 -84771 -164719 -81278 -267347 -274751 -176377 -311 -118151 273397 -25881 -131102
$$ packed form
18898a45190C4409J0782g485D0193J31468G5798h0879B53903j22965a65726b0111
18886e2633n6854C4947N9452J75311j14423a46226A35464J04812d1685j73342
18876b15027J00266G2889b24666A38480f0969E2860B2050b73752A3215c9277A5149
18864a84444r7282J105L2736P1176F776a67266K1275D7332b16598A71914c2383
18852d4120j27083e7418m3528F3899f8217N157j873j39557I9643K27057a42667
18840b3424j56047B60947e71703c3719k90604J11802B11218a41407A88667d8371
18829C30590g650A83563i1009K321I8479J36474L419a18192N1607r1743A30403
18817g2383j2388p9948h1278j86069p404R8374c11j17840B73397b5881j05221
$$ plain form
18806 -131102 -92831 61418 -213450 53904 66628 23474 -52204 7998 -99938 -184412 -81058
18794 -198565 -175346 -30407 -310967 201131 -69836 191300 -58628 -140123 -263739 -79371 257754
18782 -113015 -179524 4053 -84405 -10266 231802 -10602 32738 107804 143007 303046 -134448
18770 175878 -129057 -266695 -73134 234945 77734 50469 121327 74196 -347370 72769 -135558
18758 165707 1206 143619 -178322 -225723 -9807 149137 -198924 -118349 -43067 57877 -172357
18746 -4895 113014 195726 -236091 -66664 36322 -63517 -66918 75259 276886 248240 -66373
18734 -211680 135145 316416 -371556 -133876 103491 -366819 38525 -363910 -21434 35038
18723 107384 -425714 118104 -296581 2718 -284695 56313 235894 -181645 138724 -83642
$$ packed form
18806a31102L8271F1418b13450E3904J2724B3474e2204G998i9938q4474h1058
18794a98565K3219c0407k80560B01131f9836A91300e8628q1495j23616g9371B57754
18782a13015o6509D053h4405a0266B31802a0602C2738P5066L5203J60039a34448
18770A75878a29057j37638g3134B34945G7734k7265P0858m7131c47370G2769a35558
18758A65707A206J42413a78322m7401i807A49137a98924Q0575d3067E7877a72357
18746d895A13014Q2712b36091f6664C6322f3517l401G5259K01627k8646f6373
18734b11680A35145J81271c71556a33876A03491c66819C8525c63910b1434C5038
18723A07384d25714A18104b96581B718b84695E6313J79581a81645A38724h3642
$$ plain form
18712 -122302 -155048 -196806 23192 72901 -223898 -87096 198288 -251959 168920 191033 -121414
18700 -229256 434263 -160082 316110 -37680 -134136 13061 45481 -170711 -111559 6529 -144121
18688 2656 -42742 237005 -45393 140674 -51614 -124653 -320269 -115379 104756 7214 -63506
18676 152413 111553 152134 192847 93653 -177693 158708 121309 -80108 -187300 95966 -68200
18664 232170 201075 -28050 7230 -199776 -31276 258332 147797 92488 -158239 45115 -40208
18652 96462 317583 -372180 -69692 -185138 -128914 4719 110794 -338036 19053 -6508 -102354
18641 -102354 62800 -151061 -257875 -50645 -297964 382918 178743 59762 -78986 196079
18630 -38276 -213931 -128060 -219191 -238625 -15066 139715 -195489 -313128 -364809 -376722 -246077
$$ packed form
18712a22302l2746m1758B3192M9709b23898h7096A98288b51959A68920K2113a21414
18700b29256D34263a60082C16110c7680r6456A3061L2420a70711N9152F529a44121
18688B656d2742B37005d5393A40674e1614p3039j95616a15379A04756G214f3506
18676A52413m0860M0581M0713I3653a77693A58708l7399h0108j07192I5966f8200
18664B32170l1095b8050G230a99776c1276B58332j10535n5309a58239D5115d0208
18652I6462K21121c72180f9692j15446N6224D719J06075c38036A9053f508r5846
18641a02354F2800a51061j06814e0645k47319C82918A78743E9762g8986A96079
18630c8276j75655Q5871r1131j9434a5066A39715a95489j17639n1681j1913J30645
$$ plain form
18619 -246077 -69733 -75994 104241 22671 17536 -198804 -93071 -130862 -152182 225401 -230084
18607 -119068 233439 142141 -208915 -176446 -98713 136054 145958 -100413 -41663 89753 -352361
18595 114500 -2686 -116470 259693 -138979 -331821 -203997 -106350 -82045 -166533 -153918 -102361
18584 -102361 -424431 -197642 182902 -152161 -9246 -272214 -59235 -99380 -65981 1992 -126144
18572 -220651 -314075 133518 -147280 72900 101344 139281 -43781 100903 24954 27591 -33505
18560 -135725 406645 35342 -300325 -49481 -16787 -127222 -84059 312571 -243080 -128295
18550 -128295 -106998 -18879 24109 270614 2895 -233458 -38800 126462 216330 -88057 49381
18538 13917 -126522 19931 36511 -160826 59492 17696 -34174 -182021 -54500 112115 -67543
$$ packed form
18619b46077f9733o261A04241B2671n135a98804i3071l7791k1320B25401b30084
18607a19068B33439r1298b08915L2469P7733A36054R904a00413d1663H9753c52361
18595A14500b686j13784B59693a38979j92842J27824R7647K4305q4488J2615N1557
18584a02361l22070a97642A82902a52161i246k62968e9235m0145L3399A992a26144
18572b20651r3424A33518a47280G2900K8444L7937d3781A00903B4954K637c3505
18560a35725D06645C5342c00325d9481a6787j10435M3163C12571b43080J14785
18550a28295K1297a8879B4109K46505B895b33458c8800A26462Q9868h8057D9381
18538A3917a26522A9931J6580a60826E9492A7696c4174j47847e4500A12115f7543
$$ plain form
18526 207077 38344 79543 181310 -253339 367619 135001 -591785 -109805 -16978 210467
18515 103889 99473 191267 153079 -214331 -90657 -333650 170764 28426 77074 -165679 -363648
18504 -363648 -46283 127368 -394487 -159720 -121498 -49228 300505 -9605 32644 229365 144172
18493 144172 189304 178056 162334 13336 -95672 -70064 23650 -17416 210469 123134 -75958
18481 25369 -30452 279406 -75782 -92018 -80953 -233276 -25572 -282441 -74972 -72527 -31955
18469 -281279 -8028 76258 41252 269310 163104 -62525 76474 -7239 -66067 -93354 -230990
18458 -230990 -18560 -36852 121173 -200792 175567 -216174 -153265 -54665 -160594 217255
18447 111327 282146 30973 -467483 102959 -341335 -321482 -221777 68282 -165360 -236585
$$ packed form
18526B07077C8344M1199J01767b53339C67619A35001e91785a09805a6978B10467
18515A03889m416R1794l8188b14331i0657k42993A70764B8426M8648a65679j97969
18504c63648d6283A27368c94487a59720L8222d9228C00505i605C2644J96721q5193
18493A44172M5132j1248j5722A3336i5672K5608B3650a7416B10469q7335g5958
18481B5369c0452B79406g5782j6236J1065j52323b5572k56869g4972K445c1955
18469b81279h028G6258l5006K28058j06206f2525G6474g239n8828k7287j37636
18458b30990a8560j8292A21173b00792A75567b16174O2909e4665j05929B17255
18447A11327J70819C0973d67483A02959c41335J9853R9705F8282a65360p1225
$$ plain form
18437 -236585 -304406 51129 -20541 -206730 -32515 -74400 83500 -93164 -58394 102304 240653
18426 240653 269220 -35266 123662 144400 -221394 42254 -48633 79492 220544 259079 36728
18414 -147669 21959 -107529 -370736 203994 86651 -55762 175399 -35633 -267355 -177835
18404 -177835 92822 203744 47458 108722 -33811 -82408 184041 -212475 -155083 248695 30913
18392 224719 40545 -121751 -266034 6281 -4485 65919 -10851 -40437 -372721 87746 -60942
18380 24820 -175238 -138075 -156957 -114456 -204203 -417185 -8279 57361 9155 -52823 -23223 -149069
18368 -149069 55236 -89689 -79991 -118692 -167597 -54105 209178 65915 -112153 418 111946
18357 111946 115769 174370 131893 100859 96638 -383158 -4347 -77238 -166651 116974 246944
$$ packed form
18437b36585o7821E1129b0541j86189c2515m1885H3500i3164L4770A02304J38349
18426B40653K8567c5266A23662K0738b21394D2254d8633G9492J41052L8535C6728
18414a47669B1959a07529k63207B03994H6651e5762A75399c5633k31722Q9520
18404a77835I2822J10922D7458O1264c3811m8597A84041b12475N7392B48695C0913
18392B24719D0545a21751j44283F281d485F5919a0851k9586l32284H7746f0942
18380B4820a75238L7163j8882M2501q9747k12982h279E7361I155e2823b3223j25846
18368a49069E5236h9689R698l8701m8905e4105B09178F5915a12153D18J11528
18357A11946L823N8601m2477l1034m221c83158d347p2891q9413A16974J29970
$$ plain form
18346 246944 31310 260449 -160817 -366238 22462 138393 -145224 101187 73103 -50521
18335 -374869 -136294 -173056 69502 -10339 -238813 50459 193869 -97085 151410 -118078
18324 -47075 -181983 -98791 -212454 199582 185684 -251798 -254422 311316 -53859 356887 93374
18312 -55845 -118832 -219224 21365 128683 -132231 -4790 53641 -147554 -103619 -137743 -429695
18301 -429695 3606 274328 -7502 -82687 84287 16119 -125068 -371591 -90882 -169791 4984
18289 -33132 -144194 45922 -39681 -277670 153262 -93368 -12315 -5867 58665 -21889 30054
18277 -219444 -17718 14904 -342989 -478194 -106208 30857 -30784 -251312 81539 -230353
18266 -58528 -17010 27574 215938 65955 209183 -63053 -52026 10081 32829 144367 -120226
$$ packed form
18346B46944C1310K29139a60817k05421B2462J15931a45224A01187k8084e0521
18335c74869a36294l6762F9502a0339k28474E0459J43410i7085A51410a18078
18324d7075j34908Q3192j13663A99582j3898b51798k624C11316e3859C56887I3374
18312e5845o2987j00392B1365J07318a32231d790E3641a47554M3935l4124k91952
18301d29695C606K70722g502p5185H4287A6119a25068k46523i0882p8909D984
18289c3132j11062D5922c9681k37989A53262i3368a2315e867E8665b1889C0054
18277b19444a7718A4904c42989j35205a06208C0857c0784k20528H1539b30353
18266e8528a7010B7574J88364F5955J43228f3053J1027A0081K2748J11538a20226
$$ plain form
18254 -357299 -261129 164488 -372900 257510 -55997 -37259 -23418 -157599 -193288 173440
18243 -216793 -383302 -395237 22367 -176213 167442 -159594 309249 -5904 -41750 56592 -139801
18231 -60366 82361 363872 156170 -211822 128485 41662 27735 -201694 1703 178190 -230463
18219 32062 43149 -98501 66105 195272 -110799 113458 -112446 -53622 -331709 246849
18208 141252 106191 136384 285274 60521 -78687 -18320 66156 144612 228710 -194731 -60319
18196 -138324 26009 15747 -147243 325941 522215 135689 -164283 -79485 -128607 -81375
18186 -81375 82096 140036 151239 45584 21222 117989 -10895 138976 95167 124294 -83462
18174 -36117 -208609 37299 -64682 108698 360596 -376776 -29321 431718 -211076 -16069
$$ packed form
18254c57299R6170A64488c72900B57510e5997J8738J3841j34181l5689A73440
18243b16793j66509j1935B2367a76213A67442a59594C09249e904l5846E6592a39801
18231f0366H2361K81511A56170b11822A28485D1662j3927b01694A703J76487b30463
18219C2062J1087i8501F6105J29167a10799A13458a12446e3622k78087B46849
18208A41252l5061L0193J48890F0521g8687a8320F6156P8456Q4098a94731f0319
18196a38324B6009j0262a47243C25941J96274A35689a64283g9485m9122M7232
18186h1375H2096N7940J1203D5584B1222R6767a0895A38976m3809K9127h3462
18174c6117j72492C7299f4682A08698K51898c76776b9321D31718b11076a6069
$$ plain form
18163 3360 -194776 -192324 -15862 -302598 133669 -48926 324312 -120072 99575 -260278 -39034
18151 211047 82998 130434 -348090 133486 231734 87461 -107910 -247421 246127 119429
18140 -98334 283752 -321972 77423 95478 45958 -160605 -21972 139633 3278 5480 189665
18129 189665 -85893 8563 20999 120955 -146641 297606 -154522 34405 -9953 350186 -168717
18117 -142000 -430 -68662 -272411 -296741 8019 279347 -214754 220693 -45110 -232773 -63008
18105 -73692 334363 -297266 156921 261288 -142934 -248039 -224378 -37290 134573 -61357
18094 35043 365536 115879 -138218 19562 -75033 155087 -154673 207083 -35180 151564
18083 -74022 -423364 61134 -102597 50245 -40207 -143994 -242430 48835 -273515 -86573 -44770
$$ packed form
18163C360a94776K452a5862k86736A33669d8926C24312a20072I9575b60278c9034
18151B11047H2998M7436c48090A33486R8248H7461a07910j39511B46127A19429
18140i8334B83752c21972G7423J8055D5958a60605b1972A39633C278K202J84185
18129A89665h5893H563J2436R9956a46641B97606a54522C4405i953C50186a68717
18117a42000d30o8232k03749k4330H019K71328b14754B20693d5110j87663f3008
18105g3692C34363b97266A56921J04367a42934j05105K3661c7290A34573f1357
18094C5043L30493A15879a38218A9562g5033A55087a54673B07083c5180A51564
18083g4022l49342F1134a02597E0245d0207j03787r8436D8835b73515h6573M1803
$$ plain form
18072 -44770 -216204 -262583 -360887 -194031 339471 -407523 -216811 -23357 -162706 -221060
18062 -221060 173656 350245 165906 -160398 -17850 145522 40893 -114488 -202335 -97878
18051 193081 135249 -69078 -201392 58934 247525 -6188 -182514 78684 -145679 -10621 -135003
18040 -135003 -99900 78642 -121900 116833 433653 63308 -39767 -25374 -145558 66116 -122884
18028 241875 164553 -25271 -312138 -222999 -204485 158494 119244 -102632 -100002 -127051 287573
18016 281103 144189 359572 -110672 -55832 -77269 -146677 -267600 -183177 -265789 -70022 2397
18004 132349 -235817 91785 -151582 -65 31697 -93455 -54119 -6596 -112413 143234 206897
17993 206897 -212610 -75813 -73873 238930 -162423 -175673 -204206 -462582 -18879 -43447 -77057
$$ packed form
18072d4770j71434m6379r8304J66856C39471d07523J90712b3357j39349n8354
18062b21060A73656J76589A65906a60398a7850A45522D0893a14488q7847i7878
18051A93081n7832f9078j32314E8934J88591f188j76326G8684a45679a0621j24382
18040a35003L5103G8642a21900A16833L16820F3308c9767J4393j20184F6116a22884
18028B41875p7322b5271k86867Q9139J8514A58494l9250a02632K630k7049B87573
18016B81103j36914K15383a10672N4840k1437o9408j20923Q4423q2612g0022B397
18004A32349b35817I1785a51582f5C1697i3455L9336f596j05817A43234O3663
17993B06897b12610g5813J940B38930a62423j3250k8533k58376a8879k4568l3610
$$ plain form
17982 -77057 -56231 -59499 165317 31914 132463 -125470 324014 379679 -391366 114649 -37741
17970 25877 -189822 39325 -4047 373466 -130576 130772 -12742 172286 -20304 -234494 43188
17958 -68167 139448 -111011 94689 82635 -38827 -88536 -190142 232141 141518 104777 -111098
17946 69812 -156533 8516 273420 -406825 -129310 75 259386 330619 174529 285365 228707
17935 228707 -148966 -172559 -294626 151791 1657 22808 3422 181521 -285130 -87094 133923
17923 -137108 243833 113604 -329833 95856 130184 -311184 -5357 118472 249729 16103
17912 -217873 263918 -82103 -120511 83080 -72177 -3759 224044 125370 -45064 -168535 -202979
17901 -202979 -60463 -100396 163226 -42832 -259660 -247779 -11053 -291632 74510 -216963 -141737
$$ packed form
17982g7057K0826l268A65317C1914J00549a25470C24014N5665c91366A14649c7741
17970B5877a89822C9325d047C73466a30576A30772a2742A72286b0304k14190D3188
17958f8167A39448a11011I4689j2054c8827m9709j01606B32141r0623l6741a11098
17946F9812a56533H516K64904d06825a29310G5K59311P1233j56090J10836n6658
17935B28707a48966k3593j22067A51791A657K1151C422J78099b85130h7094A33923
17923a37108B43833A13604c29833I5856L4328c11184e357A18472J31257A6103
17912b17873B63918h2103l8408H3080g2177c759B24044r8674d5064j23471l4444
17901b02979f0463l9933A63226d2832k16828J1881a1053k80579G4510b16963P5226
$$ plain form
17890 -141737 122344 -37427 -110631 98604 -393570 -199979 311677 211125 74223 -10235
17879 -298172 -58956 87465 -265113 177419 -105771 27108 -74697 -357293 48694 250384
17869 250384 -58398 -205607 94334 330839 46881 -32334 120761 72874 343967 30468 516837
17858 516837 -306818 23553 62185 58144 412461 123342 168285 -54810 340375 2130 395026
17847 395026 167313 229518 207582 167059 -37861 89577 -112740 -277998 91460 134890 -10924
17835 -93521 -89190 -182075 29582 43738 -68008 126892 -14071 211050 161680 -14245 352192
17823 18447 58645 447174 122080 -42434 -94862 78287 -230663 285832 -50160 -197235 -36260
17811 -105200 64327 262299 -11531 -184682 -265971 -170619 108471 481994 26430 39825 -216378
$$ packed form
17890a41737A22344c7427p3204I8604c93570J93591C11677j00552G4223a0235
17879b98172e8956H7465b65113A77419a05771B7108g4697k82596D8694K01690
17869B50384e8398j47209I4334K36505D6881c2334A20761m7887K71093C0468M86369
17858E16837c06818B3553L8632m041L54317A23342M4943e4810C40375B130L92896
17847C95026A67313O2205k1936m0523c7861H9577a12740j65258I1460M3430a0924
17835i3521M331r2885B9582J4156f8008A26892a4071B11050m9370a4245C52192
17823A8447M0198L88529A22080d2434n2428G8287b30663B85832e0160j47075c6260
17811a05200F4327J97972a1531j73151q1289R5352A08471L73523B6430J3395b16378
$$ plain form
17799 182635 175384 -63597 -167077 -178609 59333 107322 142230 -237950 68526 200959 -101969
17787 365221 -166635 77764 4374 -9831 54534 -161567 72401 -61690 -76865 -68896 -19200 80662
17774 -33549 -135856 -58170 -254279 -102067 -97264 30737 -60984 -128532 145331 -19162 -546740
17763 -546740 235991 35745 7879 -68562 142639 -35821 9029 169125 207214 -3079 99937
17751 -113164 -4784 -167403 -63864 -303042 -34645 -8001 -243925 -55020 -121174 -103149 -246558
17740 -246558 -145286 -163336 68291 170537 -138592 286389 345000 -129826 -54750 56113
17729 -117510 176277 46151 -153450 -53398 -476988 16579 233927 -155316 291014 -4879
17718 192035 -58402 182855 22844 228676 302253 -129638 -255192 350568 -233126 17565
$$ packed form
17799A82635p251f3597j03480j1532E9333M7989L4908b37950F8526J32433a01969
17787C65221a66635G7764D374i831E4534a61567G2401f1690j5175P969a9200H0662
17774c3549j02307e8170j96109a02067M803C0737f0984o7548A45331a9162n27578
17763e46740B35991C5745G879f8562A42639c5821I029J60096L8089c079I9937
17751a13164d784j62619f3864k39178c4645h001k35924e5020o6154J8025j43409
17740b46558J01272j8050F8291J02246a38592B86389N8611a29826e4750E6113
17729a17510A76277D6151a53450e3398m23590A6579K17348a55316B91014d879
17718A92035e8402A82855B2844K05832P3577a29638j25554C50568b33126A7565
$$ plain form
17707 130184 -156993 80017 227388 38671 -205816 -273848 110205 187644 181821 -170652 -11968
17695 111704 620 -249441 -151059 1160 36600 25206 -41960 443429 -141061 302687 28396
17683 21064 93781 127676 103718 223062 -49773 -267852 -135225 75786 170901 -31585 -128538
17672 -128538 160923 293438 -77928 -208054 43752 55368 -93821 -43924 -72910 362710 251538
17661 251538 332685 -47779 239122 -420694 -161508 -111574 40055 389650 -335794 -235478
17651 -235478 2982 260164 193332 231763 -60238 42994 35180 221464 -29497 145743 40601
17639 58318 256181 298070 45086 171008 -77262 -100534 193315 -175412 -18864 -332793 -66330
17627 65321 -44892 90774 -236123 194740 42440 -113086 -172923 -69324 8573 411885 -42336
$$ packed form
17707A30184a56993H0017J47371C8671b05816o8032A10205P7439n823a70652a1968
17695A11704F20b49441R8382A160L5440j1394d1960D43429a41061C02687B8396
17683B1064P2717L3895k3958J19344d9773k18079J32627G5786R5115c1585r6953
17672a28538A60923J32515g7928j30126D3752J1616i3821d3924k8986C62710j11172
17661B51538Q1147d7779B39122d20694a61508M9934D0055L49595c35794J00316
17651b35478B982K57182o6832L8431f0238D2994p814J86284b9497A45743D0601
17639E8318J97863M1889D5086J25922g7262k3272A93315a75412a8864l13929f6330
17627F5321d4892I0774b36123A94740D2440a13086n9837f9324H573M03312d2336
$$ plain form
17615 -24791 -224930 298512 -69186 -30753 -80338 121092 257622 -188594 143341 -158460
17604 -13780 281873 289545 319444 -159874 -37484 -214597 219837 45088 172655 283297 390087
17593 390087 163446 101519 2991 -25426 -34078 79710 -131954 246796 220562 -73205 310190
17581 6795 -131410 71903 -209911 -108254 14617 6213 -6967 -124109 -48686 276470 -257441
17569 243324 -145436 -117946 210513 -76340 -44290 254411 33185 142489 247408 50910
17558 -237587 303774 153396 17834 299851 81054 -315551 -85718 92883 -121227 99892
17547 489147 93819 153695 69418 84473 29456 140903 -190986 -74505 459535 301813 102281
17535 206762 63199 160985 449113 42647 233454 57095 425743 184940 235486 8222 -127345
$$ packed form
17615b4791k00139B98512f9186c0753m9585A21092J36530a88594A43341a58460
17604a3780B81873P672K9899a59874c7484j77113B19837D5088J27567J10642J06790
17593C90087A63446o1927B991b5426q652G9710a31954B46796k6234g3205C10190
17581F795a31410G1903b09911J01657A4617F213f967j17142d8686B76470b57441
17569B43324a45436K7490B10513g6340L2050B54411C3185J09304J04919E0910
17558b37587C03774j50378A7834K82017H1054c15551h5718I2883a21227I9892
17547D89147I3819N9876F9418J5055B9456J11447a90986g4505D59535j57722A02281
17535B06762F3199R7786K88128D2647J90807E7095L68648A84940N0546H222a27345
$$ plain form
17523 -33984 126206 208005 -48381 156917 55946 -33167 -131774 246790 -187135 19534 160640
17512 160640 32933 -174908 111774 23605 345906 27598 -79464 -108103 -180127 369744 31056
17500 71838 330619 297385 291995 2342 -164203 29257 122598 110015 100152 -89032 -177396 15087
17487 -97656 -58951 235792 133615 309243 43127 1493 193696 301705 48479 155956 -180876
17475 109403 148982 170521 -97917 38183 23832 136623 130733 76552 43769 387415 255481
17464 255481 185440 302215 43096 -274847 -111604 264078 197983 117961 60701 202226
17454 202226 120964 -76048 209562 154883 109259 51788 -100401 240744 292361 177659 83863
17442 427313 410455 11897 167032 323857 -47703 104015 119113 67019 305947 -208070
$$ packed form
17523c3984A26206Q1799d8381A56917E5946c3167r8607B46790a87135A9534J41106
17512A60640C2933a74908A11774B3605L22301B7598g9464k8639p2024C69744C1056
17500G1838K58781l3234n390B342a64203B9257R3341j2583r863h9032q8364A5087
17487i7656L8705B35792j02177J75628D3127A493J92203J08009D8479J07477a80876
17475A09403L9579K1539i7917C8183j4351J12791n890n4181l2783L43646j31934
17464B55481p0041J16775D3096b74847a11604B64078o6095q0022n7260J41525
17454B02226q1262g6048B09562n4679m5624E1788a00401B40744N1617j14702H3863
17442D27313j6858A1897J55135J56825d7703A04015J5098n2094K38928b08070
$$ plain form
17431 294750 239483 -21031 -66695 81143 -195722 33306 174406 83579 179413 -23164 53418
17419 265259 101931 -4567 259596 244680 -607 201000 310468 157712 458663 158996 56801
17407 272727 159295 -53683 -341221 35673 -129262 -209326 133634 270514 136333 34750
17396 151649 -216744 139419 -196753 -14774 -130909 304099 62360 243581 -170618 -214243
17386 -214243 108474 393696 293282 409432 -176277 489934 114763 95062 150885 146865
17376 146865 398944 200101 -83974 41428 332320 -90499 -104118 145058 185561 383196
17366 383196 129090 -166540 34939 71692 26449 79072 -123463 52410 -37693 -104119 181229
17354 -53722 106637 203815 218975 90494 342591 30659 63045 315860 184241 324154 449019
$$ packed form
17431B94750n5267b1031m5664H1143a95722C3306J41100H3579R5834b3164E3418
17419B65259A01931d567B59596j4916f07B01000J09468j52756L00951A58996E6801
17407B72727j13432e3683k87538C5673a29262q0064A33634J36880j34181C4750
17396A51649b16744A39419a96753a4774j16135C04099F2360J81221a70618m3625
17386b14243A08474K85222j00414J16150a76277D89934A14763j9701N5823m020
17376A46865K52079j98843h3974D1428K90892i0499j3619A45058M0503J97635
17366C83196A29090a66540C4939L6753B6449N2623a23463E2410c7693o6426A81229
17354e3722A06637R7178J5160I0494K52097C0659L2386K52815j31619J39913J24865
$$ plain form
17343 449019 -354190 -71017 92028 -187435 244937 58594 206016 156924 92147 240694
17333 240694 -43275 76569 22632 606829 279512 77072 -15171 104712 -12040 138672 143705
17322 143705 314096 -31298 34987 389222 92321 313492 226973 17063 136536 17901 -103171
17310 312713 -96828 207074 101898 -95553 164248 206135 -63779 338012 -153560 174354
17299 34568 2161 256608 133768 63869 150138 -7390 -17971 -52216 69948 411085 107775
17287 -143163 38003 125553 220151 -322518 158059 -195189 293074 163981 -17985 346222
17276 204750 -10100 82814 -65000 161061 188279 659650 70597 -1400 -114522 183070 -280598
17264 -93947 219194 242103 433252 -52016 140798 75414 177448 346805 -9075 204278 178825
$$ packed form
17343D49019c54190g1017I2028a87435B44937E8594J47422m9092o4777J48547
17333B40694d3275G6569B2632N84197B79512G7072a5171A04712a2040A38672N033
17322A43705J70391c1298C4987L54235I2321K21171q6519A7063J19473A7901a03171
17310C12713i6828B07074A01898i5553A64248M1887f3779C38012a53560A74354
17299C4568B161K54447j22840F3869Q6269g390j0581l4245F9948L41137A07775
17287a43163C8003Q7550R4598c22518A58059a95189B93074j29093a7985C46222
17276B04750a0100H2814f5000A61061K7218M71371G0597a400j13122A83070b80598
17264i3947B19194K2909J91149e2016A40798o5384J02034J69357i075B04278k5453
$$ plain form
17253 178825 459515 116515 63796 201018 457505 96825 -20919 276133 52402 118245
17243 118245 453787 149098 -265368 -31847 210715 235912 102455 109252 333831 269142
17233 269142 112877 270011 249487 358563 231482 40378 102939 -131071 77766 91630
17223 91630 451222 118022 259490 329547 314628 218637 146223 101032 -72349 1602 -91300
17211 461007 286153 -19797 155307 190581 201023 387046 183015 266408 141996 408722
17201 408722 249927 188788 227689 218456 550243 -127124 -79030 259841 227861 578486 286837
17189 200918 115573 335536 -174874 676 385443 289803 -192579 75253 -53586 -46542 750725
17177 413302 296151 132070 -30056 105104 12290 121855 202623 229722 226409 427648 272571
$$ packed form
17253A78825K80690A16515n2719J37222K56487I6825b0919B76133E2402O5843
17243A18245L35542A49098b65368c1847B10715K5197A02455O797K24579o4689
17233B69142A12877J57134k0524J09076j27081D0378O2561a31071G7766J3864
17223I1630L59592A18022J41468P0057j4919r5991p2414m5191g2349A602i1300
17211D61007j74854a9797A55307L5274J0442J86023A83015Q3393j24412K66726
17201D08722j58795o1139L8901r233L31787a27124M8094B59841l1980L50625B86837
17189B00918q5345K19963a74874F76L84767r5640a92579G5253e3586P044G50725
17177D13302j17151A32070c0056A05104A2290J09565Q0768K7099l313K01239j55077
$$ plain form
17166 272571 283187 234600 85287 347401 173188 346428 449762 397276 293035 156945
17156 156945 250625 -66023 250471 221153 37698 197499 535884 -18232 182211 123444 339151
17145 339151 275971 200690 -155098 428879 253744 136640 377739 460777 420643 421500 114813
17133 704176 93191 397138 271271 564125 299304 447447 277073 321003 346680 513898
17123 513898 407856 142327 513839 362659 253842 610890 228127 194945 312987 127299
17112 354755 183719 76323 269965 460528 596572 204426 458527 274646 422607 442240
17102 442240 380629 355370 205236 282623 245193 214218 410633 323340 378186 694347 530110
17091 530110 12556 223599 268875 174926 73294 417626 107605 43685 230591 138826 337373
$$ packed form
17166B72571J0616m8587H5287K62114A73188J73240J03334n2486j04241j36090
17156A56945R3680f6023B50471k9318C7698J59801L38385a8232A82211n8767K15707
17145C39151o3180p5281a55098D28879j75135j17104K41099Q3038m0134Q57A14813
17133G04176I3191L03947j25867K92854k64821J48143j70374M3930K5677J67218
17123E13898j06042A42327L71512j51180j08817L57048B28127l3182J18042A27299
17112C54755j71036G6323J93642J90563J36044B04426K54101j83881J47961J9633
17102D42240o1611k5259j50134P7387l7430l0975J96415q7293N4846L16161j64237
17091E30110A2556K11043M5276r3949G3294L44332A07605D3685J86906r1765J98547
$$ plain form
17080 337373 506365 257246 121433 318793 362468 231340 508706 362339 519116 157635
17069 383396 304639 443302 330747 61963 216427 -49228 298966 272916 377082 288483
17059 288483 329674 678557 581173 188623 653092 481353 351336 234916 219979 213420
17049 213420 525290 673713 390998 373871 194437 91522 592856 590663 185752 416269
17039 416269 382776 476264 622181 81105 432714 667026 302814 532840 409343 407290
17029 407290 438058 147909 534443 455157 585952 358952 463704 487859 494344 524394 398784
17018 398784 442600 552797 147800 705805 611685 336203 472562 474917 384198 417205 420379
17007 420379 503781 436942 447511 647082 788603 192796 498492 392781 711809 663706
$$ packed form
17080C37373J68992k49119A21433J97360M3675j31128K77366j46367J56777A57635
17069C83396p8757J38663j12555F1963J54464d9228B98966k6050J04166q8599
17059B88483M1191L48883r7384A88623M64469j71739j30017j16420j4937o559
17049B13420L11870J48423k82715j7127j79434I1522N01334k193A85752K30517
17039D16269l3493R3488J45917H1105L51609K34312C02814K30026j23497k053
17029D07290L0768A47909L86534p9286J30795k27000J04752K4155O485L0050j25610
17018C98784M3816J10197A47800N58005r4120k75482J36359K355r0719L3007L174
17007D20379Q3402o6839J0569J99571J41521A92796L05696j05711L19028m8103
$$ plain form
16997 663706 601794 693196 715874 992460 485282 536695 565700 327310 647027 711218 766985
16986 766985 436713 638035 504087 367210 520705 348611 649840 526788 730812 697364
16976 697364 837245 774973 768852 729892 685656 562921 956332 941628 712824 694114 352773
16965 352773 496169 840048 464227 758355 592497 743883 707029 498472 437113 1020042
16955 1020042 651901 761441 787817 864712 271331 740959 558917 880956 643365 661439
16945 661439 836402 762366 782368 674113 834945 578887 1230896 897917 666601 862857
16935 862857 1068082 684038 779209 840413 503023 461596 886354 891161 489803 817063
16925 817063 1084380 469444 889379 920712 781644 871764 1097779 979645 790190 1185279
$$ packed form
16997F63706o1912R1402K2678K76586D85282N1413K9005k38390L19717O4191N5767
16986G66985l30272K01322j33948j36877J53495j72094L01229j23052K04024l3448
16976F97364J39881o2272o121l8960m4236j22735L93411j4704k28804j8710l41341
16965C52773J43396L43879l75821K94128j65858J51386l6854k08557o1359N82929
16955A020042l68141J09540K6376P6895B71331M69628j82042L22039k37591J8074
16945F61439J74963p4036K0002j08255J60832k56058O52009l32979k31316J96256
16935H62857K05225l84044R5171O1204l37390m1427M24758M807m01358L27260
16925H17063K67317D69444M19935L1333j39068R0120K26015j18134j89455L95089
$$ plain form
16915 1185279 1003871 955851 1149192 1414833 977521 1094478 669279 950264 1175113 1327181
16905 1327181 1418713 1254544 1043371 1046819 1478568 1295730 1110548 1162866 1476306 972630
16895 972630 1279627 1141832 1498971 1345971 1396193 1078829 964799 1613817 1392195 1383411
16885 1383411 1221284 1483583 1149264 1578647 1234325 1518814 1655238 1245685 1567541
16876 1567541 1372451 1392371 1634339 1409408 1593482 1271007 1366158 1718064 1567837 1718205
16866 1718205 1797996 1645419 1783796 1694527 1780667 2195581 1773589 1899289 1759810 1802118
16856 1802118 1805048 2060191 1952710 1924110 2107344 1984620 1988646 1971498 2513575 2072488
16846 2072488 2078531 2282645 2131577 2735416 2318713 2214318 2075782 2299577 2610301 2451541
$$ packed form
16915A185279j81408m8020J93341K65641m37312J16957m25199K80985K24849J52068
16905A327181R1532j64169k11173L448M31749j82838j85182N2318L13440n03676
16895I72630L06997j37795L57139j53000N0222l17364j14030O49018k21622q784
16885A383411j62127K62299l34319M29383l44322K84489J36424m09553L21856
16876A567541j95090J9920K41968k24931J84074l22475R5151L51906j50227J50368
16866A718205P9791j52577J38377q9269Q6140M14914m21992J25700j39479M2308
16856A802118K930K55143j07481k8600J83234j22724M026j7148N42077m41087
16846B072488O043K04114j51068O03839m16703j04395j38536K23795L10724j58760
$$ plain form
16836 2451541 2311374 2705948 2496771 2730017 3085840 3133815 2993715 3255225 2853414 2804731
16826 2804731 3192449 3145075 2938276 2849095 3292694 3235953 3268036 3110726 3548717 3581669
16816 3581669 3417211 3806928 3878155 3891553 3974143 4024836 4274573 4070000 4388462 4345535
16806 4345535 4148989 4573099 4867938 4733675 4713839 5030034 5176230 5372857 5627387 5406747
16796 5406747 5569884 5854767 5787543 6169236 6388057 6036616 6489845 6602373 6652907 6665630
16786 6665630 6997173 7752823 7708486 7897115 7972134 8647963 8815973 8735961 8970707 9493284
16776 9493284 9681363 10349585 10315944 10738401 10930857 11390818 11507322 11872843 12576719 12881502
16766 12881502 13291041 13945301 14555443 15053226 15643443 15735058 16693451 17097484 17931214
$$ packed form
16836B451541j40167L94574k09177K33246L55823M7975j40100K61510m01811m8683
16826B804731L87718m7374k06799q9181M43599n6741L2083j57310M37991L2952
16816C581669j64458L89717P1227J3398Q2590N0693K49737k04573L18462m2927
16806D345535j96546M24110K94839j34263j9836L16195J46196J96627K54530k20640
16796E406747J63137K84883o7224L81693K18821l51441M53229J12528N0534J2723
16786F665630L31543P55650m4337J88629P5019O75829J68010q0012K34746N22577
16776I493284J88079O68222l3641M22457J92456M59961J16504L65521P03876L04783
16766A2881502M09539O54260O10142M97783N90217R1615R58393M04033Q33730
$$ plain form
16757 17931214 18443822 19599303 20054162 20927337 22008175 22904272 23967324 24534422 25820684
16748 25820684 26962543 28375476 29453777 30878247 32544424 33845493 35817898 37943305
16740 37943305 39516559 41637149 43783466 46260106 48335814 51226131 53912243 56770886
16732 56770886 59922005 63642025 67069324 71348207 75078453 79527362 84294117 89071065
16724 89071065 94516484 99911345 105738629 111918235 118067738 124786940 131650040 138545269
16716 138545269 145515219 152354725 159468139 166277652 172878453 179079463 184513880 189643728
16708 189643728 193531468 196939034 199359469 200609896 200534928 199566362 197932635 195208625
16700 195208625 190852813 186890092 181456014 175944454 169770345 163165865 156876338 150267423
$$ packed form
16757A7931214N12608J155481M54859Q73175J080838Q96097J063052N67098J286262
16748B5820684J141859J412933J078301J424470J666177J301069J972405K125407
16740C7943305J573254K120590K146317K476640K075708K890317K686112K858643
16732E6770886L151119L720020L427299M278883L730246M448909M766755M776948
16724H9071065N445419N394861N827284O179606O149503O719202O863100O895229
16716A38545269O969950O839506P113414O809513O600801O201010N434417N129848
16708A89643728L887740L407566K420435J250427p4968r68566j633727k724010
16700A95208625m355812l962721n434078n511560o174109o604480o289527o608915
$$ plain form
16692 150267423 143242559 136672949 130185089 123650377 118024469 112218942 106642801 101022208
16684 101022208 95997516 90952711 86542750 82380834 78372759 74612597 70821372 67335711
16676 67335711 64461668 60962884 58449441 55878759 53239569 50943212 48995570 46919083
16668 46919083 44682184 42842323 41309932 39476886 38094492 36401658 35036910 33561937
16660 33561937 32274031 31151024 30131648 28800228 27919823 27052605 25928616 25098020
16652 25098020 23699471 23208238 22212057 21644582 20442025 20136172 19305899 18993933 18438406
16643 18438406 17622931 16997047 16476949 15753721 15501415 15360354 14437002 14292556 13739166
16634 13739166 12933790 12434510 12449781 12158184 11457112 11016340 11013857 10996987 10262200 9770681
$$ packed form
16692A50267423p024864o569610o487860o534712n625908n805527n576141n620593
16684A01022208n024692n044805m409961m161916m008075l760162l791225l485661
16676F7335711k874043l498784k513443k570682k639190k296357j947642k076487
16668D6919083k236899j839861j532391j833046j382394j692834j364748j474973
16660C3561937j287906j123007j019376j331420q80405q67218j123989q30596
16652B5098020j398549m91233r96181n67475j202557l05853q30273l11966n55527
16643A8438406q15475o25884n20098p23228k52306j41061r23352j44446n53390
16634A3739166q05376m99280J5271k91597p01072m40772k483j6870p34787m91519
$$ plain form
16624 9770681 9369249 9325571 8878559 9072426 8486696 8037829 7767125 7767480 7555559 7000273
16614 7000273 6967438 7257197 6581152 6460888 6311152 6222980 5715442 5489948 5496723 5394691
16604 5394691 5012205 5429616 4729639 4779859 4631628 4382775 4236120 4321383 4346285 4344213
16594 4344213 3717785 3631562 3536485 3615069 3502752 3402294 3461638 2938954 3192938 3448222
16584 3448222 2885640 2900392 3200258 2690659 2653422 2567447 2593991 2554253 2183798 2177715 2207124
16573 2207124 2191866 2179463 2009174 1764431 2198253 2036904 2053810 1851050 1644247 1670011
16563 1670011 1909036 1619294 1457745 1471559 1392111 1092471 1735381 1459159 1273596 1518921
16553 1518921 1245427 1061269 1131436 1221993 1138359 1461390 1258499 1040842 967020 1074967
$$ packed form
16624I770681m01432m3678m47012J93867n85730m48867k70704L55k11921n55286
16614G000273l2835K89759o76045j20264j49736q8172n07538k25494O775j02032
16604E394691l82486M17411o99977N0220j48231k48853j46655Q5263K4902k072
16594D344213o26428q6223r5077P8584j12317j00458N9344n22684K53984K55284
16584C448222n62582J4752K99866n09599l7237q5975K6544l9738l70455o083K9409
16573B207124j5258j2403j70289k44743M33822j61349J6906k02760k06803K5764
16563A670011K39025k89742j61549J3814p9448k99640O42910k76222j85563K45325
16553A518921k73494j84158P0167R0557q3634L23031k02891k17657p3822J07947
$$ plain form
16543 1074967 1060564 927474 1032076 1043644 1179668 660302 1171358 836231 800463 739049
16533 739049 902339 756176 779267 589012 946059 1049800 630047 569331 710334 418051
16523 418051 796929 573244 338064 801068 646216 524657 537214 791010 621594 587660
16513 587660 434914 797867 430530 556763 731920 461094 389978 333935 727103 630883
16503 630883 537323 412812 375328 760522 161046 184212 116049 282842 699728 481864
16493 481864 389878 272084 266145 384518 99832 199165 609887 331049 769 332467 538465
16482 538465 541300 160788 239235 203360 154366 617508 81617 70912 335278 27435 361453
16471 361453 231826 321012 313915 293895 209699 2032 656335 -208143 113283 433282 71961
$$ packed form
16543A074967j4403j33090J04602J1568J36024n19366N11056l35127l5768o1414
16533G39049J63290j46163K3091j90255L57047J03741m19753o0716J41003k92283
16523D18051L78878k23685k35180M63004j54852j21559J2557K53796j69416l3934
16513E87660j52746L62953l67337J26233J75157k70826p1116n6043L93168r6220
16503F30883r3560j24511l7484L85194A61046K3166o8163J66793M16886k17864
16493D81864r1986j17794n939J18373I9832R9333M10722k78838G69L31698K05998
16482E38465K835A60788P8447l5875m8994M63142H1617j0705K64366B7435L34018
16471C61453j29627Q9186p097k0020q4196B032O54303b08143A13283L19999G1961
$$ plain form
16459 340282 -72551 -236996 533010 358494 114706 -55299 197772 306895 61798 -51359
16448 87771 48570 110407 -76546 275558 492898 -93970 228093 -16557 237926 143571 -231537
16436 -135558 55883 242686 -45671 124420 423532 -109026 104307 470494 226832 2252
16425 147843 78664 -298423 133431 68070 188492 280300 121486 49329 -33981 220175
16414 -85628 258678 -67992 82230 53505 -84287 -147957 -138054 173694 145291 79039 199675
16403 199675 181608 221153 298394 33135 217716 221296 153637 -10606 117618 167727 -15118
16391 189829 97919 174756 103818 -96976 -88517 -271407 261115 249115 162619 -61336 101528
16379 218770 -46300 199625 97296 514802 121865 55921 168932 88962 -116767 -62252
$$ packed form
16459C40282g2551j64445E33010j74516A14706e5299A97772J09123F1798e1359
16448H7771l9201O1837g6546B75558K17340i3970B28093a6557B37926r4355b31537
16436a35558E5883J86803d5671A24420K99112a09026A04307L66187B26832B252
16425A47843o9179b98423A33431o5361J20422R1808A21486D9329c3981B20175
16414h5628B58678f7992H2230k8725h4287o3670R903A73694k8403o6252J20636
16403A99675j8067L9545P7241C3135J84581L580o7659a0606A17618N0109a5118
16391A89829r1910P6837p0938i6976Q459j82890B61115j2000q6496f1336A01528
16379B18770d6300A99625I7296M17506A21865E5921J13011p9970a16767N4515
$$ plain form
16369 -62252 263947 187605 -141278 15160 87007 -50564 -278971 140837 -25303 -122079 -61787
16358 -61787 143399 47203 26046 -110357 151443 -147112 -170778 -25049 -11815 36102 77579
16347 77579 -15843 -27344 104333 41293 250538 89915 33338 160355 33801 -6015 407641
16335 127148 47792 -132978 229034 34326 115583 -34157 101598 -50991 316453 -4206 -316971
16324 -316971 51795 62734 -78285 18628 -20015 101239 281552 -106735 3091 -206918 46574
16312 -53017 76784 302302 35659 -155001 207157 -608723 41210 154117 -85069 -144544 312782
16300 226206 32362 35453 320432 199101 60619 277715 -108347 -54741 62835 -249110 42078
16288 -102492 188141 250197 58171 211291 97164 60268 86565 -145270 143057 -130889
$$ packed form
16369f2252B63947p6342a41278A5160P1847e0564k28407A40837b5303r6776O0292
16358f1787A43399D7203k1157a10357A51443a47112k3666b5049a1815C6102M1477
16347G7579a5843j1501A04333D1293K09245H9915C3338J27017C3801f015D07641
16335A27148D7792a32978B29034C4326Q1257c4157A01598e0991C16453d206l12765
16324c16971E1795J0939g8285A8628b0015A01239J80313a06735C091b06918D6574
16312e3017G6784K25518C5659a55001B07157f08723D1210J12907h5069n9475C12782
16300B26206C2362L091K84979j21331F0619K17096a08347N3606F2835b49110D2078
16288a02492A88141O2056E8171J53120I7164l6896K6297a45270A43057a30889
$$ plain form
16277 -132928 118457 -150805 -19888 273742 272174 15229 -165139 208589 285908 -147671
16266 378226 33254 496281 -26130 18249 -161576 415105 352628 6748 325840 25015 234404
16255 234404 155954 379822 234210 216036 237549 232898 317881 489492 403581 191135 221861
16244 221861 -257323 27895 704097 490419 509601 375369 468134 786732 698799 813970
16234 813970 1070371 726668 760399 971846 904692 909278 1397915 1056374 1018249 1341720
16224 1341720 1026945 1235000 1116277 1052074 963720 1432383 1287657 1028099 1294194 1072664
16214 1072664 1429112 1095579 937725 1089221 1056746 932220 789859 719454 674461 966599
16204 966599 850696 611556 443092 292962 536140 593779 571044 438361 331652 70255
$$ packed form
16277a32928A18457a50805a9888B73742j568A5229a65139B08589P7319a47671
16266C78226C3254M63027b6130A8249a61576D15105o2477F748L19092B5015K09389
16255B34404p8450K23868j45612j8174K1513m651Q4983J71611q5911A91135L0726
16244B21861b57323B7895O76202k13678J9182j34232R2765L18598q7933J15171
16234H13970K56401l43703L3731K11447o7154M586M88637l41541l8125L23471
16224A341720l14775K08055j18723o4203q8354M68663j44726k59558K66095k21530
16214A072664L56448l33533j57854J51496l2475j24526j42361p0405m4993K92138
16204I66599j15903k39140j68464j50130K43178N7639k2735j32683j06709G0255
$$ plain form
16193 520254 410765 539880 253651 393478 105731 64179 84668 243698 803154 10670
16182 -37952 247854 315160 -79706 187210 250515 -157205 157874 98455 183992 152077 -52731
16170 149413 179063 -96798 -54107 -146940 85532 158680 173351 35123 226764 -29672 -195802
16159 -195802 306462 -5128 -39129 -33239 -221294 -34265 -25314 -65830 33454 -157828 -284697
16148 -284697 193048 -10392 52234 -276715 84982 55807 -177902 223806 -10108 -50819 -193530
16137 -193530 5055 12565 77 -88687 -156935 -71223 -211487 -103075 93980 -421373 86839 -64765
16124 -176533 -171573 -28942 180508 -254854 -18398 22756 24805 -330301 75644 -67967 -32746
16112 -123279 211016 57299 -64848 -130704 -64919 180976 -82503 27570 -184565 -180970 139363
$$ packed form
16193E20254j09489J29115B53651J39827A05731m1552K0489J59030N59456A0670
16182c7952B47854O7306g9706A87210O3305a57205A57874n9419Q5537l1915e2731
16170A49413K9650i6798M2691r2833H5532P3148J4671C5123J91641b9672j66130
16159a95802C06462e128l4001N890j88055c4265Q951m0516C3454a57828j26869
16148b84697A93048a0392E2234b76715H4982k9175a77902B23806a0108m0711j42711
16137a93530E055P510G7h8687o8248g1223j40264a03075I3980d21373H6839f4765
16124a76533M960b8942A80508b54854a8398B2756K049c30301G5644f7967c2746
16112a23279B11016E7299f4848o5856f4919A80976h2503B7570a84565L595A39363
$$ plain form
16100 -81581 -136473 -370056 -229741 -110094 84210 -265572 -465203 -147814 -237107 274740
16089 -325439 -287244 39993 -114569 -229787 -171846 -65836 170623 60328 85664 -60405 -460671
16078 -460671 -325748 203322 90528 -61413 -226802 276689 20324 -15949 280511 -135197
16067 -27673 -201052 -17431 -288526 -193528 -18068 -210793 -236935 5205 70168 -5101 -429467
16056 -429467 -247045 139405 -92552 -283250 -299936 -211475 318811 -167106 141312 50472
16045 266130 64653 108385 -118741 -88783 -137735 -87625 -140787 107462 -232511 -286499 -75961
16033 87586 -350629 -16969 -227105 115488 38705 -350106 104373 -161583 322969 -223128
16022 -134867 -253771 -357877 -22091 -399555 2974 -333453 60540 -178278 -61554 281592
$$ packed form
16100h1581n4892k33583J40315a10094H4210b65572j99631a47814q9293B74740
16089c25439L8195C9993a14569j15218N7941f5836A70623F0328K5336f0405m00266
16078d60671J34923B03322I0528f1413j65389B76689B0324a5949B80511a35197
16067b7673j73379a7431k71095R4998a8068j92725k6142E205O4963e101m24366
16056d29467J82422A39405i2552j90698j6686Q8461C18811a67106A41312E0472
16045B66130F4653M3732a18741K9958m8952N0110n3162A07462b32511n3988g5961
16033H7586c50629a6969k10136A15488C8705c50106A04373a61583C22969b23128
16022a34867j18904j04106b2091l77464B974c33453F0540a78278f1554B81592
$$ plain form
16011 -245884 -110106 -11751 -32698 -61518 -5097 3940 64443 -83081 -169941 -223806 -128549 -5082
15998 19605 112783 -258569 84903 34201 86282 -93610 -384036 -203266 -110458 -111518 -363485
15987 -363485 89052 -272426 -141210 -231104 -89588 109286 -190921 -132788 59866 -59243 -307674
15976 -307674 -277441 -23492 53929 -357251 50950 -56512 -159492 -119052 -45524 -234751 -321809
15965 -321809 -338760 -291508 55956 -11259 248314 -141380 282991 -312787 145243 -212360
15954 -14702 -366426 -49105 -137446 -63792 -244394 21979 34200 -278802 -370064 -188103 -77745
15942 274899 -242796 -160811 -336877 -283168 -96301 72701 -244642 -365233 176758 -73275
15931 -208150 5538 -5285 -163735 -174555 110143 11839 -250009 40513 52218 -465681 -130158
$$ packed form
16011b45884a10106a1751k0947k8820e097C940O0503h3081q6860n3865R5257e082
15998A9605R3178b58569H4903C4201N2081i3610k90426J80770R2808j060k51967
15987c63485H9052b72426J31216q9894h9588A09286a90921N8133E9866e9243k48431
15976c07674L0233b3492E3929c57251E0950e6512j02980M0440d5524j89227q7058
15965c21809j6951M7252E5956a1259B48314a41380B82991c12787A45243b12360
15954a4702l51724d9105q8341f3792j80602B1979J2221b78802r1262J81961g7745
15942B74899b42796Q1985j76066N3709i6301G2701b44642j20591A76758g3275
15931b08150E538e285j58450j0820A10143A1839b50009D0513J1705d65681a30158
$$ plain form
15919 -128227 87776 -130757 17481 -91425 -16280 -67614 -86852 194596 -158719 194263 -100779
15907 -194800 153572 -227458 -180211 -78596 -32397 -239480 -134974 109192 264489 -50355
15896 18713 -219710 -15359 92409 -406758 -227465 -38602 -74553 -171484 -388251 -317123 -306720
15885 -306720 -95606 -107767 -125709 -206541 -224488 -93233 106355 -185548 -215919 77420 -430901
15873 99706 -224184 116388 -41326 -166033 163455 -328937 20262 -213490 -175519 -153251
15863 -153251 62757 -182658 -151206 207084 -288514 -152715 151548 -137058 526721 88796
15852 -110250 -240118 -9376 178881 86565 74120 7176 37487 -79094 175399 17382 248687
15841 248687 -73368 -284968 -265630 -14391 -33520 -89577 -124043 -301777 -81491 -205797 -112464
$$ packed form
15919a28227H7776a30757A7481i1425a6280n1334j9238A94596a58719A94263a00779
15907a94800A53572b27458M7247g8596c2397k07083J04506A09192J55297e0355
15896A8713b19710a5359I2409d06758J79293c8602l5951r6931k16767P1128J0403
15885c06720i5606j2161j7942q0832j7947i3233A06355a85548l0371G7420d30901
15873I9706b24184A16388d1326j24707A63455c28937B0262b13490L7971K2268
15863a53251F2757a82658L1452B07084b88514J35799A51548a37058E26721H8796
15852a10250j29868i376A78881H6565j2445G176L0311g9094A75399A7382K31305
15841B48687g3368k11600J9338a4391j9129n6057l4466j77734h1491j24306R3333
$$ plain form
15830 -112464 -230035 -48412 -108056 -215813 245401 -223522 54346 60205 71146 -118772 -187760
15819 -187760 -85703 -2277 -83851 241389 -300836 -203025 -123587 -12016 34330 -185163 -325353
15808 -325353 -131207 -183068 430620 43192 17158 -209483 -90247 209441 -49456 -29848 -76372
15797 -76372 -272957 11067 -103411 -121969 6858 -242392 -42605 -226184 -341739 -201269 284075
15785 -170141 210792 -268641 -147889 194149 -21299 -81510 -45383 -85391 -212366 -11208
15774 -226620 -76773 -168507 -299410 -132061 -51937 -131431 -216707 268093 -35102 -140899 -257746
15763 -257746 -235445 302368 -24962 -61841 2869 87035 -345988 10198 122843 -142159 -57382
15751 252537 -290042 -214631 -99130 -282283 -219739 87826 44666 33369 131502 80389 -108485
$$ packed form
15830a12464j17571d8412n9644j07757B45401b23522E4346N859J0941a18772o8988
15819a87760h5703b277q1574B41389c00836R7811P9438a2016C4330a85163j40190
15808c25353a31207n1861D30620D3192A7158b09483i0247B09441d9456J9608m6524
15797g6372j96585A1067a03411j8558F858b42392d2605j83579j15555J40470B84075
15785a70141B10792b68641J20752A94149b1299o0211L6127m0008j26975a1208
15774b26620g6773r1734j30903a32061e1937p9494q5276B68093c5102j05797j16847
15763b57746K2301C02368b4962l6879B869Q4166c45988A0198J12645a42159e7382
15751B52537b90042P5411i9130j83153O2544H7826m3160j1297R8133n1113a08485
$$ plain form
15739 -86833 -133491 -241907 -30977 323030 -40150 -134363 27823 -89462 -162888 -72799 -42633
15728 -42633 28143 313282 180648 278892 -88483 37320 38719 -23378 -94864 -80984 -80034 -200309
15716 -200309 -86841 -119283 121481 -87778 -195187 -73191 -231920 -148724 -268479 119562
15705 -61517 -119063 22376 142903 259866 62197 -14244 -167997 170433 -256787 -396807
15695 -396807 296038 -295880 -405292 23563 -144763 95760 1512 -156361 -150456 -132274 53843
15683 -244922 -107113 15086 20506 -96831 -147027 -37277 190350 29368 -212761 -108215 -173753
15672 -173753 13143 -335107 -73150 -132979 -142133 84965 -32276 -55327 61455 -106540 33540
15660 153907 14948 -139018 10444 87891 -65526 -72173 -97948 -99195 69169 305103 -88313
$$ packed form
15739h6833m6658j08416c0977C23030d0150r4213B7823h9462p3426g2799L0166
15728d2633B8143K85139j32634R8244h8483C7320J399b3378p1486J3880R50j20275
15716b00309h6841l2442A21481h7778j07409g3191j58729Q3196j19755A19562
15705f1517n7546B2376J20527J16963F2197a4244j53753A70433b56787j40020
15695c96807B96038b95880j09412B3563a44763I5760A512a56361N905J8182E3843
15683b44922a07113A5086N420i6831n0196c7277A90350B9368b12761J04546o5538
15672a73753A3143c35107g3150n9829r154H4965c2276k3051F1455a06540C3540
15660A53907A4948a39018A0444P7447f5526o647k5775j247F9169K35934h8313
$$ plain form
15648 177299 -105527 -68708 102819 12769 -28515 24646 219079 -207452 93547 40435 -249730
15636 15040 65494 -529061 -4428 -59877 -93108 338681 42879 -207660 -228824 -7660 199525
15624 142150 -39180 295272 -26475 -14729 -31013 -52457 -118040 190169 87467 -249919 179666
15612 -1954 -15374 -169167 -88678 32671 -40655 3845 112482 -83095 15211 -10331 -24709 -282867
15600 -282867 -26046 -141030 -31662 222275 139733 61858 -65951 -28754 102770 -71489 185203
15588 157355 312623 -241884 47648 230358 -238937 250144 -90197 221206 36175 159176
15578 159176 159717 -397335 -95452 -518268 142559 -202875 106631 -94780 -340467 89088 -93492
15566 -29851 -178318 -183432 -136133 -78222 -192980 45229 -419139 -294919 -86281 -275585 -98230
$$ packed form
15648A77299a05527L6819A02819A2769b8515B4646J94433b07452I3547D0435b49730
15636A5040N0454e29061d428n5449l3231C38681D2879b07660k1164g660A99525
15624A42150c9180B95272b6475J1746j6284k1444o5583A90169H7467b49919A79666
15612a954j3420j53793Q0489C2671d0655C845J08637h3095A5211a0331j4378k58158
15600b82867b6046j14984c1662B22275q2542F1858f5951b8754A02770g1489A85203
15588A57355J55268b41884D7648J82710b38937B50144i0197B21206C6175J23001
15578A59176N41c97335i5452m22816A42559b02875A06631i4780k45687H9088i3492
15566b9851j48467n114M7299N7911j14758D5229d19139J24220h6281j89304i8230
$$ plain form
15554 -47378 -16648 -98305 -313021 -208195 231712 -125729 237705 95474 42655 196290
15544 196290 51697 307826 -165445 135851 316275 -38644 119053 -224415 -321211 118472
15533 -37393 -22993 -107541 161435 17724 -65810 -225806 -138657 88255 101235 -37643 -322885
15522 -322885 123164 -106291 -74271 -97080 -118919 -272402 135089 152330 7051 -114107 223474
15510 -21043 -28523 -72369 125211 -88866 -275002 -16471 -161587 -115209 236513 133210 76709
15499 76709 -25604 -25663 -73216 -74962 272771 26109 -127461 -311782 -262500 -100114 353 -401395
15486 190235 -607443 -52266 -209084 -197498 241374 -210493 177130 202628 179165 52674
15475 -115091 -194395 12161 -73922 -134954 70493 -312954 55998 186295 -30786 -49293 242352
$$ packed form
15554d7378a6648q1657k14716J04826B31712a25729B37705I5474D2655J53635
15544A96290E1697K56129a65445A35851J80424c8644A19053b24415r6796A18472
15533c7393J4400q4548A61435A7724f5810j59996Q7149H8255J2980c7643k85242
15522c22885A23164a06291L2020k2809k1839j53483A35089J7241G051a14107B23474
15510b1043p480m3846A25211h8866j86136a6471j45116M6378B36513j03303n6501
15499G6709b5604n9m7553j746B72771B6109a27461j84321M9282a00114C53d01395
15486A90235f07443e2266j56818J1586B41374b10493A77130K5498k3463E2674
15475a15091p9304A2161g3922o1032G0493c12954E5998J30297c0786j8507B42352
$$ plain form
15463 18564 49089 101694 238570 12579 207548 296755 -146765 -30530 973 -99541 145062
15451 228642 3591 -192376 237560 -75785 -242582 -426 -166336 7691 62338 217899 -25835
15439 28398 -14064 156882 -273483 83454 124943 -77515 190013 -340748 126961 -137059
15428 21788 -139393 -208601 -29976 159074 -183908 -240260 195552 329104 -68133 279249
15417 -139391 139147 -146718 77786 130117 31510 -4781 -104162 -105487 -202777 -140015 250863
15405 -103350 48458 243085 -77794 110241 128368 -66780 -100806 193488 103174 -80013 -121018
15394 -121018 -56961 -46454 -169610 -241072 248321 106293 -29101 82944 85093 -237904 345746
15382 19538 -138720 -356143 155266 76457 209374 -184871 -18392 155611 262686 -178877
$$ packed form
15463A8564L0525N2605J36876A2579J94969Q9207a46765c0530I73i9541A45062
15451B28642C591a92376B37560g5785j66797d26j65910G691N4647J55561b5835
15439B8398a4064A56882b73483H3454M1489g7515A90013c40748A26961a37059
15428B1788a39393o9208b9976A59074a83908n6352A95552J33552f8133B79249
15417a39391A39147a46718G7786N2331C1510d781r9381j325r7290O2762B50863
15405a03350D8458J94627g7794A10241J8127f6780l4026A93488r0314h0013m1005
15394a21018e6961J0507j23156p1462B48321A06293b9101H2944K149b37904C45746
15382A9538a38720k17423A55266G6457J32917a84871a8392A55611J07075a78877
$$ plain form
15371 197245 -79663 -46285 -123979 8724 -56250 -389469 -353102 184759 -273784 173957 235842
15360 235842 267182 -224046 78720 -36918 -146311 81160 183479 214210 -112743 18505 162773
15349 162773 240376 179496 4632 -100811 249747 368330 -115641 -50851 251400 212249 -239147
15337 -313616 60339 96776 -50758 -68000 139369 17267 -123046 -569127 248820 -240598
15326 276916 78813 51080 117472 153080 -291784 104308 203845 313690 -130082 -336424
15316 -336424 233530 233546 155980 148566 18727 -261764 68734 -63887 -14064 52756 194820 -25811
15303 -258686 236487 -225883 -66439 133898 132618 -10946 -169971 163905 73871 272744
15293 272744 -127890 406654 171287 179549 28497 341822 381861 -77735 35961 -60950 181546
$$ packed form
15371A97245g9663L3378p7694H724e6250l33219L6367A84759b73784A73957O1885
15360B35842L1340b24046G8720c6918j09393H1160J02319L0731a12743A8505J44268
15349A62773P7603o0880D632a00811B49747J18583a15641e0851B51400l9151b39147
15337c13616F0339L6437e0758j7242A39369A7267a23046m46081B48820b40598
15326B76916G8813k7733O6392L5608b91784A04308R9537J09845a30082k06342
15316c36424B33530J6p7566p414A8727b61764F8734f3887a4064E2756J42064b5811
15303b58686B36487b25883f6439A33898j280a0946j59025A63905G3871J98873
15293B72744a27890D06654A71287Q262B8497L13325M0039g7735C5961f0950A81546
$$ plain form
15281 -69323 -257208 78710 131575 -5152 -28715 99020 -94395 40475 -44611 -57831 103453
15269 46183 227610 91408 -288888 460819 -226067 18396 179433 251165 -57271 88984 375443
15258 375443 51679 -78576 315942 -33079 895 461579 -106525 7662 -64516 200954 146984
15247 146984 52408 -275208 121810 371349 310300 75340 70339 295543 63812 187312 103546
15236 103546 94457 -45529 -170659 -196761 -17471 144010 271208 -212092 133483 87796 -220540
15224 99499 299384 -21553 273235 287128 217645 65356 122152 324571 82391 135285 -85442
15212 159271 -4755 32872 89365 194398 109853 172119 -231223 -300910 278432 -132705 91641
15200 273316 287300 -66623 74429 195164 -146924 -385057 -20357 296049 -174306 -76166
$$ packed form
15281f9323j87885G8710N2865e152k3563I9020i4395D0475d4611j3220A03453
15269D6183J81427I1408b88888D60819b26067A8396J61037P1732e7271H8984K86459
15258C75443E1679g8576C15942c3079H95M60684a06525G662f4516B00954n3970
15247A46984E2408b75208A21810K49539o1049G5340n001K25204F3812J23500q3766
15236A03546r089d5529j25130k6102a7471A44010J27198b12092A33483m5687b20540
15224I9499J99885b1553B73235J3893o9483F5356N6796K02419H2391N2894h5442
15212A59271d755C2872N6493J05033q4545O2266b31223o9687B78432a32705I1641
15200B73316J3984f6623G4429J20735a46924k38133b0357B96049a74306g6166
$$ plain form
15189 240152 44879 -130589 339242 260326 268482 50300 182860 158563 65219 26365 338635
15178 338635 -295363 340840 -73772 259388 125872 459716 122539 52381 340011 356546
15168 356546 138841 310576 389255 -18773 191196 476186 147172 230129 190873 -32820
15157 411360 -318878 194463 125647 287670 30100 178240 -55172 -68712 166502 141460
15147 141460 -213496 -179029 47370 141280 62997 353517 128891 358119 317046 -55626 199758
15135 249863 159816 255556 92516 324580 312659 353078 -47748 347528 153695 354100 541537
15124 541537 76787 245900 319067 453987 24866 -38561 -25138 253198 319549 173918 234615
15113 234615 165090 -47555 55347 38990 143081 -51101 -187504 126709 317816 527014
$$ packed form
15189B40152D4879a30589C39242p8916Q156E0300J32560k4297F5219B6365L12270
15178C38635b95363C40840g3772B59388A25872L33844A22539E2381K87630J6535
15168C56546A38841J71735P8679a8773A91196K84990A47172Q2957l9256c2820
15157D11360c18878A94463o8816J62023C0100J48140e5172j3540A66502k5042
15147A41460b13496L4467D7370R3910F2997K90520A28891K29228m1073e5626A99758
15135B49863r0047R5740I2516K32064j1921M0419d7748C47528A53695K00405J87437
15124E41537G6787J69113P3167J34920B4866c8561J3423B53198O6351j45631O0697
15113B34615o9525d7555E5347j6357J04091e1101j36403A26709J91107K09198
$$ plain form
15103 527014 352401 -59554 302742 96221 437162 102579 95743 -290358 -51007 205042
15092 324340 223282 122493 181412 74088 199973 324502 -33048 212515 225906 93149
15081 27728 535024 60239 -20534 456264 92753 118792 312066 11758 164749 -149040 24649
15069 253890 241839 42626 435986 -185607 448728 145077 -50535 -137663 358236 553286
15059 553286 312642 276093 -170712 175073 380347 3442 297330 87559 -257324 204653
15048 117353 188723 133824 288017 300178 11798 -73752 508984 199088 143750 283260 86449
15036 324694 364374 42487 275603 76671 232523 172036 220549 473550 101973 244756
15026 244756 104705 154570 396590 536884 466628 537805 389024 338519 508508 273195
$$ packed form
15103E27014j74613e9554C02742I6221L40941A02579o836b90358e1007B05042
15092C24340j01058j00789N8919G4088J25885J24529c3048B12515J3391I3149
15081B7728N07296F0239b0534D56264I2753K6039J93274A1758J52991a49040B4649
15069B53890j2051D2626L93360a85607D48728A45077e0535q7128C58236J95050
15059E53286k40644l6549a70712A75073K05274C442K93888H7559b57324B04653
15048A17353P1370n4899J54193J2161A1798g3752E08984A99088n5338J39510H6449
15036C24694L9680D2487K33116G6671J55852o0487M8513K53001A01973J42783
15026B44756A04705M9865K42020J40294p0256P1177j48781n0505J69989k35313
$$ plain form
15016 273195 153631 -31115 367852 172588 11090 134175 209663 466433 150020 -66912
15005 242025 475609 111928 -16921 229186 127045 249742 426287 155145 534538 218192
14994 26726 495927 -68271 402203 -70762 283421 -28167 14658 268884 168525 -194223
14983 -8717 38158 346873 466352 361604 210551 309175 359449 220571 -25375 341109 186276
14972 186276 23852 193741 377190 290155 362000 357504 108071 388253 451631 612368 494117
14961 494117 221694 238949 418004 412075 364269 376629 222746 273289 758394 271997 265322
14950 265322 2631 273885 302832 453926 331278 439117 473726 251528 -78851 531236
14939 381996 361445 132628 377979 168404 71732 400687 719533 130705 436969 99551
$$ packed form
15016B73195j19564c1115C67852A72588A1090J23085P5488K56770A50020f6912
15005B42025K33584A11928a6921B29186j02141J22697J76545A55145L79393B18192
14994B6726M69201f8271D02203g0762B83421b8167A4658K54226j00359a94223
14983h717C8158L08715J19479j04748j51053R8624N0274j38878b5375C41109j54833
14972A86276B3852J69889J83449q7035P1845m496A08071K80182O3378J60737j18251
14961D94117B21694J7255J79055n929m7806J2360j53883N0543M85105B71997o675
14950B65322B631K71254K8947J51094j22648J07839L4609k22198g8851E31236
14939C81996k0551A32628K45351A68404G1732L28955L18846A30705L06264I9551
$$ plain form
14928 95148 350931 126954 343601 191537 223136 272868 646390 210903 295362 95138
14917 276720 177945 400527 461828 315029 354506 501694 243861 571841 311639 198656
14907 198656 128766 429724 243348 63663 253517 243906 451920 373919 312829 316935 616352
14896 616352 625391 51082 -43561 232627 180528 368795 462914 567168 375783 634159 273071
14884 15454 516636 265938 250775 341187 617920 487318 389030 674246 550767 392380
14874 392380 261243 423363 285332 337802 228210 509757 315373 448286 585604 365536
14864 365536 460501 173860 483819 270816 648642 553594 540139 536342 460198 191609 537911
14853 537911 708153 279495 344976 359657 148232 346144 419660 468351 546795 640958 597755
$$ packed form
14928I5148K55783A26954K16647j52064L1599M9732L73522B10903Q4459I5138
14917B76720r8775K22582O1301j46799L9477J47188B43861L27980k60202j12983
14907A98656o9890L00958j86376F3663J89854r611K08014p8001o1090M106K99417
14896F16352R039E1082d3561B32627n2099J88267R4119J04254j91385K58376B73071
14884A5454N01182k50698j5163R0412K76733j30602r8288K85216j23479j58387
14874C92380j31137J62120j38031N2470j09592K81547j94384J32913J37318k20068
14864C65536R4965A73860L09959k13003L77826r5048j3455l797p6144A91609L46302
14853E37911J70242B79495O5481J4681A48232J97912P3516M8691P8444R4163m3203
$$ plain form
14842 597755 230719 171998 804800 443989 573590 583964 377502 806472 483929 506396
14832 506396 317633 592807 574649 506963 321587 568687 526034 476152 491245 485830 410317
14821 410317 850542 649240 454066 559628 562365 150115 640182 262620 397669 577218
14811 577218 637547 678333 778590 238796 811421 359102 659485 770319 810124 609216
14801 609216 472422 885104 582622 732744 394395 765679 411855 560480 751021 634145
14791 634145 615236 553160 697777 853545 679631 652606 494801 810921 470168 537286
14781 537286 422040 647886 678128 550885 541618 474346 627835 730384 753561 504652
14771 504652 763732 902097 484343 603599 731407 314627 767449 457250 855359 834150
$$ packed form
14842E97755B30719n8721O32802l60811J29601J0374k06462M28970l22543K2467
14832E06396j88763K75174j8158o7686j85376K47100m2653m9882J5093n415p5513
14821D10317M40225k01302j95174J05562K737A50115M90067B62620J35049J79549
14811E77218O0329M0786J00257B38796N72625C59102L00383J10834L9805k00908
14801F09216j36794M12682l02482J50122l38349L71284l53824J48625J90541j16876
14791F34145j8909o2076J44617J55768j73914k7025j57805L16120l40753O7118
14781E37286j15246K25846L0242j27243r267o7272J53489J02549K3177k48909
14771E04652K59080J38365m17754J19256J27808C14627M52822l10199L98109k1209
$$ plain form
14761 834150 607588 1015279 650741 456856 550755 957260 675939 797800 714680 620584
14751 620584 524486 885132 693315 741983 879147 730738 871022 751510 659772 618755
14741 618755 507768 496046 955447 787291 677383 579889 942772 552915 729088 809706
14731 809706 734450 724601 951784 736790 669617 597236 828138 478517 723147 739705 951166
14720 951166 740230 885688 1024638 853812 794100 978304 936993 559617 1173094 641418
14710 641418 1014347 908351 1009917 984496 804542 1176993 1168158 1107770 1030762 930748
14700 930748 958288 1242174 1221390 1118099 1066492 1205644 1164920 922959 1030515 1021036 1029937
14689 1029937 879434 1156439 969026 1134026 950659 979366 933688 982226 1401791 1123656
$$ packed form
14761H34150k26562M07691l64538j93885R3899M06505k81321J21861q3120r4096
14751F20584r6098L60646j91817M8668J37164j48409J40284j19512r1738m1017
14741F18755j10987j1722M59401j68156j09908r7494L62883l89857J76173Q0618
14731H09706p5256r849K27183k14994o7173p2381K30902l49621K44630J6558K11461
14720I51166k10936J45458J38950j70826n9712J84204m1311l77376O13477n31676
14710F41418L72929j05996J01566k5421j79954L72451q835o0388p7008j00014
14700I30748K7540K83886k0784j03291n1607J39152m0724k41961J07556r479Q901
14689A029937j50503K77005j87413J65000j83367K8707m5678M8538M19565k78135
$$ plain form
14679 1123656 1256364 1226565 1339462 1115178 853887 1061161 922225 1323522 1341106 1168423
14669 1168423 940733 970314 727123 1252955 840317 1353763 1070484 1206910 1152572 1250080
14659 1250080 1204032 1401233 1200583 1488679 1115936 1325399 1269815 1133473 1024089 1247300
14649 1247300 1224877 1410770 1200711 1125634 1441898 1011760 1092623 1703780 1146585 1529002
14639 1529002 1309385 1143512 1458363 1569989 1387225 1435374 1643793 1481091 1196326 1744073
14629 1744073 1248020 1236361 1468824 1611628 1074555 1496894 1162472 1532266 1348638 1432577
14619 1432577 1671048 1704850 1710428 1635397 1588821 1592000 1775836 1851163 1495171 1828298 1316962
14608 1316962 1903580 1753335 1637738 1527762 1729506 1819360 1638934 1951208 1834948 1821594
$$ packed form
14679A123656J32708k9799J12897k24284k61291K07274j38936M01297J7584j72683
14669A168423k27690K9581k43191N25832m12638N13446k83279J36426n4338R7508
14659A250080m6048J97201k00650K88096l72743K09463n5584j36342j09384K23211
14649A247300k2423J85893k10059p5077L16264m30138Q0863O11157n57195L82417
14639A529002k19617j65873L14851J11626j82764M8149K08419j62702k84765N47747
14629A744073m96053j1659K32463J42804n37073M22339l34422L69794j83628Q3939
14619A432577K38471L3802N578p5031m6576L179J83836P5327l55992L33127n11336
14608A316962N86618j50245j15597j09976K01744Q9854j80426L12274j16260j3354
$$ plain form
14598 1821594 1694563 1717842 1732866 1992091 1744461 1903352 1764437 1786688 1803305 2009993
14588 2009993 2084787 1959549 1998616 2062934 2059889 1928702 2051402 2036475 1979034 2074547 2245422
14577 2245422 2551554 2155140 1939311 2391432 1963761 2795180 2519343 2333411 2044040
14568 2044040 2331386 2412319 2539745 2269184 2413038 2619253 2422901 2560185 2707843 2501960
14558 2501960 2851108 2664105 2743749 2572072 2881425 2909292 3025770 2906079 3139897 3434534
14548 3434534 3450191 3407122 3590170 3985340 4042859 4116210 4738308 5012090 5272243 5807771
14538 5807771 6668185 6958377 8365338 10034189 12435018 15156888 18009570 19799602
14530 19799602 19396234 16188062 13208772 9913727 7769895 6415431 5341550 4763341
$$ packed form
14598A821594j27031K3279J5024K59225k47630J58891j38915K2251J6617K06688
14588B009993P4794j25238L9067O4318l045j31187J22700j4927n7441R5513J70875
14577B245422L06132l96414k15829M52121m27671Q31419k75837j85932k89371
14568B044040K87346Q0933J27426k70561J43854K06215j96352J37284J47658k05883
14558B501960L49148j87003P9644j71677L09353K7867J16478j19691K33818K94637
14548C434534J5657m3069J83048L95170N7519P3351O22098K73782K60153N35528
14538E807771Q60414K90192J406961J668851K400829K721870K852682J790032
14530A9799602m03368l208172k979290l295045k143832j354464j073881n78209
$$ plain form
14522 4763341 4231199 4073042 3752095 3582992 3263059 3038791 3494472 3036332 2762758
14513 2762758 3089728 2995688 3087059 3322724 2839163 3229457 3219089 2996236 3136702 3135116
14503 3135116 2865289 3228592 3184384 3238266 3298506 3390385 3378418 3707853 3585406 3850679
14493 3850679 3244721 3618764 3563188 3690738 3619364 3970533 3801752 4149698 3862682 4128093
14483 4128093 3645829 4060318 4026997 3677178 4089951 3647164 4176666 4309609 4261685 4180101
14473 4180101 4452150 4413135 4243674 4347486 4455978 4603444 4883666 4441770 4450113 4634075
14463 4634075 5029125 5194181 4575741 5124872 4834643 5036816 5085243 5399991 5193395 5100529
14453 5100529 5178096 5506096 5677769 5364181 5522797 5607431 5614568 6032823 5808081 5859618
$$ packed form
14522D763341n32142j58157l20947j69103l19933k24268M55681m58140k73574
14513B762758L26970r4040R1371K35665m83561L90294j0368k22853J40466j586
14503C135116k69827L63303m4208N3882O0240R1879j1967L29435j22447K65273
14493C850679o05958L74043n5576J27550p1374L51169j68781L47946k87016K65411
14483D128093m82264M14489l3321l49819M12773m42787N29502J32943m7924q1584
14473D180101K72049l9015j69461J03812J08492J47466K80222m41896Q343J83962
14463D634075L95050J65056o18440N49131k90229K02173M8427L14748k06596r2866
14453E100529P7567L28000J71673l13588J58616Q4634P137M18255k24742N1537
$$ plain form
14443 5859618 5942290 5887766 6331612 6036133 6282882 6526037 6260873 6727225 6365406 6863841
14433 6863841 6774989 6857438 6760415 6986855 6673222 7045596 7369819 7399883 7414506 7190472
14423 7190472 7358457 7706769 7897372 8009870 7808737 7985862 8012775 8186011 8443138 8678357
14413 8678357 8474749 8695454 8934900 9322694 9211172 9532898 9586353 9838807 9713539 9648699
14403 9648699 9953752 10030888 10331927 10387845 10679680 10597458 10937648 11110302 11292431 11242199
14393 11242199 11669057 11553686 11846502 12293407 12609166 12660569 12737114 12881900 13250351 13208047
14383 13208047 13369684 13945964 14071570 14235734 14195614 14692524 14734177 15247858 15664853 15762462
14373 15762462 15874340 16107789 16428639 17155932 17110566 17372008 17705631 18171892 18505191
$$ packed form
14443E859618Q2672n4524M43846k95479K46749K43155k65164M66352l61819M98435
14433F863841q8852Q2449r7023K26440l13633L72374L24223L0064J4623k24034
14423G190472J67985L48312J90603J12498k01133J77125K6913J73236K57127K35219
14413H678357k03608K20705K39446L87794j11522L21726N3455K52454j25268o4840
14403I648699L05053P7136L01039N5918K91835q2222L40190J72654J82129n0232
14393A1242199M26858j15371K92816M46905L15759N1403P6545J44786L68451m2304
14383A3208047J61637N76280J25606J64164m0120M96910M1653N13681M16995R7609
14373A5762462J11878K33449L20850P27293m5366K61442L33623M66261L33299
$$ plain form
14364 18505191 18679735 18823907 19817877 19741436 20259169 20359550 21331929 21243186 22169078 22262108
14354 22262108 23183901 23234458 23912893 24314641 25146477 25535840 25968076 26620556 26840706
14345 26840706 27896863 28437242 29055310 29599605 29959375 30984318 31735856 32518575 33290519
14336 33290519 33846369 34978334 35671678 36987090 37618657 38862038 39811630 40746715 41782596
14327 41782596 43027580 43987654 45484742 46721421 47833660 49099876 50639027 52086470
14319 52086470 53570895 55326727 56802386 58634723 60630353 62319185 64540795 66637278
14311 66637278 68437266 70842826 73247071 76002127 78186903 81014052 83854484 86627944
14303 86627944 89811292 93186768 96656754 100062274 103982137 107964184 112083291 116558337
$$ packed form
14364A8505191J74544J44172R93970p6441N17733J00381R72379q8743R25892R3030
14354B2262108R21793N0557O78435M01748Q31836L89363M32236O52480K20150
14345B6840706J056157N40379O18068N44295L59770J024943P51538P82719P71944
14336C3290519N55850J131965O93344J315412O31567J243381R49592R35085J035881
14327D1782596J244984R60074J497088J236679J112239J266216J539151J447443
14319E2086470J484425J755832J475659J832337J995630J688832K221610K096483
14311F6637278J799988K405560K404245K755056K184776K827149K840432K773460
14303H6627944L183348L375476L469986L405520L919863L982047M119107M475046
$$ plain form
14295 116558337 120904016 126221846 131254650 136476563 142296006 147841959 153915488 160390987
14287 160390987 167640975 174599585 181975806 189619257 197877322 206649008 215443424 224556330
14279 224556330 234006309 243845042 254193317 264546887 275588931 286323287 297135637
14272 297135637 308364803 319406931 330717294 341644506 352201448 362871621 372623141
14265 372623141 382298791 391577850 399962269 408058755 415286774 421455435 426150965 428998567
14257 428998567 430902455 431696890 431999303 430777181 428432441 424915481 420049411 414071393
14249 414071393 407336416 399382048 390505253 380937548 370704050 359835377 348831976
14242 348831976 337386575 325722930 314164650 302788691 291319835 280036773 268234856
$$ packed form
14295A16558337M345679N317830N032804N221913N819443N545953O073529O475499
14287A60390987P249988O958610P376221P643451Q258065Q771686Q794416R112906
14279B24556330R449979R838733J0348275J0353570J1042044J0734356J0812350
14272B97135637J1229166J1042128J1310363J0927212J0556942J0670173R751520
14265C72623141R675650R279059Q384419Q096486P228019O168661M695530K847602
14257D28998567J903888P94435L02413j222122k344740l516960m866070n978018
14249D14071393o734977p954368q876795r567705j0233498j0868673j1003401
14242C48831976j1445401j1663645j1558280j1375959j1468856j1283062j1801917
$$ plain form
14235 268234856 256981461 245932207 235455945 225362297 215596908 206697448 197695218
14228 197695218 189721317 181680601 173621624 166394515 159713197 153251203 147294995 140972272
14220 140972272 135582074 130210202 125243594 120263269 115717826 111344027 107358627 103080106
14212 103080106 99476274 96211601 92488286 89181096 85963349 82638958 80302968 77446675
14204 77446675 74939978 72593483 70024273 67948234 65828044 63923869 61555638 59995937
14196 59995937 58099515 56216794 54845569 52934921 51875696 50144796 48927244 47475646
14188 47475646 46236357 45038097 43873356 42820304 41788224 40634363 39577003 38215135
14180 38215135 37660498 36765452 35713192 34712051 33812852 33025026 32370979 31456890 30771287
$$ packed form
14235B68234856j1253395j1049254j0476262j0093648r765389q899460r002230
14228A97695218p973901q040716q058977p227109o681318o461994n956208o322723
14220A40972272n390198n371872m966608m980325m545443m373799l985400m278521
14212A03080106l603832l264673l723315l307190l217747l324391k335990k856293
14204G7446675k506697k346495k569210k076039k120190j904175k368231j559701
14196E9995937j896422j882721j371225j910648j059225j730900j217552j451598
14188D7475646j239289j198260j164741j053052j032080j153861j057360j361868
14180C8215135n54637q95046j052260j001141q99199p87826o54047r14089o85603
$$ plain form
14171 30771287 30149181 29516183 28613321 28255444 27481860 26996020 26305675 25630871 25002042
14162 25002042 24551525 23884129 23929719 23523273 22850179 22461639 21930906 21064803 21157855 20539981
14152 20539981 19970309 19931819 19739687 19131809 18860947 18529781 18231206 17748291 17541016
14143 17541016 17237422 16820183 16118325 16160372 15892599 15658214 15763807 15138692 14974482
14134 14974482 14974135 14828320 14291207 14303945 13662974 13829822 13360873 12946767 12994395 12730625
14124 12730625 12704523 12324064 12085856 11563383 11632684 11439804 11220213 11215541 10927546 11185445
14114 11185445 10821097 10467532 10477125 10059914 9718183 10170980 9969844 10165304 9606425 9671685
14104 9671685 9408854 9310556 8951581 8965834 9058223 8611488 8320400 8895575 8633451 8721441
$$ packed form
14171C0771287o22106o32998r02862l57877p73584m85840o90345o74804o28829
14162B5002042m50517o67396M5590m06446o73094l88540n30733q66103R3052o17874
14152B0539981n69672l8490j92132o07878k70862l31166k98575m82915k07275
14143A7541016l03594m17239p01858M2047k67773k34385J05593o25115j64210
14134A4974482l47j45815n37113J2738o40971J66848m68949m14106M7628k63770
14124A2730625k6102l80459k38208n22473O9301j92880k19591m672k87995K57899
14114A1185445l64348l53565R593m17211l41731M52797k01136J95460n58879O5260
14104I671685k62831r8298l58975J4253R2389m46735k91088N75175k62124Q7990
$$ plain form
14094 8721441 8282407 8209513 8054517 7962468 8043515 8026023 7882682 7791474 8032744 7087755
14084 7087755 7287945 7112922 7359001 7146557 7041582 6844752 6771453 7080195 6869652 6396524
14074 6396524 6699964 6325222 6649511 6376122 6467509 6472007 5910866 6044321 6122343 6123520
14064 6123520 5777952 5868037 5684043 5598552 5406262 5881211 5336912 5654608 5376979 5411817
14054 5411817 5153077 5122392 5052843 5095608 5349414 4815193 5271091 5242455 5055200 5125764
14044 5125764 4741058 4792084 4825680 4811892 4487178 4752460 4867766 4544521 4550929 4736154
14034 4736154 4209998 4296931 4516442 4158933 4423969 4280830 4129499 4139957 4102679 4099062
14024 4099062 3895348 3953660 4120413 3678678 3692524 3924970 3782722 4185436 3537474 3567271
$$ packed form
14094H721441m39034p2894j54996r2049Q1047j7492j43341r1208K41270r44989
14084G087755K00190j75023K46079k12444j04975j96830p3299L08742k10543m73128
14074F396524L03440l74742L24289k73389R1387M498n61141J33455P8022J177
14064F123520l45568R0085j83994q5491j92290M74949n44299L17696k77629L4838
14054E411817k58740l0685o9549M2765K53806n34221M55898k8636j87255P0564
14044E125764l84706N1026L3596j3788l24714K65282J15306l23245O408J85225
14034D736154n26156Q6933K19511l57509K65036j43139j51331J0458l7278l617
14024D099062k03714N8312J66753m41735J3846K32446j42248M02714o47962K9797
$$ plain form
14014 3567271 3508778 3660261 3493585 3423818 3637591 3392176 3360256 3172747 3252428 3439298
14004 3439298 3357190 3203418 3125088 3501581 3183150 3049686 3372013 3329075 3392670 3266310
13994 3266310 2972122 3064477 3375066 3011941 3052374 3364628 3209183 3043495 3144084 3576867
13984 3576867 3677824 3732714 3757040 3790879 4321624 4453456 4972934 5441378 6319384 7905633
13974 7905633 9865098 12542359 16095555 18718807 19598361 18049662 15134199 12356372
13966 12356372 10243677 8016977 7527412 6274688 5220730 5108823 4743700 4677404 4122550
13957 4122550 4114186 3920031 3385434 3427528 3448817 3218170 3059042 3170297 3228188 2886658
13947 2886658 2805934 2661965 2836359 2808557 2584867 2945418 2359534 2523253 2402742 2798448
$$ packed form
14014C567271n8493J51483j66676o9767K13773k45415l1920j87509P9681J86870
14004C439298q2108j53772p8330L76493l18431j33464L22327m2938O3595j26360
13994C266310k94188R2355L10589l63125M0433L12254j55445j65688J00589M32783
13984C576867J00957N4890K4326L3839N30745J31832N19478M68444Q78006J586249
13974G905633J959465K677261L553196K623252Q79554j548699k915463k777827
13966A2356372k112695k226700m89565j252724j053958j11907l65123o6296n54854
13957D122550q364j94155n34597M2094K1289k30647j59128J11255N7891l41530
13947B886658q0724j43969J74394k7802k23690L60551n85884J63719j20511L95706
$$ plain form
13937 2798448 2423316 2545785 2572813 2710416 2240373 2354079 2073421 1939448 2409594 2218648
13927 2218648 2188544 2714924 2386382 2414636 2359086 2279490 2177674 2236948 2180462 2114601 2243119
13916 2243119 1784682 2147200 1843161 2000851 2027442 2076462 2088415 2031681 2107736 1706816
13906 1706816 2188107 2037073 1650617 1895625 2155999 2067487 2176508 1730666 1774463 2121123
13896 2121123 1806395 2186716 1815411 1760540 2057492 1557972 1882788 1595031 1901362 1478837
13886 1478837 1488992 1812839 1676687 1883931 1757583 1873799 1718805 1660466 1509254 1589995
13876 1589995 1847366 1599697 1569195 1586739 1586511 1578017 1759574 1626853 1499517 1707095 1385505
13865 1385505 1695753 1469583 1327755 1509010 1228763 1458813 1385562 1482879 1552916 1394347
$$ packed form
13937B798448l75132J22469K7028J37603m70043J13706k80658j33973M70146j90946
13927B218648l0104N26380l28542K8254n5550p9596j01816N9274n6486o5861J28518
13916B243119m58437L62518l04039J57690K6591M9020J1953n6734P6055m00920
13906A706816M81291j51034l86456K45008K60374q8512J09021m45842M3797L46660
13896B121123l14728L80321l71305n4871K96952m99520L24816k87757L06331m22525
13886A478837J0155L23847j36152K07244j26348J16216j54994n8339j51212Q0741
13876A589995K57371k47669l0502J7544k28q494J81557j32721j27336K07578l21590
13865A385505L10248k26170j41828J81255k80247K30050p3251R7317P0037j58569
$$ plain form
13855 1394347 1357085 1463162 1645694 1615967 1457702 1566147 1326161 1557698 1237002 1466734
13845 1466734 1618907 1305187 1179039 1166800 1400571 1361821 1412600 1576008 1512773 1539175
13835 1539175 1237279 1358572 1414050 1476711 1290547 1199532 1311612 1239937 1267088 1122878
13825 1122878 1276908 1302545 1243573 1311664 1409816 1384063 1199157 1240894 1334807 1209187 1175398
13814 1175398 991295 1240792 1153065 1110074 1415692 645646 1207401 1159572 1083925 1289569
13804 1289569 718907 1278380 1129304 874653 1167752 982805 874661 1267419 1106696
13795 1106696 1205884 1019314 1013911 1084357 1143474 958578 1123045 958326 1113820 1236052
13785 1236052 882720 1048290 1067079 1278897 794688 1106009 1147983 1118450 1001956 898813
$$ packed form
13855A394347l7262J06077J82532k9727j58265J08445k39986K31537l20696K29732
13845A466734J52173l13720j26148j2239K33771l8750N0779J63408o3235K6402
13835A539175l01896J21293N5478O2661j86164r1015J12080p1675K7151j44210
13825A122878J54030K5637n8972O8091R8152k5753j84906M1737R3913j25620l3789
13814A175398j84103K49497q7727m2991L05618F45646N61755m7829p5647K05644
13804A289569n70662N59473j49076k54651K93099j84947j08144L92758j60723
13795A106696R9188j86570n403P0446N9117j84896J64467j64719J55494J22232
13785A236052l53332J65570J8789K11818m84209L11321M1974k9533j16494j03143
$$ plain form
13775 898813 805011 987964 915736 762740 772761 908367 1112469 714946 1257060 1077479
13765 1077479 988102 1234895 1212268 1164756 889288 965346 699280 1032175 680351 803710
13755 803710 1059234 920506 797594 1002803 1049258 821710 1139858 825473 635574 997367
13745 997367 651424 1056826 1072763 934539 931307 670574 745630 570416 694394 893215
13735 893215 702796 335594 1017843 631584 678280 887887 860239 697887 795972 613758
13725 613758 559665 1128702 641530 983319 930156 749347 607803 581751 629869 993751
13715 993751 964842 483295 835111 587336 885057 959014 671955 1174908 584375 731173
13705 731173 708701 804003 823748 943952 690210 989469 744352 677875 1015295 724565
$$ packed form
13775H98813r3802J82953p2228j52996J0021J35606K04102l97523N42114j79581
13765A077479q9377K46793k2627m7512k75468P6058k66066L32895l51824J23359
13755H03710K55524j38728j22912K05209M6455k27548L18148l14385j89899L61793
13745I97367l45943M05402J5937j38224l232k60733P5056j75214J23978J98821
13735H93215j90419C35594O82249l86259M6696K09607k7648j62352R8085j82214
13725F13758n4093N69037m87172L41789n3163j80809j41544k6052M8118L63882
13715I93751k8909m81547L51816k47775K97721P3957k87059N02953E84375J46798
13705G31173k2472R5302J9745J20204k53742K99259k45117o6477L37420k90730
$$ plain form
13695 724565 532191 715154 920987 286526 549324 813107 640027 619113 566465 683349
13685 683349 488343 828453 655622 772084 646944 778690 946340 729141 677080 564703
13675 564703 545751 548397 582206 679687 1093344 660403 623388 764950 556162 847136 688581
13664 688581 604669 315951 824192 761437 617122 584851 606995 933590 769494 806437
13654 806437 621101 716757 509224 734233 411076 947887 571916 658593 690043 781037
13644 781037 490282 652884 559274 283881 571126 705428 625347 532676 851232 508498
13634 508498 873652 602778 456384 256553 648461 860581 707264 245670 796765 490357
13624 490357 380867 432149 338248 724306 504403 725437 495401 428046 234463 622217
$$ packed form
13695G24565j92374J82963K05833B86526K62798K63783j73080k0914n2648J16884
13685F83349j95006L40110j72831J16462j25140J31746J67650k17199n2061j12377
13675E64703j8952K646L3809R7481M13657m32941l7015J41562k08788K90974j58555
13664F88581q3912k88718N08241o2755j44315l2271K2144L26595j64096L6943
13654H06437j85336R5656k07533K25009l23157N36811l75971Q6677L1450R0994
13644G81037k90755J62602r3610k75393K87245J34302q0081r2671L18556l42734
13634E08498L65154k70874j46394j99831L91908K12120j53317B45670N51095l06408
13624D90357j09490N1282r3901L86058k19903K21034k30036o7355j93583L87754
$$ plain form
13614 622217 431505 142018 674325 821902 448459 347374 595842 508275 490133 608945
13604 608945 596942 150105 550395 254807 682856 747267 460939 54151 748896 790978
13594 790978 615928 587055 526816 850200 297365 571623 593154 733865 563704 442448
13584 442448 657235 320358 598555 303950 385144 530416 784544 424385 432990 455884
13574 455884 -79046 379476 636536 464497 383927 670558 372503 268564 359681 569770
13564 569770 467215 248828 493491 304830 338962 329366 712138 139533 436830 280168
13554 280168 544680 253281 489717 261218 522187 435812 162092 355468 463362 303441
13544 303441 442735 425310 245589 331666 605941 566953 151319 551046 -45795 519160
$$ packed form
13614F22217j90712A42018N32307J47577l73443j01085K48468q7567j8142J18812
13604F08945j2003A50105M00290B54807M28049O4411k86328E4151O94745M2082
13594G90978j75050k8873o0239L23384B97365K74258K1531J40711j70161j21256
13584D42448K14787C20358K78197k94605Q1194J45272K54128l60159Q605K2894
13574D55884g9046C79476K57060j72039q0570K86631k98055j03939R1117K10089
13564E69770j02555k18387K44663j88661L4132r596L82772A39533K97297j56662
13554B80168K64512B53281K36436k28499K60969q6375A62092J93376J07894j59921
13544C03441J39294j7425j79721Q6077K74275l8988A51319L99727d5795E19160
$$ plain form
13533 36419 375937 491578 252221 619650 446343 298281 109409 222241 552178 524170
13523 524170 338667 430281 637322 694207 173622 586847 304676 355260 536426 363775
13513 363775 289779 45158 681927 364342 365338 491258 441619 269619 342395 306741 156428
13502 156428 501304 513866 472969 484417 507653 289943 -6637 234406 636130 454568 477129
13491 477129 182071 174839 284201 594910 39863 149121 216246 404291 285295 488663
13481 488663 476425 532097 483128 211472 57171 321783 632492 342482 114032 189644
13471 189644 430012 204195 138475 445685 538315 192249 222173 642566 224531 497792
13461 497792 444532 412023 181908 472952 284895 413021 717026 377198 -287412 261066
$$ packed form
13533C6419L39518J15641k39357L67429j73307j48062A09409J12832L29937k8008
13523E24170j85503R1614K07041N6885A73622M13225k82171N0584J81166j72651
13513C63775p3996D5158O36769l17585R96J25920m9639j72000P2776l5654j50313
13502A56428L44876J2562m0897J1448K3236k17710f637B34406M01724j81562K2561
13491D77129A82071p232J09362L10709C9863J09258O7125J88045j18996K03368
13481D88663j2238N5672m8969B11472E7171K64612L10709k90010A14032P5612
13471A89644K40368B04195o5720L07210R2630A92249K9924M20393B24531K73261
13461D97792n3260l2509A81908K91044j88057J28126L04005l39828b87412B61066
$$ plain form
13450 233432 517442 570717 466967 110934 407510 151516 259587 585059 168622 179827
13440 179827 235124 58641 280771 540768 202471 332293 235691 742286 374017 281775
13430 281775 140739 328882 222602 163217 360309 102684 582688 388390 612933 216759
13419 -12933 382646 179987 302200 565272 287073 298355 622159 213374 412674 590382
13409 590382 17157 154791 110202 100113 47128 189653 26642 71181 145273 492186 492737
13398 492737 273035 304482 298747 489728 17502 262650 99730 54843 -29576 203146 242956
13387 242956 377639 107294 253403 102266 360990 44374 -47228 55659 -178812 208804
13376 224304 125898 292157 431344 297235 184487 518761 54658 301424 2659 299827
$$ packed form
13450B33432K84010N3275j03750A10934K96576A51516J08071L25472A68622J1205
13440A79827N5297E8641K22130K59997B02471J29822r6602N06595l68269r2242
13430B81775A40739J88143j06280n9385J97092A02684M80004j94298K24543B16759
13419a2933C82646A79987J22213K63072k78199J1282L23804B13374J99300J77708
13409E90382A7157J37634m4589j0089D7128J42525B6642M4539P4092L46913N51
13398D92737k19702L1447n735J90981A7502K45148I9730m4887b9576B03146L9810
13387B42956J34683A07294J46109A02266K58724D4374d7228E5659a78812B08804
13376B24304r8406J66259J39187j34109j12748L34274E4658K46766B659K97168
$$ plain form
13366 299827 10612 395487 316142 491714 352397 215053 200229 245101 198517 177454 335261
13355 335261 260069 98680 324632 462389 172536 268488 -76293 -166161 117923 449896
13345 449896 106247 313905 255130 405031 383392 168359 440966 237538 208997 -35715
13334 454622 201834 32418 161489 413644 418454 663636 278032 240304 245657 -251422 324417
13322 255248 387980 140456 139188 473425 478997 346900 307914 14651 247232 116465 131881
13311 131881 8543 -4089 357451 329133 278136 361596 321222 258107 245496 87506 -31567 135570
13298 33967 15807 228254 334354 479781 179798 63733 335907 322486 599854 174344
13287 209112 469676 250674 277475 228776 11352 41711 106348 199887 551486 410348 42727
$$ packed form
13366B99827A0612L84875p9345J75572j39317j37344j4824M4872m6584k1063J57807
13355C35261p5192I8680K25952J37757A72536R5952g6293q9868A17923L31973
13345D49896A06247K07658n8775J49901k1639A68359K72607k03428k8541c5715
13334D54622B01834C2418J29071K52155M810K45182B78032l7728N353b51422C24417
13322B55248J32732A40456j268L34237N572j32097l8986A4651K32581A16465J5416
13311A31881H543d089C57451k8318n0997Q3460m0374o3115j2611H7506c1567A35570
13298C3967A5807K12447J06100J45427A79798F3733K72174j3421K77368A74344
13287B09112K60564k19002K6801m8699A1352L0359O4637R3539L51599j41138D2727
$$ plain form
13275 469001 77088 34244 152831 377096 69914 150804 24840 179102 65866 66344 289657
13264 289657 -207761 251372 364630 408384 346045 95336 101651 194933 296610 163253 267121
13253 267121 194413 420405 254980 282645 144898 324405 62984 7094 280954 121467
13242 41792 341792 -146755 82881 22108 45934 128150 256114 401346 32813 623761 -332734
13230 208993 192937 63747 57030 95794 -22025 -5318 54547 320901 20100 77893 -115462
13218 374823 141968 188589 556125 -203384 247411 158535 -103630 463397 87939 25136
13207 216004 353031 201638 87273 153444 250046 363025 358294 166453 314552 253485 94383
13195 30769 388587 59005 400589 326837 428526 -28728 248813 48701 -75777 280937 85849
$$ packed form
13275D69001G7088C4244J18587K24265F9914Q0890B4840J54262F5866M78K23313
13264B89657b07761B51372J13258M3754o2339I5336O315R3282J01677j33357J03868
13253B67121p2708K25992j65425K7665j37747J79507F2984G094K73860A21467
13242D1792L00000a46755H2881B2108K3826Q2216J27964J45232C2813N90948c32734
13230B08993j6056F3747o717L8764b2025e318E4547K66354B0100N7793a15462
13218C74823A41968M6621L67536b03384B47411q8876a03630D63397H7939B5136
13207B16004J37027j51393H7273O6171R6602J12979m731A66453J48099o1067I4383
13195C0769L57818E9005L41584p3752J01689b8728B48813D8701g5777B80937H5849
$$ plain form
13183 129898 116396 107359 43121 -134379 446707 326237 128289 109337 202724 330109 145418
13171 326420 183901 -142724 350165 222446 179498 425277 236044 296844 139443 475846
13161 475846 311114 109185 187601 158537 132438 265429 165136 38821 20961 32889 226561
13150 226561 -11080 -81127 -112067 283305 77280 103937 38627 112370 315886 211518 287977
13139 287977 109991 -68567 471994 130977 381656 2916 -136694 275205 -86261 407193
13128 -45598 129934 148652 10897 43641 259972 -28786 124513 75237 -43864 1487 -108672
13116 250087 277855 24961 469726 180784 -283591 127473 -21240 186608 91002 -6377 209182
13104 23479 328784 263979 54753 -242993 -37015 49308 -51799 159393 -39900 21431 42945
$$ packed form
13183A29898j3502r037D3121a34379D46707j20470A28289j8952R3387J27385A45418
13171C26420j42519a42724C50165j27719m2948K45779j89233O0800A39443L36403
13161D75846j64732A09185P8416k9064k6099J32991j00293C8821j7860J1928J93672
13150B26561a1080p0047l0940B83305G7280K6657C8627P3743K03516j04368P6459
13139B87977A09991f8567D71994A30977K50679B916a36694B75205h6261D07193
13128d5598A29934J8718A0897L2744K16331b8786A24513m9276d3864A487a08672
13116B50087K7768B4961M44765A80784b83591A27473b1240A86608I1002f377B09182
13104B3479L05305o4805E4753b42993c7015D9308e1799A59393c9900B1431K1514
$$ plain form
13093 42945 32357 261240 68119 139540 -36426 173226 -62712 268721 384309 -22305 44406
13081 4623 129548 148892 13509 -81790 -86018 276776 227110 93223 287577 280248 280820 77552
13068 50752 348454 286741 -146281 168322 164858 422088 -23116 62043 122260 153948 391183
13057 391183 15602 490683 -27043 335447 17843 60835 17825 113225 101371 -64616 47384
13045 -66643 186952 333771 46688 377096 29980 244423 -58448 -59289 347620 197447 172391
13034 172391 88572 -209770 -47535 45062 145005 139779 -74519 160611 -116504 -174890 88526
13022 174815 2646 247658 265542 -64485 285160 245614 315552 -7048 50910 89839 101081
13011 101081 60155 357887 364128 401781 309659 163335 150462 345419 152102 295219 -57733
$$ packed form
13093D2945j0588K28883F8119P1421c6426A73226f2712B68721J15588b2305D4406
13081D623J24925J9344A3509h1790m228B76776m9666I3223J94354p329N72G7552
13068E0752K97702o1713a46281A68322l464K57230b3116F2043O0217L1688K37235
13057C91183A5602M75081b7043C35447A7843M2992A7825R5400j1854f4616D7384
13045f6643A86952J46819D6688L30408B9980K14443e8448q41C47620j50173k5056
13034A72391q3819b09770d7535D5062R9943n226g4519A60611a16504n8386H8526
13022A74815B646K45012J7884f4485B85160l9546O9938g048E0910L8929J1242
13011A01081m0926K97732O241L7653r2122j46324j2873J94957A52102J43117e7733
$$ plain form
12999 -87262 5732 324387 -72274 -5914 66464 526062 -78378 1190 126653 82093 -33825 34914
12986 120555 69277 56899 75370 330678 -14386 487570 195747 -253216 -74082 15174 257560
12975 257560 326644 -183572 117610 -25740 77190 263470 222660 426482 202774 -215674
12964 -40877 139178 41879 -106772 -93265 -3950 61355 257373 205841 203071 -97399 118326
12952 -52490 -30928 9819 352024 127294 -136636 102825 -264090 145857 62837 450512
12942 450512 147733 -14528 -132171 214021 411482 -19478 348390 17327 214960 23731
12931 144351 -59955 -65349 91187 267212 37016 233493 260643 -168799 26297 -7535 -94150
12920 -94150 266967 25873 -56246 142264 141872 134148 114098 1021 454862 -281088 -148458
$$ packed form
12999h7262E732L18655g2274e914F6464M59598g8378A190J25463m4560c3825C4914
12986A20555n1278j2378J8471K55308a4386D87570A95747b53216g4082A5174K42386
12975B57560O9084a83572A17610b5740G7190J86280m0810K03822B02774b15674
12964d0877A39178D1879a06772J3507c950F1355J96018n1532k770i7399A18326
12952e2490K1562I819L42205A27294a36636A02825b64090A45857F2837L87675
12942D50512A47733a4528j17643B14021J97461a9478C48390A7327J97633B3731
12931A44351e9955n394I1187J76025C7016J96477K7150a68799B6297g535q6615
12920i4150B66967B5873e6246A42264l92p724k0050A021M53841b81088J32630
$$ plain form
12909 -148458 213607 346389 269118 -120135 -148311 63355 36759 7072 -40738 134128 33383
12897 -219624 3946 135189 -81329 320112 127570 218429 -58876 52568 384041 -219125 302686
12885 235325 -442154 194239 -93945 195028 316686 539610 -181984 52760 245425 265378
12875 265378 -162724 270335 143698 223312 211259 -40720 -137165 116142 141950 234211 47639
12863 -72006 377889 43930 -139558 231893 381668 -12589 40000 225078 41008 125280 482
12851 -172796 273875 116362 -63003 146091 71529 237951 -23373 -337368 170774 -92883
12840 34529 8917 186825 220842 -16402 422128 -78617 -433 154915 184269 13012 62699 384598
12828 384598 27994 62709 216911 114610 18146 187136 116543 48243 40380 -130555 -55739
$$ packed form
12909a48458B13607J32782p7271a20135k8176F3355k6596G072d0738A34128C3383
12897b19624C946J31243h1329C20112A27570R0859e8876E2568L31473b19125C02686
12885B35325d42154A94239i3945A95028J21658K22924a81984E2760J92665J9953
12875B65378a62724B70335j26637P9614j2053d0720r6445A16142K5808R2261D7639
12863g2006C77889D3930a39558B31893J49775a2589D0000J85078D1008Q4272D82
12851a72796B73875A16362f3003A46091G1529J66422b3373l13995A70774i2883
12840C4529H917J77908L4017a6402D22128g8617d33A54915K9354A3012M9687L21899
12828C84598B7994L4715J54202j02301A8146J68990p0593D8243p863a30555e5739
$$ plain form
12816 317330 42077 -27717 170909 232257 116334 251121 -96824 97541 -136035 -180337 -76792
12804 -165641 27386 24790 29340 67712 123178 112557 158931 145318 3562 259641 75536 102925
12792 102925 139736 268822 86683 -8194 317072 446151 242354 76363 149721 9565 -52444
12780 -167640 -50208 201352 30290 -108298 6200 266193 -130887 -75997 -78374 31148 172508
12769 172508 -53177 25946 -441304 -119296 247809 -72081 -18160 3588 190325 45740 -347813
12757 -181349 77400 -37519 94242 231564 -161118 245736 120661 -38228 -24712 21961 78886
12746 78886 -17086 274290 -156797 34169 89191 271090 280947 -101705 30259 -85252 -22636
12734 -29556 -357921 57416 25355 109611 98500 -134370 19776 -45004 -63801 -36731 9706
$$ packed form
12816C17330D2077b7717A70909O1348j15923J34787i6824I7541a36035m4302g6792
12804a65641B7386k596M550L8372N5466j0621M6374j3613C562K56079G5536K7389
12792A02925L6811J29086H6683h194C17072J29079k03797G6363P3358I565e2444
12780a67640e0208B01352C0290a08298F200K59993a30887N4890k377C1148J41360
12769A72508e3177B5946d41304a19296B47809g2081a8160C588J86737D5740c47813
12757a81349G7400c7519I4242J37322a61118B45736A20661c8228J3516B1961N6925
12746G8886a7086B74290a56797C4169N5022J81899R857a01705C0259h5252b2636
12734b9556l28365E7416B5355Q4256j1111a34370A9776d5004j8797K7070I706
$$ plain form
12722 -17201 -57643 -112255 -276304 164282 290973 -86111 -58801 256953 48287 -82389 180582
12710 -74347 -63082 -103331 171430 -51476 -228745 117608 242 -5461 154704 94706 106156
12699 106156 -21817 43363 186190 -343774 -124056 -229021 149265 2708 -125323 31920
12688 -53850 -86429 86652 -73076 -93797 170226 121732 266232 -25145 9205 32790 -5749 48581
12675 -23208 422483 28400 -294289 87461 -68066 69371 174661 162164 214089 -158547 -50335
12663 312378 -81042 247405 -298577 75309 364479 -241251 299278 7000 -15211 269657
12652 -118493 215339 142259 79777 507478 -33900 -23322 189867 -127856 -2688 -102714 -75646
12641 -75646 303149 95956 -9099 -121335 24166 -76846 -124162 166011 -36767 -204832 43421
$$ packed form
12722a7201m0442n4612j64049A64282J26691h6111K7310B56953D8287h2389A80582
12710g4347J1265m0249A71430e1476j77269A17608B42e461A54704n9998J1450
12699A06156b1817D3363J42827c43774a24056j04965A49265B708a25323C1920
12688e3850l2579H6652g3076k0721A70226m8494J44500b5145I205K3585e749D8581
12675b3208D22483B8400b94289H7461f8066F9371J05290j2497N1925a58547e0335
12663C12378h1042B47405b98577G5309K89170b41251B99278G000a5211B69657
12652a18493B15339p3080o2482M27701c3900J0578A89867a27856b688j00026K7068
12641g5646C03149I5956i099j12236B4166g6846m7316A66011c6767j68065D3421
$$ plain form
12629 -205425 -176164 291100 -115379 237139 -17697 204546 -139948 71835 -217463 -230768
12619 -230768 270777 48323 164248 -2165 -24161 159254 -91951 166973 -86070 -8475 81107
12607 -63165 241576 105050 158134 30918 -184295 -163477 266604 135915 -57130 63929 -309708
12595 -99046 117825 -157590 4526 -72425 -122419 -278198 -39898 203608 -90472 198764 41761
12583 -198539 -29493 -6426 -283330 -81363 45742 452546 36011 -87316 199902 -112730 -349203
12572 -349203 -66310 141921 469029 168228 -242765 -18619 -85656 -140992 85851 -79972 -156521
12561 -156521 24379 61688 60414 -26968 184909 -152580 221221 -63107 27302 -74426 100296
12549 109084 -87953 -9714 -58079 50993 64901 -121317 109400 201225 -130505 166104 112710
$$ packed form
12629b05425K9261B91100a15379B37139a7697B04546a39948G1835b17463j3305
12619b30768B70777D8323J15925b165k1996A59254i1951A66973h6070h475H1107
12607f3165B41576A05050N3084C0918a84295K0818B66604j30689e7130F3929c09708
12595i9046A17825a57590D526g2425m9994j55779c9898B03608i0472A98764D1761
12583a98539b9493f426k76904h1363D5742M06804C6011h7316A99902a12730k36473
12572c49203f6310A41921L27108A68228b42765a8619o7037n5336H5851g9972p6549
12561a56521B4379L7309j274b6968A84909a52580B21221f3107B7302g4426A00296
12549A09084h7953i714m8365E0993J3908a21317A09400R1825a30505A66104n3394
$$ plain form
12538 112710 -155764 1234 131297 -22677 349447 128060 133171 -175305 189099 106079 -191638
12526 -237041 -165690 68824 109826 -471584 -57287 -198843 -10770 341843 92748 -269727 31507
12514 145555 101447 21515 -41075 204299 -15460 7948 -41663 47743 171637 33657 9997
12502 368487 -125873 83344 -60544 207952 151983 229086 66107 -201810 29395 -117432 56890
12490 -324684 25443 57857 178570 56534 -319115 -214764 157311 190027 258480 25091 -117916
12478 81917 7141 30206 -456097 -123875 40433 180308 39784 -90448 91580 -51481 8096
12466 299153 14042 88366 -5061 -81070 323108 174193 273173 -106389 49344 326072 342073
12455 342073 -130941 111562 -40928 -62893 -26584 -119474 -5422 -83846 31427 -482347 147665
$$ packed form
12538A12710a55764A234J30063b2677C49447A28060N111a75305A89099q3020a91638
12526b37041P1351F8824M1002d71584e7287j41556a0770C41843I2748b69727C1507
12514A45555m4108B1515d1075B04299a5460G948d1663D7743J23894C3657I997
12502C68487a25873H3344f0544B07952n5969P7103F6107b01810B9395a17432E6890
12490c24684B5443L2414J20713E6534c19115J04351A57311L2716O8453B5091a17916
12478H1917G141K3065d56097a23875D0433J39875C9784i0448I1580e1481H096
12466B99153A4042P4324e061p6009C23108j48915R8980a06389D9344K76728J6001
12455C42073a30941A11562d0928k1965b6584r2890e422p8424C1427d82347A47665
$$ plain form
12443 -104529 -78048 -159163 -22025 187469 -55244 -267453 -436035 3017 79753 -6982 8309
12431 -50201 157683 145652 -2608 156418 -44527 206842 -43619 188458 96981 84825 205035
12420 205035 169975 -134133 -190204 220618 181039 3745 -400050 126421 71502 211140 -30009
12408 108902 159359 -227549 -27576 -103928 232853 -51609 70012 162490 22873 106936 -34195
12396 -273733 95570 -258697 52635 209417 214089 -263137 47268 -113824 55965 291745 124134
12384 -35189 -132889 -65353 49650 -80958 -248895 95944 141899 -186144 -151452 78801 -74147
12372 85257 -246465 -111912 -21134 -80665 174798 464638 68551 139274 -153193 177321
12361 51664 187635 -96166 338148 -26884 -316147 -166411 100851 128684 23968 -113758
$$ packed form
12443a04529K6481q1115b2025A87469e5244k12209j68582C017P6736f982H309
12431e0201A57683j2031b608A56418d4527B06842d3619A88458r1477j2156J20210
12420B05035l5060a34133n6071B20618l9579C745d00050A26421n4919J39638c0009
12408A08902N0457b27549b7576p6352B32853e1609G0012R2478B2873Q4063c4195
12396b73733I5570b58697E2635J56782M672b63137D7268a13824E5965K35780A24134
12384c5189r7700f5353D9650h0958j67937I5944M5955a86144L4692G8801g4147
12372H5257b46465a11912b1134n9531A74798K89840F8551P0723a53193A77321
12361E1664J35971i6166C38148b6884k89263J49736A00851K7833B3968a13758
$$ plain form
12350 -186081 -67485 -333695 267205 101668 449984 141725 64561 -292831 237161 278321
12340 278321 120892 146907 172343 -180492 119140 14533 -67037 -20479 -143094 -82504 -193708
12329 -193708 176517 134619 -38362 -253704 160448 58011 236401 299508 25003 -199898
12318 -53681 -186445 25610 -134902 246514 315972 90201 84155 -413927 321066 -114563 -151063
12307 -151063 -303739 -12995 -75628 195107 14203 51257 47869 43905 -93554 61227 296093
12296 296093 -200240 14961 265787 7596 -31837 -107142 -472907 236630 -312970 -6016 177175
12284 142283 36284 -241150 -296831 -244672 226067 50978 -68164 188416 -171973 91738 340981
12273 340981 -14724 157573 -169661 428088 -237414 181061 207909 98993 -58241 49 -26672
$$ packed form
12350a86081f7485k66210B67205A01668L48316A41725F4561b92831B37161M1160
12340B78321A20892K6015K5436a80492A19140A4533f7037b0479j22615O0590j11204
12329a93708A76517m1898c8362k15342A60448E8011J78390O3107B5003a99898
12318e3681j32764B5610a34902B46514O9458I0201o046d13927C21066a14563l6500
12307a51063j52676a2995o2633A95107A4203L7054l388l964i3554F1227K34866
12296B96093b00240A4961K50826G596c1837p5305l65765B36630c12970f016A77175
12284A42283C6284b41150n5681N2159B26067E0978f8164A88416a71973I1738K49243
12273C40981a4724A57573a69661D28088b37414A81061K6848I8993e8241D9b6672
$$ plain form
12261 136540 -207268 26820 -74464 23368 -110006 171387 195152 -105526 228574 177465
12251 177465 104539 353120 114866 -9175 -69277 -109025 -33462 -38002 111000 92159 99921
12240 99921 128268 20933 17646 -92874 -244337 -129480 -35359 8451 194901 71354 385699
12229 385699 3765 -21498 65435 -531327 155832 -2470 55658 -243566 -251684 -16501 -157702
12218 -157702 26781 -73197 234218 -348297 -250011 212184 65939 -170305 51660 -31042 78305
12206 -315640 -224318 46510 182701 -194369 157549 -21966 -225003 -10567 315372 137593
12195 301231 -336992 -96185 -282958 64262 241284 -153269 103994 8878 176051 -281537
12184 -297497 -258285 -109041 -162615 -108545 -182636 -64103 25530 60566 -55739 -300810 22592
$$ packed form
12261A36540b07268B6820g4464B3368a10006A71387K3765a05526B28574n1109
12251A77465p2926K48581A14866i175o0102l9748c3462m540A11000j8841P762
12240I9921K8347B0933l287i2874j51463J14857c5359H451J86450G1354L14345
12229C85699C765b1498F5435e31327A55832b470E5658b43566q118a6501j41201
12218a57702B6781g3197B34218c48297R8286B12184F5939a70305E1660c1042G8305
12206c15640R1322D6510J36191a94369A57549b1966k03037a0567C15372A37593
12195C01231c36992i6185j86773F4262J77022a53269A03994H878J67173b81537
12184b97497L9212a09041n3574N4070p4091f4103B5530L5036e5739k45071B2592
$$ plain form
12172 179109 109334 207992 -63962 169828 -160378 -50108 51396 -83114 -196609 84353 -54094
12160 -89711 40109 141562 93271 272359 1801 253545 475173 -31479 201948 57429 204092
12149 204092 -58125 137054 189172 594595 819051 620615 1180323 2801784 2625172 1612042
12139 1612042 408867 686512 291071 -193803 23875 321196 -111733 51416 -125944 101294
12128 161848 68635 -41622 -68090 -43256 -125708 -40348 157202 -154591 -8024 -187213 28386
12116 325819 41554 -110723 -44364 -144784 78710 -17258 7882 -159059 178227 82273 -59743
12104 -54380 -10087 -170813 148158 233556 76822 -220318 169610 133213 206940 8265 70875
12093 70875 196053 -139537 47223 -52964 108957 131616 -112469 -124542 111440 -89271 147782
$$ packed form
12172A79109o9775R8658f3962A69828a60378e0108E1396h3114j13495H4353e4094
12160h9711D0109J01453m8291J79088A801K51744K21628c1479B01948E7429J46663
12149B04092e8125A37054N2118M05423K24456j98436N59708J621461j76612j013130
12139A612042D08867K77645B91071a93803B3875K97321a11733E1416a25944A01294
12128A61848F8635d1622k6468K4834q2452d0348A57202a54591h024j79189B8386
12116C25819D1554a10723d4364j00420G8710a7258G882a59059A78227H2273e9743
12104e4380a0087j60726A48158Q5398G6822b20318A69610l6397P3727H265O2610
12093G0875J25178a39537D7223e2964A08957K2659a12469j2073A11440h9271A47782
$$ plain form
12081 -48046 -250193 69922 -99912 136259 33910 72375 11442 -175685 128693 57537 73572
12070 73572 -173702 -49163 -165373 -172946 -213426 -188384 -116766 58068 -271601 -216314 -116604
12059 -116604 -174571 21037 10472 -31374 -64140 178259 -73380 40057 -136167 41175 240131
12048 240131 52169 108581 -51460 -12439 -234229 171347 -128072 -77854 85854 -135637 195761
12036 568825 61547 102530 49547 -156321 -18168 -248455 -61955 82453 -132773 34293 96434
12025 96434 215964 -33436 -99775 -226034 186163 -47491 -7758 70610 -64303 -57152 -267792
12014 -267792 119036 58465 -95810 -138119 299789 97611 212105 131978 -247957 138154
12003 22527 143037 47769 172886 46492 209788 -160082 -372308 -325625 -43549 -233939
$$ packed form
12081d8046k02147F9922i9912A36259C3910L8465A1442a75685A28693E7537J6035
12070G3572a73702d9163j16210p573m0480K5042P1618E8068b71601N5287R9710
12059a16604n7967B1037A0472c1374l2766A78259g3380D0057a36167D1175J98956
12048B40131E2169N6412e1460a2439k21790A71347a28072N0218H5854a35637A95761
12036E68825F1547M0983D9547a56321a8168k30287f1955H2453a32773C4293O2141
12025I6434J19530c3436o6339j26259A86163d7491g758G0610f4303P151k10640
12014b67792A19036E8465i5810m2309B99789I7611J14494q0127b47957A38154
12003B2527J20510D7769J25117D6492J63296a60082k12226M6683d3549j90390
$$ plain form
11993 -233939 -87607 -4581 317548 171222 77777 88140 -84372 -119523 48240 -222132 7067
11981 79017 101392 206308 218240 -100171 39473 -153679 219813 169535 160190 -198975 -31116
11969 -379346 -176879 -46498 -50142 -97794 184602 -100590 139832 -45355 -155797 -81473 294453
11957 -265453 150876 170553 234679 -23903 -604002 159051 -55025 -283887 214116 -61886
11946 -75362 -82836 -139049 -77818 -172866 -61537 77517 49617 78639 -449875 216505 101211
11934 232046 -147526 -142289 -406511 130510 -100204 -46415 -256469 169952 -351002 224660
11923 -76777 -3607 253445 235563 15957 -152478 347626 233130 -122029 85697 127618 58543
11911 -67627 84702 67866 26272 69531 -56997 -110859 -239014 -259652 -108895 -236346 440320
$$ packed form
11993b33939h7607d581C17548j46326G7777J0363h4372l5151D8240b22132G067
11981G9017K2375J04916J1932a00171C9473a53679B19813n0278r345a98975c1116
11969c79346a76879d6498l644m7652A84602a00590A39832d5355j10442P4324B94453
11957b65453A50876J9677O4126b3903n80099A59051e5025k28862B14116f1886
11946g5362p474n6213O1231r5048f1537G7517k7900K9022d49875B16505A01211
11934B32046a47526N237k64222A30510a00204d6415k10054A69952c51002B24660
11923g6777c607B53445j7882A5957a52478C47626j14496a22029H5697M1921E8543
11911f7627H4702j6836B6272M3259e6997n3862j28155k0638a08895j27451D40320
$$ plain form
11899 -16309 208002 -7209 -5770 -144608 -9459 202421 -153384 42530 117812 -58380 126519
11887 -329656 71474 -241645 -228933 51547 249472 -262043 -44576 -42205 -474696 -61527 -213779
11876 -213779 -69775 -98987 -146852 -289196 -180822 229396 95796 -148751 -137934 56049 -402581
11864 171798 -43637 24658 -31196 -286036 124346 -116726 -376564 -69586 -312932 10102
11853 -267947 -108658 156409 -48186 223101 283570 94567 -75642 130384 63947 69375 -10313
11841 288492 -137866 -210067 -76945 119780 -95162 -19495 -6754 135009 3406 -18721 -156787
11830 -156787 -101225 -13905 217837 352404 95075 -23843 -192197 -257209 264896 68294 -168467
11818 31296 40601 -92765 237146 -42451 477111 -32192 -50010 -210081 15631 -75219 201104
$$ packed form
11899a6309B08002g209J439j38838i459B02421a53384D2530P5282e8380A26519
11887c29656G1474b41645J2712E1547J97925b62043d4576K371m32491f1527j52252
11876b13779f9775k9212m7865j42344J08374B29396I5796a48751J0817E6049d02581
11864A71798d3637B4658c1196k54840A24346a16726k59838f9586k43346A0102
11853b67947a08658A56409d8186B23101O0469I4567g5642A30384F3947N428a0313
11841B88492a37866p2201g6945A19780i5162a9495f754A35009C406a8721j38066
11830a56787N5562a3905B17837J34567I5075b3843j68354o5012B64896F8294a68467
11818C1296R305i2765B37146d2451D77111c2192j7818j60071A5631g5219B01104
$$ plain form
11806 -167394 4946 -35589 -235739 169186 28570 -260945 -407667 -112704 -52532 -269652
11796 -269652 -233489 64693 13462 -160473 -47758 124113 -70148 -312651 88460 12961 -118923
11784 -44858 98268 -178006 -21808 157917 -1311 52076 -77505 -209564 -360444 63813 -175439
11772 280497 -24011 -176027 2368 -247078 310510 274266 72673 227355 238844 -187173 333439
11760 24438 -44584 -156337 23533 34127 -36018 -52600 -170987 129388 397099 -279768 83042
11748 102520 183701 100686 131555 47148 -159051 -18862 47484 -315517 -135242 -44277 -195554
11737 -195554 -108115 -275630 -14445 327455 -384350 -190037 -153452 48690 -122273 139833
11726 527071 -142636 319992 -16199 -63960 155809 -307010 -57303 -81682 246199 -74414
$$ packed form
11806a67394D946c5589k00150A69186B8570b60945j46722a12704e2532k17120
11796b69652L6163F4693A3462a60473d7758A24113g0148k42503H8460A2961a18923
11784d4858I8268a78006b1808A57917a311E2076g7505j32059j50880F3813a75439
11772B80497b4011j52016B368b47078C10510l6244G2673J54682J1489a87173C33439
11760B4438d4584j11753B3533J0594c6018j6582j18387A29388K67711b79768H3042
11748A02520Q1181q3015L0869D7148a59051a8862D7484c15517a35242d4277j51277
11737a95554Q7439j67515a4445C27455c84350a90037L6585D8690a22273A39833
11726E27071a42636C19992a6199m7761A55809c07010e7303k4379B46199g4414
$$ plain form
11715 114745 -20935 174678 -227949 -180154 109286 -477179 170225 -265029 -37927 120949
11704 67660 39734 130911 -53692 136917 -42100 61110 -111560 -48288 -199529 -25158 -60445
11693 -60445 -166013 -240170 -28061 50900 12119 101610 111758 122834 145121 -135902 -89534
11682 -89534 -90582 -193986 71265 14841 51305 244817 8269 123637 -180774 -142567 125795
11670 -80444 55956 55057 -52296 -191629 133660 -125752 -2431 218851 -204950 9324 256341
11659 256341 33301 104234 -31215 181209 -93558 123059 -24524 19497 -37861 -108792 87806
11647 -162094 -61724 319826 -210751 -10538 131673 -301088 -281116 -16384 251640 188624
11637 188624 116208 -199897 -172746 1356 291720 92666 65965 119754 -411091 -109169 -425672
$$ packed form
11715A14745b0935A74678b27949M7795A09286d77179A70225b65029c7927A20949
11704F7660k7926R1177e3692A36917d2100F1110a11560d8288j51241b5158l5287
11693f0445j05568p4157b8061E0900A2119Q9491J0148J1076K2287a35902M6368
11682h9534j048j03404G1265A4841L6464J93512H269J15368a80774L8207A25795
11670h0444E5956q99e2296j39333A33660a25752b431B18851b04950I324K47017
11659B56341C3301P0933c1215A81209i3558A23059b4524A9497c7861p0931H7806
11647a62094f1724C19826b10751a0538A31673c01088J9972a6384B51640o3016
11637A88624p2416a99897K7151A356K90364I2666k6701N3789d11091a09169l16503
$$ plain form
11626 -425672 33512 70040 -23194 52350 7702 -113948 -257740 120320 156418 -132804 -113532
11615 -113532 -125090 -196899 -157672 -58026 110716 -14526 281900 -219384 143064 154003 -354830
11603 -169515 -151190 50016 256242 49858 -253362 -116192 189696 50997 -83503 -93688 -19886
11591 -185592 -255002 56264 94188 -90457 97248 159764 113990 -121319 101849 429421 167029
11579 33608 44229 -330830 -66030 -5610 142809 263617 248280 -3419 -75204 -236535 -77559
11567 53353 265083 -258512 -364299 89967 -144159 -199338 -373654 -105639 112758 190801
11557 190801 55671 102935 107914 161073 -181783 90455 148971 -170348 66692 -151833 51980
11545 102024 -20643 55036 94099 -17756 -67744 274084 211088 -285458 -25567 -187838 31287
$$ packed form
11626d25672C3512L6528b3194E2350G702a13948j43792A20320L6098a32804J9272
11615a13532j1558p1809L9227e8026A10716a4526B81900b19384A43064J0939c54830
11603a69515J8325E0016K06226D9858b53362a16192A89696E0997h3503j0185a9886
11591a85592o9410E6264L7924i0457I7248O2516m5774a21319A01849L27572A67029
11579C3608J0621c30830f6030e610A42809J20808j5337c419p1785j61331g7559
11567E3353K11730b58512j05787H9967a44159n5179j74316a05639A12758P8043
11557A90801E5671M7264M979N3159a81783I0455N8516a70348F6692a51833E1980
11545A02024b0643E5036L9063a7756m9988B74084o2996b85458b5567j62271C1287
$$ plain form
11533 103442 -243726 17687 -132535 -261553 -15001 -61086 -86757 -258898 -39571 -27168 440
11521 52232 41376 415483 -184203 -123571 -110815 235005 -116725 81479 -168579 -134443 32007
11509 -240010 -380100 80440 -67129 140302 233122 -46113 -109933 174710 36718 -232567 -182227
11498 -182227 30375 -189798 -72524 -57415 236861 147171 157884 -204694 36322 91813 11413
11486 -29235 80840 -9158 -290548 172068 92526 48207 -70756 -180345 -118021 65119 -155298
11474 173055 -101607 141379 -9772 -189756 -5661 15944 272785 -21133 -58407 -185217 -18965
11462 -81193 21232 20420 -177395 -163446 12527 325953 -44877 129844 116227 26071 299897
11451 299897 57443 66171 39613 273472 27084 56429 184330 198035 -310574 29 -269576
$$ packed form
11533A03442b43726A7687a32535j29018a5001m6085k5671j72141c9571J2403D40
11521E2232j0856L74107a84203O0632J2756B35005a16725H1479a68579L4136C2007
11509b40010j40090H0440f7129A40302R2820d6113o3820A74710C6718b32567N0340
11498a82227C0375a89798g2524J5109B36861q9690J0713b04694C6322N5491A1413
11486b9235H0840i158k81390A72068p9542m4319g0756j09589O2324F5119a55298
11474A73055a01607A41379i772j79984e661A5944K56841b1133l7274j26810a8965
11462h1193B1232q12a77395J3949A2527L13426d4877A29844j3617B6071K73826
11451B99897E7443Q728k6558K33859B7084K9345J27901J3705c10574B9b69576
$$ plain form
11439 -287873 -134244 249198 -172444 -218276 31952 -239665 7578 -150479 -33825 127923
11428 219234 84996 108761 96761 216645 -248382 129548 -165389 192017 -44387 -18840
11417 -181220 249448 96399 213235 276763 -165602 44168 386047 -178682 -203508 -71193
11406 -236291 13333 50804 76703 -333872 146958 304414 -73039 -187608 -60804 74887 29825
11394 -26259 -24355 318035 -174311 149675 -22694 283486 169056 -379359 282557 50720
11383 129769 -116871 -104098 53936 219819 106067 123389 -267646 72081 109503 -70920 -225885
11372 -225885 115913 202372 74029 18703 129851 202267 16152 84501 154740 66732 58102
11361 58102 99241 128726 -117552 -166178 202105 -158130 -210245 215723 -25368 -227368 22568
$$ packed form
11439b87873a34244B49198a72444m5832C1952b39665G578a50479c3825A27923
11428B19234H4996K3765j2000J19884b48382A29548a65389A92017d4387a8840
11417a81220B49448I6399J16836O3528a65602D4168L41879a78682k4826g1193
11406b36291A3333L7471K5899c33872A46958J57456g3039j14569f0804G4887B9825
11394b6259J904C18035a74311A49675b2694B83486j14430c79359B82557E0720
11383A29769a16871J2773E3936J65883A06067J7322b67646G2081L7422g0920j54965
11372b25885A15913Q6459G4029A8703J11148P2416A6152O8349P0239F6732q630
11361E8102M1139K9485a17552m8626B02105a58130n2115B15723b5368k02000B2568
$$ plain form
11349 133061 -231047 -17835 -27534 -26957 189790 -195537 -54274 356073 25496 -11821 -2802
11337 -402324 45741 135434 -138560 339877 84975 -197982 -47297 -10869 -77258 44951 231825
11326 231825 -163758 34595 -234316 -540412 -217336 187814 7965 -138916 -169252 -114863
11316 -114863 8511 108992 -247777 -161031 -72382 -83742 -112907 43251 -8790 60320 -63061
11304 163040 104225 -171631 189952 -162555 349132 -186153 -18024 195182 -216590 -162986
11294 -162986 64773 -464038 -238957 196748 -61797 127890 -76050 150475 -103428 -130290
11284 -130290 -228302 -195655 79560 376433 -301263 98862 -12515 -98990 -180067 130891 -145695
11272 -272450 -451917 59953 3570 88992 -200568 -195184 284381 -349994 6307 217790 -75670
$$ packed form
11349A33061b31047a7835r699N77A89790a95537e4274C56073B5496a1821b802
11337d02324D5741Q9693a38560C39877H4975a97982d7297a0869o6389D4951J86874
11326B31825a63758C4595b34316l06096b17336A87814G965a38916l0336N4389
11316a14863H511J00481b47777Q6746g2382j1360k9165D3251h790F0320f3061
11304A63040n8815a71631A89952a62555C49132a86153a8024A95182b16590N3604
11294a62986F4773d64038K25081A96748f1797A27890g6050A50475a03428k6862
11284a30290r8012L2647G9560K96873c01263I8862a2515q6475q1077A30891a45695
11272b72450j79467E9953C570Q5422b00568N384B84381c49994F307K11483g5670
$$ plain form
11260 -8116 -2081 128435 51916 116921 259894 105955 -119824 -206722 -247827 -9202 -113363
11249 -113363 211680 13803 60278 -163285 252163 -136614 55542 -459899 -396036 115137
11238 -315554 97248 -78712 -148753 93498 -354034 -15829 -84530 -73235 -201152 -167408 -47839
11226 -190223 -101907 13660 -12382 -154532 -20141 215393 -326312 71659 -140670 -218649 -92489
11214 68851 69773 166933 -35052 36977 59601 -48000 195928 285979 71271 179858 -91071 187216
11201 27756 49594 -118963 141859 -135959 108632 95665 -17640 -24272 216829 -46154 272325
11189 -17037 -6545 310629 70863 9360 -3191 -138079 -27219 119719 280491 -199131 212670
11177 -56901 96211 -188329 -129417 -1608 -378385 -44006 -94790 129902 185403 -74447 187774
$$ packed form
11260h116b081A28435E1916O5005J42973A05955a19824q6898m1105i202j04161
11249a13363B11680A3803M6475a63285B52163a36614E5542d59899O3863A15137
11238c15554I7248g8712p0041I3498c54034a5829o8701J1295j27917L3744d7839
11226a90223Q8316A3660a2382j42150b0141B15393c26312G1659a40670p7979i2489
11214F8851R22R7160c5052C6977K2624d8000A95928R0051G1271J08587i1071A87216
11201B7756K1838a18963A41859a35959A08632j2967a7640o632B16829d6154B72325
11189a7037f545C10629G0863I360c191j34888b7219A19719J60772a99131B12670
11177e6901I6211a88329N8912a608l76777d4006n0784A29902N5501g4447A87774
$$ plain form
11165 69797 355675 209295 130513 -66299 -134786 40636 -183309 -57973 43436 9407 -77704
11153 -366491 51233 139113 -329043 -166190 -26936 112361 101437 -318186 -336234 3162 -161122
11141 189501 -42444 131476 -80019 -87234 79729 177538 23850 4621 -14959 95834 -245083
11129 -80106 -43704 131399 -100063 -183810 -40901 349610 176899 -60986 -194709 -16040 -26290
11118 -26290 -365423 -91294 107375 -23823 3418 58172 -197833 -12569 7208 70700 53861
11107 53861 -109225 162657 -306482 106168 -269900 -293062 137037 -183257 -83537 -294731
11097 -294731 -24922 13102 -117722 38125 -387219 4495 -86 68733 -133597 268828 310246
11086 310246 199467 204642 232322 -168462 -49943 87110 -102578 -137667 -188169 318490 -443204
$$ packed form
11165F9797K85878j46380p8782f6299o8487D0636a83309e7973D3436I407g7704
11153c66491E1233Q7880c29043J62853b6936A12361j0924c18186j8048C162a61122
11141A89501d2444A31476h0019p215G9729R7809B3850D621a4959I5834b45083
11129h0106L6402A31399a00063q3747d0901C49610j72711f0986j33723a6040j0250
11118b6290l39133i1294A07375b3823C418N4754a97833a2569G208O3492j6839
11107E3861a09225A62657c06482A06168b69900k3162A37037a83257h3537k11194
11097b94731b4922A3102a17722C8125c87219D495h6F8733a33597B68828M1418
11086C10246j10779N175K7680a68462d9943H7110a02578l5089n0502C18490d43204
$$ plain form
11074 514 57312 -73040 64766 -69205 248073 -231033 362235 153146 27966 193824 -27233
11062 105796 159954 -453419 -129724 62714 151657 46736 -41980 219860 -374076 146992
11051 139749 -103667 -182060 -26838 -42559 -368257 -223863 -55084 -61588 147393 -55407 27885
11039 -120711 -466876 -72475 87102 -85241 -145429 153017 -342637 -147427 -71216 -170595 261006
11027 9097 21336 -146552 -270838 -127732 -335070 -90210 -4760 84837 -152597 -84492 -288001
11016 -288001 65517 -55534 115477 -103352 -133065 -143320 -106843 -123916 -84059 45588 -147756
11004 284378 -241728 -42529 83157 -224164 -37616 -217643 -93543 -196585 -272367 -351219 108118
10992 -111507 -79882 220967 47826 26815 43581 -197002 255999 -55915 29923 -122161 161392
$$ packed form
11074E14N6798g3040F4766f9205B48073b31033C62235A53146B7966J65858b7233
11062A05796N4158d53419a29724F2714Q8943D6736d1980B19860c74076A46992
11051A39749a03667p8393b6838j5721l25698J44394e5084o504A47393e5407B7885
11039a20711l46165g2475H7102h5241o0188A53017c42637a47427g1216r9379B61006
11027I097J2239a46552j24286a27732k07338i0210d760H4837a52597O8105k03509
11016b88001F5517e5534A15477a03352k9713j0255L6477j7073L9857D5588a47756
11004B84378b41728d2529H3157b24164c7616j80027i3543j03042p5782p8852A08118
10992a11507L1625B20967D7826k1011J6766a97002B55999e5915B9923a22161A61392
$$ plain form
10980 -81484 245236 63622 35568 127954 65553 101730 -225058 -14195 110757 79279 -145907
10968 40317 -84819 13152 28262 102672 -61988 89886 -1103 95922 -44814 43584 -269544 91658
10955 290396 97830 24354 229002 194046 -325826 159295 90905 86554 50628 12769 -239282
10943 22036 -248278 268525 6424 126684 51164 17370 184264 -210799 -555367 -34493 322848
10931 -79845 -253798 -49388 -203859 156661 -63884 -83714 -206649 35497 1486 365922 -53601
10919 -319301 37319 -34480 -203938 149604 -316480 -241444 92742 -160151 46514 18224 -205554
10907 56726 309077 -392749 82103 -205086 -224730 168252 249490 261118 204545 -60119 -152164
10896 -152164 -120511 91612 110294 -116658 41934 -47186 62788 284735 21501 15879 -300634
$$ packed form
10980h1484B45236F3622k8054R2386o2401L6177b25058a4195A10757l1478a45907
10968D0317h4819A3152J5110P4410f1988H9886a103I5922d4814D3584b69544I1658
10955B90396I7830B4354K04648l4956c25826A59295o8390m351l5926A2769b39282
10943B2036b48278B68525F424J20260E1164A7370J66894b10799l44568c4493C22848
10931g9845j73953d9388j54471A56661f3884j9830j22935C5497A486L64436e3601
10919c19301C7319c4480j69458A49604c16480P5036I2742a60151D6514A8224b05554
10907E6726K52351c92749H2103b05086j9644A68252Q1238J1628n6573f0119r2045
10896a52164L1653I1612J8682a16658D1934d7186F2788K21947B1501n622c00634
$$ plain form
10884 -228339 43771 -236522 163881 98555 509116 -246183 -144136 -409300 -103239 -275981
10874 -275981 110964 257903 62571 98633 9399 -156498 -129054 -115966 -202347 225952 -60312
10862 -362956 36180 37273 79651 -60097 -17271 32489 -75374 21265 154680 17802 -264994
10850 -182237 -62333 146850 7443 -26982 -205142 -111266 -158427 -59025 -49891 -125782 -151751
10839 -151751 -241710 -165801 30910 250338 -550 -52519 264910 -238577 391779 -177654 -65177
10827 139691 -19102 -225882 270169 9701 38814 53332 -83254 -2250 -26106 257204 -89370
10815 -105921 41093 42241 85707 190354 -99103 44364 -226372 63477 -21082 -10303 -413814
10804 -413814 227835 -88699 21026 88237 110419 -24307 -21765 -8589 -8871 -135814 -346637 -538619
$$ packed form
10884b28339D3771b36522A63881o5326M10561b46183J02047k65164a03239j72742
10874b75981A10964J46939F2571L6062I399a56498K7444J3088q6381B25952f0312
10862c62956C6180J093M2378f0097a7271C2489g5374B1265J33415A7802b64994
10850a82237f2333A46850G443b6982j78160R3876m7161e9025R134p5891k5969
10839a51751q9959P5909C0910K19428e50n1969B64910b38577C91779a77654f5177
10827A39691a9102k06780B70169I701K9113J4518h3254b250k3856B57204h9370
10815a05921D1093J148M3466J04647i9103D4364b26372F3477b1082a0303m03511
10804d13814B27835h8699B1026O7211K2182b4307K542h589k82j26943k10823j91982
$$ plain form
10792 -538619 69808 -229582 -256655 -198034 30247 -109215 -35694 -560727 -200244 -138093 29089
10780 -33676 184764 140790 -19657 -57298 -211337 -7167 193111 -239804 309553 -126398 -48371
10768 -56322 -234246 -131955 -43371 20844 354661 -288175 129425 -199458 -54555 -244906
10758 -244906 171762 130189 -84424 25669 10348 301482 162398 2265 -170192 96865 -129002
10746 -300299 75384 -100901 -60411 -379335 -103946 35942 131639 -165181 -76329 -334509
10736 -334509 -139684 -8294 179923 80515 -374927 68827 -134705 20049 -298985 -139556
10725 156021 286780 245870 -113520 -50882 139819 143585 228438 -9297 -92539 -117017 -218238
10714 -218238 -38567 -78865 32279 76528 93147 -384926 -154599 -512358 -25712 -588139 -250192
$$ packed form
10792e38619F9808b29582k7073N8621C0247a09215c5694n25033b00244O2151B9089
10780c3676A84764m3974a9657l7641j54039g167A93111b39804C09553a26398d8371
10768e6322j77924J02291d3371B0844L33817b88175A29425a99458e4555j90351
10758b44906A71762m1573h4424B5669A0348K91134j39084B265a70192I6865a29002
10746c00299G5384a00901M0490l18924a03946C5942R5697a65181g6329k58180
10736c34509a39684h294A79923H0515c74927F8827a34705B0049b98985a39556
10725A56021J30759m0910a13520e0882A39819L766Q4853i297q3242k4478j01221
10714b18238c8567m0298C2279M4249J6619c84926a54599l57759b5712n62427b50192
$$ plain form
10702 23353 111566 143918 92119 -135956 58236 239895 34703 171057 78221 -74508 -231963
10691 -231963 -11072 -247367 -51192 -198524 -171899 -29870 -209718 -129814 8883 100787 30318
10679 -116721 -79359 86959 -289118 -16495 -50337 -365920 110047 17320 -24156 -56133 78565
10667 -289601 -313447 -85294 -155161 -190359 133158 127847 -22304 126995 -26599 29835 62927
10656 62927 204821 -244310 -166631 -16231 133944 -273229 -233814 151044 -153138 -17347
10645 92071 192211 31117 -66027 52436 180052 171169 376678 -26772 289633 49765 26302
10634 26302 -188182 224872 86629 -49817 -400585 423 171529 -316211 185292 22057 24502
10623 24502 -32591 -140804 99386 30990 -243594 -202780 69358 -78821 218315 -325879 43980
$$ packed form
10702B3353Q8213L2352n1799a35956E8236J81659C4703J36354G8221g4508j57455
10691b31963a1072k36295e1192j47332K6625b9870j79848P9904H883R1904C0318
10679a16721L7362H6959b89118a6495l3842l15583A10047A7320b4156l1977G8565
10667b89601k3846h5294o9867l5198A33158n311b2304A26995b6599B9835L3092
10656F2927J41894b44310P7679a6231A33944b73229L9415A51044a53138a7347
10645I2071J00140C1117f6027E2436J27616q883K05509b6772B89633D9765k3463
10634B6302a88182B24872H6629d9817l50768D23J71106c16211A85292B2057K445
10623B4502c2591j08213I9386C0990b43594M0814F9358g8821B18315c25879D3980
$$ plain form
10611 460359 -189463 -159527 75656 -77130 -102323 -364146 -60524 64995 51931 -70656 148000
10599 136232 129864 97076 -91337 14989 -74739 132902 112367 -67169 -149504 103625 136652
10588 136652 -58260 -76303 -238121 -58165 -40032 137350 323725 -115240 -190724 -141342 -183409
10577 -183409 21454 -58576 -17496 242714 -205003 -105938 121730 24967 -58552 -292921 50262
10565 -13786 161006 -121268 -39336 -184786 24221 -143887 -54485 320477 210833 136647
10555 136647 130947 4759 8427 -2963 -112343 220532 -72457 -61246 -291124 -87714 -254657
10544 -254657 154703 -32141 -400703 19118 -47767 -187962 183157 216604 -182923 207186
10533 -279892 -338639 25669 -16663 -26961 -265987 -208531 436527 -5901 -78903 -13111 -6275
$$ packed form
10611D60359a89463K9936G5656g7130k5193k61823f0524F4995j3064g0656A48000
10599A36232o368l2788i1337A4989g4739A32902k0535f7169q2335A03625L3027
10588A36652e8260j8043j61818e8165J8133A37350J86375a15240p5484M9382m2067
10577a83409B1454e8576a7496B42714b05003R9065A21730B4967e8552k34369E0262
10565a3786A61006a21268c9336j45450B4221a43887e4485C20477j09644p4186
10555A36647n700D759L668b963j09380B20532g2457J1211k29878h7714j66943
10544b54657A54703c2141l68562A9118d7767j40195A83157L3447a82923B07186
10533b79892n8747B5669a6663j0298k39026N7456D36527e901p3002a3111f275
$$ plain form
10521 -507651 -206970 -35873 94753 -118142 -107498 8309 -23715 41984 -127070 -145347 -9464
10509 -68221 -326568 141477 -84157 -46805 11381 -252058 -30720 290689 55115 166464 -12929
10497 8599 144927 39708 -213163 21315 351738 24734 169173 18401 100601 79095 47305
10486 47305 56693 -167380 -15566 -64087 -59330 -64230 -97156 -141776 -56499 -159147 -405212 -57996
10473 178916 163751 -154916 -218753 -226107 -206960 -195617 -19903 -212761 92253 58411 10146
10461 104059 107114 -16445 -221502 -16263 -290677 -185939 -170133 -197520 168170 310948 -136227
10449 -49351 51490 -72415 -153394 76144 -381460 -190682 35319 -81486 -246961 -88024 138091
10437 9041 35419 -9323 -99078 20180 -334179 63172 -96179 -194916 224184 51895 325768
$$ packed form
10521e07651b06970c5873I4753a18142J0644H309b3715D1984a27070j8277i464
10509f8221k58347A41477h4157L7352A1381b52058c0720B90689E5115J11349a2929
10497H599J36328C9708b13163B1315L30423B4734J44439A8401Q2200k1506l1790
10486D7305R388a67380a5566m8521M757m900l2926m4620e6499j02648k46065e7996
10473A78916j5165a54916o3837p354J9147J1343a9903j92858I2253l3842A0146
10461A04059L055a6445k05057a6263k74414J04738J5806k7387A68170J42778a36227
10449d9351E1490g2415q0979G6144c81460a90682C5319h1486j65475h8024A38091
10437I041K6378i323q9755B0180c34179F3172i6179r8737B24184E1895K73873
$$ plain form
10426 325768 189298 -157824 322286 7114 92306 -240674 50731 -31557 45085 -138935 100283
10414 29620 -108448 -10481 -225451 -429102 -71447 -188113 -281830 -3949 296202 -8117 -379973
10403 -379973 -307710 -19178 -123290 50114 103681 -144436 159065 -175441 -54099 60848 8110
10391 -138395 -373900 -298476 134251 -198109 -83681 -201350 43062 84063 16769 -338604
10380 -145388 -59459 -60492 133980 -49878 -140598 174255 -153032 -446222 -255142 -180512 -64825
10368 -3031 -40173 -27745 -2970 65324 98545 151426 54786 -351657 -69907 -104784 354973 349265
10356 349265 -147174 10843 38138 -70766 110600 -126191 307903 -286310 -6777 -90536 -48166
10345 -48166 107713 379822 145854 264822 191623 -125262 9451 17466 -184893 -93359 -29843
$$ packed form
10426C25768j36470a57824C22286G114Q5192b40674E0731c1557D5085a38935A00283
10414B9620a08448a0481k14970k03651g1447j16666r3717c949B96202h117l71856
10403c79973P2263a9178j04112E0114N3567a44436A59065a75441e4099F0848H110
10391a38395k35505P5424A34251a98109h3681j17669D3062M1001A6769c38604
10380a45388e9459j033A33980d9878r0720A74255a53032k93190J91080P4630f4825
10368c031l7142J2428b970F5324L3221N2881E4786c51657f9907l4877C54973n708
10356C49265a47174A0843K7295g0766A10600a26191C07903b86310f777q3759M2370
10345d8166A07713K72109A45854J18968p3199a25262I451Q015a84893R1534b9843
$$ plain form
10333 216386 -107473 167921 60803 105655 -263244 101760 -403084 -133898 -9709 32385
10322 -364748 42274 -358844 193309 -172818 -197427 302750 231635 219441 -95845 -495842
10312 -495842 193497 188519 -74869 -127207 313787 103358 10058 -69819 -345111 123254 -245012
10300 -310473 57102 20826 -150159 -309764 -57650 315584 98643 -112306 -7031 -210876 177667
10288 -274093 -81475 -142913 58460 13851 88222 356972 -19087 -94038 -96634 -438078 -124682
10276 83633 -37194 56586 -129884 -103697 -215760 240329 212113 -212183 -34751 56384 -147122
10264 -356830 -25423 -61564 -73121 -61049 -30922 -7198 39796 -148891 684 -112816 -83802 -327350
10252 -327350 154085 -192208 334158 28534 130281 361493 -14465 -318739 -34220 44938
$$ packed form
10333B16386a07473A67921F0803M4852b63244A01760d03084a33898i709C2385
10322c64748D2274c58844A93309a72818k4609C02750p1115j2194i5845l99997
10312d95842A93497m978g4869n2338C13787A03358A0058f9819k75292A23254b45012
10300c10473E7102B0826a50159j59605e7650C15584I8643a12306g031k03845A77667
10288b74093h1475o1438E8460A3851P4371K68750a9087p4951k596l41444a24682
10276H3633c7194E6586a29884K6187j12063B40329k8216b12183c4751E6384a47122
10264c56830b5423l6141j1557J2072L0127g198C9796a48891F84a12816K9014k43548
10252c27350A54085a92208C34158B8534J01747K31212a4465l04274c4220D4938
$$ plain form
10241 17659 276287 -201513 122006 183014 3701 117828 -367647 70602 235856 8271 -34254
10229 -143921 -174335 -341861 117449 76798 -130721 -246948 67509 38706 160206 -149841
10218 -140457 -137217 384275 67509 207770 49958 -233153 174847 -322656 -268027 -96231 95903
10206 157703 -246428 48852 -32920 26326 143507 -8873 -72020 270151 42870 -284998 67895
10194 124943 -373563 12847 -233140 23180 -9127 164832 -114965 -66951 92859 -157186 -113276
10183 -113276 50244 29289 250440 -34768 -301064 210439 -95250 -317265 -118205 14206
10172 111127 -332338 127915 -237544 39620 168666 -189111 122949 -80875 97387 -55917
10161 -97163 -224944 77070 -30109 144167 144029 -375753 -25553 -199665 -290625 -39477 211067
$$ packed form
10241A7659K58628b01513A22006O1008C701J14127c67647G0602J65254H271c4254
10229a43921l0414j67526A17449m0651a30721j16227F7509k8803J21500a49841
10218a40457L240C84275F7509J40261D9958b33153A74847c22656N4629i6231I5903
10206A57703b46428D8852c2920B6326J17181h873o3147B70151D2870b84998F7895
10194A24943c73563A2847b33140B3180i127A64832a14965M8014I2859a57186M3910
10183a13276E0244k0955K21151c4768k66296B10439i5250k22015a18205A4206
10172A11127c32338A27915b37544C9620J29046a89111A22949h0875I7387e5917
10161i7163j27781G7070c0109A44167j38c75753b5553j74112r0960c9477B11067
$$ plain form
10149 -219779 87940 -191426 8960 -337873 -154656 -38769 -280878 -32196 -104566 -86674 -281419
10138 -281419 -122144 -92020 267429 -37164 11486 188498 -247943 130900 13989 -113208
10127 271879 -8550 -368511 40627 194216 -1434 -178002 -231336 65302 -167557 -216099 -30797
10115 220980 82462 60833 -531997 61106 -148975 -126824 -48829 8126 110859 138168 199846
10104 199846 -17160 82771 -137378 -408214 142284 -143267 81379 -206810 -115501 69345
10093 110983 -84455 -101507 -325948 -160571 -11115 215098 -136935 -291515 335892 -56340
10082 -19239 109198 398645 214477 64532 131408 7856 -221761 43479 298970 -56898 209378
10070 -259461 49487 106733 431438 65040 -239236 -163532 201873 -224201 175013 -138068
$$ packed form
10149b19779H7940a91426H960c37873a54656c8769k42109c2196p2370J7892j94745
10138b81419a22144L0124B67429c7164A1486J77012b47943A30900A3989a13208
10127B71879h550l59961D0627J53589a434j76568n3334F5302a67557m8542c0797
10115B20980H2462k1629e31997F1106a48975K2151d8829H126J02733K7309O1678
10104A99846a7160H2771a37378k70836A42284a43267H1379b06810R1309F9345
10093A10983h4455j7052k24441a60571a1115B15098a36935j54580C35892e6340
10082a9239A09198K89447j84168F4532O6876G856b21761D3479K55491e6898B09378
10070b59461D9487N7246L24705F5040b39236P5704B01873b24201A75013a38068
$$ plain form
10059 -296165 43122 -176503 27175 -153529 236809 -83023 314593 -208614 -241515 23985
10048 119094 -12737 -7501 -87997 199841 221193 10053 123572 -70274 91711 181001 -155417
10036 57214 76997 -112673 -192345 -256409 143935 -179291 204393 -266908 28122 -286984
10025 -309007 -204052 85121 -162089 -21777 -171425 23559 -355973 -49592 82531 -367569
10014 92047 163224 -102423 114234 281383 -253364 -203904 -461312 -170353 -19058 -140764
10004 -140764 -3918 93936 -391462 -234943 -86522 -202803 12924 -158428 -161350 133883 -66137
9992 -16322 115027 -276028 -28602 158203 -214063 130475 -287260 -82482 221858 -214594
9981 -148374 -55683 -222442 -360577 -79206 -197177 5282 -335537 124646 -163083 -56866 3128
$$ packed form
10059b96165D3122a76503B7175a53529B36809h3023C14593b08614l2901B3985
10048A19094a2737N236q0496A99841K1352A0053J13519g0274I1711Q9290a55417
10036E7214J9783a12673p9672o4064A43935a79291B04393b66908B8122b86984
10025c09007J04955H5121a62089b1777j49648B3559c55973d9592H2531c67569
10014I2047P1177a02423A14234J67149b53364M9460k57408a70353a9058j21706
10004a40764c918I3936c91462J56519h6522j16281A2924a58428k922A33883f6137
9992a6322A15027b76028b8602A58203b14063A30475b87260h2482B21858b14594
9981a48374e5683j66759j38135g9206j17971E282c35537A24646a63083e6866C128
$$ plain form
9969 -36802 -279565 -187642 148353 -27540 29959 -286993 -216728 -98323 -63676 -28292 -163913
9958 -163913 313144 -103631 251370 -380660 -27106 -175781 -250009 -85007 128469 -301742
9947 196607 78979 9835 22971 -159696 322607 -186720 -77918 -116569 -107966 -97156 286953
9935 -130662 -151451 233541 198108 120918 76890 -184393 -67301 30106 -190300 168954 -4305
9923 -219987 84351 -16244 -75865 -241751 -16784 196651 -224188 197954 -190137 -89127 165812
9911 -238091 163463 -273178 -15174 197518 139711 -60402 -49775 -258876 62274 -112735 50391
9899 -314776 -228935 -77062 -87447 217944 -34958 -238102 -289829 185989 -371211 -280220 -25460
9887 10389 172426 23589 137893 -10557 -448186 140006 -19555 -77599 -155979 -89679 -167433
$$ packed form
9969c6802k42763R1923A48353b7540B9959b86993P0265i8323L4647b8292j35621
9958a63913C13144a03631B51370c80660b7106j48675p4228h5007A28469c01742
9947A96607G8979I835J3136a59696C22607a86720g7918l8651Q603J0810B86953
9935a30662k0789B33541l5433p7190m4028a84393f7301C0106a90300A68954d305
9923b19987H4351a6244n9621j65886a6784A96651b24188A97954a90137h9127A65812
9911b38091A63463b73178a5174A97518n7807f0402J0627k09101F2274a12735E0391
9899c14776Q5841g7062j0385B17944c4958k03144n1727A85989c71211R0991b5460
9887A0389J62037B3589J14304a0557m37629A40006a9555n8044p8380O6300p7754
$$ plain form
9876 -167433 -140996 48691 -57838 216346 93349 -107475 -190717 -268443 -92955 -125685 -78311
9865 -78311 -68349 167766 102660 182354 -371878 -271238 202062 -114203 283194 -204051 -206714
9854 -206714 -169225 108480 -59106 -304549 -245110 447473 -322105 -100985 -295683 -247960
9844 -247960 -74304 229590 -33194 -147269 -8058 97103 -134689 -82933 -142072 54690 227606
9833 227606 -20614 63546 140918 -435618 -79840 118960 -67784 -91014 -29182 236406 37790
9821 -46040 139260 26000 -13264 -76979 10021 74887 13043 -75886 -124680 -268804 63117
9809 -239570 -38252 -179022 -42122 -21280 3438 -54608 19789 -295352 -365412 -180271 -31111
9797 -203434 969 42526 -137649 -358585 -72197 -79798 8103 217250 -34823 37574 -112854 231941
$$ packed form
9876a67433K6437D8691e7838B16346I3349a07475q3242p7726i2955l2730M7374
9865g8311R962A67766o5106P9694c71878J00640B02062a14203B83194b04051k663
9854b06714L7489A08480e9106k45443N9439D47473c22105a00985j94698M7723
9844b47960g4304B29590c3194j14075h058I7103a34689N1756n9139E4690J72916
9833B27606b0614F3546P7372d35618g9840A18960f7784k3230b9182B36406C7790
9821d6040A39260B6000a3264o3715A0021O4866A3043g5886m8794j44124F3117
9809b39570c8252j40770d2122K0842C438e4608A9789b95352p0060a80271c1111
9797b03434I69M1557a37649k20936g2197p601H103K09147c4823C7574a12854B31941
$$ plain form
9784 -232917 -311841 -36036 86075 -267762 273962 -25609 232676 113527 187967 242645 174174
9773 174174 101180 59755 -172501 -95560 -252576 -8027 40247 -367411 -99365 123766 -81126
9761 358629 -93191 63909 200589 -105677 -16198 -335365 -55312 -111608 263676 -225125 -149199
9750 -149199 -341951 -293902 -165252 66286 122138 -431027 -275718 66257 135010 -63531 32827
9738 -8546 -241300 137740 114821 31799 -142045 117380 318592 -183213 -285418 246078
9727 -166808 -111874 176821 56940 218183 124615 -203566 -47721 -110255 280860 66983 14529
9715 -21351 -72917 -167916 165142 82462 -127562 -2449 -103668 -37440 -93475 32520 -96365
9703 199343 110947 173477 -209548 -118541 -1634 -123045 -99777 -119805 131124 51440 215319
$$ packed form
9784b32917p8924c6036H6075b67762B73962b5609B32676A13527P4440N4678o8471
9773A74174p2994m1425a72501P6941j57016h027D0247c67411i9365A23766h1126
9761C58629i3191F3909J36680a05677a6198l19167e5312n6296B63676b25125P5926
9750a49199j92752M8049J28650F6286N5852d31027J55309F6257O8753f3531C2827
9738h546k32754A37740k2919C1799a42045A17380K01212a83213j02205B46078
9727a66808N4934A76821E6940J61243r3568b03566d7721o2534B80860F6983A4529
9715b1351n1566r4999A65142H2462a27562b449j01219c7440n6035C2520i6365
9703A99343q8396O2530b09548R1007a634j21411K3268k0028A31124E1440J63879
$$ plain form
9692 215319 577310 -43171 10575 -27521 24842 124437 -105134 -237661 -115469 -209864 -201112
9681 -201112 74707 115129 362398 -296005 -201602 -210658 -101481 -36902 116614 -30609 -133304
9670 -133304 -197025 391765 17523 252903 -205737 -195805 -329121 401194 350059 124417 -31673
9658 95764 73633 -42482 -371604 279602 -278542 -317622 -50726 3814 233504 101416 -177538
9646 136128 -315089 22813 -34241 -245696 -78207 -104999 273750 -156749 33595 -99285 -231053
9635 -231053 -156997 -156199 85857 -91988 -141788 104763 199539 -94579 -263607 67932 -292923
9623 258211 -5518 -337200 -293156 -239587 141447 -293746 -564349 -15147 -26238 -3728 -8904
9612 -8904 -130487 129023 -16914 6798 -268168 -166446 330884 -45053 -70053 45168 -145800
$$ packed form
9692B15319L61991d3171A0575b7521B4842R9595a05134j32527a15469r4395Q752
9681b01112G4707M0422K47269b96005R4403r056a01481c6902A16614c0609j02695
9670a33304o3721C91765A7523K35380b05737R932j33316D01194n1135A24417c1673
9658I5764k2131d2482l29122B79602b78542l9080e0726C814K29690A01416a77538
9646A36128c15089B2813c4241k11455g8207k6792B73750a56749C3595i9285j31768
9635b31053P4056P98H5857i1988m9800A04763R4776i4579j69028F7932b92923
9623B58211e518l31682M4044N3569A41447b93746k70603a5147j1091c728n176
9612h904j21583A29023a6914F798b68168J01722C30884d5053k5000D5168a45800
$$ plain form
9600 -131894 -9147 13504 -87385 56864 -292684 -165348 -108350 273211 -74680 -264021 60716
9588 -110956 -55830 -13726 192666 -182108 -286692 280346 309900 -192853 124851 65325
9578 65325 -26955 264777 -149379 -246086 -22869 -10207 -75008 32999 -70789 -151508 -364145
9567 -364145 -308406 44165 -166923 128182 -16811 183370 -261696 172832 78541 91652 24875
9555 45560 198598 -200783 36592 43193 -177328 79841 -210631 -104210 -252763 290383 -111129
9543 -226497 39663 251946 11294 340362 13767 -105121 -310704 136072 208323 -124639
9532 -294416 185751 -14465 -78493 -93488 45593 1128 -75895 88467 -100990 117989 -164678
9520 -169757 -469822 1461 -17957 -257489 -83151 -79939 -52389 162464 242883 5970 2718 11746
$$ packed form
9600a31894i147A3504h7385E6864b92684J27336N6998B73211g4680j89341F0716
9588a10956N5126a3726A92666a82108j04584B80346K9554a92853A24851n9526
9578F5325b6955B64777a49379r6707b2869a0207o4801C2999g0789q0719k12637
9567c64145N5739D4165a66923A28182a6811A83370b61696A72832G8541J3111B4875
9555D5560J53038b00783C6592O601a77328G9841b10631a04210j48553B90383a11129
9543b26497C9663K12283A1294L29068A3767a05121k05583A36072P2251a24639
9532b94416A85751a4465o4028j4995D5593A128g5895H8467a00990A17989a64678
9520a69757l00065A461a7957k39532h3151L212K7550A62464Q0419E970B718R028
$$ plain form
9508 11746 -162225 -60484 -121954 38901 10032 -383061 -19668 73282 -53756 -1967 -63163 -37675
9496 -37675 -139721 -121703 201271 -327958 -60579 -52322 87926 28643 135218 -33524 508780
9484 215495 -54643 -31195 -84195 71214 25230 -7333 5645 -44599 -34305 -84892 -203299 -210936
9472 -210936 -15607 20532 -124980 -310373 -47543 50121 -108583 -104454 -142191 -112733 -94925
9461 -94925 7239 -259496 45863 172715 -15027 64007 40733 336899 203149 -300020 -206852
9450 -206852 138514 -163597 -33680 -124231 143208 -37962 54209 -137414 32793 34956 -180763
9438 -148808 -189989 -207501 -213076 -233190 -192842 -110177 -122832 -134359 309503 -151259 73090
9426 -48421 -358366 -73809 -34832 -33028 102392 252193 -222131 56855 554791 -11081 -93718
$$ packed form
9508A1746a62225f0484o1470C8901A0032c83061a9668G3282e3756a967o1196K5488
9496c7675j02046J8018B01271c27958f0579Q257H7926B8643J06575c3524E08780
9484B15495e4643K3448n3000G1214B5230g333E645d4599J0294n0587j18407p637
9472b10936a5607B0532a24980j85393d7543E0121a08583M129l7737K9458J7808
9461i4925G239b59496D5863J26852a5027F4007k3274K96166j33750c00020R3168
9450b06852A38514a63597c3680r0551A43208c7962E4209a37414C2793K163a80763
9438a48808m1181j7512n575k0114M0348Q2665j2655j1527C09503a51259G3090
9426d8421l09945g3809c4832J804A02392J49801b22131E6855M97936a1081q2637
$$ plain form
9415 -93718 93592 -67767 -29386 -233368 -55172 -263842 -170672 -65767 60225 -268935 33528
9403 -85225 80501 -36227 -178445 77868 -105186 -43911 113993 -153552 -159275 4577 -132276
9391 -108811 -896 -204503 261695 2811 -168680 -167974 71079 -220518 -331575 275871 -176552
9379 -74575 476302 325711 32398 -270514 -196552 -118838 39428 -61788 -41701 -246791 31164
9367 224076 101876 81891 -131349 -127550 242 -100645 138034 -334617 29212 40782 117422
9356 117422 225638 -27971 11147 -52039 -206948 81715 58574 16560 266625 -133925 -171671
9345 -171671 -1336 43487 -65182 -47422 -281439 -152167 -169118 -188588 -18443 140913 -16968
9333 3875 30924 242685 -110040 6157 80098 -82033 -64934 -49995 -209537 -159530 32745 -164079
$$ packed form
9415i3718I3592f7767b9386k03982e5172k08670R3170f5767F0225b68935C3528
9403h5225H0501c6227j42218G7868a05186d3911A13993a53552n723D577a32276
9391a08811h96k03607B61695B811a68680P06G1079b20518j11057B75871a76552
9379g4575D76302j50591C2398b70514P3962P7714C9428f1788K0087k05090C1164
9367B24076A01876j9985a31349L799B42a00645A38034c34617B9212J1570P6640
9356A17422J08216b7971A1147e2039j54909H1715k3141A6560K50065a33925l7746
9345a71671a336D3487f5182J7760k34017J29272j6951j9470a8443A40913a6968
9333C875K7049K11761a10040F157P3941h2033J7099J4939j59542N0007C2745a64079
$$ plain form
9320 -201850 186748 17149 66243 151714 -204027 -163742 78247 -95667 -168457 95570 -251175
9308 -17573 -284959 -319245 -233805 259064 -150564 -331897 -129255 -248724 -76817 -189727
9298 -189727 191871 -67433 -284100 150552 151344 -214593 -96682 100161 68418 -107237 61234
9286 -61961 141274 272267 -251142 -137232 -37749 -122402 -19041 43250 81181 71322 274851
9275 274851 219305 -287516 43809 -157476 -243417 -53440 10362 -118637 -24457 102524 -38732
9263 199370 189394 -55022 -186724 205911 70713 -369922 158295 -6569 39624 171957 80660
9251 239903 12008 165754 165747 -121958 281493 150268 -35376 -222751 47241 -245065 87176
9239 181417 166792 10452 -216576 -46794 -136607 5478 -123138 2510 -139728 206745 -125259
$$ packed form
9320b01850A86748A7149M9094Q5471b04027M0285G8247i5667p2790I5570b51175
9308a7573k67386l4286Q5440B59064a50564j81333a29255j19469g6817j12910
9298a89727A91871f7433k16667A50552P92b14593i6682A00161l1743a07237F1234
9286f1961A41274J30993b51142J13910c7749q4653a9041D3250L7931r859K03529
9275B74851n5546b87516D3809a57476q5941e3440A0362a18637b4457A02524c8732
9263A99370r976e5022j31702B05911G0713c69922A58295f569C9624J32333H0660
9251B39903A2008J53746pa21958B81493j31225c5376j87375D7241b45065H7176
9239A81417j4625A0452b16576d6794q9813E478a23138B510a39728B06745a25259
$$ plain form
9227 -78442 -152691 108309 -396056 99884 -71668 -171231 74654 -233055 2733 -196816 243213
9215 92213 -117463 132694 -13133 -107414 13657 -443856 -263382 -57847 52019 -46920 -250121
9204 -250121 -166301 93155 -26949 168460 158239 -114747 86301 -27381 -408052 233985 241107
9193 241107 68007 -199559 -17437 -216916 -75806 -72166 -264401 -446874 173024 172988 191251
9182 191251 -129031 -277841 24726 -154978 -52866 121096 -230092 152136 57116 148792
9172 148792 64650 -92729 -407295 165384 -353079 -512363 -16265 -318405 -262138 -122188
9161 101187 -212317 140947 42501 93290 -260157 -88234 239575 253436 -244984 9594 146385
9150 146385 -19919 80149 50274 -49648 -265163 91702 265380 -111409 309069 -142768 -18415
$$ packed form
9227g8442p4249A08309c96056I9884g1668r9563G4654b33055B733a96816B43213
9215I2213a17463A32694a3133r4281A3657d43856J80474e7847E2019d6920k03201
9204b50121Q3820I3155b6949A68460j0221a14747H6301b7381l80671B33985P122
9193B41107F8007a99559a7437j99479g5806L640j92235j82473A73024l6J8263
9182A91251a29031j48810B4726a54978e2866A21096b30092A52136E7116R1676
9172A48792F4650i2729l14566A65384c53079j59284a6265l02140N6267a22188
9161A01187b12317A40947D2501N0789b60157h8234B39575J3861b44984I594J36791
9150A46385a9919H0149k9875d9648k15515I1702J73678a11409C09069a42768a8415
$$ plain form
9138 84025 -91399 -144507 -369970 -111243 110847 -217897 -123986 322031 -59119 -176079 -67166
9126 217867 20342 25131 53959 125779 75885 58493 19422 -103928 351572 162701 -142997
9114 -48423 -105797 -348458 -241054 120855 -82267 -239059 -249526 237052 175124 106076 35434
9102 -122094 5193 -563627 39330 -115660 103598 40928 -120044 159622 193726 -166037 -30909
9090 125081 -304497 -189793 362688 -3082 225748 -119967 246687 -206328 -346432 -226336
9080 -226336 215496 84657 -33514 128563 -98505 -163837 -123526 89448 29310 -165841 107863
9068 -228040 -79489 -167414 -110570 -262674 -186476 -121629 138541 265985 160146 74810 -203638
9056 -90936 -93405 87253 -109157 -1198 -127264 -51698 -143555 -140337 7844 -81656 -453 56122 109858
$$ packed form
9138H4025i1399n3108k25463a11243A10847b17897R3911C22031e9119j16960f7166
9126B17867B0342M789K8828P1820m9894j7392A9422a03928C51572A62701a42997
9114d8423n7374k42661J07404A20855h2267j56792j0467B37052o1928o9048C5434
9102a22094E193e63627C9330a15660A03598D0928a20044A59622L4104a66037c0909
9090A25081c04497J14704C62688c082B25748a19967B46687b06328j40104J20096
9080b26336B15496H4657c3514A28563i8505o5332M0311H9448B9310a65841A07863
9068b28040g9489q7925N6844j52104P6198O4847A38541J27444j05839G4810b03638
9056i0936k469H7253a09157a198j26066e1698r1857L218G844h1656d53E6122N3736
$$ plain form
9043 109858 454935 -194897 39632 165197 -95987 -74081 -58133 250023 -368537 -440417 170483
9031 122987 -231316 -243240 -169286 -131273 -7260 -42270 -211087 -3569 -157267 125869 -68327
9019 -56634 10571 -248731 -215349 -278453 -54945 233090 243885 13260 -205942 -46914 52883
9007 -74276 19208 259114 -13244 -88648 38400 -86492 236184 96904 273567 78327 -218189
8995 -96054 138873 -36921 19880 10746 -136778 -236374 -61495 65342 -177955 -57585 -73771
8984 -73771 -144486 -193444 -189406 3270 -53375 75750 367230 -50137 115944 152542 -68974 -169277
8972 -169277 -162792 249023 212194 22613 19516 54595 -256809 -253407 7871 204065 -230898 -47907
8959 -90737 -122209 -311327 -55853 56252 -99002 226954 -8322 133435 -228257 70960 -250138
$$ packed form
9043A09858L45077a94897C9632J25565i5987K1906J5948B50023c68537p1880A70483
9031A22987b31316j1924P3954L8013g260l5010j68817c569j53698A25869f8327
9019e6634A0571b48731L3382o3104e4945B33090J0795A3260b05942d6914E2883
9007g4276A9208K39906a3244p5404C8400h6492B36184I6904J76663G8327b18189
8995i6054A38873c6921A9880r134a36778r9596f1495F5342a77955e7585j6186
8984g3771p0715m8958M038C270e3375G5750K91480e0137A15944L6598f8974j00303
8972a69277O485B49023l6829B2613l097L5079b56809L402G871J96194b30898d7907
8959i0737l1472j89118e5853E6252i9002B26954h322A33435b28257G0960b50138
$$ plain form
8947 -33283 -62256 -269386 11774 -24255 -113696 124951 -145281 -34252 -259894 78918 -111857
8935 219763 -88906 123517 67769 4444 116084 124596 24447 143824 4656 94630 -91584 -119731
8923 -119731 30237 30250 128477 196090 190305 -77266 598564 629280 525971 245453 725254 940499
8911 940499 478056 1161417 1947036 3618561 5445289 8789987 6356138 3984411 2113234
8902 2113234 1287313 528369 388052 55653 121522 355507 392481 186598 56870 257551
8892 257551 349514 -5482 109806 -56246 186739 -145670 -189527 -193544 -1663 7215 -225300 162960
8879 94091 75109 195509 -70562 -76415 209161 117120 -113121 -229490 -189948 -27723 -152044
8868 -152044 -169219 -72332 -110112 161389 31922 -62774 41745 143195 51904 -156800 238576
$$ packed form
8947c3283k8973k07130A1774b4255q9441A24951a45281c4252k25642G8918a11857
8935B19763h8906A23517n5748D444J11640Q512B4447J19377D656Q9974i1584k8147
8923a19731C0237J3R8227O7613n785g7266E98564L0716j03309B45453M79801K15245
8911I40499m62443O83361P85619J671525J826728L344698k433849k371727j871177
8902B113234q25921E28369j40317E5653O5869K33985L6974A86598E6870K00681
8892B57551R1963e482A09806e6246A86739a45670m3857m017a663G215b25300A62960
8879I4091j8982J20400g0562n853B09161r2041a13121j16369L9542b7723j24321
8868a52044j7175g2332l7780A61389C1922f2774D1745J01450E1904a56800B38576
$$ plain form
8856 24383 100656 -40424 -172367 -114168 -364427 5201 -103470 -265261 -28623 87712 -151092
8844 37165 -20878 -36439 8706 35561 124800 -88229 -362915 -145179 155691 -131520 95620
8832 104216 204032 -205822 -95698 91934 -107506 -100527 310876 31245 366899 -490704 -288328
8821 -288328 266187 -89736 -289397 139307 -205569 -244218 -90857 -245418 94706 -244625
$$ packed form
8856B4383P6273d0424j31943N8199k50259E201a03470j61791b8623H7712a51092
8844C7165b0878j5561H706K6855Q9239h8229k74686a45179A55691a31520I5620
8832A04216R9816b05822i5698I1934a07506O979C10876C1245L35654d90704K02376
8821b88328B66187h9736j99661A39307b05569l8649i0857j54561I4706b44625
$$ [...]
##END NTUPLES=NMR SPECTRUM
##END=
