
##TITLE=UV1100_M1_1161-1249_7180255_cBvFuq06ZW
##JCAMPDX= 6.0         $$ Bruker NMR JCAMP-DX V2.0
##DATA TYPE= NMR SPECTRUM
##DATA CLASS= NTUPLES
##ORIGIN= BRUKER
##OWNER= Administrator
$$ 1.72 TOPSPIN		Version 2.1
$$ 2012-12-05 01:52:44.149 -0500  Administrator@X
$$ Compression mode = diff/dup
##.OBSERVE FREQUENCY= 400.02188249412
##.OBSERVE NUCLEUS= ^1H
##.ACQUISITION MODE= SIMULTANEOUS (DQD)
##.ACQUISITION SCHEME= undefined
##.AVERAGES= 8
##.DIGITISER RES= 22
##SPECTROMETER/DATA SYSTEM= spect
##.PULSE SEQUENCE= zg30
##.SOLVENT NAME= COFFEE_meoh
##.SHIFT REFERENCE= INTERNAL, COFFEE_meoh, 1, 14.98509
##AUDIT TRAIL= $$ (NUMBER, WHEN, WHO, WHERE, PROCESS, VERSION, WHAT)
$$ ##TITLE= Audit trail, TOPSPIN		Version 2.1
$$ ##JCAMPDX= 5.01
$$ ##ORIGIN= Bruker BioSpin GmbH
$$ ##OWNER= Administrator
$$ $$ E:\/data/COFFEE/nmr/UV1100_M1_1161-1249_7180255_cBvFuq06ZW/10/pdata/1/auditp.txt
$$ ##AUDIT TRAIL=  $$ (NUMBER, WHEN, WHO, WHERE, PROCESS, VERSION, WHAT)
(   1,<2012-12-05 01:52:36.009 -0500>,<Administrator>,<X>,<go>,<TOPSPIN 2.1>,
      <created by zg
	started at 2012-12-05 01:51:29.977 -0500,
	POWCHK enabled, PULCHK disabled,
       configuration hash MD5:
       86 BA 57 50 F2 9D 5C 9B 26 00 A9 28 5F 66 2E 89
       data hash MD5: 64K
       21 A9 C0 45 44 9B F7 05 47 C5 B3 23 BB F1 6E B7>)
(   2,<2012-12-05 01:52:39.134 -0500>,<Administrator>,<X>,<proc1d>,<TOPSPIN 2.1>,
      <Start of raw data processing
       efp LB = 0 FT_mod = 6 PKNL = 1 PHC0 = 0 PHC1 = 0 SI = 32K 
       data hash MD5: 32K
       60 64 71 CB EF 45 29 E2 66 FD CA 3A 27 E6 89 A3>)
(   3,<2012-12-05 01:52:39.602 -0500>,<Administrator>,<X>,<proc1d>,<TOPSPIN 2.1>,
      <pk PHC0 = 98.73413 PHC1 = 0 
       data hash MD5: 32K
       E8 2B 53 05 B8 E7 4B 3F 9B 0E C8 BA B2 34 84 B2>)
(   4,<2012-12-05 01:52:39.837 -0500>,<Administrator>,<X>,<proc1d>,<TOPSPIN 2.1>,
      <abs ABSG = 1 
       data hash MD5: 32K
       D9 10 97 A8 02 9F 7E E4 37 5D E8 9A 51 52 B6 4A>)
(   5,<2012-12-05 01:52:39.977 -0500>,<Administrator>,<X>,<proc1d>,<TOPSPIN 2.1>,
      <abs ABSG = 2 
       data hash MD5: 32K
       F2 5F 3F 82 B1 EF D0 BF 4A 6D 8D D9 C6 95 24 90>)
(   6,<2012-12-05 01:52:40.118 -0500>,<Administrator>,<X>,<proc1d>,<TOPSPIN 2.1>,
      <abs ABSG = 3 
       data hash MD5: 32K
       BB F8 1D D6 90 DF E4 D4 7B FD EE 44 85 09 D0 6D>)
(   7,<2012-12-05 01:52:40.274 -0500>,<Administrator>,<X>,<proc1d>,<TOPSPIN 2.1>,
      <abs ABSG = 4 
       data hash MD5: 32K
       7A 4E 57 30 00 3E E6 7B 64 2E 65 50 8B F5 54 20>)
(   8,<2012-12-05 01:52:40.415 -0500>,<Administrator>,<X>,<proc1d>,<TOPSPIN 2.1>,
      <abs ABSG = 5 
       data hash MD5: 32K
       C2 DA 5E 0E F2 A3 4A 87 AD 76 57 70 48 33 5F 44>)
$$ ##END=
$$ 
$$ $$ hash MD5
$$ $$ 82 9D 0C CA 6C 88 83 E0 01 A2 AE C3 74 DB A3 CC
##$RELAX= 
##$RELAX= 
##$RELAX= 
##$RELAX= 
##$RELAX= 
##$RELAX= 
##$RELAX= 
$$ Bruker specific parameters
$$ --------------------------
##$DU= <E:\>
##$EXPNO= 10
$$ [...]
##$TP= (0..7)
150 150 150 150 150 150 150 150
##$TP07= 0
##$TPNAME0= <>
##$TPNAME1= <>
##$TPNAME2= <>
##$TPNAME3= <>
##$TPNAME4= <>
##$TPNAME5= <>
##$TPNAME6= <>
##$TPNAME7= <>
##$TPOAL= (0..7)
0.5 0.5 0.5 0.5 0.5 0.5 0.5 0.5
##$TPOFFS= (0..7)
0 0 0 0 0 0 0 0
##$TUNHIN= 0
##$TUNHOUT= 0
##$TUNXOUT= 0
##$USERA1= <user>
##$USERA2= <user>
##$USERA3= <user>
##$USERA4= <user>
##$USERA5= <user>
##$V9= 5
##$VALIST= <valist>
##$VCLIST= <CCCCCCCCCCCCCCC>
##$VD= 0
##$VDLIST= <DDDDDDDDDDDDDDD>
##$VPLIST= <PPPPPPPPPPPPPPP>
##$VTLIST= <TTTTTTTTTTTTTTT>
##$WBST= 2048
##$WBSW= 25
##$XGAIN= (0..3)
0 0 0 0
##$XL= 0
##$YL= 0
##$YMAX_a= 647053
##$YMIN_a= -551008
##$ZGOPTNS= <>
##$ZL1= 120
##$ZL2= 120
##$ZL3= 120
##$ZL4= 120
##$ABSF1= 14.98509
##$ABSF2= -5.573092
##$ABSG= 5
##$ABSL= 3
##$ALPHA= 0
##$AQORDER= 0
##$ASSFAC= 0
##$ASSFACI= 0
##$ASSFACX= 0
##$ASSWID= 0
##$AUNMP= <proc_prof1d_extract_pilot.lims>
##$AXLEFT= 0
##$AXNAME= <>
##$AXNUC= <1H>
##$AXRIGHT= 0
##$AXTYPE= 0
##$AXUNIT= <>
##$AZFE= 0.1
##$AZFW= 0.1
##$BCFW= 0
##$BC_mod= 0
##$BYTORDP= 0
##$COROFFS= 0
##$CY= 15
##$DATMOD= 1
##$DC= 0
##$DFILT= <>
##$DTYPP= 0
##$F1P= 0
##$F2P= 0
##$FCOR= 0.5
##$FTSIZE= 32768
##$FT_mod= 6
##$GAMMA= 0
##$GB= 0
##$INTBC= 1
##$INTSCL= 1
##$ISEN= 128
##$LB= 0
##$LEV0= 0
##$LPBIN= 0
##$MAXI= 10000
##$MC2= 0
##$MEAN= 0
##$ME_mod= 0
##$MI= 0
##$NCOEF= 0
##$NC_proc= -8
##$NLEV= 6
##$NOISF1= 0
##$NOISF2= 0
##$NSP= 0
##$NTH_PI= 0
##$NZP= 0
##$OFFSET= 14.98509
##$PC= 1
##$PHC0= 98.73413
##$PHC1= 0
##$PH_mod= 1
##$PKNL= yes
##$PPARMOD= 0
##$PPDIAG= 0
##$PPIPTYP= 0
##$PPMPNUM= 2147483647
##$PPRESOL= 1
##$PSCAL= 4
##$PSIGN= 0
##$PYNMP= <proc.py>
##$REVERSE= no
##$SF= 400.02
##$SI= 32768
##$SIGF1= 0
##$SIGF2= 0
##$SINO= 400
##$SIOLD= 32768
##$SPECTYP= <>
##$SREGLST= <1H.CDCl3>
##$SSB= 0
##$STSI= 32768
##$STSR= 0
##$SW_p= 8223.68421052631
##$SYMM= 0
##$S_DEV= 0
##$TDeff= 65536
##$TDoff= 0
##$TI= <>
##$TILT= no
##$TM1= 0
##$TM2= 0
##$TOPLEV= 0
##$USERP1= <user>
##$USERP2= <user>
##$USERP3= <user>
##$USERP4= <user>
##$USERP5= <user>
##$WDW= 1
##$XDIM= 32768
##$YMAX_p= 454488954
##$YMIN_p= -793031
##$CURPLOT= <Network HP LaserJet P1505>
##$CURPRIN= <$Network HP LaserJet P1505>
##$DFORMAT= <normdp>
##$LAYOUT= <+/1D_H.xwp>
##$LFORMAT= <normlp>
##$PFORMAT= <normpl>
##$SURQMSG= 1
$$ End of Bruker specific parameters
$$ ---------------------------------
##NTUPLES= NMR SPECTRUM
##VAR_NAME=  FREQUENCY,     SPECTRUM/REAL,   SPECTRUM/IMAG
##SYMBOL=    X,             R,               I
##VAR_TYPE=  INDEPENDENT,   DEPENDENT,       DEPENDENT
##VAR_FORM=  AFFN,          ASDF,            ASDF
##VAR_DIM=   32768,         32768,           32768
##UNITS=     HZ,            ARBITRARY UNITS, ARBITRARY UNITS
##FACTOR=    0.250966925370066, 1,           1
##FIRST=     8223.43324360094, -243726,      24373
##LAST=      0,             24492,           -50932
##MIN=       0,             -793031,         0
##MAX=       8223.43324360094, 454488954,    0
$$ Real data points
##PAGE= N=1
##DATA TABLE= (X++(R..R)), XYDATA
$$ [...]
19541a18721J5358B817J50522h2105B59425L1903a11728B88129G9816c2630B24133
19529d39112c8176A22068n6545b33322P583F3065h5483m9835L3886j25992A71574
19517c9345K940A66630b20719J05768a0177m6398D5741a67724A01646B0467h8884
19505c31109D64024b68119F7249b39661f2581i433p7789A02780a04178k57542
19495c61720b2903M878j6929A73118b04002A83121P0140b30541b2007G713J79260
19484A86973J82226i8748j20727A40488a35638A11299M7872j1072a33677k09979
19474c43656A09500J9894a76818E8437K43731m5687h423D4267O0869a8217l9031
19463e7248l29408B10821A0825b32900I6976b96085B093a18927G1384a82502k5515
$$ y = [-118721, -103363, 2817, 153339, -82105, 259425, 291328, -111728, 288129, 79816, -32630, 224133, -439112, -38176, 122068, 65523, -233322, -225739, 63065, -85483, -135318, -101432, -227424, 171574, -39345, -36405, 166630, -220719, -114951, -10177, -56575, 45741, -167724, 101646, 20467, -88884, -331109, 464024, -268119, 67249, -239661, -62581, -9433, -87222, 102780, -104178, -361720, -22903, -18025, -34954, 173118, -204002, 183121, 253261, -230541, -22007, 7713, 186973, 369199, -98748, -219475, 140488, -135638, 111299, 159171, 148099, -133677, -343656, 109500, 129394, -176818, 58437, 302168, 256481, -8423, 44267, 105136, -18217, -57248, -386656, 210821, 10825, -232900, 96976, -296085, 2093, -118927, 71384, -182502, -208017]
19452b08017A54488c22267c1243j0335k70774b9796k53551a35352l6225j12640
19442b84217N1243o141a02184m0166i031j20525B72918a84421m1601A01357c35039
19430a02967j42835B8439a72354B43326a5998j28504O9507B25632D136h3959B30276
19418b70974R236b2434A14442q639b46469o4031i5669k1649O472L17Q638k67235
19406c69126b2907j227l02286a49335k32114B32039a59683O4420A06203a59341
19395G0799Q58f8175j51124e7717q1865A19889f6634H4332J45692A11678a8836
19383A72356H2248j7570a42822M32A62532b84523G084N8229a95918a3683G8348
19371e79899J29079J0868B59436B8631R3906d9394B27497a36757a7680j72093
$$ y = [-208017, 154488, -322267, -31243, -41578, -312352, -29796, -283347, -135352, -171577, -284217, -232974, -239115, -102184, -142350, -9031, -129556, 272918, -184421, -226022, 101357, -335039, -102967, -245802, 28439, -172354, 243326, -15998, -144502, -74995, 225632, 4136, -83959, 230276, -270974, -261738, -22434, 114442, 105803, -246469, -310500, -95669, -117318, -110846, -110529, -101891, -369126, -22907, -24134, -326420, -149335, -381449, 232039, -159683, -95263, 106203, -159341, 70799, 71657, -68175, -219299, -57717, -139582, 119889, -66634, 84332, 230024, 111678, -18836, 172356, 82248, 64678, -142822, -142390, 162532, -284523, 7084, 65313, -195918, -13683, 78348, -579899, -450820, -439952, 259436, 28631, 122537, -49394, 227497, -136757, -17680, -189773]
19361a89773K4725A22429D4261j1813d9731I9916b03470O7885k33986C90319A20926
19349C07282b31720c3890A77383p3289k0501a13607a2375B8120J77389n3439b34159
19337A74300b2581j1762k17003K9214c9803C76919g9269o6986A24571b26818b766
19325a68297j48440e9664j3447I5748a34788A3150L55884a38943A99380a24343
19314c65196A03638b90045c974j55914g7422j98621a6356A76872d68304B14943
19303c56374G4963e08988c6474A2955K356d1949C07762E4824e74406G3801c41022
19291c44328J36433A61536d0404j25244n2792B5240K7302J69023j00088g967B74832
19279I0614a83140M9110n2978a8416j03271A9527c090k17037B84192o0948M577
$$ y = [-189773, -165048, 122429, 44261, 32448, -49731, 99916, -203470, -135585, -369571, 390319, 120926, 307282, -231720, -33890, 177383, 104094, 83593, -113607, -12375, 28120, 205509, 152070, -234159, 174300, -22581, -34343, -251346, -222132, -39803, 376919, -79269, -146255, 124571, -226818, -2766, -168297, -316737, -59664, -73111, 95748, -134788, 13150, 369034, -138943, 199380, -124343, -365196, 103638, -290045, -3974, -159888, -77422, -276043, -16356, 176872, -468304, 214943, -356374, 74963, -508988, -36474, 12955, 15311, -41949, 307762, 54824, -574406, 73801, -341022, -344328, -207895, 161536, -40404, -165648, -218440, 25240, 52542, 221565, 121477, -7967, 274832, 90614, -183140, -134030, -187008, -18416, -121687, 19527, -3090, -220127, 284192, 223244, 227821]
19268B27821b17608K1355e3680G8479N2176o2719d11372A75568J3608p6890M9343
19257A61629a10186j32300a03509j18805E5819b71953p8077h1639p4696H7519
19246c18844A39932e9803a9985j25007j40803N5572A32104f982r5466J6715d0135
19234e5337j7679k26681J31971N6037a3121k05304d6210j22243B28000b36496
19223g3144D9542K04233g0752K9256A39283a68156d7526k20906F7012a03526k6832
19212a30358l3188j31339J40776m8990n1325K2398D075J93632a36851l8050K2746
19201a52155j37719P9632C34021A52336c28702p4369e9064I2104a49876j36183
19191b86059E1189a80408R025D00536a4567j50799B48098d6015j20238k63573
$$ y = [227821, -217608, -196253, -53680, 78479, 130655, 67936, -411372, 175568, 189176, 112286, 161629, -110186, -242486, -103509, -222314, 55819, -271953, -350030, -81639, -156335, 87519, -318844, 139932, -59803, -19985, -144992, -285795, -230223, 132104, -6982, -102448, -85733, -40135, -55337, -73016, -299697, -167726, -111689, -13121, -218425, -46210, -168453, 228000, -236496, -73144, 49542, 253775, -70752, -41496, 139283, -168156, -47526, -268432, 67012, -103526, -130358, -163546, -294885, -154109, -203099, -254424, -232026, 4075, 197707, -136851, -174901, -152155, -289874, -210242, 334021, 152336, -328702, -403071, -59064, 92104, -149876, -286059, 51189, -180408, -171383, 400536, -14567, -165366, 248098, -46015, -166253, -429826]
19181d29826a79703D6694J0541c38368a24249G7738a29494j47281Q8243F4084
19170B69842K8906q3301b31037J01072f0309m51470e1240k7696l04472j15095
19160d98503a47161A55602h2811L6404B60634c52879N4281A67757d958j55952
19150a60910H0907e72k54569a4696k87267C1881N2794h4152B4968a19822i569
19138a65984e3361A15390b0980o1958j31099g3432j92957c3908o6829q5704k10631
19127c97072a13861A05582J33237c48028d152H0857g2065A24872b59937C66164
19116a83942c9677j51822D5025J12781G2134a36013A39798a52484r0063j82406
19106d24953d067j26950j62480A60379a03346D0717A4383a81531F8605g9397r7130
$$ y = [-429826, -179703, 46694, 57235, -338368, -124249, 77738, -129494, -276775, -188532, 64084, 269842, 298748, 215447, -231037, -129965, -60309, -511779, -51240, -78936, -383408, -498503, -147161, 155602, -82811, -46407, 260634, -352879, -298598, 167757, -4958, -160910, 80907, -572, -255141, -14696, -301963, 31881, 84675, -84152, 24968, -119822, -9569, -165984, -53361, 115390, -20980, -82938, -214037, -73432, -266389, -33908, -100737, -186441, -397072, -113861, 105582, 238819, -348028, -4152, 80857, -72065, 124872, -259937, 366164, -183942, -39677, -191499, 45025, 157806, 72134, -136013, 139798, -152484, -242547, -424953, -4067, -131017, -293497, 160379, -103346, 40717, 14383, -181531, 68605, -79397, -176527]
19095a76527n0843J8613B86483F111J8678a56979l43525d8301I1655d2667A32035
19083I3304J91424a21180c3635D0639b33250m875A47722b6065A67524b2088B60468
19071B39621J25464D6932a53523A78585P8986D7124a83737J3411b9002l32578
19061c61580A13502C4826a77106K1984B3681c39346B07409O550a57989F2276b9545
19049d7943r5098p0088B58883c91106A31484A3803J47971n8712m0791J89843F4794
19037A40453m4108h7230c2614G8806d9923J5270B86317H778J78417b60677O1642
19026a99035F9521c6796C93632a78900j9836H5709a88810f6591G1055J52207C7450
19014F919J4430a38786B18999q1019D8556b06453j57434a51572c1372C43466r7666
$$ y = [-176527, -227370, -208757, 286483, 6111, 24789, -156979, -500504, -48301, 91655, -42667, 132035, 93304, 284728, -121180, -33635, 40639, -233250, -238125, 147722, -26065, 167524, -22088, 260468, 239621, 365085, 46932, -153523, 178585, 257571, 47124, -183737, -170326, -29002, -361580, 113502, 34826, -177106, -155122, 23681, -339346, 207409, 213959, -157989, 62276, -29545, -47943, -143041, -213129, 258883, -391106, 131484, 13803, 161774, 103062, 62271, 252114, 64794, 140453, 96345, -87230, -32614, 78806, -49923, -34653, 286317, 8778, 187195, -260677, -199035, 69521, -36796, 393632, -178900, -198736, 85709, -188810, -66591, 71055, 223262, 37450, 6919, 21349, -138786, 218999, 137980, 48556, -206453, -363887, -151572, -31372, 343466, 245800]
19003B45800a59895M4618H6210c1766r5850L8667k79940A17223C6487b56363b0714
18991c18392F2561a94919P4310j0044H2820b4871j627B99107a51053B08868d75221
18979a06397A46852c63396A55473G3532a26887L8861K6018J320a0905A79762m0707
18968A39055c54465G0267B4211d5378E0384a22652A30811K20347c88620l6260
18958d24880A73735G6991d6809n1376P043r3131f3333l32696O8624a08888o2387
18947a71275Q2582j9366A67115a79660b4254p8581B64755G9149l3338a25069H6477
18935f3901l4237D8978d2794A39901d14752a82794C42875e4934j85369H5697J68752
18924B54449r8509c8807j99553A17234M2500F3101A5209J79729q7784f4172n6564
$$ y = [245800, -159895, -115277, 86210, -31766, -127616, -88949, -368889, 117223, 36487, -256363, -20714, -318392, 62561, -194919, -120609, -130653, 82820, -24871, -26498, 299107, -151053, 208868, -475221, -106397, 146852, -363396, 155473, 73532, -126887, -88026, -62008, -60688, -10905, 179762, 139055, -354465, 70267, 24211, -45378, 50384, -122652, 130811, 351158, -388620, -424880, 173735, 76991, -46809, -98185, -91142, -184273, -63333, -396029, -327405, -108888, -171275, -88693, -108059, 167115, -179660, -24254, -102835, 264755, 79149, 45811, -125069, 86477, -63901, -98138, 48978, -42794, 139901, -414752, -182794, 342875, -54934, -240303, 85697, 254449, 155940, -38807, -238360, 117234, 159734, 63101, 15209, 194938, 107154, -64172, -120736]
18913a20736A32957d4671H344a31098B40045b0842l01492A26132b10675A25109
18902b6632m6171C29183a83299J4698j43564k31509B30411M1391c1925l15027
18892c46952E7677d94927B85151b38200o0347e679B33952p4059F8195Q6106b24936
18880b32520k2178D96c7189k72608J48403L9482j08279B52999b46083d7498k79190
18869c26688Q8407A23843B1821O2270R2538n283D9553b38978H4105a7903o604
18858b4507k68751A91721i2827A87435E7624b40719L5381O7393C37246J16499
18848D53745B3184J11772M9787b96105a2909m3104l4975k30357A0976a69692i064
18836C59415F307b8586q8702j31700A23143J20670A10926N3813c8459m78278A11040
$$ y = [-120736, 132957, -44671, 8344, -131098, 240045, -20842, -322334, 126132, -210675, 125109, -26632, -72803, 329183, -183299, -168601, -312165, -543674, 230411, 271802, -31925, -346952, 57677, -494927, 285151, -238200, -298547, -5679, 233952, 159893, 68195, 154301, -224936, -232520, -254698, 496, -37189, -309797, -161394, -121912, -230191, 252999, -246083, -47498, -326688, -238281, 123843, 21821, 84091, 176629, 171346, 49553, -238978, 84105, -17903, -24507, -293258, 191721, -92827, 187435, 57624, -240719, -205338, -137945, 337246, 453745, 23184, 134956, 184743, -296105, -12909, -56013, -90988, -321345, 10976, -169692, -9064, 359415, 6307, -28586, -117288, -248988, 123143, 243813, 110926, 164739, -38459, -516737, 111040]
18824a02119k11974e6679A11855J48305o9671k5076A1454f3840G6525a85669c8640
18812b77536A5439J70405H79d5211A62600a43678N9799j26272j15337b4974D5240
18800a44305A72264N2896r8514E3421P2483a58875E8812N1525a30317j79926c6712
18788b25912R7669l2636N6522l4741j2393j0538J5449j01167H2274a91492A06712
18776a2887n3505j02339l7136D0760b09790i5589r1164B26453I5544J64864e9364
18764A16635Q9117J05274e1341j49372f619D0645K6197b39586F291a85075A26260
18752i4453B33251a7155j69124j10284C8634a16850J3673C3725c00908a16364
18741b86352f0485K384C797a38490P922q8050M379C26579A36830J94562a1660
$$ y = [-102119, -314093, -56679, 111855, 260160, 190489, 165413, 11454, -63840, 76525, -185669, -38640, -277536, 15439, 185844, 879, -45211, 162600, -143678, -83879, -210151, -325488, -24974, 45240, -144305, 172264, 225160, 126646, 53421, 125904, -158875, 58812, 110337, -130317, -310243, -36712, -225912, -128243, -160879, -104357, -139098, -151491, -162029, -146580, -247747, 82274, -191492, 106712, -12887, -66392, -168731, -205867, 40760, -209790, -95589, -186753, 226453, 95544, 260408, -59364, 116635, 205752, 311026, -51341, -200713, -6619, 40645, 66842, -239586, 6291, -185075, 126260, -94453, 233251, -17155, -186279, -296563, 38634, -116850, -103177, 33725, -300908, -116364, -286352, -60485, -58101, 3797, -138490, -130568, -218618, -214239, 326579, 136830, 331392, -11660]
18729B15051c69012a59437c9432r3060A6130a82519B5242e7671k9874l5122j19836
18718b42503K9202B58206k6610F6417c22145F9497k5377c2692j2698q6096A9454
18706H5866c8581n1927B11877b39057j14039G5062Q5438d05017B4860f748j73072
18695a79820P4009D06402e9852q8745L1500j31736C98777g277B2413a90616A5590
18683h7684J377j31371b084A8724Q6747D6919M2389J17979R769D9791a28848A8052
18670a03313m6735f8100C07468g5243m635n2316j58077R1146a3819A21233F0461
18658G9228i208F9024J1421a06317q6885A09731b09189J3046G887K4494h0274
18646b44234b4402j20165J309a7816G8282a9312j22382a583q4259B99335g9766
$$ y = [215051, -369012, -159437, -39432, -132492, 16130, -182519, 25242, -57671, -87545, -122667, -242503, -213301, 258206, 231596, 66417, -322145, 69497, 44120, -32692, -45390, -131486, 19454, 85866, -38581, -90508, 211877, -239057, -353096, 75062, 160500, -405017, 24860, -6748, -179820, -105811, 406402, -59852, -148597, -117097, -248833, 398777, -7277, 22413, -190616, 15590, -87684, -86307, -217678, -2084, 18724, 105471, 46919, 89308, 207287, 217056, 49791, -128848, 18052, -103313, -150048, -68100, 307468, -75243, -79878, -132194, -290271, -199125, -13819, 121233, 60461, 79228, -9208, 69024, 80445, -106317, -193202, 109731, -209189, -196143, 7887, 32381, -80274, -244234, -24402, -144567, -143258, -17816, 78282, -19312, -141694, -1583, -85842, 299335, -79766]
18634a86821D8418a66088A59102Q754K63513a01373C9892a56925C23685H935b31584
18622a64501C19283G2768a75465P9587K6892H3400h9069k07180B66788A1386f4605
18610a27050b864A06366d59465B86116c5862A9666b62009g1706C8970a55854E1492
18598c482A27921b10958a02267j40130a01979d430E9705k8691a75652g8192j50454
18587b28646a04646d7172A50622A197K3339i3483D9109b75046B67304A12313a37226
18575f4637A43913F2214b28308O1384g0661k17077a43157k1789k96118f3921k90603
18564c54524b5985j87770p6306a759l9667B73460a97830F6356a66985J8700l049
18553a51334l19314a45797j07853D526L5374a8408j4147C1407a94482B13238b53523
$$ y = [-186821, 48418, -166088, 159102, 167856, 431369, -101373, 39892, -156925, 323685, 8935, -231584, -164501, 319283, 72768, -175465, -95878, -68986, 83400, -89069, -296249, 266788, 11386, -64605, -127050, -2864, 106366, -459465, 286116, -35862, 19666, -262009, -71706, 38970, -155854, 51492, -3482, 127921, -210958, -102267, -242397, -101979, -4430, 59705, 31014, -175652, -78192, -228646, -104646, -47172, 150622, 1197, 24536, -93483, 49109, -275046, 267304, 112313, -137226, -64637, 143913, 62214, -228308, -166924, -70661, -287738, -143157, -164946, -461064, -63921, -354524, -25985, -213755, -290061, -1759, -41426, 273460, -197830, 66356, -166985, -148285, -151334, -470648, -145797, -253650, 4526, 39900, -18408, -32555, 31407, -194482, 213238, -253523]
18541e0444o9616b1520l58988e7921H4921b65689H3270c31542a48581e7378A47220
18529e2434l44549a3942j36756A2214c84285F7692J61645C0242J53652a05662
18518B9793b69198M7352C2350b1468j71541A0282e4275A34603c70333a06689k62203
18507c68892I5834a7266g584k44202A91412h5505C5799K1533b9685A82504B3167
18495b68102A20831C810c47375J30410k53751C5419c54454A54990J49254b31733
18484h3008k64008A56321l5070h2160b8061o3859E8384b64058j12189a14211j40314
18473b54525K0044k52899A06039c83245a4393A35317a50814O8642A39704J72180
18463C11884c46385d0629A85361g3417J5776C271J1513J09671n8459P2840g2450
$$ y = [-50444, -120060, -21520, -380508, -57921, 84921, -265689, 83270, -331542, -148581, -57378, 147220, -52434, -396983, -13942, -150698, 12214, -384285, 67692, 229337, 30242, 183894, -105662, 29793, -269198, -221846, 32350, -21468, -193009, 10282, -54275, 134603, -370333, -106689, -368892, 95834, -17266, -7584, -251786, 191412, -85505, 35799, 57332, -29685, 182504, 23167, -268102, 120831, 3810, -347375, -216965, -470716, 35419, -354454, 154990, 304244, -231733, -83008, -347016, 156321, 121251, -82160, -28061, -91920, 58384, -264058, -376247, -114211, -254525, -234481, -487380, 106039, -383245, -14393, 135317, -150814, -82172, 139704, 311884, -346385, -40629, 185361, -73417, -57641, 3271, 14784, 124455, 65996, 138836, -72450]
18451i607j56565C37903r5330A9702P7632H73a86542A85872g0407k84321a58947
18439b26137b7018l57509E0666a10919A69757b40534q262L2774O495r2305i5024
18427B66224a76664C3317a845C0587M2638b10652K7596A4810c9704C43179j67601
18416A75578b27629e5371p360H6677C7287K15237b73334e2860B10585b11555A03185
18404I1876b15054M9017B12759D4687a36565E6003J65375d33116a19274K8732
18394i0542j03344A1946j441c34434a66753A64899E1291e7915j07167B16703n2216
18383A64487H0544Q1882A2707a73257j13615G777P6976c44340A42851O1897c92656
18371c90915J82553B78543B6186e131B5898a09155G5539L5504b57129a26799e6742
$$ y = [-9607, -166172, 337903, 242573, 19702, 97334, 873, -186542, 185872, -70407, -354728, -158947, -226137, -27018, -384527, 50666, -110919, 169757, -240534, -248796, -216022, -209527, -301832, -95024, 266224, -176664, 33317, -1845, 30587, 73225, -210652, -183056, 14810, -39704, 343179, 175578, -227629, -55371, -62731, 86677, 37287, 252524, -273334, -52860, 210585, -211555, 103185, 91876, -215054, -166037, 212759, 44687, -136565, 56003, 221378, -433116, -119274, -90542, -193886, 11946, 10505, -334434, -166753, 164899, 51291, -57915, -165082, 216703, 164487, 80544, 162426, 12707, -173257, -286872, 7777, 84753, -344340, 142851, 204748, -392656, -390915, -208362, 278543, 26186, -5131, 25898, -109155, 75539, 111043, -257129, -126799, -56742]
18359A6617L66604h776q3007k3867A52103h3211j31704j32140A75899b33839p7942
18348c11781B12035a41067m4761J1824Q3631m5674k620C24486A11221J56800i8636
18336i7442g673C2583a87438L3o9984K6892a15193B1860a60262j23324J22816
18325a60770q8221l0744C0479Q9027c66214A34481f0376M299j88148J01383d0153
18313A74466L6861c17491A38095a31035q4514J6758A16135r044a07560A89773
18302b21057i3881l38859C15044a14188p9370I2J42365a62262c7292F1994d4021
18290A83607a35948l0915I7073B2807a22930E2863J6676O9167i9839k9541j39078
18279b68458j79003a52141P4843H9707J71892a88470D2597b09676C1489L4969
$$ y = [16617, 383221, -8776, -91783, -115650, 152103, -83211, -214915, -347055, 175899, -233839, -311781, 212035, -141067, -185828, -174004, -90373, -136047, -138667, 324486, 111221, 268021, -98636, -97442, -7673, 32583, -187438, -187405, -257389, -230497, -115193, 21860, -160262, -283586, -160770, -248991, -279735, 30479, 119506, -366214, 134481, -60376, -56077, -244225, -142842, -40153, 174466, 211327, -317491, 138095, -131035, -215549, -198791, 116135, 107091, -107560, 189773, -221057, -93881, -432740, 315044, -114188, -193558, 92, 142457, -162262, -37292, 61994, -44021, 183607, -135948, -166863, 97073, 22807, -122930, 52863, 69539, 138706, -99839, -129380, -268458, -447461, -152141, -77298, 89707, 261599, -188470, 42597, -209676, 31489, 66458]
18269F6458b18479f7041F3472f9536r2366G1312j171N7606b02623k07996c4086
18257d9000D6979d9889k72317B07925n5442a29232l998C0334a80440I7339c53703
18245d213H5515R1331a24063j7149n7031A23110b5637q0579d24r8528A19146d63028
18232h1409b0514j6308l70987a09550L6697k867A67303o7662B2962L0662J00376
18221A54000j2153b38480g710K749m8416A20043d06533E8103b85858A14547J24206
18210B38753F1754d0783A01149b9893l39010I5892k1303d4908j13568D4811b9016
18198e2281j44031A92796e4179I3569b41310h3163J9516A04811g4423A12884G107
18186A40344a23155E9078d3407j69449A78181b28521C01047j22766e5551q5733
$$ y = [66458, -218479, -67041, 63472, -69536, -161902, 71312, 70141, 127747, -202623, -410619, -34086, -49000, 46979, -49889, -322206, 207925, 152483, -129232, -133230, 30334, -180440, 97339, -353703, -4213, 85515, 176846, -124063, -141212, -198243, 123110, -25637, -106216, -424, -98952, 119146, -463028, -81409, -20514, -36822, -407809, -109550, -72853, -75720, 167303, 99641, 22962, 53624, 154000, 141847, -238480, -7710, -4961, -53377, 120043, -406533, 58103, -285858, 114547, 238753, 61754, -40783, 101149, -29893, -368903, 95892, 74589, -44908, -158476, 44811, -29016, -52281, -196312, 192796, -54179, 93569, -241310, -83163, -63647, 104811, -74423, 112884, 7107, 140344, -123155, 59078, -43407, -212856, 178181, -228521, 301047, 178281, -55551, -141284]
18176a41284A35401n2845P1992p7192b28609i7820E7289i7139J9331B42419c6833
18164i7753j66487a26554i780A33005e063C81092C0293a46131l14369J81312A14383
18152A19407c32672B63912A30473h9033A82736b0198A2864b02891F4835a79031
18141b63467k3187i1428c7215j08449A9859f9716A00675f8121a4237m81742Q2945
18130d13034R7298o4162F1575L00761H7487k6642d5899j43414A21638k827k4769
18119I4042F821c50022C20811a66500A8767B673J94878b0962q357F710b78782
18107C4023J37033c59819F4556a47325C9765d49170B10669D3956o790b01304k4555
18096b25859C1913O155a7032l7652k45100R0995B29918f5979k9554B12996b00395
$$ y = [-141284, 135401, 82556, 154548, 77356, -228609, -97820, 57289, -97139, -77808, 242419, -36833, -97753, -264240, -126554, -9780, 133005, -5063, 381092, 30293, -146131, -460500, -279188, 114383, 119407, -332672, 263912, 130473, -89033, 182736, -20198, 12864, -202891, 64835, -179031, -263467, -286654, -91428, -37215, -145664, 19859, -69716, 100675, -68121, -14237, -495979, -413034, -315736, -379898, 61575, 362336, 87487, 60845, -45899, -189313, 121638, 118811, 94042, 6821, -350022, 320811, -166500, 18767, 2673, 197551, -20962, -29319, 6710, -278782, 34023, 171056, -359819, 64556, -147325, 39765, -449170, 210669, 43956, 37166, -201304, -225859, 31913, 38068, -17032, -54684, -299784, -208789, 229918, -65979, -95533, 212996, -200395]
18084D31188A54418d49687A42108A9609c08100c9952B28987b12093a2209A5276
18073A36798J1696b62868B9028c27694A2708h6390E6219h9989A44073i3790K5896
18062f7894b5133D82972A79263a53646q3216f8585E6694J53687a66281B07085
18051a98862l10631b00567a0166l25519A55715a39142B01926J24318a06921C9790
18040I9123h6908A17800M3592a06502N2640h26H0527d1308J1409k23091B61125
18028A84260a3683k02592E9065a31025O4218A03180R7533C8027A7161c40765A55022
18016g9398m6637l49762a88700A5841b62153M8765B25299J41153g987j09575F3656
18004a80035b8639a3410j26335A5559E937J0823L34598c10873F0918c4136k23080
$$ y = [431188, 154418, -449687, 142108, 19609, -308100, -39952, 228987, -212093, -12209, 15276, 136798, 148494, -262868, 29028, -327694, 12708, -86390, 56219, -89989, 144073, -93790, -67894, -25133, 482972, 179263, -153646, -236862, -68585, 56694, 210381, -166281, 207085, -198862, -509493, -200567, -10166, -335685, 155715, -139142, 201926, 326244, -106921, 39790, 99123, -86908, 117800, 161392, -106502, -53862, -826, 80527, -41308, -29899, -252990, 261125, 184260, -13683, -216275, 59065, -131025, -66807, 103180, 200713, 38027, 17161, -340765, 155022, -79398, -126035, -475797, -188700, 15841, -262153, -213388, 225299, 366452, -7987, -117562, 63656, -180035, -28639, -13410, -139745, 15559, 5937, 16760, 351358, -310873, 60918, -34136, -257216]
17993b57216E3564N5630K9493a61535j61674J57444A60715A043K62818J74601
17983D38462a23900K6589H1294a2372D7813b29580d2310p3470B8092a33404e3186
17971h4636C23469b27158f5682j29235o7337f2677k97633B6050K6140J04072h4703
17959A50213a55689j61761A55356A4838e85890C55287a26948L8988A11779J11726
17949B23505a41679o5659F5661c7162a4438C50531F1721P4928a7610p5310C9573
17937a3070F6169O0835a17036A45148a78992A0515O4324O0431a44952B6248J60558
17926A86806b39142n4387i744G0546a63312D7353c10280g5767J0126I0131D4169
17914H9525h0084B6739j1534J55608a955A42386c11982a23593B2681g1743j06428
$$ y = [-257216, 53564, 109194, 138687, -161535, -323209, -165765, 160715, 1043, 263861, 438462, -123900, -97311, 81294, -12372, 47813, -229580, -42310, -115780, 28092, -133404, -53186, -84636, 323469, -227158, -65682, -194917, -262254, -62677, -360310, 26050, 52190, 156262, -84703, 150213, -155689, -317450, 155356, 14838, -585890, 355287, -126948, -87960, 111779, 223505, -141679, -207338, 65661, -37162, -14438, 350531, 61721, 136649, -17610, -92920, 39573, -13070, 66169, 127004, -117036, 145148, -178992, 10515, 74839, 135270, -144952, 26248, 186806, -239142, -293529, -9744, 70546, -163312, 47353, -310280, -75767, -65641, 90131, 44169, 89525, -80084, 26739, 15205, 170813, -1955, 142386, -311982, -123593, 22681, -71743, -178171]
17903a78171H5853J18396J32091j19652l8199g7203j26143i3385l5081l08737
17893d37203a34354k62004O6494H6462J4395O1664b14029Q430A49300L3514E9421
17881F4176o087K45963A05772O3665a06961a3374A5933K0431L7722a89496r4091
17870b83587C7663c00596a4003A1308g4044F9643b57694a8490k71184C4930N6972
17859I1902A4677b19739i0727I1158k5086k3116d8567q6790A4931a57626B69154
17847f3206a0563k45079Q7247j91969h5180L9919r744b1448p849A18713K73414
17836C92127b6181j17778A59520a5851q6470I0162D4876a83106B98908G033J17727
17825A24760r229a21913B01047I7692A3095a30j3284k76131A89332b65761A66088
$$ y = [-178171, 85853, 204249, 336340, 216688, 178489, -77203, -203346, -93385, -128466, -437203, -134354, -396358, -329864, 86462, 100857, 162521, -214029, -205599, 149300, 182814, 59421, 64176, 58089, 304052, 105772, 169437, -106961, -13374, 15933, 36364, 74086, -189496, -283587, 37663, -300596, -14003, 11308, -74044, 69643, -257694, -18490, -289674, 34930, 91902, 14677, -219739, -90727, 91158, 66072, 42956, -48567, -135357, 14931, -157626, 269154, -63206, -10563, -255642, -168395, -360364, -85180, -45261, -55005, -21448, -29297, 118713, 392127, -26181, -143959, 159520, -15851, -102321, 90162, 44876, -183106, 298908, 7033, 124760, 115531, -121913, 201047, 97692, 13095, -130, -13414, -289545, 189332, -265761, 166088]
17813b74139a16573F9361b51847A75233c3196B64306a0226a820B61141F2347L128
17802F5475a4940A42998d2409J1225C5464J05417b44333d321r5998A06151e6821
17790G9656a0066A4141J13866k3975a5662o412k25697b0514p6736I7497A9903
17778a12328A42048K40751a02878A132L1457b07608r6779D8694R9397p2152b12082
17766b439q7463A91598c4493C8530f6357n0728A39071O1930B4708a81125A07494
17754a11835j82490A30724d2772j56766D2971e0324j94490A90870p1517B1333
17743b4472I2577h477C4468R7680a95644O1578D04827a15279A56872j6576b42276
17731A12678C5448J90004a13296k16663M7390E8258a4832G6875c17336J13775
$$ y = [-274139, -116573, 69361, -251847, 175233, -33196, 264306, -10226, -1820, 261141, 62347, 65475, -14940, 142998, -42409, -31184, 35464, 140881, -244333, -4321, -100319, 106151, -56821, 79656, -10066, 14141, 128007, 104032, -15662, -22074, -247771, -20514, -97250, 97497, 19903, -112328, 142048, 382799, -102878, 1132, 32589, -207608, -304387, 48694, 148091, 75939, -212082, -2439, -89902, 191598, -34493, 38530, -66357, -117085, 139071, 201001, 24708, -181125, 107494, -111835, -294325, 130724, -42772, -199538, 42971, -50324, -244814, 190870, 119353, 21333, -24472, 92577, -8477, 34468, 132148, -195644, -134066, 404827, -115279, 156872, 140296, -242276, 112678, 35448, 225452, -113296, -329959, -282569, 58258, -14832, 76875, -317336, -203561]
17721b03561A98897b7073C12510b50181B0487J23831b88010a32416A10197b23835
17710b51645b1307B32845a55938A95656G566M2464f6369n0943B99772C3748e9974
17698A80266K61201A71132d13052h4148c6023C20535r9006B5275a02304A27458
17687h1664A41297n8946J5720a86613A99308j1076d975o3291j1718D33735b56309
17675B2072K20873c9356o8168e2416j38525B75319C0515b40511M6826q0893J00839
17664a73739B14713f5433B34584a31313j17537B65100A06436a57622n7198A26480
17653B33726a6946j32988l7211G4815o674c11754a22231d713A43068J68759j33844
17642A77983b71645A71601a60704q8370a20089F1102K15172a14834D04059c85445
$$ y = [-203561, 198897, -27073, 312510, -250181, 20487, 144318, -288010, -132416, 110197, -223835, -251645, -21307, 232845, -155938, 195656, 7566, 50030, -66369, -117312, 299772, 33748, -59974, 180266, 441467, 171132, -413052, -84148, -36023, 320535, 221529, 25275, -102304, 127458, -81664, 141297, 82351, 98071, -186613, 199308, 188232, -4975, -68266, -79984, 433735, -256309, 22072, 242945, -39356, -107524, -52416, -190941, 275319, 30515, -240511, -193685, -274578, -173739, 214713, -65433, 234584, -131313, -248850, 265100, 106436, -157622, -214820, 126480, 233726, -16946, -149934, -187145, 74815, 68141, -311754, -122231, -4713, 143068, 311827, 177983, -271645, 171601, -160704, -249074, -120089, 61102, 276274, -114834, 404059, -385445]
17631B53783F8065a97240d5154a7869k4891B50575C3365M8088C1614O6684a23100
17619b97889H5481a25955O1938j05467m996A62870a73146j0514C2352J05798C670
17607a24701n2429L3408A27847d5524A83756B7719h7507l0064H912L95763d29469
17595f5417b494D2326n287a82074O6226B99108C8690M916L4901b8453j29822B1706
17582D2617O4062c7746A93253L6738I8034d3916A84959a1467k28805B41231G3634
17570E0693M57493G6229d48810G2516B8536L25583I5512a30236L9293C6912A4819
17558B44963a37153A6424P3274C2262J11281A6159a39399b1086l91471A38968
17547A10972f1719C12520j00131f0132A35980Q1326I1676l1745A5678J33046J04713
$$ y = [253783, 68065, -197240, -45154, -17869, -42760, 250575, 33365, 81453, 31614, 98298, -123100, -297889, 85481, -125955, -64017, -169484, -174480, 162870, -173146, -183660, 32352, 138150, 3670, -124701, -177130, -143722, 127847, -45524, 183756, 27719, -87507, -117571, 8912, 404675, -429469, -65417, -2494, 42326, 37039, -182074, -115848, 299108, 38690, 43606, 78507, -28453, -158275, 21706, 42617, 106679, -37746, 193253, 229991, 98034, -43916, 184959, -11467, -240272, 241231, 73634, 50693, 508186, 76229, -448810, 72516, 28536, 354119, 95512, -130236, -90943, 36912, 14819, 244963, -137153, 16424, 89698, 32262, 143543, 16159, -139399, -21086, -412557, 138968, 110972, -61719, 312520, 212389, -60132, 135980, 217306, 91676, 59931, 15678, 148724, 253437]
17536B53437E1249g8252j2584j9225B32691d11762J95630C22116K1084j67828
17526A75372f9220H7939J46976p8993C823i3086D4117r054h8914j11907R1320
17515a09501h157k00073B01997C7449K05839d5894q1336A35496a35217C37033
17504B06725b196A77639F4380a07702B02025b25900h0755j43129A96793c2950
17493C37010j40961f1914Q680D62641E6946J83823J6898d8096B29770H9496a35855
17481B74752p7504n9396m5780Q743J11078P9262G1597J77789J919m4109B1492
17469C28482G3545c5698F1675J34248a42707A42513J6778N1539n7358k764J78731
17458C29439j24322A01127N9855N90J62403a4229D71841B23548K59823j81464
$$ y = [253437, 51249, -78252, -90836, -110061, 232691, -411762, -216132, 322116, 343200, 175372, -69220, 87939, 234915, 155922, 3823, -93086, 44117, 35063, -88914, -200821, -109501, -8157, -208230, 201997, 37449, 243288, -45894, -127230, 135496, -135217, 337033, 206725, -2196, 177639, 64380, -107702, 202025, -225900, -80755, -223884, 196793, -32950, 337010, 196049, -61914, -53234, 462641, 56946, 240769, 257667, -48096, 229770, 89496, -135855, 274752, 197248, 137852, 92072, 100815, 211893, 291155, 71597, 249386, 251305, 207196, 21492, 328482, 73545, -35698, 61675, 195923, -142707, 142513, 159291, 210830, 153472, 150708, 329439, 205117, 101127, 160982, 161572, 323975, -14229, 471841, 223548, 483371, 301907]
17448C01907L87021j49193k47778e1165m3704A34285c00880E18163j12120j55617
17438B50426I9730L85376b7595D13609j91192E1017P516J16829N79912b1578A93278
17426C77097J96003n4050k24923J371m1054m53n3012H3236C1890L57416p1459
17415C17847j4680A38672b6690k82156A71305o9109h3153B8869J08192N8085H4283
17403B24520N6012p8186a05944B85865J39781c61926B31950n9049p6332i3784
17392C23502E1863b7555j58631b3028D39209j47621c7798k20274B87083M389M784
17381B96256a26075H26J91734L13416A82517K3981I6641J8156L0919P4066n4950
17370A64832K74040A49079o3984K24504A44989c2998Q134j6437B09325o4217g8584
$$ y = [301907, 688928, 539735, 291957, -51165, -94869, 134285, -300880, 518163, 406043, 250426, 99730, 485106, -27595, 413609, 222417, 51017, 58533, 175362, 755274, -21578, 193278, 377097, 573100, 519050, 294127, 295498, 254444, 253991, 200979, 83236, 31890, 389306, 317847, 303167, 138672, -26690, -308846, 171305, 102196, -83153, 28869, 137061, 195146, 84283, 224520, 280532, 202346, -105944, 285865, 425646, -361926, 231950, 172901, 96569, -93784, 323502, 51863, -27555, -186186, -23028, 439209, 291588, -37798, -258072, 287083, 291472, 296256, -126075, 826, 192560, 505976, 182517, 206498, 96641, 114797, 145716, 219782, 164832, 438872, 149079, 85095, 309599, 144989, -32998, -24864, -41301, 209325, 145108, -78584]
17358a39405B71256i4222r904q7944g2001B28222J03661F1170Q4035a57618B44939
17346A80772P0318m6803a12441H0030l0383b1985B83539A19282g1681A75978L7711
17335B13689b72888R0513B50648b80762B32450F960J67853G218J61154D9012K86117
17324C35129j58021b41327N0163A50025J03207E3446Q6289L0834a93682A85560
17313C90655n6828d0017B52093q7140a65250C28751A10810k8189L1289N581g5997
17301A97897G923K98268A28750h6128C50522F6627K34384b96276A04611M1019
17291A45630e7108C1604J58029f9961B27882B6000K73273g066D12293a13593H5313
17279D17444G9025j6958A520a71424E4179j2422J78138k4807L9807H3778a3812
$$ y = [-139405, 271256, -94222, -104126, -192070, -72001, 228222, 331883, 61170, 145205, -157618, 244939, 180772, 251090, 204287, -112441, 80030, 49647, -21985, 283539, 119282, -71681, 175978, 213689, -272888, -182375, 250648, -280762, 232450, 6960, 174813, 7218, 168372, 49012, 335129, 177108, -241327, -191164, 150025, 253232, 53446, 139735, 170569, -193682, 185560, 390655, 333827, -40017, 252093, 164953, -165250, 328751, 110810, 82621, 113910, 119491, -75997, 197897, 7923, 306191, 128750, -86128, 350522, 66627, 301011, -296276, 104611, 145630, -57108, 31604, 189633, -69961, 227882, 26000, 299273, -7066, 412293, -113593, 85313, 417444, 79025, 62067, 1520, -171424, 54179, 41757, 219895, 195088, 234895, 83778, -13812]
17267A01097j3527K16546A21442L01572j45742m9436L0882j1737l760a11488j16611
17256b28099C1598L76882B5656K69663K1531a22673C8696K24793j0653j19820
17246A33016J67176J59671A74962M7793B8676a4609B46679A01627c90626A88277
17235A57376h5303J4985C43165C41M79509j00007a18541m8610B01353R07N6536
17224B58796J40150J8217A59105J23700j40351e8182B46789o316K0471r4866K49002
17213D15080E4104c0293E0961f934B211J30672J07972l9257a17543B19969K16950
17202D36919H7031J49645b834C42150K1909K50920B36227d4419C52346O3734q6670
17191C29410j1969F7041e2126A15354b9386A29337M03078A64464K34657q049k4967
$$ y = [101097, 87570, 304116, 121442, 423014, 277272, 227836, 258718, 246981, 243221, -111488, -228099, 31598, 408480, 25656, 295319, 316850, -122673, 38696, 263489, 252836, 133016, 300192, 459863, 174962, 222755, 28676, -14609, 246679, 101627, -390626, 188277, 157376, -85303, -70318, 343165, 341, 479850, 379843, -118541, -167151, 201353, 202260, 258796, 398946, 417163, 159105, 282805, 142454, -58182, 246789, 240473, 260944, 166078, 415080, 54104, -30293, 50961, -6934, 2211, 132883, 240855, 201598, -117543, 219969, 436919, 87031, 236676, -2834, 342150, 364059, 614979, 236227, -44419, 352346, 416080, 329410, 317441, 67041, -52126, 115354, -29386, 129337, 532415, 164464, 399121, 391072, 366105]
17180C66105A65142P2239J2611M7618j32187L27347q8762J13444E9748K55417
17170C15165j03284M9683K06955M2027j97241r5019p7105a67741C56346L73218
17160G29564B23591j08999C5349J07162K01974M4552A09128L01756j83938O292
17150B33238c06778C08740J47944j90341I4912M15574L512G9008M57114k56638
17140B79484O5084m829j33791n964m5424J36332A33775J35271C6746L89207A16573
17128E32091k43943P1373J07502j42967j132l2041J00706A44823K99361B10787
17117B21605M99553A66422B6217O8075M01032B20955R0491J84163j64374K02989
17107E34224q1658A16315L08082k3384J45228j76126N3228A38082M28532O6298
$$ y = [366105, 165142, 237381, 249992, 297610, 165423, 492770, 404008, 517452, 59748, 315165, 211881, 261564, 468519, 510546, 313305, 218286, 141181, -167741, 356346, 729564, 223591, 114592, 35349, 142511, 344485, 389037, 109128, 410884, 226946, 233238, -306778, 308740, 456684, 266343, 94912, 510486, 513998, 79008, 536122, 279484, 344568, 339739, 205948, 199984, 154560, 290892, 133775, 269046, 36746, 425953, 116573, 532091, 288148, 359521, 467023, 324056, 322924, 290883, 391589, 144823, 444184, 210787, 221605, 721158, 166422, 26217, 94292, 495324, 220955, 311446, 495609, 331235, 534224, 452566, 116315, 424397, 401013, 546241, 370115, 423343, 138082, 566614, 632912]
17097F32912k17843J00104k24596K85040B67061M0628R3991r866J4308K59758
17087F65880j31867j33937K01045j68875n4629C8806M63911j6628K40336k62280
17077D64145K29151k86695L63691k36562K984j52390J57210A31070L97107j50142
17067C78035m0402R0484J89273k40301j40809R4546r5563N1323N90495k89623
17057E87458R3674p790l34289K42165k89517A24623N88078k53891Q4299j11491
17047D31618m5009o4059K83678j62413J49957K35003k65534J89639k82841B30166
17036F96395J14753k29559J10807p1652j80850K1139J09134k1939k17703L19734
17026F50259A95900L99041k11046K71905o0243J61751k81570p5679K40315n3058
$$ y = [632912, 415069, 515173, 290577, 575617, 267061, 307689, 401680, 391814, 406122, 665880, 534013, 400076, 601121, 432246, 377617, 38806, 502717, 486089, 726425, 464145, 693296, 406601, 770292, 533730, 536714, 384324, 541534, 131070, 528177, 378035, 337633, 428117, 617390, 377089, 236280, 330826, 235263, 286586, 877081, 587458, 681132, 673342, 339053, 581218, 291701, 124623, 712701, 458810, 543109, 431618, 386609, 322550, 606228, 443815, 593772, 828775, 563241, 752880, 470039, 230166, 696395, 811148, 581589, 692396, 620744, 439894, 461033, 570167, 548228, 330525, 650259, 195900, 594941, 383895, 655800, 595557, 757308, 475738, 400059, 640374, 587316]
17016E87316j10866K15173J10801K7599D01811k7968R39680n07524k13401P4151
17006F66749B67470K60322j66275J65100L73507D02234L14053j58351L36004l10361
16996E83579L19210j22185k21421M09784D70783J59029K41165Q3121Q6781j16250
16986I24629l2725k36320L21847j09600r2229L03662l60449q4436J53809o0246
16976G27942M05425B31340O58480R4719m19330L02330k52226O03590l25258l10974
16966E82671M21061m4085j97068J54266D45276O00845l07160M10273n2783P4657
16956A171108l48278K84953m03702L05572M5084P4656J16663n9502j32936K46340
16946A299958k35891j70945J34790J42824o0242o326n2362J13500j8792J68455
$$ y = [587316, 476450, 691623, 802424, 830023, 401811, 373843, 1313523, 805999, 592598, 666749, 267470, 527792, 361517, 526617, 900124, 402234, 716287, 557936, 893940, 583579, 902789, 780604, 559183, 968967, 470783, 629812, 870977, 954098, 1040879, 924629, 891904, 655584, 977431, 867831, 775602, 1079264, 718815, 634379, 788188, 727942, 1133367, 231340, 889820, 984539, 565209, 867539, 615313, 1218903, 893645, 582671, 1003732, 959647, 762579, 916845, 445276, 1046121, 738961, 1149234, 1096451, 1171108, 822830, 1107783, 704081, 1009653, 1054737, 1129393, 1246056, 1186554, 1053618, 1299958, 1064067, 893122, 1027912, 1170736, 1110494, 1104168, 1051806, 1165306, 1146514, 1314969]
16936A314969j45035j0747r4362J33080m3420J58137k80619J49662J07070K69670
16926A558405m61316K66067l12173L05447J65765R5720j06586L3696j54418j64024
16916A226583M47235m22674k3183K98572L29303m09563P2144N0645p2803L43308
16906A839567n2133j36574J75476O7396O3102l80987K84820o0540j72081L32445
16896A960491l08062L42386J57275m55497J05272N94974p81511M46306J12367
16887B174001j76721O6047l63783M74254O4516j36049K97097k75090K07795k10520
16877B121547K6877j5096M05843j8334k61753K84501m37771K47636O26043k64782
16867B714711J142j03581k20863L63403O9144k23127L02091l9335P7020K8486
$$ y = [1314969, 1169934, 1159187, 1064825, 1197905, 1154485, 1312622, 1032003, 1181665, 1288735, 1558405, 1097089, 1363156, 1050983, 1356430, 1522195, 1617915, 1511329, 1545025, 1390607, 1226583, 1673818, 1251144, 1227961, 1526533, 1855836, 1446273, 1518417, 1569062, 1496259, 1839567, 1787434, 1650860, 1826336, 1893732, 1956834, 1575847, 1860667, 1800127, 1628046, 1960491, 1652429, 1994815, 2152090, 1696593, 1801865, 2396839, 1615328, 2061634, 2174001, 1997280, 2063327, 1699544, 2173798, 2238314, 2102265, 2399362, 2124272, 2332067, 2121547, 2148424, 2133328, 2539171, 2520837, 2259084, 2543585, 2105814, 2353450, 2979493, 2714711, 2715853, 2612272, 2391409, 2754812, 2823956, 2600829, 2902920, 2863585, 2940605, 2969091]
16857B969091J86506r7837r1203l8475M16202K89100J14638k59119P4850j70752
16847C393001j54497L06207J31740J31377o6972O2020j26362q6268M42850J19821
16837D152917j72165K57778j00496M32169j20311L8019J84006k2124r4617L40099
16827D895275l05492P09512k33517l3343L57596j98670K04611M698j54059L50134
16817E596745K1700M69171J30791J72397k10165N03719r3435L84363J17422J7483
16807G110191J55150K5142J77935K39324J38651J96035M33764p4240M63410O5358
16797H930720J34658L36413M17098j98045O47542Q0425J43355K21499K37820P01694
16787A1653179K31376O6113M91641K77694M84103K09076K70043Q73308J54419
$$ y = [2969091, 3155597, 3057760, 2966557, 2928082, 3344284, 3633384, 3748022, 3488903, 3563753, 3393001, 3238504, 3544711, 3676451, 3807828, 3740856, 3802876, 3676514, 3590246, 4033096, 4152917, 3980752, 4238530, 4138034, 4570203, 4449892, 4487911, 4671917, 4649793, 4555176, 4895275, 4589783, 5299295, 5065778, 5032435, 5390031, 5191361, 5395972, 5400670, 5246611, 5596745, 5618445, 6087616, 6218407, 6390804, 6180639, 6684358, 6590923, 6975286, 7092708, 7110191, 7265341, 7290483, 7468418, 7707742, 7846393, 8042428, 8476192, 8401952, 8865362, 8930720, 9065378, 9401791, 9818889, 9620844, 10268386, 10348811, 10492166, 10713665, 10951485, 11653179, 11884555, 11950668, 12442309, 12720003, 13204106, 13413182, 13683225, 14556533, 14710952]
16778A4710952M98401N57478J02483R35200N00409N79003N73043N97323O89058
16769A9743350P20554N12640Q18015P94507J074694J015876N68219J331628J116324
16760B7695807R94143J324697P47041J696647J542682J304158J639159J829344
16752C8773678J711277J806254K420353J831759K611138K207803K442694K919758
16744E6724714K344283L730470L318948L579196L979962L932829M392429M304353
16736H6307184N174459N233815N502938N826275N830717O298915N863116O893984
16728A32931403O551421O365374O510311O089387N390850N375409M326296L989742
16720A77530193K682176K162045N41745l87076j626670k193042l574910m539973
$$ y = [14710952, 15209353, 15766831, 15869314, 16804514, 17304923, 17883926, 18456969, 19054292, 19743350, 20463904, 20976544, 21794559, 22589066, 23663760, 24679636, 25247855, 26579483, 27695807, 28689950, 30014647, 30761688, 32458335, 34001017, 35305175, 36944334, 38773678, 40484955, 42291209, 44711562, 46543321, 49154459, 51362262, 53804956, 56724714, 59068997, 62799467, 66118415, 69697611, 73677573, 77610402, 82002831, 86307184, 91481643, 96715458, 102218396, 108044671, 113875388, 120174303, 126037419, 132931403, 139482824, 145848198, 152358509, 158447896, 163838746, 169214155, 173540451, 177530193, 180212369, 182374414, 182916159, 182529083, 180902413, 178709371, 175134461, 170594488]
16712A70594488m737920n743598n906089o400804o983803o332890p242881o009549
16704A21236954o723184o145896n658454n546136n770308m826902m964536m597613
16696G7003925m097917m307575l532959l517320l325016k789045k876038k979966
16688D9578089j894013k338850k594066j785558k009815j718641j935999j491043
16680C3810104j101279j469368j508530j308541j101743j015394j120405q53100
16672B4331744j336769q20879l50135j081157q44869m02746p97093o01287n26339
16663A7570470r42727o46124R4126o87799p89482k13517n27369l56409k88752
16654A3212417p13734k28086J21702o00094m86773k34830o53250J38619o78860
$$ y = [170594488, 165856568, 160112970, 154206881, 147806077, 140822274, 134489384, 127246503, 121236954, 114513770, 108367874, 102709420, 97163284, 91392976, 86566074, 81601538, 77003925, 72906008, 68598433, 65065474, 61548154, 58223138, 55434093, 52558055, 49578089, 47684076, 45345226, 42751160, 40965602, 38955787, 37237146, 35301147, 33810104, 32708825, 31239457, 29730927, 28422386, 27320643, 26305249, 25184844, 24331744, 22994975, 22174096, 21823961, 20742804, 19897935, 19495189, 18698096, 18096809, 17570470, 16627743, 15981619, 16075745, 15387946, 14598464, 14384947, 13857578, 13501169, 13212417, 12498683, 12270597, 12392299, 11792205, 11305432, 11070602, 10417352, 10555971, 9877111]
16645I877111K04707p13113J76614k28030l74508k66623n5571k77434l45154k70187
16635G727812j51735K75799j10430n79575j75553k94815j77528j51938q3862K1075
16625F299250J74752n32109r3692k74208j88923j97588L37104j57783m34483M9928
16615D982248K0091K15717m29908J14091k21040k5520k97344N1706k20288j14542
16605D075211N2419k34555K75905k34890Q0482j17404Q183n90571L99630m37723
16595C276687K66406k72289J19868j90891j4487j2929l4853j66401N9166k23065
16585B807212j9786n487j18416L97019n03853L18604l80848N02252k41312n31814
16575B223571M04109j26624K38513m9911m07447N1133l6994k384J63089o9705
$$ y = [9877111, 10081818, 9368705, 9545319, 9317289, 8942781, 8676158, 8620587, 8343153, 7997999, 7727812, 7576077, 7851876, 7741446, 7161871, 6986318, 6691503, 6513975, 6362037, 6278175, 6299250, 6474002, 5941893, 5848201, 5573993, 5385070, 5187482, 5524586, 5366803, 4932320, 4982248, 5002339, 5218056, 4788148, 4902239, 4681199, 4655679, 4358335, 4410041, 4189753, 4075211, 4127630, 3893075, 4168980, 3934090, 4014572, 3897168, 3905351, 3314780, 3714410, 3276687, 3543093, 3270804, 3390672, 3199781, 3185294, 3172365, 3137512, 2971111, 3030277, 2807212, 2787426, 2781939, 2663523, 3060542, 2556689, 2875293, 2494445, 2996697, 2755385, 2223571, 2627680, 2501056, 2739569, 2689658, 2282211, 2333344, 2296350, 2293966, 2457055, 2387350]
16565B387350p9556k07927o5110k2068M9255k28150M14933r1977j90301K51356
16555B217805j46298l94086o2171L27053j80707K35291l68642j11399L06971l90664
16545A433153N07496l52925L94944o14822N17321l36442q4186J27866J59396j88408
16535A563393j18859J6032L7840p7923o3353K15980J34303l86616j46061K21384
16525A396120l07425L33057l22924J25875K76938k03487J21050m6774j8515k88074
16515A065841K99211r7110m2789K59184l53509P9128n1156n6456N7716j66696
16505I93364J17840L4865k7196m78608M64911O34j7146M9033k0597k63845K1217
16494H74472L71260l89434M3928J4496Q5675r8073j51693M21319n27139k483J76767
$$ y = [2387350, 2307794, 2099867, 2034757, 2012689, 2061944, 1833794, 2248727, 2156750, 1966449, 2217805, 2071507, 1677421, 1615250, 1942303, 1761596, 1996887, 1628245, 1516846, 1823817, 1433153, 1940649, 1587724, 1982668, 1367846, 1885167, 1548725, 1464539, 1592405, 1751801, 1563393, 1444534, 1460566, 1498406, 1420483, 1357130, 1573110, 1707413, 1320797, 1174736, 1396120, 1088695, 1421752, 1098828, 1224703, 1501641, 1298154, 1419204, 1372430, 1353915, 1065841, 1365052, 1267942, 1225153, 1484337, 1130828, 1209956, 1158800, 1102344, 1160060, 993364, 1111204, 1146069, 1118873, 640265, 1105176, 1105810, 1088664, 1137697, 1117100, 853255, 874472, 1245732, 856298, 900226, 914722, 1000397, 902324, 750631, 1171950, 644811, 642328, 819095]
16483H19095K81295l59199K47497l12492J9643J7282q6485M46717k69977J34758
16473I38134l31636K73480j00113j07071J72984k7095N1763k15688j63467L13092
16463H04383k09374M9286J81754M3372K7009R3141D62422Q4523K77108j48907
16453F75146R3654C67199J43718L5620N378rK17808L9590C33559M7951L20585
16442G02095J6324k77779O3799J51928B81224o5589K88624J9194J62815m3542
16432F42726m7460R5316j99148j40944J54363L02180j17642j42960j26996N7323
16422D76758M9506p6928j98395K20744k5567M6354J73292q2783l8836J0845o6339
16411D88651K3583j95200L28834q4197k59384M46362k80885r0831J19035B33401
$$ y = [819095, 1100390, 741191, 988688, 676196, 695839, 713121, 626636, 1073353, 803376, 938134, 606498, 879978, 779865, 672794, 845778, 818683, 870446, 654758, 491291, 804383, 595009, 644295, 826049, 869421, 896430, 989571, 462422, 546945, 824053, 675146, 768800, 367199, 510917, 546537, 551915, 551906, 769714, 809304, 333559, 381510, 702095, 718419, 440640, 504439, 656367, 281224, 215635, 504259, 523453, 686268, 642726, 595266, 690582, 491434, 350490, 504853, 807033, 689391, 546431, 419435, 476758, 526264, 449336, 250941, 471685, 446118, 492472, 665764, 582981, 544145, 554990, 488651, 512234, 317034, 645868, 561671, 302287, 748649, 467764, 376933, 495968, 233401]
16400D16290A55075M45756B85681J91394A77439M65413k76658R911n7933M03643
16390G21815k80651K92091C31565j06474L30775B18447L12866J7030k15033J90919
16380E24229k49146J81802j28755r9182K134J41407a85407D61960A47467L19659
16370D67126B02261J90547G4629J3314J58216J69834j44968K78559B40671k9191
16360B11480P2040M5175A43741L24615B5079L80473A20919J82980A42414K97305
16350D39719J73128K50933B37654J22585n3698K21042B45210K38644j6903j27915
16340C39036A56618M049J12155J6657N5614Q9824L6070A56316J19933A9403N16624
16329E36027j85690j60467p7783K13699A43775R8126J86706M5280k11860A18747
$$ y = [416290, 155075, 600831, 285681, 477075, 177439, 642852, 366194, 376105, 318172, 721815, 441164, 733255, 331565, 225091, 555866, 218447, 531313, 548343, 333310, 524229, 275083, 456885, 328130, 228948, 231082, 372489, -185407, 461960, 147467, 467126, 202261, 392808, 74629, 87943, 246159, 415993, 271025, 549584, 240671, 211480, 283520, 328695, 143741, 468356, 25079, 405552, 120919, 303899, 142414, 439719, 612847, 863780, 237654, 360239, 306541, 527583, 245210, 483854, 466951, 339036, 156618, 160667, 272822, 289479, 345093, 434917, 470987, 156316, 276249, 19403, 536027, 350337, 189870, 112087, 325786, 143775, 241901, 428607, 473887, 262027, 118747]
16318D09648A99155K14090k01696D4277K36167A1018J53869J11416I162J25140
16308A34302m6728K18815q9007M98741A3182e740k5978A38036E974B194L03735
16297C05929A48694K34315L36463B96684L9817k9639f3895G8202B7288J08384
16287A35672d1733C064K46355a56114E9280J05835J74838p4879j7061A21574E4523
16275c1404C09933A36539c87252b6312B43918I4003R2058b6731A18308l8388k3410
16264E6510J31979c7587p1138A2171K87235a01773I056J59746J96691a4571q9740
16253a04311C0947L97611a11426D16440j36461P979J79895A74799G2180c6660
16242B71020I4117k9574l2205L06253p1227J37304a25684k6941C22171A51101
$$ y = [409648, 199155, 413245, 211549, 44277, 280444, 11018, 164887, 276303, 9162, 134302, 87574, 306389, 217382, 716123, 13182, -5740, -31718, 138036, 5974, 2194, 305929, 148694, 383009, 719472, 296684, 336501, 306862, -63895, 78202, 27288, 135672, -41733, 3064, 249419, -156114, 59280, 165115, 339953, 265074, 248013, 121574, 54523, -31404, 309933, 136539, -387252, -26312, 243918, 94003, 186061, -26731, 118308, 79920, 56510, 188489, -37587, -108725, 12171, 299406, -101773, 9056, 168802, 365493, -14571, -104311, 30947, 428558, -111426, 416440, 279979, 287958, 467853, 174799, 72180, -36660, 271020, 94117, 64543, 32338, 338591, 267364, 404668, -125684, -152625, 322171, 151101]
16231B74325i5363A66235N96527A33056L6623Q1661h6662c5065A85342H704J60288
16220A68992h539j25093A14983P0197d529m0804A13839J71449j37837e9524A11359
16208a82630f9624C50075g272B79028e4755E5979J79480i8282B07277B40h2111
16196b08480a3394q4542A30817C8020g4517p3759G227J23730Q3552b47631e3983
16184A47167F0549g6602B8451O3708j09g6081A32912K23542b7595J877F63086
16172g0961B46922d10158d3027I8403C8640a8076B04148g3179C74889c77668A6341
16160b29333j886A21274K15022A35487K73537j58207b3934B84601A1480N4144
16150F5624a98831A13429K53017j36417b09438n2548A10208i513j52484N3421
$$ y = [274325, -95363, 166235, 762762, 133056, 169679, 251340, -86662, -35065, 185342, 8704, 168992, -8539, -133632, 114983, 185180, -4529, -45333, 113839, 285288, 147451, -59524, 111359, -182630, -69624, 350075, -7272, 279028, -54755, 55979, 235459, -98282, 207277, 240, -82111, -208480, -13394, -97936, 130817, 38020, -74517, -148276, 7227, 130957, 214509, -247631, -53983, 147167, 60549, -76602, 28451, 92159, 92050, -76081, 132912, 356454, -27595, -25718, 663086, -70961, 246922, -410158, -43027, 98403, 38640, -18076, 204148, -73179, 374889, -377668, 16341, -229333, -231219, 121274, 336296, 135487, 409024, 250817, -23934, 284601, 11480, 65624, -198831, 113429, 366446, 230029, -209438, -261986, 110208, -9513, -161997, -108576]
16140a08576B54146c36354A09764M1346l9041e7660I3732m342K40531p7229g3269
16128a43019O5933k84789J51207A40555L60701a25143C60098b29442L6176I8890
16117F9877a34619j98000g8994A71373L9029h9637k36183B36593f4935K7853C4269
16105b3771A840a20041B32886i5094B99510A05003a21134B01605D7151c5267A56934
16093I3410d88383C03040a63560c4682G7969O6517a03157B39179c4156j69164
16083b03320A66127d1151r0131j15318e8344H6889j376d855B6099f5628p2640
16072a38268C11813a52646a1680A25389b5582i040B89403d921G7995b9591p9059
16061a08650A20282C1858K68706g4924m6001j13203G9724a57568C26816F3638
$$ y = [-108576, 254146, -336354, 109764, 151110, 112069, -57660, 93732, 89390, 329921, 252692, -73269, -143019, -77086, -361875, -210668, 140555, 501256, -125143, 360098, -229442, -193266, 98890, 69877, -134619, -332619, -78994, 171373, 210402, -89637, -325820, 236593, -64935, -37082, 34269, -23771, 1840, -120041, 232886, -95094, 299510, 105003, -121134, 201605, 47151, -35267, 156934, 93410, -488383, 303040, -163560, -34682, 77969, 144486, -103157, 239179, -34156, -203320, 166127, -41151, -131282, -246600, -58344, 86889, 85513, -4855, 26099, -65628, -138268, 311813, -152646, -11680, 125389, -25582, -9040, 289403, -4921, 77995, -29591, -108650, 120282, 31858, 300564, -74924, -120925, -234128, 79724, -157568, 326816, 63638]
16050a92263A31516a22308A09780a03296C25036A11998R5366c6272B4883J98015
16040B22898c5909k0158D8474c32459B53906j19838O0200a88147A54774R2316
16030B47090b25322d5353A01364c3705k4179j29061A84619j7540K1427F0337R141
16019F9478b6223H9658M9015i6712n2860B09212D4874E987P9873d0322A41496
16007e4126R848k75478J04050e6790A6709J82825a77169j95261B09036a50190
15996a56826A49240G0367L21482b8977r3400C03998m6962j10057h9040p8498n3066
15985b20604E4329J66489F2176J28776l9897J89572A55476J2795n9176k6337d0683
15973C0676c9414k83996d2878k50250m9529H3080L1020b12428f6643a5259B34110
$$ y = [-192263, 131516, -122308, 109780, -103296, 325036, 111998, 207364, -36272, 24883, 222898, -35909, -56067, 48474, -332459, 253906, 134068, 194268, -188147, 154774, 247090, -225322, -45353, 101364, -33705, -57884, -186945, 184619, 167079, 188506, 60337, 69478, -26223, 89658, 138673, -96712, -149572, 209212, 44874, 5987, 85860, -40322, 141496, -54126, -44278, -319756, -215706, -56790, 16709, 199534, -177169, -372430, 209036, -150190, -156826, 149240, 70367, 391849, -28977, -122377, 303998, 257036, 146979, -89040, -167538, -220604, 54329, 220818, 62176, 190952, 151055, 340627, 155476, 168271, 109095, 82758, -40683, 30676, -39414, -323410, -42878, -293128, -342657, 83080, 114100, -212428, -66643, -15259, 234110]
15961h9133A59186C8251a27238j86453C47547a83041A23488k9416J28587A01943
15950a901B76091c8471A31379b03697d471k21718A69759b78969E634K62210b08784
15938A43850g8277A06538K20267b94080H52K19240a07792l71790e8152A64823
15927c47738a2978A10502P060N4855g6952r5219F4112a67122A18519B749a36550
15915D655a92230A16215o063a40780a5156k87342i8571A16949a3124B05072e7611
15903D118O165P9129J92773b15597b959j84979j13882a42076d3545m1263h562
15891a43593j37150P6116i672j11970j3321o3896N9946M6634A54790b81887I4085
15879a16798b8656A7007a17764q6816h523k95617C26585b69062B20859d20395
$$ y = [-89133, 159186, 38251, -127238, -313691, 347547, -183041, 123488, 94072, 222659, 101943, -1901, 276091, -38471, 131379, -203697, -4471, -226189, 169759, -278969, 5634, 267844, -208784, 143850, -78277, 106538, 326805, -294080, 852, 220092, -107792, -479582, -58152, 164823, -347738, -12978, 110502, 117562, 172417, -76952, -172171, 64112, -167122, 118519, 2749, -136550, 4655, -192230, 116215, 110152, -140780, -15156, -302498, -98571, 116949, -13124, 205072, -57611, 4118, 10283, 89412, 282185, -215597, -2959, -187938, -301820, -142076, -43545, -84808, -8562, -143593, -280743, -204627, -9672, -121642, -134963, -198859, -138913, -92279, 154790, -281887, 94085, -116798, -28656, 17007, -117764, -204580, -8523, -304140, 326585, -269062, 220859, -420395]
15868E2125a2126D181J28019e03318B84026a77725q2944e6329m00453B4464b61602
15856A03535Q1424a96686H2695a56202B27519a86936A25816E1529b07413h3710
15845C02475c42390i0585k3083B369d5885q8822a2558j80521B51081a97076f5589
15833a04013A609b25237N9756l8804i1179I4736b69795F8935J46844a08017A54057
15821a23612j25662D7192a21954A17345h3390p5800J3331j24971k2923f8646A4461
15809f8104D2717P8164K2164C5064f7452A81232J57428A14031a0325A16702c71793
15797i6876L1452j31081A99186p0123b22187B9197i1463n0588A45565n0426l4445
15786F0694b59272q5350R7667C2875g336q5525e183q7010A11439a21326A95636
$$ y = [52125, -12126, 4181, 132200, -503318, 284026, -177725, -260669, -56329, -456782, 24464, -261602, 103535, 184959, -196686, 82695, -156202, 227519, -186936, 125816, 51529, -207413, -83710, 302475, -342390, -90585, -113668, 2369, -45885, -134707, -12558, -193079, 251081, -197076, -65589, -104013, 1609, -225237, -165481, -204285, -91179, 94736, -269795, 68935, 215779, -108017, 154057, -123612, -249274, 47192, -121954, 117345, -83390, -159190, -145859, -270830, -293753, -68646, 14461, -68104, 42717, 120881, 143045, 35064, -67452, 181232, 338660, 114031, -10325, 116702, -371793, -96876, -65424, -196505, 199186, 129063, -222187, 29197, -91463, -142051, 145565, 95139, 60694, -259272, -344622, -246955, 32875, -7336, -92861, -5183, -92193, 111439, -121326, 195636]
15774c411G6384L6061m4057K3604K8358a98373B1288m089K4880f1023j91559P6571
15762a76011o924H0831a99639e2266A46341b1427D0461N2300J80984G9886P0178
15751A50064b40538k22454h7147J1239A57606a73860o0601q0121K464A22277J53535
15740B75812a14086Q33j25135H7795K14415a80468A82562g477k25257Q4670D385
15728G5605h6626r2660B1485M001j491g9575A68206O1665b41922a01794J7434
15717h4360L1349G0578Q2875a84177G7243r811J22635d6688D5737K03043j18670
15706A30110Q5629G942J53379K6890E4219J34414c04l4896n0373j44481B8993
15694b10440I6537a8357A34012a23348A01501l7438c33021e4260b2383A64861
$$ y = [-3411, 76384, 112445, 68388, 91992, 120350, -198373, 21288, 17199, 42079, -61023, -252582, -176011, -182935, 80831, -199639, -52266, 146341, -21427, 40461, 92761, 273745, 79886, 150064, -240538, -462992, -87147, -75908, 157606, -173860, -234461, -314582, -312118, 122277, 275812, -114086, -113253, -238388, 87795, 302210, -180468, 182562, -7477, -232734, -148064, 4385, 75605, -86626, -179286, 21485, 25486, 23995, -79575, 168206, 229871, -241922, -101794, -84360, -53011, 70578, 153453, -184177, 77243, 67432, 190067, -46688, 45737, 248780, 130110, 215739, 7942, 161321, 188211, 54219, 188633, -304, -35200, -85573, -230054, 28993, -210440, 96537, -18357, 134012, -123348, 101501, 64063, -333021, -54260, -22383, 164861]
15683c89156O0281E9139K17156j17828F2722d0446C1126a65503A07005i8155E865
15671a66464H7878c69949a76037A11902C9429E165a86999B41941a40260M4382
15661i5878A73886G2473k9281i743B52627d15671O1876a18444L148E794f0848
15649c25040B40590e4489j6271C3102J11943G510i5017a1287j6763j04656A23070
15637e6704B8631a74495H083a7989j56474H8304a46694B38020L1597a50633A27098
15625A45935r847d4166L464a3250q0482B96068G831c14123D308N8979b86916A79894
15612B09033c2682j89789B70553a461j2563A56717a38444k77612i5850E18655
15601b1100n3570j84527H1932a19060F004h5667j13294G9392a29327q411K0904
$$ y = [-389156, -328875, 59139, 276295, 158467, 62722, -40446, 31126, -165503, 107005, -98155, 5865, -166464, 87878, -369949, -176037, 111902, 39429, 5165, -186999, 241941, -140260, -95878, 173886, 72473, 43192, -9743, 252627, -415671, -353795, -118444, -115296, 5794, -60848, -325040, 240590, -54489, -70760, 33102, 145045, 7510, -95017, -11287, -28050, -132706, 123070, -56704, 28631, -174495, 8083, -17989, -174463, 88304, -146694, 238020, 269617, -150633, 127098, 145935, 136088, -44166, -40702, -13250, -93732, 296068, 7831, -314123, 4308, 63287, -286916, 179894, 209033, -32682, -222471, 270553, -1461, -14024, 156717, -138444, -416056, -95850, 518655, -21100, -74670, -259197, 81932, -119060, 6004, -85667, -198961, 79392, -129327, -137738, -116834]
15590a16834b8609o2933B182Q6960j1761O804K8273o489h9890j13259G9409P585
15578H6994a89558f0676F6891K54335a57612d8090A34676a60812A05951J8573
15568A24524g4382a8469C10394F2560b33363I3700l3363P7638c5850F259a99809
15556F3804K06301b18114D8768a04654B61992e2722R96n9351A18004a46441K9445
15545a16996B30444q1839b20597P7542j6194A3889c04725B36800c9806F8041A406
15533a00298K213a3211F1933b05735g2520B13438g5024H2984P5533o2089b8054
15521I4125c24425C0972a02584A7171G195L2669a87396H0297h4792B01806b2110
15509e1333C8835a20140n3007k2074B9387a08374H2737b19278J03772N4490l6862
$$ y = [-116834, -28609, -91542, 2182, 89142, 77381, 84185, 112458, 105969, -89890, -203149, 79409, 86994, -189558, -60676, 66891, 321226, -157612, -48090, 134676, -160812, 105951, 124524, -74382, -18469, 310394, 62560, -233363, 93700, 60337, 137975, -35850, 6259, -199809, 63804, 270105, -218114, 48768, -104654, 261992, -52722, -51726, -111077, 118004, -146441, -116996, 230444, 148605, -220597, -143055, -159249, 13889, -304725, 236800, -39806, 68041, 1406, -100298, -98085, -13211, 61933, -205735, -72520, 213438, -75024, 82984, 158517, 96428, -28054, 94125, -324425, 30972, -102584, 17171, 7195, 39864, -187396, 80297, -84792, 201806, -22110, -51333, 38835, -120140, -173147, -195221, 29387, -108374, 82737, -219278, -115506, -61016, -97878]
15498i7878j44847L5174m6133I6556J62507a45125L8622D3484e15787b40432D86045
15486i9533A10241K6820a53120A11824b18181A44377a33606k64091A58520d10820
15475h5690k60497A40048Q9791H1414j4039c6376j80301A66004A630g8602j47218
15464b25820B11845a40438D1761b76378f960C7590a01443j25059g5947A41257
15453B84229F6872N3040l2296L48930H5074a20875B6003N5702M8088n1004i9516
15441g7873p1027A22254m4774a9918E9314Q417c48511d3414j25053j01310J19005
15430a50772J4257A95548a09055p7206Q6783q4361l28620h5534C0872J78039a37977
15418a32218C71500A3975M2968b20314M3411p5365i0326C4544a32142L6857A42162
$$ y = [-97878, -242725, -207551, -253684, 96556, 259063, -145125, -106503, 43484, -515787, -240432, 486045, -99533, 110241, 137061, -153120, 111824, -218181, 144377, -133606, -397697, 158520, -410820, -85690, -346187, 140048, 229839, 81414, 67375, -36376, -216677, 166004, 1630, -78602, -225820, 211845, -140438, 41761, -276378, -6960, 37590, -101443, -226502, -75947, 141257, 284229, 66872, 119912, 87616, 436546, 85074, -120875, 26003, 81705, 129793, 78789, -99516, -77873, -148900, 122254, 77480, -19918, 59314, 67731, -348511, -43414, -168467, -269777, -150772, -136515, 195548, -109055, -186261, -99478, -183839, -512459, -85534, 30872, 208911, -137977, -132218, 371500, 13975, 56943, -220314, -176903, -252268, -90326, 34544, -132142, -95285, 142162]
15406a272m9426B44328l0675l4309J6987m4241r822A1752K2466g9754k88670I2804
15393B05351h2993A79265b26103F0659J01500a57204C29338b19717G0779Q7807
15383A58586R8440b15589D181J71857N9087a35209B07223a44495c8089o3429B5588
15371h743F7482b69701R3432g0969a3303q8333A78683a04089R116A9339e9365
15359A7587b88530J23330f8295j67060F502b24580c9832A83552J07878r2719H3126
15347i4989B74581H8246c30874F6966J69090f188A5354a64024j55674I3858E652
15335A96319e8595a5297j82388L9403D22461d1151j93029R0107A19873A0236L190
15324A3426K46849f2972B04799h4561d0884q6102B82463a99927f2578L098k1724
$$ y = [-1272, -50698, 244328, 213653, 179344, 196331, 152090, 142268, 11752, 34218, -79754, -368424, 92804, 205351, -82993, 179265, -226103, 60659, 162159, -157204, 329338, -219717, 70779, 158586, 257026, -215589, 4181, 176038, 235125, -135209, 207223, -144495, -38089, -101518, 25588, -8743, 67482, -269701, -176269, -70969, -13303, -101636, 178683, -104089, -94973, 19339, -59365, 17587, -288530, -165200, -68295, -235355, 6502, -224580, -39832, 183552, 291430, 198711, 83126, -94989, 274581, 88246, -330874, 66966, 236056, -6188, 15354, -164024, -319698, 93858, 5652, 196319, -58595, -15297, -197685, -158282, 422461, -41151, -234180, -144073, 119873, 10236, 13426, 260275, -62972, 204799, -84561, -40884, -126986, 282463, -199927, -62578, -59480, -81204]
15313h1204b5979p0064E2424k2509J71316c32831a21443k17801C225J30298a84544
15301A91139B3593f1909m2303A22744A3886N1504J21232g885B40580O7744M9761
15290C58085A63533c7920l6632d29G2533L51417D7455a50405A53285c47094d0936
15278F4843J44230O6132c77803F7663B1746L90718A44728J36994d9436j44669
15268a94105D0944M5887p15L4067O4262o459D552J07517e5122E84342c798G5271
15255A95835D076a7378B51388j5224K64249q0249N39549L16926j12784j19251
15245A044604l47644k54289k15305G1599e2334k23620d1050B06275q8859n291
15235A12125C6940a5125A9853K49525j03394Q6691a30375M7327g376G4625d4313
$$ y = [-81204, -25979, -96043, 52424, 29915, 201231, -332831, -121443, -339244, 3225, 133523, -184544, 191139, 23593, -61909, -104212, 122744, 13886, 65390, 186622, -7885, 240580, 308324, 358085, 163533, -37920, -74552, -429, 72533, 423950, 47455, -150405, 153285, -347094, -40936, 64843, 209073, 275205, -377803, 67663, 21746, 412464, 144728, 281722, -49436, -194105, 40944, 86831, 86116, 120183, 184445, 177986, 4552, 112069, -55122, 584342, -3798, 75271, 195835, 4076, -17378, 251388, 236164, 500413, 420164, 959713, 1276639, 1163855, 1044604, 696960, 442671, 227366, 71599, -52334, -275954, -41050, 206275, 117416, 112125, 36940, -15125, 19853, 269378, 165984, 252675, -130375, -83048, -7376, 74625, -44313]
15223c1937j62393d7936H495J82043J03100p3632c2977C66591o2707j43052a85157
15211F3472b55233n5355B9584a07859B23417F2547a8752n1839B99623c4974k01954
15200b36928G0661a4308c662o5442B9632J13824N9466a4540A09491J14861a84146
15188B12275I423J14851hB39639F9918g0846k46840H7662j0517O9246D9470K95820
15176C45290k383k4643J72275A11392J79213a03279A00364J52884b68937A57699
15165E3258a05662B74433D9674k3473M5280a27900G5291A7947L03699j33857a25845
15153g6441D01769A32002J82306m6976g9820A70765I715b09905A34492Q9104b04120
15141B15760J30772P8510a72587B20228d05221C57066a36914B42851q1219p6684
$$ y = [-31937, -194330, -47936, 8495, 190538, 293638, 220006, -32977, 366591, 303884, 160832, -185157, 63472, -255233, -310588, 29584, -107859, 223417, 62547, -18752, -70591, 299623, -34974, -236928, 70661, -14308, -3662, -69104, 29632, 143456, 202922, -14540, 109491, 224352, -184146, 212275, 9423, 124274, -8, 239639, 69918, -70846, -317686, 87662, 77145, 146391, 49470, 345290, 342907, 318264, 490539, 111392, 290605, -103279, 100364, 253248, -268937, 157699, 53258, -105662, 274433, 49674, 26201, 71481, -127900, 75291, 17947, 321646, 187789, -125845, -76441, 401769, 132002, 314308, 267332, -79820, 170765, 9715, -209905, 134492, 223596, -204120, 215760, 346532, 425042, -172587, 220228, -405221, 357066, -136914, 242851, 161632, 84948]
15131H4948d8655I1689A91b5353B32170r8333f746k08072B67399j16330J13735
15120B64804c1477A9743a90825l8820G9123K956L34508b32696R8032E7894g3050
15108I9924A548J92286N088m5121A9723K54671l3848p6901K52240A5182K64831
15097B80013A5652J21875c62490a35046C01331A10727J61132J04806a11080C99323
15086I3866K12813H4991b82998A0153g3609o1657A45028k8686a15525a3696A02405
15074a46000A0683a4340E37337B08195b81321I2524J2336f3690B046P5421O6974
15063A44441a14672d8157A81558q0834P9636J98218j39668c0610k7989B0833J3465
15052C4298b27063B98498J07038A99490d7082A16318b3834e381B61283A030N65777
$$ y = [84948, -48655, 91689, 191, -25353, 232170, 133837, -6746, -214818, 267399, 151069, 264804, -31477, 19743, -190825, -229645, 79123, 82079, 416587, -232696, -134664, 57894, -73050, 99924, 1548, 193834, 198922, 153801, 19723, 274394, 240546, 163645, 415885, 15182, 280013, 15652, 137527, -362490, -135046, 301331, 110727, 271859, 376665, -111080, 399323, 93866, 306679, 84991, -282998, 10153, -73609, -135266, 145028, 116342, -115525, -13696, 102405, -146000, 10683, -14340, 537337, 208195, -281321, 92524, 104860, -63690, 2046, 77467, 144441, -114672, -48157, 181558, 100724, 180360, 378578, 238910, -30610, -58599, 20833, 34298, -227063, 298498, 405536, 199490, -47082, 116318, -23834, -5381, 261283, 1030, 566807]
15041E66807k73397A4085J75046a255A51852L2537a20616B33465N2519L09345
15031E95329A23471J09415A01281J49339A16447K39855a74748C00775D563b25741
15020C15076j23191r1020j733a7618C2352L33146J05692B21230I5118K90687A44905
15008A4999K17071k7220q0984P949Q5705L9199K21471k37886h6399A45973K74740
14997D20713p4988A54460J66830f0780C65814H0413f5510A70833q1210J05929
14987A95552D6165J85261A14089K78206j69982k5042C1929L23671j67747Q2913
14977B70766a53341A48024l5579f0428C7188J89684C6643J98891A8865J894L08578
14966C29337j21096o5353M9809J21732K2643j21959J43558j60191Q1374j38918
$$ y = [566807, 293410, 14085, 189131, -1255, 151852, 184389, -120616, 233465, 285984, 595329, 123471, 232886, 101281, 250620, 116447, 356302, -174748, 300775, 4563, -225741, 315076, 191885, 100865, 99132, -17618, 32352, 365498, 471190, 221230, 95118, 385805, 144905, 14999, 232070, 204850, 123866, 131815, 217520, 256719, 478190, 240304, -86399, 145973, 420713, 345725, 154460, 321290, -60780, 365814, 80413, -65510, 170833, 89623, 195552, 46165, 231426, 114089, 392295, 222313, 197271, 31929, 355600, 187853, 270766, -153341, 148024, 112445, -60428, 37188, 226872, 36643, 235534, 18865, 20759, 329337, 208241, 142888, 192697, 314429, 337072, 215113, 358671, 198480, 279854, 140936]
14956A40936a5058D86556C050M44534B15820q6929E9772M73195k04690k1059A51813
14944D04090j43557a73315A81355O9315j0721j7646l6970J30755J6692P8265A16729
14932D76156H3017M7416J82542j2678l7570k5782K23987j98788D0425L01908A13339
14920B28965m3297N05035l05882E8508O7775L59462G7121L05138J73594j97279
14910C58574C3773L40848j02491h9281D77407A3891J76015J11463A13341K05195
14900C18536j52940n1615K31473j18486J19367K82840k42150A77850J22646J89302
14890D89798Q1343j51764L9447J03990J94724A93487L77737A34427L02970j07703
14880C29694J67464j49650j36236J01424n0161J25903j57297M25676k96238q685
$$ y = [140936, -15058, 486556, 3050, 447584, 215820, 128891, 59772, 532967, 328277, 307218, 151813, 404090, 260533, -173315, 181355, 250670, 239949, 222303, 185333, 316088, 332780, 411045, 116729, 476156, 83017, 130433, 312975, 300297, 262727, 236945, 460932, 262144, 40425, 342333, 113339, 228965, 185668, 690703, 384821, 58508, 126283, 485745, 77121, 382259, 555853, 358574, 33773, 374621, 272130, -89281, 477407, 13891, 189906, 301369, 113341, 318536, 165596, 113981, 345454, 226968, 346335, 629175, 387025, 177850, 300496, 489798, 571141, 419377, 458824, 562814, 757538, 193487, 571224, 134427, 437397, 329694, 497158, 347508, 211272, 312696, 262535, 388438, 231141, 656817, 360579, 351894]
14870C51894P242J74952B23542J58463j74336J87314j21780k0796P7872j31673
14860A98606K81250j36082L90171j99002o4528J04491B80362K11192B26588K09705
14850D36293j49771P4485L2634j75984J54777F0570K1781K47659M975K11583k37926
14839C08642A49585P68854m12683r6826k747A47748O1640L23775B29889M56273
14829F86162A43198L40923J65967j05998J06684B64294J34752j21817J89815j52423
14819C14621L43819j99686K49159C22814L75780j88786n9254K04464R273j87174
14809D77117j25553L98536k53068k3116M70401l99939j58544K5331P5618N0390
14799E37173n729k39944L09881B58561J82923l9032l1815K28312B68767K87003
$$ y = [351894, 359136, 534088, 223542, 382005, 207669, 394983, 273203, 252407, 330279, 198606, 479856, 343774, 733945, 534943, 470415, 574906, 280362, 491554, 226588, 436293, 286522, 361007, 393641, 217657, 372434, 60570, 82351, 330010, 334985, 546568, 308642, 149585, 918439, 505756, 408930, 406183, 147748, 209388, 533163, 229889, 686162, 143198, 484121, 650088, 544090, 650774, 264294, 399046, 277229, 467044, 314621, 658440, 458754, 707913, 322814, 698594, 509808, 450554, 655018, 664291, 477117, 351564, 750100, 497032, 473916, 944317, 544378, 385834, 411165, 486783, 537173, 531444, 291500, 601381, 258561, 441484, 402452, 370637, 598949, 268767, 555770]
14789E55770F0763L24949N0392Q8579J72920j96746p5248L71656L3291B76067
14778E67804j72412K71783l04755K23899J49098j90882j56883P2190O7408P1832
14768E99082j60640L2276R2184l7663O4911B94422R776K29858j02737K43230o2034
14757F12515K06995j80699C14390N42383p9733j51626J9031J38433j74292L64133
14747I72719k50824r5795P9431J32975n8354R8561j09449j93740O2021o9599L12437
14736H80383j04649j63221L05506k93555m8124P1303K46093k4297j57364j32514
14726E79561J31078k58701K84095p2852j33890J90836j33206M18276j68131l0699
14716H06367K3377l9517L33526j45244J46590m54763M5921O8718J38786k64529
$$ y = [555770, 60763, 385712, 436104, 524683, 697603, 500857, 425609, 797265, 830556, 276067, 567804, 395392, 667175, 362420, 586319, 735417, 544535, 387652, 459842, 527250, 599082, 438442, 470718, 562902, 525239, 590150, 294422, 304198, 534056, 431319, 674549, 612515, 819510, 638811, 314390, 856773, 777040, 625414, 644445, 782878, 608586, 972719, 721895, 626100, 705531, 838506, 780152, 878713, 769264, 575524, 637545, 567946, 880383, 775734, 612513, 918019, 624464, 576340, 647643, 893736, 869439, 712075, 579561, 710639, 451938, 736033, 663181, 529291, 720127, 586921, 1005197, 837066, 806367, 829744, 790227, 1123753, 978509, 1125099, 670336, 716257, 784975, 923761, 659232]
14706F59232j33741J38231L32045l66159J19533k3509J90463J12325l09355M08666
14696A127731k78972k744p1101N37060n57757M7313J37569K19721j50938k82356
14686G25526M75150l04038Q2666M979j26504o5149N1023m8725M6693J79844j09562
14675I11903J28473L4524m7707j84410p7074M36812m62709m3854O30000j81921
14665A144037J55667k79343k386l7321j89552o5759P07574k85016l7966K7605
14655A137540K2832K55674o02738L56674E36093M51926L05595j2280l42899L78116
14645A316551r9752j5579l55316M61554j69981Q5529P1625J17730M9051l09894
14635A151518j02899K21396n3911j29458M84544j15933k63696O4530J4564l5254
$$ y = [659232, 525491, 663722, 995767, 629608, 749141, 725632, 916095, 1028420, 719065, 1127731, 848759, 846015, 774914, 1311974, 754217, 801530, 939099, 1158820, 1007882, 725526, 1200676, 896638, 979304, 984283, 857779, 792630, 843653, 794928, 841621, 1021465, 911903, 1040376, 1074900, 1027193, 842783, 765709, 1202521, 739812, 695958, 1325958, 1144037, 1299704, 1020361, 1017975, 980654, 791102, 725343, 1432917, 1147901, 1109935, 1137540, 1160372, 1416046, 813308, 1169982, 536093, 988019, 1293614, 1281334, 938435, 1316551, 1216799, 1201220, 845904, 1307458, 1137477, 1223006, 1294631, 1412361, 1461412, 1151518, 1048619, 1270015, 1216104, 1086646, 1571190, 1455257, 1191561, 1256091, 1270655, 1235401]
14625A235401M0282k38423l9196J57574J07067J78492k06361R2445R9595L1591
14615A458467J17954j40747m523L07343j99441m5895M4675m8718j30841J5108
14605A373382L24453k03538o2853R8100K9413K25376l50880R6516K16400k60497
14595A485872K93195l91169M12296j7525L2772k636k55689P04133k58175l34477
14585A668597K22220K20836k4228j95249j19238N02093m58089K88430j17978j04590
14575A882804J15163j36414n5713L10303J38564r3874K32932j51255J74377k09141
14565B207746K17115K25093j52575n4390J86652l00335M93840Q1037j25403l1717
14555B747063O29419L76912L220P0803N67680Q82670K256683L559446Q386738
$$ y = [1235401, 1275683, 1037260, 998064, 1155638, 1262705, 1441197, 1234836, 1327281, 1426876, 1458467, 1576421, 1435674, 1431151, 1738494, 1539053, 1493158, 1537833, 1489115, 1358274, 1373382, 1697835, 1494297, 1431444, 1529544, 1558957, 1784333, 1433453, 1529969, 1746369, 1485872, 1779067, 1387898, 1800194, 1782669, 1815441, 1812805, 1557116, 2261249, 2003074, 1668597, 1890817, 2111653, 2087425, 1892176, 1772938, 2275031, 1816942, 2105372, 1987394, 1882804, 1997967, 1861553, 1805840, 2116143, 2254707, 2160833, 2393765, 2242510, 2416887, 2207746, 2424861, 2649954, 2497379, 2442989, 2629641, 2329306, 2823146, 2904183, 2778780, 2747063, 3376482, 3753394, 3756614, 3827417, 4395097, 5277767, 7534450, 11093896, 19480634]
14546A9480634J5729024J1643263k1721528A0428609E106932j485159j203430
14539B418343p0278k75631o0763j48147J69623j14677k5446K06681J08071j73938
14529B033838J69638K04175k68246L95128r2113o0124Q5292K819k62325P36754
14519B944836m06446k89117M01300l01811n766L89266m3717L46875j85812q1516
14509B768092m7972J00690J97643j16518K7215k03606P70474k48823k86254Q6079
14499C047020K02435k113n4227L9639J00412R08r3398K33249k56555K43070m0187
14488C420253K28046k97977O65301n31374j89030L90079K42464l37266l978M37728
14478D024246k68563L69831j43882k73344K61893K07062K14732m27248M16971
$$ y = [19480634, 35209658, 46852921, 25131393, 10428609, 5106932, 3621773, 2418343, 2348065, 2072434, 2011671, 1863524, 2033147, 1918470, 1893024, 2099705, 2207776, 2033838, 2203476, 2407651, 2139405, 2534533, 2442420, 2382296, 2467588, 2470407, 2208082, 2944836, 2538390, 2249273, 2650573, 2348762, 2342996, 2732262, 2688545, 3035420, 2849608, 2768092, 2720120, 2820810, 3018453, 2901935, 2929150, 2725544, 3496018, 3247195, 2960941, 3047020, 3249455, 3247342, 3193115, 3232754, 3333166, 3334074, 3240676, 3473925, 3217370, 3460440, 3420253, 3648299, 3350322, 4015623, 3484249, 3295219, 3685298, 3927762, 3590496, 3586518, 4024246, 3755683, 4125514, 3981632, 3708288, 3970181, 4177243, 4391975, 3964727, 4381698]
14469D381698J50600m10847P2985M3465J84610N4125J47219M21224n80949M87857
14459D951987j69165N28648l46310r1843L69633n41234K49043K91520j74038K23549
14449E291790J07354j35889M07202K48161k70956K16780n6634K80688k44234P3204
14439E917466L77523j70034j36382j83M73623j4774r2495L76822j02248N53L34625
14428F964496R4179l30714O08485J04814j32047r3014K36003M30025j39024K92411
14418H035614L774J67781J56904Q7131J69915j52170L26522J43854J41734L3274
14408I114333j28646K79118O34415m25576L83834p1804L07398L89598j0546K32812
14398A0704936L9475K56137K94054R7070O20228k4774j59881L06784K1859L96408
$$ y = [4381698, 4532298, 4121451, 4194436, 4237901, 4422511, 4476636, 4623855, 5045079, 4464130, 4951987, 4782822, 5311470, 4965160, 4873317, 5242950, 4701716, 4950759, 5242279, 5068241, 5291790, 5399144, 5263255, 5670457, 5918618, 5647662, 5864442, 5807808, 6088496, 5844262, 5917466, 6294989, 6124955, 5988573, 5988390, 6462013, 6447239, 6354744, 6731566, 6629318, 6629871, 6964496, 7058675, 6727961, 7336446, 7441260, 7309213, 7216199, 7452202, 7882227, 7743203, 8035614, 8039388, 8207169, 8364073, 8451204, 8621119, 8468949, 8795471, 8939325, 9081059, 9114333, 8985687, 9264805, 9899220, 9473644, 9857478, 9785674, 10093072, 10482670, 10472124, 10704936, 10744411, 11000548, 11294602, 11391672, 12011900, 11987126, 11827245, 12134029, 12155888, 12552296]
14388A2552296N41776o0890K24213K76279J01620O35561J75980N5679M73264J96822
14378A5172600J65471K26717L30713M48348j45039M93862L51910N35129M20028
14369A7999739K96845L16593N33566M2528Q13670L33116L68410P10536L37294
14360B1752297J69956M46616P09879J36060Q99159N92362N31376O41099Q55178
14351B6733982O81744J91791J066102L62684J367733J08616J014208R25041P76125
14342C3228026P78459R99880N86768J217123J063785R38783J133052J454144Q67665
14333D2267685J620882J337945J113240J471584J629256J472965J634644K101655
14325E4649856J490126J758235K304549J724490K232349K183001K563239K646990
$$ y = [12552296, 13094072, 13033182, 13257395, 13533674, 13635294, 14270855, 14446835, 14502514, 14975778, 15172600, 15338071, 15564788, 15895501, 16343849, 16198810, 16692672, 17044582, 17579711, 17999739, 18296584, 18613177, 19146743, 19189271, 20002941, 20336057, 20704467, 21415003, 21752297, 21922253, 22368869, 23078748, 23214808, 24113967, 24706329, 25237705, 25878804, 26733982, 27415726, 27607517, 28673619, 29036303, 30404036, 30512652, 31526860, 32451901, 33228026, 34006485, 35006365, 35593133, 36810256, 37874041, 38812824, 39945876, 41400020, 42267685, 43888567, 45226512, 46339752, 47811336, 49440592, 50913557, 52548201, 54649856, 56139982, 57898217, 60202766, 61927256, 64159605, 66342606, 68905845, 71552835]
14317G1552835K747183K938554K690104L185992L243254L777918L279934L813307
14309I7229081M175431M259800M437631M635839N415348N511768N481828O033215
14301A37179941O179945O933145P126586P453330P948176Q321073Q972900R528173
14293A99643269J0047643J0343024J1166662J1574134J1912839J2410626J3043957
14286B80142154J3839898J3489698J3975284J4679763J4148823J4298687J4138619
14279C78712926J3720997J3317105J2321069J1138721R802983P937114N528525
14272D52479440K009514k100009k599223o8958k070457m905303o885275q623813
14264D27235916r903733j1351221j2498680j4037731j4853970j5413688j5273233
$$ y = [71552835, 74300018, 77238572, 79928676, 83114668, 86357922, 90135840, 93415774, 97229081, 101404512, 105664312, 110101943, 114737782, 120153130, 125664898, 131146726, 137179941, 143359886, 150293031, 157419617, 164872947, 172821123, 181142196, 190115096, 199643269, 209690912, 220033936, 231200598, 242774732, 254687571, 267098197, 280142154, 293982052, 307471750, 321447034, 336126797, 350275620, 364574307, 378712926, 392433923, 405751028, 418072097, 429210818, 439013801, 446950915, 452479440, 454488954, 452388945, 449789722, 449720764, 447650307, 442745004, 435859729, 427235916, 417332183, 405980962, 393482282, 379444551, 364590581, 349176893, 333903660]
14257C33903660j4999024j4777923j3539974j4036699j3418249j2997791j2438340
14250B37695660j1622748j1057351j0467927j0099254r477977q839647p913399
14243A68217357q004791o975099p416878o785014o163871n845136n073455n391855
14235A16561258m985380m562923m684781m095790l207312m226214l348186l243722
14227H4206950l490403k997267l087606k606037k273353k624877k279859k117965
14219F2729583j863101k342801j731001k087330j606004j034134j507110j687778
14211D8870324k017268j338280j089309j156641p35420j034633j371013j276091
14203C8851669j477145o81041j063292l3142j402427j019086r64466j495260O9924
$$ y = [333903660, 318904636, 304126713, 290586739, 276550040, 263131791, 250134000, 237695660, 226072912, 215015561, 204547634, 194448380, 184970403, 176130756, 168217357, 160212566, 153237467, 145820589, 139035575, 132871704, 127026568, 121953113, 116561258, 111575878, 107012955, 102328174, 98232384, 95025072, 90798858, 87450672, 84206950, 80716547, 77719280, 74631674, 72025637, 69752284, 67127407, 64847548, 62729583, 60866482, 58523681, 56792680, 54705350, 53099346, 52065212, 50558102, 48870324, 46853056, 45514776, 44425467, 43268826, 42533406, 41498773, 40127760, 38851669, 37374524, 36693483, 35630191, 35597049, 34194622, 33175536, 32211070, 30715810, 30785734]
14194C0785734p45110q05942n91760r51456o57550p13566n56100n55496m55950
14185B4752804l06602p16163p09201m43138l19435m50482q96001m8771r95442
14176A9867569M6448m20683k65118n25598p21581J04111l17257m79147l07572
14167A6981172o5352m20453m84359J2942o92334J41193o31336L17239n96012M4465
14157A4607165n00851l79759j5830k45387l83874o8869n1043k3660p10070j28406
14147A2099416p1406k88943l90111K55711m40601k06444k29510N5809j22136l49209
14137A0312576k6720j4365m34694m8731k63300J9546M4880k19997m94983k39202
14127H635010L08697j69770k8101l743r2984k66435j263n88005k0450M13745k17968
$$ y = [30785734, 30040624, 29234682, 28642922, 27691466, 27033916, 26320350, 25764250, 25208754, 24752804, 24446202, 23730039, 23020838, 22577700, 22258265, 21807783, 20911782, 20863011, 19867569, 19914017, 19493334, 19228216, 18702618, 17981037, 18085148, 17767891, 17288744, 16981172, 16915820, 16495367, 16011008, 16023950, 15331616, 15472809, 14841473, 15158712, 14562700, 14607165, 14106314, 13726555, 13710725, 13465338, 13081464, 13012595, 12961552, 12937892, 12227822, 12099416, 12028010, 11739067, 11348956, 11604667, 11164066, 10957622, 10728112, 10783921, 10661785, 10312576, 10285856, 10271491, 9836797, 9788066, 9524766, 9544312, 9589192, 9369195, 8874212, 8635010, 8943707, 8773937, 8745836, 8742093, 8649109, 8382674, 8381411, 7793406, 7772956, 8186701, 7968733]
14116G968733k7047m78179L02333m34586q4248J18035j92564j1853l98431L38365
14106G100558j19854m42537K64986k94837J11459k65531l32213K77993j01881
14097F198143j08590k96747K82790J14619j57999l57875j6338Q7653k42521M70129
14087E973264k69505m49572K2225N596J30709j69915j61227m4854k41511P3750
14077D868960k64586J12246J66324l76681L32306k40103N9071k10703J44949j77071
14067D414712m145j16582K11583n15605K18091L60708m09671N5605J98733J84199
14057D597628m21026l7108k10219k7821N550R7836p7173J83590n47584p2488L77853
14046C869038k43592q9800k65222L13207j91974j43325k24596K31793J25835o7663
$$ y = [7968733, 7941686, 7463507, 7765840, 7331254, 7247006, 7365041, 7172477, 7160624, 6762193, 7100558, 6980704, 6538167, 6803153, 6508316, 6619775, 6354244, 6022031, 6300024, 6198143, 6089553, 5792806, 6075596, 6190215, 6032216, 5674341, 5658003, 5745656, 5503135, 5973264, 5703759, 5254187, 5276412, 5282008, 5412717, 5242802, 5081575, 5036721, 4795210, 4868960, 4604374, 4716620, 4882944, 4506263, 4838569, 4598466, 4657537, 4446834, 4591783, 4414712, 4410567, 4293985, 4505568, 3989963, 4208054, 4568762, 4159091, 4214696, 4413429, 4597628, 4176602, 4139494, 3929275, 3901454, 3907004, 4004840, 3927667, 4111257, 3563673, 3491185, 3869038, 3625446, 3535646, 3270424, 3583631, 3391657, 3248332, 3023736, 3255529, 3381364, 3313701]
14036C313701L5147m14739L15109j01116N2737N6108j81772M65766n26038M47165
14026C462068l02899k16118k27491L04938m68368M90755o8686n54588Q4269K56215
14016B760095j33979m2135P2587j96299N9448R9082n8694O7731p7381O4349j87553
14005B427251k33445M90940l68011k57799k72203M62256J82769l47383K12454
13996B296829n31585N64421r2848k93903M42511J1528J71772R20940K061231O793699
13986A2344595J4882082J7119154j4397621j4314529o135204k849013j288548
13979E360916j079057m50314l02886m56732R872l43559L82602o16073k1386O8494
13969B551877k27502M47056k06739J51582j26220j98430m4957J025M2301m43412
$$ y = [3313701, 3348848, 2934109, 3249218, 3148102, 3200839, 3256947, 3075175, 3540941, 3014903, 3462068, 3159169, 2943051, 2715560, 3020498, 2552130, 3042885, 2974199, 2419611, 2503880, 2760095, 2626116, 2583981, 2656568, 2460269, 2519717, 2618799, 2560105, 2627836, 2550455, 2614804, 2427251, 2193806, 2684746, 2316735, 2058936, 1786733, 2248989, 2431758, 2084375, 2296829, 1765244, 2329665, 2236817, 1942914, 2385425, 2396953, 2568725, 3489665, 5550896, 12344595, 27226677, 44345831, 29948210, 15633681, 9498477, 6649464, 5360916, 4281859, 3831545, 3528659, 3071927, 3081799, 2738240, 3120842, 2504769, 2483383, 2551877, 2324375, 2771431, 2564692, 2716274, 2590054, 2391624, 2346667, 2347692, 2389993, 1946581]
13959A946581j598K9385Q2770J49021j44406K92012l87278j00908M4031N1030
13949A960640m310j29342L43888N1162k87080j31467J50164p5554m38561M95492
13939A935032j40935K40707N4027l02132l37460L27286J23950J0455o0032p5299
13929A775599l0941J36629K4283m08894l6320O8649Q6123l52523L42708j76584
13919A428729K13653K1441j75123k27026K32270J16707j35293O2277j14491J34534
13909A557678K19380q0737l75108K28435O5611L4764k02052N221K88860P2285
13899A814337l17254j84631L8271k3112O8605l0710j91933J36144j61629L30443
13889A478531J73659n00647J30731J53673N2019j49387o681n2359l511r302l05004
$$ y = [1946581, 1944983, 1974368, 2057138, 2206159, 2061753, 2353765, 1966487, 1865579, 1909610, 1960640, 1956330, 1826988, 2170876, 2222038, 1934958, 1803491, 1953655, 1878101, 1439540, 1935032, 1794097, 2034804, 2088831, 1786699, 1449239, 1776525, 1900475, 1910930, 1850898, 1775599, 1744658, 1881287, 1905570, 1496676, 1460356, 1529005, 1615128, 1262605, 1605313, 1428729, 1642382, 1663823, 1488700, 1261674, 1493944, 1610651, 1475358, 1537635, 1423144, 1557678, 1777058, 1696321, 1321213, 1549648, 1615259, 1650023, 1447971, 1453192, 1742052, 1814337, 1497083, 1312452, 1350723, 1327611, 1396216, 1365506, 1173573, 1309717, 1148088, 1478531, 1652190, 1151543, 1282274, 1435947, 1487966, 1338579, 1331898, 1279539, 1276028, 1266726, 961722]
13878I61722Q8312J84722j37372J69765k35761M5197K35693j98572Q2907M1095
13868A237708k88791L95394l74917M87649l17641J3434J6594k78855J58990L47095
13858A396660j87339j60853o4221L8838j00681J20037L58368l36020j27710L52413
13848A289492m65572k3662M95634j64405k15989j6781M8999J90088k23467K04966
13838A119303l38762M23875k25490k9854L3542l7546N5817K18576n28433J20032
13828H11060K60531k98800Q7454J55073K3903j45208m0662L26278k32319j66868
13818G80442J35972k47003L6048L80666m04358K08685R2135j61638K56006l0833
13808A046122r9895k57579J47981M8373l3061K53751k96453m7549j09334J26101
$$ y = [961722, 1050034, 1234756, 1097384, 1267149, 1031388, 1076585, 1312278, 1113706, 1196613, 1237708, 948917, 1344311, 969394, 1457043, 1139402, 1152836, 1169430, 890575, 1049565, 1396660, 1209321, 1048468, 984247, 1023085, 922404, 1042441, 1400809, 1064789, 937079, 1289492, 823920, 800258, 1295892, 1131487, 915498, 898717, 947716, 1137804, 914337, 1119303, 780541, 1204416, 978926, 949072, 982614, 945068, 1000885, 1219461, 691028, 811060, 1071591, 772791, 860245, 1015318, 1039221, 894013, 853351, 1179629, 947310, 780442, 916414, 669411, 705459, 1086125, 681767, 890452, 982587, 820949, 1076955, 1046122, 946227, 688648, 836629, 885002, 851941, 1105692, 809239, 761690, 652356, 778457]
13798G78457K22909j71582N57m14317L75900r8942Q0539L2087J94257l34764K41895
13787I06996k37708L07059K30099m16116r7222K06728l23543K2158m3077O3246
13777F18620o2155K92578k40564J79177l93355M04384K02122C50298O23565l35833
13767F38030L91755k17810j70618n871O4345j43653J06167C00615K98071j78959
13757D19727Q4975L21934l22112m3167J88765J52796j23439L40374q7562k03968
13747G28323J59797k20639r6039K01937n3999K6552K83429C76388K57825J81352
13737H15565n3591o3963J5768R0271k70646J28087K7424M7195q3045k58079O94859
13726A089845m86748L5385J80134k58960J66244J08245k62194J72594M4684l02888
$$ y = [778457, 1001366, 829784, 830341, 416024, 791924, 692982, 773521, 805608, 999865, 665101, 906996, 669288, 976347, 1206446, 790330, 693108, 899836, 576293, 598451, 555374, 618620, 556465, 849043, 608479, 787656, 394301, 798685, 1000807, 350298, 973863, 638030, 1029785, 811975, 641357, 635486, 699831, 556178, 662345, 300615, 598686, 419727, 504702, 826636, 504524, 461357, 650122, 802918, 679479, 1019853, 932291, 728323, 888120, 667481, 571442, 773379, 719380, 745932, 1029361, 376388, 634213, 815565, 761974, 698011, 713779, 804050, 533404, 661491, 688915, 736110, 653065, 394986, 1089845, 603097, 638482, 818616, 559656, 725900, 834145, 571951, 744545, 789229, 486341]
13716D86341K17639j67844N638m0148J81777j55177O7557K19055k87463J26678
13706F54053K3513j74004R941j86691N19375l13582k49239K51894m2653j39353
13696C53254q11P6729R6739p3250N6004N2297k04581K04225L7560k14788I8536
13684C42668J42694j04142j9917J25498R9618L5375j04560Q2780A71665L55337
13674E27002r5528B12511J85157j36655J21653M15511k32903j56984j24586K54630
13664E38334B18557k6444R5383K88185p8393A67583K68068o3539P7728j36652
13654C13188O153O5595p4961J60016B13584K41119A33931J31372M18896j44055
13644E40144Q4917j82023J15754j13988P2070A54239K84099P1320j43111j76294
$$ y = [486341, 703980, 536136, 541774, 501626, 683403, 528226, 595783, 814838, 527375, 654053, 677566, 503562, 513503, 326812, 846187, 532605, 283366, 535260, 492607, 353254, 352443, 429172, 525911, 452661, 508665, 560962, 356381, 560606, 598166, 383378, 98536, 342668, 485362, 381220, 361303, 486801, 586419, 621794, 517234, 600014, 171665, 527002, 431474, 212511, 397668, 261013, 382666, 798177, 565274, 408290, 283704, 538334, 218557, 192113, 287496, 575681, 497288, 167583, 435651, 372112, 449840, 313188, 319341, 384936, 309975, 469991, 213584, 454703, 133931, 265303, 684199, 540144, 625061, 443038, 558792, 444804, 516874, 154239, 438338, 509658, 366547, 190253]
13634A90253L41202B19676o6042J17525K73753B43288J8689L16859B24801J86987
13624D11788J03280k30930K80048k51173J72339j72J65251l085k1947B17480I5591
13612C72801K21810k26080K9144k3283N37490C11599K35636A99762L71143j95155
13602C75750p4098l6800O8841A22122L17912L81756C63834n8973j25632K11387
13592C90616R0681j93419J32937l7539L05070l01059q4490K88432k15330A43106
13581A20936J62916J69692j0208A62189K06327L61582j46789m6593B35655K20447
13571D56102j50481K23245k08742j00580J66229H8889K57454J22674A01768K78717
13561C80485K1385k2677l4800J27019A27914K22512F6585O05342l22748L2138
$$ y = [190253, 531455, 219676, 153634, 271159, 544912, 243288, 261977, 578836, 224801, 411788, 515068, 284138, 564186, 313013, 485352, 485180, 650431, 647346, 625399, 217480, 95591, 372801, 594611, 368531, 397675, 374392, 911882, 311599, 547235, 199762, 570905, 375750, 301652, 264852, 333693, 122122, 440034, 821790, 363834, 304861, 179229, 390616, 481297, 287878, 420815, 383276, 688346, 387287, 302797, 591229, 375899, 143106, 120936, 283852, 453544, 443336, 162189, 368516, 730098, 583309, 536716, 235655, 456102, 305621, 528866, 320124, 219544, 385773, 88889, 346343, 469017, 101768, 380485, 401870, 379193, 344393, 471412, 127914, 350426, 66585, 671927, 349179, 381317]
13551C81317J26309n298I2584Q9243J33138J05897P1431k21051K76309k53563
13541B93988J79436j74917J07273K25568Q9246B40919J80795A4969J18229k6712
13531A06486L12773A53430J59263j33131N74505B18805J26837m8198K00854j89402
13521C08896J44795E3969N22503k74992J39060I0202K58076j28725K6791K43177
13511D89521m6886A95767J94554c1896C24008m6077q3993K43816B04567J92797
13501C97364m9062A24740J61549J34896j17105l9017q1786J46551j45811j5792
13491A68225O5009K85215j38238J77461k51044A17481M1085J8836N7745o7741
13481A67406K86533k02409b66023A35175C7871F719J93228G8679K13543G8836
$$ y = [381317, 507626, 502328, 92584, 181827, 314965, 420862, 492293, 271242, 547551, 293988, 473424, 298507, 405780, 631348, 720594, 240919, 421714, 14969, 133198, 106486, 419259, 153430, 312693, 179562, 754067, 218805, 345642, 297444, 498298, 308896, 453691, 53969, 576472, 301480, 440540, 90202, 348278, 219553, 246344, 489521, 442635, 195767, 390321, -31896, 324008, 277931, 193938, 437754, 204567, 397364, 348302, 124740, 286289, 421185, 304080, 265063, 183277, 329828, 184017, 168225, 233234, 518449, 380211, 557672, 306628, 117481, 158566, 177402, 235147, 167406, 453939, 251530, -266023, 135175, 37871, 6719, 199947, 78679, 292222, 78836]
13470a15418F8267J15263K34575j35023J70025A68750L915Q4356r1576k1776A4123
13458A38404k115K51909j0775J21213A82181H9611L98324k20341j10997j2769
13448A43828J12987F3469j6551Q8020K92156l6641j47044l8357l1032J58392d3241
13436g008A78019d2699B18948D4639K57164r7580j00875J70786J57745j18883
13426C12996j52405L73919h495k32166I733O02152G8908L91404P2807j23957I4490
13414I9032L48521j44833j18998K03645L29286A41973R9487J23195I9002K895
13404A01897C9558J54159J51315J95047H6666c05403I9973N5989J45689A18422
13393B06193k0288K8505a3403A91595I3662j2763e370B45931l7030J37863j46915
$$ y = [-115418, 68267, 183530, 418105, 283082, 453107, 168750, 172665, 257021, 165445, 143669, 14123, 138404, 136289, 388198, 377423, 498636, 182181, 89611, 487935, 267594, 156597, 143828, 256815, 63469, 46918, 134938, 427094, 390453, 243409, 205052, 174020, 332412, -43241, -7008, 178019, -42699, 218948, 44639, 301803, 204223, 103348, 274134, 431879, 312996, 160591, 534510, -8495, -240661, 9733, 611885, 78908, 470312, 543119, 419162, 94490, 99032, 447553, 302720, 183722, 387367, 716653, 141973, 241460, 364655, 99002, 101897, 39558, 193717, 345032, 540079, 86666, -305403, 99973, 155962, 301651, 118422, 206193, 185905, 214410, -13403, 191595, 93662, 80899, -5370, 245931, 208901, 346764, 199849]
13382A99849J02946I6551R6590L8287L46776B59764N34262B42679A16269K44256
13372C60525B7513L5708J76456L97387a05127D61264j72481o0803H1655J36092
13362B17747R5061A32984O4245M8274A16737K15136l4055A04868L59667j07343
13352C57192j37031O1266L40472b2871I0655B0094L98217A08556K38042L2363
13342C78961A76809M3310K09035j79870O1322A37006R3500J93268A48653l6535
13332A12118R0667J63399D6804L00994r7788O7818G8230c17343C93809C1566N4129
13321H5695L4911J05684a00412B84893Q899J52096G6192i9936L635A21979e2336
13309B09222J05446j04111f0525C82249A41756E5618L63101j44767l3476J57382
$$ y = [199849, 302795, 96551, 193141, 231428, 578204, 259764, 794026, 242679, 116269, 360525, 27513, 63221, 239677, 637064, -105127, 461264, 288783, 227980, 81655, 217747, 312808, 132984, 197229, 245503, 116737, 331873, 297818, 104868, 464535, 357192, 220161, 281427, 621899, -22871, 90655, 20094, 418311, 108556, 346598, 378961, 176809, 220119, 429154, 249284, 310606, 137006, 230506, 423774, 148653, 112118, 202785, 366184, 46804, 347798, 250010, 317828, 78230, -317343, 393809, 31566, 85695, 120606, 226290, -100412, 284893, 293792, 445888, 76192, -99936, -96301, 121979, -52336, 209222, 314668, 210557, -60525, 382249, 141756, 55618, 418719, 273952, 240476, 397858]
13299C97858A26600J42926F9940c70180h4193B98448k8694D1765a29056A08321
13288B28151r3862l1974K45352f6943D08781e3910C45545H0473J37304n2041J99470
13277C65206r0957B2533J17046E1915J03086a18314C44500D8566i2468B461b2781
13265a19528F52359B06536r7857K35284J12466N1219B10406q750k0697q6351j7353
13254G7255K69510A19694J38205C4426J5507e8518A91803P5393K07975E3433N5257
13243A08690i1921K2636D67347j95396g5767C71343j12627J6932a06085B06190
13232A83960O9864L5293q3578I9505b83007D60732r0408G3674Q3808b4978E29763
13220B21790P3955K78595k40706G0250K1931k0220d6650I9525j9088e1330D80504
$$ y = [397858, 126600, 269526, 69940, -370180, -84193, 298448, 269754, 41765, -129056, 108321, 228151, 134289, 102315, 347667, -66943, 408781, -53910, 345545, 80473, 217777, 165736, 365206, 274249, 22533, 139579, 51915, 155001, -118314, 344500, 48566, -92468, 2461, -22781, -119528, 652359, 206536, 108679, 343963, 456429, 507648, 210406, 201656, 180959, 94608, 77255, 346765, 119694, 257899, 34426, 49933, -58518, 191803, 267196, 475171, 53433, 108690, -91921, -69285, 467347, 271951, -75767, 371343, 258716, 275648, -106085, 206190, 183960, 253824, 289117, 205539, 99505, -283007, 460732, 370324, 73674, 157482, -24978, 529763, 221790, 295745, 574340, 333634, 70250, 92181, 71961, -46650, 99525, 80437, -51330, 480504]
13208B44638A08109E2426N0722k4937a6019E3851J74964K84546f9930A76377p9062
13197I7315e199A9800a89792C81434A48693B5002P4072l4963J8761b42068M8728
13186a93340B6551K79361A07094K342L1810B3951J58228H7758K7048N9966J91165
13175C65937j72786c1591C54983A74613l1224h666C65070i4821F27840A38816
13164F9573C4741n968a08030d4181A45222K07408e5563C36008A52314R4046F5920
13152C40963a67782B24567a41685k68768d6135k2324B79697a28303j59327A98058
13141B43824A15671n7767g5034D29189c52541f4114j02070A60084d8626p8536
13131a27162B94468A16601c10939B19147h1326G7564a94026A0116a80134d0584
$$ y = [244638, 108109, 52426, 103148, 78211, -16019, 53851, 228815, 513361, -69930, 176377, 97315, -5199, 19800, -189792, 381434, 148693, 25002, 99074, 64111, 82872, -242068, -193340, 26551, 305912, 107094, 109436, 141246, 23951, 182179, 87758, 114806, 174772, 365937, 193151, -31591, 354983, 174613, 143389, -8666, 365070, -94821, 627840, 138816, 69573, 34741, 28773, -108030, -44181, 145222, 352630, -55563, 336008, 152314, 246360, 65920, 340963, -167782, 224567, -141685, -410453, -46135, -68459, 279697, -128303, -287630, 198058, 243824, 115671, 57904, -75034, 429189, -352541, -64114, -166184, 160084, -48626, -127162, 294468, 116601, -310939, 219147, -81326, 77564, -194026, 10116, -180134, -40584]
13120A10983a06361A60101K2105a24381k12425A23008k021J93376n8789N3262
13110C08836H6183f9083D93862r1127f1889A81030J905b6241r5008A68832c2502
13098b6936A26233N0486J13028a854A01309P7309E0440a8148D13793j56153h1141
13086a67540D6269K70309j47965K18968e8067F3683J60604e5513p6588A49161
13075B82485a76020f5862L1433A5193K53327q4105r1806I594L4207K50812B5726
13063a82313A80316J59411j66288J9803K75752b19820B52400j06560F4472a60237
13052d910D39658j85641b9868p8917B5733J05733a1812B03765O1142d9162j25939
13041a75101C78407g2648C23227a11719A84297e0696B71947K63321A6450J51751
$$ y = [110983, -106361, 160101, 182206, -124381, -336806, 123008, 120987, 314363, 255574, 308836, 86183, -69083, 493862, 402735, -61889, 181030, 182935, -26241, -121249, 168832, -32502, -26936, 126233, 176719, 289747, -1854, 101309, 178618, 50440, -18148, 413793, 257640, -81141, -167540, 46269, 316578, 168613, 387581, -58067, 63683, 224287, -55513, -132101, 149161, 282485, -176020, -65862, -34429, 15193, 268520, 184415, 92609, 9594, 43801, 294613, 25726, -182313, 180316, 339727, 173439, 193242, 468994, -219820, 252400, 145840, 64472, -160237, -4910, 439658, 254017, -29868, -108785, 25733, 131466, -11812, 203765, 264907, -49162, -175101, 378407, -72648, 323227, -111719, 184297, -50696, 271947, 535268, 16450, 168201]
13031A68201m3980J79408a98594I221M73147j55032j30275B4669o77J70626K82071
13020D76689A12190a16675E4580J45174a97105A58840Q8601g9364B27880C6669
13009d9369B20590r2075E5078j2710J0836P4568J07749c678A11181J98757a1121
12997B09380m5692J27520b25334A05748J37094F0877c8904A18901P388k4747d1129
12985a41021K3935A12685K31636L4645A57523B239b26716B13908n2162h3517A60492
12973h7743n6123K3563A22786i3164j19278C4889d3360l33128f2114I2814c7638
12961F0541J14224b18670J08599A84617C8665a1984A48073m3807E0378j6256M3129
12950G7251m286e9968A21930a6972A43248k2995a34134j48287E5896C559J75434
$$ y = [168201, 124221, 303629, -198594, 9221, 482368, 327336, 197061, 24669, 23992, 194618, 476689, 112190, -116675, 54580, 199754, -197105, 158840, 247441, -79364, 227880, 36669, -49369, 220590, 128515, 55078, 42368, 53204, 127772, 235521, -3678, 111181, 309938, -11121, 209380, 163688, 291208, -225334, 105748, 242842, 60877, -38904, 118901, 126289, 101542, -41129, -141021, -117086, 112685, 344321, 378966, 157523, 2239, -226716, 213908, 161746, -83517, 160492, -87743, -143866, -120303, 122786, -93164, -212442, 34889, -43360, -376488, -62114, 92814, -37638, 60541, 174765, -218670, -110071, 184617, 38665, -11984, 148073, 104266, 50378, 34122, 77251, 72965, -59968, 121930, -16972, 143248, 120253, -134134, -282421, 55896, 3559, 178993]
12939A78993p1672a37905f0604r4885e9831C09827q8641l5839D4804i1135M5533
12928d5602j8819F63732e7131A99642J99422e710q3536L0116C62713j59195G3487
12916a70850H7935j7719K28363b2818k66690E0504b2782C13887G4493J97623j04567
12905A67549f6889k0731B66861K7017j39856G2992M1791m9353K01090A32613o1238
12894G1375c40364A41951a55474B689K28511i598B62741b1480B39250a70747A06756
12882H8603J45471L5075D0008K48441D0333K32491a23642b4087A83208a95159
12871B16115a3171F0356P022a7392H6009L2018G302b61602a8501A94111B2693
12859F4195c9197j21377f5121c0038A63979k8427h5572F5705a41939a143A66437
$$ y = [178993, 107321, -137905, -60604, -155489, -59831, 309827, 221186, 185347, 44804, -91135, -45602, -64421, 663732, -57131, 199642, 399064, -5710, -89246, -59130, 362713, 203518, 73487, -170850, 87935, 70216, 298579, -22818, -289508, 50504, -22782, 313887, 74493, 272116, 167549, -66889, -87620, 266861, 293878, 154022, 72992, 114783, 65430, 266520, 132613, 71375, -340364, 141951, -155474, 2689, 231200, -9598, 262741, -21480, 239250, -170747, 106756, 88603, 234074, 269149, 40008, 288449, 40333, 272824, -123642, -24087, 183208, -195159, 216115, -13171, 60356, 67378, -17392, 86009, 118027, 7302, -261602, -18501, 194111, 22693, 64195, -39197, -160574, -65121, -30038, 163979, 135552, -85572, 65705, -141939, -1143, 166437]
12847B64220a58887B9903O1683b1349A10741A1666J91336o5619n7373b85800B84655
12835i5754C20255e57I3690M6351A592K97510q8006b87408C43927d3937M209C11756
12822a07353d5949B19111J6687G0637b15360L8033B02835a73328A70826A3152
12811G9888J34891b3796A83579a44258q0484J06592C0771a57418I8672b02084
12800a13179d8917K1275c784B70389H5312i4007B03105b9005k9661A76814R5109
12789B71923E5239K54402o3421E2364J56850Q1059c84990J91174B4609a401A66291
12777a73197N4507A66711c6675j93500A92557J83485A21264h5937B170g1955D3115
12765g5986A9903M4390a2126j42209c4801F727b40054J14851B7943a86147f8154
$$ y = [264220, -158887, 29903, 91586, -21349, 110741, 11666, 203002, 137383, 80010, -285800, 284655, -95754, 320255, -557, 93690, 140041, 1592, 299102, 211096, -287408, 343927, -43937, -39728, 311756, -107353, -45949, 219111, 235798, 70637, -215360, -177327, 202835, -173328, 170826, 13152, 79888, 214779, -23796, 183579, -144258, -224742, -118150, 30771, -157418, 98672, -202084, -113179, -48917, -27642, -3784, 270389, 85312, -94007, 203105, -29005, -58666, 176814, 271923, 55239, 309641, 246220, 52364, 209214, 290273, -384990, -193816, 24609, -1401, 166291, -173197, -118690, 166711, -36675, -230175, 192557, 376042, 121264, -85937, 2170, -71955, 43115, -75986, 19903, 64293, -12126, -154335, -34801, 6727, -240054, -125203, 27943, -186147, -68154]
12753c90971i2359A38220a27155A2527a13098J0207A12587n5946J00385g4317
12742d7856A45773a34323b4153A2921J84419i0642G7457J00208a87829A29544
12731C9915a1689D5891J0907a60758B46687a23924b8419D0494b83099G1911d2727
12719g6286F5704O6486L40447b93061c0707D6391N6989m4305J21597p617J88756
12708C61811J47592A2573a28824A77756K53132A10761P1124q8458c7890A03769
12697A78861b55875J26832B43997A5529c308B3496b07079c0155o8724c7812H5521
12685h3669r9800A04641J34608p6792F3614C1153J12819K70356d7738k4982A50011
12673A81652L5061b8477C01937c3426A4311g7387F8508K31571A10308m3310a5206
$$ y = [-390971, -92359, 138220, -127155, 12527, -113098, -102891, 112587, 56641, 157026, -74317, -47856, 145773, -134323, -24153, 12921, 197340, -90642, 77457, 177665, -187829, 129544, 39915, -11689, 45891, 56798, -160758, 246687, -123924, -28419, 40494, -283099, 71911, -42727, -76286, 65704, 132190, 472637, -293061, -30707, 46391, 103380, 59075, 180672, 173055, 361811, 509403, 12573, -128824, 177756, 430888, 110761, 181885, 93427, -37890, 103769, 178861, -255875, -129043, 243997, 15529, -3308, 23496, -207079, -30155, -98879, -37812, 85521, -83669, -183469, 104641, 239249, 162457, 63614, 31153, 143972, 414328, -47738, -72720, 150011, 181652, 216713, -28477, 301937, -33426, 14311, -77387, 68508, 300079, 110308, 66998, -15206]
12661a5956A04733K38154A67182L02992j49164D206J98333Q4398a9350A56910
12650C49258j60983g833A62551a4322r6525N293E3325a7528A79700R1692j16195
12639A55197a73927C83633r075D1782d9393A44433a7328F993a3306C61210J6252
12628C77462f5316E0787O4231J48581A03774l71l057N08152H1751i5886A50251
12616D15493b67823A95670b55039B98338i545D92378k29850e6799q2750n2513
12606a92062A57957e2470A26299j279g6529o8703A39887J55275r8821n3106a0600
12594E3545f0450l44215A8139o48d5047B69124b44158B17174I0593j8790J24515
12583A96318a17691L1595c7827A07519L6377a70169e2164A29801b27702F1245
$$ y = [-15956, 104733, 342887, 167182, 470174, 321010, 4206, 202539, 286937, -19350, 156910, 349258, 188275, -7833, 162551, -14322, -110847, -105554, 53325, -17528, 179700, 271392, 155197, -173927, 383633, 374558, 41782, -49393, 144433, -17328, 6993, -13306, 361210, 377462, -65316, 50787, 115018, 263599, 103774, 103403, 100346, 608498, 81751, -95886, 150251, 415493, -267823, 195670, -255039, 298338, -9545, 492378, 262528, -56799, -139549, -192062, 157957, -52470, 126299, 125020, -76529, -145232, 139887, 295162, 196341, 143235, -10600, 53545, -60450, -404665, 18139, 17491, -45047, 269124, -244158, 217174, 90593, 71803, 196318, -117691, -86096, -37827, 107519, 143896, -170169, -52164, 129801, -227702, 61245]
12572C60972D0900J36716e0779A31397e59688C47418A6009g8773a4423j06522
12562a20945a6038k75854A34730K5742m5353j1522K08397a93814Q5895N1786B01373
12550A48013a33367A56456J75092G1032a80047N7339F4862P7466a22993B47887
12539I1722b15388C7925Q7893j1154A5793f2479E2293a77002j94083I539g8431
12527a39209B5052a19007F0607P1072J20875a73063G9981b17425A22537b8149
12516A19904a18936A08658D0553A5682M24598a18124B81811b1006B70097c08566
12505f0503k07303D37872a97525A11560e185I9648b40683E3083R847i2667m1856
12494a34523m9530B32183h9886B06481b15159B03361a0824m0580C84754b00685
$$ y = [360972, 40900, 177616, -50779, 131397, -559688, 347418, 16009, -78773, -14423, -120945, -16038, -291892, 134730, 160472, 115119, 103597, 311994, -193814, -107919, -56133, 201373, 148013, -133367, 156456, 331548, 71032, -180047, -122708, 64862, 142328, -122993, 247887, 91722, -215388, 37925, 125818, 114664, 15793, -62479, 52293, -177002, -371085, 9539, -78431, -139209, 25052, -119007, 60607, 131679, 252554, -173063, 79981, -217425, 122537, -28149, 119904, -118936, 108658, 40553, 15682, 440280, -118124, 281811, -21006, 270097, -308566, -60503, -267806, 437872, -197525, 111560, -5185, 99648, -240683, 53083, 62930, -92667, -134523, -184053, 232183, -89886, 206481, -215159, 203361, -10824, -51404, 384754, -200685]
12483A77448a38900F557J34770l8993J32175a69532D8408K0137k3410g9243A44245
12471A77450A9733K06057g5027l09215H031O0358c14087d6811F4387a80661C7935
12459e30095A9781J12728K9810c53947a35587j05760A22187k2937K21066B9737
12448b33879H5613c404B41105h2453I6768a77322H3265K61223A9771a03303p427
12437a10730B29676j2636b84538B31356I3387K61993M3161j65221j02709F5087
12426B69404b11989r4767B89428j29154a26097A86785q7578b9494E5901J06720
12416A62621Q3773a5393j91208p7288C26672a91510M6770n7805A5554h7123n5102
12405a42225L2593E5812a04302l9134B15950O4290H2137q85a78549A83980f0404
$$ y = [177448, -138900, 6557, 141327, 102334, 234509, -169532, 48408, 68545, 45135, -79243, 144245, 177450, 19733, 225790, -75027, -384242, 8031, 68389, -314087, -46811, 64387, -180661, 37935, -530095, 19781, 132509, 162319, -353947, -135587, -241347, 122187, 99250, 320316, 29737, -233879, 85613, -3404, 241105, -82453, 96768, -177322, 83265, 344488, 19771, -103303, -110730, 229676, 217040, -284538, 231356, 93387, 355380, 398541, 233320, 130611, 65087, 269404, -211989, -306756, 289428, 160274, -126097, 186785, 99207, -29494, 55901, 162621, 246394, -15393, -206601, -283889, 326672, -191510, -144740, -202545, 15554, -87123, -142225, -109632, 55812, -104302, -143436, 215950, 280240, 82137, 81252, -178549, 183980, -60404]
12393A57542a62473C5467g8120b8659r590A61432b768n0207B5835J26293g7027
12381a36719A22945b34575J02983l7222B05412a41392f5456A53122c9475A30517
12370A46902E8088J21492a47262Q507Q544N4698g084C2515g9050l1017a1375A28935
12357E42852g965B00173J87806d26326A17446M2604k6296d0137A03036P8745p5434
12346A06347k0871A7079h5074r239k31233E5401c9967A44224a32641j34103E0357
12334B17830M6684b98401A94329g4241p804B99190I5894K6816n9048h173A26478
12322A33106a26653a6527k70901P0416f2306j06965k5883e3985j8451H9883c94252
12310B26320J30226i002k24724j0637A01612K62953k3378G1723i4708I7830L0244
$$ y = [157542, -162473, 35467, -78120, -28659, -38249, 161432, -2768, -52975, 25835, 152128, -77027, -136719, 122945, -234575, -131592, -168814, 205412, -141392, -65456, 153122, -39475, 130517, 146902, 58088, 179580, -147262, -138755, -130211, -75513, -7084, 32515, -79050, -110067, -11375, 128935, 542852, -7965, 200173, 387979, -426326, 117446, 160050, 133754, -40137, 103036, 181781, 106347, 85476, 17079, -85074, -94313, -325546, 55401, -39967, 144224, -132641, -266744, 50357, 217830, 264514, -298401, 194329, -74241, -82045, 299190, 95894, 122710, 63662, -8173, 126478, 133106, -126653, -16527, -287428, -217012, -62306, -169271, -195154, -53985, -72436, 89883, -394252, 226320, 356546, -9002, -233726, -244363, 101612, 364565, 341187, 71723, -94708, 97830, 128074]
12299A28074A5467a64752K2400F4612a55914C3499L43471a04203B5342P9031B4586
12287A93011Q774b05119C08932h58C51755q2014M4686A06895e8810J6752k95899
12276c37957Q8540p1456B77783R5158A35499L2491N2812J25812n6050A0139L53171
12265C63310A63296B8204K5034h2067C4948J60465e67296C52852a42225A70765
12254h2508j8979B28512i9102c4894k23179C36431A66285d3370l8534A44474l7853
12243A06621K11775a30223m8962A44673J55014C4607b0365r2121C3601g1270J839
12232f9431A93318K95572a76631h4719B11053n4587K34911f1598b8652A58706
12221G04541C31942A02049K93151e1868A42729J50487A10374K7712a51707C84150
$$ y = [128074, 15467, -164752, -142352, 64612, -155914, 33499, 376970, -104203, 25342, 104373, 24586, 193011, 201785, -205119, 308932, -858, 351755, 269741, 314427, 106895, -58810, -42058, -337957, -249417, -320873, 277783, 372941, 135499, 167990, 220802, 346614, 290564, 10139, 363310, 163296, 28204, 53238, -82067, 34948, 195413, -567296, 352852, -142225, 170765, -82508, -101487, 228512, -99102, -34894, -258073, 336431, 166285, -43370, -81904, 144474, 106621, 318396, -130223, -179185, 144673, 299687, 34607, -20365, -112486, 33601, -71270, -69431, 193318, 488890, -176631, -84719, 211053, 156466, 391377, -61598, -28652, 158706, 704541, 331942, 102049, 395200, -51868, 142729, 293216, 110374, 138086, -151707, 384150]
12210A72051q3599l4790J25094P7673b21171A7913q820M5485K48904O9107j06461
12199B66128d2379j58105B41557a92675B63061H3007a8865E77123B01215h5093
12188C50560a78835G1049k4774J25263j9724J84250A49175M6312C9350a01868
12177A53723J75318j5784j22472R9164C3671c30874C52349J05060H8899a0739
12166b41058B0174a92514B36016a96644Q0539C6948K41418a11041F019K83602
12156B89621g0627E8892J70568C1167I246d6147n2523j93500I568L25260j54657
12145A80171h0082D16632A67646n9333C0967d1652A1080a44572E3075K3933L5214
12134A12222B7168A2710d5409n5313C8563a02093B57743B7513b11861e1618B86600
$$ y = [172051, 88452, 53662, 178756, 256429, -221171, 17913, 9093, 54578, 303482, 372589, 266128, -42379, -200484, 241557, -192675, 263061, 83007, -18865, 577123, 201215, -85093, 350560, -178835, 71049, 46275, 171538, 151814, 336064, 149175, 195487, 39350, -101868, 153723, 329041, 313257, 190785, 289949, 33671, -330874, 352349, 457409, 88899, -10739, -241058, 20174, -192514, 236016, -196644, -116105, 36948, 278366, -111041, 6019, 289621, -70627, 58892, 229460, 31167, 9246, -46147, -98670, -292170, 9568, 334828, 180171, -80082, 416632, 167646, 108313, 30967, -41652, 11080, -144572, 53075, 77008, 112222, 27168, 12710, -45409, -100722, 38563, -102093, 257743, 27513, -211861, -51618, 286600]
12122b9734j67272R4358J2178A98103b38011A43320h2571B11518A8484c7664A21616
12110A53069j1255c8164j74898C5384K47248h9644j59997D4027L8410K46866b88858
12098a28234l9089H2520J86465j13337d0936j19698A62831a50417k9996A84914
12087B29688O434a27024b8641C07658A19863a57456p3517m4392a20283E9353J08335
12076A67688J260400L83057B42384D4078M1228b4789p2437d6800j17043B21181
12065C09632M6292I6689l1396g4326A27192c3323H4426b07675Q7573A58633m2562
12054A16071M4786N8172a1738A66889b7950j0576k6583A0339B461J91260q8606
12043A05115b57484B51202a74270e7651j78453a12315k2922B76827j06913a19061
$$ y = [-29734, -197006, -102648, -90470, 198103, -238011, 143320, -82571, 211518, 18484, -37664, 121616, 153069, 141814, -38164, -213062, 35384, 282632, -89644, -249641, 44027, 82437, 329303, -288858, -128234, -167323, 82520, 268985, 155648, -40936, -160634, 162831, -150417, -180413, 184914, 229688, 236122, -127024, -28641, 307658, 119863, -157456, -230973, -275365, -120283, 59353, 167688, 1428088, 1811145, 242384, 44078, 85306, -24789, -97226, -46800, -163843, 221181, 309632, 355924, 96689, 65293, -74326, 127192, -33323, 84426, -207675, -120102, 158633, 116071, 160857, 219029, -11738, 166889, -27950, -38526, -65109, 10339, 2461, 193721, 105115, -257484, 251202, -174270, -57651, -236104, -112315, -135237, 276827, 169914, -119061]
12032A44415L2731D8936c66931a097B23756A7230O0841k3895a69347c176j6808
12021a9984A92758G474M4098J0993j1576K78172G8143b71352M2383d4280B78556
12009C14700A32484m1071m0331i5779q177A78307a64388A8286K51108a87018j0779
11998a97797o1581A46943b33795f7802k00660c2831j26934e5698m327j32590a9239
11986e5418b6648C07725a08461J1903n5719p0859L6982A56979K08853A54920c52049
11974a44853r131q0572l463B01042D5184a95338e1687j80522A24148n1967K02966
11963B75147G7080G639K5071R4025a27885o1627D7441a62991a8601l14633H1655
11951A73917l0224b32101e5877J1081B9772a32254D0733a9376k97895A33119l4829
$$ y = [144415, 177146, 48936, -366931, -1097, 223756, 17230, 78071, 54176, -169347, -3176, -19984, 192758, 7474, 51572, 62565, 50989, 329161, 78143, -271352, -228969, -44280, 278556, 314700, 132484, 91413, 51082, -95779, -103956, 178307, -164388, 18286, 269394, -187018, -197797, -259378, 146943, -233795, -67802, -268462, -32831, -159765, -55698, -60025, -192615, -19239, -55418, -26648, 307725, -108461, -96558, -152277, -223136, -186154, 156979, 365832, 154920, -352049, -144853, -153984, -234556, -238019, 201042, 45184, -195338, -51687, -232209, 124148, 72181, 275147, 77080, 7639, 32710, 126735, -127885, -189512, 47441, -162991, -18601, -333234, 81655, 173917, 143693, -232101, -55877, -44796, 29772, -132254, 40733, -19376, -317271, 133119, 98290]
11940I8290b10857A60638i5558j91015g8037j17365d6199B01114o757a73104b1605
11928C67153g6425j24134j39053E8640a8180P194p4228A26357J16192G8979a51105
11916i1771l18338G8602b81213p5603i4174A18440a08179f358j4981k51341b3692
11904a88509A12551h7056M306C51485a56589A10378C5912O6664a56479C7275P5056
11893A12331D1020b62131E8301c12075r7448k16386C6330i7205E6125b67953a11808
11881B36152a17803l9269f3560m0649A31378h4263k43124G6291i363k94951l7476
11870c41790a27846p3101E7658a06885m484C32019A1869a59323j30085l7043k015
11859c28466B09183b86396D59797f0095A40354a32109C1263f5738k153r671m1578
$$ y = [98290, -210857, 160638, -95558, -286573, -78037, -195402, -46199, 201114, 194357, -173104, -21605, 367153, -76425, -200559, -339612, 58640, -18180, -10986, -85214, 126357, 242549, 78979, -151105, -91771, -410109, 78602, -281213, -356816, -94174, 118440, -108179, -6358, -21339, -272680, -23692, -188509, 112551, -87056, -82750, 351485, -156589, 110378, 35912, 102576, -156479, 37275, 112331, 41020, -262131, 58301, -312075, -409523, -625909, 36330, -97205, 56125, -267953, -111808, 236152, -117803, -157072, -63560, -104209, 131378, -84263, -327387, 76291, -9363, -304314, -341790, -127846, -200947, 57658, -106885, -111369, 332019, 11869, -159323, -289408, -326451, -328466, 209183, -286396, 459797, -60095, 140354, -132109, 31263, -65738, -67891, -77562, -119140]
11848a19140e2682k59006C52467C5221Q9710A5377K96264b60313j77863I941R9402
11837A09343d9746E792c20955A04669c2664m94281d0589A91936D0325i0451R324
11826h1127A08499a24300E1974a81309F5028d2799E44226D3896c60840e4333B9593
11814e9791b4967A1050J00297a91184d7418l2365k99423J26714A86422J7750b05862
11802i7908J981J2424B7803M7647d0063E9754a24316B51696a03253m2375l7863
11791a83491N9008J6268G5271J74551e8045F6494d851B30810a10452B77546A14106
11779a80037d5714C78600j06109e4856a8737m1603n8964L8499c0990o0058L9984
11768e1064j07076B25825E1370K35694I1216A732L1275J13887E9818M918J19594
$$ y = [-119140, -52682, -311688, 352467, 35221, 124931, 15377, 311641, -260313, -438176, 9941, 109343, -49746, 5792, -320955, 104669, -32664, -526945, -40589, 191936, 40325, -90451, -81127, 108499, -124300, 51974, -181309, 65028, -42799, 544226, 43896, -360840, -54333, 29593, -59791, -24967, 11050, 111347, -191184, -47418, -79783, -379206, -252492, 186422, 204172, -205862, -97908, -95927, -83503, 27803, 75450, -40063, 59754, -124316, 251696, -103253, -145628, -183491, -124483, -108215, 75271, 249822, -58045, 66494, -4851, 230810, -110452, 277546, 114106, -180037, -45714, 378600, 272491, -54856, -18737, -60340, -119304, -80805, -30990, -91048, -51064, -158140, 225825, 51370, 287064, 91216, 1732, 33007, 146894, 59818, 64736, 184330]
11757A84330d5776j95654j8326b6067l02192f0587G3732f1550A642h395B5467
11745C0249J92089b68995O195B0522a85710B63242H1908C4540L16637b03471j6908
11734b20379H9633P5485N8779c9550A6316a15888Q471G9450J1100c89167g7807
11722d51B64083a32508A87707d969C4531Q2095a87577g9057j77157A53954J27766
11711B81720K02128j70229A46258c99384B2617N3705h5284G1120k1685J32643
11701A82078m3048k8587A9927a34415n9951k2345B15121G9602b60781J13575j66558
11690c13764A23986h9375B05615B9029K92953g2421H9368K90820L1962A56200
11679D3995K87948b19801A35244b01456c2739k91645L8524F8441J30464a1487
$$ y = [184330, -45776, -241430, -259756, -26067, -328259, -60587, 73732, -61550, 1642, -8395, 25467, 30249, 222338, -268995, -262800, 20522, -185710, 263242, 81908, 34540, 351177, -203471, -220379, 89633, 165118, 223897, -39550, 16316, -115888, -107417, 79450, 90550, -389167, -77807, -451, 264083, -132508, 187707, -4969, 34531, 116626, -187577, -79057, -256214, 153954, 281720, 483848, 313619, 146258, -399384, 22617, 76322, -85284, 71120, 49435, 182078, 139030, 110443, 19927, -134415, -194366, -216711, 215121, 79602, -260781, -147206, -313764, 123986, -89375, 205615, 29029, 321982, -72421, 89368, 380188, 412150, 156200, 43995, 331943, -219801, 135244, -201456, -32739, -324384, -285860, 68441, 198905, -11487]
11668d6117H3420a79065A46933a18527j49120i8889k09660R8379B9296Q9192e9929
11656f6443m3193N1509H9600c6391N57C92216b67570F5340a00356r2258d144k9027
11644c3171B8296N8262a93063F9540J72860l0493O1706O3579j53076l2029b34275
11632C14668A33995o1677j4086R7049F0711J48338a43233k3460o450E6394J08046
11621A64440K41780a52532c5644B07459a03130b3134B84049j34389a10045f571
11610D9258J62567m1587J80852A42586b81507e3000B7803K62424h2804j37342
11600b20146E9734b6546A32157n6680d9442q2259M009l7813j41417B56149Q7217
11589C43366B1672d59540a20780B29803N7402A39839a99932J1533C16513A25411
$$ y = [-46117, 83420, -179065, 146933, -118527, -267647, -98889, -308549, -210170, 29296, 118488, -59929, -66443, -109636, -58127, 89600, -36391, -35834, 392216, -267570, 65340, -100356, -192614, -4144, -33171, 28296, 86558, -193063, 69540, 242400, 211907, 273613, 337192, 184116, 152087, -234275, 314668, 133995, 72318, 58232, 155281, 60711, 209049, -143233, -166693, -173143, 56394, 164440, 406220, -152532, -35644, 207459, -103130, -23134, 284049, 149660, -110045, -6571, 49258, 211825, 170238, 351090, 142586, -281507, -53000, 27803, 290227, -82804, -220146, 59734, -26546, 132157, 75477, -49442, -131701, -127692, -165505, -306922, 256149, 343366, 21672, -459540, -120780, 229803, 287205, 139839, -199932, -188399, 316513, 125411]
11578A24468n2093a72703J3432e538B16989J21101n8484a60093L7640A78153g9372
11566H0647b5026g153B54365a2916B52275A26095C5324O7912b37036A40112Q4555
11555B24667C1382f4925B62888l3635G92K2686K2775c95872A83837r026c8291
11543B00335J5801m662P9959j06045a55291N2673n9286d0840C29362j06504r3202
11532A29656i7530D42559c8912J8980A76422G472c9092A65335k321h5237B81492
11520b10961Q1116C3471K43931I0268J47284d8587k19980B56196a43913D9186
11509B25320a24046j04512A71371R1942l0500p9767F2559C0223j2356o385c76118
11497H9534k0734a84694b3943r8891B32329g3795C46567A59921c9170A78663A4595
$$ y = [124468, 72375, -172703, -159271, -5538, 216989, 338090, 279606, -160093, -122453, 178153, -79372, 80647, -25026, -7153, 254365, -12916, 252275, 126095, 35324, 103236, -237036, 140112, 224667, 31382, -64925, 262888, 229253, 792, 23478, 46253, -395872, 183837, 174811, -38291, 200335, 216136, 211474, 291433, 185388, -155291, -102618, -161904, -40840, 329362, 222858, 129656, -97530, 442559, -38912, -19932, 176422, 7472, -39092, 165335, 163014, -85237, 281492, -210961, -129845, 33471, 277402, 90268, 237552, -48587, -268567, 256196, -143913, 49186, 225320, -124046, -228558, 171371, 263313, 232813, 153046, 62559, 30223, 17867, 11482, -376118, 89534, 68800, -184694, -23943, -122834, 232329, -73795, 346567, 159921, -39170, 178663, 14595]
11485A10596L20922b0444B66481p3956M8619b2870H1688d667E5058j1894N6791
11474I9955h8920B25180n9878g8551q031L2618C05531F9231J20452Q3494I595
11462B48282j04672J84799H6371K47149b73398B88500e4361B22665a61171C85410
11451c5708B25327j02139b15889G2752A0744M3338F895O0012J79392h9730J2759
11440g6971E157a38737f2827C57401L9686c19036C04893j18193b38259h6081C8437
11428a08853C47144d6090E4420J94432A16661m3593Q3104N0932b23259i0920L3525
11417e7395A73149b54501P1461c6901k8171A64187M6089b28040C7797P2018K60919
11406C70734i5913B28984P6669h2139C0430n944J4555b74169B91375a21790A7219
$$ y = [110596, 431518, -20444, 266481, 192525, 241144, -22870, 81688, -4667, 55058, 43164, 99955, -88920, 225180, 165302, -78551, -86582, -53964, 305531, 69231, 189683, 273177, 9595, 248282, 143610, 328409, 86371, 333520, -273398, 288500, -54361, 222665, -161171, 385410, -35708, 225327, 123188, -215889, 72752, 10744, 54082, 6895, 66907, 246299, -89730, -76971, 5157, -138737, -62827, 357401, 397087, -319036, 304893, 186700, -238259, -86081, 38437, -108853, 347144, -46090, 54420, 248852, 116661, 73068, 156172, 207104, -223259, -90920, -57395, 173149, -254501, -183040, -36901, -65072, 164187, 210276, -228040, 37797, 109815, 370734, -95913, 228984, 305653, -82139, 30430, 24486, 39041, -274169, 291375, -121790, 17219]
11394c15759J14196B48604i1610A27537a38675A75975M0310A6013d34321a02953
11383A17491L1017j0493l5232b40821J04827A98216a4571j67478C7245Q9182e4984
11371b72423B35230d11456C0682i9872H2889b9588j54509j32758b1378k00770
11361b22148i94j7094B13983H9079e3017B06950H3642g7064E55b80988A37897
11349a99895C16206F2290a03777M4871l59070D20120m8827A13636e4611K5439
11339b9172q2181m0671B80627a95176A26439K9458a68092l2818G6235Q4969n3030
11328A08174b45633C11403d0661k16560I3047e0710j02007E4985d24940f4665
11317B08918L483a81309J063C90763a6283j75569c4436k16357M9748B1795b27348
$$ y = [-315759, -201563, 248604, -91610, 127537, -138675, 175975, 216285, 16013, -434321, -102953, 117491, 148508, 138015, 102783, -240821, -135994, 198216, -14571, -182049, 37245, 126427, -54984, -272423, 235230, -411456, 30682, -99872, 82889, -29588, -184097, -316855, -21378, -222148, -994, -18088, 213983, 89079, -53017, 206950, 83642, -77064, 555, -280988, 137897, -199895, 316206, 62290, -103777, -58906, -417976, 420120, 371293, 113636, -54611, -29172, -111353, -152024, 280627, -195176, 126439, 155897, -168092, -200910, 76235, 161204, 108174, -245633, 311403, -40661, -257221, 93047, -50710, -152717, 54985, -424940, -64665, 208918, 212401, -181309, -180246, 390763, -16283, -191852, -34436, -250793, -201045, 21795, -227348]
11305b2359l670B0846J58227g5579I517J12921A5619f3954j2591A06728m4287
11294F2441b4571l862k74188h2330j10187A43805B1125f4436B72034a80740b3076
11282D7642J0365qe7209k7743q8409P4709j00256P0203j58949q161n492b0505
11269C46a14825j08260I7637J33717e8579l8678j33437A40199M3367b7124o6779
11258i3903H4689c44420a07954F999c81717B61065B1317c70408e9585j81422i5404
11246a20508B03238g3986C41356f6172k40610I7228a93583J5301E2817a8686A4672
11234I9653a08940A01441R2620g2380B42411c06247A33225J8623f5042j37741
11224b02783A43772n8656l9180M1456c04826i2536k44971E1411j742i850j06900
$$ y = [-22359, -26029, 20846, 179073, -75579, 9517, 122438, 15619, -63954, -76545, 106728, 62441, -24571, -28433, -302621, -82330, -192517, 143805, 21125, -64436, 272034, -180740, -23076, 47642, 58007, 57999, -57209, -84952, -173361, -98652, -198908, -128705, -287654, -295815, -301307, -20505, 346, -114825, -223085, 97637, 231354, -58579, -97257, -230694, 140199, 183566, -27124, -93903, 84689, -344420, -107954, 6999, -381717, 261065, 21317, -370408, -59585, -241007, -95404, -120508, 203238, -73986, 341356, -66172, -306782, 97228, -193583, -178282, 52817, -18686, 14672, 99653, -108940, 101441, 194061, -72380, 242411, -306247, 133225, 151848, -65042, -202783, 143772, 85116, 45936, 87392, -304826, -92536, -337507, 51411, 49669, -9850, -116750]
11213a16750k9276A02634a61740j44792B7574L7481n693K8994i5873A59232E0737
11201a08437e340j7737A38642o396c23198A96795F7221J8767a27051k0873E1692
11189b49432B14439a46253J2533B26822a49118N231i249C37901I0156b5894q7319
11178a13213j15692G7064a390B12792P8509E2571J60957a83242A26495M0437H1578
11166b18088H4674c3762G9589d46154a01350M6826j21655B48447a52085c6848
11155g332l3516j1879C6841c37902A98907b34627N3235F607J75159p2502g119
11143a96325N6747q1858g8455k91662f5128j51758B69988A28971E2799K10512
11133B63311b39292d8679A83309d9134B40725C1396f2429A1469g9855A85267b41294
$$ y = [-116750, -146026, 102634, -161740, -306532, 27574, 65055, 59362, 88356, -95873, 159232, 50737, -108437, -5340, -23077, 138642, 132246, -323198, 196795, 67221, 85988, -127051, -147924, 51692, -249432, 214439, -146253, -133720, 226822, -149118, -143887, -9249, 337901, 90156, -25894, -113213, -228905, 77064, -1390, 212792, 291301, 52571, 213528, -183242, 126495, 166932, 81578, -218088, 84674, -33762, 79589, -446154, -101350, -54524, -176179, 248447, -152085, -36848, -7332, -40848, -52727, 36841, -337902, 198907, -234627, -181392, 6607, 181766, 109264, -7119, -196325, -139578, -221436, -78455, -370117, -65128, -216886, 269988, 128971, 52799, 263311, -239292, -48679, 183309, -49134, 240725, 31396, -62429, 11469, -79855, 185267, -241294]
11121b3593k45286J05840F5143M8720J6517d04529A83056F4636Q0915a11666A23200
11109a3102j90523C9090M7111k9109J66049q2654D9639J6556J65331i5481A34390
11097B99553A04684q792g0134A64228P0413N9165D6644k143K85183A09234a45560
11085i4081C80116D3052K94408R8845A10187L63367B3652P1242M24897B34240
11074A42952J48274L0115a25946C41367j923I4273K67230J88340k08090H3638
11063C02584L3498M16818C65308j7135J03880N50606C16112M31218j74027R2575
11053F65878J26309l12405R3154K01622J24180K3078k41874k11549J17043R7063
11043F82499J44301m7306l67240L69099r0927J5118p7528K82094k03638J45361
$$ y = [-23593, -268879, -163039, 65143, 113863, 130380, -404529, 183056, 64636, 145551, -111666, 123200, -13102, -203625, 39090, 86201, 57092, 223141, 140487, 49639, 66195, 231526, -95481, 134390, 299553, 104684, 95892, -70134, 164228, 234641, 293806, 46644, 44501, 329684, 109234, -145560, -94081, 380116, 43052, 337460, 436305, 110187, 473554, 23652, 94894, 519791, 234240, 142952, 291226, 321341, -125946, 341367, 339444, 94273, 361503, 549843, 341753, 83638, 302584, 336082, 752900, 365308, 348173, 452053, 1002659, 316112, 747330, 573303, 665878, 792187, 479782, 572936, 774558, 898738, 921816, 679942, 468393, 585436, 682499, 826800, 779494, 412254, 781353, 690426, 705544, 628016, 910110, 706472, 851833]
11033H51833k54140o9446k5715L12678j59363O863P7033q4194o6541p100J45894
11022G27802j92941J55134j8189K3233j60367J31603j3172j50970J65438j9715
11012F47856k14673K36662r6410J29501j24546B52916L85476A81496M28396j67519
11002D42373j18718L79972J08695l2441j6350j70227j23353J65985j42648j33618
10992C59670J91672K36535K22473k90315j23278M53285j22574j42605J69563L32355
10982A286781k90615L15136n27179O06145O8520J63977K4954M80923j07944J94483
10972B215181K97763J63716o3957k50161j52405P260o05653j97438M04256j47684
10962A670878j08324j43274K62772O0267k36691M8409j45128N23379m52951j92767
$$ y = [851833, 597693, 528247, 502532, 815210, 655847, 662710, 739743, 655549, 589008, 581908, 727802, 534861, 689995, 671806, 695039, 534672, 666275, 653103, 502133, 667571, 647856, 433183, 669845, 573435, 702936, 578390, 252916, 638392, 181496, 609892, 442373, 323655, 703627, 812322, 779881, 763531, 593304, 469951, 635936, 493288, 359670, 551342, 787877, 1010350, 720035, 596757, 1050042, 927468, 784863, 954426, 1286781, 996166, 1311302, 784123, 1390268, 1458788, 1622765, 1647719, 2128642, 2020698, 2215181, 2512944, 2676660, 2612703, 2362542, 2210137, 2217397, 1611744, 1414306, 1818562, 1670878, 1562554, 1419280, 1682052, 1742319, 1505628, 1554037, 1408909, 1932288, 1479337, 1286570]
10952A286570j91396o8829m35845M880j27227N6420j03162o3915H8249K83892
10942C72141i3970B22020J13659I7669J47Q4619g8118b1227B11613b60172g7363
10930B54000o1296r4803R7103l0736B9781d4739q4574L5954n4C4174a1234D10402
10917A8920b37538m6645H4188a68755A010O1001i4529B37448B6967Q1105a39592
10905B10062c3485D9222c3696C12460J8304j2949a72468B76777A15581c156A45957
10893B03145C6551b83139n3054B25066j05399l9373j0103h2398B08492E5366b25760
10881C5394J44812a6768j99650F309b1822p6880M8031r3449M3721A84216O8496
10870B52712E3542J73138c05071a9921A80678K13891b133k39640j2281p4400A82662
$$ y = [1286570, 1095174, 1026345, 590500, 595380, 468153, 524573, 421411, 357496, 88249, 372141, -93970, 222020, 335679, 97669, 97816, 182435, -78118, -21227, 211613, -260172, -77363, 254000, 192704, 97901, 195004, 164268, 29781, -44739, -129313, -93359, -93413, 34174, -11234, 410402, 18920, -237538, -284183, 84188, -168755, 1010, 62011, -94529, 237448, 26967, 108072, -139592, 210062, -33485, 49222, -33696, 312460, 330764, 317815, -172468, 276777, 115581, -3156, 145957, 203145, 36551, -283139, -336193, 225066, 119667, 80294, 70191, -82398, 208492, 55366, -225760, 35394, 180206, -16768, -216418, 6309, -21822, -98702, -50671, -144120, -100399, 184216, 252712, 53542, 226680, -305071, -19921, 180678, 394569, -2133, -241773, -254054, -328454, 182662]
10858C17081g6717j47397A51241I205b11590Q9911q0668A26032b05931A97565
10847a52498B25444F358f963k41455B23325a01262r0438h6233A72486B6246a16664
10835A45677m637f4684p4082O0681E8712k3713r566J9492b79194A71011e2597
10823B31141a00833A54928K54897A67424a24154C13429j04799a72143j18958A91160
10812E4579a90593A02920L18359b60339B3503E55J55410e01291a45468A09629
10801B49382D2510a71367a0552d334B30053a42211j70504H3538b40274A04813
10790b21933E1444R7645g5027j00942h0055j47651J7932b1776n8276G9202B6887
10778a27799r2712j53367C46710P4916a60532a0224B43694E3420p717e2538o0229
$$ y = [317081, -76717, -224114, 151241, 9205, -211590, -121679, -202347, 126032, -205931, 197565, -152498, 225444, 6358, -6963, -248418, 223325, -101262, -191700, -86233, 172486, 26246, -116664, 145677, 141040, -64684, -138766, -78085, 58712, 34999, 25433, 44925, -279194, 171011, -52597, 231141, -100833, 154928, 409825, 167424, -124154, 313429, 208630, -172143, -291101, 191160, 54579, -190593, 102920, 421279, -260339, 23503, 555, 155965, -501291, -145468, 109629, 249382, 42510, -171367, -10552, -4334, 230053, -142211, -312715, 83538, -240274, 104813, -221933, 51444, 149089, -75027, -175969, -80055, -227706, -209774, -21776, -80052, 79202, 26887, -127799, -220511, -373878, 346710, 421626, -160532, -10224, 243694, 53420, 45703, -52538, -112767]
10767a12767G492d35076b08062H0228b79230A67846G1758b07742G3922Q3390k4545
10756A32767R1521d864A91624b22985B75912r0579a45593j16982A9241c65127
10745b01503J9292B22377B7294c18693C53644a79042C84629a74251D4360a20784
10734b27163M0389A0530c67837a65042p5016O6698r0222H20h2857c3475A66826
10722h8016j822A56460e845k44763i9505p0580o9974A98086C3197a20403o8872
10711a89275C93087B6413c75055h2299A31894c53983A08467a59501k76550a39594
10700C0421R0241h753B21891b49098d0127l17586e9877j49352C57015F747b89735
10688b25633K2381E3178d24405A49088a07338A22551b28341B43850d32642B13823
$$ y = [-112767, 7492, -435076, -208062, 80228, -279230, 167846, 71758, -207742, 73922, 157312, 132767, 224288, -4864, 191624, -222985, 275912, 185333, -145593, -262575, 19241, -365127, -201503, -182211, 222377, 27294, -318693, 353644, -179042, 384629, -174251, 44360, -120784, -227163, -186774, 10530, -367837, -165042, -240058, -173360, -263582, 820, -82857, -33475, 166826, -88016, -89838, 156460, -5845, -250608, -99505, -170085, -240059, 198086, 33197, -120403, -189275, 393087, 26413, -375055, -82299, 131894, -353983, 108467, -159501, -436051, -139594, 30421, 120662, -8753, 221891, -249098, -40127, -357713, -59877, -209229, 357015, 6747, -289735, -225633, -203252, 53178, -424405, 149088, -107338, 122551, -228341, 243850, -432642, 213823]
10677a02746m5899H137O0114i8913m376A89016A8937K1066M202J84922a92775
10665B849K95194a74285k8154P3621J1509C84370b47628A35784b6535A41749a6041
10653b81458D1950a43006e5801G1976a64467p6204b0963j45308l83266e1989I9668
10641b81342A23387b73872g3507k8963k297j38799H2795a814B0824a02588j38936
10630b41524E2101a9949D2645a61426M1647m9553j47407d8936I4558J93961b36224
10618e4010j63280h9086k52038P6730r0416O4175A54497G1653C1004K24943H4935
10606F8006b21681I5092c6237j91688L7528A50003h7678B967L2954e467m43501
10595d48968B0062a25801A23098a75077h5290j67595c806E1620J81361f0697j70555
$$ y = [-102746, -148645, 8137, 68251, -98913, -103289, 189016, 18937, 40003, 44205, 229127, -192775, 2849, 298043, -174285, -202439, -128818, -117309, 384370, -247628, 135784, -26535, 141749, -16041, -281458, 41950, -143006, -55801, 71976, -164467, -240671, -20963, -166271, -549537, -51989, 99668, -281342, 123387, -273872, -73507, -102470, -104767, -243566, 82795, -1814, 20824, -102588, -241524, 52101, -19949, 42645, -161426, -119779, -169332, -316739, -48936, 94558, 288519, -236224, -54010, -217290, -89086, -341124, -264394, -354810, -290635, 154497, 71653, 31004, 255947, 84935, 68006, -221681, 95092, -36237, -227925, -190397, 150003, -87678, 2967, 35921, -5467, -448968, 20062, -125801, 123098, -175077, -85290, -252885, -3806, 51620, 232981, -60697, -231252]
10584b31252q5780M8902A97351h4248A83872f7314k85994A6961b75903D8476a64896
10572e2984k31575C75415A14299b8035F5499k092a674r3009E2494a76621g0309
10560b89212K6324k35743a51736H8455J88392A0700J57288a87693o4563J08716
10550a43540D9563A7316h4005b126k02806g4737j55268A11837c8685E3610a1541
10538b98761a41813o8921B72395b22232d3300C7488N9741m5934a69915C8031R3552
10527A31583K48894N605c4395E3133d3973B9336a34564j09107g6118o3465A8617
10515c2036q5132B1038a86836P6665B70678a68882C30179a60051A84105a74890
10504a89917F0203M1565a10352B58481a68338D2685J91898a23687E9021e2750
$$ y = [-231252, -317032, -268130, 197351, -84248, 183872, -67314, -353308, 16961, -275903, 48476, -164896, -52984, -284559, 375415, 114299, -28035, 65499, 63407, -1674, -94683, 52494, -176621, -70309, -289212, -262888, -498631, -151736, 88455, 276847, 10700, 167988, -187693, -252256, -143540, 49563, 17316, -84005, -2126, -204932, -74737, -230005, 111837, -38685, 53610, -11541, -298761, -141813, -210734, 272395, -222232, -43300, 37488, 97229, 51295, -169915, 38031, 131583, 380477, 386082, -34395, 53133, -43973, 29336, -134564, -243671, -76118, -139583, 18617, -32036, -117168, 21038, -186836, -110171, 270678, -168882, 330179, -160051, 184105, -174890, -189917, 60203, 101768, -110352, 258481, -168338, 42685, 234583, -123687, 59021, -52750]
10493i8731A89719b55474D4582a30433j97070A1617R8594j5189m2213J25712g8553
10481D71313o3179k795j30039H2057i9173A07829E844K3214g284k21078A6422
10469a1968m11641a69415F3336j2585a27674n4240i396B00727a73655A46539d9594
10457c5407B8465K1546j2083P0619B9738a21801j1685j0045L7054r8906e8087
10445I2441b20506D5348J12440a79140b892k4794A25999B360a6796G3089i4003
10433F7514a76494A4660J31270b15119a7517B38765a95315M1127N0017j2190K0235
10422i6126a1519o9268k4154j4746c7308J6208j71129D10921A12715i3113j18084
10411b11197c7309j38394B2774J27850a34683G1241b29475A5927a50749A82378
$$ y = [-98731, 189719, -255474, 44582, -130433, -327503, 11617, 110211, 95022, 52809, 178521, -78553, 471313, 408134, 405339, 275300, 82057, -99173, 107829, 5844, 29058, -7284, -228362, 16422, -11968, -423609, -169415, 63336, 50751, -127674, -181914, -9396, 200727, -173655, 146539, -49594, -35407, 28465, 50011, 37928, 108547, 29738, -121801, -133486, -143531, -106477, -205383, -58087, 92441, -220506, 45348, 157788, -179140, -2892, -27686, 125999, 2360, -16796, 73089, -94003, 67514, -176494, 14660, 145930, -215119, -17517, 238765, -195315, -154188, -104171, -116361, -96126, -11519, -80787, -104941, -119687, -37308, -21100, -192229, 410921, 112715, -93113, -211197, -37309, -175703, 22774, 150624, -134683, 71241, -229475, 15927, -150749, 182378]
10400H3846b48967D38879a5384A71003b006H6589c0357B67856a19355A8045c9915
10388A12623h2724A09388Q80a64630f7614B47215i2941B45180e6528k9563i027
10376B6576C83J56330m4425o281L30910B17376o6014L50050a33779D39982P3798
10365E13780B8455K10849M1320A29885N2292K67069a8917B25303A03965d1944
10354A87265J32153j44844K77845p1373L10578k17933n3449j34457K1078p5990
10344B30873K66201Q3848B76028R4073g0024A23647n8931O868A0322J27556k9046
10333A08832h4600C24763b13707A20164a39101D7737M1037L37849i0366E07646
10322A02281M26929A22513M01696A88597Q1953p6739J26217n1367e9903A90878
$$ y = [83846, -248967, 438879, -15384, 171003, -2006, 86589, -30357, 267856, -119355, 18045, -39915, 112623, -82724, 109388, 110268, -164630, -67614, 247215, -92941, 245180, -56528, -86091, -9027, 26576, 383, 156713, 112288, 106007, 436917, 217376, 151362, 501412, -133779, 439982, 513780, 28455, 239304, 280624, 129885, 182177, 449246, -18917, 225303, 103965, -41944, 187265, 319418, 174574, 452419, 381046, 691624, 473691, 420242, 285785, 306863, 230873, 497074, 580922, 276028, 370101, -70024, 123647, 64716, 71584, 10322, 137878, 108832, -84600, 324763, -213707, 120164, -139101, 47737, 88774, 426623, -90366, 507646, 102281, 529210, 122513, 524209, 188597, 270550, 193811, 320028, 268661, -59903, 190878]
10311b7309B69183a76402e9552a908F694J47871b25344i4786r4160C77254A41869
10299a10053o4012j60122F1564E38Q552e5695D92724b99491K7261o8462e5364
10287A07974b3285k2662o1957H8604B0742a79291d6917r3742m010m9036h0438
10275a22601D7475b69785n23246D2390b53672a23898C77142A54853J78287b73446
10264a51562b9568F730b63694D85400j88098J35901k14711J12147K08685j97194
10254C42130A19844K4040l3899M9201A9114e3716A73478b77284e206j68944C74998
10242A36135m31d58740B3377i5763k93454A63989b98156A11317d958A9350c4219
10230A0968m715a92105m2982C4782b34391A49325n6563J52015d0561p1830J8278
$$ y = [-27309, 269183, -176402, -59552, -1908, 6694, 154565, -225344, -94786, -188946, 377254, 141869, -110053, -174065, -334187, 61564, 538, 9090, -55695, 492724, -299491, -272230, -340692, -55364, 107974, -23285, -45947, -107904, 88604, 20742, -179291, -46917, -140659, -144669, -193705, -80438, -122601, 47475, -269785, -793031, 42390, -253672, -123898, 377142, 154853, 333140, -273446, -151562, -29568, 6730, -263694, 485400, 297302, 433203, 218492, 330639, 539324, 342130, 119844, 143884, 109985, 159186, 19114, -53716, 173478, -277284, -5206, -174150, 374998, 136135, 135704, -458740, 23377, -95763, -389217, 163989, -298156, 111317, -4958, 19350, -34219, 10968, 6253, -192105, -235087, 34782, -234391, 149325, 92762, 244777, -40561, -112391, -94113]
10219i4113H2233a11504A48624C7424Q0779b60472e4625A09482a19175o2935h6051
10207G1275h121k6919j04048r4928J13036l32086c0535o1302k0779k53721a9075
10195g4194B56442b35663C35897A16452L36821G3037C1473i7660j74478A2105
10184I1726a24019N0986m8604B593K55584a83431c3539A06848h6963L7258r2072
10173a41777B11049B9452J10364A924K6766b06434n6069A57511b60904B53418
10162E987Q7498J10164a22533C7720M8700e8022E4063a54669A01791b74370A58934
10150a35668A53964a80863J6087p590f2703F4144a5461k92803J19847d9813H3888
10138B87742B2715q445J71528d4440q4401C29763c67842j04062b16055b515j10757
$$ y = [-94113, 82233, -111504, 148624, 37424, 118203, -260472, -54625, 109482, -119175, -182110, -86051, 71275, -8121, -35040, -139088, -234016, -120980, -453066, -30535, -91837, -112616, -366337, -19075, -74194, 256442, -235663, 335897, 116452, 453273, 73037, 31473, -97660, -272138, 12105, 91726, -124019, -73033, -121637, 2593, 258177, -183431, -33539, 106848, -86963, -49705, -141777, 211049, 29452, 139816, 1924, 28690, -206434, -262503, 157511, -260904, 253418, 5987, 93485, 203649, -122533, 37720, 86420, -58022, 54063, -154669, 101791, -274370, 158934, -135668, 153964, -180863, -164776, -172366, -62703, 64144, -15461, -308264, -188417, -49813, 83888, 287742, 22715, 14270, 185798, -44440, -128841, 329763, -367842, -471904, -216055, -2515, -113272]
10127a13272A9835g7823m6193A33109f1825n286n6706q199j31712c5350A03790
10115B04640a16152j70856C0952c26484A51049a59422d789B38417C9391b51927
10104c363D6846a19324j35332a18781o7853j45298B17760h8336p4393n0385j24465
10093c37579a54481q2334A50491a12488A01107J36843N1523c49817h9146j21594
10083b10740j6382e5065E5180Q8911i9711F5672c04174p5737J50123C7833a30741
10071c2415B7984M8111g39217A1726J12208a84550A3419b79556D9360h2772b3932
10059A37480o4730a13975C62692a29986l1054C4338O8351h6130C32922a10559
10048A85925c23082A44466O1819a12707j67993a978k87098E9326j8986b59432
$$ y = [-113272, 19835, -77823, -124016, 133109, -61825, -67111, -123817, -132016, -263728, -35350, 103790, 204640, -116152, -287008, 30952, -326484, 151049, -159422, -4789, 238417, 39391, -251927, -3363, 46846, -119324, -254656, -118781, -186634, -331932, 217760, -88336, -162729, -213114, -337579, -154481, -236815, 150491, -112488, 101107, 237950, 289473, -349817, -89146, -210740, -227122, -55065, 55180, 144091, -99711, 65672, -304174, -379911, -229788, 37833, -130741, -32415, 27984, 76095, -739217, 11726, 123934, -184550, 13419, -279556, 49360, -82772, -23932, 137480, 72750, -113975, 362692, -129986, -161040, 34338, 102689, -86130, 332922, -110559, 185925, -323082, 144466, 206285, -112707, -280700, -1978, -289076, 59326, 40340, -259432]
10037A10618i9220r7193F5730b95199D7755b40051C89411c02955E758K97081e61790
10025E5580J04042G3630K90673e6304l99706J37060C2311a48071N4012D9701a72344
10013d2532r6668A9848b21429M1385m7941R4332O2620I9285c95073P2189a42216
10001B11a54294A18502d76436E4728e1835j09688A00849e4094l07565J79771Q2335
9990i9553d3421I5823J3252e5923j59863B7597b39174j65848A72829a3928j05707
9979a19635A79104E260J08733a43397l04614A60548B3778a44905k0843L1958N2135
9968h1655C58749g0252l02616e2367j27870B21814q0837a00748B09476F6534b69336
9956a61851A9099O1059f6511C59034a33072M4056C26407a69057o0824P655A37864
$$ y = [110618, -99220, -196413, 65730, -295199, 47755, -240051, 389411, -302955, 5758, 302839, -561790, 55580, 159622, 73630, 364303, -56304, -456010, -318950, 32311, -148071, -94059, 49701, -172344, -42532, -139200, 19848, -221429, -180044, -227985, -133653, -71033, 99285, -395073, -322884, -142216, 211, -154294, 118502, -476436, 54728, -51835, -161523, 100849, -54094, -361659, -181888, -99553, -43421, 95823, 109075, -55923, -215786, 27597, -239174, -405022, 172829, -13928, -119635, 179104, 5260, 113993, -143397, -448011, 160548, 23778, -144905, -165748, -133790, -81655, 358749, -70252, -372868, -52367, -180237, 221814, 140977, -100748, 209476, 66534, -269336, -161851, 19099, 80158, -66511, 359034, -133072, -89016, 326407, -169057, -229881, -222226, 137864]
9944a22351C9447c83879J38810C7809K1449c7825k04959N108d3285l05748g325
9932b02973n8522Q4215F3270K55007A51118c36248J47977j33291J48657g7813
9921a74626O4662A6007a52385o007J1705C0847a21204b0274q2298j12358B73939
9909F503a07633m3776A44640p0865f7213j89121D26336F8264P9997k2168e8236
9897c10069I7144i752j07409j13378H5802a48286A00550c7791G015P1867B9079
9885d1603j63503a5983B0345K3274b29497G5634b98556E5899h4751j04037C97836
9873c35340J40903A20464N4871G4584k5030b0135j02011L9388G1926b004o0049
9862f2053B451b84403d0559A8382a37777j61340o9962a0767r9732D34551a88949
$$ y = [-122351, 39447, -383879, -245069, 37809, 59258, -37825, -242784, -237676, -43285, -349033, -7325, -202973, -261495, -177280, 63270, 318277, 151118, -336248, -188271, -321562, -172905, -77813, -174626, -109964, 16007, -152385, -158392, -146687, 30847, -121204, -20274, -102572, -214930, 273939, 6503, -107633, -151409, 144640, 73775, -67213, -256334, 426336, 68264, 148261, 126093, -58236, -310069, 97144, -9752, -117161, -230539, 85802, -148286, 100550, -37791, 7015, 78882, 29079, -41603, -205106, -15983, 20345, 43619, -229497, 75634, -298556, 55899, -84751, -188788, 397836, -335340, -194437, 120464, 175335, 74584, 49554, -20135, -122146, -82758, 71926, -2004, -62053, 2451, -284403, -40559, 18382, -137777, -299117, -369079, -10767, -110499, 434551, -188949]
9850a51988D43645D4122d1479j73322m1512A84955d7513l03203C1151a85139P8041
9839a07098l67781a63989P7512F5099J1362a86282c8811C2080a97544j2340F4317
9827D36301h5180k79915a77508A72839e0342j73837n881E2207c78566A38627a3714
9815A73144N5800D6415a53437f0250B1279c37597g8761o8865C20408a48700C67271
9803H9152a25067j1841D8317O0533C5719A0626b71684a23483D1312K8986a65907
9791b68402c475G8698a41290l24335a23759N6312K7736H0023M6067P252b2750
9779a32753d5390F1199a99647k16894e8025B727c70476a15356B0548K2098c1537
9767b99363J04605P2457B15011g0758l61977a51404k30021B84114a72853C2685
$$ y = [-151988, 443645, 44122, -41479, -214801, -256313, 184955, -47513, -350716, 31151, -185139, -107098, -474879, -163989, -86477, 65099, 76461, -186282, -38811, 32080, -197544, -209884, 64317, 436301, -85180, -365095, -177508, 172839, -50342, -224179, -230060, 52207, -378566, 138627, -13714, 173144, 228944, 46415, -153437, -60250, 21279, -337597, -78761, -147626, 320408, -148700, 367271, 89152, -125067, -136908, 48317, 108850, 35719, 10626, -271684, -123483, 41312, 70298, -165907, -268402, -3475, 78698, -141290, -465625, -123759, -67447, -39711, 80023, 126090, 133342, -22750, -132753, -45390, 61199, -199647, -416541, -58025, 2727, -370476, -115356, 20548, 42646, -31537, -299363, -194758, -122301, 215011, -70758, -432735, -151404, -381425, 284114, -172853, 32685]
9756a22605j40316B0526N6680a42905A30892d249j90377B84167b5507r6172N3418
9745f8261l18654C07750b04591c1575j03237a3162j646m8188A77048a37711a1550
9733e7103B35647f1590A87699a4635k62488B58694r0756d3934A31036b38559A23593
9721i1052k28449I2428R8696A3141b28307a09914k76775J7508J28530C41887A42460
9709c4011o058C2039a48274j30800D5330g8619r3561o7893f8560A1187Q2066a58143
9696a9108j32309L7505m1439k47432J12143C6260P093b21479b9156r2005A33123
9684d5612j98156A76006b19613K9379B3415a44568F2042a74865n1049J10420R719
9673a05775A73671a2717j72643B08487c21161A19161A9389b17211f4951m5478
$$ y = [-122605, -262921, 20526, 77206, -142905, 130892, -4249, -194626, 284167, -25507, -121679, -68261, -386915, 307750, -204591, -31575, -134812, -13162, -14808, -62996, 177048, -137711, -11550, -57103, 235647, -61590, 187699, -14635, -277123, 258694, 167938, -43934, 131036, -238559, 123593, -91052, -319501, 92428, 191124, 13141, -228307, -109914, -386689, -369181, -240651, 341887, 142460, -34011, -40069, 32039, -148274, -279074, 45330, -78619, -172180, -240073, -68560, 11187, 93253, -158143, -19108, -151417, -113912, -155351, -402783, -290640, 36260, 43353, -221479, -29156, -121161, 133123, -45612, -243768, 176006, -219613, -190234, 23415, -144568, 62042, -174865, -225914, -115494, -105775, 173671, -12717, -185360, 208487, -321161, 119161, 19389, -217211, -64951, -110429]
9663a10429n6565P5776k20603O210A05756J02355a56870J8619r5834n0877H4889
9651I7900g1430q7479D8498c55791L6991J50504H9107b93963r3279a86581k2832
9640b09413C57087h1618c7875n9204j99972j11342b8351C4764K23487c18835h1711
9628a1790k19180J534I4986a96887j32755J18840A45018b60418j55538F8133b16465
9616h7204B11276b10316A26699a10525N0870j00287D9280d34758A46151h14l44198
9605c45012R6855a02179i12A78413d25896j30726g2397n9438O4667k19786J33168
9594a53786B0589J6263a17284N5180k01532a16794e234n8671j07003E1008b7744
9582B13315E5932b4843B22133c694l18376C7440b94237a21554l13568J13180E8929
$$ y = [-110429, -166994, -91218, -311821, -305611, 105756, 208111, -156870, -138251, -234085, -284962, 84889, 97900, -71430, -158909, 48498, -355791, -318800, -168296, 89107, -293963, -387242, -186581, -209413, 357087, -81618, -37875, -97079, -297051, -408393, -28351, 34764, 258251, -318835, -81711, -11790, -230970, -229436, 94986, -196887, -329642, -210802, 145018, -260418, -415956, 68133, -216465, -87204, 211276, -210316, 126699, -110525, -59655, -159942, 49280, -434758, 146151, -814, -345012, -248157, -102179, -912, 178413, -425896, -556622, -72397, -131835, -67168, -286954, -153786, 20589, 36852, -117284, -62104, -263636, -116794, -5234, -63905, -170908, 51008, -27744, 213315, 55932, -24843, 222133, -3694, -322070, 37440, -294237, -121554, -435122, -321942, 58929]
9570a59090O3738j17641e6499B69900b80599E5585J16949b6881A76980a75335
9559a14220A83862a8559j34042B12715d0962E3903a28796B38503a08626h365D9768
9547b52707a13668c633E2153K7153a15432d6394o097B78739a80863j61751a04596
9535a96120E9780a31714B23473a8590A83561Q173h9448H3421J65739j06368O2464
9524B05256a2665H572a70481k00448a82160b4120k53876a33259L0455C44408g4747
9512E5475a3029m20348a00608A00612N6319a81923A7227N109R9357g101n0892
9501e7993q8260l1234O3199j0816o5856G541a31966A67101e34828a27254A7687
9489c15276A08986N9329b00540J0678e4296K2473p5988E1796b31907c1050A8174
$$ y = [-159090, -95352, -212993, -56499, 269900, -280599, 55585, 172534, -26881, 176980, -175335, -114220, 183862, -18559, -152601, 212715, -40962, 53903, -128796, 238503, -108626, -8365, 49768, -252707, -113668, -3633, 52153, 79306, -115432, -46394, -52491, 278739, -180863, -342614, -104596, -196120, 59780, -131714, 223473, -18590, 183561, 191734, -89448, 83421, 249160, 142792, 205256, -12665, 8572, -170481, -370929, -182160, -24120, -277996, -133259, -102804, 344408, -74747, 55475, -13029, -433377, -100608, 100612, 156931, -181923, 17227, 22336, 121693, -7101, -57993, -146253, -177487, -114288, -125104, -190960, 7541, -131966, 167101, -534828, -127254, 17687, -315276, 108986, 168315, -200540, -189862, -54296, -31823, -107811, 51796, -231907, -31050, 18174]
9477a7568G7620g3928B42185d48488J94044O6973k9702L7844b5122D57224a7412
9465i4013G2487a83115I4182O1888e7373m0553b2787B10492b38506l9034E2099
9453F3595a6056k8269G9996a2029B76912b16318Q2693A92299o4310b8100j43369
9442a71469F4304a34784a0458l42766a26068A4837b72775b0441J009j34193A14957
9430b60051Q0193O5919C19482a90834B78749b48410d7248o3256c9084l0541p0987
9419a40612j2227A18064A1184a78449j5121k39465f9024L2880A0119a3506k25781
9408b39287J17189e1472k36660J3776P3825M1603p7645k7051m1747a38810l32661
9397d71471a33390A68505b78225d6689E74a44247c6162A29403a8195K979H9756
$$ y = [-17568, 77620, -73928, 242185, -448488, -254444, -187471, -217173, -179329, -25122, 457224, -17412, -94013, 72487, -183115, 94182, 156070, -57373, -97926, -22787, 210492, -238506, -277540, 52099, 63595, -16056, -44325, 79996, -12029, 276912, -216318, -133625, 192299, 127989, -28100, -171469, 64304, -134784, -10458, -353224, -126068, 14837, -272775, -20441, -19432, -153625, 114957, -260051, -179858, -113939, 319482, -190834, 278749, -248410, -47248, -110504, -39084, -69625, -140612, -152839, 118064, 11184, -178449, -193570, -433035, -69024, -36144, 10119, -13506, -239287, -122098, -51472, -288132, -274356, -200531, -158928, -236573, -263624, -305371, -138810, -471471, -133390, 168505, -278225, -46689, 574, -144247, -36162, 129403, -18195, -15216, 89756]
9385A75330c62823A07284j588d5846D180g7027n0699n01707c10887N811d6891
9373i7727C65135a27606p0869L5922F4968b03712G9242O7268F8826b39686Q1197
9362a58489A92191a33353j514B77025I3236K45047C8086b16609n7120P1543K8661
9351a73525C6019Q0293e3453l403B22552n0409k9510J18850j19330a75233B8454
9339e0501m5575A74120Q9397A01375K39311a90154E1760K1372Q5895B5268a51647
9327h3783n4255o0077j52701B21150c75388A666b68B422N9699a36925N8675n1190
9315a29440j60353C3967J04194h6337A89097b33627A08270b46595a10972D16242
9304A62419a00862L054B01916C481b70936R7521L4628B48389g7478m2665p7688
$$ y = [175330, -362823, 107284, 105696, -45846, 4180, -77027, -127726, -629433, -310887, -305076, -46891, -97727, 365135, -127606, -198475, -162553, 64968, -203712, 79242, 146510, 68826, -239686, -158489, 192191, -133353, -134867, 277025, 93236, 338283, 38086, -216609, -273729, -202186, -173525, 36019, 116312, -53453, -56856, 222552, 172143, 142633, 261483, 142153, -175233, 28454, -50501, -96076, 174120, 263517, 101375, 340686, -190154, 51760, 73132, 159027, 25268, -151647, -83783, -138038, -198115, -350816, 221150, -375388, 1666, -268, 2422, 62121, -136925, -78250, -129440, -289793, 33967, 138161, -86337, 189097, -233627, 108270, -246595, -110972, 416242, 162419, -100862, -97808, 201916, 3481, -270936, -173415, -138787, 248389, -77478, -120143, -197831]
9293a97831D5265b18513R9629d6714I6975B0952d7582n8245N0966A41765G110
9281i2335j3836B4658L00283c8691a4701o6621j13713o1356a06280K491l01240
9270d05029A66565M4262P690f8928p2853O9347j13581k91939a68295A67405e7130
9258d0585m4290A28553R6290E5791J41800p3177c34987a07733K4883k2444n1063
9247a56357a8421B19361h1618l29590J14629E7390J27696c4712J108k46080d3804
9235b95060B45644b38422A24437a13842c3411k52590I8445K7688L1682c3749A21441
9223b44728e5710n8798k59025C6844J63406e8028m32609A84299G3341B8915b92582
9211B3402J20818L885o0005A1644a92698L4513d2549D4239c8763B9249a67074
$$ y = [-197831, 45265, -218513, -118884, -46714, 96975, 20952, -47582, -105827, -54861, 141765, 7110, -92335, -106171, 24658, 324941, -38691, -14701, -81322, -195035, -256391, -106280, -103789, -405029, 166565, 210827, 218517, -68928, -141781, -72434, -186015, -477954, -168295, 167405, -57130, -40585, -84875, 128553, 224843, 55791, 197591, 124414, -334987, -107733, -82850, -105294, -156357, -18421, 219361, -81618, -411208, -296579, 57390, 185086, -34712, -33604, -279684, -43804, -295060, 245644, -238422, 124437, -113842, -33411, -286001, 98445, 126133, 157815, -33749, 121441, -244728, -55710, -114508, -373533, 36844, 200250, -58028, -490637, 184299, 73341, 28915, -292582, 23402, 144220, 148105, 88100, 11644, -192698, -158185, -42549, 44239, -38763, 29249, -167074]
9199E7029L23680a84858P6824A55696b05289b4472I5828O4215a20787j7392j47289
9188b85468A27182i0102A2308P0513k0221F156d17469a19152j067j61906a26177
9176b11099C01592p2799a48208n9972C52358H0270b2456G4670P0985c96560A10727
9164h3210k9283j7116C0593a16664l4171a3641D6250Q9592b70638P4972G8132
9152a39298m2289B30241i2313j6611a9444k73513O8905L0787A9318C769b84367
9140B21526C8087c19675J1851H3548b83093M1230K8378E4026M4202J9626R2968
9129B10822A04634O2254h845D9154B667i4699d2155p0087A0295P6458a0820A11879
9116f8506A29353J0296a92370j94482a0265B23160f2655p2742A1234b6903j34328
$$ y = [57029, 380709, -184858, -108034, 155696, -205289, -24472, 95828, 160043, -120787, -138179, -285468, 127182, -90102, 12308, 82821, 62600, 6156, -417469, -119152, -120219, -282125, -126177, -211099, 301592, 228793, -148208, -208180, 352358, 80270, -22456, 74670, 145655, -396560, 110727, -83210, -112493, -129609, 30593, -116664, -150835, -13641, 46250, 135842, -270638, -195666, 78132, -139298, -181587, 230241, -92313, -108924, -19444, -292957, -224052, -193265, 19318, 3769, -284367, 221526, 38087, -319675, -307824, 83548, -283093, -241863, -213485, 54026, 98228, 117854, 210822, 104634, 166888, -8845, 49154, 2667, -94699, -42155, -112242, 10295, 86753, -10820, 111879, -68506, 129353, 139649, -192370, -386852, -10265, 223160, -62655, -135397, 11234, -26903, -161231]
9105a61231A67475i4291E9863e4583a1302j66919N4075k50206f8364j54975A50890
9093c1424j93972O3926B35864a08068k30072P2220j22329a774k70277J21973O600
9082a43478F8671b64668R1447p361L6271A7869a07316D5435K51571a49898G7590
9070d6858F7880a28203C8019c36826E5406L2404a43114b3189A93386c13405A55139
9058C2494A2168h1863A790a02569p9982j47765B281a0053D0136b45884a02446
9046a4511k6878j88963D9594a16158I528K8865a76161h0459B52291C7444A8138
9034i543k4659B21077b66092C3784j0506a41118I8849c9960A14633c03536C5766
9022E7407a47109A09648b95095b1033l6004D4830h2546B40093a53873A80042i6089
$$ y = [-161231, 167475, -94291, 59863, -54583, -11302, -178221, -124146, -374352, -68364, -223339, 150890, -31424, -225396, -161470, 235864, -108068, -338140, -265920, -388249, -1774, -272051, -150078, -143478, 68671, -264668, -173221, -180582, -144311, 17869, -107316, 45435, 297006, -149898, 77590, -46858, 67880, -128203, 38019, -336826, 55406, 87810, -143114, -23189, 193386, -313405, 155139, 32494, 12168, -81863, 1790, -102569, -182551, -330316, 2281, -10053, 40136, -245884, -102446, -14511, -41389, -230352, 49594, -116158, 9528, 38393, -176161, -80459, 252291, 37444, 18138, -9543, -34202, 221077, -266092, 33784, 23278, -141118, 98849, -39960, 114633, -303536, 35766, 57407, -147109, 109648, -295095, -21033, -57037, 44830, -82546, 240093, -153873, 180042, -96089]
9010a80696h0363G585N5544a2688F2209a87505F6292b03035g3028F104b50968
8998A1420O6663K80794e8434a8897m93n2642l12930a55474G0145b04629p6916
8987b81545J34669h045j99587R6686C0946j3686J48676r717b78549A05534c14974
8975a37261A15250b52097J19886K9193j78905A80313a94385O8232N2409k89059
8965c62803e1553j67835k53802A39740C8046c9631b223k7829A6746J23797E5494
8953b08573A61319a92237k8385i4858q2172c1682r0648a7820B870a47538j04593
8942b52131g2215l71841h0251j7329A2199K33741b31084C01530r6114j5211I285
8930a29775B46865a69434f5942G2615K55626N2317K35910J358898M349868L452490
$$ y = [-180696, -80363, 7585, 63129, -12688, 62209, -187505, 66292, -203035, -73028, 6104, -250968, 11420, 78083, 358877, -58434, -18897, -19390, -72032, -384962, -155474, 70145, -204629, -281545, -146876, -8045, -207632, -110946, 30946, 17260, 165936, 156219, -278549, 105534, -314974, -137261, 115250, -252097, -132211, -103018, -281923, 180313, -194385, -126153, -73744, -362803, -51553, -219388, -473190, 139740, 38046, -39631, -2223, -30052, 16746, 140543, 55494, -208573, 161319, -192237, -220622, -94858, -177030, -31682, -122330, -17820, 2870, -147538, -252131, -72215, -444056, -80251, -97580, 12199, 245940, -231084, 301530, 205416, 190205, 9285, -129775, 246865, -169434, -65942, 72615, 328241, 380558, 616468, 1975366, 6325234, 9777724]
8920I777724C126804A099664m15313B96385j29484m9469a08980D71945A14693
8910A97661q4356J0985L7102n6989a76103M8469c4406F8393a36338d9978n3063
8899a03041j45282B50396j23859N5637D8369a57195A756c5264k49012c0709D3641
8887C3804b32306A69429a42733C6016J3404a31744k50106A85967a4654A31021
8876a86114L9436A69686R2542d03955a55939B75986j06875E9814K6304b2960k20441
$$ y = [9777724, 3126804, 1099664, 684351, 296385, 166901, 117432, -108980, 471945, 114693, 197661, 113305, 124290, 161392, 104403, -176103, -127634, -34406, 68393, -136338, -49978, -103041, -248323, 250396, 126537, 182174, 48369, -157195, 1756, -35264, -284276, -30709, 43641, 33804, -232306, 169429, -142733, 36016, 49420, -131744, -381850, 185967, -14654, 131021, -186114, -146678, 169686, 262228, -403955, -155939, 275986, 169111, 59814, 86118, -22960, -243401]
$$ [...]
##END NTUPLES=NMR SPECTRUM
##END=
