
##TITLE=UV1101_M1_1161-1249_7180299_PugBAnIHS7
##JCAMPDX= 6.0         $$ Bruker NMR JCAMP-DX V2.0
##DATA TYPE= NMR SPECTRUM
##DATA CLASS= NTUPLES
##ORIGIN= BRUKER
##OWNER= Administrator
$$ 1.72 TOPSPIN		Version 2.1
$$ 2012-12-05 00:39:43.349 -0500  Administrator@X
$$ Compression mode = diff/dup
##.OBSERVE FREQUENCY= 400.02188249412
##.OBSERVE NUCLEUS= ^1H
##.ACQUISITION MODE= SIMULTANEOUS (DQD)
##.ACQUISITION SCHEME= undefined
##.AVERAGES= 8
##.DIGITISER RES= 22
##SPECTROMETER/DATA SYSTEM= spect
##.PULSE SEQUENCE= zg30
##.SOLVENT NAME= COFFEE_meoh
##.SHIFT REFERENCE= INTERNAL, COFFEE_meoh, 1, 14.98509
##AUDIT TRAIL= $$ (NUMBER, WHEN, WHO, WHERE, PROCESS, VERSION, WHAT)
$$ ##TITLE= Audit trail, TOPSPIN		Version 2.1
$$ ##JCAMPDX= 5.01
$$ ##ORIGIN= Bruker BioSpin GmbH
$$ ##OWNER= Administrator
$$ $$ E:\/data/COFFEE/nmr/UV1101_M1_1161-1249_7180299_PugBAnIHS7/10/pdata/1/auditp.txt
$$ ##AUDIT TRAIL=  $$ (NUMBER, WHEN, WHO, WHERE, PROCESS, VERSION, WHAT)
(   1,<2012-12-05 00:39:35.099 -0500>,<Administrator>,<X>,<go>,<TOPSPIN 2.1>,
      <created by zg
	started at 2012-12-05 00:38:29.115 -0500,
	POWCHK enabled, PULCHK disabled,
       configuration hash MD5:
       86 BA 57 50 F2 9D 5C 9B 26 00 A9 28 5F 66 2E 89
       data hash MD5: 64K
       B2 BB 86 D1 8C E8 51 3B 68 23 20 11 D8 75 81 28>)
(   2,<2012-12-05 00:39:38.240 -0500>,<Administrator>,<X>,<proc1d>,<TOPSPIN 2.1>,
      <Start of raw data processing
       efp LB = 0 FT_mod = 6 PKNL = 1 PHC0 = 0 PHC1 = 0 SI = 32K 
       data hash MD5: 32K
       81 7D 07 C1 B6 55 9E DE CC 85 4E 07 B2 9F 6A 99>)
(   3,<2012-12-05 00:39:38.708 -0500>,<Administrator>,<X>,<proc1d>,<TOPSPIN 2.1>,
      <pk PHC0 = 96.92139 PHC1 = 0 
       data hash MD5: 32K
       90 5D 56 98 8E 41 CE A5 43 1A 2B 37 75 B5 F9 ED>)
(   4,<2012-12-05 00:39:38.943 -0500>,<Administrator>,<X>,<proc1d>,<TOPSPIN 2.1>,
      <abs ABSG = 1 
       data hash MD5: 32K
       40 38 3E 95 A4 39 95 A1 87 06 AC A9 82 9B EF DC>)
(   5,<2012-12-05 00:39:39.099 -0500>,<Administrator>,<X>,<proc1d>,<TOPSPIN 2.1>,
      <abs ABSG = 2 
       data hash MD5: 32K
       6F F3 FD 64 A2 45 71 F2 B2 FF A0 D8 28 85 CE 40>)
(   6,<2012-12-05 00:39:39.240 -0500>,<Administrator>,<X>,<proc1d>,<TOPSPIN 2.1>,
      <abs ABSG = 3 
       data hash MD5: 32K
       B2 B4 17 49 05 22 2C 50 BE 49 22 5B F5 91 D2 70>)
(   7,<2012-12-05 00:39:39.380 -0500>,<Administrator>,<X>,<proc1d>,<TOPSPIN 2.1>,
      <abs ABSG = 4 
       data hash MD5: 32K
       24 4A 8F 47 DD 8B 1A 92 14 CE 25 96 64 D1 C7 63>)
(   8,<2012-12-05 00:39:39.521 -0500>,<Administrator>,<X>,<proc1d>,<TOPSPIN 2.1>,
      <abs ABSG = 5 
       data hash MD5: 32K
       4D 57 AD 71 69 EE 01 53 55 09 5D 9B 18 F4 A6 3B>)
$$ ##END=
$$ 
$$ $$ hash MD5
$$ $$ C9 D8 6F 9C 35 01 7F 96 BF F1 84 1C D0 D1 7A CA
##$RELAX= 
##$RELAX= 
##$RELAX= 
##$RELAX= 
##$RELAX= 
##$RELAX= 
##$RELAX= 
$$ Bruker specific parameters
$$ --------------------------
##$DU= <E:\>
##$EXPNO= 10
$$ [...]
150 150 150 150 150 150 150 150
##$TP07= 0
##$TPNAME0= <>
##$TPNAME1= <>
##$TPNAME2= <>
##$TPNAME3= <>
##$TPNAME4= <>
##$TPNAME5= <>
##$TPNAME6= <>
##$TPNAME7= <>
##$TPOAL= (0..7)
0.5 0.5 0.5 0.5 0.5 0.5 0.5 0.5
##$TPOFFS= (0..7)
0 0 0 0 0 0 0 0
##$TUNHIN= 0
##$TUNHOUT= 0
##$TUNXOUT= 0
##$USERA1= <user>
##$USERA2= <user>
##$USERA3= <user>
##$USERA4= <user>
##$USERA5= <user>
##$V9= 5
##$VALIST= <valist>
##$VCLIST= <CCCCCCCCCCCCCCC>
##$VD= 0
##$VDLIST= <DDDDDDDDDDDDDDD>
##$VPLIST= <PPPPPPPPPPPPPPP>
##$VTLIST= <TTTTTTTTTTTTTTT>
##$WBST= 2048
##$WBSW= 25
##$XGAIN= (0..3)
0 0 0 0
##$XL= 0
##$YL= 0
##$YMAX_a= 682289
##$YMIN_a= -580197
##$ZGOPTNS= <>
##$ZL1= 120
##$ZL2= 120
##$ZL3= 120
##$ZL4= 120
##$ABSF1= 14.98509
##$ABSF2= -5.573092
##$ABSG= 5
##$ABSL= 3
##$ALPHA= 0
##$AQORDER= 0
##$ASSFAC= 0
##$ASSFACI= 0
##$ASSFACX= 0
##$ASSWID= 0
##$AUNMP= <proc_prof1d_extract_pilot.lims>
##$AXLEFT= 0
##$AXNAME= <>
##$AXNUC= <1H>
##$AXRIGHT= 0
##$AXTYPE= 0
##$AXUNIT= <>
##$AZFE= 0.1
##$AZFW= 0.1
##$BCFW= 0
##$BC_mod= 0
##$BYTORDP= 0
##$COROFFS= 0
##$CY= 15
##$DATMOD= 1
##$DC= 0
##$DFILT= <>
##$DTYPP= 0
##$F1P= 0
##$F2P= 0
##$FCOR= 0.5
##$FTSIZE= 32768
##$FT_mod= 6
##$GAMMA= 0
##$GB= 0
##$INTBC= 1
##$INTSCL= 1
##$ISEN= 128
##$LB= 0
##$LEV0= 0
##$LPBIN= 0
##$MAXI= 10000
##$MC2= 0
##$MEAN= 0
##$ME_mod= 0
##$MI= 0
##$NCOEF= 0
##$NC_proc= -8
##$NLEV= 6
##$NOISF1= 0
##$NOISF2= 0
##$NSP= 0
##$NTH_PI= 0
##$NZP= 0
##$OFFSET= 14.98509
##$PC= 1
##$PHC0= 96.92139
##$PHC1= 0
##$PH_mod= 1
##$PKNL= yes
##$PPARMOD= 0
##$PPDIAG= 0
##$PPIPTYP= 0
##$PPMPNUM= 2147483647
##$PPRESOL= 1
##$PSCAL= 4
##$PSIGN= 0
##$PYNMP= <proc.py>
##$REVERSE= no
##$SF= 400.02
##$SI= 32768
##$SIGF1= 0
##$SIGF2= 0
##$SINO= 400
##$SIOLD= 32768
##$SPECTYP= <>
##$SREGLST= <1H.CDCl3>
##$SSB= 0
##$STSI= 32768
##$STSR= 0
##$SW_p= 8223.68421052631
##$SYMM= 0
##$S_DEV= 0
##$TDeff= 65536
##$TDoff= 0
##$TI= <>
##$TILT= no
##$TM1= 0
##$TM2= 0
##$TOPLEV= 0
##$USERP1= <user>
##$USERP2= <user>
##$USERP3= <user>
##$USERP4= <user>
##$USERP5= <user>
##$WDW= 1
##$XDIM= 32768
##$YMAX_p= 484991023
##$YMIN_p= -666353
##$CURPLOT= <Network HP LaserJet P1505>
##$CURPRIN= <$Network HP LaserJet P1505>
##$DFORMAT= <normdp>
##$LAYOUT= <+/1D_H.xwp>
##$LFORMAT= <normlp>
##$PFORMAT= <normpl>
##$SURQMSG= 1
$$ End of Bruker specific parameters
$$ ---------------------------------
##NTUPLES= NMR SPECTRUM
##VAR_NAME=  FREQUENCY,     SPECTRUM/REAL,   SPECTRUM/IMAG
##SYMBOL=    X,             R,               I
##VAR_TYPE=  INDEPENDENT,   DEPENDENT,       DEPENDENT
##VAR_FORM=  AFFN,          ASDF,            ASDF
##VAR_DIM=   32768,         32768,           32768
##UNITS=     HZ,            ARBITRARY UNITS, ARBITRARY UNITS
##FACTOR=    0.250966925370066, 1,           1
##FIRST=     8223.43324360094, 22842,        -140124
##LAST=      0,             106830,          -67541
##MIN=       0,             -666353,         0
##MAX=       8223.43324360094, 484991023,    0
$$ Real data points
##PAGE= N=1
##DATA TABLE= (X++(R..R)), XYDATA
$$ [...]
23789 -70766 116200 20717 -64277 -171801 -59514 -221597 243216 -346106 -121578 -141751
23779 -141751 96164 60067 -47744 6314 135131 166384 240185 -271499 -187289 -154634 123262
23767 -21194 -64027 -75389 109743 -354896 -50373 40543 78029 -173905 84951 -180023 -24359
23755 -68802 34484 -233978 -325185 -38697 137075 -121254 -53054 397110 -194253 -93504 235099
23743 221378 340486 323232 41215 300310 -107116 -59131 -448722 246444 -22938 147460
23732 170026 156436 -28124 -140347 119952 -182773 88538 -90710 127152 -59350 -118019 -234796
23721 -234796 -30586 -36959 295614 -27340 78375 -22335 177671 -110808 56952 -19180 -167253
23710 -167253 -248688 44188 -144841 -37319 -66935 92280 -280956 181394 39996 107780 -271648
23698 84996 -72311 16262 11341 -127697 -270411 320068 -276805 -21316 48259 432889 -10024
23686 96027 -1940 135879 169037 -131763 -105420 -318912 -7126 -80929 180059 32010 -187540
23674 -108180 94555 102262 16713 113347 -265984 136293 -153199 63326 -450170 -405521 -127322
23662 118443 113843 197500 -17686 8352 127579 -34981 -180007 16753 99838 -134338 -11814
23650 -47877 54716 89503 -205293 148858 -142444 -136433 -275747 236612 296447 153870 -150174
23638 133358 -14185 -49604 4088 -102668 167826 115516 73240 -148479 -211579 -146622 49980
23626 -54335 36002 -52563 155083 82525 102142 -70046 -5905 -51016 607451 97213 -264362
23614 16195 -62305 91455 30861 159250 -68336 -110955 193134 -9822 105327 224482 -185108
23602 -107504 -30199 139643 33704 -356708 -41883 79284 55448 -196316 334850 -120793
23591 92737 164081 100271 249570 109889 206131 126708 352358 275827 101879 31027 83832
23580 83832 -66045 14866 -252074 89006 -57563 150314 -244499 -126290 112424 -20207 115176
23568 -235911 123898 -54010 -12017 142117 149504 -225883 -312556 447091 -156308 283000
23557 79044 282146 135395 -194587 -306786 5744 -212101 31594 241293 -169501 -202941
23547 -202941 -426129 -44898 -49063 188346 -269078 -255170 -203974 -320131 169197 -220800
23536 132497 -166130 -34722 -371552 126336 141017 29957 -105140 84270 -41362 -103873 63367
23524 -141290 196294 -38141 -166199 -340334 -103350 -169919 -185614 -142276 -98371 -369901
23514 -369901 -163722 -148682 70246 181388 -248642 73311 54609 -291302 -79574 3499 231405
23503 231405 87592 -170232 -47848 97717 184690 164386 218490 202986 -87009 -274295 113216
23491 34972 54220 122308 -127735 98170 -102903 150378 8840 -298764 30590 434978 74687
23479 -29752 -313225 98617 189877 16125 -74736 118193 94793 269583 -220257 -262052 40302
23467 -51617 252434 82848 177816 -136384 -116807 238020 -87918 -124267 132167 -38099 20705
23455 -121430 325768 -64307 -129735 -206667 209903 -139968 -13104 10183 105462 -174153 -54060
23443 -293892 -163966 105399 -6596 108442 -152577 -69413 -197041 48148 53978 -16500 104081
23431 67144 -225080 -53601 175493 -119584 -263553 -33391 347415 -149891 -61038 80741
23420 167593 -335967 -122055 -24749 26065 23781 155922 -140643 -6661 64846 163497 126561
23409 126561 -44564 -160124 416248 -51667 -172547 -205061 165368 72173 163922 -22785 -55234
23398 -55234 10230 -77316 -256352 -354855 10567 -121433 147850 -358471 32377 -43453 -78690
23387 -78690 -263419 -211937 -59386 -114863 -9143 98307 19306 -205093 298101 173730 142629
23376 142629 1269 33922 -261988 144326 100611 -4180 -66445 127774 -189987 -156476 -100959
23365 -100959 89958 -328371 62247 -171816 -27425 -61372 -452667 88602 136477 -387272 89213
23353 -94576 81828 -64033 75373 -233055 -17683 -350422 196403 -466128 -157866 204615
23342 6964 266355 250977 -137211 -370972 358354 -239619 42679 96957 222343 -83112 88060
23330 217991 -145225 266287 76346 159698 -352675 -217975 83006 232955 386576 -191290
23319 225545 18295 -38094 106318 -29608 130570 252603 -170281 5037 49559 365 -84861
23307 -374174 -158082 -118276 -78341 -224566 4817 22280 -30949 97521 47420 136 -229983
23295 -212788 104080 58020 187824 -220657 -47178 40955 -153628 164431 -246295 -305768
23285 -305768 28413 27529 -156378 -64888 -139117 199806 59390 103311 -244015 -990 -275488
23274 -275488 -131429 137731 147023 -240931 -417623 -202447 -172845 -109923 57483 101894 -145792
23262 104874 -113721 -225510 -122912 97852 80038 -358656 80137 -49584 29845 273805
23252 273805 -34191 208816 -296404 336086 238994 -95685 24760 -38917 255703 -51755 96015
23240 71471 46839 -45315 247630 202245 81532 -38083 -269646 -291945 73509 200889 27720
23228 -94458 278571 -249062 88148 -132443 -452 -34263 -162191 221896 -169406 -120032 -327707
23217 -327707 78960 -63521 -476489 -202813 15944 -100003 88024 -228083 -186586 -93352 60199
23205 -362529 151242 -18820 -348188 -362644 148326 22990 263665 43248 -176950 -60875
23194 -63005 -124907 -113736 -131078 429488 34048 -37992 109774 -156763 43794 -73909 -66097
23183 -66097 -385170 49171 82449 -221461 -143720 -43023 34012 109442 -208804 257310 -132201
23171 47695 116558 300399 192499 144618 -77755 -10123 7254 23042 -132817 114088 229860
23160 229860 -21876 104408 21393 -97846 -194658 -116390 191362 -186168 27827 -70446 -164414
23149 -164414 -343620 -191325 -94699 77938 -146818 -112005 -234043 105724 67840 249573
23139 249573 133179 114086 -18364 333596 312417 -234788 -38107 21937 -336610 -93020 -122630
23128 -122630 -258710 16352 278021 67939 152946 253819 136805 189002 347846 -93922
23117 349459 -92386 -79016 -177477 -23413 174422 27088 -135864 88250 30436 41516 6663
23105 351764 89121 -201772 -126651 136058 -8861 41659 144899 89094 108662 128692 -320447
23093 150952 -134712 25997 -19549 -50929 -207717 83758 -72189 195441 -112617 -377094
23083 -377094 172086 -71314 183282 -286168 -246115 -133990 -169746 407766 -272873 -375393
23073 -375393 174487 -268965 -186527 -140469 -29222 209447 227345 -109698 5623 -181255 86734
23061 -23067 181266 -232205 -37395 105376 -231433 295382 -81854 100047 174020 231328
23051 231328 145311 -197388 76863 84495 -153918 -18781 -220669 -118987 -108074 -214898 313595
23039 -77934 154733 -241320 150525 38485 -50826 -47013 -81427 110307 -65614 34915 45257
23028 45257 -81425 -163618 -62969 109350 -91928 18304 -67860 -114402 -148948 -101190 -145165
23017 -145165 -111884 -215481 -94406 -101640 -122953 -241606 -43558 80772 -116526 183107 -314195
23005 133454 -98479 198719 -159332 325341 97908 49449 -15794 -251803 -70888 337265
22994 -126346 246050 36918 110233 118000 -180432 128202 -22087 -456536 26773 -35474 216493
22982 87474 25011 -146420 -239512 -16365 -238141 -83797 -308079 -263020 -205727 -45942 140810
22970 233665 68460 -266015 202188 -155971 -161580 23769 -101880 309174 -203081 55933
22959 56094 -68203 -84433 103731 -145378 -310823 -120083 4791 52412 10003 -145372 -60396
22947 -169248 115768 -93595 -63627 -384673 -157750 -191866 -385095 -392810 20780 -267483 -84903
22935 182407 -49246 -499113 -120158 -193011 -54580 64245 48765 259225 -105343 -130765 267282
22923 27532 -94902 196204 226084 81026 -199831 -158708 11709 70417 98118 -239614 -55426
22911 -22723 -46683 -22094 222867 -396520 263278 238706 103961 -180653 52782 7848 -71957
22899 126516 -170018 170260 -4667 -254124 179304 42824 -32845 317860 337095 -104995
22888 47704 7446 -74727 -69291 339397 145982 -176914 -167588 -209062 124261 232464 -330312
22876 -88236 138304 -19022 -292077 -227281 74962 -162163 167801 109649 342782 -105470
22865 160777 10530 -77854 60533 -211222 30343 -109664 -208278 -54763 -94844 -54476 -191953
22854 -191953 -113118 -93587 -130351 -89847 -289706 -31302 118284 -194885 -190404 163252 367062
22843 367062 114431 -119798 121869 9197 -153296 4437 -218404 -112827 -184850 -14349 40908
22831 -18999 -99726 -44633 88614 -137425 68222 -154386 313005 308491 -228043 -222454 65277
22819 -294128 -53867 85348 -17074 92394 -80165 -135596 -37395 -87518 -279342 100028 -79906
22807 -557105 57549 -1866 199580 87395 -173223 36489 -46525 125165 -74893 33507 66996
22796 66996 77506 45897 33525 -156143 -97476 -293422 171506 -26242 104249 -164176 11706
22784 -20452 -165989 -32281 78773 -350461 331119 -95218 41580 -166574 -221966 91120 40627
22772 272817 -12545 -177320 159948 -223457 178398 -403149 -119839 -268119 -87765 141578
22761 -90060 -224484 -159470 -372480 -48579 -94700 -193657 -77103 -173316 119027 155990 -104859
22749 -15852 120240 -36943 -100015 -83710 7851 -142640 21470 -92432 -129371 50135 -34593
22737 74280 -99012 1484 65175 18298 249171 56412 66356 64707 -160101 -90729 -249298 -238024
22725 -238024 -76894 -300505 -163052 160344 -272681 45876 133947 -179280 -50419 -301974
22715 -301974 74677 -60713 -142030 176101 -31744 173371 280738 4689 -330806 -90872 75652
22703 -45544 -52184 -241507 193447 100233 107235 -368050 110590 -57052 -52089 -27568 30174
22691 -157487 -136330 -244660 93272 139402 -30430 183224 -32945 392365 19014 281117 -271166
22679 78756 -152613 333413 -73365 -144417 70088 75245 -186754 -87327 -130370 -304995 30691
22667 203046 -159884 -303037 92039 -85915 -252037 -240948 -92152 -112570 -54989 213709 -332784
22655 143598 245078 -19154 -1830 -157938 66214 -210756 130100 95349 46557 -562421 43997
22643 23207 -308056 180060 -42510 -215701 -161354 -17093 231739 70179 184594 -158551
22632 -287518 -118396 -112294 -66827 79366 109409 13344 -112497 84025 32858 -104133 -231690
22621 -231690 -140252 473053 -140402 -292549 -185222 -174807 264404 28879 -166241 167781
22610 -226080 114030 12932 -233455 -82315 299746 -59988 -76708 -95758 240379 36884 -252697
22598 254147 -204881 -235929 213373 -243502 -8543 -110050 215099 291154 -251089 160275
22587 126838 -201253 -17531 31553 157118 -306847 53901 -207600 302213 -166581 -146308
22577 -146308 227691 -105058 -174049 -206987 -92721 -324066 173262 -222971 -264303 38502
22566 35590 -44210 -134947 91784 160904 144934 -54486 -72223 -258197 -88545 -334094 -207161
22555 -207161 115010 -272176 -51739 -224794 168707 70582 -130319 -442961 -23289 -149492
22545 -149492 122085 22227 438210 -288301 -235714 -178873 -100612 202140 -102949 -132869
22535 -132869 52965 33297 59551 -104339 -310949 50659 12245 6521 260596 -62232 -22438
22523 -396152 -208806 169380 -113397 -288216 96681 46516 -166857 105356 -112238 198627
22512 -43930 -44342 -66048 -190171 -100324 -24792 -123894 78435 -62490 47859 52767 -210265 -143449
22500 -143449 23896 -223287 285993 78228 125047 -195762 -118845 196683 -216500 3795 74341
22489 74341 58114 156168 -470576 7269 46576 214564 -143412 -175664 -79816 103384 -319102
22477 133013 145352 30219 279175 24973 -24099 -460372 -242754 149062 69298 83095 -119788
22465 -80048 -32737 59175 -8412 -279278 10053 -283823 -99945 -211213 -169744 197585 9523
22453 -82754 -30524 -12624 -171147 49809 -141475 -156162 -12752 -94531 174850 -205000 -218049
22442 -218049 -358673 45944 -63149 -189440 105168 138050 -110597 -288715 -34631 240541
22431 114089 366259 -458950 -7892 -235974 -71069 199095 -58428 -110943 170910 -128228
22420 30612 -23295 -29838 35718 -14132 -175785 -149938 341500 -257355 -22069 150669 117102
22409 117102 -211833 -86487 -74379 9400 33561 -147713 -73586 -339683 -62626 115760 -158842
22397 -4376 148632 -111428 232514 -98260 87053 67446 -82612 43719 -64934 -59580 -41352
22386 -41352 61889 -87953 -151673 156456 -4375 -66738 -197917 -296644 -41756 232953 117128
22375 117128 -330921 119973 -69905 -157637 -376841 73881 279453 -60930 -111445 -1147 -142496
22364 -142496 135759 -152106 -178443 -54966 -183171 -187155 -395724 2978 124801 238270 42532
22352 -113210 -86777 2595 -52594 -166570 -218214 -214838 -271918 -194670 148261 80743 289691
22341 289691 -184900 -151187 -309222 319278 199612 52537 -334036 -171623 -30511 206629
22330 -120484 -42652 82625 95822 -199880 -179120 -5461 -75225 39171 191339 218427 -141337
22318 280762 -37438 -87107 56764 253742 77210 -184681 66760 113022 -126807 354188 -138398
22306 87024 60884 57674 -67968 -159575 -168709 -29638 198328 425513 155422 -227592 -19149
22294 -257200 -99958 161771 416133 -116662 -360321 80812 -87424 -162548 -157054 -260386 -156152
22283 -156152 105472 -258406 -121851 -118842 -78425 82294 -214851 175393 47505 -178953
22272 161738 118939 -49864 -105373 103127 31647 -271706 -132557 50693 115149 -10491 49272
22260 184503 -240811 13057 -129875 -250691 -124941 -275302 22368 199696 -238213 55943
22249 -79194 -221671 -193276 308440 358275 53694 -406888 111911 65815 -56709 -459981 9461
22237 -250447 -336627 -218027 -142264 -86297 -75056 159597 33760 -69625 97079 -287101 -168236
22226 -168236 -74725 -221674 101025 -208485 -231685 -143295 -160104 -153589 -138003 114976 149872
22215 149872 -32024 -104631 64801 -76559 -139345 -7980 359057 330337 -236732 -107379 109925
22203 211467 -74313 -250436 -119968 -163258 -112233 -139220 -176750 159910 -231177 119360
22192 -149336 -218602 41189 -138217 -272425 -168019 4495 -106388 -51273 73938 -14575 -45540
22181 -45540 53531 143224 -33563 -50547 -77419 253266 -274522 181386 -19144 199521 -66470
22169 159054 -41810 54769 -32515 -65221 -249651 156195 -179073 -356930 -261316 -60042 -348793
22158 -348793 -39001 177736 -166669 -26458 -434105 -9795 -112628 -38492 247707 -371804
22147 84244 -312312 -12767 -90780 167026 -116717 57918 245971 -486874 52129 -123490
22136 -57431 -89879 -77140 77374 337260 82238 -341515 147372 -220212 74661 -92237 370014
22124 -157149 50074 9164 -301636 202229 -101161 -167020 -202817 -414770 -81999 -337536 50626
22112 264888 -196124 19889 -141715 50068 -198432 183797 -19602 -34310 -46834 37680 28814
22101 28814 202094 72894 -42838 -101561 -154527 101258 291835 38160 -62504 -292140 344586
22089 -48567 5129 122850 30127 -239774 -345723 -65634 -126018 -26843 -180664 -197296 -136150
22078 -136150 -121911 114907 -1981 -131511 53806 68862 189360 50950 -211964 -103151 68550
22066 -188973 50662 -186533 -302922 185172 -30658 -83417 -9042 76993 286010 -299206 -46315
22054 -193560 -326251 174920 -136059 -115243 106402 -99604 -81994 -46495 -105209 -18328 -70314
22043 -70314 -10493 -132182 -339684 -21878 -34818 -566051 115991 343500 -254715 -172242
22033 -172242 -386816 -115223 -305030 -155129 71659 96003 18365 4648 -181979 14586 -257856
22021 -218953 187027 -525924 -213185 176489 -66677 158075 240289 47415 -301582 -113661
22010 -86057 59551 47532 103960 -40211 -666353 -294285 -24271 -194696 134857 -79952 105041
21998 61889 225164 -188246 -198003 -430571 -96074 -207790 -64487 24364 -232685 34523 -244354
21986 117901 -150347 -161895 -19377 -93388 -400663 12185 -250240 46645 -96448 -324302 -294653
21975 -294653 11992 312857 -47309 -99512 29977 88652 421210 32086 -469422 -202490 72815
21963 -77986 -25050 74408 65872 -19906 -26816 65028 -65518 -279460 -127061 -267417 110790
21951 55915 21715 142752 -144362 -338439 -93353 -18872 141677 -32719 138418 -227160
21940 220075 50548 158855 -47409 -44236 83204 -10139 67862 -155509 -42725 -148817 72998
21928 136061 -9395 120574 -294205 -114741 -10781 353551 124970 63945 65973 -98178 -274360
21917 -274360 -250303 -58534 -38849 -357206 -37001 -375331 -234882 241556 210051 353730
21907 353730 -247721 -217668 157493 174113 309099 -83660 -101934 2998 -73404 -141340 87329
21895 -263760 -350769 -64530 98 -87597 -84564 189723 75551 -195 63012 69413 -76794 126813
21882 91167 32258 -23520 126233 68912 -41470 -64062 127969 -194307 -207915 37087 -112856
21870 -253497 182871 90594 -39165 142982 -302506 -87383 110504 5395 -94444 190500 -312809
21858 -12363 10968 -146524 74105 -93393 -8268 -111531 -32632 7093 -247677 -39397 -208626
21847 -208626 -219238 -25351 391649 -114525 -222896 -194383 147948 -331690 39316 -67249
21836 -109332 176010 -78663 121112 7586 -204582 -21407 -39727 327694 139783 -417681
21825 -116748 -320844 -251932 359339 76881 93146 -17943 -242087 -40924 -80947 167427 65495
21813 -182712 115909 -75402 -79296 10965 -188128 9053 -14836 274527 242376 126828 188151
21802 188151 -87328 6746 7748 145588 -84056 39567 195883 141222 147576 -178665 -40075
21790 79830 -95685 -17146 98578 -302802 -213088 -30874 -154689 323885 172494 32952 -372645
21778 -94819 -70117 94884 -110793 -42056 63240 -357223 -215858 276344 -209058 -50523 -119143
21767 -119143 20075 -65101 7654 151040 -432351 -130457 -30600 -3196 8088 53801 41590
21756 41590 -93821 59153 151817 56968 168398 -272892 102134 -6872 154974 47121 -198672
21744 198225 -94716 -229866 -239944 -32783 390605 -267811 -125315 95857 -83526 232338
21733 -161967 -253048 -92690 329991 218982 249475 179119 -407203 -181653 -31706 -299609
21723 -299609 -227702 -319641 35785 -28354 -115422 -135428 -92207 -36533 50949 210634 43319
21711 -61532 -238198 -191662 54173 -9781 193418 18158 -178072 111513 510225 219022 -229045
21699 -226501 99823 -17866 -154890 -210305 160755 76382 227531 1671 64072 -275523 -146514
21688 -146514 141964 99391 55082 167618 -219115 38755 -464301 -171108 129413 -57220
21677 -301250 113031 -144539 -201956 45129 -157887 168672 -118358 -215938 -7262 -7696 -140034
21666 -140034 39725 -878 -39070 -62343 59861 87247 -243536 -51187 -71334 -280772 -129180
21654 -76381 -329045 -236024 -55334 49379 10586 61909 -29212 -344576 -203062 38365 47595
21643 47595 -311689 -428082 -213741 -197680 -238967 214111 -83726 84083 -143719 -76114 -199688
21632 -199688 -192875 -32761 -79341 -285764 -169873 130032 -47224 -138488 -425060 -122472 -330459
21621 -330459 -386706 195010 -52062 -170442 -19081 -16939 95049 6401 81456 -151727 -229680
21610 -229680 24407 -71475 208213 246103 195075 -118248 191417 124715 -225530 2712 118974
21599 118974 -192801 -202514 -22476 107751 -57188 81851 -103716 25120 52208 -401177 -184403
21587 -142799 16373 -152973 -256697 -85673 -102304 164348 -13519 -151998 164414 14947
21576 -83016 -464500 285387 -284988 -98345 152118 -3417 -128196 -54076 -38531 -265946 -222143
21565 -222143 -17654 277569 50476 47297 -167275 -139387 46753 -254656 282634 -141910 176010
21553 -266209 69734 51117 71797 -35853 4336 -218360 -350937 175785 50363 81744 -87495
21541 166956 -71381 -23960 -59021 -131123 2552 -296686 141147 -103452 -342400 -225033 -216906
21530 -216906 77440 75163 367706 -147044 57092 -69324 -182728 -466615 65008 -152669 -34277
21518 265823 -106639 -462098 -36673 5923 70014 -226945 -282288 -76199 -52004 -367211 -264561
21507 -264561 -40311 144367 64584 -193671 -82091 -122213 -200330 -38095 -102793 -159333 36492
21495 -47699 -325853 -156333 63947 -100564 12122 -172662 -189334 -137592 43008 224069 -25028
21483 325648 -299704 36751 -443229 -106634 67106 -90121 -269849 -120916 -138907 12937
21472 290377 140215 172660 -265222 11852 61021 -50217 93321 112133 -366841 -31753 -259204
21461 -259204 31585 53127 -200768 10240 -61824 -4871 -243840 -132232 94206 12284 75420
21450 75420 -185438 148745 -108251 45526 -369853 -124173 128934 318900 -77508 157862
21439 -209762 305413 433401 279813 444878 460468 224734 278514 27246 10952 194840
21429 194840 -45028 -354410 -63611 -5022 13159 511394 29854 194132 50017 -145401 297428
21417 -50689 87588 -59549 163251 -115610 -104090 174309 168494 26202 -240849 2496 102139
21406 102139 85068 -56866 -254940 38397 -175895 22180 -149675 27878 -34855 -19201 423852
21394 60717 -121893 27171 -107853 -64381 -299729 70038 117854 169806 -140155 -243291 -251760
21383 -251760 -96819 -73137 48758 -248594 13425 -327876 -88948 99668 -1583 65922 50790
21372 50790 -55707 115747 -126747 -259653 313200 -177656 11156 345193 26384 214440
21362 214440 189119 114348 -136707 27469 -64196 28957 -359530 -229813 -522148 -602892 201673
21350 38686 -135887 -274915 -116709 164169 -192609 287662 180538 -54436 -55129 -93351 -181164
21339 -181164 269795 12184 -101116 112762 -359281 10079 -404000 -146180 -71858 -259025
21329 -259025 -92602 -592 -190526 155236 -144859 -255217 -266628 8804 -200986 -203515 -39567
21317 -139796 332808 -226683 -245433 -161675 90337 -201869 -38835 -155093 198486 -129327
21306 -244097 104385 -116906 76415 -218599 -339883 -141031 -187943 34193 -291502 -224179
21296 -224179 47778 -322888 -297772 -21684 -134836 -5938 43357 115422 35654 -141152 -106350
21285 -106350 -422654 -167624 64414 83864 31468 15925 57684 -158962 -85077 15601 63108
21274 63108 -39083 -59116 -15449 -98461 -285095 -301850 100799 54921 -406897 285678 -88129
21262 37163 -168156 -439751 -372535 -318364 28861 -149935 -170620 121545 136248 43880 -122618
21250 -305557 156494 -391532 165951 31356 147848 148926 -156168 214351 -240698 -48848
21239 3134 60808 11376 -355950 7945 -195955 -213602 -207138 -118622 103822 142864 -34176 -11465
21226 -59397 -2599 -90177 -203094 -294493 -174969 -425818 164267 145246 -154545 -33258 244522
21214 216134 -169946 -66516 -230756 115227 -158926 153449 -19393 -53686 188856 -294334
21203 -106494 37793 65592 106280 -273732 493956 -103269 136636 -402047 -10467 -28223
21193 -28223 221272 -5744 60693 -94980 -145612 197630 -135951 340248 -113664 -140774 -166992
21182 -166992 35321 -65151 -169287 -198896 61467 -78844 -510396 -6957 43726 -136923 -274821
21171 -274821 -98295 153400 -38458 349361 99466 -156791 122595 113168 -57747 -190823 93826
21159 -59013 206372 -137869 -121158 181352 -21381 -263702 229987 166481 -251420 33038
21148 179865 -248860 -94802 -269993 -222054 81576 -196278 352467 331584 -284691 -301647
21138 -301647 88702 82275 -199676 69434 78125 -141246 269663 151316 -245002 -204787 112883
21126 248445 100689 -239550 -150511 -26274 281609 329736 -266718 130604 100121 148517
21116 148517 264952 -282476 -74527 102588 -37763 -158072 -126619 7862 -178394 -123308 281903
21104 -257620 87472 219228 125233 535217 -134774 201365 -243483 -115749 -231595 262846
21093 74608 -135118 208114 -157462 212013 55459 -290753 17864 -204550 -98329 -178502
21083 -178502 368483 121165 90210 -21591 -305869 -45691 -233154 230383 81758 -312067
21072 -23790 -525708 25299 144494 20998 -348089 -149305 202993 -177673 25646 -369328
21061 231005 -103021 42540 -29424 175228 -123135 -212935 -64677 -162656 176959 -269271
21050 10261 -153523 -229466 70560 -371607 -270278 -158942 -25255 -150612 -194172 -267713 -41532
21038 52667 -392314 -24218 -396061 -117355 -351018 -231694 372812 -8118 -53611 -122398 173802
21026 -307362 -115819 -127166 158179 303652 -45254 130728 -211773 -199901 -136658 -22189
21015 -289153 -196836 -305451 46614 30351 -142269 -29560 -216702 202228 -300839 -15615
21004 -348490 118827 205702 81616 -177058 -40767 -418004 137336 69667 47589 -81787 269314
20992 87372 19736 -114132 -128403 1912 99033 -201798 -29471 -192249 248630 242366 34652
20980 -235521 -179469 -176414 -133230 -74383 72866 20992 -504801 -445293 309115 -289141 -89722
20968 -98779 -422424 -87789 -209224 -301046 61769 6523 19730 -68872 323866 71428 150901
20957 150901 -29114 -299555 -287885 73408 13775 98109 -69005 -145081 -437566 198213 -73261
20945 66665 27611 155115 326814 228059 -228848 21117 197175 -195080 266469 -86110
20934 -86735 211057 62176 -54359 -68040 -274910 86477 -210071 -115814 218072 -95092 -111715
20923 -111715 -266781 303381 -154848 30163 -334689 -261430 -91476 -143825 32889 -182385
20912 -49324 -48822 -65073 -160037 375643 -113066 -422138 2942 -61347 -21107 -46205 276315
20900 94335 42206 -55452 6733 77495 -173063 -202144 37206 -105107 -78228 -192852 -123809
20889 -123809 84714 -223277 2937 -226236 -239149 14184 -141621 -104015 -168314 136107 -296661
20877 113509 107052 149 38466 -117101 -37180 -66528 280549 -167881 -103895 -134766 -12625
20865 -25182 -68004 -201491 293985 -138307 -130499 -188154 -191240 74107 -381268 -10238 16885
20853 185860 -221119 -203354 67217 -42231 -188847 75879 316669 -155039 28608 -334724
20842 197290 -73965 -124939 101896 -11089 -229174 -6218 -556170 127547 -94766 202867 854
20830 400244 -172166 170354 -77053 -176764 -32928 -245904 196456 -88991 40136 251417
20820 251417 -201014 222783 69761 262138 -147624 39079 -199745 -128149 -86816 65665
20809 -251740 357217 -239295 97249 209388 270096 38302 -63978 21478 -19869 81394 -94975
20797 -313776 -168180 362902 -46469 -184908 54218 -270494 -315359 32929 -57715 416302
20786 50890 -245018 61861 -80454 -211056 -276989 -72072 264167 -297310 -564089 32280 51663
20775 51663 -165658 1601 -128148 146906 -137528 100712 -229559 -205838 -174160 -212164 -27338
20763 -308147 82394 -116711 -85168 279097 308845 19612 -357210 -45044 -121943 445761 -182317
20751 192112 -172458 171816 -143946 -190719 -147162 -21455 63118 71578 -131399 176758 10832
20739 66449 81013 -41214 -29662 -345174 55616 -57978 -331978 -372248 37419 -329034 260193
20727 28519 75616 -90442 43278 21276 122510 153755 -234793 64740 -235889 -100306 -98329
20716 -98329 -107323 -135368 22199 -343404 -72496 -92583 -259250 22961 -202876 -224253 -114812
20705 -114812 16811 -340572 -78984 -136987 -56128 137141 128971 -38853 -334542 93522 77666
20694 77666 -30371 -118295 -265170 164542 28251 172544 -27628 -177640 73752 -118377 235686
20682 -235547 -13313 84494 -113315 -252274 -15381 -87890 119386 -171416 -44180 -290034
20672 -290034 32123 -148901 -31917 109254 -152750 104808 -334621 -121650 170257 44776
20661 -96291 213277 -209749 178014 285040 201615 -4436 -28433 -238584 -467211 107451
20650 -151793 216187 -105116 -33820 201229 67137 -38770 -319860 -28330 -95571 111424
20639 -32180 -85221 122623 -389438 -196163 -24452 -147411 -57972 171431 70485 173475
20629 173475 77597 -236582 190814 -142565 9280 -243301 48696 129013 -175822 -78490 10483
20617 -273847 -99602 -298888 -272309 -227845 -122568 180954 22364 -72106 -194902 -242400 -105346
20605 -23515 129596 -252055 -201254 -176288 -101351 195716 192348 208048 86186 -37130 -95961
20594 -95961 328071 44171 -214455 1592 -24748 278200 107135 146293 -93037 -20539 -73172
20583 -73172 170324 -86192 208542 -48698 -75622 -25200 144961 33506 -96404 244406 -19360
20571 -111802 52669 116543 -116201 -36690 -125856 -180619 -185809 -442845 85988 182565 -236925
20559 -223077 -59685 69042 -103855 66077 -120412 -185533 -269629 -112667 -54796 -154503 -220142
20548 -220142 -7637 -327233 -173678 -33972 -264218 93037 211430 -63355 49409 -159690 -115547
20537 -115547 -90140 187073 112449 -103648 -277965 -71544 118493 -8 119397 98817 -328235
20525 278665 234384 -92501 -267020 -67538 -134124 51428 207205 -360828 2636 46526 -325496
20513 222518 35950 -6171 178963 -195555 190831 -402616 -159501 -131588 705 -110395 236334
20501 86731 -149635 -267799 -252428 -98144 -33411 244931 -218760 54894 -83388 -162764 -91227
20490 -91227 50106 -437092 -182761 -100002 156673 115984 -336745 88308 -271489 -322448 -205006
20479 -205006 -88979 155522 9695 -463865 -138965 -80439 160162 -288641 76947 -243113
20468 -263546 -99913 -242625 17387 90062 56794 -219224 -280361 163290 -273395 -203826 -132598
20457 -132598 54510 -62971 44907 295684 -175378 -21667 -65406 139448 -318562 134090
20446 359474 -61090 27755 -128422 264108 -108461 -246545 -118276 -386575 139724 -54022
20435 36568 204501 121912 -287313 -111713 -494563 214859 37210 63472 44264 -60979 271412
20423 -85145 -50768 -230044 60392 -7317 -51554 -271971 -16880 -107854 -86161 -221959 -279314
20412 -279314 -57989 13338 18703 -340546 248766 -27499 -47329 240228 -397756 336691 287971
20401 287971 -61605 320466 334630 10115 -162155 500426 -306257 -30170 -223178 -254644
20391 -254644 -128665 484742 249383 31782 -357323 56620 357498 34208 -372715 265446
20380 -93706 -118611 -108681 23496 -26567 -139923 271396 -139023 146583 -139288 -356720 108487
20368 100538 195816 -65694 -100640 -150867 -276924 -51380 191863 -72517 25125 -226469 208050
20356 6879 -9710 -51062 7221 -201564 145518 -283799 -47457 -215959 -86727 -379115 -73209
20344 8263 66570 -111101 -130284 -43619 59786 -267665 -134916 -333181 -94451 -44013 -239860
20333 -239860 69351 313825 84110 15536 274695 -195734 -76146 -87678 -329615 -332955 -94540
20321 37790 -175089 -455242 -17137 81792 -77024 110732 -53703 337802 -60413 -264782 -49585
20309 69729 -92447 15596 -136351 -15409 120718 -448452 -48124 28453 -243416 -394054 -52417
20297 -67341 -10773 -8933 99150 -50053 211002 -113975 277862 -165608 -19525 142019 -52942
20285 -428070 38475 -204961 73856 69299 -371988 -171459 -125753 -63785 -84463 33690 -89007
20273 180850 7482 13244 -166539 -140701 -228672 968 58196 -395621 -30211 48063 -269749 -117756
20260 393246 -193512 -108954 -164737 -105043 84123 -170230 -364966 -67245 -40986 276614 11099
20248 -238111 -183886 -140075 -385129 -149090 -6257 47570 29561 -156942 60850 -52487 -39022
20237 -39022 -213909 -85923 83192 -180331 -124446 -107326 217605 94045 18062 182574 119655
20226 119655 -113122 104267 -44231 -119896 -256873 -25111 -137275 239838 -171427 -18430
20215 -47567 39663 64997 -348428 -116242 -399795 -204114 -71520 -177079 204598 -226607
20204 184159 -64209 -122414 -312573 -46616 -379066 90680 -5905 -246947 -223890 -73634 -134133
20193 -134133 -24830 35356 -90659 64367 -289133 -30644 188530 7627 -198340 -84045 -172973
20182 -172973 544 -34785 -225694 -100154 -76439 225661 60674 9545 -101386 25354 -54471
20170 -146303 -44619 -42304 -106428 -16335 -56831 149685 -186934 178897 78586 85517 60573
20159 60573 38184 -120884 46984 -210388 -194125 120701 -61043 64472 91274 80207 187585
20148 187585 -124057 -345265 -62695 60954 -150937 47885 -163160 196521 148963 219015
20138 219015 -165471 -59223 79779 -94247 35168 109682 -221998 -329698 17269 59023 -299564
20126 -199841 104005 -56652 -107083 -31535 41555 -212183 24041 -72642 -305230 31635 51691
20115 51691 -125610 -188190 -140578 60578 -81722 -64964 -83568 -171257 -65833 -286433 77952
20103 -253706 -37148 -153458 82978 51132 -26163 -49552 -75988 -79657 39381 103799 38858
20091 -284457 -217751 -384732 202179 -262272 220247 -62352 -238907 -480508 -231874 -204045
20081 -204045 -156065 182290 -7228 338815 238929 -244386 46396 -141308 53910 -311421 -115614
20069 -78750 -217960 160826 70939 121502 -203978 47560 -103743 -119380 97978 -29502 85589
20057 64779 60814 -187106 -205297 61145 89086 -424195 -184183 75735 25128 -213025 179995
20045 188830 -181256 -326227 -67718 51480 78981 -156210 34347 -207662 -47620 307578
20034 331965 -89659 1863 262154 113668 -117732 -56025 11579 77652 -20894 -16579 31046
20022 -246047 -39494 -132161 183789 -83244 -122620 -90750 127962 -79994 -199003 53681 -155112
20010 268793 -165251 -139320 -158445 116100 -311053 -109745 -83447 -100906 -48259 -205670
20000 -205670 -172710 -154697 103524 274356 48457 241 -147518 -113116 31358 -171508 -69814
19988 -142069 -51460 -201458 248863 256657 -183924 58675 139816 -169847 -449665 -93253 -274061
19977 -274061 -329544 -77136 -183677 -44790 158797 -183973 -170721 222255 -107345 -226923
19967 -226923 -373254 -15045 -116398 -180745 -203634 -163803 -188234 -21395 -120674 60580 115807
19956 115807 -188949 281068 118763 -236357 -309886 2457 103732 175894 -209718 22036
19945 373322 101802 178363 282729 -47978 -293669 59852 33548 236578 -148266 -10005
19934 433327 -139072 44736 537557 -190735 -16474 -34951 -21554 -94601 13882 -33359 -357146
19923 -357146 175612 30131 -384016 -219043 -312304 -80873 69962 36877 27655 128125 10432
19911 37339 -8824 -101083 4551 -23415 75097 -86652 174381 -64136 16688 -184278 -98508 -69338
19899 -69338 -205747 3192 -409732 125522 39547 126194 88238 -158766 153742 153321 92032
19888 92032 202221 89385 -58244 -200507 -215308 87247 -376181 -154124 -20356 -321879 -232960
19877 -232960 -141940 -42760 -275876 -183521 -18816 130014 -129547 203313 -30764 -175740
19867 -175740 98212 -115260 -56522 -102544 -99003 248299 127221 -232605 -67510 -285582 -80524
19855 89136 60620 102463 54280 -186393 -142763 -192873 118428 148104 209881 -40771 -76440
19844 -76440 -110302 56052 116119 -17416 -118441 6279 -94017 -423681 364890 40965 -218828
19832 -17508 -153620 152556 -306227 -250717 -408855 -150568 35303 -63964 -220321 -147034
19822 -147034 -45131 -154089 -383114 -340983 -7067 57277 33640 62614 -263443 138713 -148352
19810 22077 199240 -388378 22765 -176364 187547 344343 -147497 -226080 60032 -147360
19799 -82032 42238 -133826 -203530 -191765 98670 -198979 -144514 83295 -134435 300187 -112560
19787 -515839 -258230 -437377 -162520 -144275 -219479 -54172 38170 166315 112755 106770 -36835
19775 -164823 -260775 -334750 -238305 -108082 58895 -373080 -25980 -592116 -192320 -4431 -73204
19764 -73204 -240175 -76028 -334437 127434 -25241 -265348 -92763 -370659 98670 92286 -71885
19752 -166287 194507 -21660 -204197 -250788 37061 -191713 23432 -109583 -25438 38640 -288685
19740 98866 226188 -431293 287779 -137703 -35495 -4562 262093 -226588 -89226 -39120 146623
19728 -146070 -107803 305836 26060 -281528 -150345 -125411 30065 -260135 -235984 6849 -67316
19716 -393166 78547 -420670 31728 -170635 -161665 13797 -164569 -193515 360508 -172714 -74134
19704 -124266 -5764 301516 189272 -91411 -29205 138449 -161592 -14011 -394808 110969
19693 454111 225076 266970 95517 -278602 25512 -151252 -131609 82038 118403 61490 -83293
19681 80535 200638 -44600 59582 -158785 261583 39983 -263681 194104 -77940 273446
19670 26001 -190435 -331049 -98145 90045 -146798 4077 153500 400641 -79647 -196565 114458
19658 -17810 326412 -363300 -107812 -82636 -64837 58963 34765 112600 -95234 -302414 -93620
19646 -124083 -316575 71523 250577 8177 50197 130608 -225532 -78018 -323488 -354489 -160261
19634 -125808 -136942 202500 48629 -99484 -355997 -247981 -36120 157835 -91855 78432 -57598
19622 -138904 105791 -155676 126774 -49341 251092 109221 -28101 14825 258593 -136565
19611 136879 2851 -201340 -42548 -827 120708 -7266 -347745 -90685 -258361 -6064 26107 -136833
19598 215439 214077 -172183 157480 -82761 44684 17323 -274522 -100975 -187881 -197222 131275
19586 -14062 340255 -34018 -104513 -274984 -30489 -288249 -253411 89635 -105513 -81603 -55020
19575 -55020 111125 343061 6782 -226284 -148696 -140851 140446 171620 85345 143275 -194018
19563 -216222 -196276 131320 75032 -245574 33841 -238737 -102782 -428435 8857 -242193
19552 -308728 -323545 -45819 230092 11546 190878 62066 -47481 167547 -139213 -42077 -35495
19541 -35495 -403105 142485 128393 -64759 -227160 -88759 151843 -139090 -10125 176619
19530 -70966 -74752 -259028 -54215 178392 198691 144758 -59056 153962 -98292 -16430 22884
19518 -235353 -181427 198206 -150142 -17666 5961 363752 21880 40447 -45734 -103391 -204324
19507 -204324 -82544 -21624 -45807 197029 -10541 -77632 56320 74726 577 -217874 -54181
19495 -184605 -69659 -195342 -238645 -53502 -135153 -76974 288092 146255 -75154 -509514 12324
19483 217005 -221334 -161217 -203767 -129194 126940 -274610 -70436 59029 -282416 -149813
19473 -149813 -174828 -46106 -160593 -279307 -95376 -163387 -253204 -9610 199 -260593 -34357
19461 -17409 -42332 120859 24141 181026 -211330 -427811 -224003 -19915 -156279 -145957
19451 -145957 -322656 -75226 45249 -162824 -150884 -118773 -103885 -413186 -255246 -128781
19441 -128781 -295123 -117628 133712 -485129 68972 -140153 185800 -54508 -222317 -199231
19431 -199231 -41089 -423018 39760 -24940 30778 -144887 127578 -291123 152877 173995
19421 173995 41054 -61105 -372035 8562 248036 238553 -28274 -161899 -154492 25797 -505535
19409 188337 -44562 -98333 -193281 -242450 -36939 -17838 -245400 333683 -102225 -146505 -50118
19397 -211593 57252 -210265 -89103 -312051 176796 78658 -44667 -32700 149812 -6435 -19577
19386 -19577 -301015 157103 -77308 -173930 -233860 -68570 70943 58126 -18106 -243371 143055
19374 186724 -28116 -133565 -285324 40057 -291779 -164144 45880 -189570 200514 -185199
19363 -156223 52900 -354521 -207019 23809 -72876 -50519 44728 -238163 -120884 48354 -233105
19351 37449 -65215 151817 -51067 111775 127189 -34525 165133 126234 -79915 -64131 -26586
19339 -208146 91692 -300038 -5014 -27385 -218815 27335 -337422 75812 -341295 136258 -14445
19327 -89333 -128777 241656 -242038 178992 -212328 -10438 230611 -99233 207241 -164689
19316 -111872 -151262 -61156 -152157 67189 -120591 -242587 97967 124841 -173602 487142 -198864
19304 -100080 -64230 29851 -74777 19365 -151713 -306562 -75048 270971 66405 -137026 -98229
19293 -98229 7367 51248 110278 -87006 -140361 -87020 -195863 93823 140392 -214353 218713
19281 3856 -211996 13551 -142066 -83677 -246151 -84191 -2496 -156221 -149461 -356149 301360
19269 289624 -135125 -148224 -231198 -338111 -258605 -178182 57878 72608 -212617 250300 -179778
19257 -133974 76636 3019 -181613 228159 -274362 -186123 220072 -124543 118472 120754 -120787
19245 -207954 -187244 -435095 46497 172135 3771 -150882 -101470 129889 -457273 199164
19234 -172735 24969 -75403 106457 -3216 172502 -146306 147371 -35059 63848 -113702 118299
19222 -6069 -160087 14477 -46740 105492 -74354 30155 -200942 139033 -154256 64748 -221414
19210 -234889 -60247 -303057 217604 -89387 17654 -180058 -182571 117747 -223339 -181186 -115732
19199 -115732 -122548 -75551 -39665 -110554 -52455 -10612 -48722 252078 177344 115070 -280499
19187 10257 59683 -139433 236499 240157 -346844 -154229 50776 -265986 -196445 -159695 -118291
19176 -118291 -45476 -75522 -82725 -13213 23593 14643 -87263 -138324 73671 284547 -181201
19164 146791 366816 -27657 -107714 338841 -151188 117847 163244 -256240 -388285 -137336
19153 -235980 88399 -111891 284773 -365254 -203977 -89043 10207 223059 199767 -190692
19142 -302803 -138033 581 -100376 -129666 -44376 -370103 -96325 -7642 39945 395703 -18772
19130 -115759 -159273 -322776 -244057 341958 26366 171459 426226 21559 -174416 -118540
19120 -118540 27759 -116223 175452 -259634 -346922 -140764 -28524 242100 -124711 33254
19109 -26897 -194949 310330 -176543 -232507 1084 23895 -161784 237866 251573 -26173 -26627
19098 -26627 -81745 -140391 34946 -117578 -138351 -61815 -160422 -215063 -146997 62063 15020
19086 -144879 -336711 -207244 -249294 -40029 112016 26805 -288712 52956 -381195 211345
19075 189893 205471 -46157 -148019 -132261 -333500 -175590 137217 -315972 64428 -190932
19064 -403627 97719 -165237 45016 -206445 -265425 39192 -318842 -88636 -38534 -293487 146375
19052 202225 -86094 182386 -251086 -334552 -146869 -9727 584 -265045 362115 115597 -47771
19040 23435 202355 80948 26919 -52063 -169897 -2638 54146 -183005 -189192 -427463 144107
19028 7959 219673 113181 18824 81910 -163713 144935 76904 205459 -90612 -34520 275741
19016 -304035 43854 -354810 -62333 9638 -66778 17544 -32364 164137 -138849 -207477 -82913
19004 -171723 165741 96384 -59320 129002 94925 149306 -115040 -126646 139061 -312851
18993 215963 -72914 21771 -168631 -271906 218750 -6750 -82115 86402 -16735 206050 -323845
18981 -276363 -11922 -350174 99532 -161212 307798 -232378 186238 -221487 -119169 -144808
18971 -144808 52156 -136246 224787 -132167 91353 -44218 -34656 217607 141992 -177727 -662143
18960 -662143 -135842 357455 142197 -156248 -41647 -145313 -96805 99276 -166093 -154558
18950 -154558 -150607 -2362 253763 -60777 -113882 -299271 209630 -131183 -102480 51227 -174807
18938 -340903 -159570 -277316 -194414 66923 -295479 35888 161336 163853 -208092 352861
18927 -55421 -81555 -134404 -81058 -361199 -306292 -49613 -49277 -74333 154382 -27317 288942
18915 294736 -170948 227034 -166426 -87530 -248162 95690 -139238 -10651 -42879 1053 -49642
18903 -224128 -50784 -109590 -97422 -85928 -94423 -305612 58806 -135922 -51843 243090 347831
18892 347831 -204633 6898 -77039 -46535 40695 -14259 250403 -60033 -102627 101489 -119088
18880 26608 -236036 -159821 161297 -290470 -156971 -178630 -54296 -233735 307244 -46575
18869 109933 -73567 253614 -9732 -75257 196831 69263 -55880 40410 -132343 -115602 -124612
18858 -124612 -190183 156122 -281927 78256 -235294 138532 -83559 -32594 452714 -302222
18847 -194900 288351 81952 -249399 161326 101437 386094 202139 -61026 -181387 -289544
18837 -289544 -103109 79471 -202506 -228336 -61218 -148354 -185439 -404736 100367 185313 -80356
18825 -254738 60109 -162264 -102767 -84601 211776 117890 -106843 125350 275476 -166257
18814 79616 -114487 172415 207548 -109940 -16268 166200 -97261 297073 -24937 -101888 -23762
18802 -202480 -118883 149581 29295 -248245 -174927 -34237 194759 17473 -114495 -141189 2780
18790 214682 64584 -95080 -93209 182774 20412 -118330 79727 4549 166473 -49752 -190945
18779 -190945 -331991 58764 -92615 -209994 -122846 115334 -322792 48171 -2885 129700 63554
18767 -304666 199128 -26708 -15440 -305350 -31995 -229738 23148 -254009 -79602 16030 -8342
18755 4703 -139403 -175829 121583 -112547 241561 -12163 222438 -82810 -182357 -157121 -180726
18744 -180726 -1367 6341 -403912 100697 -112215 -272820 -23526 130889 133554 -213153 142813
18732 -91386 -94778 78602 -164188 -79723 -190071 224771 -164293 313598 65443 -113841 -103322
18721 -103322 -209168 11661 -201542 21471 -51154 24641 -157634 -253514 -242728 38639 -37555
18709 176138 78486 -154843 -119924 99854 84223 -287129 -19460 -465840 -88624 263779 -154620
18697 -74281 52623 -45153 -48456 150074 -17644 249813 -125161 -185795 139304 156469 -174674
18685 214033 -67634 -241242 -49439 -126425 -322618 -264673 -564784 -258284 938 208221 70525
18673 -90369 -209749 47700 -17831 -17187 30443 -94103 -9372 24514 63932 -168183 193050 467555
18661 467555 -305059 -84157 23601 21927 92366 406333 71312 -120547 -60468 -242688 -66202
18649 -74245 -110510 -79978 83001 -195456 -226009 -115863 211701 -55229 -132548 -87097 -240559
18638 -240559 -131040 78560 15560 23394 -93795 4958 -290283 281017 127759 110194 -46118
18626 -34225 15293 -156213 -24776 62466 -52313 90034 -156189 133645 -142371 71006 215098
18615 215098 228113 289521 49694 -89734 -2446 142520 -117485 -43489 -95986 -395706 77654
18603 -237045 -58964 -102854 -149699 -47951 106650 25578 -22800 -31624 49942 -115923 129167
18591 -144024 227409 -56192 -210157 -19323 271028 -241711 -103259 -46805 -71839 -163720
18581 -163720 16886 12461 136273 121624 70515 -200971 -185443 -47180 -386939 -393170 -79405
18569 -365671 -662334 -245616 -139518 -276018 184996 -291593 -355859 -477948 68565 -162787
18558 -47120 -71307 -95538 -243269 -168465 -217252 314759 -170453 -79197 269492 108881 -255099
18546 284370 -184941 99224 -5505 339599 -162259 -183396 -104181 -253663 -73189 -146648 -142889
18535 -142889 64281 87633 -166930 -147386 -70401 -69141 -121985 164999 -137759 -55486 203492
18523 -176606 9803 349898 272679 -248203 -144765 -39093 -134417 311644 -73417 106404 -117799
18511 194308 -177804 -175780 -234464 3632 253254 -274212 -161583 -29045 -205104 -2674 119843
18499 -118334 359393 -75467 -244935 -134537 -265977 -29092 7279 1724 165866 -21018 166897
18487 -87710 -75257 176537 -85909 -32492 48519 -74801 -317592 -1140 343039 78784 258305
18476 258305 -430222 -98905 -235925 -259114 153274 -107982 25068 48616 -203567 31883
18465 -15020 -178115 -119452 178298 -140349 187028 237268 -248113 134503 -357874 -365092
18455 -365092 -445656 59874 -198872 -53223 76765 -51732 67626 45008 -89512 -52407 -121931
18444 -121931 48959 71556 -68321 -162320 -205216 52094 121806 -206487 -136854 86743 -172049
18432 99388 342514 13660 95932 -88280 -52036 -70150 -480673 -5196 16961 -84957 -84595 -69016
18420 -69016 93944 281467 514914 -21180 -300455 -109872 317303 -11875 383420 160005
18409 300832 -253209 257186 365225 -121309 187372 -488621 71850 -40735 -112863 382679
18398 289687 -138575 -182259 191136 12940 -32759 85727 -129520 -16383 -180109 -121558 -181268
18387 -181268 -57572 -257512 -23855 -5713 -99791 -136185 -143144 -240072 230104 -29923 106017
18375 55652 -334725 -28174 163213 -45892 -89493 148287 -1344 -25078 -54416 377702 75899
18363 -155640 -118563 -82015 -88575 -24415 -138111 130866 46668 -5175 25504 100181 -240500
18351 -323970 229225 37620 -119602 -320783 -512397 117414 170489 295705 70738 -189058
18340 183631 -77432 -414404 -7349 -175060 34951 -1003 -47598 -161586 48778 25484 -134005
18328 -27426 -27795 242328 102796 339630 -201550 -91763 73780 17786 281637 -95883 -230415
18317 -230415 63678 -127783 -34675 -177141 -190201 -2746 151538 -155979 -116685 122958 -36376
18305 111885 125089 66333 -354673 66008 -100396 -74227 -208887 -332626 -96789 503554
18294 -161710 -128163 -495363 257999 489993 -152309 -16336 -384550 173126 217247 299607
18284 299607 -95019 -455014 3878 -232735 60304 -116893 108525 107408 51180 147511 -200912
18272 -291872 293935 60808 -232937 55993 210034 41541 65377 57379 -32458 -116928 75664
18260 327308 -75815 71320 57993 256773 -17526 -99549 -43643 28135 54049 -158242 -109948
18249 -109948 -82745 24587 -382615 -47639 83213 -129069 -280152 -449664 -13144 115777
18238 69917 100216 27188 -150530 -154619 46565 -288286 -259983 33688 246021 -464348 -3745
18226 -136015 -105894 33985 185835 -152137 140382 131246 -3714 -132159 -109381 111207 -146894
18214 225461 -157098 67272 -188272 -35344 -247481 -227032 -66993 -240954 204757 370350
18204 370350 -87881 -98346 -131398 -178664 22667 104138 -59558 2376 182333 268052 85115
18192 -64535 156204 155810 -11870 116505 245794 37741 -134338 -205443 -102232 21416 189647
18181 189647 -441348 62697 -116715 28218 -141681 -320064 -294041 -146740 -93642 -347199
18171 -347199 -110097 -267402 205658 265854 14617 128324 51148 -149386 -380031 291442
18160 84440 116055 169389 191390 -133151 -22730 49949 -155900 -39786 81811 163480 -282303
18148 -119861 -12574 -65199 -41091 1166 -462153 -394225 -382639 -55549 -16527 52336 -35872
18136 -18905 120619 168453 135597 10957 -176245 -235554 21812 55317 -110164 54069 -120179
18124 183248 -377884 79627 -189026 -277179 67449 565277 396295 -19133 160330 -211763
18113 -291590 -7014 -22997 -236891 -7739 149534 -231239 -67149 61713 98597 24152 -51397
18101 122103 159219 154795 110196 -26373 163345 60082 18812 -234482 -288190 -183401 -25991
18089 141599 -474084 -120772 -161581 -189687 99738 -230224 -122435 150076 249676 -295202
18078 109598 -21537 136247 -340629 197826 -67928 196782 -67896 112781 44995 -92262
18067 -479 -11401 229844 175926 133264 82062 -212187 -121556 126805 -1601 25972 19214 -46111
18054 190456 -147918 73954 74545 -98839 -215635 -78449 -149526 71400 113193 162559 193925
18043 193925 -45379 144378 46049 -34401 -276966 -55428 193693 -82300 -122816 -132497 -90349
18032 -90349 17519 -190057 -4021 -14951 255193 -79828 -112126 -6347 -95739 133582 103531
18021 103531 37651 810 -436191 -225607 27545 96816 -26497 166146 -35404 -3657 -3445 -70412
18009 -70412 -115212 30845 297263 46472 -285760 202496 166063 -148122 -178078 17432 224300
17998 224300 -239993 236834 84634 -18649 -175293 -117430 -31444 -141300 119597 -37202
17987 292228 321457 -171715 -39044 178857 65199 28914 -50045 -208241 -197576 -108585 14278
17975 -194370 -221473 -126627 258783 -129526 -24898 361829 -340873 183311 -168234 78731
17964 213532 -1211 -53960 -111230 11976 65972 242418 -77102 194553 -202193 189133 -251617
17952 113508 -87111 59807 -149202 190037 -326066 -856 194326 -286981 132443 20007 178045
17941 178045 357120 119007 -71184 185759 -154669 81136 -90647 28415 58399 105867 100426
17930 100426 41057 76458 29215 87602 161092 73892 273248 383241 -84253 66340 175374
17919 175374 5754 73790 208399 26497 46923 -8614 -155008 290636 -121738 344743 33336
17907 218598 -160634 -270684 -34628 34402 -57280 20511 -270696 -83401 148976 154551 -171271
17895 235403 -132876 -169582 -65644 272172 312268 -297296 411068 -161749 27563 119229
17885 119229 102759 9867 -28740 138296 272310 -22532 -55117 57622 59047 222003 104944
17873 125084 -354573 23335 49408 -294782 -400314 31700 287470 -152018 258653 -134261
17862 -5561 -6833 4588 -120296 -81069 -236139 47517 234998 -263442 -249937 92421 144711
17851 144711 451103 535581 -413900 -217760 -238726 175845 -218138 -261035 -246131 168560
17840 18913 -103108 63550 -51884 108024 -101148 159596 -107535 -112444 -121499 -153475 188748
17828 115328 236310 -22399 -12335 -210620 238673 -6985 91327 30776 -215195 44587 163700
17817 163700 -216509 -31890 209028 18599 6956 -162915 -198323 -183388 321665 -74038 -143691
17806 -143691 78208 -211134 107383 95863 182042 75995 -62695 -186293 -63633 -21169 107240
17794 532 23396 299747 70494 -149402 141871 -112601 169703 -343037 -17694 355015 269126
17783 269126 13684 -125548 159226 -157212 -175969 92926 203204 -204721 168848 -49422
17772 -1760 -107887 -15778 -229881 118367 -110690 192670 11546 -1080 -305656 121920 -132973
17760 -40466 95694 -49731 140780 -247195 184165 -271054 68944 -10271 136005 4502 79356
17749 79356 -108068 133753 -254847 139074 78537 -234704 161978 57957 -140959 -114630
17739 -114630 -292724 205758 -42370 72240 -75561 -97149 171012 58305 120452 -235129 -39752
17727 114836 -3646 22442 350336 -9050 159358 -366530 155785 203876 -35699 88382 -35220
17715 111907 -258983 -101236 -26799 346228 -172437 -101052 -46566 111017 -114923 -122820
17705 -122820 -132112 -111456 177869 53320 119900 92250 441675 49619 91345 -95950 -344081
17694 -344081 161955 347661 246101 91065 125887 -302613 -319480 -232841 72498 -19604 110552
17682 2316 310065 44653 191266 58740 -30894 -14662 204703 -127118 157636 -128574 -147550
17671 -147550 279989 -86271 129866 135486 -145929 128622 182871 -235681 44178 320456
17661 320456 -45204 72249 -118355 16500 -125878 61056 530254 108970 418949 2743 235135
17650 235135 87372 -129424 -313867 -100492 23454 405850 347527 153832 -205544 -52300
17639 30619 133865 -57639 -1865 11384 239759 209658 24582 -101641 -71830 16907 134418
17628 134418 -268419 -48453 292686 7812 190347 93053 -110665 -182963 234742 -229706
17617 156169 -80819 121883 -33753 60063 -155914 -113991 20588 42747 110913 -278059 -126229
17605 209860 192436 50234 144725 286657 165577 -168334 266438 -38258 138716 -112475
17594 228102 20331 32753 54006 -82552 -37142 163284 41098 -35537 66041 199131 -61822
17582 315573 26367 142101 208653 -130366 102984 -198413 -35104 -11177 86884 517739
17572 517739 52251 80062 18571 245849 -291042 30744 372376 22044 325182 266098 482489
17561 482489 -186615 99742 -67451 -23852 111681 -64184 132492 152091 134522 38420 111182
17550 111182 37513 -185470 323156 285759 82030 -46446 -70330 196960 -183663 418834
17539 152887 183029 -62678 162351 138369 -124415 108112 130275 134872 84716 -12825 240154
17527 27095 -103550 112787 37551 362368 200876 153528 64536 115999 165830 134328 -19746
17515 352148 40572 149743 132842 164125 326908 63887 -261455 41026 132268 356454 -91643
17503 -228584 -106076 146473 -151625 63323 -189887 9136 92606 -31388 -259593 293218
17492 24451 -115666 183790 29843 -17375 66373 124087 -66583 174333 282675 -75881 267357
17480 117603 -258366 284545 194023 -145630 137679 161729 188706 303343 -229078 105240
17469 30829 44649 221824 151114 -160436 149134 -141419 19918 -263569 551969 266269
17458 -221791 160421 -133609 323752 -171957 140378 -3191 168646 458589 280571 295821
17448 295821 -150109 179080 278599 124738 251870 184356 583795 457289 16725 52327
17438 52327 238054 209299 317742 145190 338976 297248 320870 167668 184196 311195
17428 311195 314667 277503 340458 31071 427550 76230 246187 124667 384701 402062 350094
17417 350094 205552 69193 300478 364745 236426 521302 291613 44182 81602 171163
17407 171163 55083 143366 -47607 106172 -9829 354448 -94040 207814 320367 -81403 176686
17395 438167 142018 272385 62861 280875 567003 332622 202424 35593 -91443 78397
17384 44923 196575 164292 -150982 294374 88080 -133767 -170059 354836 197386 8047 151423
17373 151423 -25115 645547 273504 149963 -270104 39038 216834 -21725 144731 48913
17362 11440 204384 296672 112503 373897 20468 207790 294396 -232321 7077 14945 84144
17351 84144 207074 162907 10254 451539 -52108 180438 -7169 243428 178754 217372 66157
17339 220668 140226 232092 266516 5050 10679 400761 187377 7826 312912 157968 -43557
17327 231063 70766 57061 131409 22954 183593 110981 136291 382494 764 294773 180374
17316 180374 140403 276768 350408 129896 201153 227473 -249673 106335 293961 201855
17306 201855 220900 224263 723623 -48766 433992 69658 -3907 169137 216077 66150 263678
17295 263678 452323 233632 145621 354780 227118 94309 72539 145446 218932 211525 259741
17284 259741 215795 319156 91175 319892 15079 181059 775236 142219 197968 42897
17273 144269 364684 -63285 32477 449730 255110 96507 466388 258360 259765 28435 85014
17262 85014 208085 82462 76610 48643 257727 -16171 336344 373816 61839 139988 560350
17251 560350 -9482 155680 496920 444190 208770 35885 -9219 308748 207516 236277 97277
17239 191092 180853 -71332 372866 90221 238615 312103 23019 135638 255156 57254 -30407
17227 184583 445891 139182 64520 188418 64426 49551 152699 155674 387623 671477
17217 671477 240022 241402 374177 176661 289397 330019 335696 271105 459584 -102728 120774
17205 271909 162456 335353 309205 207521 127620 361034 129127 40326 163234 588545
17195 588545 321715 283749 509268 331182 215936 591035 253655 204173 435334 -146243
17184 -10692 486300 40327 135805 339901 450982 257758 142676 281063 285971 618132
17174 618132 206043 -254761 59494 143960 456408 572457 462283 172925 176805 111910
17164 111910 65895 283832 276373 327558 226259 202918 158447 254195 308230 548143 336569
17153 336569 274163 427698 219418 154722 214445 435936 321668 299811 291335 344391 557472
17142 557472 565441 568581 370384 185861 307105 304068 485672 -72263 268164 191005 215585
17131 215585 158846 429196 370759 507181 225856 380397 268543 319584 428963 204872
17120 122562 624840 333053 390475 451660 253092 589282 437593 737182 422193 484876
17110 484876 408870 595285 222921 321876 687916 271277 539213 640856 312978 367960
17100 367960 554002 253678 494290 693045 381239 233197 393801 368130 415567 383850
17090 383850 584982 579967 350773 426719 652816 597963 178525 312988 741534 474679
17080 474679 720784 471016 672419 423976 541418 461499 522548 700341 540718 441435
17070 441435 762126 292833 607173 443432 600491 727049 516698 640761 530658 739816
17060 739816 580840 435018 547634 405754 174185 768041 201269 671732 504926 563963
17050 563963 627170 512544 331362 390081 699484 182697 440302 497903 695414 772457
17040 772457 716962 599584 811339 832797 257350 772769 496429 503453 690843 532263
17030 532263 607844 826495 697995 698986 797035 409879 652236 609476 534815 779222 760477
17019 760477 769396 703041 502194 1062207 697673 742578 474189 693558 886290 513551
17009 513551 639172 685864 607977 751799 658708 706992 717793 867471 963716 693807 800521
16998 800521 561380 865858 827284 1015739 1101313 790066 712629 691865 782240 739533 794850
16987 794850 700276 897898 670974 1196237 1039225 915794 926257 1002939 841385 1091173
16977 1091173 1166479 933585 740641 1129582 1268127 640653 1035876 926818 1351887 883543
16967 883543 1060609 693076 839504 871191 1114662 915231 874275 1143697 936379 1034685
16957 1034685 1385570 1031276 1200836 1057241 1326387 1001225 1435866 1072533 1051626 1224489
16947 1224489 1235816 1144947 1004981 1397839 1071667 1569084 1244511 1252252 1193809 1382441
16937 1382441 1074016 1407043 1595720 1301598 1742873 1225882 1701619 1247699 1548586
16928 1548586 1410605 1457439 1520722 1362082 1494168 1396438 1670822 1503542 1629197 1623880
16918 1623880 1483206 1702424 1814605 1769171 1601834 1875406 1811396 1734329 1998694 1401314
16908 1401314 2004450 1698900 1956229 1289395 1787273 1879215 1762695 1914489 1997462 2023910
16898 2023910 1913825 1838149 1466963 1714992 2127131 1800805 1895748 1834746 2285171 2198526
16888 2198526 2296885 1974541 2407208 2157392 2380971 2284462 2250860 2002121 2263331 2435982
16878 2435982 2418546 2598150 2487233 2654693 2429428 2607436 2586072 2597858 2496838 2930407
16868 2930407 2460134 2742494 2905089 2769229 3096029 3095478 3126848 2942020 3003657 2999692 3204580
16857 3204580 2931238 2934828 3074783 3192106 3607677 3363696 3554196 3683506 3591727 3520964
16847 3520964 3586824 3633599 3963894 3653376 3911485 4407675 3839380 3900722 4285947 4552709
16837 4552709 4154432 4223278 4351069 4616529 4663632 4526930 4858656 4821634 5077139 5198804
16827 5198804 4989879 5199390 5094829 5144727 5577283 5555007 5966478 5870512 5896382 6073196
16817 6073196 6168708 6041780 6313575 6624776 6547627 7085069 7248765 7240463 7387411 7112685
16807 7112685 7272666 7625053 7886688 8316952 8380996 8541147 8366574 8547630 8967852 9093824
16797 9093824 9628871 9694278 9870472 9975096 10258636 10837427 10735549 10819885 11681951 11849949
16787 11849949 12384088 12697784 12700789 13222711 13602767 13763816 14221917 14918814 14919009 15597403
16777 15597403 16214236 16548491 16887958 17299276 18269126 18770188 19430215 19909440 20694004
16768 20694004 21667611 22253268 23056495 23804581 24558084 25345900 26843506 27604287 28782212
16759 28782212 30251183 31080562 32553482 33908097 35325356 37097452 38618023 40029897
16751 40029897 42102667 44320530 46361053 48438060 50660674 53759995 56277360 59424220
16743 59424220 62436570 65947480 69361660 72983181 76967394 81277560 86097881 91063608
16735 91063608 95968573 101547350 107438456 113503495 120017617 126249286 133423814 140511972
16727 140511972 147099695 154542844 161000173 167924421 173978547 179790942 184608871 188377481
16719 188377481 191699538 193616103 194355680 194106274 192676430 190011108 186453221 181920117
16711 181920117 176830134 170576945 163908111 157463844 150266268 143264942 136238298 129184727
16703 129184727 122617339 115524622 109299060 103370237 97493617 92329301 87286350 82181870
16695 82181870 78238198 73250807 69675200 65666817 62454580 59531296 56203023 53105188
16687 53105188 50417333 48080291 45737968 43706843 41609503 39987801 38028541 36310176
16679 36310176 34322540 33356079 31627667 30481287 29030791 28129234 26668862 25848355
16671 25848355 24693965 23812043 23110815 21860824 21249339 20305243 19293651 19211199 18304989
16662 18304989 17932496 17152765 16687735 16083279 15558027 14957643 14710787 13926008 13846079
16653 13846079 13480349 12768743 12439064 11863295 11724421 11316609 11046664 10713684 10668610
16644 10668610 10273546 10182757 9915112 9674897 9421557 8985549 9118067 8366081 8426042 8267463
16634 8267463 7970384 7944266 8072294 7412236 7244573 6870604 7111156 7114657 6479408 6526801
16624 6526801 6383948 6168441 6347671 6094453 5610224 6076052 5671781 5414292 5444969 5374123
16614 5374123 5254321 4907765 4837675 5067101 4702844 4827933 4746960 4713731 4685143 4177628
16604 4177628 4267692 4224640 4239002 4067698 3897938 4305733 4062143 3913053 3770543 3619548
16594 3619548 3804879 3832375 3679439 3351142 3247902 3484415 3073760 3009455 3074699 3249206
16584 3249206 3309098 3198317 2909361 2677120 3150028 2878069 3170062 2884181 2774452 2879160
16574 2879160 2549089 2732720 2570652 2662607 2112003 2439808 2394897 2246033 2560443 2163349
16564 2163349 2443179 2091836 2069278 2256431 2062471 2437797 2101329 1883748 2255084 1994237
16554 1994237 1960623 2112629 2190440 1819328 1834374 1976270 1965367 1682406 1558741 1646458
16544 1646458 1483604 1637578 1922554 1538667 1588176 1357514 1403110 1526720 1297834 1624075
16534 1624075 1690436 1381971 1689781 1485913 1306386 1275753 1368624 1275464 1469918 1274644
16524 1274644 1246637 1236950 1636622 1175570 1229431 1430999 1229469 1356937 984773 1207034
16514 1207034 1330625 1235425 1341216 1305919 1202767 1169551 1028165 895572 933916 894677
16504 894677 1371746 1192043 1194768 896679 1218808 1038302 783075 1062095 1091258 837896
16494 837896 1227616 979398 1145276 865813 1035968 763743 1020694 768977 619549 1128740
16484 1128740 1099107 800034 917644 907627 1152505 864410 960313 582522 683902 974819
16474 974819 406059 846177 718020 775428 881237 655502 685679 881619 850533 844194
16464 844194 644809 931134 670121 895266 569011 823792 974193 1095193 678709 823224
16454 823224 755839 508344 596094 548983 777485 648651 515261 680073 614024 355412
16444 355412 428739 508841 778804 897206 464259 647544 917029 852094 386083 240100
16434 240100 706342 744078 545143 668726 275377 371735 312412 439018 367090 753541
16424 753541 377038 668826 445161 307349 517668 599615 662145 337595 443871 720568
16414 720568 532365 375334 525062 324759 306538 338539 398206 376602 540486 570428
16404 570428 830241 475436 427196 325777 325811 684450 713762 613651 462085 312161 403325
16393 403325 942195 509152 472329 349860 140912 361663 603348 445541 169558 71401
16382 337336 416304 550140 334583 375028 68106 132254 457050 238037 194524 838961
16372 838961 287850 434857 539479 459178 271224 173597 367406 344272 174430 463639
16362 463639 557665 303666 588693 185160 241548 199616 97250 502254 332537 789513
16352 789513 467060 799357 329485 248243 159643 197354 380677 236130 184969 305533
16342 305533 189991 311518 156264 438987 514175 459187 596358 97553 439348 216829
16331 159660 75914 395076 454591 391137 302991 265154 236670 277522 163360 230275 286090
16320 286090 266151 203630 533945 97773 402106 399912 292432 375789 152249 19258 340746
16309 340746 220634 169080 286147 369246 45879 442628 337817 103660 203632 120155
16299 120155 380865 -22692 -210490 223925 -32436 433017 220484 -39839 -155148 81047
16288 -136316 4718 365780 46310 21847 195659 172029 542369 300152 325555 232090 -114904
16276 -128022 -290980 -60081 60496 466240 137374 337067 345519 465146 16845 -263484
16265 120623 107436 134212 277768 162124 447632 164603 50747 176993 294900 342651
16255 342651 -235058 169891 166990 -119496 -23107 337579 398334 -31286 287080 -80420 217277
16243 181950 197616 239364 192254 403749 348905 49610 146607 -177155 490459 266119 387454
16232 387454 132555 406298 515920 21277 17040 -26237 202996 -102882 -257696 92557
16221 -123965 319393 -240918 89289 139705 13517 -299202 -162635 -171702 197846 -121565
16210 376298 102791 22307 161670 -222943 -98243 174339 -48055 -42365 -20513 102007 164822
16199 164822 83165 236449 -83525 -12134 200811 -278010 30242 -9152 204543 144031 -122374
16187 104717 -68473 93047 88947 40776 -88510 -120066 45660 -137804 141747 -61515 235658
16175 339846 372939 -296725 28635 376043 -84932 -239027 105923 147667 204281 -114680
16164 -213589 43479 356463 94912 184983 197945 155659 365749 -223083 -70438 -65650 -5634
16152 166383 58724 115753 221621 -197506 110431 -73572 30516 -84195 170193 65192 -182571
16140 208411 181173 -193024 147688 60334 83817 -231590 81859 -15268 -3779 -175015 -295699
16129 -295699 69857 238323 -66874 99773 -74590 -21238 105331 400232 -38543 8790 72091
16118 72091 202913 243058 228181 356805 62643 162865 299080 302019 -136879 36733 34542
16107 34542 -91601 -363434 -75120 92202 12663 87881 -173656 244368 65481 190189 24200
16095 -176514 203306 -295690 172318 -37124 217204 -108679 -11545 -544034 112274 227661
16085 227661 157117 83623 -186685 -65594 -144615 99974 150385 -51932 42283 -197908 49665
16073 134893 258437 -27047 331929 36288 -442421 -206531 252573 -272337 47499 18096
16062 -2698 -56909 93733 128918 104478 64565 -88132 191852 152119 238993 151750 144148 20832
16049 121505 103402 -35419 -42272 -326404 31636 -36730 -3163 -54136 -197199 -126195 -114501
16038 -114501 -11065 -129238 35201 -34942 -401 208643 165645 76242 25716 -66829 264620
16026 86490 -53852 24613 128814 138595 84355 -227842 -112766 32158 -26578 -139399 -191064
16015 -191064 17517 -261883 -237513 -128360 54654 -65058 -158525 -140607 79853 -50924 -211085
16004 -211085 63408 24182 67164 -35214 35617 130648 -178589 -5066 480900 2183 -252711
15992 -298350 118176 197617 222911 51444 455836 100756 61932 4354 276734 155941 168126
15981 168126 218099 -15695 273456 -38710 172994 -101325 -158143 272316 -242093 47016
15970 -4018 32084 219417 -90966 172648 280900 100427 -16936 134718 184466 -15773 -59854
15959 -59854 169703 405609 22034 -262890 154076 -290036 -116131 -352638 -1980 -209990
15949 -209990 55278 13917 -115908 -502041 33934 -317019 152275 -313426 -144705 -4000
15938 -203373 -208126 58713 -151859 295927 -54570 111286 274647 -261690 66136 113413 78738
15927 78738 -227032 -44432 117136 -71048 -101056 -246711 -200773 240348 19564 -216104 -232787
15916 -232787 -121932 -175266 -190668 -147384 -143004 -138530 19218 -147338 152110 -272650 -156521
15905 -156521 173601 -25169 56099 82501 -120714 -266964 -55387 244767 -120985 -36091
15894 -96856 101028 -7392 87157 89457 -250481 -48988 197766 9330 -174875 123548 -252352
15882 -27979 60438 -274788 -179221 -242028 48140 -38910 -262523 -131725 -512926 90254 56835
15871 56835 25287 -179116 -493071 79602 -270695 45511 -258891 -58929 104125 81042 -55023
15859 -223246 -83502 91571 -260830 78760 -142359 49085 96296 -154297 -184274 22168 32664
15848 32664 -203582 -77472 -45917 96443 -214040 -4857 -283640 -5926 -42540 -343698 35966
15836 -10280 43417 -159154 243848 -136503 -210102 -101746 -72238 12283 -201018 10391 -199372
15824 290686 107014 14461 -41151 427484 -6048 270905 18685 -159045 43482 241757 -150676
15812 -33409 -216828 -465244 121434 166941 208335 -167897 -300850 40371 -298299 -239808
15802 -239808 39955 10420 -528173 166291 -342185 -3662 117673 329341 125994 -285166
15791 -294241 170693 72708 -297059 -134083 -331865 -165548 78933 -22559 -32316 77342 -117086
15779 -117910 -203658 -291358 33519 -24573 -136870 49811 -49350 -37559 -29633 176114 217191
15768 217191 324994 -43926 7845 160536 64558 55965 122982 496363 -84171 180510 219814
15757 219814 -106049 -144385 -71482 62562 275841 119009 5582 176293 27766 447650 77751
15745 -78904 264635 -241301 -63668 358 49535 302084 -137463 -24643 -329703 -25800 -133041
15734 -133041 -130369 -299154 -116560 -5945 -151833 -291798 115625 2278 34391 44584 100057
15723 100057 8564 -133949 -283030 -115459 -325348 -224775 -205141 138750 -92925 -169829
15713 -169829 -90539 -72693 -4646 -95977 -325929 -246320 -366864 -21425 -170775 -13214 -48620
15702 -48620 86304 89954 -30365 -45202 -136026 22784 127019 -202672 251980 273172 3903
15690 75341 185714 34926 -50892 324817 63842 -4646 -89944 -304351 -54684 -87343 -397848
15679 -397848 -330815 -211793 -69739 307208 -61491 230677 146013 -81580 221943 174085 -93436
15667 114552 -70135 111874 -10244 -123723 89808 -243556 -99608 -30017 -45593 -93133 56800
15655 -26413 287628 69353 40571 -126808 -143570 82313 -40076 -241493 222206 -87196 -39107
15643 -35962 98944 4809 -246857 -58541 -27130 244073 427187 -86997 120896 367132 82565
15631 -12541 67464 264101 164223 421459 213818 -126203 -470605 -135914 -175701 59568
15620 -123278 -280905 -243859 52521 -85454 -29485 -229715 -10284 17239 -41192 -236876 -332297
15609 -332297 -167547 57281 26943 -279853 3454 504369 -594283 23104 95093 -93049 110333
15597 87096 -238856 -90802 100305 -50197 -151595 118529 90606 90016 -146029 38360 -181847
15585 -169911 -57376 -169006 -158350 80739 -14499 270589 329295 -50023 51242 -77290 -215460
15574 -215460 -58265 17105 -219898 -62419 -31093 -320692 -416270 204214 32449 147990 107402
15563 107402 346889 25762 41170 587287 -53247 155075 -34652 -80281 -72491 85696 139046
15552 139046 -102143 -39999 -442678 -1196 86301 -309602 -54074 212675 224466 429043 -212486
15540 -31738 -129219 -143021 38434 114695 252364 -258732 -287608 -158426 -171020 31973 -171941
15528 -9513 -59491 232237 85602 13704 123516 112714 -74963 80009 146925 -120503 75061
15516 157875 -100077 911 -185200 78962 90014 63804 -40019 30427 12366 109008 149184
15505 149184 199068 -88705 -125372 -204771 223622 107426 -2737 44036 183406 87294 271795
15494 271795 381324 -83135 -12106 -79824 61591 53462 10125 -212997 120142 -301383 -3368
15482 129157 24437 276703 143480 25940 34916 -257021 168310 120146 -55082 -218229 -108036
15470 -164689 156133 110604 58637 -112789 96448 -236521 35690 -82461 77507 -121704 92332
15458 258919 -123852 -325422 -22056 -110436 -324181 250321 153689 -97446 15845 6511 182315
15447 182315 252130 213846 6618 -451124 -132595 333759 216922 181242 -116339 -374380
15437 -374380 143777 -306045 136640 410415 -79651 -26151 163470 -120584 11230 -53350
15426 139308 -113789 190829 -41967 9383 -243706 23680 46673 204305 -72007 298412 -178567
15414 -10298 -152113 -7338 197894 -89908 -165435 -88402 16964 512336 -11744 -14204 -63321
15403 -63321 -11740 -95185 -86950 -229513 145857 195412 -164351 22370 -116687 -101755 -339337
15392 -339337 244525 127218 354742 -202350 320911 -98494 81632 -48816 322943 38864
15381 94940 -13130 -4922 109588 163786 -64905 153359 122441 95246 365765 -178619 -28476
15369 117742 32897 -357650 61131 -122340 222046 470244 112656 -397034 -127511 139164
15358 146129 -316049 89385 51694 -68078 -240259 -47627 50807 -79754 -11129 90123 190305
15347 190305 91474 -74036 164987 -260183 -120083 4855 -200739 -286507 479195 -180067
15336 -61710 -111183 -428847 32955 -76599 -159156 145225 -121926 -1635 170030 30461 -169418
15324 239439 -372371 -107658 50592 27141 196532 -195940 426922 237775 -92211 83026
15313 -98197 62018 -216059 -70366 67619 -2274 53135 -55915 506829 95541 -12948 -99412
15302 -99412 -1329 153178 216133 261479 382097 -37578 19751 -461156 205080 157802 237127
15291 237127 216835 -80377 -188702 -132291 196351 -210556 -72145 -8265 84222 49060 -186469
15279 30844 25685 139768 26574 248935 422422 68273 -19916 25383 124680 -103099 -288237
15268 -288237 271677 85139 -63990 204576 -108389 86660 235252 -182870 10712 181786
15258 181786 11805 17571 -160140 181900 25998 190213 -120035 417139 147490 1089973
15248 1089973 1341495 1249200 1373756 1545220 387145 553204 307132 -110307 94114 157744
15238 157744 -209402 -69967 -69007 -100652 96640 81887 -67342 274131 7033 -137977 -149184
15227 -149184 413455 188666 121835 125106 -463872 -11331 102378 -25950 115432 -213705
15216 122105 292912 -78102 282924 284125 -252849 113039 7901 -78383 294860 35679 300783
15205 300783 293356 -24394 -12047 111556 101199 44954 44074 106772 -70565 367933 182809
15193 75313 -48562 3917 204125 -159065 235108 67145 128494 86611 324456 198380 224402
15182 224402 34513 -23020 328840 -101899 111256 -223792 -69298 241430 442088 -322845
15171 -129124 -26025 -120034 311256 -233535 195704 76328 -113652 200060 325600 84833
15160 197315 42211 311939 206240 119683 149677 227568 29945 130756 165237 6805 263411
15149 263411 -58596 -28227 149482 101994 -281050 206147 -27696 33335 314577 149459
15138 441621 -304360 218376 141735 125621 124759 259083 420885 -79628 160463 110081 292385
15127 292385 154946 4912 680762 418843 14148 475368 182648 195447 44217 158625
15117 158625 -19024 261854 -52180 107022 153478 254969 203206 104201 310540 60518 157144
15106 157144 366469 161140 237348 378954 -34121 127276 358891 89328 227207 210597
15096 210597 420563 41765 -11808 198626 102790 195089 148049 184136 -216625 306633 93690
15084 198699 120588 161946 189962 194321 22496 273482 59540 117081 238719 279774 255713
15073 255713 210001 -210692 190075 15706 -120557 338412 195754 -156477 90485 138115
15063 138115 137398 351827 152229 396891 269364 117675 250759 -79699 364001 72000
15052 70337 289531 -29548 123667 301122 119024 78816 200870 278340 88748 24286 193796
15041 193796 197038 309377 399477 245368 165531 407690 194646 265294 -45104 641712 413019
15030 413019 274433 249507 -61453 145745 82839 316722 48727 22347 -175244 -61509 278752
15018 -20654 -58015 279838 152050 407089 352820 400051 174772 381735 355216 -70513 41677
15006 237070 122282 -26331 574630 116191 -18055 66550 450157 267691 236072 434357
14996 434357 308878 38020 177924 210843 219090 586129 -44892 183118 513728 114749
14985 405157 -52252 345463 284204 321044 272672 469359 201130 180980 354940 485153
14975 485153 241649 305502 384746 594982 288444 358821 120194 386503 415620 367978
14965 367978 294037 39699 15979 308865 85731 166285 523442 142753 363105 419419 284803
14954 284803 135362 220204 103475 557868 403342 141339 308354 354952 21366 423688
14944 423688 91140 146489 447803 478740 347631 209385 466723 174796 519054 402427
14934 402427 119745 145590 247392 253738 402378 905169 576268 418198 85365 258045
14924 258045 322220 147033 250875 256338 149864 396537 -74777 439968 384346 284736 70292
14912 359183 446936 363016 490008 466917 352485 106085 731461 189638 555506 229690
14901 507312 641597 137662 514653 297361 577804 356527 459958 363157 323009 272312
14891 272312 253721 166170 639751 625633 496687 252505 642446 267170 797514 514056
14881 514056 519261 611441 321748 178105 189287 673747 347430 105975 194814 438312
14871 438312 733818 401162 312452 262923 751379 106804 427287 538296 438418 380576
14861 380576 107770 44483 383703 598876 570414 451236 412681 217952 445031 368671
14851 368671 610201 223509 184204 949518 604816 287429 341803 792529 433039 114159
14840 708801 660465 341869 146139 358736 503370 295056 593281 809046 485849 379946
14830 379946 298412 558708 534012 387993 534086 432610 393650 664708 810416 346926
14819 865803 360834 713706 185989 500504 502576 519429 445509 425931 347352 464514 367016
14808 367016 330090 379105 392559 87277 735395 482364 760787 575612 479092 406937 635881
14797 635881 475708 340922 653296 637115 742737 865138 542610 349674 148085 626605
14787 626605 613411 511326 315436 611393 741841 456494 685669 443722 603274 739603
14777 739603 667310 409293 775815 674873 756866 926601 638868 579559 684418 645476
14767 645476 598833 710181 794531 584489 749731 281707 908115 790406 485038 497290
14757 497290 782449 360073 563255 744720 418889 634661 694970 775981 351384 852044
14747 852044 842103 551525 754648 659921 594402 996168 491218 961294 345731 646059
14737 646059 688461 936455 642875 545918 737385 896212 904044 981752 908436 739954 1098780
14726 1098780 1268854 1049599 828472 883475 889548 866266 586659 898438 970169 1092483
14716 1092483 1267468 806902 866998 501229 1063287 878624 877467 756922 679505 701589
14706 701589 956138 776777 1110582 892233 967892 738939 1270444 911958 1181832 1117912
14696 1117912 784920 1214398 827246 1061787 1097482 1097392 726001 959605 947777 1009091 1136705
14685 1136705 857347 1058682 1040878 795792 1176096 1159159 600446 954237 1025050 963267
14675 963267 1018982 997288 1143934 1116473 891277 1135793 873194 1240235 1323605 857946
14665 857946 1421251 1081788 1338823 939019 1138879 1087431 970549 1348835 1228874 1172901
14655 1172901 1086852 1338400 966835 950927 1218798 1201747 1365608 1311927 1643091 1444168
14645 1444168 1667864 1123941 1446477 1449317 1474198 1418192 1463184 1345566 1306345 1423636
14635 1423636 1249691 1094601 1067249 1296299 1459322 1342760 1387035 1352163 1381980 1384832
14625 1384832 1529454 1736641 1307667 1843336 1542525 1550029 1369294 1451905 1545105 1486476
14615 1486476 1435272 1823949 1627427 1949971 1706987 1394320 1380218 1576166 1513495 1712417
14605 1712417 1493693 1794739 1613857 1824566 1595400 1681421 1770378 2154581 1707897 1867765
14595 1867765 2290025 1644846 2079248 1989448 1954712 1922558 2070271 1832392 1805603 1904665
14585 1904665 1898237 1759159 2228255 2148689 2210421 2265358 1947675 2099294 2174622 2033941
14575 2033941 2365067 2126997 2292056 2208277 2341893 2681547 2200607 2349334 2382812 2564411
14565 2564411 2410428 2619262 2759662 2861235 2304882 2479608 2912723 2975393 2749842 3637597
14555 3637597 3421639 3796336 4433446 4634292 5319106 6016518 7581941 11771073 21084876
14546 21084876 39969029 48826507 24145746 10643148 5749732 3934684 2840940 2697926
14538 2697926 2564870 1920737 2002592 2011754 2353917 2322407 2285391 2664697 2553390 2327882
14528 2327882 2137170 2211334 2414620 2566163 2662439 2788165 2652147 2948342 2481033 2905356
14518 2905356 2739580 2899466 3104992 2726784 3027959 2674151 3089383 2946847 3007888 3269654
14508 3269654 3002525 2843988 3147648 3337405 3509374 3034862 3433632 3401500 3471215 3358548
14498 3358548 3690401 3381622 3758205 3413328 3708532 3646562 4053560 3996689 3725839 4019207
14488 4019207 4027065 3746063 3739208 3830386 4126025 4303452 4285492 3850521 4285844 4311785 4147660
14477 4147660 4312411 4504381 4411325 4443664 4648382 4510766 4782907 4660626 4734482 5055753
14467 5055753 4550795 4702892 5359639 5042819 4929423 4868333 5432552 5127763 5036824 5074633
14457 5074633 5157393 5583051 5573316 5676225 5946930 5813629 5555442 5722355 6089339 5964941
14447 5964941 6193750 5867149 5764711 6309825 6224564 6234776 6425771 6363884 6479276 6789945
14437 6789945 6929233 6978759 7231930 6927111 7048554 7041716 7370219 7286226 7485586 7461604
14427 7461604 7473910 7621931 8142579 7736507 8061677 8310195 8528585 8385031 8383593 9019891
14417 9019891 9032908 9101468 9081089 9215209 9821062 9294886 9800731 9787031 9729593 10012236
14407 10012236 10242613 10480421 10304925 10215527 10739889 10801966 11131312 11171600 11482081 11750774
14397 11750774 11843908 12379539 12196793 12505882 12619671 12920271 13048077 13441199 13512959 13378536
14387 13378536 14290454 14086460 14363756 14688822 14900414 15155571 15244394 15612430 16209340
14378 16209340 16588347 16578390 17080802 17498473 17616173 17808362 18396266 18851960 18704548 19630307
14368 19630307 20054926 20247850 20533377 21256141 21511157 21930629 22478659 23267882 23507888
14359 23507888 23928983 24693301 25186598 25429138 26638364 26750216 27582418 28061981 28627499
14350 28627499 29729121 29854083 30867149 31820263 32767456 33376393 34185571 35508962 36355798
14341 36355798 36643396 38041761 39147829 40288346 41282514 42766567 43446301 45144981
14333 45144981 46821699 47711933 49546492 50512684 52297373 54072942 55827974 57686460
14325 57686460 59423270 61337168 63721632 65789562 67963444 70382085 73115401 75479268
14317 75479268 78534688 81087341 84466746 87594280 91042565 94646262 98603990 102904739
14309 102904739 106987069 111642145 116521096 121099534 126657717 132597915 138409648 144762844
14301 144762844 152117869 158943610 166579946 174431163 182977982 192586219 202068779 211851914
14293 211851914 222983344 233973169 246275867 258306520 271332715 285309825 299297376
14286 299297376 313949361 329142158 344612690 360379342 376028097 391508308 406940676
14279 406940676 421902766 435743508 448912276 460397775 470553084 478426129 483350218
14272 483350218 484991023 483596052 481315787 477927848 473213444 467935633 460030136 451301443
14264 451301443 440221883 428042042 414334390 399114000 384023862 368413362 352304393
14257 352304393 335957783 320542461 305815071 291188295 276659844 263330247 250324996
14250 250324996 238049452 226392324 215100940 204610294 194609345 185564921 176755979
14243 176755979 168613954 160797510 153544338 146267955 139641072 133985123 128270672 122590147
14235 122590147 117065189 112387195 107670625 103455369 99793070 95714515 91915109 88248727
14227 88248727 84754064 81430059 78633543 75634609 72972182 70755259 67902833 66104143
14219 66104143 63861135 61477322 59311554 57512044 55593158 54294864 52990866 51290657
14211 51290657 49337970 47620402 46492001 45302233 44266341 43301202 41989911 40634344
14203 40634344 39406314 38420880 37470076 36845158 35702321 34563401 33773790 32938286 31958266
14194 31958266 30929133 30652839 29558107 29207633 28179710 27652039 27179250 26807254 25919879
14185 25919879 25082878 24617213 24085222 23421768 23269281 22741535 21997107 21473434 21555253
14176 21555253 20589937 20192399 19927270 19424895 19466360 18759818 18517958 18137896 17563601
14167 17563601 17608466 17439538 16958377 16695072 16037891 16191281 15450656 15008662 15009204 14805335
14157 14805335 14606009 14511230 14075929 13874002 13613002 13568822 13042461 12906007 12782166 12579286
14147 12579286 12546952 12189836 12024219 11600618 11303050 11263522 11715944 10990657 10802362 10915854
14137 10915854 10711056 10150768 10326914 10146577 9977003 9881246 9677045 9434198 9396517 9295663
14127 9295663 9089006 8774567 8927011 8695291 8709921 8718437 8017438 8077650 8071283 8334215
14117 8334215 7945815 7897604 7733894 7862710 7503437 7038069 6906868 7227690 7015417 6997866
14107 6997866 6757930 6495756 6562989 6746039 6442640 6520572 6371004 6001648 6522133 6214768
14097 6214768 6045052 5787300 6215113 6007294 5860334 5932789 5804856 5465439 5432087 5413951
14087 5413951 5338932 5456091 5273374 5163184 5379634 5177821 5086566 5030942 4963901 5039201
14077 5039201 4972147 4861427 4701192 5048740 4982409 4913109 4485276 4521478 4680326 4594398
14067 4594398 4380293 4537188 4242797 4296957 4067925 3802918 4402044 4287790 4219562 4079883
14057 4079883 4622222 4220470 4525439 4128794 4178047 3883194 3920176 3905886 3605586 3518386
14047 3518386 3860370 3759132 3772798 3503175 3293993 3511174 3214529 3770778 3482800 3332709
14037 3332709 3417157 2950466 2857043 2929763 3347152 3372690 2915692 3141728 3195792 3322952
14027 3322952 3361023 3079470 3176370 2727374 2671632 2589057 2680910 2263180 2619901 2670491
14017 2670491 2446502 2864606 2788424 2257577 2455735 2449647 3084691 2542668 2292298 2499066
14007 2499066 2439970 2287220 2370397 2797964 2336570 2638909 2225686 1966994 2353857 2006826
13997 2006826 2147636 2560741 2147954 2428178 2050530 2448300 2319209 2465780 3513664
13988 3513664 5983477 13701789 31986155 47341390 29310891 15618838 9733451 6651098
13980 6651098 5293514 4626869 3925476 3737069 3311324 3328526 3096848 2905326 2886084 2643169
13970 2643169 3160118 2541514 2447328 2387256 2553856 2250875 2644305 2092654 2542160 2156425
13960 2156425 1966786 2107139 2230851 2103986 2064768 2262356 2248762 2127104 1898503 2135143
13950 2135143 2124693 1692528 1975314 2089919 2107832 2215919 1969718 1849869 2156152 1904700
13940 1904700 1764205 2172309 1836492 1851826 1642904 1889267 1806840 2259661 2005904 1792153
13930 1792153 1900984 1576530 1527260 1518414 1588650 1683652 1697961 1578254 1601279 1646822 1452781
13919 1452781 1499366 1865931 1485045 1846742 1401664 1464181 1590749 1171503 1389223 1559729
13909 1559729 1524786 1420634 1488281 1534031 2005050 1640686 1739545 1230759 1434521 1708525
13899 1708525 1197796 1154955 1662254 1070476 1378392 1413067 1582288 1647229 1331298 1109895
13889 1109895 1119185 1455094 1497708 1257180 1348736 1300435 1730633 1299661 1349773 1569561
13879 1569561 1302510 1434579 1054098 1142243 1235843 1198330 769785 1249381 1081746 1171782
13869 1171782 1280432 1240749 1095929 899033 1198447 1370956 1205015 1183678 1194464 1103288
13859 1103288 1001251 1331105 1269149 1194501 673428 1227597 1235366 1250239 1188593 949021
13849 949021 1082693 983141 1004593 1351673 717363 1394752 798638 1099458 1248923 1076011
13839 1076011 706489 1144613 1186710 932501 885915 987560 997680 803965 1121411 1012378
13829 1012378 858461 1190763 907016 952964 757187 567689 786003 592759 883676 1014337
13819 1014337 751062 727214 1166078 860680 899399 670855 728174 1144263 884479 849274
13809 849274 873343 960993 903476 888122 840330 1015223 664879 859824 801587 503875 647177
13798 647177 654690 983000 723148 787472 731601 401231 697468 712600 637647 474923 613008
13787 613008 558471 584468 620750 829853 951364 650276 633610 876163 548999 1148790
13777 1148790 809119 785214 928449 776030 625323 831806 779805 517006 529619 735672
13767 735672 217362 608356 787660 691028 593423 800078 668251 877820 325787 492678
13757 492678 522085 707886 879954 885005 762809 770038 646771 849377 637623 697954 513188
13746 513188 826201 659259 931535 903295 1055713 321881 573291 757701 463257 820027
13736 820027 661151 665770 647939 410363 392530 631096 704583 697579 600865 786355 610767
13725 610767 921522 420210 877614 696534 498168 801748 825911 410591 530471 669417
13715 669417 494006 650467 357243 475523 588448 903298 300040 590193 486432 543321
13705 543321 684520 500390 835814 398444 699043 635000 570552 661478 499383 787535
13695 787535 787101 649863 629114 500379 543236 779054 682663 521512 298419 599823 756306
13684 756306 582585 460463 537208 891039 766447 518728 376076 509878 678903 749497
13674 749497 400604 598707 644971 404342 259360 777619 471618 527647 617041 589669
13664 589669 139494 237899 359047 517678 508709 410992 381631 516425 439088 533305 452902
13653 452902 598500 466509 478407 526765 566673 117848 331942 196748 604593 562678
13643 562678 509101 319274 358922 120486 368764 384133 402811 246466 385615 386103 517110
13632 517110 473453 481977 322513 475778 454632 350958 222934 492317 507801 335419
13622 335419 298514 258512 351289 169564 606136 566414 421514 63464 462868 397951 475928
13611 475928 595160 469214 183786 482971 287762 430038 233371 92366 440600 609058
13601 609058 455250 621086 305761 794161 180205 305291 413297 532041 503119 100263
13590 643874 457352 290103 497238 387002 498364 114602 56919 418184 385544 343896
13580 343896 494527 486438 270338 397214 546986 230011 151225 221416 459453 278814
13570 278814 294756 418718 -96814 435430 228659 271107 352591 60597 346332 421230 30197
13558 461758 310983 47330 -109403 327739 105775 465670 350038 249856 736190 654492
13548 654492 450701 541912 115066 550083 225135 167921 181518 427350 647161 148523
13537 100688 315369 83520 -39064 412099 285206 615282 305662 197701 388722 -21243
13526 525556 288650 -53248 173164 353524 247062 475733 -243303 411310 242200 330700
13516 330700 448204 283598 269420 150699 274322 299048 257729 63984 302507 625898
13506 625898 760865 553711 414804 114450 413821 368665 364143 449784 193040 244418
13496 244418 269924 501684 251965 46219 556013 15102 -31500 83185 265746 4059 -99724
13484 552765 200606 178775 115677 211905 102011 49759 285659 -231481 195627 231214
13474 231214 -86787 254414 368746 466976 -12060 77709 210746 365025 17874 241948
13464 241948 273249 464697 19592 165390 486082 -139847 361553 249614 139618 259562
13454 259562 90289 119935 293445 472025 261641 163313 147317 286181 255118 147654
13444 147654 167658 341920 376797 357673 125180 323041 146516 26897 347403 101729
13433 136192 305423 235179 88717 196225 577856 26502 219063 67203 204040 -196959
13422 369013 317357 213754 437430 266363 18208 259535 396283 73825 157509 448851
13412 448851 22929 245595 60401 277896 150257 50298 256956 321423 -114287 245629
13401 89672 226933 242346 13471 407315 246223 331555 66585 71474 257096 274053 -193424
13389 181843 550597 392968 16595 638089 -6083 162225 192670 -53166 -45372 419941 259518
13378 259518 412966 44080 187802 -1026 135123 -47351 197738 -146677 226360 520570
13368 520570 186641 176607 68799 240103 351721 135934 359966 56151 636285 314374
13357 159750 188650 225915 321985 416914 274057 172658 161840 43241 189393 68123 215834
13346 215834 79012 382326 318168 445484 442465 444635 446653 142486 235006 408218 288809
13335 288809 284216 459095 272355 -223965 168897 39064 63823 25493 157475 210870 250657
13324 250657 181829 270671 58710 294403 113164 145670 58147 251501 285438 298737 394903
13313 394903 183794 268653 88242 188167 304441 393034 59051 242707 527207 -6801 479392
13301 222606 444049 244851 196632 -246699 237960 226446 44782 557398 -10432 120500
13290 -37483 183607 319958 330183 255266 -17941 -55187 174494 -12001 187037 -228248 -161358
13279 -161358 45304 -74976 199528 428571 381219 86046 -25519 127706 -198881 219511
13268 109790 513260 13877 134488 -58440 245367 203286 312785 -41745 157705 -124855
13257 354350 36528 211909 216723 238343 162341 38092 209353 341444 -75805 346225 262303
13246 262303 -55024 406082 -184831 36704 355329 324416 34608 267866 82586 269515
13236 269515 65170 -65726 545229 -128761 325864 -39009 19478 213857 -4439 -132645 183221
13224 -251404 -108149 -141462 97150 -134870 77275 20145 334065 529897 68926 167201 244132
13213 244132 147875 95182 18283 -59495 144724 -60783 224428 -218167 106871 69674 -59786
13201 201285 -268274 246858 104983 66805 90884 36917 181013 131779 -36332 -136706
13191 -136706 -10438 247025 183755 202621 177531 228922 -70967 103390 -50328 -287732 183872
13179 173089 340546 244492 -6693 347756 104067 70623 122369 -205871 292077 -65677 20401
13167 -135786 87557 -215426 358636 -124200 200266 208747 253838 -67387 127954 108634 230820
13156 230820 -79799 227021 157698 175094 276853 29085 296835 52061 299528 75415 33526
13144 -9742 -434301 4303 111716 179875 220162 -76307 417123 151333 177188 -11549 66600
13132 -18830 -11596 -282987 249740 32275 -258032 154965 -19926 228368 193489 46415 235462
13121 235462 236410 251999 113318 59794 63836 53518 336954 191315 84873 26884 169434
13110 169434 208515 -46790 105396 61771 35095 -69609 418404 158893 -3518 -149262 158248
13098 -11250 479988 111241 43608 130327 192070 -116163 58509 102761 8236 -103004 82442
13086 84094 -235091 252202 61299 149650 38014 217321 -110936 137197 -37290 -130122 -13003
13074 -377961 205138 58717 23909 -116458 26023 206330 121177 310186 283512 -8496 60893
13062 -135209 293177 -5753 25279 -204336 47459 267775 500926 98197 -174040 257588
13051 154977 66454 41803 108474 -181946 170057 229929 265820 -382091 45510 491121 346319
13040 346319 -14116 -220027 -201812 -108000 185462 -127163 -43921 25505 111475 49056 -46694
13028 206379 389085 -52149 77596 50384 447366 -63865 -44589 20577 128961 321225 136371
13016 -13680 114711 74212 86602 -340599 -51249 424726 472531 364156 -110787 237059
13005 -96474 76661 -120078 155923 -46915 96917 498622 -183758 -166330 263496 183932 -47481
12993 60443 442277 287896 329887 -137985 150939 -30175 -4431 -30969 205718 184436 -129692
12981 297304 189713 335522 -104272 133900 -257135 58661 -62375 131714 -79241 311308
12970 22428 -16400 -109270 69354 137422 -96134 243810 4592 347959 25458 126745 10032
12958 -110718 -149980 47460 -133906 177656 208738 66925 -332222 156765 -59533 -153647 -73537
12946 -265060 6580 299785 1832 -45092 177662 -159414 -80733 480765 286815 454360 -117079
12934 5622 66694 50853 -74999 350190 228445 180488 198513 -95925 -39129 280604 -2223
12922 108521 -139609 -9213 -166586 31508 379883 -262809 -45426 119467 414509 129120
12911 4052 -291167 5358 -259360 -62939 -66380 109317 -149736 17674 -164332 -102046 361274
12899 -229328 288670 8641 130684 168632 -240407 104733 -466360 357952 57085 191222
12889 191222 -76183 74336 -230702 -69349 -268527 196050 176925 56123 197165 -12287 -87421
12878 -87421 52650 -40480 -58404 -84699 76803 9618 99789 -287831 292818 304369 93985
12866 -153825 137305 117498 298462 -138959 13026 -385224 103890 283019 102 -151107
12855 1799 179391 11783 -184277 53761 -265299 49801 -49289 231859 435578 -65121 120637
12843 27884 -51731 -86484 195691 -308180 50652 -73784 -253592 -193404 331516 139105 -287112
12831 231254 -72649 -94128 -107444 18741 -119812 248722 -86140 245906 574441 -253763
12820 -418174 -51908 -189255 112257 -95305 99734 123318 79772 -128084 -51715 7198 -44009
12808 270494 -195362 89860 129950 15394 129170 -37881 233179 -183100 89917 311781
12798 311781 -153085 -58646 313008 251227 -224169 73574 285469 111254 -9818 -59225 -108252
12787 -108252 -135320 -313 35238 -48707 4757 204786 35170 128944 276654 -151724 163031
12775 177393 -40606 -164624 -261780 -87021 56828 -55919 91201 -159364 93985 -40122 -36836
12764 -36836 -246927 233494 20443 236929 -107238 -294307 32537 105449 -10878 -245814
12754 -245814 51044 -143920 -146734 -453138 -136348 223542 -39205 -277551 -35981 -48155 97739
12742 213577 731 108770 167424 44027 -46547 114739 -5475 -139339 -86913 156982 271417
12731 271417 199322 234364 -184379 -400655 121268 181448 -141662 -36132 119575 -172222
12720 -216387 275004 -215690 -111096 119148 -65421 -56311 -38971 76742 -83865 232465 -168320
12708 85456 100270 533134 436330 165334 203574 196065 297562 -47299 29877 240050 68520
12696 120227 113738 20696 246854 183536 22008 232798 194977 242039 -154025 145213 329710
12685 329710 142295 -6251 -50133 15357 234947 69834 130369 464706 -273607 -55019 367691
12673 189069 94531 94883 -182012 -138401 25630 127236 -16366 16421 -105898 40372 80427
12662 80427 -182393 -183594 210626 310926 138954 -55769 1155 90088 8872 311189 292316
12651 292316 258066 117426 165611 -184828 372331 101734 -93598 -100299 146271 -149949
12640 -307127 -69073 20367 156510 -253250 100238 -129839 -44738 240277 135841 285298
12630 285298 365311 252651 112632 214537 190559 266599 316603 305735 93307 41107 200264
12619 200264 189448 93931 38123 141404 15846 -77805 -83862 300546 -109620 -97023 45717
12607 -38737 61428 -93374 200777 216600 375381 242305 70600 125252 249527 -53394 176169
12595 289118 185024 193505 7148 221421 45979 -89163 15180 56470 41897 176065 -24906
12583 120313 13949 -37475 -134937 -12908 -133150 259467 -144875 79874 199692 45742 -47371
12571 -185742 -131137 -33367 100423 140050 -289035 -254423 -61528 149710 16728 -62271 75349
12559 32245 1777 155296 107407 176652 181686 97947 104590 -68837 -214954 -15530 134518 -166132
12546 -225794 -190597 -103631 -219118 -213722 -34531 -84910 -25889 -269310 134281 -45386 141083
12534 304000 -31794 -29342 206846 152018 -90182 -352747 -87978 509499 -114072 28928 -46663
12522 8740 21699 -29760 71377 42459 109725 306885 168678 39441 -240474 -161606 85315
12510 97464 32942 124172 18108 -211269 125991 -116187 301520 -248939 353110 320236
12500 320236 174303 127180 94360 -10629 34477 32146 194747 -122395 403130 87094 -203056
12488 -386328 9127 82762 211819 397330 136122 195182 40975 3337 69223 -72095 48654
12476 42004 -4097 -180486 -340 -386225 -276432 222674 -86081 -190868 -108119 -63068 -163347
12465 -163347 -55903 171572 139661 -295478 -190162 -181827 -77558 373937 192911 114507 -152061
12453 -405297 -185710 -128887 31516 11994 -34334 119688 -159574 -250333 49180 196953 -31335
12441 137654 134244 32645 -116152 97213 285573 -44771 -127887 162424 109698 -649 85883
12429 229771 87044 62672 15993 166672 -130143 334389 -164108 84064 12846 -260135
12418 130390 2495 16411 -171762 -8555 99875 -55079 -147695 508548 -322292 -55199 45451
12406 118745 -10419 -114122 -28367 212829 69060 287112 28244 -71639 165191 -112495
12395 -74388 -128482 53620 49223 193137 -95005 103478 -57248 47644 302 3379 -216885 173382
12382 -111827 -148558 186614 -140899 -157472 393145 73235 -30708 124523 -178394 -5548 -86758
12371 -86758 81873 103853 -60140 -52710 180528 -120167 -32216 -164684 10158 72282 13934
12359 170720 -298900 99456 -41608 -202897 -61799 95865 37177 -252991 111721 -212519
12348 -6756 -85932 -165019 184788 -178181 176520 -3430 -96048 -369328 367215 -10450 -160001
12337 -160001 252080 242262 -108977 -36952 -197135 -45550 68234 -54937 324917 -59216 -137617
12326 -137617 -197314 -265368 -51894 -74023 -201388 -316289 59786 -355427 169848 -151174
12315 10928 -8433 154294 207096 -232910 -134010 340241 -72546 31454 99879 -122967 -57849
12303 -73479 -444588 241237 -292308 -58524 -50478 347431 284554 77661 -302901 123269 -116473
12291 -275341 320379 -428031 303010 -30543 -56784 231560 38687 -7394 -76711 -3540 17300
12279 63132 -16259 386606 -321108 307513 -57643 462999 489030 72688 10382 -252903 170323
12267 209332 -178272 231804 129757 -209757 -24239 213123 284981 186266 -265761 -76284
12256 -71725 355489 241531 6952 322607 14322 42106 7571 -29316 45528 115489 141586
12245 141586 52438 358113 -236776 -9324 -80904 -111202 436739 -22522 -45303 22676 305970
12234 305970 87925 190827 23693 298620 -28345 243213 459579 55778 231877 455413
12224 455413 447743 333882 537560 206267 -46052 127207 114061 51238 61134 199584 264431
12213 264431 -44441 420899 182649 152860 27363 -352424 -210159 50962 39962 -66508 -142175
12202 -142175 382913 237461 -65846 -3109 274274 495235 -214357 365624 134755 133864 133885
12191 133885 287554 264808 34258 31316 167974 -15498 -51199 78121 121627 168034 509994
12180 509994 -231780 144395 -76999 175539 309976 373927 65506 -55817 -323103 -254508
12170 -254508 467878 -70280 330825 -37785 -96188 220511 417551 -10729 126430 3947 304655
12159 304655 205455 159785 98793 115976 -412826 48200 79825 -195825 114796 185973 -294688
12147 -170897 -221923 34106 -77121 88927 126010 -41672 -63846 -357316 -79920 511265 73184
12135 411696 -177324 -258422 -87983 -151463 202212 -12732 282671 236389 -53382 -174779 67637
12123 -52302 -90690 -298288 -63996 107993 77488 -223385 65006 134276 86562 -78229 -217947
12112 -217947 -215043 -171224 86038 -79221 -63405 207542 -22186 -245349 -211706 143115 -32118
12100 -29825 117067 -7544 130831 79601 81433 142492 27779 -198375 192575 -166171 159042
12088 59744 -110284 -22072 6350 -224688 373735 -19859 -88512 -1421 -80295 172366 138067
12077 138067 102100 887634 1986927 1180743 124236 241997 412621 -205205 147833 42561
12066 -39985 -137046 -151974 52017 104346 -2861 -133399 434926 221675 280780 -150715 -70444
12054 -167108 57467 115615 200867 130932 29034 -94871 -355236 49921 -27012 -37247 -327508
12043 -327508 76368 -4424 24901 -78346 450488 -258889 -218671 39105 4706 -3069 -56985 -100079
12031 -100079 110347 205484 -64084 -204353 166113 -61232 -4848 -40831 152400 -93013 150426
12019 -206330 11178 -89936 -447702 210702 57111 416050 73381 -154012 -10901 -259588
12009 -259588 -156379 155234 -258762 411405 -45637 -60175 96835 316109 166032 167882
11999 167882 -117480 -123617 206527 289623 -16017 19888 -109000 -112067 204180 316657 274171
11988 274171 211068 -41250 -256999 208636 -285566 -99564 -63065 60426 76380 -269943 122942
11976 -168982 -101904 -293046 -476652 -99166 -236285 136269 56008 -290106 298987 96218
11965 -237696 132568 123597 -177237 -93524 -99844 -96585 4543 55602 -5467 -276535 -69229 -240115
11953 -240115 160668 -242659 -109525 137284 102011 166841 207194 106020 -157459 122755
11942 -174633 -103823 -352520 99456 -44799 -14739 -116140 -22464 -137032 501882 -338163
11931 87436 -185604 -201627 113150 99316 -3159 -231572 -330638 165473 31053 -48222 157823
11919 -2030 -258956 -116322 -41641 107796 117946 6327 1828 275619 157985 -99429 -7256
11907 -315817 291718 -70356 -165074 64146 140760 114299 325502 -29643 -3555 100194 -232070
11895 120384 -430723 -72226 112700 1723 158194 -227929 21492 -177644 -44360 210472
11884 -213163 -93479 785 -140685 48421 -86569 -404156 4110 394573 66936 -16611 -256123
11873 -256123 95 -144776 -213454 -267500 -32123 26011 343406 27253 -141810 88259 31127
11861 -89601 -16329 -131810 -325136 120044 -127377 -286833 54191 -228856 -293651 144539
11850 -110286 -69777 40675 -106046 83798 -64327 -209158 -320593 -135984 204422 -9893 -79812
11839 -79812 -121294 268705 -60338 -209123 -156459 -72141 85682 -90749 238091 -275792 9019
11827 92294 225891 -209568 25396 267703 -238631 -161126 35587 -154335 10905 -73027 5819
11815 -128461 129266 -83282 -191176 -120952 36604 -371803 185135 -153074 51955 -168731
11804 -442058 -148547 218091 -111487 304928 -45890 -45147 39453 -334331 -193620 14525 168469
11793 168469 -304 -110951 -10255 -118178 352803 -100680 -314291 -132835 -116150 81849 156271
11782 156271 -340516 -143677 -78959 -220090 9945 83270 -108938 34428 -140203 -92774 -129895
11771 -129895 136516 208852 211716 -121322 -207473 -227318 -29098 19080 160463 -75336 -181817
11760 -181817 41406 89126 32224 -24195 -441005 88353 -139066 12108 90170 215036 204866
11749 204866 -316698 18321 -156988 -117949 -6036 75139 32078 66319 -166688 72093 -37764
11737 -202195 21196 195315 -97898 127347 -182752 -17093 193158 45511 337470 33666
11726 -195646 -186049 -1963 -73270 76007 20199 -64303 296962 -173539 146775 195072 -200605
11714 164266 187840 134492 124453 252218 -46146 -61984 -49308 57405 -103922 152507 100716
11703 100716 -2544 -159609 341796 -38943 -93633 195111 -358426 -130731 145104 -66138
11692 434077 193113 225933 -36861 -95223 222122 151298 -10076 -132608 -198748 23175 -90309
11680 -102134 -231455 -192743 96724 37809 -131242 62156 75200 382105 64594 188948 359862
11669 359862 270990 -244486 192176 -230 -253 44244 99175 -395076 -14354 21590 -415035 163430
11656 107656 94672 137802 -96855 149160 48551 2107 206951 -375713 83209 201828 -336528
11644 91755 -78797 306679 90479 -199259 -123336 102295 112640 244109 178866 148619 -14353
11632 -17314 345265 255376 58901 91626 -64034 -276401 174438 -4368 268227 -54437 97859
11620 222410 -37793 -83785 211132 68085 -189053 -23494 135776 -250055 4428 -42234 -74089
11609 -74089 256273 -9393 -46303 63204 71913 166105 18821 163973 77860 -22531 136168
11597 62504 -58110 326258 142751 -205622 -70721 -54 136806 -17501 343846 218613 -239231
11585 166074 -40835 127612 -132010 -222592 -363547 -173068 -101232 6547 27542 -128466 27699
11573 74463 180972 53976 -28491 244656 161113 -186149 50383 228563 11501 -182141 -120094
11562 -120094 -160504 44620 291842 332326 -81514 20798 324070 -15922 186961 -206802 182080
11550 -11661 34673 12 135126 -85213 -191027 40028 205910 248414 407610 -28766 -86373
11539 -86373 179448 -2765 5781 37073 -14764 86661 7473 252762 -65916 90740 332632 -114498
11526 110422 -16169 -372188 -3925 601 -227708 226454 -203440 58252 -144333 -225919 203318
11514 218911 17777 62010 295337 28447 116227 386013 11055 418595 269173 234402 289607
11503 289607 203195 147785 -19147 547800 317068 225571 -46410 132694 105313 132263 319971
11492 319971 34611 375391 -92283 -303630 72971 1455 329262 501947 -16292 348200 167929
11480 93628 194606 265393 101046 326153 89803 101682 321925 523141 -136666 93358
11469 -32037 175837 19154 -609966 288340 139755 200987 113021 143839 342166 165481
11458 16560 83185 252229 248542 296933 451984 237128 215407 110357 35938 -215703 471160
11446 -215222 40702 451301 -59200 198586 254265 231934 37308 370114 -125511 -105854 252291
11434 -99151 -76461 280282 116002 -24935 210831 -20488 -220833 133714 110386 45219 -50928
11422 -82197 -100012 -117711 14463 167418 -24783 -53409 81845 30089 -53064 124030 73220
11411 73220 -49626 122560 -68972 127744 -197118 -31421 -119775 96687 -49532 194389 -96824
11399 -234338 -114450 486824 -75661 -33074 -63459 -109543 -47932 257621 79490 -63556 -260919
11388 -260919 -387607 75858 -219706 -378568 127833 -162102 192681 188367 144694 89717
11378 89717 -123730 192732 -133795 163329 -182764 454732 -134850 -264556 84052 22818
11367 -5353 12344 174264 90303 217659 187247 -43374 163370 104301 -66309 63149 210039
11356 210039 -203065 42642 -128918 -164806 -209784 113347 -21579 -155894 -396234 -45432
11345 -201771 125083 212840 59655 -250402 -135263 -205748 78824 -195732 232721 136892
11335 136892 -31278 46218 186389 83948 112828 -380715 132901 -91214 67107 184251 -144118
11323 -322530 -111306 -135712 -36439 80667 219915 18419 -119311 -282846 -50817 58833 223546
11312 223546 10106 55165 -56689 -129890 -189778 -194877 92759 -141299 175578 -113921 -237102
11301 -237102 -164841 352393 169309 54924 -48580 76731 283216 -60565 42282 134491 -129537
11289 -287403 92088 -133164 8542 -250939 -109235 133220 -79524 108545 -50524 -204960
11279 -204960 -225494 -101457 4977 -115349 -126695 171749 -499906 -101342 204152 217998
11269 217998 -242252 -47046 -109733 -20977 -30372 -40719 134705 -120024 -58258 -432250 71094
11257 86600 -6453 -450753 135431 135870 146364 -28340 -120429 -337909 -551470 -57036 -64581 -184464
11245 -184464 -66110 -46872 113491 -401430 -73709 114849 -363973 94444 385703 -202036
11234 -93783 6101 -353252 -234151 265563 -29962 -194686 -131005 -67815 148661 155472 142688
11223 142688 97519 120475 -113376 176195 -96845 27628 -341391 -229902 75800 -166193
11212 -148311 -97374 77905 104059 -3784 -251652 159112 206423 -169373 -96376 125729 309564
11201 309564 -263238 -245845 -161675 89903 -146067 127478 -44648 -76484 89237 -183291 -128119
11190 -128119 -15457 96815 -133718 73034 156375 79712 -60559 -121425 93664 -236342 -44857
11178 100798 -191047 -2237 -143291 -240438 -15573 -81194 24417 -233421 83680 -286403 65094
11166 -88420 28871 6039 256402 112514 54377 -135084 -53016 -113985 -192566 -51589 -186260
11155 -186260 180594 -145016 -290141 -33085 201393 246831 21477 148886 -34083 122125
11144 42518 -181076 156773 -10156 -45599 118419 209310 215553 190098 -24032 76104 209308
11133 209308 -52925 105689 50796 -138418 -38404 -134035 43848 -124736 442919 194961
11122 -60036 -92123 -31892 -15915 -186204 -14393 52379 -77094 -21335 -206285 -167935 390177
11110 -80698 195697 185398 214947 147029 -9033 291577 326970 -71451 -131191 216440 129200
11099 129200 55525 209366 107605 125275 90902 446049 295780 -44246 167958 912 198739
11088 198739 -5145 145902 287121 243641 70473 -151154 276475 495744 391692 -30468
11077 249543 87540 415911 297449 327987 246460 160745 395225 74307 307264 103528
11066 436146 461816 253764 -59772 573084 493241 293564 264462 528892 241492 705883
11056 705883 397866 844556 406692 728488 486887 951653 1037063 741581 835218 682471
11046 682471 847799 676260 794067 570760 773819 869858 825356 799734 571891 683007
11036 683007 795520 558444 537770 764754 454193 515402 521278 809116 581858 1015550
11026 1015550 804707 946430 545776 473012 690238 358912 625811 765590 722855 629298
11016 629298 575367 532430 327177 440078 866589 262227 755338 910733 525623 652477
11006 652477 531852 529085 306109 946080 636763 650048 1001363 584188 805143 603676
10996 603676 313792 804048 582549 478080 602355 925960 668884 541823 848714 857501
10986 857501 800116 1297851 953544 1015529 1007403 892706 1188605 1345486 1657963 1492922
10976 1492922 1521499 2122271 2279005 2488926 2511197 2733177 2677569 2402335 2248789 2034297
10966 2034297 1980205 2050542 1974670 1950419 1711872 1593473 1699654 1514878 1867452 1732182
10956 1732182 1519810 1646368 1453653 1157232 1027339 792016 668885 624031 714418 431610
10946 431610 294244 449339 290291 455954 406005 538389 452972 273573 208966 -26487
10935 173598 291015 214185 -59080 -49987 527219 -92847 154989 -18678 63163 34674 160065
10924 160065 66102 255239 -10025 -87971 -71889 -27883 -40805 328193 28607 205429 -8076
10912 26133 -3809 -18056 47097 -182184 258498 519584 -63956 32492 114809 -196148 109403
10900 52387 -48331 178574 -36792 -62129 -40931 -72995 -15844 16101 -302047 -580451 210878
10888 1516 169446 437740 -148557 155988 -303743 -100507 -307383 209751 -10675 178720
10877 -233003 10543 -92632 -21843 -46834 276250 146036 -13476 -175540 -63691 422408 -161907
10865 121455 -208586 36002 226559 -345998 -328912 44713 -543559 -62596 -50392 161863
10854 77669 -26665 99699 82754 -39478 230582 -131982 -6686 17322 42746 107989 -137577
10842 125501 -263827 -175236 -300388 130716 10575 -93065 165719 124394 219821 7407 19597
10831 19597 -156602 -189679 137640 -52371 160101 69462 189968 -197155 -167914 -132960 283047
10819 93607 -448109 -263639 120292 227264 164005 -143662 -123746 -188018 127939 430168
10809 430168 -39314 -195877 -197061 -142101 -97009 91678 248781 -208652 -380 -146870 112650
10797 -303687 -242160 145387 241553 -262886 -28893 -97433 -240694 -38041 250883 -19966 32617
10785 -165732 -91556 -122746 -120143 350347 -39874 -17914 5505 -182275 -253645 169068 -257766
10773 108342 -460972 37858 -129836 -90993 324671 -141385 -52836 -40466 -125061 -125905 -272587
10762 -272587 37972 -22307 -422716 -174022 -25801 294193 69724 116673 20487 -308268 57870
10750 -179086 227733 49778 -62491 -68273 172381 -128587 175735 98341 -115161 133723
10739 -3464 -50602 -229120 -13497 411351 -276517 -446665 -28418 -251901 299014 -296614
10728 -362549 -214321 -194108 -87035 84159 -294556 -391631 -304753 230110 77061 -93792 -64965
10717 -64965 120772 -6879 128313 114993 70781 -166180 -173061 -62776 -142111 -120186 23242
10705 -327182 68030 -261048 -74179 33101 1846 -243371 -104628 -174628 -174187 203391 -243836
10693 322708 -131502 -6487 -37382 -51924 10264 109897 -132959 -241582 -140909 -300204 45731
10681 -268406 -145048 -103207 -114796 375252 64289 -106694 -177562 -267391 -364050 -96170 174790
10669 -109257 251957 30583 264523 -244134 185674 -259829 -5625 69324 241153 93915
10658 -63804 -665976 237566 104932 -96313 -74919 -215670 -211883 -196666 -266837 -973 -302347
10647 -302347 -78710 192109 93246 -90550 -68983 19297 -12084 -235701 -49100 -52984 -256554
10636 -256554 51375 -467546 131361 100023 -29511 -167403 61615 256410 -8517 91162 -111172
10624 -219136 -15802 -266086 -268616 356938 -323727 -22182 -66978 233482 -253255 44777 -194434
10612 199070 -220759 276729 37279 91701 -67534 -293585 47230 -3417 81556 75309 108027
10601 108027 42265 245981 263331 -116669 -178543 -148219 36000 33142 26533 -57990 -265022
10590 -265022 -179582 61072 -124643 -63639 -44910 94338 150970 -17103 -166748 18336 -391259
10578 45354 -304047 -39362 -246962 82259 -3856 -283918 -146331 9373 191998 -233372 -294622
10567 -294622 -51865 -161370 -298815 12630 -131311 335083 -6409 -93498 -109094 -8055 154113
10555 44031 73788 213209 -341275 -321715 144679 106204 243569 -60340 -357445 -280985 47770
10543 -186912 -71424 -238197 -143051 -217785 -22170 -134475 -98645 -10491 -249186 -30290 -106490
10532 -106490 -62155 308396 302783 -481255 -55508 -215372 -84905 234743 -8359 -342676 199434
10520 210209 226719 -387460 -100624 -254011 61496 -126861 -229533 -373073 -147018 87592
10509 -86341 173373 56050 -24404 -105463 -93835 -117957 -283406 -100321 -82489 -157274 189074
10497 56718 166197 273781 140725 -30880 -44876 -146908 220456 50437 -92532 132909
10486 -83365 -260110 -173012 289739 384811 404768 371446 654309 400492 457358 272513 148351
10475 148351 310324 -147551 -333906 -8206 72106 -243435 104761 -92642 -47984 -210710
10465 -210710 81376 -121658 -124243 -357428 63289 160877 -158970 160355 290548 -87700 120280
10453 -50319 -59387 18378 14392 -84086 132961 -121215 115213 34709 -73083 -11168 -205897
10442 -205897 -35785 92038 83083 -22189 -39881 27403 -93070 -297374 -284773 -64312 -32519
10431 -32519 -525943 -253982 -111004 -70962 91428 -105053 -92106 143159 -68865 212041
10420 -62284 -153394 -160406 144135 31153 -143055 -119472 61635 -22567 -369845 232102 -217820
10408 -232914 -397870 195341 415784 257587 47356 -133342 -184613 -214485 1035 320473
10398 320473 34898 -22862 -254907 -292824 5233 353323 79702 -253280 406681 8569 125903
10387 125903 40790 -16401 -2550 95205 -34594 122145 195370 6561 438536 649758 441637
10376 441637 460753 404406 105097 257414 434196 228028 67021 229057 608120 364012
10366 364012 132471 251318 342858 638808 202238 93504 194392 380301 373646 315814
10356 315814 194245 304320 26967 375106 79796 563005 510096 515872 257160 -225872
10345 242645 370447 218725 438537 390597 -135576 215310 211866 165845 159545 30681 35324
10334 35324 119276 184157 32003 30349 1129 256269 251577 -388309 -22600 -59925 291424 -5877
10321 230536 -90593 -75953 187930 277139 6154 91926 90339 177688 173455 -111401 63972 57386
10309 57386 -93193 -465642 -159128 -105850 3227 -2687 57824 187424 233923 126130 97577
10298 97577 -45475 -188587 -25829 -176229 -262026 277879 -7348 -312699 -99422 -52439 -338722
10287 -338722 155291 111445 245135 11696 -37096 -126523 -226020 -233551 -16704 -188305 -20132
10275 46935 -242300 -227618 45274 -57412 58290 -6116 5713 90230 69743 -5042 -60063 125157
10262 117703 502860 483834 113473 228081 296439 449672 160084 -144328 374560 183990
10251 -50485 92343 -37217 -113992 -243184 116362 -136848 106483 -31334 137016 166242 30881
10239 -184699 -267190 -98322 22244 55498 -236859 6204 207043 -157006 96463 -220496 -11245
10227 -45256 -83742 153901 -81114 -140286 -273709 -54986 -156145 68922 181305 -4540 43909
10215 -363306 104058 69198 386531 -225688 286038 -139306 -184872 -215642 99609 276672
10205 276672 -123443 -198069 46746 -84564 -291348 -455320 -240282 -319059 -20789 -213560
10195 -213560 28831 -230444 31206 -110395 187460 107120 -284046 -38934 -180795 37981
10184 -56786 -226401 -94737 -65810 117220 -326744 60969 -58291 -57027 255598 35384 -45271
10172 -49702 -322458 -26669 79619 127109 70686 -306429 -247447 -27292 -188772 9499 -95585
10160 145782 268283 -225128 148156 177389 -191927 149907 -241494 -13361 -12641 43234 -150696
10148 -85619 -78643 -360453 204748 -129325 -234166 15173 -64013 -319540 -430721 99800 -294435
10136 44970 -78001 -217058 -81519 -55396 -16697 -337980 268186 -233760 -188024 210217 47850
10124 241145 -30337 -244580 -20628 -20304 154784 178677 53654 -129276 156232 199618 -252057
10112 -291471 57325 -85657 96374 -272168 110446 415586 -24405 -109742 -78 19884 202273
10101 202273 -144704 -7496 -188469 -181196 -114540 78739 -50985 -192415 11328 -241023 3739
10089 193792 -31087 -4498 -135150 -312133 -165164 -151545 256494 -212732 -173709 -184169 -150952
10078 -150952 96520 -71085 -154959 -96462 -230768 -329733 25650 76657 -23286 698 117960
10067 117960 21461 58100 16340 -288949 -204663 -40253 -245769 -12735 280317 -308395 -132640
10055 82525 -14982 153903 -15042 4600 18599 -166932 293189 260688 146513 -38970 -192885
10044 -192885 -196353 85891 -9985 -115547 -225148 -86294 -114972 -313278 -791 11336 46067 -25873
10031 -319390 -114151 -174294 -274232 -99328 -249006 -386479 -91638 121283 210217 -91231 258084
10019 -165217 307636 97670 -191677 82019 -118744 -20768 -49027 -70612 250626 -185726
10008 -154054 27275 -17267 -69926 -186969 -152854 210577 -42910 232196 -242294 219188
9997 -237770 73069 -250173 47860 -92982 52305 -226560 -167162 -30922 83545 244978 -244232
9985 -169031 -91305 469548 -290065 229985 -131944 -442187 57285 57169 -204889 -151731 -259015
9974 -259015 -258865 298554 -169534 -32747 -143702 -429527 -95451 -77331 -162433 -395737 -309619
9963 -309619 -155090 77237 91219 -204336 181581 182741 155968 25875 -18878 54621 -156273
9951 -184585 124294 -85244 -207666 -193337 103756 -259004 40565 -147460 -137734 -19082 -36427
9940 -36427 -488361 261889 -120746 -109320 -91728 -76749 -134303 -200127 359328 -936 254540
9928 -165025 -40327 317810 -104541 46918 153165 -146 -224354 -213708 29385 -277639 43024
9916 -106913 73901 -213020 -449491 -206525 -168961 35688 33797 -110593 79600 -271696 174076
9904 -316838 178992 -27642 320831 111727 88298 -138515 -125221 139643 68839 -35389 -141150
9893 -141150 70720 -7551 -99584 62166 -296978 -59795 -119247 98415 -130684 -155621 143983
9881 -341894 -81453 166967 -41399 -23427 -165108 -243508 -192299 83807 -275848 -395081 28879
9869 156578 83824 -294862 278301 -199706 -474969 115172 134805 -48805 208851 -60473
9858 -52917 -530301 9958 -87398 -173253 -2762 10834 114265 98024 -11788 -268773 -292967 -34463
9845 -15403 -115513 -77008 -146548 -77321 -84795 72698 -511208 -129384 -262347 -151943 -26249
9833 123809 -217389 117408 48951 -134076 327982 -181453 -513153 -188988 183505 -172517
9822 -105316 -127979 -265574 -55154 8240 -109165 157764 -280936 -193937 -199168 29869 36692
9811 36692 -19151 -52380 19287 -138929 -61387 6833 -52509 -152607 -120240 -15399 16571 -48773
9798 190443 72604 -316970 363476 141688 -169859 -162284 78374 -209030 -374100 -180703
9787 213346 142264 -21190 -357224 -280299 -160254 143 -50181 -215614 30351 -636255 -318382
9776 -318382 -125480 22305 16121 -158442 -84820 -11324 113937 -151404 -10949 51917 50707
9765 50707 -162400 -194892 -32946 -241330 -237473 -166933 339695 127523 -263959 -266022 31639
9753 -392086 137531 -254072 64569 -327910 84568 -113732 -147699 -54890 199166 204974 -131384
9741 -107289 -46182 -151192 -44393 79635 337607 -271253 -15368 -294945 18478 65146 -301712
9729 -140630 -122963 -135359 12804 -77521 50813 -94233 -317094 -115586 -260907 -156459 -35036
9717 12684 259842 59833 391581 151220 -43093 -178119 -106864 150888 -81305 167342 -90057
9705 -48066 168133 73083 -509032 -111721 -141625 297493 -201072 158651 -52190 -71039 -25108
9693 8400 81501 -57685 243795 -83479 13334 -56546 -486908 -144985 -46861 -376453 519435
9681 165569 -148309 -49577 -144327 204079 196752 112200 -86430 -116589 -338949 -100523 -117090
9670 -117090 169782 -293481 139749 22636 -37883 -170190 -28137 -209983 -229846 26613 156309
9659 156309 33269 -474412 6679 -202648 -25344 -118338 275462 -564846 95035 -116423 -235773
9648 -235773 -150395 117859 -143023 -154834 -6210 -40619 -135378 -239671 150637 -173241 299347
9636 -307508 -106113 -274337 22904 -84261 -32753 -95932 21780 -12351 -77308 157545 -226265
9624 -181095 -117199 -160216 232078 -115300 187344 -236425 -241734 -292853 -40922 -25740 28040
9612 -372814 46248 128553 199427 126005 -168699 -190474 -61055 -236793 -27443 91393 -90912
9600 -105868 -398785 -87311 53719 65879 300882 155878 -32565 184100 -262330 52227 -27953
9588 -127736 -300696 230949 207292 -361548 -27829 -90228 -112473 -151990 -265712 373504 -273662
9576 -118309 -61958 238938 184332 -48647 -141778 -332495 -67198 -64916 45870 -14599 -280725
9565 -280725 -174585 -274541 114110 -204729 66456 -345678 -186711 -207043 -444939 -235903
9555 -235903 50229 93470 -345949 -117912 -317436 -229464 -107971 -107763 127569 -12059 245152
9543 121125 -333340 -104281 -103167 24726 -280552 55754 -3285 236471 147729 -122622 -279910
9532 -279910 -216949 273281 -122837 -166792 214597 -154616 23525 -101233 -5367 137001 -26438
9520 -3020 255490 9763 26838 -176534 -234302 -272379 -69172 142530 -134056 97567 35782
9508 -210031 -276567 -36800 -32386 -80881 -12595 116891 -142643 -119858 -58422 85131 84987 -12010
9495 -131676 -59440 36727 -148312 -152258 32344 -82146 -77959 -211341 -57689 11463 57849 -62114
9482 -71321 106648 -9062 534 29284 -155322 -254124 -186607 -76562 37972 -145346 148700 126832
9470 126832 62344 122666 -142976 -3112 -39695 343099 -47925 114735 -265870 4256 -203644
9458 -35138 -135299 -327003 -142166 100170 121040 188141 -109840 23330 19223 -215398 -150035
9447 -150035 -97015 -176570 -154013 -190811 53561 289051 391246 -178901 -35404 -94107 -220314
9436 -220314 -64643 50038 320957 89185 -12581 -253343 -222151 -296334 -40619 -226889 3910
9424 -105318 214608 -214640 -162613 244733 -179049 -189426 135399 20854 -94058 -64801 -124602
9413 -124602 116049 -222577 -146250 -346366 -3981 95538 -108740 -4545 -121082 42108 285715
9402 285715 108086 -298692 243325 292588 40687 124780 -159889 -227567 -208148 165315 183176
9391 183176 -171864 -144795 -121481 72854 128746 -236878 22175 -250042 -350945 48851 -21445
9379 -151231 -355312 -374116 -211908 66725 -49923 118649 70940 -99746 50716 -275715 186168
9367 -319261 -218765 -60095 -82639 -192378 -254465 241802 135764 -155361 -149346 -169064 -18062
9355 -237729 -94966 82778 44717 -66177 -219841 89070 45318 -23289 -79697 -67481 4622 -103608
9342 -198328 -74286 -7663 -94329 176573 -197231 172347 -13126 167619 21557 -140081 -123129
9331 -123129 274019 -116056 -121190 8352 188400 -140952 -117064 -250102 -177678 -8630 -207746
9320 -207746 90834 -72489 -95889 -20747 -207192 -208798 -72411 -84110 -52285 -42754 -104021 42258
9307 -24597 7498 -176101 13236 -164249 149081 -84982 92333 165495 -12191 -83392 -244024
9296 -244024 -148541 65953 -74220 -16595 -38951 -12211 182713 -279368 -144298 -160570 -267647
9285 -267647 -255654 -79045 -5413 -225019 -24606 -147086 -30472 -40339 187399 77131 84570 -131205
9272 -806 226558 234508 -136771 98047 -302462 -50256 -278710 52124 17378 -35036 128296
9260 238072 -104864 -196839 -147824 -198473 -127345 121434 36886 -161120 -52867 183 148323
9249 148323 -222778 -17324 43900 -343920 196218 -2609 -1701 -147649 265424 161183 -86415
9237 -269593 -127758 244451 111611 323723 128181 -201456 -3952 -10496 -86464 -71099 -122088
9226 -122088 9496 -133488 -292672 -222952 -42514 -131537 -293421 -67042 -141194 -261544 183140
9214 -71999 -246328 -20306 -125919 -181404 -238389 108903 -301498 -256128 -28116 264438 -230676
9202 217760 -391952 43710 173657 -47476 282484 -330784 122825 -44507 72259 104636 16387
9190 -627604 3575 -210198 -133512 -281355 177261 -276327 -71386 -37131 -226756 -90353 -56422
9179 -56422 -184342 -116884 -184683 271757 -477491 -182369 23987 129145 -144816 120999
9168 94809 -11735 -184051 52368 -178091 -19624 -57562 119414 -8745 119642 -61029 66171
9156 -3595 -17498 -295288 36227 -108329 -58304 -387015 -128488 -299278 -252485 282590 -106332
9144 -319065 123054 -187958 -90444 -29663 -285328 9056 -351144 -156025 -13604 -89924 36568
9132 247078 344268 -167502 -121497 -358643 -62960 188724 -119248 221812 2938 69682 -81623
9120 18467 144611 -200924 -44276 177246 89725 -127372 189622 12271 -94388 160111 -178462
9108 -175198 -101429 -78901 126491 261811 -143304 136674 114125 -263972 164288 30772
9097 246925 -143702 185855 -282547 -233853 -21784 204983 -65750 -280116 -332052 -142738
9086 -143076 -146783 153272 -263877 -225348 198659 66239 -120093 199199 -433 -172113 -285284
9075 -285284 41158 101209 -300063 16155 -118546 -236662 -111109 65181 246094 133155
9065 133155 69410 -191714 -127619 -116002 163714 -209103 -70315 -168407 -84945 -6836 228062
9053 -180276 -410269 -311574 32074 -16441 -280734 -40113 32930 -447304 365464 -281327 88359
9041 -41079 -352337 -57633 24545 -88973 -2737 -199859 -244105 -13825 -256688 -79824 -186180
9030 -186180 -197644 48317 -94588 36218 -330523 -97059 -118512 294518 -48695 183750 -199899
9018 180243 -190517 -208733 -146612 -174466 25467 217433 126785 -66691 143044 241701 -52178
9006 -55127 39939 -330969 236387 -190414 -125766 -89506 -212847 -36868 138422 206903 -267629
8994 -16255 -363077 -83236 123257 -85525 -107507 45354 30158 3653 -172893 -141485 -269031
8983 -269031 -22460 -26574 -33024 -265170 -40555 -149580 130266 -133287 -390532 -138446 -182434
8972 -182434 -328960 -401935 -200996 -235922 -28420 100325 -116729 -145184 -170536 157962 62089
8960 -246757 -23723 -231256 -108635 -401395 -296285 -135508 -39428 212698 -35957 -73605
8950 -73605 1926 -55471 163229 -241314 -392994 -301509 -120699 -120528 -141730 259061 -89011
8938 119609 122524 232194 -27307 -201356 360356 23019 -139534 -176417 131114 -106913 -85945
8927 -85945 -141120 90480 318549 930394 2516927 8880258 9460976 2501856 1307318 575430
8916 355272 238766 62150 -113192 384386 149944 132154 -257641 186566 280331 -68160
8905 221755 -48042 -236257 -91 80418 -120326 -87184 26914 -93400 202979 266157 -2474 37623
8892 -192266 -115803 -110120 -197377 -22976 127207 -320559 -129637 114103 -360130 -105408 25789
8880 95715 100478 -102579 51525 28884 -214468 256177 -310066 -13199 251608 -118058 -50550
8868 -333544 -85839 -87892 -58006 291567 -187553 83268 -236908 -25024 -173595 202721 -78053
8856 123360 -183160 -120191 -311744 -286749 -247783 -6328 -321966 -55764 -24439 -116711 -185812
8845 -185812 -415098 295829 93651 68542 -172520 83556 -128443 11457 -131549 266102
8834 -281374 -114797 -61586 -163791 55871 -449975 -65383 132008 -181071 -313974 274994
8823 -34154 -3057 -90966 -198584 -298873 -217512 77928 -248320 -374178 -35564 -533883 -35937
8811 240798 -126902 -61201 -153353 -8552 155119 200933 -83392 105964 -19322 -158408 191109
8799 -257531 -162299 101859 -128965 -96704 -131245 -219459 -27558 -157547 42782 145875 -58576
8787 -429200 -345379 -55154 31807 -121821 83056 57953 -12523 112870 46951 -19412 -40454
8776 -40454 -63862 -69287 -48631 9392 -109577 153712 -271590 -190535 266564 -136184 -537852
8765 -537852 -10768 -146198 -141865 67732 113038 -174390 -323044 -42655 -96547 52945 -276932
8753 -314138 -255941 -207702 247633 -253231 -158249 -68265 -350482 124068 31979 -161392 50802
8741 233338 -19336 186863 44793 5060 69708 12071 99015 -422708 6374 223498 37229
8729 124836 231984 90149 22876 -18809 33007 -120515 -429765 -26402 66634 -123406 273195
8717 -194910 16745 -372027 -4808 -28342 3392 334717 -204449 -67328 -119912 -161211 119206
8705 5405 79302 -60968 -368747 236565 -426500 110227 31527 -86440 17517 -239520 -93958
8693 -272515 -133224 89725 108778 -39956 -238928 -110557 17784 101102 -218733 -189510 -152608
8682 -152608 -149697 -255184 133420 -87972 26513 -396976 63226 -9547 42392 -125938 -120213
8671 -120213 -201420 -358788 -529160 -31870 -34453 -75342 -21301 -293953 -160740 -252007 -110572
8659 310869 -8084 -55934 -450708 -55040 -174785 122251 -40152 -151642 -144513 -251659 -30237
8647 -186989 269498 26815 -17834 -140031 -60673 -59733 22842 170169 297185 -389791 -247092
8636 -247092 -301118 -42823 192817 304648 268276 214461 -204151 -76080 408383 -222361 -293449
8625 -293449 -182636 210324 -64368 -93198 149096 -293725 95458 52129 236046 -283836
8614 77096 50065 30163 354423 43783 -148290 141564 -53561 159107 -352918 -231283 -165400
8603 -165400 55128 163994 -344027 -31692 81592 196988 -186171 -2222 -143598 41250 -44596
8591 281435 21258 160993 71444 -4444 260956 -191376 48181 -190763 -192124 -72326 -162586
8580 -162586 208702 141728 -172486 127347 -152863 -26059 -282671 -209047 71766 -98412 -154411
8569 -154411 -102651 -112762 35336 95845 114774 -268454 201809 -45708 -6999 134221 -106823
8557 56102 246290 285868 -119406 -346230 33300 -136951 -196916 315399 -489527 62509 -443860
8545 -309189 -88873 219720 -264399 -315219 -157479 -144978 188658 -96472 155809 226169 96710
8533 -209473 2012 9541 157017 22595 148571 133146 -89005 58719 -148741 199092 -220367
8521 274266 198708 90321 -86308 -84251 -120499 -27450 160402 -2208 -267 -61329 -77217 11637
8508 -130593 -146249 107995 -20810 -256729 -112681 -239855 39524 -71241 86632 -478721 29853
8496 -88981 227534 170534 64731 -62588 61956 -302898 163161 125543 -87008 22847 -83539
8484 -162962 -326469 -93365 93194 -17422 174036 -79134 2505 233975 -272796 -118663 249306
8472 -216653 -4907 113779 -215570 -146322 -212702 -177633 57866 -346119 -228196 238130 -165162
8460 70727 -177663 2972 57597 -265183 -230058 452622 -150161 191710 152821 210428 -109229
8448 368024 -73077 -26038 -172912 -365080 -149462 201325 -209182 -338347 738 -187582 -37014
8436 34282 85555 -372047 -45787 -115942 114295 -136226 -229434 -94398 46243 -195052 300366
8424 -33911 9956 -344421 163518 -85466 -116437 12025 62425 -246406 8045 259123 -47884
8412 3964 113838 103753 -4727 -129564 -33219 263225 4352 116854 89596 -239920 -331807
8401 -331807 -153117 51293 -312581 52014 165404 -298840 -128168 135130 215665 -197178
8390 -203530 79201 -411046 -100473 56463 -80432 -79037 69245 -169106 3305 -127923 154291
8378 -250195 -252842 -246912 404776 187080 -20336 -376515 264549 -407675 -120027 -161153 -261233
8367 -261233 -133330 84919 -95229 -37541 -369603 -267991 -194653 201980 -80420 -317837 -245019
8356 -245019 -216105 -47144 -63439 213187 316711 -240499 48621 366832 237508 -151293
8345 -171719 -299074 -146784 170089 203325 254761 57367 186690 -76449 294304 -121769
8334 13287 -379917 -62755 -206620 -81699 -157998 -178484 -103398 69070 74149 -97864 124792
8322 -9546 -138086 -90455 66984 -56631 -190440 82201 -181755 -274253 247931 57274 114390
8311 114390 23627 -41058 92846 35449 -338672 152693 -3116 -39603 -306212 204106 -123812
8299 -72895 221489 -68547 -196992 -248423 124666 100483 -33078 156826 249003 -258354 -118574
8287 73821 -56465 -442065 23525 53176 -11706 -143728 -151596 240293 232267 77322 164189 -35440
8274 -49871 107706 24697 -274265 -36024 221829 157660 30394 286286 -155389 -101970 -55492
8263 -55492 -411427 136665 -9276 129431 162323 252304 71193 -237797 25608 -117302 156778
8251 -37729 -220594 -270679 -362412 -264875 -196153 -97055 -132378 97590 -142031 -374426 -389766
8240 -389766 220300 138980 1602 109946 28165 9650 47947 -128392 -93766 -72022 61358
8228 132509 178943 -23835 -274870 -19328 -275257 -344559 -155416 -65082 137173 7980 29264
8217 29264 266909 -24646 -165367 44240 -180150 114041 -56091 53249 -274493 108806 -114674
8205 -211444 -165085 -215840 -168793 161874 -90707 36016 -76845 -5126 -265880 63053 -39966
8193 9575 -169361 62959 41000 -405852 -49307 -301772 -130130 -340059 231598 -224973 48809
8181 430434 -454324 -1162 200525 156773 -205255 12286 -11360 -163119 -178341 -233472 -469232
8170 -469232 -173073 233704 -61081 -248257 -332567 404811 -196099 -91425 206136 168767
8160 168767 -123355 -190792 44665 146009 -89912 -185794 77998 196122 104382 208185 42897
8148 72506 -269997 68919 -162480 -82577 -490388 -19522 71562 99558 -260340 45139 -150784
8136 -309245 -86368 -5570 464 -388912 -21916 -540455 251443 66218 17759 -44583 -70545 312650
8123 68468 -228447 94826 -44844 -35517 399304 118303 -274260 -154019 -31221 104853 -148487
8111 -49513 197569 -334834 -44453 153180 -130896 245289 7710 -377360 177912 358702
8101 358702 53831 -288798 -68600 -5984 85913 -67136 -213805 -63558 115997 131759 -301798
8089 -57118 -115929 8030 -281355 -124201 -23944 -137864 158951 -208009 93272 -164531 235501
8077 -211167 -210669 219228 147660 -297488 -345094 -428825 -31336 210591 -286867 -97806 77784
8065 227224 -1276 60556 -39155 191851 -184083 47969 -421046 79991 -76740 198678 -113690
8053 56426 120194 121855 -205569 -37321 -25021 -81287 84934 -159792 -157067 -153666 -117655 -52762
8040 -153090 -123093 148286 -405134 54524 -220747 80338 -83064 63634 292460 27984 64663
8029 64663 -55039 -292252 -165504 -258113 -96253 -20696 228949 51759 -175193 -113468 -159276
8018 -159276 -25072 -278526 -188322 264870 240287 -282191 -374325 -44694 -434909 29068 -70058
8006 19019 120250 -157927 -275095 -336817 255206 208942 -187423 -270905 -164823 172557
7995 36171 -119068 -160085 7305 316427 153126 -75130 109454 -174396 9336 450700 -50118
7983 58282 15751 -198239 28996 93021 187281 -43641 -163634 -177770 4503 -159 -130944 -72785
7971 -72785 -267307 83344 -384064 44295 -94343 199836 -247975 206788 -25909 200662 285454
7960 285454 128038 -59385 -95559 165357 -261108 311047 44202 127089 231300 218483 117638
7949 117638 -190055 -208444 -67109 162979 24975 -184521 -292674 58473 -14654 -127477 -237546
7938 -237546 -288516 -68040 86137 -146897 -262981 190771 6883 267133 -70003 -109605 72701
7926 287056 -335710 314542 -21717 -206821 -24200 138517 -424077 93327 -145729 -122863
7916 -122863 -136414 -212358 84002 45892 -436098 -138746 -185606 -84385 152245 35486 -309780
7904 174561 66947 -203096 65014 -231308 136397 -40882 -389967 4825 -140500 -157450 -104532
7893 -104532 -135614 365565 52377 185619 150975 105055 51089 -89344 47349 -37096 -126304
7882 -126304 -132031 -148835 147396 -4405 159078 242413 -1791 5106 82491 -90332 2649 68485
7870 68485 -304922 -20960 53498 58696 364441 119779 74765 -304581 80248 -21061 16221
7858 44349 -93422 754 -57591 -8414 -80611 -225933 -78152 -61870 -150508 -21474 -43628 -306275
7846 -306275 -222583 369512 103045 -133510 11167 410307 -111647 -288470 -3014 260570
7835 -263567 99307 59966 -90133 -107299 -162978 209588 264445 -237457 -418581 -45249 -267545
7824 -267545 -139403 -254282 -28685 97694 62676 -327142 -3238 14026 -20430 -84954 120891
7812 246817 -196402 -273099 -68015 -420799 136186 -118865 -10657 -185714 -206106 168485
7801 -202908 60406 143747 162279 -165871 -147535 3817 67768 22747 -254503 70981 -177250
7789 -276790 119399 -165765 -139827 -68612 204442 -165295 346795 -224383 76055 103722
7779 103722 189065 230598 41240 213699 -98548 -68197 -30922 230185 262994 62030 240663
7768 240663 -365607 -98806 -155344 -103989 8358 -14496 -156202 243113 -515705 -58971 -264834
7757 -264834 53287 -276892 -207503 -35078 -201675 155450 72447 178117 -221399 -39016 49029
7745 -169012 41389 -111961 158694 -318039 266952 -240045 -547669 -51395 -305615 185970
7734 -46856 -266969 -165080 -9195 120807 47188 -30938 95564 254239 -135167 30395 -37543
7722 -217669 750 48388 -209102 -227187 107420 -180770 143498 -75030 -60250 30958 -160672
7710 -83206 -154941 155641 -156290 79444 506587 -145638 89657 90262 9419 -264610 -78944
7698 -32844 32386 -235672 -219130 110323 20987 -69627 -18676 -178271 -140344 -124136 -225904
7687 -225904 -4822 -153618 81055 102654 -282717 198980 348421 -299368 -212141 -26569 100161
7675 11497 46730 2126 189828 -287546 -11542 263468 -103404 26184 -227693 243132 -53322
7663 -38145 8709 -264062 362931 -197371 -355507 -123160 -219929 -233 -322744 -400479 157551
7651 125833 -270737 -210475 209853 -120102 -146703 -184209 132421 141945 118650 -154939 190654
7639 104035 146060 -202691 -389431 14754 -76027 -145155 18623 -15164 -141272 -195514 59002
7627 99149 -127310 190129 -150358 -294675 -40543 47394 -131970 406593 -119549 8761 -128741
7615 164768 19539 414531 -90431 -137466 -48722 17604 -120803 214823 -25350 -295284 86414
7603 63639 -62061 46057 9690 -241515 132066 -27043 304171 230174 186207 -234298 -5457
7591 -18473 -184284 -174879 120830 9239 -88155 -98776 62452 -144400 215554 -283610 -107145
7579 59902 -189567 -73554 -275675 -142852 -233589 -235061 12687 -31582 95610 184190 46700
7567 67790 -62633 -35986 -137179 -358715 -233526 144648 -141801 -112893 51026 -316369 -101391
7555 330134 -182030 104997 -167822 -10641 -2479 24592 58971 -169523 175736 -89561 -50238
7544 -50238 -1895 -224136 -206400 -54687 -199686 171113 -165577 -397940 -137501 -61370 -130062
7533 -130062 -80285 345187 56739 139909 315316 105884 -250758 -60092 -136484 49076 84935
7522 84935 -253943 -391126 -78343 154163 160752 -13085 30451 75714 -9176 -43495 -153995
7511 -153995 -241607 -215223 -156281 86127 177301 -60943 -100381 286376 -138566 30522 -21406
7499 -235445 -195559 -37267 3897 -119317 231517 -237270 135632 -138228 5912 -220329 -53715
7487 -226702 -230351 73580 123923 65504 -554722 -312674 -61795 110170 -33159 75906 -58532
7475 -48618 -156039 51094 -15976 13978 -95383 16289 -156151 -76996 127490 -43697 177259
7463 99478 -31147 159571 -183459 -29515 171696 290441 -7161 -187013 -231173 113979 61217
7452 61217 34680 -45935 286627 -66302 -8352 -23730 -29550 164747 -7235 81603 -90587 -339090
7440 -339090 67899 -36492 22527 66597 235577 -154768 72330 -144950 184572 41528 66841
7429 66841 -71041 -153241 -244092 227244 -17321 -157500 83467 30872 -198663 -66443 -54039
7418 -54039 -37141 303147 37709 22207 -171736 -2368 211220 -334301 49774 -136561 -76410
7407 -76410 -117795 -50843 -37009 -31183 -11311 84873 90969 -170081 -26695 159797 2812 -132593
7394 -79270 -371992 -192563 -16561 25923 -155201 214437 -358941 34197 -142260 131046
7383 340812 -25148 -35257 21268 -35163 207783 -125698 -45016 63433 133156 -239709 -13680
7371 -194863 -12762 98997 127861 183437 42159 -256783 307527 128660 9159 -108498 -185086
7360 -185086 204834 -132419 -34037 108439 -76229 -103962 118913 227771 11432 53384 -129822
7348 1833 -206436 17632 -26962 -57756 -265809 132779 -205384 -313951 -70679 -247447 -137400
7337 -137400 160880 -57424 -325298 147322 -72781 -256393 30633 166915 105989 -37744 299925
7325 -53846 -6100 -132533 -159372 95877 230713 88534 -33288 -560701 123707 -201639 -78711
7313 -71876 -240048 214571 -17756 -92239 197640 215510 -60967 214215 6584 -178126 -138574
7302 -138574 -164996 10155 21031 -197034 3714 72342 -19459 18943 -166561 -129515 39992
7290 -130184 142498 113107 79849 -357916 -78564 -45208 7173 -240240 293907 28727 62688
7279 62688 24085 -272719 -191301 -10525 -22581 149739 55722 -67615 178119 -27730 -149997
7268 -149997 -59789 143348 139465 360767 -40202 -13995 -25789 67901 138496 191066 -259166
7256 -230085 161890 -308538 250717 101822 -146126 -216970 -150431 -405758 60549 2018 35148
7245 35148 3213 -34784 -419685 165250 -421528 28944 -170926 61515 102228 -176877 149349
7233 -273414 -54842 -28876 68196 140133 47285 -24580 177438 8554 -52194 75739 274635
7222 274635 132931 -139722 -17978 83101 -41766 -271546 66184 28125 224142 -55348 -9957
7210 -242176 -171458 -28833 119650 36448 144699 122372 -170458 254898 65519 -139351 -98361
7199 -98361 -241595 27731 370030 44367 7664 208881 -232030 273773 -229747 141759 -81826
7187 -338722 135420 -86703 13687 -11843 -98231 -52836 164223 -186889 -432946 10809 -86685
7175 -103304 -31820 15451 248957 -185407 -273927 13315 97620 175171 25181 67514 -144814
7163 -68792 -114214 56197 155917 282271 73321 172843 27439 131621 106451 -71312 26285
7151 -78118 -54803 67000 -586841 19636 186207 81743 35543 4206 98450 -319234 165114
7139 -146688 38342 79318 -67528 -48608 -223571 -72248 -317133 -40477 -34803 430739 -155282
7127 90202 -9757 66035 -51705 -31854 -356761 -287740 -38627 160711 45685 -7777 -497527 125014
7114 -114989 -65324 -2780 -72810 201250 187084 -278 89686 110080 107118 -157754 -319505 11190
7101 -7403 -400797 56937 43911 -157765 87002 -48980 58271 -171812 119561 -70625 -12535
7089 -333861 -24467 54196 53747 141837 -78339 24066 -15059 -87008 101783 176560 -182003 19030
7076 52201 134891 -121505 -60100 -107518 -44332 12567 86033 272031 85197 -195601 -196139 -90687
7063 39567 124815 -405504 -163213 -51713 -45328 -17529 -61686 168399 3961 149623 98944
7052 98944 -73778 -245571 -223536 193778 92175 -156420 67156 -26522 4647 104380 -185504
7040 -248123 -6423 -57371 22935 70185 -70223 231046 -47448 -26694 31734 -104463 -34639
7028 -529912 82602 -202301 -177529 -342405 -246001 -69062 68616 -60403 -10399 426950 182480
7016 6963 -315080 -184804 -21741 93052 -114393 -103417 -318763 -14782 -97095 154059 89688
7005 89688 -104020 19077 95975 -93417 -256957 284769 212140 -64515 -85814 -84007 -55594
6994 -55594 -84206 -9050 51188 -58233 -279466 83030 142394 -51247 117867 -162817 182214
6982 -110499 -121727 -74141 30117 -43250 -5113 -164515 242231 -46311 89135 328493 -64215
6970 -47119 382648 -60351 -482692 -51392 51360 35932 137723 42533 18568 -359094 88843
6958 -196039 -252267 -261705 -74774 76554 -53813 183249 329228 21965 -109600 288683 -165254
6946 157578 159976 334065 -63864 -22615 113043 -169962 31521 -231725 -176279 275328 -286359
6934 -506903 -437154 68225 168421 126479 90932 -136001 461551 7170 -78861 -40914 -9291
6922 -116505 -177240 -109873 -183832 253297 -24857 13634 73171 -175536 97003 141310 284540
6911 284540 16391 -29660 78687 18373 -248650 241990 -282960 40388 -118327 -118597 314667
6899 -286624 -238160 -182678 -14442 -28885 62866 -63423 137812 -167416 -202694 240162 -87128
6887 -14102 -162506 201143 136812 58918 -102520 225488 -221944 -158263 134893 -232164
6876 257890 156837 128078 -376098 -63435 88111 -28457 6291 -82955 57544 387650 -103881
6864 -236557 -85361 -107876 3945 463232 -303396 -48492 477508 -48309 183253 -13263 44214
6852 427430 -51817 34816 -187319 45691 170774 -181305 -45863 -72971 -25683 132383 -240761
6840 46139 13949 92831 -16654 -328097 -98373 -155577 138002 -56659 -458119 380729 -50645
6828 121726 -511417 -15508 -216202 -167123 203770 -183406 -221670 102050 141402 -24666 8616
6816 6279 -11261 -237504 445737 31112 60229 -35015 401892 -62250 218045 -106108 119643
6804 8869 36499 2598 -416104 -107656 -91042 213923 -70420 69547 -30042 119105 -150084
6792 293209 251881 -67209 19162 59220 -210832 -212402 -66948 103338 -423469 -230382 -159878
6781 -159878 -29263 -181455 -353021 -112626 101393 59934 110484 -414589 54829 179617
6771 179617 61853 -25104 -90176 130708 -59925 -70312 114368 41346 180690 -25279 88791
6759 -152603 122347 -170493 -280626 270174 2200 -121553 90498 328368 17039 288792
6749 288792 302138 173607 -43133 50610 -35661 42066 -137833 163125 -4989 -155033 -209402
6738 -209402 199394 16508 -133955 -179632 -17088 125725 -72054 43367 14721 -59860 102876
6726 -25580 -142637 188497 -69751 -242475 -136884 -42629 -35812 177898 -48161 39964 -32819
6714 58 35983 97491 169802 69804 84366 -124543 -34791 -100492 -4178 74874 -163622 232032
6701 15704 231925 149440 -10499 107094 83622 118385 -40101 -332058 -95862 344446 101752
6689 17153 -153065 98154 122769 329191 349892 -140250 -176968 -212665 18280 14163 -89350
6677 209407 247458 -43116 275518 -37948 21564 36776 29334 190122 235743 -251614 186535
6665 67111 -86808 -489780 -36321 -7361 -97819 319745 -84482 -22041 19488 -126949 -44673
6653 -225191 -120234 -4462 167248 -126769 -190264 215482 -166940 65715 -15601 -118749 95281
6641 -8365 -56895 -50865 71693 141485 -200060 -131485 -198891 -201877 92699 -106676 -138986 -102547
6629 -102547 54728 54445 180985 -91863 44902 143550 7195 20909 -73600 -73072 -141642 -136055 -67601
6615 59046 283491 -60826 96586 -124649 169908 -210893 -163095 217282 -82811 74218 336046
6604 336046 216086 39042 5670 -48115 -270478 -137779 -121610 -6721 -93998 -62957 100514
6592 55170 -150170 -63756 8427 -149170 -13027 206286 -118385 5533 53531 -76966 -24599
6580 -169780 29745 169224 -135186 376971 -18896 -17818 -35690 -153811 -241184 239863 108477
6568 110743 -238695 14861 -62900 -254664 107555 99141 176597 -25813 -193179 -14829 110281
6556 -17030 -5416 209429 54552 -170240 -89461 -99885 -46678 106555 -6944 -299274 -67044
6544 160317 -143965 -94997 278492 -89721 72828 150141 -295328 -71537 54400 -466852 -252550
6533 -252550 125661 35872 263182 -218745 117612 149128 48253 64629 356615 -93425 109550
6521 344594 -256989 2777 27231 261545 168130 171444 292150 -178080 14938 -4260 27979
6509 -274850 94013 -91917 266733 -127948 140589 109817 -248912 95213 142025 -239268 10481
6497 237733 -76582 158794 162641 -77074 -80230 -229522 12703 -98589 -208773 6360 84358 9087
6484 -64765 230370 -440187 -65172 61743 -168135 -6479 -210713 70916 63150 -81520 37721
6472 29352 -5255 109636 151669 147266 -82451 296164 105204 -34227 -290844 91047 13173
6460 88664 -52719 149099 -40423 208188 -165840 140671 -16067 59935 325125 -167983 -110848
6449 -110848 -29008 269065 -57822 267531 -109143 -89889 -123779 -26441 -113443 312164 -183173
6437 -13467 -25828 -39997 49564 -18166 199405 -170167 110411 -105721 -108254 -197656 119459
6425 -235743 -60484 173536 -181386 -11125 213666 -38493 -229572 202821 -34117 -268342
6415 -268342 90744 -191152 250184 100600 64590 -276996 14224 186936 -17762 40728 33588
6404 33588 -16136 -55132 118352 -216088 61172 -12218 205506 -205272 102871 189416 -60984
6392 105170 -12806 -78116 -18829 7648 29548 97108 187567 -375392 -333102 4042 -149918 86535
6379 148831 115143 -45145 -158234 -252189 20555 -77727 -226667 -23295 8696 -165181 -155866
6368 -155866 152538 157898 -15181 -59398 -76898 -180509 137651 132345 198887 -60030 -205542
6357 -205542 18288 -34265 -566978 12570 449248 -339237 -29611 -145328 -128177 105607 220712
6346 220712 -216106 -124683 25421 -181079 -211368 183294 288544 65647 156870 148419 280086
6335 280086 -42359 234834 -149348 -17979 -300658 -28007 -64800 -66876 -224122 -7076 -253200
6324 -253200 130278 153165 36574 -191117 145939 286977 184079 38133 -185937 2306 -172006
6312 272878 255285 -204441 -311683 -146304 275128 -169354 90876 207564 -57279 -157964
6302 -157964 19604 239604 -87721 -44030 -136998 -169109 134647 -262901 184873 126627 125254
6291 125254 22987 15509 -5431 -159246 -98743 -249484 329721 -1030 -313182 -130464 -232078
6280 -232078 51764 136741 308511 114014 89028 228119 -138360 -220208 355235 -202618
6269 116856 -231857 100813 112544 122821 -15386 -99597 -127996 -185878 122068 105624 -95248
6257 109038 -1827 -14071 -86446 -112351 -280152 26212 -50742 160487 -282550 111752 -43424
6245 532032 58481 136890 94892 169352 238817 195721 -44954 -182572 -108398 -195963 34180
6233 -143026 144215 -135927 -120469 -155434 72127 -49659 -350079 146817 -324609 5837 -17227
6221 -351650 -355998 103648 -92135 602749 -330575 96444 103805 -46550 -287000 232910 -289595
6209 266336 -30493 178082 -270012 -55912 66967 -22636 -106983 23534 321125 117896 219320
6198 219320 -70244 73674 297048 54633 -3535 27490 -284170 -78820 -158752 -2090 -246562
6187 -246562 -27732 49898 -36636 143506 -116693 -212253 -125366 90566 140872 302565 -115366
6175 -72659 1221 151339 -22412 128382 -230151 110571 268761 -61555 -327363 240694 8691
6163 -37921 163795 32087 142298 -159246 194403 -270125 139485 -29319 -99051 16498 261811
6152 261811 -136534 12706 8462 -273172 136526 33513 -197496 -8839 -264079 -339670 410010
6140 -23433 79506 -184409 110035 -102336 88929 -359995 188903 -234671 -236721 127125 31832
6128 -60575 -92551 -196381 -261588 -143545 -140092 -168038 -129458 156660 -374636 209419 -161758
6116 -1614 127664 8898 -54978 218998 74101 343898 159967 214660 193470 -91252 423463
6104 -69399 255496 -201926 212286 -31996 -43652 -47992 -108695 94768 -54258 -281315 -81902
6092 -102364 -39029 -52419 37982 -89631 -177465 -11642 -37143 -53713 37809 -331097 -71982
6080 205022 5031 -40166 210760 116695 -868 -203536 -68515 -53944 246018 -14529 -195934
6069 -195934 -193121 -217564 313227 -199535 -67540 45083 41828 155982 -13151 -199243 -60971
6057 139312 -46300 -64314 159829 113817 315226 -88913 107668 -2033 -345824 -107116 -186665
6046 -186665 -16552 62579 -102620 -131011 -277313 -129562 123390 -53858 249385 214292 -32984
6034 -122210 84016 -184665 -179277 -67707 179484 258761 154538 30246 334311 311031 411674
6023 411674 -60287 -173586 209040 -78265 11619 -246337 -9996 -765 85091 146744 -302123
6011 314602 72848 -14522 63620 306445 41703 -188385 202320 147726 41742 -495644 24544
5999 122286 -44463 358923 41 169014 208918 16962 -47277 114204 8657 79108 36056 417215
5987 417215 -230236 239961 -154781 -20869 -249531 -14983 -15368 -174574 60997 113065 111797
5976 111797 150651 -385240 400816 152196 4170 111112 42510 178825 -57339 -160399 -169847
5965 -169847 -258402 -40303 -80254 -196078 -220639 -41277 115449 130689 13065 -131415 -215119
5954 -215119 454515 -332089 104436 115943 -17426 -114233 120806 -167504 -172986 10036 -179424
5942 -161985 138566 299940 54297 46943 137779 76335 13276 -343629 -97736 67134 -126827
5930 -80541 122977 312337 96740 106578 -153656 -281331 -211663 -45562 117358 275694 -232031
5918 106182 165666 61616 234452 87797 210586 301909 -165927 -141267 -240796 153336 -13801
5906 462839 -95199 25963 -155434 -106752 9360 -94482 -44141 -44425 -254010 -74461 -202932 25212
5893 -128093 -92128 9275 -136843 -441212 38076 283283 3875 158739 -54863 -119802 -142722
5882 -142722 -169791 -65476 -180765 209305 -88698 -103796 -206932 177223 142120 -161474 -148091
5871 -148091 139720 -109276 -1557 17113 -114154 -68903 231830 -24678 117179 161929 143520
5860 143520 -90533 -421110 7681 35537 -140646 -139648 33282 187539 119376 20773 23046 -136810
5847 205351 -148622 336202 48083 -173777 -38203 -182023 -68999 199124 -83551 72477 114568
5836 114568 132513 -178899 108524 254787 -167075 -95427 85817 -22190 -72970 -73024 -193758
5825 -193758 57647 -85473 -288694 308911 -10603 -4565 -15559 54331 16738 -287416 -189381
5814 -189381 -15100 -242356 -89915 -130995 163301 108441 1587 -200049 282296 -41358 -223840
5803 -223840 289627 -44956 -103215 -492278 -58680 -81335 -63312 -61921 192940 -107692 224005
5791 -139526 66513 48437 91580 97700 79596 114293 179249 -67191 -195310 -335917 102695
5779 168968 80994 62527 -45504 -102285 281653 197853 -239395 -516977 176 -40383 -292731
5768 -292731 -62138 118334 -117659 -116231 185814 4394 177990 -74808 -211265 53348 -97222
5756 308942 11613 223299 193711 187942 239398 229579 134150 -76683 15753 8077 266576 -73552
5743 18420 -136918 123443 -327299 -62583 134483 332594 103898 -420496 -90506 139313
5732 -92456 -319612 112860 -29762 -101248 41984 256801 28825 -171016 289293 -209022 -125597
5721 -125597 273711 18064 -286307 186875 -82477 138877 91233 121903 -27050 -221747 129845
5709 -150346 123137 -204688 -178020 -118057 131840 -71112 -253 58129 -6353 42203 74600 211379
5697 211379 219698 40344 -368314 -96043 167596 -86887 -135762 71810 -256358 -36986 -43218
5686 -43218 -67557 106744 -23719 -79203 -146074 121252 55318 -34414 -182894 -198886 -28954
5674 16362 -92147 -238589 -80403 362419 159479 -271213 -92959 -206756 -16885 219071 71661
5662 -117760 2947 145267 -64557 222475 -187842 368797 -182804 160243 -26340 -100018 -136685
5651 -136685 -151594 -40095 -63796 17808 -210206 -5633 379195 198652 -92525 -427850 -28044
5639 -418929 68833 -233471 144524 24105 40639 106049 -91008 277487 77215 -32747 146223
5627 -246704 373305 -141153 -104248 -388874 170510 -2749 -218221 -751 33145 327729 -147351
5615 -233532 -31104 -3141 96298 -204877 150662 -7682 168529 -30894 304031 -225278 -51715
5603 -7938 196608 -160954 86199 -207589 -279412 215344 28853 209683 -202725 70955 63
5591 60463 197301 -17802 -401337 -250941 358035 94185 -290891 -289900 -88743 -145872 -69464
5579 -342639 -109790 -298979 -105079 194021 -141824 204507 -269782 -115209 90848 123992
5569 123992 138994 57922 11161 -173489 -28937 135877 -2191 85547 186064 -29749 104853
5557 -4697 -118867 19409 54394 -86455 83749 -177776 -317891 52123 -242497 -116658 17458
5545 -245584 -168101 -43642 -24467 95436 341147 159454 199619 221072 406354 257476 -305505
5533 -400 13959 12789 83397 -65816 51736 198826 -108503 -833 -56351 88667 37241 -8309 -185842
5520 -185842 -345994 -46698 -94930 157943 -76450 72390 -106238 -170021 -300291 39446 68099
5509 68099 104667 -130062 26652 -2225 20222 38159 -350913 18652 62710 26815 63836 127621
5497 127621 261210 199002 -285832 46742 -36522 -151306 -71252 75256 -858 -74866 -595330
5486 -595330 153511 -175030 173540 59339 263833 -328034 245269 -106498 -152543 182452
5475 59439 -202464 -33913 134787 175802 43597 315564 19207 -237536 6452 31925 -3061
5463 -220058 -57843 -157267 198174 128351 3518 166254 338178 -54260 -6977 31203 36809 378592
5451 378592 199722 -98109 25646 -142705 92147 77832 123925 436581 -408803 -321958 -47455
5439 -414302 -175598 -92013 -117723 258831 27956 -210113 45999 38178 20790 244608 1313
5427 -11124 -5154 135667 115339 72923 -195816 79001 20750 151190 -55713 151801 129538
5416 129538 408147 -17657 -136689 -3776 -28649 -60242 101240 45692 197530 234114 45876
5404 -129473 -1797 334224 -221759 -46203 314104 -107500 -88261 -104564 269600 216566 117426
5393 117426 5982 257856 -300870 100898 -29047 -151202 -69756 -47423 33792 -196877 -42955
5381 38017 184237 119677 125298 147544 -291948 -258511 -322639 -136751 -231739 -307616 -252191
5370 -252191 -201821 -198804 -6772 -114629 239647 336872 107073 -131874 -83886 171866 -89278
5358 140555 -271566 -132705 34849 19155 34991 -165434 -352875 -144416 59796 -16122 135732
5346 -233115 -230359 -14189 86510 -33440 -197066 -39113 -96174 -154383 -102358 12269 -144536
5334 -99057 51291 -36068 -114699 9221 159858 -100694 235801 336447 150700 -53895 -153007
5323 -153007 421440 -173830 57846 -102350 41052 -327289 -288375 251573 -317126 -209968
5313 -209968 47187 3078 -190387 220447 109533 -168362 1231 65228 9480 -12605 -348513
5302 -348513 -248545 68888 106780 51208 -32085 -223969 157457 70319 -104298 115347 -203577
5290 -78408 85618 -85587 -242470 -247967 -126428 95259 -254206 -57150 61622 -162877 -131504
5279 -131504 -13453 -82935 -101432 271665 -129747 108457 -4332 228779 -67332 321777 167042
5268 167042 245695 8217 -29007 61302 -235875 41011 77153 -156162 -200265 -327593 -56627
5256 -127291 226643 130000 -396888 107697 3039 227700 156745 -25664 224471 269799 21097
5244 228871 -37230 -447828 249012 45202 95438 147118 -52055 460689 222776 -45801 -33065
5233 -33065 67374 142607 52938 36988 -55005 164533 134411 140075 337154 184099 38811
5221 1040 -136326 151977 -16478 -172015 18660 340559 -395185 196430 -139210 116207
5210 41554 36951 164342 66239 -106106 -34822 388914 -118548 233837 -291368 7898 236987
5199 236987 34707 118668 138867 -56227 -335253 -46747 213742 12538 112015 -15234 -81248
5188 -81248 -85827 -77105 -61378 -32626 77833 -66174 -260728 -77187 126458 44079 247063 -177564
5175 43011 -214740 131252 97787 113978 73476 84676 -47465 -146094 46139 -39933 124890
5163 -105870 66288 233311 209864 -164823 500177 -395395 -3104 -403344 -181172 161409
5152 41439 290163 147098 -37934 -280784 153699 -97089 85674 226493 -304362 31686 30682
5141 30682 -199784 230992 268076 102007 316546 525975 977 415620 -107117 -58152 22992
5129 -132708 114838 -188231 122550 441099 -69382 68057 274837 68950 344851 138271
5118 114853 44109 224007 199249 20181 152356 192834 -42238 291161 -231663 -247059 86632
5106 73082 -82030 -31528 -277955 62494 -68538 111337 146617 -50244 -286705 115720 -259994
5094 -46954 148213 -28818 168304 294681 37368 79998 33016 -240676 -146918 -23655 -139395
5083 -139395 -11032 -136585 94091 303745 -94935 72401 38476 -41809 -211762 56971 94892
5072 94892 -475066 -345041 -244463 122612 -72623 189383 -10662 -19983 50648 4388 -156201
5060 -5151 -206844 -63511 52965 -192310 152836 124211 176301 301691 228168 410759 59516
5048 -153586 -344358 -33465 138569 146218 -26065 117902 19002 -384385 349705 317959 -204659
5036 361353 -258969 -26628 -84409 -16886 -91554 -60196 48580 -12480 283530 -24466 57304
5024 -159616 -106013 121756 36197 85802 -112684 22085 -51231 -222117 28232 -101281 135243
5012 4270 7447 133630 25687 -73823 44324 114086 -279983 -121178 83407 -49324 396652
5000 18237 13405 10637 142951 244775 -97506 -61767 147454 -26112 45073 37535 189066 -172313
4987 134290 82773 38980 80675 158193 129572 -167205 5318 -3118 -96902 -196489 26275 -117315
4974 312842 -109565 86306 42376 336462 287303 -130794 63739 8576 120720 -104708 68116
4962 -151471 -397426 96319 -58798 -258441 35697 -381690 -60465 -99862 -224059 -100623 -228548
4951 -228548 -151801 -1015 -18810 229731 -39332 -220500 -293033 -299213 26843 -107025 -9307 381566
4938 44021 101416 71360 23576 365967 -136561 11990 -28569 -97988 111024 -16337 290634
4926 279 -61376 -147186 -101423 115102 -131121 -299292 -81989 597202 -112637 201381 435529
4915 435529 79865 -34709 -136223 324092 104227 -73629 48260 -252961 428253 -33605 -59958
4904 -59958 138302 -42598 -307304 7893 -46497 36316 75254 234893 -138964 262719 150941
4893 150941 49216 6237 62791 -30734 -96064 20724 454249 101598 164904 93945 98189 221275
4881 221275 -117327 -30921 -124463 124943 131950 -13823 -372609 71634 154763 -38070 -14470
4869 -22779 -82506 81209 93065 -355124 173164 36433 48134 168963 110096 245791 -268182
4857 -200280 -48999 160103 -6481 349546 357864 170431 10653 -302818 85010 86780 -147048
4845 84772 -139740 -77619 -207027 207504 18794 -85957 -212558 17188 -110218 -15768 12443
4833 -329505 -9151 267500 289950 -98329 -181036 110765 -163498 -181295 47543 -303868 -237977
4822 -237977 -88336 133151 -149557 273249 84225 -148406 -148018 -185461 23460 152565 -24229
4810 -103379 -89846 -70057 -120206 75993 148364 115173 113980 21777 -22360 -186405 35354 97100
4798 97100 -95518 -175585 194830 280808 144843 -19109 -320140 -135023 -23130 -285247 -82033
4786 -156758 141127 338281 75122 119513 -80167 202050 8895 -461088 178213 248864 -30669
4774 -44120 -344943 -29629 -148089 230840 487184 119345 121474 256131 -293973 116861
4763 86665 135201 -160311 290140 -187224 -116962 117254 339886 18905 -128371 124902
4752 -94055 -124096 215734 166133 -8762 -128833 -8640 60942 185382 -59622 79321 239092
4741 239092 -48385 -174039 -142568 228033 -126811 122077 -73050 177071 37581 -184357
4730 60075 27016 -49285 278087 -102636 -33122 189856 86902 74575 155750 212673 -216867
4718 72055 80449 -202846 102813 176384 232277 39437 -39582 -177124 -83668 10692 346518
4707 346518 35893 46167 156024 67579 263503 123712 -58721 -112856 -130855 -130884 -25072 -176251
4695 -176251 203893 34458 -10331 135795 73194 -124679 101686 -36825 159370 -207522
4684 -412204 -18488 139993 255456 -12521 -194772 -148068 -371466 82698 -118921 -19889 -96923
4673 -96923 183650 -256632 110461 -63293 -89122 -27134 85379 79799 -275164 175358 85666
4661 -313514 -53946 -128359 -82340 389502 -8738 -444354 441736 76236 19 -45016 -159541 -228635
4649 -228635 99256 -61090 73667 22448 458481 -117774 74635 21742 155268 190969 -70309
4637 5124 -136524 -156019 117302 330511 38932 -12161 -222591 179859 -23134 115259 28280
4625 -25907 -107460 -146698 40556 318803 290873 -266908 -170788 299166 -175693 182989 -341226
4613 -141915 -41235 320572 -125379 37162 -29118 -45020 323586 135596 61139 132314 221681
4602 221681 71221 -126933 25112 -10012 152523 -66279 -37584 -2506 -81940 9189 -48559 -152
4589 215396 -189614 44258 -1442 198710 -30279 -107195 -187905 146662 -12780 196025 -303328
4577 78205 -158149 -25308 -147351 -237962 3682 167338 -169581 -173953 -7035 36054 347084
4566 347084 230009 179380 -78531 64013 -213943 363310 94604 -257382 53044 -359050 -23502
4554 -217966 -84777 -120714 -7922 -115470 -58569 143919 -466401 105300 -122737 -13198 -77423
4543 -77423 32386 -119839 -143272 381880 513812 54681 50674 452799 -32515 8835 -51236
4531 -7594 396951 -234596 -78731 -149306 24203 108421 -54213 -190461 227450 127454 17591
4519 22210 -172372 180921 -83781 -112651 -159555 -102801 -146148 261204 -169798 -111717 73722
4507 -82212 189473 17624 87384 86600 -95208 -67361 -101144 -271379 -21613 -58845 81422 305237
4495 305237 101129 -385744 137422 -14673 -40710 -115650 28681 -40184 138254 197654 -191629
4483 92605 119489 322227 282684 -20945 157946 8632 127278 -383304 145210 363176 11610
$$ [...]
##END NTUPLES=NMR SPECTRUM
##END=
