
##TITLE=UV1101_M1_1161-1249_7180299_PugBAnIHS7
##JCAMPDX= 6.0         $$ Bruker NMR JCAMP-DX V2.0
##DATA TYPE= NMR SPECTRUM
##DATA CLASS= NTUPLES
##ORIGIN= BRUKER
##OWNER= Administrator
$$ 1.72 TOPSPIN		Version 2.1
$$ 2012-12-05 00:52:46.615 -0500  Administrator@X
$$ Compression mode = diff/dup
##.OBSERVE FREQUENCY= 400.02188249412
##.OBSERVE NUCLEUS= ^1H
##.ACQUISITION MODE= SIMULTANEOUS (DQD)
##.ACQUISITION SCHEME= undefined
##.AVERAGES= 64
##.DIGITISER RES= 22
##SPECTROMETER/DATA SYSTEM= spect
##.PULSE SEQUENCE= noesygpps1d.comp
##.SOLVENT NAME= COFFEE_meoh
##.SHIFT REFERENCE= INTERNAL, COFFEE_meoh, 1, 14.96093
##AUDIT TRAIL= $$ (NUMBER, WHEN, WHO, WHERE, PROCESS, VERSION, WHAT)
$$ ##TITLE= Audit trail, TOPSPIN		Version 2.1
$$ ##JCAMPDX= 5.01
$$ ##ORIGIN= Bruker BioSpin GmbH
$$ ##OWNER= Administrator
$$ $$ E:\/data/COFFEE/nmr/UV1101_M1_1161-1249_7180299_PugBAnIHS7/12/pdata/1/auditp.txt
$$ ##AUDIT TRAIL=  $$ (NUMBER, WHEN, WHO, WHERE, PROCESS, VERSION, WHAT)
(   1,<2012-12-05 00:52:40.583 -0500>,<Administrator>,<X>,<go>,<TOPSPIN 2.1>,
      <created by zg
	started at 2012-12-05 00:41:10.052 -0500,
	POWCHK enabled, PULCHK disabled,
       configuration hash MD5:
       86 BA 57 50 F2 9D 5C 9B 26 00 A9 28 5F 66 2E 89
       data hash MD5: 64K
       7C 23 05 E7 66 E1 7C 84 17 58 FD EE 83 8F 10 D5>)
(   2,<2012-12-05 00:52:43.724 -0500>,<Administrator>,<X>,<proc1d>,<TOPSPIN 2.1>,
      <Start of raw data processing
       efp LB = 0.3 FT_mod = 6 PKNL = 1 PHC0 = 0 PHC1 = 0 SI = 128K 
       data hash MD5: 128K
       32 1B 72 00 71 5B 49 80 29 23 A6 6A A9 13 D2 4F>)
(   3,<2012-12-05 00:52:44.755 -0500>,<Administrator>,<X>,<proc1d>,<TOPSPIN 2.1>,
      <pk PHC0 = -80.95276 PHC1 = 0 
       data hash MD5: 128K
       E8 89 08 6E B6 BC 6E 5A 53 44 6C 07 8B 23 8C 2D>)
(   4,<2012-12-05 00:52:45.505 -0500>,<Administrator>,<X>,<proc1d>,<TOPSPIN 2.1>,
      <abs ABSG = 1 
       data hash MD5: 128K
       25 41 EC EE 92 FF 48 D0 B7 D8 81 E3 71 2F 0A A7>)
(   5,<2012-12-05 00:52:45.708 -0500>,<Administrator>,<X>,<proc1d>,<TOPSPIN 2.1>,
      <abs ABSG = 2 
       data hash MD5: 128K
       0E 27 D0 84 1F FF C7 9F 9D 2F D1 C9 94 3A A3 B7>)
(   6,<2012-12-05 00:52:45.896 -0500>,<Administrator>,<X>,<proc1d>,<TOPSPIN 2.1>,
      <abs ABSG = 3 
       data hash MD5: 128K
       32 FC 92 52 9B 14 B3 89 D3 66 E3 7F 83 5A F4 D4>)
(   7,<2012-12-05 00:52:46.068 -0500>,<Administrator>,<X>,<proc1d>,<TOPSPIN 2.1>,
      <abs ABSG = 4 
       data hash MD5: 128K
       47 44 D8 D5 AA 46 D1 FC DA 1C F4 FC 3F F2 47 A9>)
(   8,<2012-12-05 00:52:46.240 -0500>,<Administrator>,<X>,<proc1d>,<TOPSPIN 2.1>,
      <abs ABSG = 5 
       data hash MD5: 128K
       F5 67 49 DE 36 11 A7 61 2B EE FE 3F 74 7F 5B 2E>)
$$ ##END=
$$ 
$$ $$ hash MD5
$$ $$ CC 80 D0 5C 07 4D 1C 13 69 AC 48 2F 5D BF 05 D2
##$RELAX= 
##$RELAX= 
##$RELAX= 
##$RELAX= 
##$RELAX= 
##$RELAX= 
##$RELAX= 
##$RELAX= 
$$ Bruker specific parameters
$$ --------------------------
##$DU= <E:\>
##$EXPNO= 12
$$ [...]
##$TP07= 0
##$TPNAME0= <>
##$TPNAME1= <>
##$TPNAME2= <>
##$TPNAME3= <>
##$TPNAME4= <>
##$TPNAME5= <>
##$TPNAME6= <>
##$TPNAME7= <>
##$TPOAL= (0..7)
0.5 0.5 0.5 0.5 0.5 0.5 0.5 0.5
##$TPOFFS= (0..7)
0 0 0 0 0 0 0 0
##$TUNHIN= 0
##$TUNHOUT= 0
##$TUNXOUT= 0
##$USERA1= <user>
##$USERA2= <user>
##$USERA3= <user>
##$USERA4= <user>
##$USERA5= <user>
##$V9= 5
##$VALIST= <valist>
##$VCLIST= <CCCCCCCCCCCCCCC>
##$VD= 0
##$VDLIST= <DDDDDDDDDDDDDDD>
##$VPLIST= <PPPPPPPPPPPPPPP>
##$VTLIST= <TTTTTTTTTTTTTTT>
##$WBST= 2048
##$WBSW= 25
##$XGAIN= (0..3)
0 0 0 0
##$XL= 0
##$YL= 0
##$YMAX_a= 5977530
##$YMIN_a= -12406772
##$ZGOPTNS= <>
##$ZL1= 120
##$ZL2= 120
##$ZL3= 120
##$ZL4= 120
##$ABSF1= 14.96093
##$ABSF2= -5.597252
##$ABSG= 5
##$ABSL= 3
##$ALPHA= 0
##$AQORDER= 0
##$ASSFAC= 0
##$ASSFACI= 0
##$ASSFACX= 0
##$ASSWID= 0
##$AUNMP= <proc_prof1d_extract.lims>
##$AXLEFT= 0
##$AXNAME= <>
##$AXNUC= <1H>
##$AXRIGHT= 0
##$AXTYPE= 0
##$AXUNIT= <>
##$AZFE= 0.1
##$AZFW= 0.1
##$BCFW= 0
##$BC_mod= 0
##$BYTORDP= 0
##$COROFFS= 0
##$CY= 15
##$DATMOD= 1
##$DC= 0
##$DFILT= <>
##$DTYPP= 0
##$F1P= 0
##$F2P= 0
##$FCOR= 0.5
##$FTSIZE= 131072
##$FT_mod= 6
##$GAMMA= 0
##$GB= 0
##$INTBC= 1
##$INTSCL= 1
##$ISEN= 128
##$LB= 0.3
##$LEV0= 0
##$LPBIN= 0
##$MAXI= 10000
##$MC2= 0
##$MEAN= 0
##$ME_mod= 0
##$MI= 0
##$NCOEF= 0
##$NC_proc= -2
##$NLEV= 6
##$NOISF1= 0
##$NOISF2= 0
##$NSP= 0
##$NTH_PI= 0
##$NZP= 0
##$OFFSET= 14.96093
##$PC= 1
##$PHC0= -80.95276
##$PHC1= 0
##$PH_mod= 1
##$PKNL= yes
##$PPARMOD= 0
##$PPDIAG= 0
##$PPIPTYP= 0
##$PPMPNUM= 2147483647
##$PPRESOL= 1
##$PSCAL= 4
##$PSIGN= 0
##$PYNMP= <proc.py>
##$REVERSE= no
##$SF= 400.020009665164
##$SI= 131072
##$SIGF1= 0
##$SIGF2= 0
##$SINO= 400
##$SIOLD= 131072
##$SPECTYP= <>
##$SREGLST= <1H.CDCl3>
##$SSB= 0
##$STSI= 131072
##$STSR= 0
##$SW_p= 8223.68421052631
##$SYMM= 0
##$S_DEV= 0
##$TDeff= 65536
##$TDoff= 0
##$TI= <>
##$TILT= no
##$TM1= 0
##$TM2= 0
##$TOPLEV= 0
##$USERP1= <user>
##$USERP2= <user>
##$USERP3= <user>
##$USERP4= <user>
##$USERP5= <user>
##$WDW= 1
##$XDIM= 131072
##$YMAX_p= 431881256
##$YMIN_p= -12737
##$CURPLOT= <Network HP LaserJet P1505>
##$CURPRIN= <$Network HP LaserJet P1505>
##$DFORMAT= <normdp>
##$LAYOUT= <+/1D_H.xwp>
##$LFORMAT= <normlp>
##$PFORMAT= <normpl>
##$SURQMSG= 1
$$ End of Bruker specific parameters
$$ ---------------------------------
##NTUPLES= NMR SPECTRUM
##VAR_NAME=  FREQUENCY,     SPECTRUM/REAL,   SPECTRUM/IMAG
##SYMBOL=    X,             R,               I
##VAR_TYPE=  INDEPENDENT,   DEPENDENT,       DEPENDENT
##VAR_FORM=  AFFN,          ASDF,            ASDF
##VAR_DIM=   131072,        131072,          131072
##UNITS=     HZ,            ARBITRARY UNITS, ARBITRARY UNITS
##FACTOR=    0.0627417313425164, 1,          1
##FIRST=     8223.62146879497, 2993,         -61563
##LAST=      0,             5119,            -61480
##MIN=       0,             -12737,          0
##MAX=       8223.62146879497, 431881256,    0
$$ Real data points
##PAGE= N=1
##DATA TABLE= (X++(R..R)), XYDATA
$$ [...]
63952G79445N2243N9661O8654P9507R1957J05405J19540J34484J50056J65238
63942A806190J78857J90561K00587K08769K14420K17085K16673K12755K04396
63933C650293J90962J72628J49891J23217R3429O1919K9924k189l4631o7281r9256
63922D268906j29101j55187j76277j92041k02981k09683k12356k11104k06279
63913B573897j98347j87661j74697j60315j45523j31078j17373j04508r2342q0806
63903A181247p0269o1276n3802m7161m0950l5620l1697k8865k6327k3849k1760
63892G39671k0113j8484j6794j5645j5501j5853j5657j4437j2675j0996r388p388
63880E66740m923k532o22J159L473O367R174J1344J2956J4394J5858J7354J8845
$$ plain form
63952 779445 831688 891349 960003 1039510 1131467 1236872 1356412 1490896 1640952 1806190
63942 1806190 1985047 2175608 2376195 2584964 2799384 3016469 3233142 3445897 3650293
63933 3650293 3841255 4013883 4163774 4286991 4380420 4442339 4472263 4470074 4435443 4368162 4268906
63922 4268906 4139805 3984618 3808341 3616300 3413319 3203636 2991280 2780176 2573897
63913 2573897 2375550 2187889 2013192 1852877 1707354 1576276 1458903 1354395 1262053 1181247
63903 1181247 1110978 1049702 995900 948739 907789 872169 840472 811607 785280 761431 739671
63892 739671 719558 701074 684280 668635 653134 637281 621624 607187 594512 583516 574128 566740
63880 566740 561817 559285 558663 559822 563295 569662 578836 590180 603136 617530 633388 650742 669587
63867F69587K0281K1556K2575K3137K2936K1946K0677J9665J8732J7243J5014
63856H93349J2364R405O023K606j26k337n108q843j2463j4909j6521j8153j9726
63843H25561k0767k1732k3515k5885k7635k8215k8184k8007k7508k6685k6019
63832E41409k5584k4702k2934k0749j8815j7213j5738j4497j3712j3254j2709
63821C41502j1749j0322q735p548p067o942o561n810m961m071l099k446k611l235
63807B56345l389k842k234j842j235n21p05k120l462l357k194j380j382j537j496
63792B26649j639k131k526k449k018j451q87o43r63j492j610j309j166j353j394
63777B03618j058p85q95j007o29J07O68P79M25k95j011j059j88R57J499J299Q58
$$ plain form
63867 669587 689868 711424 733999 757136 780072 802018 822695 842360 861092 878335 893349
63856 893349 905713 915118 921141 923747 923621 921284 916176 907333 894870 879961 863440 845287 825561
63843 825561 804794 783062 759547 733662 706027 677812 649628 621621 594113 567428 541409
63832 541409 515825 491123 468189 447440 428625 411412 395674 381177 367465 354211 341502
63821 341502 329753 319431 310696 303148 296081 289139 282578 276768 271807 267736 264637 262191 259580 256345
63807 256345 252956 250114 247880 246038 244803 244282 243577 241457 237995 234638 232444 231064 229682 228145 226649
63792 226649 225010 222879 220353 217904 215886 214435 213548 212905 211942 210450 208840 207531 206365 205012 203618
63777 203618 202560 201775 200880 199873 199244 199351 200019 200798 201223 200928 199917 198858 198670 199627 201126 202425 203283
63760B03283L90l45j338j975j695p32J04K07l46r39r32k08P38J299J399J501J922
63743B02333K408K559K333J960J522J007O58Q88J693K480K641K227J871K092K729
63728B31401L108K778K098J887K491L348L672L333K792K436K392K813L708M428
63714B72685M017K344L82r38j664k250k648k538k100j905k111k332k211j752j127
63699B55852n96m40n76m12M78J656K386K648K987L451L495L007K638K795K999
63684B82368K631J831J194J010J165J462J597J190K24p47j155r71m84K03J074
63669B92592J900K375K449K238J752J058M44J05k12q79j807k573l019l421m052
63654B88950m852n492n556m835l679k916l024l434l058j583J28J037J000N94K61
$$ plain form
63760 203283 203673 203328 201990 200015 198320 197588 197692 197899 197553 196614 195682 195474 196212 197511 198910 200411 202333
63743 202333 204741 207300 209633 211593 213115 214122 214780 215668 217361 219841 222482 224709 226580 228672 231401
63728 231401 234509 237287 239385 241272 243763 247111 250783 254116 256908 259344 261736 264549 268257 272685
63714 272685 276702 279046 279428 278490 276826 274576 271928 269390 267290 265385 263274 260942 258731 256979 255852
63699 255852 255256 254816 254240 253828 254306 255962 258348 260996 263983 267434 270929 273936 276574 279369 282368
63684 282368 284999 286830 288024 289034 290199 291661 293258 294448 294672 293925 292770 291799 291315 291518 292592
63669 292592 294492 296867 299316 301554 303306 304364 304808 304913 304701 303822 302015 299442 296423 293002 288950
63654 288950 284098 278606 273050 268215 264536 261620 258596 255162 252104 250521 250649 251686 252686 253280 253541
63639B53541J5l6N50J966L528M168L687L100L411M426N205N464N775O405O810
63624C08015O640O559P367Q808R941J0517J1261J2837J5122J7566J9723K1327
63612D55683K2404K3459K5133K7361K9294L0232L0299K9968K9248K7696K4922
63601G55699K0730J5073Q418J984k884n751p157p731p670p169o867p473r188j1773
63587G28241j4951j8423k1631k3940k5052k5018k3962k2087j9950j8203j6949
63576D98075j5658j3931j2055j0489r064p097m347j491N01J446K234L906O482
63563D38512Q836R864R543Q738Q232Q364R277J0865J2577J3925J5278J7418K0279
63550E91708K3016K5525K8843L3341L7560L9719L9595L7849L4182K7607J8376
$$ plain form
63639 253541 253556 253520 254070 256036 259564 263732 267419 270519 273930 278356 283561 289025 294800 301205 308015
63624 308015 314655 321214 328581 337389 347330 357847 369108 381945 397067 414633 434356 455683
63612 455683 478087 501546 526679 554040 583334 613566 643865 673833 703081 730777 755699
63601 755699 776429 791502 799920 801904 799020 793269 786112 778381 770711 763542 756675 749202 740014 728241
63587 728241 713290 694867 673236 649296 624244 599226 575264 553177 533227 515024 498075
63576 498075 482417 468486 456431 445942 436878 429781 425434 423943 424444 425890 428124 432030 438512
63563 438512 447348 457212 466755 475493 483725 492089 501366 512231 524808 538733 554011 571429 591708
63550 591708 614724 640249 669092 702433 739993 779712 819307 857156 891338 918945 937321
63539I37321Q321p69q060j3003j5110j4748j3124j1070q715o577n911p393j0274
63526H30888j3493j6900k0769k4808k8315l0859l2274l2410l1457l0030k8468
63515E41105k6487k3949k1460j9558j7895j5835j3534j1740j0759j0209r635q916
63503C51128q120p311o430n250l731k479k252k872l280k969k505k300j744l88
63489B99497R28J125N14K94Q33J511J977K461K919K959K696K816L550M284M386
63474C32750L832K957K074J390Q15p4j450k813l638m178m929n573n319m209l198
63459C08437k860k811k491j837j005j24N70R08J183J832K784L678M579N722O730
63444C25295P036P115Q171J0368J2451J3580J4591J6822K0337K3972K6641K7945
$$ plain form
63539 937321 945642 944873 936813 923810 908700 893952 880828 869758 861043 854466 848555 841162 830888
63526 830888 817395 800495 779726 754918 726603 695744 663470 631060 599603 569573 541105
63515 541105 514618 490669 469209 449651 431756 415921 402387 390647 379888 369679 360044 351128
63503 351128 343008 335697 329267 324017 320286 317807 315555 312683 309403 306434 303929 301629 299885 299497
63489 299497 300425 301550 302064 302358 303191 304702 306679 309140 312059 315018 317714 320530 324080 328364 332750
63474 332750 336582 339539 341613 343003 343818 343744 342294 339481 335843 331665 326736 321163 315844 311635 308437
63459 308437 305577 302766 300275 298438 297433 297309 297879 298787 299970 301802 304586 308264 312843 318565 325295
63444 325295 332331 339446 347617 357985 370436 384016 398607 415429 435766 459738 486379 514324
63432E14324K7896K6605K4150K0551J6098J1657Q149N749M155L660N162Q885J3933
63419F90974J9323K4744K9904L4059L6658L7829L7646L5587L1267K5126J7984
63408A021101J0473L371k349o378r300j1367j1933j0876r758j0418j2985j6333
63396I33248j9977k4203k8568l1754l3093l3192l2881l2368l1629l0661k9098
63385F05824k6378k2698j9103j6310j4079j1970j0044q395o711m747k786j112
63373D61491M97K294M024N408O846Q961J1632J4046J5695J6856J8044J9502K1324
63360F06620K3612K6281K8950L1285L3296L5074L6335L6484L5100L2171K7885
63349I53093K2403J5987R172K686k797o854r393j0741j1467j1986j2306j2401
$$ plain form
63432 514324 542220 568825 592975 613526 629624 641281 649430 655179 659334 662994 668156 677041 690974
63419 690974 710297 735041 764945 799004 835662 873491 911137 946724 977991 1003117 1021101
63408 1021101 1031574 1034945 1032596 1026218 1016918 1005551 993618 982742 972984 962566 949581 933248
63396 933248 913271 889068 860500 828746 795653 762461 729580 697212 665583 634922 605824
63385 605824 579446 556748 537645 521335 507256 495286 485242 476847 470136 465389 462603 461491
63373 461491 461988 464282 468306 473714 480560 489521 501153 515199 530894 547750 565794 585296 606620
63360 606620 630232 656513 685463 716748 750044 785118 821453 857937 893037 925208 953093
63349 953093 975496 991483 1000655 1003341 1000544 993690 984297 973556 962089 950103 937797 925396
63337I25396j2692j3986j6806k0951k5606k9721l2345l3042l2164l0576k8819
63326F48688k6654k3567j9595j5464j1959r279p099n234m110m459o498r593j2823
63313D92354j5630j7722j8626j7925j5935j3699j2085j1074j0124q865p404o073
63301C37192n071m299l502k682k222k353k661k524j968j630j808k113k144k051
63287C00164k110k182j906j260o29m54q79j549j811j380p57n89p53n69N4M12R1
63270B83893l93l90J15Q15J532J966J704R72P32J416K204K224J845J999K669L067
63254C06370L004L080L595M146M436M626M813M815M705M977N891P080Q036Q675
63240C78249R326J0359J1894J3625J5054J6048J6960J7978J8764J9113J9556K0573
$$ plain form
63337 925396 912704 898718 881912 860961 835355 805634 773289 740247 708083 677507 648688
63326 648688 622034 598467 578872 563408 551449 542170 535071 529837 525727 521268 514770 505177 492354
63313 492354 476724 459002 440376 422451 406516 392817 380732 369658 359534 350669 343265 337192
63301 337192 332121 327822 324320 321638 319416 317063 314402 311878 309910 308280 306472 304359 302215 300164
63287 300164 298054 295872 293966 292706 292077 291623 290744 289195 287384 286004 285247 284658 283905 283336 283390 283802 283893
63270 283893 283500 283110 283225 284040 285572 287538 289242 290214 290946 292362 294566 296790 298635 300634 303303 306370
63254 306370 309374 312454 316049 320195 324631 329257 334070 338885 343590 348567 354458 361538 369574 378249
63240 378249 387575 397934 409828 423453 438507 454555 471515 489493 508257 527370 546926 567499
63228E67499K1624K1773K1020K0221J9768J9340J8914J9038J9827K0564K0739
63217G90327K0689K0848K0919K0349J9020J7045J4303J0622O172J320l613q282
63205I29719j2429j6165j9720k2812k4844k5856k6539k7019k6414k4116k0824
63194F82981j7573j4478j1157p817m904k093J297M993P932R777J1329J3165J4883
63181F88335J6059J7138J8692K0348K1197K0990K0324J9788J9446J9118J8708
63170I00143J8114J7236J6147J5004J3644J1536Q259L859j357p038j2657j7537
63158I65353k1432k4922k8656l2151l3967l3419l1594l0219k9714k9024k7220
63147F43035k4640k2234k0326j8493j6385j4239j2502j1276j0250r099p806o626
$$ plain form
63228 567499 589123 610896 631916 652137 671905 691245 710159 729197 749024 769588 790327
63217 790327 811016 831864 852783 873132 892152 909197 923500 934122 940294 941614 938001 929719
63205 929719 917290 901125 881405 858593 833749 807893 781354 754335 727921 703805 682981
63194 682981 665408 650930 639773 631956 627052 624959 626256 631249 639181 648958 660287 673452 688335
63181 688335 704394 721532 740224 760572 781769 802759 823083 842871 862317 881435 900143
63170 900143 918257 935493 951640 966644 980288 991824 1000083 1003942 1002585 995547 982890 965353
63158 965353 943921 918999 890343 858192 824225 790806 759212 728993 699279 670255 643035
63147 643035 618395 596161 575835 557342 540957 526718 514216 502940 492690 483591 475785 469159
63135D69159n768n241m939m722m339l503k235r94k06K28P15J371J986K482L043
63120D47037L700M194M325M208M037L917L906L953L754L063K200J826K060K317
63106D94497K222K183K634L221L276K766K183J747J352J122J296J541J087j68
63092E20959j336j609j157o45k63J98O39O05k7o86o52K68J569K527K854K973L524
63075E29741M566N394N394M794M385M695N694P137Q750J0206J1354J2469J3830
63062F28409J5163J6056J6899J8663K1449K4095K5759K7172K9540L2766L5764
63051H91735L8196M0770M3758M6381M8057M9274N0611N1625N1442N0062M8383
63040A410294M7170M6568M6454M6696M7117M7510M7682M7308M5967M3602M0593
$$ plain form
63135 469159 463391 458150 453211 448489 444150 440647 438412 437418 437212 437440 438155 439526 441512 443994 447037
63120 447037 450737 454931 459256 463464 467501 471418 475324 479277 483031 486094 488294 490120 492180 494497
63106 494497 496719 498902 501536 504757 508033 510799 512982 514729 516081 517203 518499 520040 521127 520959
63092 520959 519623 518014 516857 516212 515949 516147 516786 517391 517364 516678 516026 516294 517863 520390 523244 526217 529741
63075 529741 534307 539701 545095 549889 554274 558969 564663 571800 580550 590756 602110 614579 628409
63062 628409 643572 659628 676527 695190 716639 740734 766493 793665 823205 855971 891735
63051 891735 929931 970701 1014459 1060840 1108897 1158171 1208782 1260407 1311849 1361911 1410294
63040 1410294 1457464 1504032 1550486 1597182 1644299 1691809 1739491 1786799 1832766 1876368 1916961
63029A916961L6976L1950K4644J5270M963n423j5891k6604l7166m6645n4137n9201
63017A785697o1993o2984o2428o0264n6598n2024m7069m1662l5502k8725k1708
63006A254740j4529p160n5O137J1409J6360K1193K5417K8572L0748L2240L3271
62994A438343L4147L5213L6263L6636L6079L5115L4256L3331L1891K9857K7244
62983A808375K3606J8332J1359L251n357j4094k2748l1195l9455m7488n4824o0579
62971A589183o4058o5324o5079o3912o1806n8534n4401n0169m6182m2088l7777
62960I79853l4023l1587l0023k8233k5993k4099k2960k1953k0513j9005j8062
62949G03402j7650j7296j6807j6193j5315j4096j2859j1936j1176j0258r297q698
$$ plain form
63029 1916961 1953937 1985887 2010531 2025801 2030764 2025341 2009450 1982846 1945680 1899035 1844898 1785697
63017 1785697 1723704 1660720 1598292 1538028 1481430 1429406 1382337 1340675 1305173 1276448 1254740
63006 1254740 1240211 1233051 1232996 1239133 1250542 1266902 1288095 1313512 1342084 1372832 1405072 1438343
62994 1438343 1472490 1507703 1543966 1580602 1616681 1651796 1686052 1719383 1751274 1781131 1808375
62983 1808375 1831981 1850313 1861672 1864923 1859566 1845472 1822724 1791529 1752074 1704586 1649762 1589183
62971 1589183 1525125 1459801 1394722 1330810 1269004 1210470 1156069 1105900 1059718 1017630 979853
62960 979853 945830 914243 884220 855987 829994 805895 782935 760982 740469 721464 703402
62949 703402 685752 668456 651649 635456 620141 606045 593186 581250 570074 559816 550519 541821
62937E41821q488q217p506o478n564n071m911m695m130l304k493j840j437j479
62923D76208j945k289k044j587j600j869j473l80K48k75j134j344j208j553k202
62908D55553k318j830j508j689k008k274k747l351l416k508j006L28R84R20N92
62893D33722P38J657K656K715J737O22Q4n0k70o79j100j457j735j834j620j025
62877D34161m9J079J823J725R06m6o67q87q02o41p96j481k342k779k650k240j643
62860D22671p07M01J121J141P01J80j66n9O67J638K175K129J996K062J996J533
62844D39479R66O06K82k47p44q46n99k86m0j0m66j305j833j487n72K78R74J737
62826D35887K319K196J470Q06M62N7n49q48m73K30Q20J440K360L278L615L409
$$ plain form
62937 541821 533333 525116 517610 511132 505568 500497 495586 490891 486761 483457 480964 479124 477687 476208
62923 476208 474263 471974 469930 468343 466743 464874 463401 463021 463269 462994 461860 460516 459308 457755 455553
62908 455553 453235 451405 449897 448208 446200 443926 441179 437828 434412 431904 430898 431226 432210 433130 433722
62893 433722 434460 436117 438773 441488 443225 443847 443931 443881 443611 442932 441832 440375 438640 436806 435186 434161
62877 434161 434112 435191 437014 438739 439645 439599 438932 438045 437243 436602 435806 434325 431983 429204 426554 424314 422671
62860 422671 421964 422365 423486 424627 425328 425508 425342 425283 425950 427588 429763 431892 433888 435950 437946 439479
62844 439479 440445 441051 441333 441086 440342 439496 438897 438611 438571 438561 438095 436790 434957 433470 432898 433176 434150 435887
62826 435887 438206 440402 441872 442678 443140 443197 442648 441800 441327 441557 442377 443817 446177 449455 453070 456479
62810D56479L319L749M381M661M463M126M071M524N467O626P605Q107Q119P941
62796E33638Q066Q895J0426J2248J3988J5681J7496J9318K0985K2871K5762K9930
62784G39304L4705L9338M3882M8817N4087N9075O3550O7942P2484P6600P9491
62773A379275Q1006Q1461Q0710P7865P2041O3207N2188M0005K7210J3814k47j4581
62761A953954k8242m0161m9728n7081o2936o8028p2493p5766p7124p6375p4000
62750A272020p0681o6857o2637n8072n3365m8923m5065m1703l8486l5275l2246
62739G18710k9393k6348k3035k0031j7800j5868j3477j0821q849p833o996n689
62727E32570m198l037k226j621j318j260r70j55R15K011L454N472P602R264J0558
$$ plain form
62810 456479 459798 463547 467928 472589 477052 481178 485249 489773 495240 501866 509471 517578 525697 533638
62796 533638 541704 550599 561025 573273 587261 602942 620438 639756 660741 683612 709374 739304
62784 739304 774009 813347 857229 906046 960133 1019208 1082758 1150700 1223184 1299784 1379275
62773 1379275 1460281 1541742 1622452 1700317 1772358 1835565 1887753 1927758 1954968 1968782 1968535 1953954
62761 1953954 1925712 1885551 1835823 1778742 1715806 1647778 1575285 1499519 1422395 1346020 1272020
62750 1272020 1201339 1134482 1071845 1013773 960408 911485 866420 824717 786231 750956 718710
62739 718710 689317 662969 639934 619903 602103 586235 572758 561937 553088 545255 538259 532570
62727 532570 528372 525335 523109 521488 520170 518910 517940 517785 518700 520711 524165 529637 537239 546503 557061
62712E57061J1944J3546J5267J7185J9299K1271K2990K5082K8219L2306L6834
62701H01004M1672M6809N1771N6101O0079O4200O8163P1272P3539P5464P6761
62690A486835P6256P3061O7123N8710M8222L6427K3989J0694l883j8883l2430
62679A826121m3545n2850o1047o7732p2257p4795p5922p5795p4367p1776o8131
62668A087904o3439n8180n3250m8876m4356l9379l4849l1662k9356k6831k3888
62657F33838k1207j9155j7549j6298j5431j4573j3189j1434j0044r324q796p999
62645D68839p075o438o135n802n072l988l044k700k770k564j756q11k81j01O5
62630D20367J35j84p76j169j165r60p70o21m96k92J47P56J189J369J755K681L731
$$ plain form
62712 557061 569005 582551 597818 615003 634302 655573 678563 703645 731864 764170 801004
62701 801004 842676 889485 941256 997357 1057436 1121636 1189799 1261071 1334610 1410074 1486835
62690 1486835 1563091 1636152 1703275 1761985 1810207 1846634 1870623 1881317 1877434 1858551 1826121
62679 1826121 1782576 1729726 1668679 1600947 1528690 1453895 1377973 1302178 1227811 1156035 1087904
62668 1087904 1024465 966285 913035 864159 819803 780424 745575 713913 684557 657726 633838
62657 633838 612631 593476 575927 559629 544198 529625 516436 505002 494958 485634 476838 468839
62645 468839 461764 455326 449191 443389 438317 434329 431285 428585 425815 423251 421495 420684 420403 420302 420367
62630 420367 420502 420318 419542 418373 417208 416248 415478 414857 414361 414069 414216 414972 416161 417530 419285 421966 425697
62613D25697M268M332M413M563M441M140M287N166O422P728R164J0705J1983J2893
62599E20202J4008J5957J8715K1852K5197K8876L2755L6298L8958M0518M1021
62588H34357M0536L9089L6708L3442K9267K4024J7581J0086K057n874j3224j9672
62576A028377k4945k8952l1893l4053l5480l6035l5754l4995l4101l3080l1618
62565F67471k9468k6796k4125k1909k0117j8327j6202j3817j1583r964r187r011
62553D56965q786p988o710n387m182k993k042j856k439k973k681j651m96M58J262
62538D08501J965K503K785K523J375l60j484r80Q81K952M498N574O307O643O881
62523D50564P741R552J1830J3974J6018J8464K1569K5036K8308L1014L3251L5508
$$ plain form
62613 425697 429965 434297 438710 443273 447714 451854 456141 461307 467729 475457 484621 495326 507309 520202
62599 520202 534210 550167 568882 590734 615931 644807 677562 713860 752818 793336 834357
62588 834357 874893 913982 950690 984132 1013399 1037423 1055004 1065090 1067147 1061273 1048049 1028377
62576 1028377 1003432 974480 942587 908534 873054 837019 801265 766270 732169 699089 667471
62565 667471 638003 611207 587082 565173 545056 526729 510527 496710 485127 475163 465976 456965
62553 456965 448179 440191 433481 428094 423912 420919 418877 417021 414582 411609 408928 407277 406781 407239 408501
62538 408501 410466 412969 415754 418277 419652 419292 417808 416828 417709 420661 425159 430733 437040 443683 450564
62523 450564 458305 467857 479687 493661 509679 528143 549712 574748 603056 634070 667321 702829
62511G02829L8192M1126M3627M5006M4957M3538M0965L7376L2628K6470J9105
62500A115819J1465M530j582p498j3506j8945k2848k4959k5823k5926k5159k3217
62488I42351k0318j7063j3560r219l794J799O433J0213J4086J8083K1014K2237
62476I72262K2535K2498K1182J7452J1983O596J991k659q044j3884j9790k5667
62464A006455l1053l5034l7273l8302l8536l7872l6493l5120l3947l2184k9274
62453F21367k5834k2790k0162j7365j4305j1421q997o985n363m134l081j932o37
62440D78361P13K039L170L955M572N327N977N736M291K281M36j181k753m122n134
62425E03668o029o915p420p452p670q475r058q386o817n702n577n685n289m550
$$ plain form
62511 702829 741021 782147 825774 870780 915737 959275 1000240 1037616 1070244 1096714 1115819
62500 1115819 1127284 1131814 1130232 1122734 1109228 1090283 1067435 1042476 1016653 990727 965568 942351
62488 942351 922033 904970 891410 882191 878397 880196 886629 896842 910928 929011 950025 972262
62476 972262 994797 1017295 1038477 1055929 1067912 1074508 1076499 1073840 1065796 1051912 1032122 1006455
62464 1006455 975402 940368 903095 864793 826257 788385 751892 716772 682825 650641 621367
62453 621367 595533 572743 552581 535216 520911 509490 500493 493508 488145 484011 480930 478998 478361
62440 478361 479074 481113 484283 488238 492810 498137 504114 509850 514141 516422 516858 515677 512924 508802 503668
62425 503668 497639 490724 483304 475852 468182 459707 450649 442263 435446 429744 424167 418482 413193 408643
62411D08643l935l596l492l469l115k199j272j158j704j899j344p32n83m24K12
62396C79933Q61R39P94J095J658J781J460J427K035K890L587M095M331M090L571
62381D14547L436M004M891N657O316O943P241P042O861P401Q632R849J0660J1402
62367E14882J2512J3907J5265J6548J8050K0064K2780K6387L0904L5933M0859
62356G68091M5356M9538N3420N6469N7862N7184N4664N0692M5348L8516L0421
62345A307561K1754J3240N170k488r737j6448k2533k7957l2616l6382l9285m1366
62333A118913m2332m1694l9462l6406l3377l0548k7601k4470k1531j9216j7706
62322G84570j6972j6742j6526j6068j5784j6342j7712j9017j9455j9025j8211
$$ plain form
62411 408643 404708 401112 397620 394151 391036 388837 387565 386407 384703 382804 381460 380728 380145 379721 379933
62396 379933 380794 381733 382527 383622 385280 387061 388521 389948 391983 394873 398460 402555 406886 410976 414547
62381 414547 417983 421987 426878 432535 438851 445794 453035 460077 466938 474339 482971 492820 503480 514882
62367 514882 527394 541301 556566 573114 591164 611228 634008 660395 691299 727232 768091
62356 768091 813447 862985 916405 972874 1030736 1087920 1142584 1193276 1238624 1277140 1307561
62345 1307561 1329315 1342555 1347725 1345237 1335500 1319052 1296519 1268562 1235946 1199564 1160279 1118913
62333 1118913 1076581 1034887 995425 959019 925642 895094 867493 843023 821492 802276 784570
62322 784570 767598 750856 734330 718262 702478 686136 668424 649407 629952 610927 592716
62311E92716j7321j6352j5240j3950j2550j1306j0460r784q710p174n882n417
62299D58570n376m894l785k621j768r41K20J611K833L567L601K918J960J478J855
62284D59228K690L347L727M249N145O052O376N974N377N410O462Q137R576J0269
62270E42019J0498J1007J2263J4133J6222J8376K0743K3416K6260K9164L2326
62259G56427L6048M0223M4285M7810N0968N4168N7310N9655O0406N9185N5872
62248A322357N0271M2311L2544K2152J2232L140n358j3363k0606k6923l2717l8600
62236A347440m4685n0424n5124n8312n9720n9217n6967n3388m8912m3904l8886
62225G77901l4414l0624k7221k4082k1444j9236j6836j3942j1325r931r547r154
$$ plain form
62311 592716 575395 559043 543803 529853 517303 505997 495537 485753 477043 469869 463987 458570
62299 458570 453194 448300 444515 441894 440126 439185 439405 441016 443849 447416 451017 453935 455895 457373 459228
62284 459228 461918 465265 468992 473241 478386 484438 490814 496788 502165 507575 514037 522174 531750 542019
62270 542019 552517 563524 575787 589920 606142 624518 645261 668677 694937 724101 756427
62259 756427 792475 832698 876983 924793 975761 1029929 1087239 1146894 1207300 1266485 1322357
62248 1322357 1372628 1414939 1447483 1469635 1481867 1485007 1479649 1466286 1445680 1418757 1386040 1347440
62236 1347440 1302755 1252331 1197207 1138895 1079175 1019958 962991 909603 860691 816787 777901
62225 777901 743487 712863 685642 661560 640116 620880 604044 590102 578777 568846 559299 550145
62213E50145q483q215q459q157o544m414l033k448j761p64j95l76o03k05N28R35
62197D97951R96J236K008L250M685N908O532O660O958P923R235J0233J0817J1384
62183E85776J1986J2129J1495J0421R427Q649P927P190O539O134O178O869Q270
62170F98990J0302J2927J6174J9933K3985K8223L2611L6870M0445M2864M3866
62159A007190M3154M0431L5826K9949K3323J6215R103K798k362o954j1598j6028
62147A171047j9675k2785k6183l0027l3437l5424l5612l4079l1182k7633k4120
62136H50890k0720j7198j3903j1580j0177q691o654m941m437m528l817j995j22
62123G42127Q69J173J590K608M130N571O040M948K708N41o43r39r22q40o79p50
$$ plain form
62213 550145 541662 533447 524988 516831 510287 505873 502840 500392 498631 497867 497672 497296 496693 496488 497016 497951
62197 497951 498947 500183 502191 505441 510126 516034 522566 529226 536184 544107 553342 563575 574392 585776
62183 585776 597762 609891 621386 631807 641234 649883 657810 665000 671539 677673 683851 690720 698990
62170 698990 709292 722219 738393 758326 782311 810534 843145 880015 920460 963324 1007190
62159 1007190 1050344 1090775 1126601 1156550 1179873 1196088 1205191 1207989 1205627 1198673 1187075 1171047
62147 1171047 1151372 1128587 1102404 1072377 1038940 1003516 967904 933825 902643 875010 850890
62136 850890 830170 812972 799069 787489 777312 768621 761967 757026 752589 748061 744244 742249 742127
62123 742127 742996 744169 745759 748367 752497 758068 764108 769056 771764 772305 771662 770723 769801 768961 768282 767532
62107G67532j712l855o659r331j1573j3495j4823j4747j2895j0105p674n928m150
62094F50585j961J3J183K027L411N219O449O520N950N617N903O665P627Q571R449
62079G23228J0413J1631J3053J4541J6123J7825J9359K0371K0979K1668K2590
62068I11781K3419K4008K4655K5526K6292K6712K7230K8459L0193L1323L0690
62057A210288K7770K2731J6361R870M265m04m823r320j3408j6736k0042k4430
62045A202122k9742l4428l7330l8974m0519m1965m2233m0957l9129l7671l6212
62034G82962l3968l1183k8800k6973k4854k1974j8958j6535j4545j2467j0470
62023E42235r262r036r167q976q392p765p377p267p276p158o797o399o240o082
$$ plain form
62107 767532 765820 761965 755306 745975 734402 720907 706084 691337 678442 668337 660663 654735 650585
62094 650585 648624 648637 649820 651847 655258 660477 666926 673446 679396 685013 690916 697581 705208 713779 723228
62079 723228 733641 745272 758325 772866 788989 806814 826173 846544 867523 889191 911781
62068 911781 935200 959208 983863 1009389 1035681 1062393 1089623 1118082 1148275 1179598 1210288
62057 1210288 1238058 1260789 1277150 1287020 1291285 1290881 1286058 1276738 1263330 1246594 1226552 1202122
62045 1202122 1172380 1137952 1100622 1061648 1021129 979164 936931 895974 856845 819174 782962
62034 782962 748994 717811 689011 662038 637184 615210 596252 579717 565172 552705 542235
62023 542235 532973 523937 514770 505794 497402 489637 482260 474993 467717 460559 453762 447363 441123 435041
62009D35041n183l195q20Q05J366J636K383L528M551N312N986O424O257N578M982
61994D74651M677M072K591M96j445k866l887m531m669m545m836n880p159p801
61980D38868p499o703o060n886o073o260o025n118l728k420j680j466j348j144
61966C77458j157j701k529l044k928k282j285q7Q59Q97j9r60q22N13K168L325
61950C68406L960M492N043N276N023M817N548P531J0057J2119J3476J4667J6129
61937D76544J7657J8802J9296J9025J8072J6962J6399J6412J6200J5156J3622
61926F64147J2225J0919R249P154M908K517j75k853m891o057o562o492n789m688
61912F73612l530k096J64L218O320Q985J1409J3743J5530J6173J5541J3799J1078
$$ plain form
62009 435041 429858 426663 425843 426648 428014 429650 432033 435561 440112 445424 451410 457834 464091 469669 474651
61994 474651 479328 483400 485991 486487 485042 482176 478289 473758 469089 464544 459708 453828 446669 438868
61980 438868 431369 424666 418606 412720 406647 400387 394362 389244 385516 383096 381416 379950 378602 377458
61966 377458 376301 374600 372071 369027 366099 363817 362532 362445 363304 364201 364182 363222 362400 362913 365081 368406
61950 368406 372366 376858 381901 387177 392200 397017 402565 410096 420153 432272 445748 460415 476544
61937 476544 494201 513003 532299 551324 569396 586358 602757 619169 635369 650525 664147
61926 664147 676372 687291 696540 703694 708602 711119 710944 708091 703200 697143 690581 684089 678300 673612
61912 673612 670082 667986 668150 671368 677688 686673 698082 711825 727355 743528 759069 772868 783946
61899G83946P578L639m90m624q294j0895j2430j3595j4896j6085j6721j6764j6307
61886F64062j5321j3989j2866j2200j1593j0743j0069j0004j0146r807r132q921
61874E29271r425j0015r983r058p196m577j921k09K76K06L49Q95J727K824M133
61859D87297N465O875Q836J1500J4206J6157J7533J9318K1996K4880K6985K8202
61847F89250K9173L0260L0997L0641K8939K6284K3242K0073J6565J2373P569K804
61835I48170j296m834q323j1604j3590j3386j1315q416n253j722K155N902R038
61822H85526J1384J2879J3480J3176J1759Q693L764k242q121j3449j8559k3359
61810H94931k7049k9226l0400l0936l0386k8425k5807k3618k2044k0565j8940
$$ plain form
61899 783946 791524 795163 794673 790049 781755 770860 758430 744835 729939 713854 697133 680369 664062
61886 664062 648741 634752 621886 609686 598093 587350 577281 567277 557131 547324 538192 529271
61874 529271 519846 509831 499848 490790 483594 479017 477096 476887 477163 477369 477718 478613 480340 483164 487297
61859 487297 492762 499637 508473 519973 534179 550336 567869 587187 609183 634063 661048 689250
61847 689250 718423 748683 779680 810321 839260 865544 888786 908859 925424 937797 945366 948170
61835 948170 946874 942040 933717 922113 908523 895137 883822 875406 870153 868431 870586 876488 885526
61822 885526 896910 909789 923269 936445 948204 956897 960661 958419 950298 936849 918290 894931
61810 894931 867882 838656 808256 777320 746934 718509 692702 669084 647040 626475 607535
61799F07535j7331j5686j3780j1760j0085q977q347q033p700o825n310l869l235
61786D86597l196l028k591k323k383k522k691l012l177k708j868j518j920k359
61772D51301k199j605r95m43M8K65J56L2O5O6L0L39J084J662J635J408J573J914
61754D56336J721R13J73k5L6j86p70j309j439j220j105j408j878j951j476r66
61738D45446r53j325j578j491j271j126j011p47k38M63J161J679K041K445K861
61723D46356K912K368J608J296J620K077K059J481P65L66M41Q30J239J409J222
61708D68049P16Qq38j804k774l435l556l390l488m031m543m525m094l772l828
61693D24695m134m447m484l991l183k878l578m556m597l596k677k551k645k201
$$ plain form
61799 607535 590204 574518 560738 548978 538893 529916 521569 513536 505836 499011 493701 489832 486597
61786 486597 483401 480373 477782 475459 473076 470554 467863 464851 461674 458966 457098 455580 453660 451301
61772 451301 449102 447497 446502 446059 446107 446372 446528 446560 446625 446691 446721 447060 448144 449806 451441 452849 454422 456336
61754 456336 458057 458970 459143 459118 459154 458968 458198 456889 455450 454230 453125 451717 449839 447888 446412 445446
61738 445446 444493 443168 441590 440099 438828 437702 436691 435944 435706 436169 437330 439009 441050 443495 446356
61723 446356 449268 451636 453244 454540 456160 458237 460296 461777 462542 462908 463349 464179 465418 466827 468049
61708 468049 468765 468773 467935 466131 463357 459922 456366 452976 449488 445457 440914 436389 432295 428523 424695
61693 424695 420561 416114 411630 407639 404456 401578 398000 393444 388847 385251 382574 380023 377378 375177
61679C75177j428r56q50p89q00j032j203r98p28q76j147q41p8J84m76j296j388
61662C60475q60m60n13o76m87J97J190K058K321J841R95L29N9N2K18O89J519K387
61644C71334K815K696K453K544K977L441L836M247M421L734J969k13j947l089
61630D01218m040m841m990m282l314k879l067l295l115k742k627k709k337j107
61616C55873M50J285R70R6n03n94m56l83o31j486k911m258m833m697m499m574
61600C28849m657m496m196l887l438k775k176j958k138k506k810k766k181j287
61586B87578p28r42j662k214k216j836j450j290j333j372j154n87J46P04Q58O53
61570B73155L38J31N1j9j02p1J53M40O17O31N64N11O44J135J844K303K158J577
$$ plain form
61679 375177 373749 372793 371943 371154 370354 369322 368119 367121 366393 365517 364370 363529 363451 363635 363159 361863 360475
61662 360475 359615 359155 358642 357966 357479 357676 358866 360924 363245 365086 366081 366410 366469 366521 366739 367428 368947 371334
61644 371334 374149 376845 379298 381842 384819 388260 392096 396343 400764 404498 406467 406254 404307 401218
61630 401218 397178 392337 387347 383065 379751 376872 373805 370510 367395 364653 362026 359317 356980 355873
61616 355873 356323 357608 358578 358674 358171 357577 357121 356738 356107 354621 351710 347452 342619 337922 333423 328849
61600 328849 324192 319696 315500 311613 308175 305400 303224 301266 299128 296622 293812 291046 288865 287578
61586 287578 286850 285908 284246 282032 279816 277980 276530 275240 273907 272535 271381 270794 270940 271644 272502 273155
61570 273155 273493 273624 273675 273656 273554 273483 273636 274076 274693 275324 275888 276399 277043 278178 280022 282325 284483 286060
61552B86060R80N55K90K27L37L14l9l27M3R40J494J118K02l37J11J435K819L189
61534B99411K131N05k98J53J010J360J177R05P17O17O89P83L94o33j682k126k099
61517C03014k039j862j301p51r43j723k011j148L10J323J481J065N02O4j02mJ47
61500B96022R1k47o54p24k26N31Q73M97j47m84n89r05j332j226l68O02R67P64
61482B93445N73P65J256J767K061K014J692J299R21M11l15r67j057m36M42R15
61466C04786Q26P04J094J725J703O93m26n35L59J176J167O58L56M41O66R01J104
61449C17398J050N66NkO17J156J003M98N41J405K315K403J766J230J264J630K026
61432C36871K418K609K156J134L91M91Q67P70N06Q46J519J474O18J07O06J312
$$ plain form
61552 286060 287040 287595 287885 288112 288449 288763 288724 288397 288440 289380 290874 291992 292194 291857 291968 293403 296222 299411
61534 299411 301542 302047 301749 301902 302912 304272 305449 306354 307071 307688 308377 309160 309554 308921 307239 305113 303014
61517 303014 300975 299113 297812 297061 296118 294395 292384 291236 291546 292869 294350 295415 295917 295981 295879 295875 296022
61500 296022 296113 295866 295212 294488 294262 294793 295666 296163 296016 295532 294943 294038 292706 291480 291112 291714 292681 293445
61482 293445 294018 294783 296039 297806 299867 301881 303573 304872 305793 306204 305889 304922 303865 303429 303871 304786
61466 304786 305612 306316 307410 309135 310838 311531 311105 310570 310929 312105 313272 313930 314286 314727 315393 316294 317398
61449 317398 318448 319014 319019 319017 319634 320790 321793 322291 322832 324237 326552 328955 330721 331951 333215 334845 336871
61432 336871 339289 341898 344054 345188 345579 346070 346937 347707 348213 349059 350578 352052 352670 352777 353383 354695
61416C54695J318R51R98J341J235M96m17j170j675j732j308r17j050j356j153
61401C50256n90m33p53p96k78N5l42q76p17q1J35l06p78p84n08k19K35R78J542
61382C45740J293L27m84n14q1J06l2R5Q18J701K086J829J301R28R18J181J393
61365C58605J366J480K292L523L974K986J504J027J768K678L112L503M312N248
61351C97378N969O729P703Q339Q079P343P014P196P145O391N238M066K853J597
61337D83040P52P66J495K357K904K923K262R33o32j859k638l328m059m397l995
61322D76524l214k680k411j923j143n90m56j62Q48K225L239L796M385N219O072
61307D89729O939Q190R881J1433J2261J2321J1851J0898R397P431N208K996J111
$$ plain form
61416 354695 356013 356964 357962 359303 360538 361034 360617 359447 357772 356040 354732 353815 352765 351409 350256
61401 350256 349666 349233 348480 347684 347406 347461 347119 346243 345526 345445 345580 345274 344496 343712 343204 342985 343220 344198 345740
61382 345740 347033 347360 346876 346362 346281 346387 346355 346450 347268 348969 351055 352884 354185 355113 356031 357212 358605
61365 358605 359971 361451 363743 367266 371240 374226 375730 376757 378525 381203 384315 387818 392130 397378
61351 397378 403347 410076 417779 426118 434197 441540 448554 455750 462895 469286 474524 478590 481443 483040
61337 483040 483792 484558 486053 488410 491314 494237 496499 497432 496800 494941 492303 488975 484916 480519 476524
61322 476524 473310 470630 468219 466296 465153 464563 464107 463945 464793 467018 470257 474053 478438 483657 489729
61307 489729 496668 504858 514739 526172 538433 550754 562605 573503 582900 590331 595539 598535 599646
61294E99646l06j585l177m857n769n575n099n304o041o390o030n572n492n449
61280E33000m933m088l450l114k620j669n58K15N82Q79J303J734K168K897L884
61265E26230M373L776K840L085M826O539O798O103O036O969P663P050N440L754
61251F01482K460J672J571K047K346J753M79o28j139j419k043l189m583n656n818
61236E89335m973l829l312l596m004l917l423k886k250j204J29J111J385J409
61222E59975K000L348M763N427N261M889M943N543O396P101P294O844O047N413
61208F35244N044M500L498K453J971K021K179K461L281M557N636O402P726J0257
61194F97230J3314J5581J6588J6777J6349J4838J1999Q506N488L650K953K770
$$ plain form
61294 599646 599340 597755 594578 589721 583952 578377 573278 567974 561933 555543 549513 543941 538449 533000
61280 533000 528067 523979 520529 517415 514795 513126 512568 512783 513365 514244 515547 517281 519449 522346 526230
61265 526230 530603 534379 537219 540304 545130 551669 558467 564570 570606 577575 585238 592288 597728 601482
61251 601482 603942 605614 607185 609232 611578 613331 613810 613182 612043 610624 608581 605392 600809 595153 589335
61236 589335 584362 580533 577221 573625 569621 565704 562281 559395 557145 555941 556070 557181 558566 559975
61222 559975 561975 565323 570086 575513 580774 585663 590606 596149 602545 609646 616940 623784 629831 635244
61208 635244 640288 644788 648286 650739 652710 654731 656910 659371 662652 667209 672845 679247 686973 697230
61194 697230 710544 726125 742713 759490 775839 790677 802676 811182 816670 820320 823273 826043
61182H26043K334J308P1q68j631k760m259n432n837n857o080o565p064p563q193
61167G67647q862r380r751j0093j0416j0746j1216j1759j1989j1693j1185j0857
61155F39700j0568r817q390o529m660l160k219j643j047m66m24j171k256l321
61141E84029m765o917q913r302p821n716m196l251k249j021J03R18J612K458L544
61126E38513M741N906P128Q568J0068J1208J2041J3286J5320J7440J8834J9855
61114F82908K1337K2916K3295K2343K1656K2391K3592K3551K2085K0492J9612
61103I26178J8927J7493J4944J1548P825M330J395j159l837o948j0258j3194j5278
61090I51966j6507j7339j8182j8919j9171j9017j8987j9215j9020j7677j5343
$$ plain form
61182 826043 828377 829685 829756 828888 827257 824497 820238 814806 808969 803112 797032 790467 783403 775840 767647
61167 767647 758785 749405 739654 729561 719145 708399 697183 685424 673435 661742 650557 639700
61155 639700 629132 619315 610925 604396 599736 596576 594357 592714 591667 591201 590777 589606 587350 584029
61141 584029 579264 572347 563434 554132 546311 540595 536399 533148 530899 529878 529981 530899 532511 534969 538513
61126 538513 543254 549160 556288 564856 574924 586132 598173 611459 626779 644219 663053 682908
61114 682908 704245 727161 750456 772799 794455 816846 840438 863989 886074 906566 926178
61103 926178 945105 962598 977542 989090 996915 1001245 1002640 1001481 997644 990696 980438 967244 951966
61090 951966 935459 918120 899938 881019 861848 842831 823844 804629 785609 767932 752589
61079G52589j2865j0909r592q778q286p816p021n757m202k621j123L29J682K624
61065F78254K865K656K784L774N253O404O992P548Q635J0211J1788J2939J3690
61052G73793J4534J5918J7616J8962J9885K1108K2974K4757K5918K7279K9848
61041A012592L3004L5239L6371L7618L9488M1161M2208M3366M5136M7011M8657
61030A461851N0627N3179N5502N6852N7433N7667N7748N8426O0943O5574P1434
61019B107236P8266Q6797R6699J06212J15009J25606J40590J60484J85931K19793
61009C422623K64964L22342L93672M84154N98954P39474R06917J105889J335636
61000I574625J575867J787423J928482J963155J854427J569022J115329N81776
$$ plain form
61079 752589 739724 728815 719223 710445 702159 694343 687322 681565 677363 674742 673619 673948 675630 678254
61065 678254 681119 683775 686559 690333 695586 701990 708982 716530 725165 735376 747164 760103 773793
61052 773793 788327 804245 821861 840823 860708 881816 904790 929547 955465 982744 1012592
61041 1012592 1045596 1080835 1117206 1154824 1194312 1235473 1277681 1321047 1366183 1413194 1461851
61030 1461851 1512478 1565657 1621159 1678011 1735444 1793111 1850859 1909285 1970228 2035802 2107236
61019 2107236 2185502 2272299 2368998 2475210 2590219 2715825 2856415 3016899 3202830 3422623
61009 3422623 3687587 4009929 4403601 4887755 5486709 6226183 7133100 8238989 9574625
61000 9574625 11150492 12937915 14866397 16829552 18683979 20253001 21368330 21950106
60992B1950106J17391j50466j91592p3827R7671K31135K51769R4433k68957p85714
60982B1271949j324280j740970j956644j978484j863922j674968j458141j244310
60974H030230j050565q81890p37135o15050n14354m31381l61713l03618k57452
60965B877072k22155j94544j71719j52375j35943j21923j10000r9588q9466p8813
60955A500546o8281n9190n1984m6349m2222l9658l8081l6675l5325l4304l3337
60944A015140l1769k9358k6312k2973k0017j8411j8367j8884j8956j8689j8576
60933G72828j8388j7745j7017j6680j6279j5104j3451j2195j1491j0839j0136
60922F13503r643r247q696q220q054p668o455m820l595k762j808r85r71j446j226
$$ plain form
60992 21950106 22067497 21917031 21725439 21651612 21749283 21980418 22232187 22326620 22057663 21271949
60982 21271949 19947669 18206699 16250055 14271571 12407649 10732681 9274540 8030230
60974 8030230 6979665 6097775 5360640 4745590 4231236 3799855 3438142 3134524 2877072
60965 2877072 2654917 2460373 2288654 2136279 2000336 1878413 1768413 1668825 1579359 1500546
60955 1500546 1432265 1373075 1321091 1274742 1232520 1192862 1154781 1118106 1082781 1048477 1015140
60944 1015140 983371 954013 927701 904728 884711 866300 847933 829049 810093 791404 772828
60933 772828 754440 736695 719678 702998 686719 671615 658164 645969 634478 623639 613503
60922 613503 603860 594613 585917 577697 569643 561975 555520 550700 547105 544343 542535 541550 540579 539133 537907
60907E37907Q9J638K536K677K263J522R85J166J756J831J015j97j202j718j551
60892E50717p99k73q98k534m062m698m630m416m435m936n942p022p723q160q674
60877D81515r041q731p804o853o136n482m874m457l979l008j641l32P87J750K179
60862D23893J691P82L55N74Q85J044J213J221P38J08J9M01O59Q01J355K146K447
60845D40332K278K341K580K159J141P01J234J524M82j381k948l832m103l645k681
60830D36182k128k596l508l881l420k429j309n78o80j276j426r71r53k020l311
60815D05696l639l079k551k489k744l308m192m912m871m157l389k941k748k638
60801C58038k458k090j699j631j875j996j823j705j747j538r33m76n51p39n25
$$ plain form
60907 537907 537996 539634 542170 544847 547110 548632 549617 550783 552539 554370 555385 555188 553986 552268 550717
60892 550717 549918 549645 548747 546213 542151 537453 532823 528407 523972 519036 513094 506072 498349 490189 481515
60877 481515 472474 463743 455939 449086 442950 437468 432594 428137 424158 421150 419509 419177 419964 421714 423893
60862 423893 425584 426366 426721 427295 428180 429224 430437 431658 432396 432504 432523 432924 433583 434384 435739 437885 440332
60845 440332 442610 444951 447531 449690 450831 451532 452766 454290 454772 453391 450443 446611 442508 438863 436182
60830 436182 434054 431458 427950 424069 420649 418220 416911 416333 415653 414377 412951 411980 411027 409007 405696
60815 405696 402057 398978 396427 393938 391194 387886 383694 378782 373911 369754 366365 363424 360676 358038
60801 358038 355580 353490 351791 350160 348285 346289 344466 342761 341014 339476 338543 338067 337516 336777 336252
60786C36252r6R6N2%o2r4J82P94J293J421J392J229O14j59l1J358K939L671L881
60767C54732M222M255L235J685Q90J140J623J728J447P68k70j093j173r16j017
60752C71256j269j051o59q66j398j191j74N76O57Q32J363J205l95k598m097m645
60736C57546m739m572m186m004m310m575m130l233k709k726k678k239j785j605
60722C10055j358o30K77O20J10p12j106q94m00J30P12J229J380J162J077J456
60706C13108J943K034J853J863K029J918J493J215J295J474J608J902K334K420
60692C38489J913J245R44R66J036J305K133L273L835L190J687K89l01p6O04J414
60676C61946K128K461K237J633J051O52J94n56j462k221k752l190l642l998l943
$$ plain form
60786 336252 336156 336252 336304 336304 336242 336148 336330 337124 338417 339838 341230 342459 343073 342914 342883 344241 347180 350851 354732
60767 354732 358954 363209 366444 368129 369019 370159 371782 373510 374957 375725 375455 374362 373189 372273 371256
60752 371256 369987 368936 368277 367411 366013 364822 364648 365224 365881 366713 368076 369281 368886 366288 362191 357546
60736 357546 352807 348235 344049 340045 335735 331160 327030 323797 321088 318362 315684 313445 311660 310055
60722 310055 308697 308067 308344 308964 309074 308362 307256 306362 305962 306092 306804 308033 309413 310575 311652 313108
60706 313108 315051 317085 318938 320801 322830 324748 326241 327456 328751 330225 331833 333735 336069 338489
60692 338489 340402 341647 342591 343557 344593 345898 348031 351304 355139 358329 360016 360305 360004 359928 360532 361946
60676 361946 364074 366535 368772 370405 371456 372108 372302 371746 370284 368063 365311 362121 358479 354481 350538
60661C50538l221j991r67p79j229j523j272q06m24K1N92R22R16J165K075L044
60645C47061L217K677K207K089J847J025m21k278l946m505l640k426k197k764
60631C37946k715j549l62j11k87J6N76N20k62r74j011m61L11J032J447J433J180
60614C36729R63P26K46l84p57o56k53K22O97J066J048N18j79m82k50Q9J21k6K4
60595C39462K33K33O7L25J224K036J892R69L07N10J139J396J043M71K48O51J492
60578C53698K272K697K930L182L253K935K689L385N259P565R435J0665J1555J2383
60564D33903J3239J3996J4177J3159J0786P581M144O60k783n735p611q280q056
60551D79180p225n898m281k696j265J75J713L210M669O526R153J2135J4481J5790
$$ plain form
60661 350538 347317 345326 344359 343580 342351 340828 339556 338750 338326 338347 338939 339861 340777 341942 344017 347061
60645 347061 350278 352955 355162 357251 359098 360123 359702 357424 353478 348973 345333 342907 340710 337946
60631 337946 335231 333682 333320 333209 332922 332938 333514 334034 333772 332798 331787 331326 331637 332669 334116 335549 336729
60614 336729 337692 338418 338664 338280 337523 336867 336614 336836 337533 338599 339647 340165 339986 339504 339254 339343 339464 339438 339462
60595 339462 339695 339928 339995 340320 341544 343580 345472 346441 346748 347258 348397 349793 350836 351307 351555 352206 353698
60578 353698 355970 358667 361597 364779 368032 370967 373656 377041 382300 389865 399300 409965 421520 433903
60564 433903 447142 461138 475315 488474 499260 506841 510985 511645 508862 503127 495516 487236 479180
60551 479180 471955 466057 461776 459080 457815 457990 459703 462913 467582 474108 483261 495396 509877 525667
60537E25667J6779J8315K0185K1350K1292K0381J8847J6153J1861O589J505k825
60525F96099o511r509j1388j1932j1507j0740j0098r767r572r011p722n939m245
60512E78158k927j784n01J036K713M248N414O471Q170J1007J4708J8708K2902
60499F68323K7470L2238L6830M1266M5742M9937N3057N4579N4373N2213M7901
60488A163929M1830L4696K6517J6658N089p197j9224l0731m1356m9926n5343n7774
60476A027168n8307n7639n5741n2584m8551m4029l9133l4092k9459k5760k2992
60465E58881k0711j8515j6372j4420j2673j1053r687q807q239p387n975m492l535
60452D17015l002k481k147k466l127l146k287j569j824k434k188r82O0Q7n86j186
$$ plain form
60537 525667 542446 560761 580946 602296 623588 643969 662816 678969 690830 697419 698924 696099
60525 696099 689588 680079 668691 656759 645252 634512 624414 614647 605075 596064 588342 582403 578158
60512 578158 575231 573447 572946 573982 576695 580943 586357 592828 600998 612005 626713 645421 668323
60499 668323 695793 728031 764861 806127 851869 901806 954863 1009442 1063815 1116028 1163929
60488 1163929 1205759 1240455 1266972 1283630 1288719 1281522 1262298 1231567 1190211 1140285 1084942 1027168
60476 1027168 968861 911222 855481 802897 754346 710317 671184 637092 607633 581873 558881
60465 558881 538170 519655 503283 488863 476190 465137 455450 446643 438404 431017 425042 420550 417015
60452 417015 414013 411532 409385 406919 403792 400646 398359 396790 394966 392532 390344 389362 389422 389509 388923 387737
60436C87737j472j695j953k041j898j753j736j592j118n95m25m89l17O6J15k92
60420C70542n28k19O5l01q88p85J04J027J498J674J690J360P28K50L08Q55J602
60403C78982K211K382K098J669J283P81K38K15Q86J472J345J150J830K987L433
60388D02962L060K846L069L000K485K288K519K195J000J29N33J487J810J509J284
60373D32176J306J434J847K552K887K408J663J344J291J144J242K013L032L631
60359D59970L868M049L933L362L120M034N679P069Q165R511J0751J0784R358P346
60345E50999N389L265P10k042m625o668p643p378o697o635p054o973o164n426
60331D93058n172m881m229l724l745l817l450k931k762k872k855k515j840q04
$$ plain form
60436 387737 386265 384570 382617 380576 378678 376925 375189 373597 372479 371884 371459 370970 370653 370719 370834 370542
60420 370542 370014 369795 369860 369559 368671 367886 367990 369017 370515 372189 373879 375239 375967 376217 376525 377380 378982
60403 378982 381193 383575 385673 387342 388625 389406 389644 389859 390745 392217 393562 394712 396542 399529 402962
60388 402962 406022 408868 411937 414937 417422 419710 422229 424424 425424 425553 426086 427573 429383 430892 432176
60373 432176 433482 434916 436763 439315 442202 444610 446273 447617 448908 450052 451294 453307 456339 459970
60359 459970 463838 467887 471820 475182 478302 482336 488015 495084 503249 512760 523511 534295 543653 550999
60345 550999 556388 559653 560363 558321 553696 547028 539385 532007 525310 518675 511621 504648 498484 493058
60331 493058 487886 483005 478776 475052 471307 467490 464040 461109 458347 455475 452620 450105 448265 447461
60317D47461L66J281K035L259N146O974Q110R040J0767J3362J5792J7115J7341
60304E58049J7098J6824J6526J5952J4697J2230Q191K927k412o747j0111j3475
60292F29749j7314k0673k2074k1081j8600j5778j3174j0931r115p672o333m868
60280D62136l388k233j660j633j881k166k492k913l163k841k065j545j773k445
60266D29938k979l226l293l035k221j071j13L46L55R2j41k2L50M74K49K45O92
60249D16640Q42J38n32J68K004L368L402K826K434J993J132K97oj49p83j682j962
60232D30130j313l11M43R76J590K233K505K219J697J358J185Q95O07Q16J550K087
60216D48667J991J912K700M143N300N899O449P050P036O066M788M041L993M326
$$ plain form
60317 447461 447827 449108 451143 454402 459548 466522 474632 483672 494439 507801 523593 540708 558049
60304 558049 575147 591971 608497 624449 639146 651376 659567 662494 660082 653335 643224 629749
60292 629749 612435 591762 569688 548607 530007 514229 501055 490124 481009 473337 467004 462136
60280 462136 458748 456515 454855 453222 451341 449175 446683 443770 440607 437766 435701 434156 432383 429938
60266 429938 426959 423733 420440 417405 415184 414113 414000 414346 414701 414793 414652 414630 414980 415454 415703 415948 416640
60249 416640 417482 417620 417088 417256 419260 422628 426030 428856 431290 433283 434415 434712 434706 434557 433774 432092 430130
60232 430130 428817 428506 428949 429925 431515 433748 436253 438472 440169 441527 442712 443607 444214 445030 446580 448667
60216 448667 450658 452570 455270 459413 464713 470612 477061 484111 491147 497213 502001 506042 510035 514361
60202E14361M822N332N608N528N234M817M130L071J860Q87M77P40J393J820J570
60187E61650P98j00j068k137k919l001k738k905l574m026l913l685l751l887l729
60172E21015l242k466j462o96p79j519j922j461p77o78j114j585j975k345k337
60157D96657j488L2J440K028J627O24k61m77j22K50L92N61R08J200J294J391J631
60140E07687J900K218K839L730M509N092N788O550O778O263N611N280M854L855
60126E72954K644J860J464J037O18N40P35Q74R84J299J700J845J757J694J658
60111E93663J454J135Q90O19Q1o76j409k037k507k568k180j899k266k947l066
60096E76287k411j710j642k010k136j739j161q76r30r20n30P9N35P24P52N45k8
$$ plain form
60202 514361 519183 524515 530123 535651 540885 545702 549832 552903 554763 555650 556127 556867 558260 560080 561650
60187 561650 562448 562348 561280 559143 556224 553223 550485 547580 544006 539980 536067 532382 528631 524744 521015
60172 521015 517773 515307 513845 513149 512370 510851 508929 507468 506691 506013 504899 503314 501339 498994 496657
60157 496657 495169 495201 496641 498669 500296 500920 500659 500182 500060 500310 500702 501263 502171 503371 504665 506056 507687
60140 507687 509587 511805 514644 518374 522883 527975 533763 540313 547091 553354 558965 564245 569099 572954
60126 572954 575598 577458 578922 579959 580577 581117 581852 582726 583710 585009 586709 588554 590311 592005 593663
60111 593663 595117 596252 597142 597761 597842 597166 595757 593720 591213 588645 586465 584566 582300 579353 576287
60096 576287 573876 572166 570524 568514 566378 564639 563478 562602 561672 560752 560222 560301 560836 561560 562312 562857 562829
60079E62829o87r65r36j147j654j919j825j991k735l541m120n033o515p524p005
60064E15232n571m724m845n024m739m473m662n043n222n069m410l105j586n62
60050D56197j16K54P01R05R25J259J920K349K452K856L756M443M419M191M336
60035D90847M495M019K971J845P30m26j185j122p44j093k443m012n045n514n689
60020D77634n609n294n015n089n602o442p316p682p022n489l992l327l329l201
60006D03225k578j924j749j804j383l30O30P50J68l07j73K76M90L79L30O55J260
59989C97915J800K008J887J698J789K251K691K488J422M5p71o70n8M51O09M92
59973D16047J18n18j125j191n69J70K14o65j804k270j755p80K7O54J470K414K921
$$ plain form
60079 562829 562142 561177 560241 559094 557440 555521 553696 551705 548970 545429 541309 536276 529761 522237 515232
60064 515232 509661 504937 500092 495068 490329 485856 481194 476151 470929 465860 461450 458345 456759 456197
60050 456197 456081 456335 457036 457941 458866 460125 462045 464394 466846 469702 473458 477901 482320 486511 490847
60035 490847 495342 499361 502332 504177 504907 504481 503296 502174 501430 500337 497894 493882 488837 483323 477634
60020 477634 472025 466731 461716 456627 451025 444583 437267 429585 422563 417074 413082 409755 406426 403225
60006 403225 400647 398723 396974 395170 393787 393457 394087 394837 395005 394698 394525 394801 395291 395670 396000 396655 397915
59989 397915 399715 401723 403610 405308 407097 409348 412039 414527 415949 415994 415223 414553 414495 414946 415555 416047
59973 416047 416165 415647 414522 413331 412762 412932 413146 412481 410677 408407 406652 405872 405899 406553 408023 410437 413358
59956D13358K732K233J772J154K49m15l49K5p1n41o04j40J62J4p9J04mp14j423
59937D17463j520j323j387j588j584j644k158k704k400j005R78L057M966O327
59923D15478O823O570N868M707L144J789J263J276R89J98n82j052j352j344o17
59908D43158O60J667K025K252K777L201K961K210J528J173J027R73Q94O23L32
59893D67461O26J851L489M626M927M783M661M702M862N104N373N622N856N997
59879E29940N782N123M422M238M488M453L625K336J237M27n21j786l020l847m253
59864E52644m314l938l150k324j779j415j085j005j253j113L15K831N165O436
59850E46015O991P470P746P225N812M035K425J213M13l6j71J10Q43J613J718Q11
$$ plain form
59956 413358 416090 418323 420095 421249 421498 421083 420734 420759 420688 420147 419543 419403 419565 419579 419500 419604 419600 418886 417463
59937 417463 415943 414620 413233 411645 410061 408417 406259 403555 401155 400150 401128 404185 409151 415478
59923 415478 422301 428871 434739 439446 442590 444379 445642 446918 447907 448105 447523 446471 445119 443775 443158
59908 443158 443818 445485 447510 449762 452539 455740 458701 460911 462439 463612 464639 465612 466506 467129 467461
59893 467461 468087 469938 473427 478053 482980 487763 492424 497126 501988 507092 512465 518087 523943 529940
59879 529940 535722 540845 545267 549505 553993 558446 562071 564407 565644 566071 565550 563764 560744 556897 552644
59864 552644 548330 544392 541242 538918 537139 535724 534639 533634 532381 531268 531583 534414 539579 546015
59850 546015 553006 560476 568222 575447 581259 585294 587719 588932 589345 589309 589138 589248 590091 591704 593422 594233
59834E94233q91l053n302o858o889n602m308l920m010l795l308k922k485j790
59820E39100j399j968l105l837l971m091m393m524m496m746n189n187m638m214
59806D83342m227m091l283k193j550j500j670j754j670j427j142r91j016j099
59792D55729j166j185j023n97j50J0k3J00M46P84R92J060Q37K70j44K66J428K433
59774D60067K465J550L69k95r8N86R77Q41Q58J615K631K949K395J582R64P08J179
59757D81343K545L981M311L570K983L266L911M334M747N429O084O341O295O070
59743E45210N547M850M487M617M783M609M178L505K430J367J237K121K776K158
59729E93875P94j03k71m36j068j838k178j917j433j433k244l224l309k373j502
$$ plain form
59834 594233 593342 590289 584987 578129 571240 565638 561330 557410 553400 549605 546297 543375 540890 539100
59820 539100 537701 535733 532628 528791 524820 520729 516336 511812 507316 502570 497381 492194 487556 483342
59806 483342 479115 475024 471741 469548 467998 466498 464828 463074 461404 459977 458835 457844 456828 455729
59792 455729 454563 453378 452355 451758 451608 451618 451595 451695 452141 452925 453917 454977 455814 456084 455940 456206 457634 460067
59774 460067 462532 464082 464451 464156 464058 464644 465621 466462 467320 468935 471566 474515 476910 478492 479456 480164 481343
59757 481343 483888 487869 492180 495750 498733 501999 505910 510244 514991 520420 526504 532845 539140 545210
59743 545210 550757 555607 560094 564711 569494 574103 578281 581786 584216 585583 586820 588941 591717 593875
59729 593875 594669 594566 594295 593859 592791 590953 588775 586858 585425 583992 581748 578524 575215 572842 571340
59714E71340j614k402l002l059k674j933j075o14p45r57q00n46o23q02m91L92
59698E50395J359J856J582O56j83o6R01J524Q90n67j785k286k193j665r07l40
59682E49171j55o9M0k49j152k115k603k856l267l650l793m125m981n726n561m743
59666E04166m096l698l040k178j569j098l04M66L59m79q96l80L34O41R84J860
59650D91072K831L212L143L143L057K204N46r87j579j599k159l586m796m573l214
59635D86715k194k219k429j891r51m62l83j39J72n3p49j249j380j614k116k523
59619D66535k694k888l118l117k999l132l309k882j930j308j310j099J5J498K265
59604D40527J974J211P54J035J860K513K443J994J935K271K242J645J241J519
$$ plain form
59714 571340 569726 567324 564322 561263 558589 556656 555581 554967 554222 553265 552465 551919 551296 550494 550003 550395
59698 550395 551754 553610 555192 555848 555665 555599 556500 558024 558914 558347 556562 554276 552083 550418 549511 549171
59682 549171 549016 548947 548987 548738 547586 545471 542868 540012 536745 533095 529302 525177 520196 514470 508909 504166
59666 504166 500070 496372 493332 491154 489585 488487 488183 488649 489008 488529 487633 487253 487587 488228 489212 491072
59650 491072 493903 497115 500258 503401 506458 508662 509208 508221 506642 505043 502884 499298 494502 489929 486715
59635 486715 484521 482302 479873 477982 477031 476569 476186 476047 476219 476166 475417 474168 472788 471174 469058 466535
59619 466535 463841 460953 457835 454718 451719 448587 445278 442396 440466 439158 437848 436749 436764 438262 440527
59604 440527 442501 443712 444466 445501 447361 449874 452317 454311 456246 458517 460759 462404 463645 465164
59590D65164J903J755J380J320J280N86o76j746k217k298k279k320k606l069l116
59575D53061k266r74k41l77p79q71o85m12k1M16N31J93j73j02L04O25O98O26M21
59556D49974L2l42m41l72m71o31k61Q59K083K630K594K762L533M523N301O111
59540D77884P607J0120J3327J6467J8670J9269J7945J4599R236K347m579r548
59528E93344j1422j0705q707o330l864j578J24J061J406J423J360J384J387Q96
59514E59779l87k085l495m416n219o141o900p121o876o591o546o589o349n726
59500D85338n091m846m863m617l969l345l010k626j918j284j177j220o60N02J482
59485D48696J849J962K198K417K418K390K560K800K919L015L260L519L556L413
$$ plain form
59590 465164 467067 468822 470202 471522 472802 473388 472712 470966 468749 466451 464172 461852 459246 456177 453061
59575 453061 450795 449821 449580 449203 448424 447553 446868 446456 446435 446851 447382 447575 447402 447300 447604 448229 448927 449553 449974
59556 449974 450006 449664 449223 448851 448380 447749 447488 448347 450430 453060 455654 458416 461949 466472 471773 477884
59540 477884 485491 495611 508938 525405 544075 563344 581289 595888 605124 607471 602892 593344
59528 593344 581922 571217 562510 556180 552316 550738 550862 551923 553329 554752 556112 557496 558883 559779
59514 559779 559392 557307 553812 549396 544177 538036 531136 524015 517139 510548 504002 497413 491064 485338
59500 485338 480247 475401 470538 465921 461952 458607 455597 452971 451053 449769 448592 447372 446712 447214 448696
59485 448696 450545 452507 454705 457122 459540 461930 464490 467290 470209 473224 476484 480003 483559 486972
59471D86972L358L493L636L550L152K503J708Q82J85j23J56R51J892K649L199
59456E18163L763M492N389O324P066P343P078O508N993N725N635N473M892L636
59442E97480J693p35l330n574o800o759o067n562n315m796l979l514l522l165
59428E40055j922n91k21n44k13J574M390P306R786J1808J3615J5422J7298J9427
59414F37190K2227K5691K8680K9729K8637K6185K2112J4880M390o367j3809j6944
59402H02601j6826j3958q284j143M918Q489R656P985K228p167j6900k3347k5411
59389G22841k4271k1479j8168j5125j2564j0098p606n661m678m258l808l281k832
59376E89012k281j459n76J30O86J035R61O21N67R17J157J037R71J214J396J338
$$ plain form
59471 486972 490330 493823 497459 501009 504161 506664 508372 509254 509439 509316 509472 510423 512315 514964 518163
59456 518163 521926 526418 531807 538131 545197 552540 559618 566126 572119 577844 583479 588952 593844 597480
59442 597480 599173 598438 595108 589534 582734 575975 569908 564346 559031 554235 550256 546742 543220 540055
59428 540055 538133 537542 537321 536777 536564 538138 542528 549834 559620 571428 585043 600465 617763 637190
59414 637190 659417 685108 713788 743517 772154 798339 820451 835331 839721 833354 819545 802601
59402 802601 785775 771817 763533 762390 767308 775797 785453 793438 795666 788499 771599 748252 722841
59389 722841 698570 677091 658923 643798 631234 621136 613530 607869 603191 598933 595125 591844 589012
59376 589012 586731 585272 584696 584826 585512 586547 587508 588129 588696 589613 590770 591807 592778 593992 595388 596726
59360E96726J569K424L394L936M388N324O600P713Q665R777J0952J1848J2492
59347F85808J3125J3650J3799J3650J3478J3240J2608J1478J0043Q504O943N322
59335H21648L468J298r28k926m954p456j0098j1885j2531j2912j3685j4318j4105
59322G20616j3425j3125j3155j2724j1590j0297r282q454p635o848o089n304m597
59309E98091m060l452k335n08J941M771P500R471J0424J0750J0743R755O611R54
59295F60656o020j2222j5980j6968j6152j4742j3154j1145q865p117o333n808
59283E26150m513k382k93J024J624J991K446K998L595M441N918Q160J0670J2717
59269E74546J3937J4348J3970J2896J1654J0850J0402R691Q407O685M516J796
$$ plain form
59360 596726 598295 600719 604113 608049 612437 617761 624361 632074 640739 650516 661468 673316 685808
59347 685808 698933 712583 726382 740032 753510 766750 779358 790836 800879 809383 816326 821648
59335 821648 825116 826414 825486 822560 817606 810150 800052 788167 775636 762724 749039 734721 720616
59322 720616 707191 694066 680911 668187 656597 646300 637018 628564 620929 614081 607992 602688 598091
59309 598091 594031 590579 588244 587736 589677 594448 601948 611419 621843 632593 643336 653091 659702 660656
59295 660656 654636 642414 626434 609466 593314 578572 565418 554273 545408 538291 531958 526150
59283 526150 521637 519255 518962 519986 521610 523601 526047 529045 532640 537081 542999 551159 561829 574546
59269 574546 588483 602831 616801 629697 641351 652201 662603 672294 680701 687386 691902 693698
59257F93698r90l053m366n598o772p098o495o090o556o954o149m528l345k884
59243F22820k314j051N97J982K720K915L126L843M732M936M362L988M389M825
59229F61870M311K859R97j142l433n238o210p053q468r890j0222r421q347p484
59215E93129o779o399o636p135p197o666n861m896l814l135l309l833l700k685
59201E21084j457n70k1L51O72J087J473J421R69Q13J333J941K112K291K992L712
59185E40203L774L537L626L630K870J899J800K368K535K222K334K960L225K910
59171E79893K748K959K943K661K846L581M023L830L598L507K959J944J391J538
59157F20421J224m57k858m844o136o996p504p822q310q737q251o740n357n053
$$ plain form
59257 693698 692708 689655 685289 679691 672919 665821 659326 653236 646680 639726 633577 629049 625704 622820
59243 622820 620506 619455 620052 622034 624754 627669 630795 634638 639370 644306 648668 652656 657045 661870
59229 661870 666181 669040 670037 668895 665462 660224 654014 646961 638493 628603 618381 608960 600613 593129
59215 593129 586350 579951 573315 566180 558983 552317 546456 541560 537746 534611 531302 527469 523769 521084
59201 521084 519627 519057 519036 519387 520059 521146 522619 524040 525009 525822 527155 529096 531208 533499 536491 540203
59185 540203 543977 547514 551140 554770 557640 559539 561339 563707 566242 568464 570798 573758 576983 579893
59171 579893 582641 585600 588543 591204 594050 597631 601654 605484 609082 612589 615548 617492 618883 620421
59157 620421 621645 621188 618330 613486 607350 600354 592850 585028 576718 567981 559730 552990 547633 542580
59143E42580n478n906o282o659o468n358m038l401l334l168k812k627k664k726
59129D81659k793k647j668K81K169K859K612K770M013N667O682O743O427O606
59115E21380P743R473J0857J1265J0870J0236R686R252Q840Q299P541O757O195
59102F38394N732M965L827K641J545L92p26j448j761k085k560k824k705k515k412
59087F38460k149j662j313j251j219j210j678k693l665m288n068o322p386p476
59073E91080o759n940n264m597m125m155m523m735m636m427m231m025l819l555
59059E26289k982k003r73l84l65o92j079j362j660k281l155l462k486p89K51J97
59043E03064p7O6J08m76j157j245j003j033j154q28k08K28O75J680L006L800L904
$$ plain form
59143 542580 537102 531196 524914 518255 511787 506429 502391 498990 495656 492488 489676 487049 484385 481659
59129 481659 478866 476219 474551 474832 477001 479860 482472 485242 489255 494922 501604 508347 514774 521380
59115 521380 529123 538596 549453 560718 571588 581824 591510 600762 609602 617901 625442 632199 638394
59102 638394 644126 649091 652918 655559 657104 657496 656770 655322 653561 651476 648916 646092 643387 640872 638460
59087 638460 636311 634649 633336 632085 630866 629656 627978 625285 621620 617332 612264 605942 598556 591080
59073 591080 584321 578381 573117 568520 564395 560240 555717 550982 546346 541919 537688 533663 529844 526289
59059 526289 523307 521304 520331 519947 519582 518890 517811 516449 514789 512508 509353 505891 503405 502616 502867 503064
59043 503064 502987 503053 503161 502685 501528 500283 499280 498247 497093 496265 496057 496285 496960 498640 501646 505446 509350
59026E09350M092M875N866O554P118Q090R561J1069J2121J2558J2413J1646J0188
59013F25501Q179N937L582J009j571l447m240m464m655m345k829o31R71J837L070
58998F23904M966O256O005M955M171L485K330J128O57O91M48j24n77j086k148
58983F55061l404l871l293k339j507o99J63R32J673K679L956N282O665Q147R347
58968F78792R923J0338J1382J2867J3616J2933J1453J0264R737R464Q906P808
58956H07483O194M243K064m09l261o366r430j2121j4076j5031j5102j4730j4157
58943G15301j3271j2074j0924r999q957p578o343n866n995n940n231m109l126
58930F15888k635k588k571k153j382p25m47l73l20l11k87q5P5l02j124j613j446
$$ plain form
59026 509350 513442 518317 524183 530737 537855 545945 555506 566575 578696 591254 603667 615313 625501
59013 625501 633680 639617 643199 644208 642637 639190 634950 630486 625831 621486 618657 618026 618997 620834 623904
58998 623904 628870 635126 641131 646086 650257 653742 656072 657200 657857 658548 658996 658872 658295 657209 655061
58983 655061 651657 647786 644493 642154 640647 639948 640111 641043 642716 645395 649351 654633 661298 669445 678792
58968 678792 688715 699053 710435 723302 736918 749851 761304 771568 781305 790769 799675 807483
58956 807483 813677 817920 819984 819575 816314 809948 800518 788397 774321 759290 744188 729458 715301
58943 715301 702030 689956 679032 669033 660076 652498 646155 640289 634294 628354 623123 619014 615888
58930 615888 613253 610665 608094 605941 604559 603834 603387 603014 602694 602383 602096 602011 602086 601784 600660 599047 597601
58913E97601j273j590j800j100K80J501K355L357M844O595Q192R274R688R732
58899F47656R928J0259J0193R672R402R702R993J0065J0844J2943J5248J6212
58887G82117J5969J5958J6807J7806J8244J7952J6661J4072J0711P633N073K304
58875I41307r98m181o659q670j0631j2418j3673j4287j4241j3378j1652r409p295
58862H13815n910n454n519n537n542o076p175q105q514r049j0172j1188j1281
58849G14293j0793j0426r829q321o496n719o146o582o331n914n856o024o350p027
58835F12479p714p664o966o591o812o654n349l473k131j724j989k427k339j160
58821E49486P08K110K550K771L470M266M447M133L945L993L868L385K806K432
$$ plain form
58913 597601 596328 594738 592938 591838 592118 593619 595974 599331 604175 610770 618962 628236 637924 647656
58899 647656 657584 667843 678036 687708 697110 706812 716805 726870 737714 750657 765905 782117
58887 782117 798086 814044 830851 848657 866901 884853 901514 915586 926297 933930 939003 941307
58875 941307 940309 936128 929469 920799 910168 897750 884077 869790 855549 842171 830519 821110 813815
58862 813815 807905 802451 796932 791395 785853 779777 772602 764497 755983 746934 736762 725574 714293
58849 714293 703500 693074 683245 674924 668428 662709 656563 649981 643650 637736 631880 625856 619506 612479
58835 612479 604765 597101 590135 583544 576732 570078 564729 561256 559125 557401 555412 552985 550646 549486
58821 549486 550194 552304 554854 557625 561095 565361 569808 573941 577886 581879 585747 589132 591938 594370
58807E94370K282K118J559L92j081k229k719k769k826l231m120n305o200o329
58793E63912n897n477n237m867m269l760l532l383k997k160q23O63J575J598J459
58778E26805K141L559M663M819M355L712K824J524L8j276k284l039l652m172m423
58763E35594m196l841m146n089n355l970j911r31j101q59N35K012K477K268K192
58748E13679K201J842J368J525K544L843M615M484L789L342L639M380N025N565
58734E61841O186O511N992M983M470M750N192N396N706O353O901O802N943M535
58720F41561L120K602L456M938N932O444P231Q045P684O048M663M527M697L875
58706G14823K238O66r29l258o175q796j0825j2771j4791j6220j6518j6082j5782
$$ plain form
58807 594370 596652 598770 600329 600721 599640 597411 594692 591923 589097 585866 581746 576441 570241 563912
58793 563912 558015 552538 547301 542434 538165 534405 530873 527490 524493 522333 521510 522173 523748 525346 526805
58778 526805 528946 532505 537168 541987 546342 550054 552878 554402 554440 553164 550880 547841 544189 540017 535594
58763 535594 531398 527557 523411 518322 512967 508997 507086 506155 505054 504195 504730 506742 509219 511487 513679
58748 513679 515880 517722 519090 520615 523159 527002 531617 536101 539890 543232 546871 551251 556276 561841
58734 561841 568027 574538 580530 585513 589983 594733 599925 605321 611027 617380 624281 631083 637026 641561
58720 641561 644681 647283 650739 655677 661609 668053 675284 683329 691013 697061 701724 706251 710948 714823
58706 714823 717061 717727 716798 713540 707365 698569 687744 674973 660182 643962 627444 611362 595580
58693E95580j5891j5815j4838j3033j1187r875q945q014p061o174n201m196l718
58680D71632m055m471m040k919j986j500j010l99L2M54J457L042M594N896P238
58665D73965Q532R281R551J0033J0953J1684J1565J0305P785M341J127q90k183
58652E66049l813n539o146n559n092n358n475m812m083m047m354m325l843l021
58638E00582j940j145j240j720j360q1Q17O55K24K11K09j26l58m50j258l080m948
58621D84992o118o928p475o852m692k100J1K178M901P231Q147Q183Q319Q183O870
58606E04850M748L108K415K144J835J350N71k88o29m58p37j900k899k632j536
58591E09942p54l69L74J649K866L635M120M708N855P773R858J1012J0971J0512
$$ plain form
58693 595580 579689 563874 549036 536003 524816 514941 505996 497982 490921 484747 479546 475350 471632
58680 471632 467577 463106 459066 456147 454161 452661 451651 451252 451284 451738 453195 456237 460831 466727 473965
58665 473965 482497 491778 501329 511362 522315 533999 545564 555869 563654 567995 569122 568232 566049
58652 566049 562236 556697 550551 544992 539900 534542 529067 524255 520172 516125 511771 507446 503603 500582
58638 500582 498642 497497 496257 494537 493177 493096 493913 494568 494792 495003 495212 495086 494728 494278 493020 489940 484992
58621 484992 478874 471946 464471 457619 452927 450827 450838 453016 457917 465148 473295 481478 489797 497980 504850
58606 504850 509598 512706 515121 517265 519100 520450 521021 520733 520104 519646 518909 517009 514110 511478 509942
58591 509942 509188 508819 509193 510842 513708 517343 521463 526171 532026 539799 549657 560669 571640 582152
58577E82152J0096R331Q171P412P330P066O123N326N461O182P133Q882J1720J4702
58563F97087J6976J8919K0907K2218K2299K1979K2052K1790K0156J7470J4556
58552I16409J1230P060K738o81l114m877n691n501n257n697o276o588p543r780
58538H76432j2190j3641j4928j7189j9483k0009j8837j7406j5980j3749j0985
58527G02035q972p967o948n409l817k536j621j344j690j814j289j188k462m056
58513F50922m243l156k249j948j684j601k265l098k984k233k092k586k677k245
58499F15861k090k138j531m41j7m84r02p53l29L50J514K657L062L005L163L300
58483F24227L037L254M997P468R047R818J1166J3196J4588J4730J4063J2567R924
$$ plain form
58577 582152 592248 601579 609750 617162 624492 631558 637681 643007 648468 654650 661783 670665 682385 697087
58563 697087 714063 732982 753889 776107 798406 820385 842437 864227 884383 901853 916409
58552 916409 927639 934699 937437 936756 933642 928765 923074 917573 912316 906619 900343 893755 886212 876432
58538 876432 864242 850601 835673 818484 799001 778992 760155 742749 726769 713020 702035
58527 702035 693063 685096 678148 672739 668922 666386 664765 663421 661731 659917 658628 657440 654978 650922
58513 650922 646679 643523 641274 639326 637642 636041 633776 630678 627694 625461 623369 620783 618106 615861
58499 615861 613771 611633 610102 609661 609644 609160 608258 607505 607176 607526 609040 611697 614759 617764 620927 624227
58483 624227 627264 630518 635515 642983 652030 661848 673014 686210 700798 715528 729591 742158 752082
58470G52082O921M619K325j330n530p844p785p368p782p884o588m616l009j732
58456G04479m77P43K416N334Q979J1521J1947J0915R236O931M106J346j129l537
58442G72810n614o739o988o854o142m504k726j959j932j509o53j41K78J474L036
58427G31837L766L857M583N998P049P684Q604R068P426M003J123j00p80j875k954
58412G89289l762m817n991o438o274o462o913o599n573m845m311l068j619j350
58398G21267j834j263L71J308J352K227M170N173M392L522L785M192L812L325
58384G55799L310L279L237M023N354N826N418N581O425O434N600N855P531Q359
58370H32031P153N742N942P119Q075Q810R220Q429O800O273P487Q767Q935Q878
$$ plain form
58470 752082 759003 763622 765947 764617 759087 751243 743458 736090 728308 720424 713836 709220 706211 704479
58456 704479 704002 704745 707161 712495 721474 732995 744942 755857 765093 772024 776130 777476 776347 772810
58442 772810 767196 760457 753469 746615 740473 735969 733243 731284 729352 727843 727190 727049 727327 728801 731837
58427 731837 735603 739460 744043 750041 757090 764774 773378 782446 789872 793875 794998 794898 794118 792243 789289
58412 789289 785527 780710 774719 768281 762007 755545 748632 742033 736460 731615 727304 724236 722617 721267
58398 721267 719433 718170 718541 719849 721201 723428 727598 732771 737163 740685 744470 748662 752474 755799
58384 755799 759109 762388 765625 769648 775002 780828 786246 791827 798252 804686 810286 816141 823672 832031
58370 832031 839184 844926 850868 857987 866062 874872 884092 892521 899321 905594 913081 921848 930783 939661
58356I39661R311R428Q765Q090P549O280M572L830L883L151K045K832N352O437
58342A021186M963L828N296P741Q979R540J0602J1657J2314J3673J5939J7258
58330A142976J6653J5568J5008J4008J2381J1768J2330J1683Q924O429N749N208
58318A278685L592K721L910N297N187M953O054P362P894R042J1531J3312J3065
58305A372605J2718J3901J5103J4931J4969J6596J8145J8029J7646J8433J9204
58294A552280J9035J9466K1141K1775K0345J9682K1815K4424K5010K4932K5923
58283A795828K6482K5363K4881K6904K9090K9020K8525L0013L2035L2587L3308
58272B114036L6203L9454M0734M1501M3848M6345M7104M7739N0256N3294N5347
$$ plain form
58356 939661 948972 958400 967165 975255 982804 989084 993656 997486 1001369 1004520 1006565 1009397 1014749 1021186
58342 1021186 1026149 1029977 1035273 1043014 1051993 1061533 1072135 1083792 1096106 1109779 1125718 1142976
58330 1142976 1159629 1175197 1190205 1204213 1216594 1228362 1240692 1252375 1261299 1267728 1273477 1278685
58318 1278685 1282277 1284998 1288908 1294205 1299392 1304345 1310399 1317761 1325655 1334697 1346228 1359540 1372605
58305 1372605 1385323 1399224 1414327 1429258 1444227 1460823 1478968 1496997 1514643 1533076 1552280
58294 1552280 1571315 1590781 1611922 1633697 1654042 1673724 1695539 1719963 1744973 1769905 1795828
58283 1795828 1822310 1847673 1872554 1899458 1928548 1957568 1986093 2016106 2048141 2080728 2114036
58272 2114036 2150239 2189693 2230427 2271928 2315776 2362121 2409225 2456964 2507220 2560514 2615861
58261B615861N8105O2710O6487O7403O7878P0116P1944P1455P1191P3255P5038
58250C371443P4609P5321P9976Q5509Q8809R2594R9728J07206J11899J16851J25364
58239D429309J34359J40300J46206J55704J65926J73615J82425J96264K11425
58230E935533K23463K35871K53235K72106K87848L04299L26958L52809L76976
58221H569098M03070M36466M73880N10593N51360O02729O61624P23384P93657
58212A3725861Q79705R78015J084031J205653J352731J522513J711118J929676
58204B4389303K193060K504340K869122L313081L865113M537648N347788O344511
58196E5363966P591943R145632J1073228J3470567J6414313J9918412K3964247
$$ plain form
58261 2615861 2673966 2736676 2803163 2870566 2938444 3008560 3080504 3151959 3223150 3296405 3371443
58250 3371443 3446052 3521373 3601349 3686858 3775667 3868261 3967989 4075195 4187094 4303945 4429309
58239 4429309 4563668 4703968 4850174 5005878 5171804 5345419 5527844 5724108 5935533
58230 5935533 6158996 6394867 6648102 6920208 7208056 7512355 7839313 8192122 8569098
58221 8569098 8972168 9408634 9882514 10393107 10944467 11547196 12208820 12932204 13725861
58212 13725861 14605566 15583581 16667612 17873265 19225996 20748509 22459627 24389303
58204 24389303 26582363 29086703 31955825 35268906 39134019 43671667 49019455 55363966
58196 55363966 62955909 72101541 83174769 96645336 113059649 132978061 156942308
58189A56942308K8492124L3227385L7498197M0323480M0711454L7829135L1018185
58182D06042268K0059148N779840r645237k3361185l3137250l8244207l9308482
58175B88184895l7557933l4194058l0146427k6034815k2196768j8774987j5820804
58168A03459103j3335855j1270615r550300q116984o931129n947171n117576m415113
58160C8774360l827063l332727k907115k540192k232071j973786j750327j557158
58152A8653921j396460j261375j139768j029360r34477q51910p73994p01639o40615
58143I924323n88440n37729m89244m49251m16975l86492l58093l36171l18354
58134F043574k97936k75194k55819k40031k23278k05852j91999j81061j68731
$$ plain form
58189 156942308 185434432 218661817 256160014 296483494 337194948 375024083 406042268
58182 406042268 426101416 431881256 422236019 398874834 365737584 327493377 288184895
58175 288184895 250626962 216432904 186286477 160251662 138054894 119279907 103459103
58168 103459103 90123248 78852633 69302333 61185349 54254220 48307049 43189473 38774360
58160 38774360 34947297 31614570 28707455 26167263 23935192 21961406 20211079 18653921
58152 18653921 17257461 15996086 14856318 13826958 12892481 12040571 11266577 10564938 9924323
58143 9924323 9335883 8798154 8308910 7859659 7442684 7056192 6698099 6361928 6043574
58134 6043574 5745638 5470444 5214625 4974594 4751316 4545464 4353465 4172404 4003673
58125D003673j55673j46003j38820j29853j20114j14224j11401j06438r8722r2304
58115B790121q7930q2734p7033p3833p2210o8438o3065n9925n8805n6038n1780
58104B038330m9782n0224m9453m6721m4888m4522m3251m0885l9561l8995l7072
58093A552976l4589l4026l4315l2363k9030k7788k8221k6800k3603k2134k2673
58082A237434k1949j9610j8924k0544k1348k0282j9852k0877k1016j9583j8898
58071A014551j9672j9657j8060j6890j6843j6074j4103j2992j3519j3917j3295
58060H39529j2758j2498j1316r636r428j0613j0965j0054r784j0616j0808r853
58048G11200r170q980p995o511o327p219p056n736n405o354o478n351n088o299
$$ plain form
58125 4003673 3848000 3701997 3563177 3433324 3313210 3198986 3087585 2981147 2882425 2790121
58115 2790121 2702191 2619457 2542424 2468591 2396381 2327943 2264878 2204953 2146148 2090110 2038330
58104 2038330 1988548 1938324 1888871 1842150 1797262 1752740 1709489 1668604 1629043 1590048 1552976
58093 1552976 1518387 1484361 1450046 1417683 1388653 1360865 1332644 1305844 1282241 1260107 1237434
58082 1237434 1215485 1195875 1176951 1156407 1135059 1114777 1094925 1074048 1053032 1033449 1014551
58071 1014551 994879 975222 957162 940272 923429 907355 893252 880260 866741 852824 839529
58060 839529 826771 814273 802957 793321 783893 773280 762315 752261 742477 731861 721053 711200
58048 711200 702030 693050 685055 678544 672217 664998 657942 652206 646801 640447 633969 628618 623530 617231
58034F17231o914o008n391o160p006p027p257q191q621p980p330p204o912o520
58020E18710o900p477o623m718l967m767n187m486m082m425m027k413j180j215
58006D57243j476j322j424j825j656j223j762k693k044j0R28n7j102j174j481
57991D38922k579l239l123l542m527m216k271q94j205j559q10k74j016j969k327
57976D05371l113m701n368m078k390j915k053j788j610j995k038j201n48p47q05
57961C71021p7M16P3J28J417K642K388J124k10j807l709m686l956k601j826j254
57945C59083k07P95J147J351J876K197K115K570M027N456O016O372P311Q391Q926
57930D17426Q934Q239O155K958J79j453k875m741o322p156p978r038r280q317
$$ plain form
58034 617231 610317 604309 598918 592758 585752 578725 571468 563277 554656 546676 539346 532142 525230 518710
58020 518710 511810 504333 497710 492992 489025 484258 479071 474585 470503 466078 462051 459638 458458 457243
58006 457243 455767 454445 453021 451196 449540 448317 446555 443862 441818 441808 442736 442679 441577 440403 438922
57991 438922 436343 433104 429981 426439 421912 417696 415425 414531 413326 411767 410957 410683 409667 407698 405371
57976 405371 402258 397557 392189 388111 385721 383806 381753 379965 378355 376360 374322 373121 372573 371826 371021
57961 371021 370944 371360 371433 371561 372978 375620 378008 379132 378922 377115 373406 368720 364764 362163 360337 359083
57945 359083 358876 359671 360818 362169 364045 366242 368357 370927 374954 380410 386426 392798 400109 408500 417426
57930 417426 426360 434599 440754 443712 443891 442438 439563 434822 428500 421344 413366 404328 395048 386731
57916C86731p469p712q172p763o745n566l836j615j11Q3j6M94J129J397J754K233
57900C44816J923Q05L25R77J267K89n26K81J921K851K954K781K242J470J417K153
57884C67946K195R11j08L87J143N21q73j610j940k888m115m637m702n079n436
57869C41715n084m467m272m004l023k028j875j806n13J751L571M229L930K984
57855C31108K047K257L909N741O567O661O552N815M261K959K676K495J407N9n35
57840C83979p16j143j365r72q58j650k261j749j259k103l244k923j667j339k031
57825C58699k306j870j633j582r06L3L8o66o37L17P73o2j539l047m692o335p471
57808C27114q176q887r258q578p278o531o465o050m848l550k695k088j527j074
$$ plain form
57916 386731 379262 371550 363378 355615 348870 343304 339468 337853 337742 337825 337809 338303 339432 340829 342583 344816
57900 344816 346739 347544 347869 348846 350113 350402 349876 350157 352078 354929 357883 360664 362906 364376 365793 367946
57884 367946 370141 371052 370944 371331 372474 372995 372122 370512 368572 365684 361569 356932 352230 347151 341715
57869 341715 336631 332164 327892 323888 320865 318837 316962 315156 314643 316394 319965 324194 328124 331108
57855 331108 333155 335412 339321 345062 351629 358290 364842 370657 374918 377877 380553 383048 384455 384514 383979
57840 383979 383263 382120 380755 379783 378925 377275 375014 373265 372006 369903 366659 363736 362069 360730 358699
57825 358699 356393 354523 352890 351308 350402 350435 350473 349807 349170 349487 350260 350198 348659 345612 340920 334585 327114
57808 327114 318938 310051 300793 292215 284937 278406 271941 265891 261043 257493 254798 252710 251183 250109
57794B50109n90O5M53J09m96m77K59J160J952K556K644K301K565M141O166P367
57778B80284P814Q186Q145O989N469N155O118O812O354N400M743M322L833L168
57764C62792K127O02r05j746j964j929j524n75L16L86k16q97j735l095m665n974
57748C40998p375r375j1407j2419j2204j1055q793n455k382j024j048r86m07q
57734B57060M7K74O24N63L46P42J608K111K210K534K981K857K352K322K652K370
57718B83653J418Q79J208J645J605J420J389J201O54ro45j337j915k138k209k323
57702B84496k109j346p23q21r30j75P56N08p61j733k107k780l967m811m906m644
57686B53947m123l191k492k752l161k116K81K295L279M478O752R392J1846J4844
$$ plain form
57794 250109 249519 249584 250037 250146 249650 249173 249432 250592 252544 255100 257744 260045 262610 266751 272917 280284
57778 280284 288098 296284 304429 311418 316887 322042 328160 334972 341326 346726 351469 355791 359624 362792
57764 362792 364919 365521 364616 362870 360906 358977 357453 356878 357194 357580 357364 356467 354732 351637 346972 340998
57748 340998 333623 324248 312841 300422 288218 277163 268370 262915 260533 259509 258461 257475 257068 257060
57734 257060 257107 257381 258005 258568 258914 259656 261264 263375 265585 268119 271100 273957 276309 278631 281283 283653
57718 283653 285071 285950 287158 288803 290408 291828 293217 294418 295072 295063 294418 293081 291166 289028 286819 284496
57702 284496 282387 281041 280318 279497 278567 278392 279148 279656 278895 277162 275055 272275 268308 263497 258591 253947
57686 253947 249824 246633 244141 241389 238228 236112 236393 238688 241967 246445 253197 262589 274435 289279
57672B89279J9015K3826K8829L4710M2074N0060N6712N9987N8027M9536L4676
57661G46731J5210o289k6778m2795n1826n4090n1999m7748m2285l6354l0887k6051
57649C44839k1373j7083j4041j2121j0127p671n687m643l758k519j566j326j200
57636B41724p58n02o73n27L48J083Q55J71QL43M34r8j059k100k841l030k931k984
57618B27463l086k780k166j794j691j398r52q07q84p67p25j272j793j124N02J573
57602B08299J530J318J435J179K78l82l59m52j225k076k460k706l003k923k546
57587A95907k619l051k769j711j291k080k734k182j279j090j159p93n87j192j867
57572A69503j702j201j178j155l78N14L94m49q32m78l2J79J03o44k063l032k537
$$ plain form
57672 289279 308294 332120 360949 395659 437733 487793 544505 604492 662519 712055 746731
57661 746731 761941 755652 728874 686079 634253 580163 528164 480416 438131 401777 370890 344839
57649 344839 323466 306383 292342 280221 270094 262423 256736 252093 248335 245816 244250 242924 241724
57636 241724 240966 240464 239791 239264 239612 240695 241550 241721 241729 242072 242506 242408 241349 239249 236408 233378 230447 227463
57618 227463 224377 221597 219431 217637 215946 214548 213596 212789 211905 211138 210413 209141 207348 206224 206726 208299
57602 208299 209829 211147 212582 213761 214039 213657 213298 212846 211621 209545 207085 204379 201376 198453 195907
57587 195907 193288 190237 187468 185757 184466 182386 179652 177470 176191 175101 173942 173149 172562 171370 169503
57572 169503 167801 166600 165422 164267 163889 164403 164797 164348 163516 163038 163006 163185 163288 162644 160581 157549 155012
57555A55012j239o18r65j393j374j126p71k86l9l94r54j090q58o60m10J10M78
57538A43423J73m30n29n9L36J92o04k041l663m508m206l726m113n024n343m867
57522A05011m345m166l990l576l142k873k678k391j784o34Q69K122K841L366L925
57507H8555M217M177M321M812M936M229L297K812K462J718R35O93P10M03o0k30
57491A27987l26p08q99k72O53P23j88j015q82Q7J229J826J422L37l51M6R38J278
57473A31885Q43J06o13j137j071l67K11pn53n04J30N84N70M85O07Q61J187J501
57455A34718J505J138Q58R59J001N77Q4l1j82r37j848j959j209m20j03o6m1O2
57437A34106L19O15N80J72o7P4J2n77r53m44L56N60M92J013J826J784O72n26j057
$$ plain form
57555 155012 153773 153155 152190 150797 149423 148297 147526 147240 147201 146807 145853 144763 143905 143245 142835 142945 143423
57538 143423 143596 143166 142637 142578 142914 143106 142502 140461 136798 132290 128084 124358 120245 115221 109878 105011
57522 105011 100666 96500 92510 88934 85792 82919 80241 77850 76066 75432 76301 78423 81264 84630 88555
57507 88555 92772 96949 101270 106082 111018 115247 118544 121356 123818 125536 126471 127164 127874 128277 128217 127987
57491 127987 127661 126953 126054 125782 126435 127158 126970 125955 125073 125160 126389 128215 129637 129974 129623 129669 130607 131885
57473 131885 132728 132834 132221 131084 130013 129646 129857 129850 129297 128793 128923 129507 130077 130562 131169 132030 133217 134718
57455 134718 136223 137361 138219 139178 140179 140756 140840 140809 140627 139690 137842 135883 134674 134254 134151 134085 134044 134106
57437 134106 134425 135040 135620 135792 135725 135799 135811 135234 134281 133837 134193 134753 135245 136258 138084 139868 140540 140014 138957
57418A38957j065q86o46n20n49k91N18J224J040L53K78J040J762J791J287N89
57402A44882j76p95j059j154j344j422j072n23j66J63P83J419J552J275R84O99
57386A44046M06O01J550K504K660K411K570K813K239J112O14J020J455J419J232
57371A68652R48K16o05n52L68R09L30o37r95p16l27m4J13Q5j1J24M68P00Q20J178
57351A71024J803K252K203J747J049K73k15j66K12O01J075J638J707Q42l08o42
57335A85095k9P22J087J170J096R17R54J368J616J215P11R22J553J666J277J246
57319B02586J744K096K029J891J634Q62r1l55R1M42M96Q82J679K157J988J586
57303B21717J066K32l37L50J968K998K946K895L308L017J311m27m64R66K283K714
$$ plain form
57418 138957 137892 137006 136360 135840 135291 135000 135518 136742 137782 138135 138413 139453 141215 143006 144293 144882
57402 144882 144706 143911 142852 141698 140354 138932 137860 137337 137171 137334 138117 139536 141088 142363 143347 144046
57386 144046 144452 145053 146603 149107 151767 154178 156748 159561 161800 162912 163526 164546 166001 167420 168652
57371 168652 169600 169816 169211 168659 169027 169936 170266 169629 168634 167918 167591 167547 167660 167745 167734 167858 168326 169026 169846 171024
57351 171024 172827 175079 177282 179029 180078 180351 180136 179970 180182 180783 181858 183496 185203 186045 185737 185095
57335 185095 185066 185788 186875 188045 189141 190058 191012 192380 193996 195211 195922 196844 198397 200063 201340 202586
57319 202586 204330 206426 208455 210346 211980 212842 212751 212396 212487 212929 213425 214307 215986 218143 220131 221717
57303 221717 222783 223015 222678 223028 224996 227994 230940 233835 237143 240160 241471 241044 240580 241546 243829 246543
57287B46543K680K616K550K544K736L100L629M438N329N723N463N183N448N972
57273C03954O170O053O161O828P840Q623Q742Q454Q560R322R874R344Q121P155
57259D15201O393N156L745L256L740M050L750L694M291M769M724M882N562N784
57245D78997M946M063M211M858M979M866N487O683P468P600P702P983P995P605
57231E65443P313P515Q111Q752R101Q975Q696Q968J0040J1288J2048J2406J2748
57218F91404J3007J2911J2583J2315J2073J1706J1394J1415J1691J1948J2106
57207H24553J2243J2407J2694J3190J3710J3959J4078J4471J5007J4992J4207
57196I75511J3355J3167J3657J4544J5749J7084J8032J8362J8482J8836J9356
$$ plain form
57287 246543 249223 251839 254389 256933 259669 262769 266398 270836 276165 281888 287351 292534 297982 303954
57273 303954 310124 316177 322338 329166 337006 345629 354371 362825 371385 380707 390581 399925 408046 415201
57259 415201 421594 426750 430495 433751 437491 441541 445291 448985 453276 458045 462769 467651 473213 478997
57245 478997 483943 488006 492217 497075 502054 506920 512407 519090 526558 534158 541860 549843 557838 565443
57231 565443 572756 580271 588382 597134 606235 615210 623906 632874 642914 654202 666250 678656 691404
57218 691404 704411 717322 729905 742220 754293 765999 777393 788808 800499 812447 824553
57207 824553 836796 849203 861897 875087 888797 902756 916834 931305 946312 961304 975511
57196 975511 988866 1002033 1015690 1030234 1045983 1063067 1081099 1099461 1117943 1136779 1156135
57185A156135J9791K0131K0435K0673K0943K1324K1512K1186K0813K1307K2708
57174A386958K4070K4823K5343K5882K6040K5725K5643K6127K6451K6065K5686
57163A668813K6262K7542K8498K8746K8763K9028K9664L0521L1057L0506K8654
57152A988054K6268K4317K3105K2421K2022K1666K1101K0437K0038J9983K0122
57141B229534K0733K2230K4079K5048K4855K4618K5131K5840K6085K6283K7105
57130B501541K8499L0386L3344L7519M1663M4418M5977M7533M9654N2329N5972
57119B968835O1138O7457P3940Q0167Q6262R1939R6666J00824J05800J12841J22436
57108C968305J34878J50795J70937J95980K26663K63937L08946L63198M28675
$$ plain form
57185 1156135 1175926 1196057 1216492 1237165 1258108 1279432 1300944 1322130 1342943 1364250 1386958
57174 1386958 1411028 1435851 1461194 1487076 1513116 1538841 1564484 1590611 1617062 1643127 1668813
57163 1668813 1695075 1722617 1751115 1779861 1808624 1837652 1867316 1897837 1928894 1959400 1988054
57152 1988054 2014322 2038639 2061744 2084165 2106187 2127853 2148954 2169391 2189429 2209412 2229534
57141 2229534 2250267 2272497 2296576 2321624 2346479 2371097 2396228 2422068 2448153 2474436 2501541
57130 2501541 2530040 2560426 2593770 2631289 2672952 2717370 2763347 2810880 2860534 2912863 2968835
57119 2968835 3029973 3097430 3171370 3251537 3337799 3429738 3526404 3627228 3733028 3845869 3968305
57108 3968305 4103183 4253978 4424915 4620895 4847558 5111495 5420441 5783639 6212314
57099F212314N07797O03470P19274Q59210J026979J225387J456084J718868K010499
57090A6339882K323803K647308K965262L258615L507399L693106L800065L817529
57082D2352969L743278L584365L350233L042464K651783K165810J579700R01941
57074F3372543J55770o21187j381305k077026k671254l141605l479152l686025
57066D6470759l772693l753790l644913l463055l228071k960899k679833k399260
57058B0568245k130797j883217j660960j464299j291493j140206j007570q90708
57050I098995p87761o97666o19132n50653m91175m39822l95308l56611l23560
57041D437307k95668k71026k47773k26011k06614j88567j69440j48308j26248
$$ plain form
57099 6212314 6720111 7323581 8042855 8902065 9929044 11154431 12610515 14329383 16339882
57090 16339882 18663685 21310993 24276255 27534870 31042269 34735375 38535440 42352969
57082 42352969 46096247 49680612 53030845 56073309 58725092 60890902 62470602 63372543
57074 63372543 63528313 62907126 61525821 59448795 56777541 53635936 50156784 46470759
57066 46470759 42698066 38944276 35299363 31836308 28608237 25647338 22967505 20568245
57058 20568245 18437448 16554231 14893271 13428972 12137479 10997273 9989703 9098995
57050 9098995 8311234 7613568 6994436 6443783 5952608 5512786 5117478 4760867 4437307
57041 4437307 4141639 3870613 3622840 3396829 3190215 3001648 2832208 2683900 2557652
57032B557652j03742p9721n4030k9192q734M976J0221M614j3646m2617p5484j03327
57020B066970j19840j24150j19672j10602r9580q8060p7246o7751n9275n1612
57010A149182m5412m1039l7485l3573k9687k6980k5372k3679k1518j9629j8442
56999H26366j7623j7045j6903j6852j6200j5043j4047j3103j1356q749o290m546
56987F68609k909p03J929M511O686P952P720N854K599j978p682j3467j7905k0405
56973F40811k1237k0585j8595j6157j4372j3225j1767r640p314m887j892J533
56961E02673M620P356J0682J4843J8561K0298J9552J6568J1657N202k296j0338
56949F19378j7978k3431k5258k3981k1548j9079j6302j3119j0302q050n287j223
$$ plain form
57032 2557652 2453910 2374189 2320159 2290967 2282233 2287209 2297430 2302044 2288398 2245781 2170297 2066970
57020 2066970 1947130 1822980 1703308 1592706 1493126 1405066 1327820 1260069 1200794 1149182
57010 1149182 1103770 1062731 1025246 991673 961986 935006 909634 885955 864437 844808 826366
56999 826366 808743 791698 774795 757943 741743 726700 712653 699550 688194 679445 673155 668609
56987 668609 665700 664997 666926 671437 678123 686075 693795 699649 702248 700270 692588 679121 661216 640811
56973 640811 619574 598989 580394 564237 549865 536640 524873 515233 507919 503032 501140 502673
56961 502673 507293 514649 525331 540174 558735 579033 598585 615153 626810 632012 629716 619378
56949 619378 601400 577969 552711 528730 507182 488103 471801 458682 448380 440330 435043 433820
56937D33820L380P333J0582J3857J7449K1029K4263K6816K7929K6502K1591J2952
56925F47503J515j0566k0861k7951l1751l2837l1855k9432k6091k2372j9139j7180
56913C78983j6074j4330j1482r069q374q170o417l545j927k305k920k416j521
56900B90433j099n21J061L164M852O020O964P702Q490J0040J2512J5146J7487
56887C82251J9934K2472K3945K3439K1330J8097J3108N779k678r897j4508j6858
56875D86414j7785j7527j5877j2947r434o050k691J512O899J2610J7813K3048
56863D65985K9390L6661M3698M9975N5444N8774N7446M9955L6728J8908j863k2135
56851H78966l7301m4923m6410m4471m0251l3772k5770j7506r490j505O598J4961
$$ plain form
56937 433820 437200 444533 455115 468972 486421 507450 531713 558529 586458 612960 634551 647503
56925 647503 649018 638452 617591 589640 557889 525052 493197 463765 437674 415302 396163 378983
56913 378983 362909 348579 337097 328028 319654 311484 305067 301522 299595 297290 294370 291954 290433
56900 290433 289334 288813 289874 293038 297890 303910 310874 318576 327066 337106 349618 364764 382251
56887 382251 402185 424657 448602 472041 493371 511468 524576 530355 527677 517780 503272 486414
56875 486414 468629 451102 435225 422278 412844 406794 404103 405615 412514 425124 442937 465985
56863 465985 495375 532036 575734 625709 681153 739927 797373 847328 884056 902964 901101 878966
56851 878966 841665 796742 750332 705861 665610 631838 606068 588562 579072 577567 584165 599126
56839E99126K3991L3859M4306N5383O7455P9778Q9832R4769R2663Q2052O1681
56828A324895L2220k317l5884o3131q0878q8404q7453q1332p2787o2810n1659
56817G30460m0147k9206j9000r263L2R062J8539K8976L9953N0467N9344O4935
56805I04152O5220N8900M5817K6361J716k4739m7742o3156p0276p0870o7042o0657
56793F97684n3446m6308l9050l1557k4404j7761j0795l060M563J1227J7322K3266
56781E27681K8193L0981L1508K9611K3974J3677J97j3589k5822l5786m2480m4922
56769E23223m3634m0341l6238l1698k7382k4199k2141k0241j7778j4718j1310
56758B33543q146o278o171o781o616n546m639m520m842n111n003m159k652j465
$$ plain form
56839 599126 623117 656976 701282 756665 824120 903898 993730 1088499 1181162 1263214 1324895
56828 1324895 1357115 1354798 1318914 1255783 1174905 1086501 999048 917716 844929 782119 730460
56817 730460 690313 661107 642107 632844 632876 641938 660477 689453 729406 779873 839217 904152
56805 904152 969372 1028272 1074089 1100450 1102166 1077427 1029685 966529 896253 825383 758341 697684
56793 697684 644238 597930 558880 527323 502919 485158 474363 471303 475866 487093 504415 527681
56781 527681 555874 586855 618363 647974 671948 685625 685822 672233 646411 610625 568145 523223
56769 523223 479589 439248 403010 371312 343930 319731 297590 277349 259571 244853 233543
56758 233543 225397 219119 212948 206167 199551 194005 189366 184846 180004 174893 169890 165731 163079 161614
56744A61614j511k350k758k330j615r60l58j64q15j804k000j163k23J6k94o14
56728A42671o76m32J06P80J405J922K201J978J321P86P54J032J394J888K189J511
56712A60830j77j619j805j246q82n75K42J134J264Q41P15Q28N00q5k5O70R56M22
56694A61988r0J55Q01J143J106J049J177J428J655J818K053K422K523J838P24
56679A81790K99R99J927K213K087J973J484L74m32NJ061J418J004P45Q39O29M8
56662A98463k17j8L2k69m03q9L83Q14J259J474J017lj007j737k407l146l933m850
56644A85363n858o521o619o572o696o535n681m747m481m452l558j611N72K324
56630A24928L475L846L428K801K550K471K103J596J341J150P56N50Q43R81L15
$$ plain form
56744 161614 160103 157753 154995 152665 151050 150090 149732 149568 148753 146949 144949 143786 143563 143579 143285 142671
56728 142671 141995 141563 141669 142449 143854 145776 147977 149955 151276 152062 152816 153848 155242 157130 159319 160830
56712 160830 160653 159034 157229 155983 155101 154526 154768 155902 157166 158007 158722 159550 160050 159965 159940 160610 161566 161988
56694 161988 161898 162053 162854 163997 165103 166152 167329 168757 170412 172230 174283 176705 179228 181066 181790
56679 181790 182089 183088 185015 187228 189315 191288 192772 193146 192714 192719 193780 195198 196202 196947 197786 198415 198463
56662 198463 198246 198228 198260 197991 197588 197499 197882 198696 199955 201429 202446 202443 201436 199699 197292 194146 190213 185363
56644 185363 179505 172984 166365 159793 153097 146562 140881 136134 131653 127201 123643 122032 122604 124928
56630 124928 128403 132249 135677 138478 141028 143499 145602 147198 148539 149689 150445 150995 151838 152819 153134
56615A53134n20m25M09Q32M31k22o85q81n77K62R02O81J00M8L98N47P25J505K357
56596A59021K163R11l02p79o03M3P47N99n97j415n34J137J659Q14K1l5J16L26
56578A63292R88J724J724J368J706K344J791M0j072m59J012K188K925L358L455
56563A86384L558M071M476M170M051N473P625Q087O260M122L150K574J483N33
56549B46017M61O29K54l29o95j295k391l109k612j326k98j07q28k108k982k631
56533B26650j594j138j339j170m67j60l77j49N46M54o34j128j52R66P62l95j413
56516B19262k041k267j667n51k78j297k155j653o14l15m52j78P3o10j752j995
56500B01510r79M73J577K005J569M75m48n86k50j06l47q23j260j124n0J224J415
$$ plain form
56615 153134 152614 152189 152598 153430 153861 153639 152954 152073 151496 151758 152660 153341 153441 153489 153887 154434 155159 156664 159021
56596 159021 161184 162095 161793 161014 160411 160454 161201 161800 161203 159788 159254 160391 162050 162864 162885 162850 162966 163292
56578 163292 164280 166004 167728 169096 170802 173146 174937 174977 173905 173446 174458 176646 179571 182929 186384
56563 186384 189942 194013 198489 202659 206710 212183 219808 227895 234155 238277 241427 244001 245484 246017
56549 246017 246478 247107 247361 247032 246337 245042 242651 239542 236930 235604 235306 235199 234371 232263 229281 226650
56533 226650 225056 223918 222579 221409 220942 220782 220405 220256 220802 221256 220622 219494 219342 220308 221070 220675 219262
56516 219262 217221 214954 213287 212736 212458 211161 209006 207353 206739 206424 205972 205794 205867 205257 203505 201510
56500 201510 200531 201004 202581 204586 206155 206630 206182 205596 205346 205240 204893 204070 202810 201686 201636 202860 204275
56483B04275M55l44k51j5k93n76l33P1L07P12J247J144L26r9L43O17O1l29L64
56464B07682J264J172N37N20J003J047O01L97N46N01P9m34q33r20l57P41J648
56447B15194J985K162K359K068J128L08J00M6j14K13J198J818J341M75K4m30j394
56430B28481k108j679o71k45l70j32O99J487J748J433O32k73o18k16M25J026J812
56413B31431K598K599J804J266J414J299L63l62J49J292J899J879J756J546J213
56398B52146J269J863K148J559P90O09O99N71O20J195J753J879K069K476K090
56383B73736L37j676k822l661n193o960p846p796p359o327m269j732L37J720K480
56368B22969K321J470J142J964K878K862K575K984L501L001J858J372J835K502
$$ plain form
56483 204275 204730 204386 204135 204120 203827 203251 202918 202989 203296 204008 205255 206399 206725 206626 206969 207586 207647 207318 207682
56464 207682 208946 210118 210655 211175 212178 213225 213826 214223 214769 215270 215349 214915 214082 213162 212805 213546 215194
56447 215194 217179 219341 221700 223768 224896 225204 225304 225350 225236 225449 226647 228465 229806 230281 230305 229875 228481
56430 228481 226373 224694 224023 223778 223408 223276 223975 225462 227210 228643 229275 229002 228384 228168 228593 229619 231431
56413 231431 234029 236628 238432 239698 241112 242411 242774 242412 242561 243853 245752 247631 249387 250933 252146
56398 252146 253415 255278 257426 258985 259775 260384 261083 261654 262274 263469 265222 267101 269170 271646 273736
56383 273736 274073 272397 269575 265914 260721 253761 245915 238119 230760 224433 220164 218432 218769 220489 222969
56368 222969 225290 226760 227902 229866 232744 235606 238181 241165 244666 247667 249525 250897 252732 255234
56354B55234K812K522J432N7l38N79J493J475J347J916K294J588P88J140J908
56339B76247J663P58N70J113J378J269J460J939K342K946L805L834K461J156J467
56324C04408K534K520J627J471K235K674K448K349K440K034J293J048J199R88
56310C31268N91Q05J441J599J309J402K055K790L478M142M415M311M679N676N964
56295C75925M840L746L997M533L942L228M035N504N578M539M373N299N815N745
56281D41099O422P891Q651Q225P674P593P709Q307R795J1155J1170J0893J2428
56268E59012J5512J7798J8462J8909J9976K1046K2146K4267K7291K9964L2380
56257H06763L6115M1489M7046N2180N8065O5439P3565Q1935R0981J00607J09882
$$ plain form
56354 255234 258046 260568 262000 262057 261719 262298 263791 265266 266613 268529 270823 272411 273199 274339 276247
56339 276247 277910 278668 279238 280351 281729 282998 284458 286397 288739 291685 295490 299324 301785 302941 304408
56324 304408 306942 309462 311089 312560 314795 317469 319917 322266 324706 326740 328033 329081 330280 331268
56310 331268 331859 332664 334105 335704 337013 338415 340470 343260 346738 350880 355295 359606 364285 369961 375925
56295 375925 380765 384511 388508 393041 396983 400211 404246 409750 415328 419867 424240 429539 435354 441099
56281 441099 447521 455412 464063 472288 479962 487555 495264 503571 513366 524521 535691 546584 559012
56268 559012 574524 592322 610784 629693 649669 670715 692861 717128 744419 774383 806763
56257 806763 842878 884367 931413 983593 1041658 1107097 1180662 1262597 1353578 1454185 1564067
56246A564067J18653J27625J36421J43357J47468J49082J48256J44383J37384
56237B816696J27444J13650R4896P2226M8312K4523M85k3574m6193o6461q4333
56226C077671r9135j09985j17698j24023j28817j30287j28149j24233j19709j14151
56216A881484j07646j01393r5656q9356q2326p5819p0315o4832n8918n3367m8554
56205A033302m4034m0001l7230l5278l2737k9394k6217k3300j9904j6426j4015
56194G14766j2439j0645r182r372j0329r779p819o735o925o289m137k346j877
56181F16892j321N7Q46K01p48j242j946k746k206k75J139J261J538K700L480L305
56165F20935L450M379M739M261M833P236R419R588Q719Q528R171J0298J2204J4657
$$ plain form
56246 1564067 1682720 1810345 1946766 2090123 2237591 2386673 2534929 2679312 2816696
56237 2816696 2944140 3057790 3152686 3224912 3273224 3297747 3298232 3274658 3228465 3162004 3077671
56226 3077671 2978536 2868551 2750853 2626830 2498013 2367726 2239577 2115344 1995635 1881484
56216 1881484 1773838 1672445 1576789 1487433 1405107 1329288 1258973 1194141 1135223 1081856 1033302
56205 1033302 989268 949267 912037 876759 844022 814628 788411 765111 745207 728781 714766
56194 714766 702327 691682 682500 673128 662799 653020 645201 638466 631541 625252 621115 618769 616892
56181 616892 615571 615628 616474 616675 615927 614685 612739 609993 607787 607512 608651 609912 611450 614150 617630 620935
56165 620935 624385 628764 633503 637764 642597 649833 659252 668840 677559 686087 695258 705556 717760 732417
56151G32417J6545J7827J9867K2979K5865K8268L1918L7919M5504N4046O3890
56140A097045P4434Q3889R1681R8515J03513J04059R9313R1199Q1341P0044N8840
56129B053873N0589M5883M2343L8401L4505K9901K2110J1138O24o991j3196j9873
56117B289307k6539l2932m0994n2087o4835p7361q8830r7535j00687r7823r1559
56106A518125q3789p4226o3604n4443m7176l9421l0656k3681j9696j6168j1593
56095A053672q129p122o251l777j633j461j393K98K063K453L044N086O756O582
56081A050188O244P207Q078P984Q851J1512J3324J2565J1487J2064J2625J1760
56069A173889J1550J3461J5095J4450J3683J5072J7017J7519J7846J9266K0029
$$ plain form
56151 732417 748962 766789 786656 809635 835500 863768 895686 933605 979109 1033155 1097045
56140 1097045 1171479 1255368 1347049 1445564 1549077 1653136 1752449 1843648 1924989 1995033 2053873
56129 2053873 2104462 2150345 2192688 2231089 2265594 2295495 2317605 2328743 2329367 2322376 2309180 2289307
56117 2289307 2262768 2229836 2188842 2136755 2071920 1994559 1905729 1808194 1707507 1609684 1518125
56106 1518125 1434336 1360110 1296506 1242063 1194887 1155466 1124810 1101129 1081433 1065265 1053672
56095 1053672 1045543 1038421 1032170 1028393 1026760 1025299 1023906 1024204 1026267 1028720 1031764 1036850 1043606 1050188
56081 1050188 1056432 1063639 1071717 1079701 1088552 1100064 1113388 1125953 1137440 1149504 1162129 1173889
56069 1173889 1185439 1198900 1213995 1228445 1242128 1257200 1274217 1291736 1309582 1328848 1348877
56058A348877J9150J9100K1095K1979J9720J7576J8570K0153J9002J6943J7240
56047A559405J8792J9011J8896K0312K1679K1123K0658K2616K5283K6427K7550
56036A801752L0221L2096L1216L0377L2480L5441L6460L7249M0114M3084M3947
56025B194437M4829M7684M9779M8900M8379N1408N5226N6555N7807O1776O5417
56014B782197O5529O5475O9442P4937P7924Q0400Q5712R1380R4072R6705J03040
56003C686813J10263J14535J18674J26471J34895J40132J45597J55430J65938
55994D898748J72487J78780J89959K02764K12327K22354K38193K56335K71482
55985F843429K87344L09293L33384L54373L77184M08148M42770M75268N11911
$$ plain form
56058 1348877 1368027 1387127 1408222 1430201 1449921 1467497 1486067 1506220 1525222 1542165 1559405
56047 1559405 1578197 1597208 1616104 1636416 1658095 1679218 1699876 1722492 1747775 1774202 1801752
56036 1801752 1831973 1864069 1895285 1925662 1958142 1993583 2030043 2067292 2107406 2150490 2194437
56025 2194437 2239266 2286950 2336729 2385629 2434008 2485416 2540642 2597197 2655004 2716780 2782197
56014 2782197 2847726 2913201 2982643 3057580 3135504 3215904 3301616 3392996 3487068 3583773 3686813
56003 3686813 3797076 3911611 4030285 4156756 4291651 4431783 4577380 4732810 4898748
55994 4898748 5071235 5250015 5439974 5642738 5855065 6077419 6315612 6571947 6843429
55985 6843429 7130773 7440066 7773450 8127823 8505007 8913155 9355925 9831193 10343104
55976A0343104N60782O17066O73526P36449Q15013R04585R98219J104737J236486
55967A7989967J390002J559518J758591K005949K302223K645764L058921L571443
55959C6282378M192387M930650N830736O956650Q358942J0095213J2257412J4925588
55951A03829956J8113189K1802136K5961986L0387748L4490709L7357680L8055125
55944C09998529L5805662K9961627K0205785P159266p234232k0277469k9785652
55937C45833516l4980445l6378654l5078617l2176763k8546965k4791169k1241252
55930A32639651j8038466j5243425j2875175j0897583r241891p856099o708724
55923E1778288n758677m957940m279196l711650l234434k820017k458498k153707
$$ plain form
55976 10343104 10903886 11520952 12194478 12930927 13745940 14650525 15648744 16753481 17989967
55967 17989967 19379969 20939487 22698078 24704027 27006250 29652014 32710935 36282378
55959 36282378 40474765 45405415 51236151 58192801 66551743 76646956 88904368 103829956
55951 103829956 121943145 143745281 169707267 200095015 234585724 271943404 309998529
55944 309998529 345804191 375765818 395971603 403130869 395896637 375619168 345833516
55937 345833516 310853071 274474417 239395800 207219037 178672072 153880903 132639651
55930 132639651 114601185 99357760 86482585 75585002 66343111 58487012 51778288
55923 51778288 46019611 41061671 36782475 33070825 29836391 27016374 24557876 22404169
55915B2404169j898707j676721j482069j319177j183764j063948r57196q68586
55907A1954001p94698p25643o60565o05804n59920n15015m70726m33011m01108
55898F787511l68767l36528l10236k89048k66834k43771k25204k10664j94910
55889D341549j78160j64841j53882j40577j26330j16627j10947j04553r8421r7363
55879C049848r9657r8512r3019q8270q5472q1254p6163p4599p6313p6470p4142
55868B125977p2709p2071o8608o2760n8733n6644n2664m7003m4104m4549m4193
55857A501939m1816m0464m0615l9115l5614l3406l2956l1061k7334k5345k6229
55846A127984k7119k6743k6983k7989k7322k4923k3571k3672k2670k0282j9062
$$ plain form
55915 22404169 20505462 18828741 17346672 16027495 14843731 13779783 12822587 11954001
55907 11954001 11159303 10433660 9773095 9167291 8607371 8092356 7621630 7188619 6787511
55898 6787511 6418744 6082216 5771980 5482932 5216098 4972327 4747123 4536459 4341549
55889 4341549 4163389 3998548 3844666 3704089 3577759 3461132 3350185 3245632 3147211 3049848
55879 3049848 2950191 2851679 2758660 2670390 2584918 2503664 2427501 2352902 2276589 2200119 2125977
55868 2125977 2053268 1981197 1912589 1849829 1791096 1734452 1681788 1634785 1590681 1546132 1501939
55857 1501939 1460123 1419659 1379044 1339929 1304315 1270909 1237953 1206892 1179558 1154213 1127984
55846 1127984 1100865 1074122 1047139 1019150 991828 966905 943334 919662 896992 876710 857648
55835H57648j9176j7920j5123j3812j4586j4511j2578j1219j1307j0600q417p177
55823G01222p906q637q560r442j1655j2985j2680j2705j3699j3580j1476r299
55811E68598q260p248n832n324n806n426l725k385j853n03J968L704M077M683
55797E36668O039O476N277L937L345K550J054l54j551l183m579m380l391l768
55783E44140n429o469p017r102j2482j4369j3751j2297j0487o712j075L802O719
55770D55471R133J1411J1445Q185L119k734r741j6475j9530j8183j5830j5089
55758D01182j4766j3302j1781j1373j0925r416q160q420r086q728p809p041n744
55745B74631l547j665q90l34N24O96p9k83O90J188J08j218j584j993l367m432
$$ plain form
55835 857648 838472 820552 805429 791617 777031 762520 749942 738723 727416 716816 708399 701222
55823 701222 693316 684679 676119 666677 655022 642037 629357 616652 602953 589373 577897 568598
55811 568598 560338 553090 547258 541934 536128 530702 526977 524592 522739 522236 524204 527908 531985 536668
55797 536668 542707 549183 554460 558397 561742 564292 565346 564992 563441 560258 555679 551299 547908 544140
55783 544140 538711 532242 525225 516123 503641 489272 475521 463224 452737 446025 444950 448752 455471
55770 455471 464604 476015 487460 495645 498764 496030 486289 469814 450284 432101 416271 401182
55758 401182 386416 373114 361333 349960 339035 329619 321459 313039 303953 295225 287416 280375 274631
55745 274631 271084 269419 268529 268195 268719 269415 269336 269053 269743 270931 271039 269821 268237 266244 262877 258445
55729B58445l883k693k367k641k766l263m565n458m828l545k898k575j700n62
55715B14701K58J143K362L124L121L575N203O540N913L849K010Q36k33j275k052
55700B49075k874l970m867n346o065p290q090p760o928o314n571m369l333k828
55686A73470k002k24J655K549K641K607K438K082K227L283M379M432L500K303
55672B05340J195K62l97j063k152l215l198k134j246j044p13J18O21M13L70R52
55656A94109J334J058J056J942K834K825K313J882J235L31Q7Q17J246L08j250
55641B12127k146k348k556l044l911n352o812p077o074n258n365n311m215k974
55627A49684k610k547j867r68o52p14o87q71j410j546q80k38k15j93J60j37j597
$$ plain form
55729 258445 254562 251869 249502 246861 244095 240832 236267 230809 225981 222436 219538 216963 215263 214701
55715 214701 214959 216102 218464 221588 224709 228284 233487 240027 245940 249789 251799 252635 252402 251127 249075
55700 249075 246201 242231 237364 232018 225953 218663 210573 202813 195885 189571 184000 179631 176298 173470
55686 173470 171468 171244 172899 175448 178089 180696 183134 185216 187443 190726 195105 199537 203037 205340
55672 205340 206535 206797 206400 205337 203185 199970 196772 194638 193392 192348 191635 191753 192374 192787 193157 194109
55656 194109 195443 196501 197557 199499 202333 205158 207471 209353 210588 210919 211006 211823 213069 213377 212127
55641 212127 209981 207633 205077 202033 198122 192770 185958 178881 172807 167549 162184 156873 152658 149684
55627 149684 147074 144527 142660 141692 141040 140326 139639 138768 137358 135812 134932 134694 134479 134286 134446 134309 132712
55610A32712k945k982k425k437k677k352j866j838j669p95j56p08j560j349m49
55595A06504l1J8L75M48p10k336k796k001j170p14j13N90R65J423K518L414K856
55578A09240J384Q01J571K516L050L841N149O133O248N984N866N786N495M865
55564A67929L584J517o60k064k791l623m746n626n988n987n590m737l864l532
55550A23822l591l518l183k652j665k01R90J271J064J065J130Q93P99J381K109
55535A19714K144J737J703J964J911J692J847K049J539N70J06L22N50M91L07j38
55519A38508q99j172k61R92J180M33J04N29P01J35n43j080k138l952n786p178
55503A19573q495r727r965q690o722n171m200l321k336j443p96l36P5M64N85J75
$$ plain form
55610 132712 129767 126785 124360 121923 119246 116894 115028 113190 111521 110726 110570 109862 108302 106953 106504
55595 106504 106473 106491 106866 107314 106604 104268 101472 99471 98301 97587 97474 98064 99029 100452 102970 106384 109240
55578 109240 110624 111425 112996 115512 118562 122403 127552 133685 139933 145917 151783 157569 163064 167929
55564 167929 171513 173030 172370 170306 167515 163892 159146 153520 147532 141545 135955 131218 127354 123822
55550 123822 120231 116713 113530 110878 109213 109012 110002 111273 112337 113402 114532 115425 116224 117605 119714
55535 119714 121858 123595 125298 127262 129173 130865 132712 134761 136300 136870 136976 137298 137848 138339 138646 138508
55519 138508 137609 136437 136176 137168 138348 138781 138885 139414 140115 140250 139707 138627 136489 132537 126751 119573
55503 119573 111078 101351 91386 82696 75974 70803 66603 63282 60946 59503 58707 58371 58446 58910 59495 59670
55487E9670l75j46J001J847J307l8q21q10q57j277j488j195p43l05K68P71P46
55470E7555L68L29P98J265J429J489J572J604J636J616J098m0r79r47m76n89j105
55453F6623j004k19K69J43J15N15P79O08M17L33j15r38j364r67k72J38L26M92
55435F5879O03P60J152J454J105K93j44J7P1l33n99j73N29P17K06m52m66N74K168
55416G3361L214L320L403M224M873L926J681j11o84r51j636k241k268k155k339
55401H5617k503k364k230k204j847j118q06j384k222k416j741m69R30J659J098
55386F8000j35o03J01Q89R59Q42J099J171M58m33o29l68m60r29j222j303j572
55369F5865j962j991j527q05O3R81J549J512J360J741K419K420J318j63r82q40
$$ plain form
55487 59670 59295 59149 60150 61997 63304 63266 62445 61635 60778 59501 58013 56818 56075 55770 56038 56809 57555
55470 57555 57923 58252 59050 60315 61744 63233 64805 66409 68045 69661 70759 70719 69740 68793 68317 67728 66623
55453 66623 65619 65400 65669 65812 65927 66442 67221 67829 68246 68579 68464 67526 66162 65195 64923 65061 65387 65879
55435 65879 66482 67242 68394 69848 70953 71246 71102 71119 71190 70857 70258 70085 70614 71331 71537 71085 70619 71193 73361
55416 73361 76575 79895 83298 87522 92395 96321 98002 97891 97207 96256 94620 92379 90111 87956 85617
55401 85617 83114 80750 78520 76316 74469 73351 72545 71161 68939 66523 64782 64313 65243 66902 68000
55386 68000 67865 67262 67363 68252 69211 70053 71152 72323 72781 72348 71719 71351 70891 69962 68740 67437 65865
55369 65865 63903 61912 60385 59580 59643 60624 62173 63685 65045 66786 69205 71625 72943 72780 71798 70958
55353G0958k88mj07k01k2K40L45M13O29P82O08L23K78L16O9k89l23k00l54m79
55333G2694R0J045J289O32R5K12K96j01k44M34J151R55K52R0N12O68K06m02p40
55314G9134q53q74q42p99o77k63L47O21K82k17l37j84j69l46n27o44o41l55N5
55295G2711P2l91o85m09j26m55r82q84k22K72M18P33J380J792J492P48J97J93
55277G5854N72P82L26p06j627j882j561j037m21K52O56N08K4l06l09n6N00J357
55259G2926K105K248J786J158O37K13j00k51l80o24q29p81o54q01j136j162p12
55242G3643k68m14j124j789j757r20J57O59K54n71r58m94M20R84P37l1n29k17
55224F7782O86J472J659J340Q83N21K47l2l09m40k90J02N78J096J593J699J079
$$ plain form
55353 70958 70670 70666 70559 70358 70336 70576 70921 71334 71963 72745 73353 73676 73954 74270 74339 74050 73727 73527 73173 72694
55333 72694 72784 73829 75118 75750 75845 76057 76353 76252 76008 76442 77593 78548 78800 78890 79402 80070 80276 79874 79134
55314 79134 78281 77407 76565 75766 75089 74826 75173 75794 76076 75859 75522 75338 75169 74823 74296 73652 73011 72656 72711
55295 72711 72783 72392 71707 71298 71172 70717 69735 68851 68629 68901 69319 70052 71432 73224 74716 75464 75661 75854
55277 75854 76426 77208 77534 76828 75201 73319 71758 70721 70300 70552 71208 71716 71740 71434 71125 71069 71569 72926
55259 72926 75031 77279 79065 80223 80860 81073 80973 80722 80342 79718 78889 78108 77454 76653 75517 74355 73643
55242 73643 73375 72961 71837 70048 68291 67371 67528 68187 68441 67870 66912 66418 66838 67822 68559 68528 67999 67782
55224 67782 68468 69940 71599 72939 73822 74343 74590 74558 74249 73809 73519 73621 74199 75295 76888 78587 79666
55207G9666J23k78L4J71l83q43l66N03O29j4o08r95j543j841j084K48P02O9l15
55188G3875J44M13o5j79Q38J705R98m94r58k73J40k61o08l76j02j67j51K36O18
55169G5333O66O01O86Q36R66J120J092N25l93p90q1J249K094J825Q21m4l20l03
55151H5883l80l16K97J076J047J9j021j249r24n92j41N70R57M86l10n24k43k25
55133H4410n45n98k74j27l43m92m24n38r44j144p99k17J91M38P17J041J355J637
55115H3344J768J634J370J219J121Q45M66L36N44P56O58K07m69j114j341r38j93
55098I0213L49M38K32M6K09Q76J692J956J475Q81O89N20j74j038j272q09l00l5
55080I5948K07M00K00k85m79k32j1q5j96j94l05m83k31N74J236J106L93k12l91
$$ plain form
55207 79666 79789 79511 79545 79716 79333 78490 78124 78627 79256 79242 78634 77639 76096 74255 73171 73419 74121 74190 73875
55188 73875 74019 74432 74367 74188 75026 76731 77729 77235 76277 76004 76144 75883 75275 74899 74797 74630 74479 74715 75333
55169 75333 75999 76600 77286 78122 79088 80208 81300 81825 81432 80642 80561 81810 83904 85729 86550 86506 86186 85883
55151 85883 85503 85187 85484 86560 87607 87626 86605 85356 84432 83840 83699 84269 85226 85712 85402 84878 84635 84410
55133 84410 83865 83267 82993 82866 82523 82031 81607 81069 80125 78981 78182 77965 78156 78594 79311 80352 81707 83344
55115 83344 85112 86746 88116 89335 90456 91301 91767 92103 92647 93403 94061 94268 93799 92685 91344 90406 90213
55098 90213 90562 91000 91232 91278 91487 92363 94055 96011 97486 98367 99056 99576 99402 98364 97092 96283 95983 95948
55080 95948 96155 96555 96755 96470 95991 95759 95748 95663 95467 95273 94968 94485 94254 94828 96064 97170 97563 97351 96960
55061I6960l42l32m45n95n84k20L85P98N89l15j523k313k119j122j91J04J43N40
55043H9418J124J156M49l85p15m00M35J459J962J350k0j046j096n75k06l06q46
55026I1758j574j859j067N30J751J761J001M67N12O84N60J81k02m59o09o55n00
55009I2280j10K84L31K6j59Q3M63N67M95N59O44M35J07J13L79M04R1k05m09p22
54989I5656q41j25J276K275K223J683J405J272Q03J22k31j11J76L47L05P1j50
54972A06156r6J21Q7k21k94N3K65j27p92j187j321j344r31K12J503J984J511P76
54954A06355K47k00n95n84q8L39K19k03l49j69k02q01j584j829j321n63j39l1
54936I8502J83O30R50Q76O42O46R92J471J796J741J332J005J352K464L758M566
$$ plain form
55061 96960 96618 96286 95841 95246 94662 94442 94827 95625 96214 95899 94376 92063 89944 88822 88631 88735 88878 89418
55043 89418 90542 91698 92147 91762 91047 90647 91082 92541 94503 95853 95833 94787 93691 93116 92910 92604 91758
55026 91758 90184 88325 87258 87788 89539 91300 92301 92768 93280 93964 94524 94705 94503 94044 93435 92780 92280
55009 92280 92170 92454 92785 92811 92652 92735 93198 93765 94260 94819 95463 95898 96005 96118 96497 96901 96992 96787 96378 95656
54989 95656 94815 94690 95966 98241 100464 102147 103552 104824 105627 105749 105518 105407 105583 105930 106235 106306 106156
54972 106156 106060 106181 106268 106047 105753 105806 106071 105944 105152 103965 102644 101300 100369 100581 102084 104068 105579 106355
54954 106355 106602 106402 105807 105223 105135 105474 105693 105490 105141 104972 104770 103969 102385 100556 99235 98672 98533 98502
54936 98502 98685 99315 100265 101141 101783 102429 103421 104892 106688 108429 109761 110766 112118 114582 118340 122906
54920A22906M762M675M719N160N969O672O617N631M120K430M54j857m014n384
54906A62860n853n757n377m867m390l951l283k233j156n46m08m10m80q13j319
54891A22017j569j349r15n62k95m5J24K24M94J112J875K368K464K502K918L802
54875A35165M832N600N927N834N318M346L078J838P97k44j540k974m074m536m594
54860A54773m757n178n350m663l187j743j072j229j860k708l512l711k871j411
54846A11521l54l05r30j568j834j608r25j34K55J17j69k83k86k73j61j2j14m37
54828A02500n25k40j07m80q61o08N6M22L80M65R56J568J975J996J398J27j182
54811A07840j668j323j002j113j064l04O89J099R44Q70J022Q87L08r5K12Q51J030
$$ plain form
54920 122906 127668 132343 137062 142222 148191 154863 161480 167111 171231 173661 174115 172258 168244 162860
54906 162860 157007 151250 145873 141006 136616 132665 129382 127149 125993 125447 125039 124629 124149 123336 122017
54891 122017 120448 119099 118184 117622 117327 117282 117406 117630 118124 119236 121111 123479 125943 128445 131363 135165
54875 135165 139997 145597 151524 157358 162676 167022 170100 171938 172735 172491 170951 167977 163903 159367 154773
54860 154773 150016 144838 139488 134825 131638 129895 128823 127594 125734 123026 119514 115803 112932 111521
54846 111521 111167 110862 109932 108364 106530 104922 103997 103863 104118 104235 104066 103783 103497 103224 103063 103051 102937 102500
54828 102500 101975 101735 101628 101148 100287 99679 99735 100157 100537 101002 101958 103526 105501 107497 108895 109022 107840
54811 107840 106172 104849 103847 102734 101670 101366 102055 103154 104098 104968 105990 106877 107185 107090 107302 108153 109183
54794A09183O26K68M14P71P63K90k12l71k31l0J40L59O55Q54O67M2o27p27p1P97
54774A13560J144Q66N48P76J608K726L803M557M797M630M497M802N582O549P314
54759A67759P484O765N230L357J541l23k545m994o966p800p446o405n256m345
54745A46056l810l641l601l253k345j252p47j193k040k375j823p61J98O61N77
54730A20651K62K64Q59J682K125K100K061K344K871L483M120M656N018N447O145
54715A64088O589N816L601Q38j466k999l831m017l885m064m627m854m358l877
54701A42954m113m414l656k112j319j985l036l110k150j129o94o23l63K56P99
54686A15305O51k58j233j508j100o26m44m05l57l66l94k49j6m6l87n98l49J35
$$ plain form
54794 109183 109809 110077 110491 111262 112025 112315 112103 111732 111501 111471 111611 111970 112625 113479 114146 114188 113561 112834 112763 113560
54774 113560 114704 115570 116118 116894 118502 121228 125031 129588 134385 139015 143512 148314 153896 160445 167759
54759 167759 175243 182008 187238 190595 192136 191813 189268 184274 177308 169508 162062 155657 150401 146056
54745 146056 142246 138605 135004 131751 129406 128154 127407 126214 124174 121799 119976 119215 119413 120074 120651
54730 120651 120913 121177 122036 123718 125843 127943 130004 132348 135219 138702 142822 147478 152496 157943 164088
54715 164088 170677 176493 180094 180932 179466 176467 172636 168619 164734 160670 156043 151189 146831 142954
54701 142954 138841 134427 130771 128659 127340 125355 122319 119209 117059 115930 115236 114613 114250 114506 115305
54686 115305 115956 115698 114465 112957 111857 111231 110787 110382 110025 109659 109265 109016 109000 108954 108567 107969 107620 107755
54668A07755M32L64rn62j044j127o93Q2Q96J385J210N01J07O90J576J302l77j882
54650A10606j738m16N21N70N33R20J183Q02J66j30k61q02j647j954j178J82J064
54633A08421R23J95k43j2M44M31k29j053j399r92l1J027J750J967J753J221M49
54616A14622l71q48p47k87J03K73L99N85P28P62O95M40j27p97j077p64j94J84
54598A13579K56J04k18n78o72l69R7M47N95M10l95j617k259j487K42J590J875
54581A11600J543J221R42M94q0o12r28p07K09J209J291M12k35J83Q91N91o97j715
54563A15612j642q58n9N85J145J442J171L29o53j141p94j6L22j22o83n35K70J048
54545A15421J448J621J683J566J343J108P25J97R9Q39J775J873J143N25L39l4
$$ plain form
54668 107755 108187 108551 108542 107980 106936 105809 105116 105198 106094 107479 108689 109190 109297 109987 111563 112865 112488 110606
54650 110606 108868 108452 108973 109543 110076 110996 112179 112981 113147 113017 112756 111954 110307 108353 107175 107357 108421
54633 108421 109344 109539 109296 109284 109728 110159 109930 108877 107478 106486 106455 107482 109232 111199 112952 114173 114622
54616 114622 114251 113403 112656 112369 112472 112745 113144 113729 114457 115219 115914 116354 116227 115430 114353 113589 113395 113579
54598 113579 113835 113939 113721 113143 112471 112102 112199 112646 113241 113651 113256 111639 109380 107893 108135 109725 111600
54581 111600 113143 114364 115306 115800 115720 115108 114180 113473 113682 114891 116182 116594 116359 116542 117433 118024 117327 115612
54563 115612 113970 113112 113053 113638 114783 116225 117396 117725 117072 115931 115137 115121 115443 115321 114638 114103 114373 115421
54545 115421 116869 118490 120173 121739 123082 124190 124915 125112 125211 126050 127825 129698 130841 131366 131705 131671
54529A31671q31j370j232r77j131j318j076o89n65m29J05P25Q62N27Q7l18n41
54512A23500j82P26J342R96J27n72j223k152k695j883j04J223J555J633J841J501
54496A25633L22o48l51P42J277P41k10q80j111r07k53M98P13K80n9L46J092J213
54478A28438N24j23j24N9j82m49K4R13J022L6r88j138p33m23j98N5l3m95l41J107
54458A26951K787K993J592L2p14r03p73QJ263J877J227J95RO72J151P82j77j076
54440A37896j502j461j278j209j095o27L2L18P7j53L9L62M24M60R96J957K561
54423A37797K126P33q55j771j669r19j78J83J81q7n73j066j176o92J62Q24P52
54406A33772q2q87n96Q52K127J980Q25J40M83J012R83O97O05M71N2j68L29J162
$$ plain form
54529 131671 130840 129470 128238 127261 126130 124812 123736 123047 122482 122053 122158 122883 123745 124272 124359 124041 123500
54512 123500 123318 124044 125386 126382 126509 125937 124714 122562 119867 117984 117880 119103 120658 122291 124132 125633
54496 125633 125955 125307 124956 125698 126975 127716 127506 126626 125515 124608 124355 124853 125566 125846 125787 126133 127225 128438
54478 128438 128962 128839 128715 128774 128592 128143 128167 129080 130102 130138 129150 128012 127279 126856 126658 126713 126680 126185 125844 126951
54458 126951 129738 132731 134323 134355 133641 132738 131965 131973 133236 135113 136340 136535 136544 137216 138367 139149 138972 137896
54440 137896 136394 134933 133655 132446 131351 130724 130756 131074 131151 130998 131037 131399 131823 132283 133279 135236 137797
54423 137797 139923 140656 139801 138030 136361 135442 135264 135447 135628 135541 134968 133902 132726 132034 132196 133020 133772
54406 133772 133690 132803 132207 133059 135186 137166 137991 138131 138614 139626 140609 141306 141911 142382 142434 142266 142595 143757
54388A43757J499J144N06j52p82j108q38k84j38n60r62q20k90J13J75J44M22J126
54370A42952J892K171J843J421J464J907K185J959J570J716K765M278N195M729
54356A78047L188J690R31M60n56k123l392l732l409l101l062l003k637k112j808
54341A55381j832j906j717j258p51l90l29o84j307j655j327o28k41k73j64M23
54325A41342J073J276J130J015R27N93J17l4K54M74O6q91j817k230k113j682j083
54308A38417m70j45k98n77l94K31N28K6p05q27m23j68j08L64J266J707J126J29
54290A39679l59k62o4Q8M13P89P57J96l83l52L44J088J157M64k56k54L20O66M83
54271A44514K96N01P33N61L10N91J320J727J277J52j044j707j517o72J44L90K27
$$ plain form
54388 143757 145256 146400 146906 146754 145972 144864 144026 143742 143604 143044 142082 141262 140972 141085 141260 141404 141826 142952
54370 142952 144844 147015 148858 150279 151743 153650 155835 157794 159364 161080 163845 168123 173318 178047
54356 178047 181235 182925 183856 184316 183760 181637 178245 174513 171104 168003 164941 161938 159301 157189 155381
54341 155381 153549 151643 149926 148668 147917 147527 147198 146514 145207 143552 142225 141597 141356 141083 140919 141342
54325 141342 142415 143691 144821 145836 146763 147356 147473 147439 147693 148167 148233 147342 145525 143295 141182 139500 138417
54308 138417 137947 137802 137504 136927 136533 136764 137292 137318 136613 135786 135363 135195 135087 135451 136717 138424 139550 139679
54290 139679 139320 139058 138994 139082 139495 140284 141041 141237 140854 140502 140846 141934 143091 143555 143299 143045 143365 144031 144514
54271 144514 144810 145311 146044 146605 146915 147506 148826 150553 151830 151982 150938 149231 147714 147042 147186 147576 147803
54254A47803K65Q29J663K293K413J963J070k9j045j686j724j258q07q42j180j183
54238A48545o13R5M97O15O05L84p8m80n06k01J44K52j30r93j768j734r67l12j59
54219A43196Q0Q63J546J205k4j128j384q21J03P34M35o83j555j344n20q7j08J29
54201A40637O75P40J7p29o86O2Q92J356J288P35J27M1N51J093J149P47K32j65
54183A48762l89n27p51j067j122o08K03P20P75O85O39M93J72k52q45j598j927
54166A43363j116N85J904J941J008o1q76j366j355q32k69o4K8M66J079J191N19
54149A46145m59r85o66K66J075J045J72p28q62k49N31J128J573J741J308L73l66
54132A51042l50J37L96K14MJ04L52M67M59M80N28O18R26J439J680J248N27L03
$$ plain form
54254 147803 148068 148897 150560 152853 155266 157229 158299 158270 157225 155539 153815 152557 151750 150908 149728 148545
54238 148545 147932 148027 148524 149139 149744 150128 150050 149570 149064 148863 149007 149259 149129 148136 146368 144634 143667 143355 143196
54219 143196 143276 144139 145685 146890 146866 145738 144354 143533 143636 144370 144805 144122 142567 141223 140703 140616 140508 140637
54201 140637 141312 142052 142069 141340 140654 140716 141608 142964 144252 144987 145114 145155 145706 146799 147948 148695 148927 148762
54183 148762 148373 147846 147095 146028 144906 144298 144501 145221 145996 146681 147320 147813 147985 147733 146888 145290 143363
54166 143363 142247 142832 144736 146677 147685 147624 146748 145382 144027 143195 142926 142862 142890 143356 144435 145626 146145
54149 146145 145686 144701 144035 144301 145376 146421 146593 145865 145003 144754 145285 146413 147986 149727 151035 151408 151042
54132 151042 150692 150829 151225 151439 151443 151547 151899 152366 152825 153305 153833 154451 155377 156816 158496 159744 160271 160574
54114A60574O55Q75N21k0l24n02p06o37j88P4k70o15j07J037J811J919K056K645
54096A68798L237L400L529M303N745P152P680O896N005K690M78j655l768n331
54082B08159n701n141m624m520m217l242k070j394j219j141r62o44m0P95J352
54067A75391J238P71N84Q84J499K337L258L703L114J813Q99J067J832K169J686
54052B02245Q73K96l7m03p01n06K26R37J192J285J766K582L141L155L013L279
54036B22343M141N314O260O611O582O797P366P524O589M952L491K365J201J80
54022B91716j14J34J37r2L27J368J625K10j909l340l989m448m610m171l799m384
54006B64661n513n948n451m909m665m090k948k061k050k462k580k404k301k346
$$ plain form
54114 160574 161229 162104 162625 162605 162281 161779 161073 160436 160248 160322 160052 159437 159330 160367 162178 164097 166153 168798
54096 168798 172035 175435 178964 183267 189012 196164 203844 210740 215745 218435 218913 217258 213490 208159
54082 208159 202458 197317 192693 188173 183956 180714 178644 177250 176031 174890 173928 173284 173244 174039 175391
54067 175391 176629 177400 177984 178868 180367 182704 185962 189665 192779 194592 195491 196558 198390 200559 202245
54052 202245 203118 203414 203377 202974 202273 201767 201993 202930 204122 205407 207173 209755 212896 216051 219064 222343
54036 222343 226484 231798 238058 244669 251251 258048 265414 272938 279527 284479 287970 290335 291536 291716
54022 291716 291602 291736 291873 291781 292108 293476 295101 295311 293402 290062 286073 281625 277015 272844 269045 264661
54006 264661 259148 253200 247749 242840 238175 234085 231137 229076 227026 224564 221984 219580 217279 214933
53992B14933k464k700k924k760k152j537j114n73J07K37n68j506j500o49k4j70
53976A94636n98p14n26k57O4L73M42L06L88Q68J345J473J600K304L484M417M677
53959B14282M541M530M941N906P423R134J0352J0570R780Q148N674K423j097m071
53945B92536n837o174n361m085k993k154j154Q3J009J204J041J149J604K131K720
53930B75719L386L622K975K040K010L110M341M890N040N278N475N440N537O105
53916C34968O780P117P391Q078Q848Q940Q286P543O954N928L914J237j208k745
53902D12031l344l418l389l292k904k306k086k674l769m779n665o843q304r351
53888C49907r365q524p564p010o792o474n894n443n632o250o403n576m365l730
$$ plain form
53992 214933 212469 209769 206845 204085 201933 200396 199282 198709 198816 199053 198485 196979 195479 194830 194806 194636
53976 194636 194038 193324 192798 192541 192605 192978 193420 193726 194114 194982 196327 197800 199400 201704 205188 209605 214282
53959 214282 218823 223353 228294 234200 241623 250757 261109 271679 281459 289607 295281 297704 296607 292536
53945 292536 286699 280525 275164 271079 268086 265932 264778 264861 265870 267074 268115 269264 270868 272999 275719
53930 275719 279105 282727 285702 287742 289752 292862 297203 302093 307133 312411 317886 323326 328863 334968
53916 334968 341748 348865 356256 364334 373182 382122 390408 397951 404905 410833 414747 415984 414776 412031
53902 412031 408687 405269 401880 398588 395684 393378 391292 388618 384849 380070 374405 367562 359258 349907
53888 349907 340542 332018 324454 317444 310652 304178 298284 292841 287209 280959 274556 268980 264615 260885
53874B60885l794l868l513k941k474k164k108k503l197l663l681l655l879l866
53860B15579k943j346j78j66q21j088o43k02m93j280j701j424r92q97q41l14M67
53843B00717Q05N61L04L22J70m96j103q08K83J137J054M01m3q7j08l32n62o22
53825B01593o44p33o25l0Q63J524J716J664J583J426J152R70J078J340J526J647
53809B16050J910K376K891L330L731M195M732N171N289N079M885N042N375N351
53795B75407M809M239M075M080L700K862K009J444J070P43N90P24Q44L66r93k795
53779C03174m187m706m705m851n263n474n171m613m156l773l353l093l234l576
53765B43019l700l542l424l499l510l144k424j681j265j307j632j903j933j785
$$ plain form
53874 260885 257091 253223 249710 246769 244295 242131 240023 237520 234323 230660 226979 223324 219445 215579
53860 215579 212636 211290 211112 210946 210125 209037 208394 208192 207699 206419 204718 203294 202302 201405 200564 200250 200717
53843 200717 201522 202083 202387 202709 202879 202383 201280 200472 200755 201892 202946 203347 203304 203217 203109 202777 202215 201593
53825 201593 200949 200216 199591 199561 200424 201948 203664 205328 206911 208337 209489 210459 211537 212877 214403 216050
53809 216050 217960 220336 223227 226557 230288 234483 239215 244386 249675 254754 259639 264681 270056 275407
53795 275407 280216 284455 288530 292610 296310 299172 301181 302625 303695 304438 305028 305752 306596 306962 305969 303174
53779 303174 298987 294281 289576 284725 279462 273988 268817 264204 260048 256275 252922 249829 246595 243019
53765 243019 239319 235777 232353 228854 225344 222200 219776 218095 216830 215523 213891 211988 210055 208270
53751B08270j619j496j389j209q14j65M77P58O50L84n1q31j612j505k01J314J781
53734B02742J150M53L55N12M05K11M80J283K052K232J869J511J549J792J809J558
53718B21963J411J526J578J264P56M35M59Q12J455K117K263J707J004Q97J470
53703B41117K179K580K714K829L075L374L506L326K983K722K486K097J810K141
53689B78939K905L117K253J007L06J02k20p58j147j317j466j517j330j141j132
53674B78601q76rQ10N63o03j403j051j3Q62J213J010L21m68q62q51q96j179j367
53656B73802j156o07P2O01O57L21K71Q42J258O17n98j053n12j3l6J77J111K040
53638B77794K201J905J761J693J460J404J862K426K512K236K097K241K559L127
$$ plain form
53751 208270 206651 205155 203766 202557 201743 201578 202055 202813 203463 203847 203796 202965 201353 199848 199647 200961 202742
53734 202742 203892 204345 204700 205212 205617 205828 206308 207591 209643 211875 213744 215255 216804 218596 220405 221963
53718 221963 223374 224900 226478 227742 228498 228933 229392 230204 231659 233776 236039 237746 238750 239647 241117
53703 241117 243296 245876 248590 251419 254494 257868 261374 264700 267683 270405 272891 274988 276798 278939
53689 278939 281844 284961 287214 288221 288527 288629 288409 287651 286504 285187 283721 282204 280874 279733 278601
53674 278601 277725 277716 278526 279089 278486 277083 276032 276019 276881 278094 279104 279425 278957 278095 277244 276348 275169 273802
53656 273802 272646 272039 272111 272712 273369 273690 273961 274803 276061 276678 276080 275027 274515 274502 274466 274643 275754 277794
53638 277794 279995 281900 283661 285354 286814 288218 290080 292506 295018 297254 299351 301592 304151 307278
53624C07278L896M431M496M484M722M793M148L053K329K287K473K301J651R68
53610C53310R64J949L316M086M049L819L717L388K765K487K839L121K749K206
53596C94765K147K221J721Q72M72O16O56K39m40j168j793j959j558j157j312j651
53580C92671j476j002j098j889k544k513k205k201k479k673k583k251j871j705
53566C64181j740j529p33K92R10J020R99R94Q30N40L85L56K30L8M5K67N07P43
53548C68335R67R02M97M41J395K765L258K664K179K707L741M345M444M552M832
53533D08024N101N397N991O902P844Q480Q644Q498Q641R679J1419J2811J3025
53520E20456J2402J2044J2681J4129J5711J6877J7521J7934J8561J9663K1210
$$ plain form
53624 307278 311174 315605 320101 324585 329307 334100 338248 341301 343630 345917 348390 350691 352342 353310
53610 353310 354274 356223 359539 363625 367674 371493 375210 378598 381363 383850 386689 389810 392559 394765
53596 394765 396912 399133 400854 401726 402198 402814 403470 403709 403269 402101 400308 398349 396791 395634 394322 392671
53580 392671 391195 390193 389095 387206 384662 382149 379944 377743 375264 372591 370008 367757 365886 364181
53566 364181 362441 360912 360179 360471 361381 362401 363400 364394 365224 365764 366149 366505 366735 366773 366818 367085 367592 368335
53548 368335 369302 370204 370701 371142 372537 375302 378560 381224 383403 386110 389851 394196 398640 403192 408024
53533 408024 413125 418522 424513 431415 439259 447739 456383 464881 473522 483201 494620 507431 520456
53520 520456 532858 544902 557583 571712 587423 604300 621821 639755 658316 677979 699189
53509F99189K2942K4431K5184K5007K4336K3935K4126K4475K4351K3644K2793
53498I64413K2233K1899K1356K0386J9388J9018J9360J9689J9248J8136J7171
53487A182297J6996J7485J7987J7959J7411J6906J6956J7462J7830J7695J7192
53476A374176J6464J5301J3504J1192Q473N290J913q77k680m141o187q865j1430
53463A412133j3276j4246j4409j4141j4113j4631j5234j5548j6095j7484j9212
53452A243744k0207k0270k0044j9771j9206j8610j8661j9209j9272j8552j7772
53441A032170j7212j6001j3483j0340p698n893m707m116m017l738k584o40J409
53428I43150K990L935M469N133O293P581Q382Q978J0373J2752J5049J6546J7877
$$ plain form
53509 699189 722131 746562 771746 796753 821089 845024 869150 893625 917976 941620 964413
53498 964413 986646 1008545 1029901 1050287 1069675 1088693 1108053 1127742 1146990 1165126 1182297
53487 1182297 1199293 1216778 1234765 1252724 1270135 1287041 1303997 1321459 1339289 1356984 1374176
53476 1374176 1390640 1405941 1419445 1430637 1439110 1444400 1446313 1445436 1442756 1438615 1432428 1423563 1412133
53463 1412133 1398857 1384611 1370202 1356061 1341948 1327317 1312083 1296535 1280440 1262956 1243744
53452 1243744 1223537 1203267 1183223 1163452 1144246 1125636 1106975 1087766 1068494 1049942 1032170
53441 1032170 1014958 998957 985474 975134 967436 961543 956836 952720 948703 944965 942381 941741 943150
53428 943150 946140 950075 954544 959677 965970 973551 981933 990911 1001284 1014036 1029085 1045631 1063508
53415A063508J9749K1575K2408K2550K3193K4818K6893K8895L0701L2128L3076
53404A349494L4061L5860L8514M1310M3733M5796M7470M8509M9027M9696N1085
53393A834555N3044N4898N6040N6328N6041N5479N4613N3316N1889N0872N0151
53382B427226M8873M6597M3935M1535L9007L5558L1223K6690K2200J7460J2482
53371B792786P615K840k277p906j3876k0177k6826l3316l8878m3357m7071m9885
53359B519672n1301n1589n1927n2989n4131n4344n3380n1589m9316m6979m5183
53348A956944m4107m3203m2040m1060m0956m1522m1812m1302m0245l8850l6815
53337A505032l3912l0624k7749k5489k3350k0928j8495j6615j5404j4490j3655
$$ plain form
53415 1063508 1083257 1104832 1127240 1149790 1172983 1197801 1224694 1253589 1284290 1316418 1349494
53404 1349494 1383555 1419415 1457929 1499239 1542972 1588768 1636238 1684747 1733774 1783470 1834555
53393 1834555 1887599 1942497 1998537 2054865 2110906 2166385 2220998 2274314 2326203 2377075 2427226
53382 2427226 2476099 2522696 2566631 2608166 2647173 2682731 2713954 2740644 2762844 2780304 2792786
53371 2792786 2800401 2803241 2800964 2793058 2779182 2759005 2732179 2698863 2659985 2616628 2569557 2519672
53359 2519672 2468371 2416782 2364855 2311866 2257735 2203391 2150011 2098422 2049106 2002127 1956944
53348 1956944 1912837 1869634 1827594 1786534 1745578 1704056 1662244 1620942 1580697 1541847 1505032
53337 1505032 1471120 1440496 1412747 1387258 1363908 1342980 1324485 1307870 1292466 1277976 1264321
53326A264321j3167j3307j3905j4541j4969j5006j4357j2987j1517j0709j0523
53315A119333j0153r030p332n458l571j850o65l0P16K220M291O207P672R037J0621
53300A122008J2280J3727J4944J6090J7250J8511K0086K2087K4214K5906K6845
53289A333948K7230K7444K7620K7564K6964K5515K3068J9934J6917J4679J2999
53278A583882J1025Q287N153K144p21l678o701r607j2360j4848j6673j7733j8769
53265A509401k0724k3469k5796k6769k6669k6409k6539k7055k7778k8589k9392
53254A220212l0085l0445l0057k8648k6619k4901k4064k3869k3860k4056k4676
53243I28932k5472k5803k5401k4593k3716k2622k1019j9057j7283j6029j5094
$$ plain form
53326 1264321 1251154 1237847 1223942 1209401 1194432 1179426 1165069 1152082 1140565 1129856 1119333
53315 1119333 1109180 1100150 1092818 1087360 1083789 1081939 1081274 1081244 1081960 1084180 1088471 1094678 1102350 1111387 1122008
53300 1122008 1134288 1148015 1162959 1179049 1196299 1214810 1234896 1256983 1281197 1307103 1333948
53289 1333948 1361178 1388622 1416242 1443806 1470770 1496285 1519353 1539287 1556204 1570883 1583882
53278 1583882 1594907 1603194 1608347 1610491 1609770 1606092 1599391 1589784 1577424 1562576 1545903 1528170 1509401
53265 1509401 1488677 1465208 1439412 1412643 1385974 1359565 1333026 1305971 1278193 1249604 1220212
53254 1220212 1190127 1159682 1129625 1100977 1074358 1049457 1025393 1001524 977664 953608 928932
53243 928932 903460 877657 852256 827663 803947 781325 760306 741249 723966 707937 692843
53232F92843j4083j2933j1872j0978j0031q891p824p231p244p757q688r936j1128
53219E64247j1806j1968j2169j2834j3638j3849j3212j2239j1569j1186j0531
53208D29246r239p611o261n517n293n409n710o000o126o181o362o622o766o846
53194C39303p079p311p030o133n203m729m489m035l384k797k298j911j938k427
53180B78539k762k459k036k303l032l233k655k017j756j545j228j198j493j533
53166B49289j184j149j642j683n47Q38J045J28o57p95r24j415j742j509j101q77
53150B36075n17K63R71Q91L9r18j424j344q05j76k0n60j248j265m78L88O80N44
53132B31096O00J090J672J941J864J607J213O51P1k61k43M9N52J156J486J165
$$ plain form
53232 692843 678760 665827 653955 642977 632946 624055 616231 609000 601756 593999 585311 575375 564247
53219 564247 552441 540473 528304 515470 501832 487983 474771 462532 450963 439777 429246
53208 429246 420007 412396 406135 400618 395325 389916 384206 378206 372080 365899 359537 352915 346149 339303
53194 339303 332224 324913 317883 311750 306547 301818 297329 293294 289910 287113 284815 282904 280966 278539
53180 278539 275777 273318 271282 268979 265947 262714 260059 258042 256286 254741 253513 252315 250822 249289
53166 249289 248105 246956 245314 243631 243084 243922 244967 245095 244438 243643 242719 241304 239562 238053 236952 236075
53150 236075 235558 235821 236792 237683 237722 236804 235380 234036 233231 233055 233035 232475 231227 229962 229484 229872 230552 231096
53132 231096 231696 232786 234458 236399 238263 239870 241083 241734 241805 241544 241301 241350 241902 243058 244544 245709
53116B45709M65K38R04J755J729O96m77j049j130j202j390j464j316j111j089
53101B41268j326j666j751j325n59RM4k47m63m97m63l31K8M20L97j46p20q78q57
53082B30937j201j835j999j277k66J13j87k82M15J370J518N91n81j080r00p46
53066B24590j003j312j233r01p21p18o28n28p48j120r34J2R01Q95K31k10n7M26
53048B16942J037J690J941J416O63O86J395J537N39m98l88L54L40o31j448j438
53032B24137j119j026p88O2J087J438J022N53M98N37J94m03p25o08m08l42j04
53015B24005N57J216J281J002J238K121K652K022P26k03n68q69j192j076m71k0
52999B32421j51n47o47l28J22K92j67j186k122k324j916j509j147k27J338K636
$$ plain form
53116 245709 246174 246412 247316 249071 250800 251496 251019 249970 248840 247638 246248 244784 243468 242357 241268
53101 241268 239942 238276 236525 235200 234641 234650 234694 234447 233984 233487 233024 232693 232721 233141 233538 233392 232672 231794 230937
53082 230937 229736 227901 225902 224625 224359 224472 224285 224003 224418 225788 227306 227897 227316 226236 225336 224590
53066 224590 223587 222275 221042 220141 219420 218702 218074 217546 216798 215678 214744 214756 215657 216552 216783 216573 216516 216942
53048 216942 217979 219669 221610 223026 223689 224375 225770 227307 227846 227348 226960 227314 227654 227023 225575 224137
53032 224137 223018 221992 221204 221266 222353 223791 224813 225366 225864 226401 226595 226192 225467 224859 224451 224109 224005
53015 224005 224562 225778 227059 228061 229299 231420 234072 236094 236820 236617 236049 235180 233988 232912 232441 232421
52999 232421 232270 231723 231076 230748 230870 231162 230995 229809 227687 225363 223447 221938 220791 220564 221902 224538
52983B24538K870K316J736J280P04J87K04O64R20P03M79O59R55Q28L21J08P05
52966B40177J873K813K910K182J094J36l06jP44R97M8j565k442j968j004o72j040
52949B43976j484j798k183k444k067j116l81m22r70j362j182m14N75J155Q92O2
52933B30837o52r59j069j060p41k23j7k12j91M37J084R30P1o41p30m82k20J55
52915B26317P81J344J319N59m79j106r69k68N18J054J235R85K83o16j302j616
52899B28039j706j593j119m73k31n55p97l25N50J053J002Q16P26O52P43J241J771
52882B29794J539N19k73k5Q18J208P57j9m31j72N53J175J188P25M73P82J209J198
52864B41018Q41N62L73M7k61j54K53L04l14j162j629j616j431j360j470j612j519
$$ plain form
52983 224538 227408 229724 231460 232740 233444 233631 233835 234499 235419 236122 236601 237260 238215 239043 239364 239472 240177
52966 240177 242050 244863 247773 249955 251049 251185 250879 250878 251622 252619 252667 251102 248660 246692 245688 245016 243976
52949 243976 242492 240694 238511 236067 234000 232884 232503 232081 231111 229749 228567 228153 228728 229883 230775 230837
52933 230837 230185 229226 228157 227097 226356 226133 226116 225904 225713 226150 227234 228164 228235 227594 226864 226382 226162 226317
52915 226317 227098 228442 229761 230320 229841 228735 227766 227498 228016 229070 230305 231290 231573 230957 229655 228039
52899 228039 226333 224740 223621 223148 222917 222362 221565 221240 221790 222843 223845 224661 225387 226039 226782 228023 229794
52882 229794 231333 231852 231579 231554 232372 233580 234337 234318 233887 233715 234268 235443 236631 237356 237829 238611 239820 241018
52864 241018 241859 242421 242794 242841 242580 242426 242679 242983 242669 241507 239878 238262 236831 235471 234001 232389 230870
52847B30870j067n39m10q14j429j925k193k138j641r28o06j015j678j774j061
52832B11652o0O74J087J420J663J486P15l04r54r55o29m67n69o62n89m72l71q4
52814B12581N09J115J318J110Q77Q80R42P67L97J62K31L36P0n83j177j362j344
52797B16829j634k304k774k450j451n04j30q6K74J117J761J418K30p27o83j38
52781B08748j43q23j215o51L17P61N96M08M32M55N19R24J394J072k75j665k059
52764B08795j602j168j009o66mM60M68M38O82P86K99l98m96K13J229K052K467
52747B12546K287J506P67J029K360L578L483K166P44L6n3K7J20L39P04J008J004
52730B33651O75L26L55Q01J234J215P18J7p12j405j867j903j695j665j836j639
$$ plain form
52847 230870 229803 229264 228854 228040 226611 224686 222493 220355 218714 217786 217180 216165 214487 212713 211652
52832 211652 211592 212266 213353 214773 216436 217922 218637 218333 217379 216424 215795 215328 214759 214097 213508 213036 212665 212581
52814 212581 213090 214205 215523 216633 217510 218390 219332 220099 220496 220658 220889 221225 221295 220712 219535 218173 216829
52797 216829 215195 212891 210117 207667 206216 205712 205582 205496 205770 206887 208648 210066 210296 209569 208886 208748
52781 208748 208605 207782 206567 205916 206233 206994 207590 207998 208430 208885 209404 210328 211722 212794 212519 210854 208795
52764 208795 207193 206025 205016 204350 204346 204806 205274 205712 206394 207180 207479 207081 206585 206798 208027 210079 212546
52747 212546 214833 216339 217106 218135 220495 224073 227556 229722 230466 230502 230449 230476 230596 230935 231639 232647 233651
52730 233651 234326 234652 235007 235808 237042 238257 238975 238992 238280 236875 235008 233105 231410 229745 227909 226270
52714B26270p16L46N38k83j123j047l15J52J92N04J346J860J291K05k70m2N1k51
52696B28708l43q7k52j040j370m55P89R96L62J73P20R92M22l83q22j049j147p05
52678B25509K41P37J29r43j424j113m93J53P23Q77L83l20n74k72K83R85J817K422
52660B29120K418J972J540J258J120J432K401L383L403K378J152L20l09r47j348
52645B49293j355j316j503j638j407j039r85j285j607j714j567j089k32P52J351
52630B34659J258P82O56J271K112K217J332K83j22j39n14j199j423r35l81k57
52614B39600k88j73k06o49j090r83m08K18P85J300J457J021L82J23K16K45J81
52597B41731L11M99L12j45k16K85P74Q06O84Q06J018J057J126J457J685J221J62
$$ plain form
52714 226270 225554 225900 226438 226155 225032 223985 223670 223822 224014 224518 225864 227724 229015 229220 228950 228908 228959 228708
52696 228708 228365 228278 228026 226986 225616 225161 225950 226946 227308 227481 228201 229193 229615 229232 228410 227361 226214 225509
52678 225509 225750 226487 226616 225673 224249 223136 222643 222796 223519 224396 224779 224459 223885 223613 223896 224881 226698 229120
52660 229120 231538 233510 235050 236308 237428 238860 241261 244644 248047 250425 251577 251897 251588 250641 249293
52645 249293 247938 246622 245119 243481 242074 241035 240050 238765 237158 235444 233877 232788 232556 233308 234659
52630 234659 235917 236699 237355 238626 240738 242955 244287 244570 244448 244309 243795 242596 241173 240238 239857 239600
52614 239600 239312 239139 238933 238284 237194 236211 235803 236021 236806 238106 239563 240584 240966 241089 241305 241550 241731
52597 241731 242042 242541 242853 242708 242492 242777 243551 244357 245041 245847 246865 247922 249048 250505 252190 253411 253573
52580B53573p52r84n90J20Q21J080N51n26j412j592j277r25o67l46N1L45M16K82
52562B48168Rl07m79m63n69j157k014k319j454K25J644J940J117j21r49r39l05
52545B42027L06M14J87J34L89N44L51J89M91R96R70J93p53j181r45k61O17J362
52527B46030J563J149N37Q8l70j068j600j295k28P02Q39M52J70K15M19O82J006
52510B49291J272J361J339J381J532J761K055K284K139J456M94l47r40j425j885
52495B61768k223k300j994j319o24l91o43q44o72n13q05j153q19J28Q21P89N07
52478B49713N87R80J223J071O19J21j43r9k2j87l76j67L45O36O11P27J188J676
52460B58503K077K646L144K694J107m48q58n18n03r01j056j030j589k705l278
$$ plain form
52580 253573 252821 251837 251247 251367 252188 253268 253819 253293 251881 250289 249012 248087 247420 247074 247125 247470 247886 248168
52562 248168 248177 247870 247391 246928 246359 245202 243188 240869 239415 239640 241284 243224 244341 244220 243271 242332 242027
52545 242027 242333 242747 242934 243068 243457 244001 244352 244541 245032 246028 246998 247191 246438 245257 244312 244051 244668 246030
52527 246030 247593 248742 249279 249367 248997 247929 246329 245034 244806 245508 246347 246799 246969 247184 247603 248285 249291
52510 249291 250563 251924 253263 254644 256176 257937 259992 262276 264415 265871 266365 266018 265078 263653 261768
52495 261768 259545 257245 255251 253932 253308 252917 252274 251430 250758 250245 249440 248287 247468 247596 248417 249206 249713
52478 249713 250300 251280 252503 253574 254193 254314 254171 254072 254050 253863 253487 253320 253665 254301 254912 255639 256827 258503
52460 258503 260580 263226 266370 269064 270171 269723 268865 268347 267844 266943 265887 264857 263268 260563 257285
52445B57285k615j307k85J65J56k90r46j264j036p36p38p25l33O1j03n81n57J47
52427B46298Q24R00O71P30J039J002L83k77k79L98J127J468J637K023K563K897
52411B63404L021L401M382N808P286Q555R486R925R673Q493O168K775j054m380
52397C36943o645p911q434q286p489o281m955l656k488j671j375j447j480j113
52383B73712k21R80J925J980J055j34n76J25J439K465K734K472K271K519L149
52368B95895L799M162M167L945L623L156K342J155j4n87m15R6N38R24J342J545
52352C25673J230N53J6q7K62J117K428L585L779K963K134K248L194M111M511M719
52336C62436N245O050O669O915P249Q235R704J0894J1448J1937J3014J4460J5466
$$ plain form
52445 257285 254670 253363 253078 253243 253399 253109 252163 250899 249863 249127 248389 247664 247331 247392 247289 246708 246151 246298
52427 246298 247122 248022 248693 249423 250462 251464 251847 251570 251291 251689 252816 254284 255921 257944 260507 263404
52411 263404 266425 269826 274208 280016 287302 295857 305343 315268 324941 333434 339602 342377 341323 336943
52397 336943 330298 322387 313953 305667 298178 291897 286942 283286 280798 279127 277752 276305 274825 273712
52383 273712 273491 274471 276396 278376 279431 279297 278721 278846 280285 282750 285484 287956 290227 292746 295895
52368 295895 299694 303856 308023 311968 315591 318747 321089 322244 322230 321643 321228 321324 321862 322786 324128 325673
52352 325673 326903 327456 327472 327385 327647 328764 331192 334777 338556 341519 343653 345901 349095 353206 357717 362436
52336 362436 367681 373731 380400 387315 394564 402799 412503 423397 434845 446782 459796 474256 489722
52323D89722J5740J5800J6280J7332J8661J9722J9962J9307J8315J7474J6621
52312F84936J5576J4944J5398J6317J6250J4929J3725J3740J4360J4313J3307
52301H47795J1926J0561R252Q149P326O453N204L754K401J041n42k335m326o567
52287I00092q467q876p604o136n862o205n671m223l130k690j674O33L250M973
52273H48410N907O777P663Q256Q705R390J0219J0828J1185J1449J1522J1304J1154
52260I72769J1513J2217J2618J2328J1469J0344R288Q776R156J0080J0546R650
52248A100754P378M523J921k88k577n224p759r392r914r802r503r107q817r140
52234A033053j0177j1125j1016r852q548p722p026n802m122k812k522k966l245
$$ plain form
52323 489722 505462 521262 537542 554874 573535 593257 613219 632526 650841 668315 684936
52312 684936 700512 715456 730854 747171 763421 778350 792075 805815 820175 834488 847795
52301 847795 859721 870282 879534 887683 895009 901462 906666 910420 912821 913862 913320 910985 906659 900092
52287 900092 891625 882749 875145 869009 863147 856942 851271 847048 843918 841228 839554 840187 843437 848410
52273 848410 854317 861094 868757 877013 885718 895108 905327 916155 927340 938789 950311 961615 972769
52260 972769 984282 996499 1009117 1021445 1032914 1043258 1052546 1061322 1070478 1080558 1091104 1100754
52248 1100754 1108132 1112655 1114576 1114288 1111711 1106487 1098728 1089336 1079422 1069620 1060117 1051010 1042193 1033053
52234 1033053 1022876 1011751 1000735 990883 982335 974613 967587 961785 957663 954851 952329 949363 946118
52221I46118k812j924j027j17J021K113K627K670L066M224N494O006N790N500
52207I78749N393N164M648M109L737L354K732J949J330J316K296M189O069O766
52193A031801N972M566L610L368L441L465L306K862J991P02q60k500l962n048
52179A052714n943p137q705r876r821q677p321o218n121l913l028k684k355j550
52165I70365o56l59n15k92O37J719K373K670K929L195L391L552L574L001J507
52150I97091n02k075k548k008j015j6Q79J724K337K265J232l70j642j880j110
52135I92362L9R58J566K348L837N987Q216J0150J2023J4092J6058J7540J8876
52122A104052K0712K2923K4668K5574K6137K6753K7078K6681K5711K4494K3082
$$ plain form
52221 946118 943306 941382 940355 940238 941259 943372 945999 948669 951735 955959 961453 967459 973249 978749
52207 978749 984142 989306 993954 998063 1001800 1005154 1007886 1009835 1011165 1012481 1014777 1018966 1025035 1031801
52193 1031801 1037773 1042339 1045949 1049317 1052758 1056223 1059529 1062391 1064382 1065084 1064224 1061724 1057762 1052714
52179 1052714 1046771 1039634 1030929 1021053 1011232 1002555 995234 989016 983895 979982 976954 974270 971915 970365
52165 970365 969709 969350 968835 968543 969180 970899 973272 975942 978871 982066 985457 989009 992583 995584 997091
52150 997091 996589 994514 991966 989958 988943 988927 989806 991530 993867 996132 997364 996994 995352 993472 992362
52135 992362 992401 993359 994925 997273 1001110 1007097 1015313 1025463 1037486 1051578 1067636 1085176 1104052
52122 1104052 1124764 1147687 1172355 1197929 1224066 1250819 1277897 1304578 1330289 1354783 1377865
52111A377865K1502J9925J8184J5733J2564R569P464N972M570L424K783K099P55
52098A502409q24j814k423l600n449p140q355r708j1471j2992j3791j4329j5171
52085A395342j6070j6312j5483j3549j0786p932n803m369k744n06J633K935L765
52072A310121N090P281R985J2742J5099J6378J6170J4972J3832J3293J3070J2670
$$ plain form
52111 1377865 1399367 1419292 1437476 1453209 1465773 1475342 1482806 1488778 1493348 1496772 1499555 1501654 1502409
52098 1502409 1501585 1499771 1497348 1493748 1488299 1481159 1472804 1463096 1451625 1438633 1424842 1410513 1395342
52085 1395342 1379272 1362960 1347477 1333928 1323142 1315210 1309407 1305038 1302294 1301788 1303421 1306356 1310121
52072 1310121 1315211 1322492 1332477 1345219 1360318 1376696 1392866 1407838 1421670 1434963 1448033 1460703
$$ [...]
##END NTUPLES=NMR SPECTRUM
##END=
