
##TITLE=UV1102_M1_1161-1249_7185105_ww0NWCGROB
##JCAMPDX= 6.0         $$ Bruker NMR JCAMP-DX V2.0
##DATA TYPE= NMR SPECTRUM
##DATA CLASS= NTUPLES
##ORIGIN= BRUKER
##OWNER= Administrator
$$ 1.72 TOPSPIN		Version 2.1
$$ 2012-12-05 19:01:40.121 -0500  Administrator@X
$$ Compression mode = diff/dup
##.OBSERVE FREQUENCY= 400.02188249412
##.OBSERVE NUCLEUS= ^1H
##.ACQUISITION MODE= SIMULTANEOUS (DQD)
##.ACQUISITION SCHEME= undefined
##.AVERAGES= 8
##.DIGITISER RES= 22
##SPECTROMETER/DATA SYSTEM= spect
##.PULSE SEQUENCE= zg30
##.SOLVENT NAME= COFFEE_meoh
##.SHIFT REFERENCE= INTERNAL, COFFEE_meoh, 1, 14.98509
##AUDIT TRAIL= $$ (NUMBER, WHEN, WHO, WHERE, PROCESS, VERSION, WHAT)
$$ ##TITLE= Audit trail, TOPSPIN		Version 2.1
$$ ##JCAMPDX= 5.01
$$ ##ORIGIN= Bruker BioSpin GmbH
$$ ##OWNER= Administrator
$$ $$ E:\/data/COFFEE/nmr/UV1102_M1_1161-1249_7185105_ww0NWCGROB/10/pdata/1/auditp.txt
$$ ##AUDIT TRAIL=  $$ (NUMBER, WHEN, WHO, WHERE, PROCESS, VERSION, WHAT)
(   1,<2012-12-05 19:01:31.840 -0500>,<Administrator>,<X>,<go>,<TOPSPIN 2.1>,
      <created by zg
	started at 2012-12-05 19:00:25.355 -0500,
	POWCHK enabled, PULCHK disabled,
       configuration hash MD5:
       86 BA 57 50 F2 9D 5C 9B 26 00 A9 28 5F 66 2E 89
       data hash MD5: 64K
       B9 2B F6 A0 97 10 1C B7 1A 88 10 C2 A1 1B AA 1A>)
(   2,<2012-12-05 19:01:34.933 -0500>,<Administrator>,<X>,<proc1d>,<TOPSPIN 2.1>,
      <Start of raw data processing
       efp LB = 0 FT_mod = 6 PKNL = 1 PHC0 = 0 PHC1 = 0 SI = 32K 
       data hash MD5: 32K
       6B EE 74 54 E2 8B 8E 1A 47 EE A7 BE D8 A6 29 7B>)
(   3,<2012-12-05 19:01:35.402 -0500>,<Administrator>,<X>,<proc1d>,<TOPSPIN 2.1>,
      <pk PHC0 = 102.1564 PHC1 = 0 
       data hash MD5: 32K
       59 C8 82 E2 5A 9E 6F 52 DA 68 70 B5 A7 9C FC 8F>)
(   4,<2012-12-05 19:01:35.621 -0500>,<Administrator>,<X>,<proc1d>,<TOPSPIN 2.1>,
      <abs ABSG = 1 
       data hash MD5: 32K
       5C 14 3F 39 28 6A 1F CB BB 54 3F 66 E6 00 53 96>)
(   5,<2012-12-05 19:01:35.777 -0500>,<Administrator>,<X>,<proc1d>,<TOPSPIN 2.1>,
      <abs ABSG = 2 
       data hash MD5: 32K
       9E 7C 51 34 F7 C4 AB 8B DE 86 3C 69 F0 99 DB 84>)
(   6,<2012-12-05 19:01:35.918 -0500>,<Administrator>,<X>,<proc1d>,<TOPSPIN 2.1>,
      <abs ABSG = 3 
       data hash MD5: 32K
       BE BA E0 37 A0 EA 6C 21 AC 96 AD C7 63 57 0A 48>)
(   7,<2012-12-05 19:01:36.074 -0500>,<Administrator>,<X>,<proc1d>,<TOPSPIN 2.1>,
      <abs ABSG = 4 
       data hash MD5: 32K
       73 D8 CE 6A DB 8F 84 0C A2 69 2D 16 E1 A5 61 3E>)
(   8,<2012-12-05 19:01:36.230 -0500>,<Administrator>,<X>,<proc1d>,<TOPSPIN 2.1>,
      <abs ABSG = 5 
       data hash MD5: 32K
       EA 85 8A A9 29 34 51 15 64 A2 DF 24 9B CF BA 61>)
$$ ##END=
$$ 
$$ $$ hash MD5
$$ $$ 2B B6 EC 90 BF D6 4D 0C CE CC 76 4F 67 35 CC 36
##$RELAX= 
##$RELAX= 
##$RELAX= 
##$RELAX= 
##$RELAX= 
##$RELAX= 
##$RELAX= 
$$ Bruker specific parameters
$$ --------------------------
##$DU= <E:\>
##$EXPNO= 10
$$ [...]
##$TP= (0..7)
150 150 150 150 150 150 150 150
##$TP07= 0
##$TPNAME0= <>
##$TPNAME1= <>
##$TPNAME2= <>
##$TPNAME3= <>
##$TPNAME4= <>
##$TPNAME5= <>
##$TPNAME6= <>
##$TPNAME7= <>
##$TPOAL= (0..7)
0.5 0.5 0.5 0.5 0.5 0.5 0.5 0.5
##$TPOFFS= (0..7)
0 0 0 0 0 0 0 0
##$TUNHIN= 0
##$TUNHOUT= 0
##$TUNXOUT= 0
##$USERA1= <user>
##$USERA2= <user>
##$USERA3= <user>
##$USERA4= <user>
##$USERA5= <user>
##$V9= 5
##$VALIST= <valist>
##$VCLIST= <CCCCCCCCCCCCCCC>
##$VD= 0
##$VDLIST= <DDDDDDDDDDDDDDD>
##$VPLIST= <PPPPPPPPPPPPPPP>
##$VTLIST= <TTTTTTTTTTTTTTT>
##$WBST= 1024
##$WBSW= 4
##$XGAIN= (0..3)
0 0 0 0
##$XL= 0
##$YL= 0
##$YMAX_a= 636816
##$YMIN_a= -544888
##$ZGOPTNS= <>
##$ZL1= 120
##$ZL2= 120
##$ZL3= 120
##$ZL4= 120
##$ABSF1= 14.98509
##$ABSF2= -5.573092
##$ABSG= 5
##$ABSL= 3
##$ALPHA= 0
##$AQORDER= 0
##$ASSFAC= 0
##$ASSFACI= 0
##$ASSFACX= 0
##$ASSWID= 0
##$AUNMP= <proc_prof1d_extract_pilot.lims>
##$AXLEFT= 0
##$AXNAME= <>
##$AXNUC= <1H>
##$AXRIGHT= 0
##$AXTYPE= 0
##$AXUNIT= <>
##$AZFE= 0.1
##$AZFW= 0.1
##$BCFW= 0
##$BC_mod= 0
##$BYTORDP= 0
##$COROFFS= 0
##$CY= 15
##$DATMOD= 1
##$DC= 0
##$DFILT= <>
##$DTYPP= 0
##$F1P= 0
##$F2P= 0
##$FCOR= 0.5
##$FTSIZE= 32768
##$FT_mod= 6
##$GAMMA= 0
##$GB= 0
##$INTBC= 1
##$INTSCL= 1
##$ISEN= 128
##$LB= 0
##$LEV0= 0
##$LPBIN= 0
##$MAXI= 10000
##$MC2= 0
##$MEAN= 0
##$ME_mod= 0
##$MI= 0
##$NCOEF= 0
##$NC_proc= -8
##$NLEV= 6
##$NOISF1= 0
##$NOISF2= 0
##$NSP= 0
##$NTH_PI= 0
##$NZP= 0
##$OFFSET= 14.98509
##$PC= 1
##$PHC0= 102.1564
##$PHC1= 0
##$PH_mod= 1
##$PKNL= yes
##$PPARMOD= 0
##$PPDIAG= 0
##$PPIPTYP= 0
##$PPMPNUM= 2147483647
##$PPRESOL= 1
##$PSCAL= 4
##$PSIGN= 0
##$PYNMP= <proc.py>
##$REVERSE= no
##$SF= 400.02
##$SI= 32768
##$SIGF1= 0
##$SIGF2= 0
##$SINO= 400
##$SIOLD= 32768
##$SPECTYP= <>
##$SREGLST= <1H.CDCl3>
##$SSB= 0
##$STSI= 32768
##$STSR= 0
##$SW_p= 8223.68421052631
##$SYMM= 0
##$S_DEV= 0
##$TDeff= 65536
##$TDoff= 0
##$TI= <>
##$TILT= no
##$TM1= 0
##$TM2= 0
##$TOPLEV= 0
##$USERP1= <user>
##$USERP2= <user>
##$USERP3= <user>
##$USERP4= <user>
##$USERP5= <user>
##$WDW= 1
##$XDIM= 32768
##$YMAX_p= 473746893
##$YMIN_p= -753014
##$CURPLOT= <Network HP LaserJet P1505>
##$CURPRIN= <$Network HP LaserJet P1505>
##$DFORMAT= <normdp>
##$LAYOUT= <+/1D_H.xwp>
##$LFORMAT= <normlp>
##$PFORMAT= <normpl>
##$SURQMSG= 1
$$ End of Bruker specific parameters
$$ ---------------------------------
##NTUPLES= NMR SPECTRUM
##VAR_NAME=  FREQUENCY,     SPECTRUM/REAL,   SPECTRUM/IMAG
##SYMBOL=    X,             R,               I
##VAR_TYPE=  INDEPENDENT,   DEPENDENT,       DEPENDENT
##VAR_FORM=  AFFN,          ASDF,            ASDF
##VAR_DIM=   32768,         32768,           32768
##UNITS=     HZ,            ARBITRARY UNITS, ARBITRARY UNITS
##FACTOR=    0.250966925370066, 1,           1
##FIRST=     8223.43324360094, 150836,       -187482
##LAST=      0,             -30455,          44362
##MIN=       0,             -753014,         0
##MAX=       8223.43324360094, 473746893,    0
$$ Real data points
##PAGE= N=1
##DATA TABLE= (X++(R..R)), XYDATA
$$ [...]
23862 72699 80181 180863 -142250 -171051 157862 118777 -7744 -109072 -171642 -134213 101243
23850 -210232 -23865 -90931 69155 259352 258626 -64028 61094 81355 340156 170257 -314295
23838 -112471 -1502 8039 -62372 138113 -373704 -214513 123684 -77860 143654 219423 -116940
23826 -145180 -127669 81564 -421767 -291901 -162557 14061 -31680 -122511 118115 127518 -322530
23814 -225519 190388 195913 -74940 123381 150730 79341 -291054 152436 16080 145834 -212646
23802 -319113 -52449 22192 -75339 152951 -6952 -63488 -63697 -63157 8482 107545 -55612 47549
23789 233714 201517 -108181 -73390 219165 -149937 -4139 71221 54310 -238053 81315 34351
23777 -236241 243319 -141790 194349 -127471 207707 303904 8910 -80708 -95638 -142247 15457
23765 5460 67308 -129518 106722 -102676 -53442 52592 -53484 103359 44192 58663 78791
23754 78791 -168689 -222006 156471 -150911 316295 -181032 88854 108625 22309 -62683 171130
23742 -3867 -24176 -2604 163365 -90647 -222143 -59574 -398174 -215914 -197988 231643 -296660
23730 -17536 201555 200519 269692 -272118 -196860 -136342 159881 51884 -83427 -114092 280976
23718 -8343 -298432 -130179 144447 96358 -28593 -30146 -207406 75910 201795 -351521 -60618
23706 -365737 73940 -84092 -145112 -196426 -90967 -33134 51573 -82499 186870 -144215 -3676
23694 -220159 64638 18883 57113 279331 234623 -3410 64615 73145 365184 73253 -149073
23682 276922 35433 -133799 -75068 -72324 -69350 243259 464310 164542 -23639 83446 -331269
23670 44245 204989 243634 -53021 -20574 -301901 436 -63565 114662 259283 147104 -81124
23658 16357 112326 -73971 -54170 -234984 3933 126734 -17866 792 181648 61508 119570 -123057
23645 -264603 53294 -245668 -242504 -146122 -368260 -32781 -294535 225494 39142 -78936 -65008
23634 -65008 63653 4018 -56026 -64848 -222504 210778 4556 -246537 144822 -80320 -107390
23623 -107390 6662 -121227 -99473 387127 -30576 338396 15947 -93237 187198 83802 280081
23612 280081 2110 140867 -112219 -48820 -27246 135641 48471 -303135 108277 165787 -236287
23600 -168022 234505 155456 -7821 -50760 251498 -155855 -162335 -14656 175150 -160197 -170759
23589 -170759 110372 -214436 206230 349576 275780 173776 -52939 135332 187699 115356
23579 115356 -119226 -200276 -160314 -170367 4968 -167056 -106025 58381 -141489 -67480 -70249
23568 -70249 303518 -19484 -1521 32781 233928 169260 111679 -56016 8777 25018 53557 45510
23556 45510 130478 -68735 -85394 -194215 -187905 416205 99923 -170529 -63305 200708 108238
23545 108238 113255 165886 -192628 124454 -122444 -84548 -144370 -12573 -223886 11343 20285
23534 20285 -2525 256396 72378 -248443 -409385 94558 -162086 -134771 -74058 -529665 -193688
23522 99036 -151492 178091 -300381 -287414 245179 107749 350784 -164020 216962 188339
23512 188339 -298138 178638 -20877 4499 155698 14411 -4186 112012 222617 96497 -287237
23500 -64807 -370700 -57436 -127421 299600 -174650 -202326 -131073 225384 -70878 -90388 -89378
23489 -89378 66834 -112922 101337 225541 -81781 -123058 164847 171729 111295 -282990 -104547
23477 -1013 -287213 -91013 206596 -51696 239737 -31232 -111015 194340 -117514 -141308 -149333
23466 -149333 -279035 139041 -188716 11122 -89803 11955 -123007 265889 -133198 -125462
23456 -125462 -121871 -886 -14114 167093 -96078 -142317 110404 395076 175907 26002 87183
23445 87183 -134499 35641 12538 -132763 147826 226069 302076 148421 -276542 -35857 136911
23433 98173 -10674 116655 94921 78107 134027 103606 49881 173778 261517 157789 -185945
23421 68673 -8483 -350608 243162 325526 -30423 -451281 -139041 -269377 57478 20389 -52758
23409 262063 44167 85058 -42278 -386925 441059 -54076 -85050 269659 203655 -127628 -302308
23398 -302308 -78215 -77296 -106144 24778 -160523 88308 -58795 -9982 -16141 -130463 -76360 -240753
23386 -240753 -123049 -521871 116488 -83992 117826 87150 -162045 195235 -295356 232216
23375 -24659 -96400 195300 -296120 -21115 150832 118145 347962 -48977 109196 -89947 -14176
23363 241560 -365437 157112 -410764 237288 -285171 1033 -190316 -108699 -62440 139159
23352 -15435 -50103 103931 -54829 -94776 66336 -226649 42207 -305451 284130 -85742 149942
23340 -188933 -189426 147283 -188865 -196671 51260 -11510 164111 -77195 -49719 424361 18298
23328 124015 4303 -290522 -242848 141061 203889 -14340 276516 -29014 -105776 -195095 232417
23316 -159006 -108419 -104625 -71227 -134442 -314481 144612 399902 43338 -107371 -68675 -16155
23304 151084 -296704 -26825 -71788 131716 139716 119262 -49731 -17678 -19997 -97833 -233146
23293 -233146 -378972 226620 42889 -77499 -80140 -235193 -81634 126047 -344152 35821 254799
23282 254799 208048 170619 34448 -94688 -258968 8606 -89301 -409487 331703 103915 91659
23271 91659 -27552 103628 207574 192561 303345 295515 269881 197897 -71107 -129059 225655
23259 162757 -99559 -16978 93454 -318260 44395 102231 181922 45655 -15615 -41921 -179308
23248 -179308 24149 191365 263667 -66556 -88182 -179758 69434 -188085 38155 -50481 -177663
23237 -177663 -152213 157520 62753 -25484 35196 -79796 292737 129321 -161774 165688
23226 -87282 -138171 -61872 -45333 -164361 236629 153238 -150334 -17540 39779 -169621 -354598
23215 -354598 -98373 74630 -39894 -50643 108598 -25679 -82687 -387059 1439 -15387 -257391
23204 -257391 96222 -158861 -75639 -19051 55724 120401 157947 -35882 -15587 -128190 -207036
23193 -207036 30685 27271 160130 114127 6084 -95828 -117336 -112768 118510 -95884 -320519
23182 -320519 191414 59645 -40372 425885 -108467 -73877 -162236 -47311 -96285 -35430 42819
23170 116110 -113642 -54737 -122071 73042 113990 -187314 -56046 -88844 129340 179723 -77091
23158 -205556 -5557 -110183 -104189 -131210 314107 -67713 13295 82515 -115389 -22020 29892
23146 -117622 164237 -83455 52609 263451 -163329 26329 193788 -428530 -123934 -352517
23136 -352517 128377 81574 -262702 60033 -89001 -307943 -454110 45028 -88553 33420 118718
23125 118718 -216535 -262554 133540 135624 173101 -284066 -28512 196191 -24837 64595 -320498
23113 182141 -59698 -78057 -110005 -6366 -297262 172339 -3101 257175 76259 -213468 -215664
23102 -215664 136324 -37389 -167227 -313093 11308 -284002 -173173 124753 127290 -89676
23091 -61402 -32004 248941 208242 107317 84370 -349245 -504568 -66955 233288 -73317 -136551
23080 -136551 208694 -142432 62135 -155339 79394 146297 -2227 -82525 -31047 -74502 217097
23068 204989 359146 -363376 130509 129464 -55381 37427 20584 -191895 359117 -560344
23057 -101448 -220321 569248 247476 149886 217078 -424391 18929 165016 377206 101713
23046 61946 82131 -166730 88201 -109119 46199 -149975 68894 -222725 -247017 5739 -9900
23034 -82728 -215070 142353 -50953 284771 354093 3796 125767 -186523 43031 -6623 -162765
23023 -162765 -278556 -111544 -249151 -159603 9150 -52995 172487 115266 102475 396808 -184480
23011 -53289 -268506 109689 301915 -156908 82930 -263648 -73499 -78886 187736 -232832
23000 202547 -56673 312938 20028 -259348 7715 -119955 -346504 378432 40934 217930
22990 217930 94574 132818 160815 176157 69225 -81890 145456 -61384 -35974 41950 -96306
22978 -198414 176962 166320 -183524 57937 -43534 -262316 43997 223427 218151 -253105 249752
22966 -324853 165641 -262929 137919 11626 221722 -170762 218802 218766 171607 -220875 110911
22954 -32811 -131089 -13060 -335821 -47801 259430 91507 -28379 -8059 -133199 -59121 80609
22942 -72027 186322 150713 -173893 -126455 76981 -427834 -152601 -88256 -41329 -303711 72326
22930 -293637 -26634 -11813 68948 -105421 -31404 -197987 -120695 394028 330361 121793 -104749
22918 223430 -371033 56875 -13251 -208824 -81076 -62073 -57061 -85583 -192992 25290 -198995
22906 216023 -105029 -108053 -108507 -26276 -11160 -34266 8116 87952 81645 75500 70551 3390 -131801
22892 466555 -318249 38699 -9475 40599 217926 53079 122063 -399817 -211082 -216137 135580
22880 9283 83736 201367 -162712 73392 -40016 -141181 -143152 14649 -16052 8287 137405
22869 137405 106204 385711 -197462 187598 176779 14845 291150 -89016 -132901 -66448 -12038
22857 182115 -9352 -160450 99067 -73988 58963 14211 -56297 -210643 10490 -14256 41444
22845 102217 -83051 -85190 -105755 -226216 188894 -65589 -209534 -130158 -206086 -123795 -84010
22834 -84010 -136219 -92163 -87258 -140668 147845 -240779 87179 -12138 -235187 -92032 81577
22822 -9007 267725 -251902 -139499 -30855 -162247 -49513 -78819 -127349 -24781 -134742 26147
22810 -99840 -95648 -159066 186609 3825 -12044 -45070 -230603 134026 -187207 196132 -51124
22798 35965 -164176 -72240 -82766 -57295 28015 92339 127104 196640 25883 -43599 90777
22786 170587 -198714 334166 -258049 77850 76294 294337 -156082 -56988 -105336 -289984
22776 -289984 -132402 62826 185836 -231423 44616 67635 -128206 -44952 -18310 125834
22765 -188446 -495777 -112702 -161326 416727 -350110 -129217 13534 164797 -267808 98592
22754 -198517 -122876 167179 -181326 -214826 -12143 -145265 -94552 -82709 336810 -11465 -136401
22743 -136401 -344491 -235239 -185309 296844 316658 -451074 -177493 99439 19636 225708
22733 225708 32060 -59631 -183162 78802 -157695 -40039 198145 54654 22406 199885 -285176
22721 200019 -108519 98152 -166670 204100 119690 -184924 136814 -115482 -91359 16337
22710 -152299 452010 -43980 95622 1714 182866 39414 -400 -282444 76912 -68691 -71932 30674
22697 290333 202204 127261 -107185 -131688 131477 -66849 -53600 187802 93186 -149676 74189
22685 -416635 40866 30407 -145166 62810 -184798 -7305 -120036 29128 25432 -280572 -204985
22674 -204985 -67226 185764 246156 -156378 23585 83758 -90998 52456 -11177 51652 -112788
22662 184057 -66906 -20141 268081 -158993 -152758 41542 48300 27686 44111 160918 -181001
22650 78807 69965 -387600 -170697 -139276 163517 -265700 137051 175873 21057 98079 143765
22639 143765 148826 27026 -78480 -68398 -35458 89840 -130651 -286114 -112226 -33368 -356969
22628 -356969 100239 -266151 -236505 115283 227737 145937 97183 -21249 42033 -255340
22617 -148989 13568 -346725 -145157 -25154 -381537 36171 5874 5885 -385033 153425 -9263
22605 -135843 64817 -221080 -214710 -201543 252503 88899 -53092 35069 51864 59125 170056
22594 170056 -242338 -256736 32393 -140589 281858 239942 -181988 16306 3577 76589 281552
22583 281552 67464 -45119 -115464 -338401 -182130 318706 16092 -187671 223497 -39036
22572 -534156 323327 -3259 133900 69203 -17053 87631 9869 -400555 231497 -141517 81831
22560 3356 -88395 56603 -47443 -39528 87368 -128826 -219375 87686 33962 -132644 204375
22548 -15314 -192404 100654 -130828 428490 -272865 170138 49611 70684 154275 -333084
22537 -103764 118982 -135143 -210949 88195 -383081 78798 -13708 -92578 69552 10398 -114912
22525 206727 7054 -222637 175450 85056 -22180 -20089 238354 -178503 -247017 -115047 281835
22513 -140240 107112 -112822 -87555 264643 -384954 272029 -184265 92435 -103405 -86350
22503 -86350 -167408 78343 -453875 162414 -14099 -80307 154547 147250 -131061 -44547 89996
22491 -152155 -369070 59064 -36841 -77478 -11840 177133 85585 118785 273318 369 304265
22480 304265 136402 -51022 -379628 11523 -160078 186537 7961 269954 -172332 215912
22469 -17920 124990 -165303 -114552 -108471 -93769 107801 279314 223986 21826 197025 -391111
22457 -208548 -63261 -23628 90873 137338 -56777 128222 -21285 -339061 23302 -90523 -295406
22446 -295406 -241898 63459 29749 -347127 206200 73376 -147347 -61450 -159729 148501 134667
22435 134667 -64033 -252240 95129 244970 -174828 30947 -61509 -127337 -33442 -171983 247813
22423 234852 -356772 -322183 -180636 -45658 -130308 169578 -604614 183147 -70809 229795
22412 28836 -236671 22517 101607 -21222 -43427 -132461 -303058 -2848 -332264 -70580 -263058
22401 -263058 142935 -53359 136536 -260361 -37709 -61798 -46882 -53832 -147834 227320 250340
22390 250340 -270999 13994 -264370 47429 198964 110687 61222 -61434 95413 26074 -34919
22378 -40329 -81590 -172847 -175394 -37218 -397691 214901 31327 127793 108143 31378 -8705 26784
22365 166277 -2188 -121968 10902 -305443 -24305 -184245 -173426 1185 97339 -135415 -54116
22353 -318433 -201955 501091 222235 210839 97922 217540 -1280 237555 132500 -314917
22342 218773 -23609 -29163 -176493 50512 75141 -297713 63965 105255 -52109 -164165 161421
22330 -188548 47035 186945 239084 -430514 65880 -144707 59327 78671 -137726 293485
22319 -261545 92159 -14751 -6547 23652 -114993 -270064 146538 149732 -121535 -137160 -31643
22307 -90945 56554 132961 161168 17914 141505 -170783 -180453 156017 -183627 -28345 -275074
22296 -275074 94361 -101947 -287908 -123392 190558 -187322 -5889 93730 167004 399593
22286 399593 336937 101011 -59721 -54706 63253 40778 -35754 141655 108661 27263 -281125
22274 23682 -60210 -119748 23496 -172761 285655 100069 -7459 -72650 15154 -179786 -192675
22263 -192675 52202 132644 -235786 280695 -301271 -57981 -149192 -319872 -116885 17401
22252 -21160 -245998 -278291 -138048 386718 107853 34460 35449 110565 -215742 -211363 21765
22240 -208271 211125 506289 94364 86941 142939 -334089 -352901 -32333 46890 -51026 -121791
22229 -121791 -67794 -155529 -101064 -315759 -27058 -119070 56726 175444 -322005 7943 -137276
22217 13936 -132949 80199 -225190 33380 4253 -31639 -10155 -74926 187076 -150375 -28905
22205 -143477 -203838 197038 -99933 36016 -92862 381402 -42700 -116341 -24381 -28603 -57867
22194 -57867 -161573 34038 -31891 -179634 -45456 -50364 132576 33848 -13324 80050 -74659
22182 215829 -10597 -176122 -261393 -225809 -48994 71147 -393803 292791 -58202 -165127 65896
22170 394545 13421 7799 -211713 -217282 64749 -384672 260899 122535 178682 202002 -331037
22158 -167023 91010 89448 -17808 -7704 27658 -315264 416232 -216612 -269704 -164878 14625
22146 136630 883 360762 -269902 -92874 -56263 -57678 2441 -77921 44660 -48613 -483549 -194307
22133 -273424 -18297 136100 125356 14736 -77895 -371453 111659 114832 61585 166007 -264242
22121 -256021 10695 -50189 32715 72501 -141800 -38459 -190953 -106455 -74790 -239100 -54055
22109 406080 207961 -273748 -180789 -411159 -63007 -327873 183453 80475 -197481 80541
22098 322142 64565 5785 -26212 -92573 -217206 212773 -51573 169855 -26507 243323 -156280
22086 219362 -138703 -132013 -165664 31748 -164738 233058 -211890 239604 60085 -10384 -228490
22075 -228490 385427 -97403 -91466 168645 4408 -120917 -19511 -106244 32346 -418534 73459
22063 -192633 -396932 24007 179255 -383054 56334 14791 53890 -15852 15912 -217123 -172295
22052 -172295 -542174 -505738 -102955 -90609 224558 -222443 51506 35251 -70419 -43657 122464
22040 48653 76558 187270 143512 -261059 -162090 -72625 -25966 -194981 78074 16055 6038
22028 -181465 422473 215527 223341 267362 -354626 -157282 -186741 164587 75958 -65968 133825
22016 99313 -155955 -53302 -89245 -49957 -4430 21588 -70499 -118196 -167500 -255971 -58037 5030
22003 164454 -168030 -257088 -1635 -359994 -46647 -260683 35173 67877 -21761 251733 351550
21992 351550 -235643 482029 -39995 61290 -87479 171044 -134553 60847 74531 -44644 173699
21980 -73502 256931 -369721 339285 11474 -264462 434008 -64277 -106158 -50029 -187040
21970 -187040 -333498 144230 242588 -267661 -76591 -209456 51165 284945 -142428 -120641
21960 -120641 -207868 219403 -348903 20788 -159637 202028 111236 -110555 -95187 -190412
21950 -190412 -87783 109923 -149468 -408514 49133 -192930 -25038 -313606 -21207 -297478
21940 -297478 -124901 302867 -231468 -109554 144400 -100532 -60740 63162 -153650 -52906
21929 198041 -232538 143850 -147245 110637 112872 -104573 50625 201320 73090 104612
21919 104612 240243 14627 204138 -128760 -251804 -46098 -198546 20345 74331 95213
21909 95213 -96854 45273 -58998 -17558 -232325 -296932 102285 282057 187229 -6506 -181510
21898 -181510 -49444 -52522 114379 -202216 40583 -448007 99973 101574 -225762 -7120 225841
21886 155933 -155693 86098 -250561 -149591 -129531 124251 -28661 78813 29439 -70815 110948
21874 -404372 -1809 -114457 61390 -171261 116557 346550 129157 53836 148979 542107
21864 542107 -125207 -296661 -117769 119679 -86929 96574 -28550 -157647 73369 -32401
21853 110913 88705 103503 -159485 -83762 58729 -15593 293976 237626 8268 -47964 -31522
21842 -31522 -119166 4187 -215644 130316 -154753 9128 -76126 14581 110022 169902 7711 -63857
21829 -183228 311904 68588 -67317 110874 10161 -279596 94459 -106297 -262943 54393
21818 213778 -170404 -267727 -90623 -23181 -61298 7611 -94037 40770 10234 -153897 167847
21806 -182368 7941 -51078 -148794 -51244 -161326 403921 -151012 -292250 -243633 -101831 -139071
21795 -139071 86504 -127506 76545 -238847 -181571 -72923 -74124 116100 -91954 -44192 -544311
21784 -544311 51842 -7255 -141377 476717 357380 -263193 -65713 -36295 -49391 122293 -202275
21772 -170674 -199431 -88180 47775 -29362 -93762 -92700 9399 -119157 152110 279906 -28891
21760 -282562 101079 -218149 -57188 -422646 -135512 -134624 -119841 -144188 -41246 2238 -309095
21748 -136701 -382898 -215663 1240 357867 -431203 -239432 -51012 96521 -70254 238357
21737 -48815 -136056 214756 86037 100532 55315 -156895 -184010 -312477 -109477 50107 -8533
21725 -176669 109097 -317443 -179393 -382209 139208 93998 -295408 81488 6415 125601
21715 125601 -48751 46548 -116901 191804 2026 44550 -209463 -42189 -141260 87330 -6676
21703 -129048 71319 -191307 3386 90959 210197 298724 49408 -128143 -159616 55540 -260111
21691 -381193 -305878 179281 -37475 -102174 -283188 -108186 -161847 194996 72956 -85470 19568
21679 -251418 48276 -58019 206852 -163549 6966 -389903 -91057 -79569 19089 508354 -15726
21667 -110665 131121 -13027 19494 -251109 54672 -123723 -69724 95088 74785 -2705 -126544
21656 -126544 5596 207545 152512 23877 11188 15106 -40530 -83596 126408 64305 -26724
21644 -286324 -56617 -27307 -261578 320835 -6081 225557 -123004 -210178 -122436 83682 182744
21633 182744 180162 49893 112798 -114080 147029 14034 -235001 185896 -58861 232926 149760
21622 149760 138553 -173798 190845 -38094 271687 -85214 49610 -83214 -300474 8405 -18680
21610 195026 -287995 -77142 4662 -185884 -19631 -234531 55395 26094 -51105 100801 -41442
21598 -114157 -18045 -270106 150446 9525 -17366 -97921 -160480 -59401 -192848 163520 162746
21587 162746 162115 193086 -288979 68172 -6074 -139452 -159959 278030 -154668 -17895 -48323
21576 -48323 189598 -336687 -76739 -203290 -282931 85761 -285006 -151579 -268762 17714
21565 178582 -157383 113150 -253787 -2234 -204115 -340135 -85267 -289313 18878 -348517
21554 83659 -59957 -128213 -3132 -19906 277149 -306708 139615 -297995 14197 109894 -265806
21542 152213 -80710 -399590 -48350 -23853 185505 -162169 -168191 41291 -75237 -315674 75005
21530 250802 -247030 -1870 -98341 6424 -389514 172733 -376609 -158964 -70325 131744 52013
21518 -208690 41905 -91084 -33595 49559 -208488 -144806 -333616 100989 -106488 223985
21507 -243380 -329367 209091 14095 -376550 120882 183327 -26868 -107692 -63235 -302189 177487
21495 -9483 205771 -181534 108867 -120284 30438 99112 -1693 146800 -93749 -42711 187291
21483 39305 67335 -359731 90270 -182465 -378076 -157361 -168815 -121586 165378 -241796
21472 126757 98879 -307684 -156933 31981 200518 -358089 -91991 -27610 93755 -62384 223725
21460 419335 -94849 -179426 -37108 86196 163268 -247715 16893 83780 135636 77261 106977
21449 106977 -429778 15112 124432 -331544 -134670 54479 182111 -6844 312839 118523
21438 -55523 40342 303293 226345 377319 463065 168190 3495 -42682 46125 93432 -155241
21426 -392365 20973 -147847 -108202 -11129 117964 177438 -1089 -87255 -79816 237156 -107547
21414 -4865 -37689 65097 -151870 -233896 12529 -386312 -71770 35238 -31483 -324397 172408
21402 -248993 102800 57109 43052 389903 -162175 88856 -352225 31380 -3123 120727 125405
21391 125405 -141478 295281 144731 -230354 149146 -259096 -64853 138812 -181612 33539
21380 122557 233163 127546 213512 160645 -123152 118752 127189 -156468 -74905 -372761
21370 -372761 -187023 -98655 -231778 44436 85354 -165847 -150707 -247136 -102886 65719 -143162
21358 -61237 154547 68545 -206034 392758 156552 -237649 -98150 -180848 -269899 -217589 -92023
21346 -33582 2415 79610 -120476 -344879 90710 -266266 64412 -208913 -30122 -228185 -109187
21334 -231258 -78508 -90524 -58539 -195633 146652 240666 -335502 -157588 184635 31254
21323 -101325 22906 -6557 2369 -225904 -29301 -67407 146966 19707 52337 7222 88385 -23805
21310 315381 413915 -91526 -152800 141475 -52527 174439 88283 70481 -158565 -529343 66641
21298 -123342 -268921 78642 -315453 190126 152317 338668 -163038 -56270 -147090 34602
21287 -106705 -375285 -37320 -237220 -156546 -123624 -130324 144812 -21628 -81259 126074 -163405
21275 -342760 53614 144908 156244 -213653 -193997 -5744 189095 -177478 62393 117977 243037
21264 243037 43776 -69863 180129 162281 -96502 486564 -106009 21831 71889 148136 -428636
21252 25767 -52500 -358263 -11358 -240210 -20449 -33116 -339988 71175 -151015 30044 161911
21241 161911 -15823 -278141 156428 203657 -139554 -191159 -309237 -123781 -144725 -278788
21231 -278788 -319245 -277093 -245007 -72614 -351042 -133361 44637 -77736 87757 -246120 -94012
21219 -52685 -243415 394663 26882 -458870 265289 -196155 -53637 -44375 -79354 -296271 204478
21207 -354580 -339157 -341542 -343735 -174709 -32969 -95147 44403 247710 -585274 235309 144933
21196 144933 -87038 260471 115133 226369 153364 -195463 -37101 270932 -364223 44092
21185 -144593 36206 -89346 237003 -45413 -35941 194168 -276035 28058 179093 -353404 -158059
21173 -154421 -424271 -389678 110634 -282671 327081 243062 156479 -118509 -173683 -70102
21162 -73279 27191 46044 25232 -30559 -177343 -331081 -177902 6411 200508 250593 -361445
21150 -9807 -37719 24693 143302 281001 -15843 -43339 -126852 -225169 -229424 -250945 -219229 -92347
21137 183007 230824 28032 -46898 151537 -75885 -130188 49593 -187998 -171079 -179811 -215435
21126 -215435 -192006 119917 45101 -53136 -16583 -136560 -86813 152878 -120911 -502705
21116 -502705 292684 -329148 -144508 -128077 -307662 -39020 81809 33110 -56063 -25064 -393724
21105 -393724 -40028 131025 91457 -32551 -94763 129654 16611 66949 -116062 51308 80346
21094 80346 -73010 223797 -287378 -134811 -290393 88152 -218890 -144759 148584 -210865
21083 -189074 -377462 232562 -212279 -131436 100720 348543 -230981 -128394 258701 199598
21073 199598 -27793 2914 -145395 -90461 422851 65179 -191956 -207515 -43500 241091 -51976
21061 -86176 12748 49787 127750 204059 -24085 -74236 -88581 -258655 -280894 -74550 31897
21049 -12656 -171030 -13371 106853 -129542 345006 -274733 125785 -32269 174175 177106
21039 177106 -71383 104071 -140718 -30324 -400083 -137888 55498 -64778 118376 303151
21029 303151 -23212 -114355 13908 -30185 -106606 88823 -21722 -127603 -60059 141998 117191
21018 117191 102805 -267819 -84861 -41945 -32651 84749 84567 -178000 8811 6202 -81609 -346216
21006 -346216 -6204 -71050 149861 -300646 -303744 -137230 -241182 -89334 -250022 -147037 47498
20994 -63808 -41835 36639 -10788 -189964 -336111 302549 -185492 -276923 9432 -95011 -16153
20982 157145 -270090 45381 106564 -167659 -24383 -69122 -201367 -209163 -356063 -1577 74464
20970 -205183 -83482 -249011 183907 58889 -95554 -7738 63506 -11359 44625 -151475 -129439
20959 -129439 14584 241296 -26298 83818 -55592 78899 197901 -404382 252902 -415 -379645
20948 -379645 -24593 111546 84188 -218391 2361 -205278 -10469 -127248 -241432 -199131 94793
20936 204120 82564 -179540 -188909 114195 -143514 -189139 -388504 -100848 -152547 201109
20925 -28085 -282353 205637 40334 74790 -504871 -283059 -254754 -86212 -265822 -130302
20914 -94139 -362429 -160180 -286897 -30586 248955 8149 242795 -352867 -15160 238627
20903 -69326 -215628 -280777 -142799 -11129 -270487 155096 -30378 -269612 -94284 195831
20892 6177 -55704 170127 119966 -67892 -120190 -5617 -271949 -56158 -180169 169582 96479
20881 96479 -133359 -94379 -188804 90132 72799 81053 -23377 -191290 -390000 -97486 83620
20869 -96529 -60173 112473 134688 41569 -207084 -105003 -20076 214685 37115 -64370 -12915
20857 85806 -145990 -278762 15690 38817 225257 -306142 148164 -211788 -217173 82343 -148795
20845 -274347 44458 -317420 33904 -39067 83843 71511 -224897 -123361 -95772 -81201 -374624
20834 -374624 -177651 -129720 61825 -257449 -15026 -29428 -114827 -195245 -185072 -519512 120146
20822 190394 -145734 82560 -17899 -242006 -337461 33040 74554 -21617 18911 -30820 27994
20810 300111 17176 -96448 24966 -113773 94284 -137834 87561 28301 73793 -90117 115694
20798 5907 -105313 -154896 -87823 144767 62236 -82960 -202544 -17537 -33647 -193837 120808
20786 30492 -380860 366852 194822 -113177 -227688 1590 10504 -111469 3297 87461 -13501
20774 -309114 120374 -204590 -51951 101316 -204668 -345843 -55835 -304867 230005 108206
20763 -264457 -78156 -14962 -162206 -254002 36351 -204048 23846 -225526 33793 -127811 -204733
20752 -204733 -191399 -167529 -34684 -4382 361028 -54214 -181046 35755 -55646 -156404 -464771
20741 -464771 185552 49257 35239 -248366 -39275 340168 -83341 117495 -100246 153914
20730 50107 -161122 -286835 123201 348550 27938 -44664 -38044 -146844 61444 -140703 13682
20718 -195941 -374075 -4666 91017 2787 -65209 234829 -76132 -77182 -194417 201333 -100184
20706 -150939 -105747 -166647 -307474 156329 34561 -557796 -257185 -208659 124263 284952
20696 284952 -35834 -170558 33003 -177428 -99262 -81445 25485 -408919 58020 -312002 91845
20684 174698 263665 -80039 -192204 -158196 -353548 177440 8091 -94982 280350 -259639 -61467
20672 59798 -134211 -173713 -59021 204296 -77792 196435 -111961 142221 -129311 -41026
20661 -452454 -19135 -156972 -183420 196231 -337730 270682 78483 -30334 -52625 -9646 257146
20649 41364 -109409 163612 -74783 -50208 56156 59390 -181974 127697 148663 -127913 57241
20637 112328 57578 253916 -123647 -308535 32495 23597 -102246 -177490 209471 120158 -145556
20625 -73723 11119 170325 60005 -350667 36809 159526 103806 -251814 427858 -113374
20614 -220182 -117855 6172 -318856 -29532 173309 -287303 -111018 92283 -161769 -420576
20604 -420576 -85503 -152209 46736 -109008 -355295 -35227 339519 27056 -179743 -242814 -35025
20592 -50343 130867 86352 -96659 339091 126916 29551 -508451 -50639 -278544 -196225 -3592
20580 131051 70651 246246 22854 216598 161225 46379 -255155 173805 81966 144972 -419265
20568 -231132 -126973 -317459 -212376 179234 31350 -279832 -260903 156535 -58827 194892
20557 129792 -135722 140239 46548 36079 -139187 -150175 -62140 -24321 15006 83310 -303178
20545 -176425 -163325 -166134 36106 -166281 -203279 -171985 -6777 183495 -83355 -288878 68732
20533 -102681 -53593 68008 94220 129624 -179757 -184186 -77155 101894 290844 124859 -346190
20521 -155797 -25987 -12883 82947 -127579 -166941 39358 -238117 -150467 -177545 42271 4307
20509 -190090 96098 -168607 17069 -295185 2426 208679 35817 -67700 39023 91385 174251
20498 174251 -262515 75601 -13325 -382253 156599 -147681 -8494 65425 -116612 154198
20487 -31025 59106 -470842 -248419 131158 -139241 -637329 -123903 -175818 -272896 -183489
20477 -183489 -7214 -74595 231574 -38463 -232335 -130444 -8990 -26870 179245 139948 -85749
20465 -154993 76388 -207753 -185082 81357 -8998 7476 293182 -403361 52720 11266 -275122
20453 77801 47420 -15787 -36583 -336882 -278893 146226 39417 -190114 -122057 -76238 91223
20441 147941 38838 -304822 123933 -30073 138804 -324634 -264838 -239196 -336526 -22452 -29020
20430 -29020 -378536 103319 -157303 15009 -65550 -262166 -32648 110207 -136654 14802
20419 -314078 -84636 48669 -35565 -275587 -26027 25014 17004 143660 286687 145732 -240418
20407 32567 108908 -142246 -54184 -106881 51980 -399339 -172902 -179348 -56532 142777 -309597
20395 -287613 -394670 -15821 -368038 -16199 88965 54310 -59961 119908 -116962 126099
20384 -343404 -9117 -171067 105493 52812 -123346 112847 71315 66278 -113332 161823 -171824
20372 311511 -280093 -367492 -342202 -118247 -139404 -244449 -23747 187745 63078 -42568 -87828
20361 -87828 73277 163527 -351351 -50272 -154412 25650 -399165 -309308 -175374 124998 -141587
20349 -269620 -198668 -219018 -9711 -7054 199505 160053 -233250 -15219 392574 -136374 -53729
20337 172471 -86861 -53426 61435 -23690 9424 -189043 271922 -150378 370499 66843 -153737
20325 118438 -315310 -117326 191984 -174938 -168445 102261 -104543 -323612 10252 32265
20315 32265 -388812 6009 293893 187383 120626 -27276 -211172 108057 -345493 120572
20304 182895 95989 -111963 -365306 -74296 -64088 -36751 -214851 -136746 199307 43122 53892
20293 53892 -20274 -310392 -190789 166586 33541 132964 -62508 193704 -86738 -61074 116572
20281 -171828 103740 -5166 -51437 -88005 58667 78964 -82904 -292311 -62842 136473 -148581
20269 -236222 16844 36989 -267430 -74461 -455277 235996 -110332 -150925 -476165 312361
20258 301972 -212740 -52403 -256252 -81633 200472 -188465 -118946 1412 255560 -137754
20247 96968 -158344 -214668 166270 -42489 60460 -208507 -318300 119436 -113327 170328
20236 -233028 5416 23996 -458133 143024 -248708 86321 96514 69791 31937 238715 -34456
20224 140880 -94265 -55976 -90325 -23383 -208102 15050 -219175 -238584 -180188 -176717 3583
20212 40695 40131 18805 -28605 -180103 -236769 -10790 -155995 174501 202006 283956 97002
20200 -196715 -471140 -233942 293697 -133571 65116 56731 8700 -256781 -403796 24742 207031
20189 207031 -23518 48593 -152515 -142813 -502 -35580 -187529 -61793 -486646 363219 -137648
20177 -487023 -327673 259073 -250015 -27976 30309 -139709 -114011 159677 104632 -216058
20166 -70939 -193504 -56258 66612 73348 40174 147966 246657 95411 18995 -179070 13790
20154 -20271 -40064 -312055 -186338 -105428 -88513 -109933 -172131 -261066 -282554 256300 -222802
20142 -228787 313578 47565 -145268 91073 -128071 -207830 205349 87987 163574 -183497
20131 101405 -100809 202821 -220115 -17767 76198 -214178 -105481 97270 259742 -240393
20120 -78127 21347 -416614 222700 -207356 95874 -242734 -205039 97122 12840 -233672 -2009
20108 -122571 24873 247053 -158116 40037 -487973 -3901 -258892 19131 63553 -136276 -238635
20097 -238635 -270623 55807 -209667 -11213 -130971 -56866 203592 -531931 -253099 95867
20086 -60328 -79574 2044 -83407 192593 -32368 -316692 -44017 -176951 164172 162208 -109774
20074 359 -447953 -281793 196014 128330 -151474 107806 14564 -301557 -281586 -285791 -7069
20062 -31971 370953 25840 179589 -103514 -89403 -77795 -194952 -252429 -307391 148614 -52620
20050 -164765 -22564 138679 -312428 359972 227984 -231910 44938 47904 -4915 157879 408939
20039 408939 21400 116376 -500713 -216495 86011 -189053 -231309 91268 139858 238777 178379
20028 178379 -17457 -45259 -149409 58496 474250 -17325 -429203 143969 -123795 -281076
20018 -281076 -163509 91868 -166796 187023 -313530 -250627 -374499 -87815 86539 83006 24135
20006 -20297 -33150 60185 -142180 -347012 70947 353197 -18827 -69124 -65401 -198384 -62093
19994 -147211 85734 -212420 -149190 158186 -326782 -79621 -228873 -138255 -292413 -115644
19983 -404149 -193352 9778 -209292 178891 141540 -179405 -350308 -88364 55415 -64653 -252434
19972 -252434 -57652 160816 247640 427651 -257118 -38188 6548 -47470 316529 15633 -207775
19960 -186263 -206230 73701 -65740 -377293 230049 -92815 143768 84460 -3317 -174448 -4941
19948 32391 3920 99150 66318 -492462 89992 -306007 -108396 97143 -86851 -144424 138239
19936 -152663 -122152 284537 -237783 -138920 -37894 -49224 311827 -109572 -205183 -168954 152424
19924 139785 24027 2973 68181 -51262 121270 -165903 47033 43356 -98904 187477 89798
19912 111304 136969 1832 -15539 -275844 -156239 -520946 -198545 -198027 58777 173722 123624
19901 123624 209491 18102 -371059 -281740 82027 46519 -664697 73443 -253290 -204200 -95178
19889 125617 -299939 247814 168767 -226065 -366083 -159933 -14141 -153390 -151989 -138067
19879 -138067 -6606 -228309 206851 -365772 104227 240418 -132347 -218341 -70548 104178
19868 -72170 499686 -179784 -230505 -300376 60677 -267158 -107043 163003 -318008 6766 -23257
19856 152387 -321452 303182 -186254 -74043 -85001 73304 -251432 -80382 -186630 156761
19845 -478880 -433953 -121094 53876 13097 -14013 -109368 155484 -95202 50569 28102 -191577
19833 165946 173543 16576 126830 -274469 -83921 -46778 141705 -442441 -253189 10706 -206449
19821 -42406 -136935 -60006 -42705 -103598 -168897 11127 -38603 7870 105154 -304091 -156246
19810 -156246 -352655 -166026 114115 -275919 -160844 -3472 -180604 167205 -210159 -331879
19800 -331879 -127777 -500627 16650 -54734 -185893 -253546 -160697 10311 -97462 -326472 -219626
19789 -219626 -92871 -168612 -44375 -4380 131152 109915 127417 -136937 3102 -344792 217183
19777 19010 -244996 -84723 19337 79514 73055 86612 -123857 165977 -113302 -334382 192692
19765 -166744 -227713 151609 -5332 -152678 -14149 -25872 -183425 -370908 228985 -196843
19754 -99613 286673 116590 30785 -277839 -66206 159113 -161116 -169729 120820 -191773
19743 27501 -146495 -60620 -105704 78105 -130137 -33684 126430 314300 -213748 -104083
19732 -274202 -16388 143076 -270930 -156789 48847 148424 -42437 356308 -201775 129128
19721 -56073 144999 79411 -221539 40977 295518 -164478 -191289 -59856 141058 -239333
19710 -112112 -344324 39478 -162361 -163742 17467 -231032 181411 -57862 177161 -585013
19699 -181873 -10882 -140492 -94004 144760 -58972 147003 -131192 -110119 -116079 -106482 253757
19687 76302 42948 -318072 222485 -522475 -659629 -91802 -23423 -476651 56940 -87549 -203306
19676 -203306 -231738 105146 63593 -67128 -204786 101882 126340 -258404 181053 -240943
19665 94303 -101230 258053 -65657 -126721 308683 -148018 315486 20763 -237059 -5416 -31164
19654 -31164 -219108 43236 -67533 -166692 -26034 187109 194847 -181691 42210 186672 -368318
19642 -158028 206176 -6541 191661 234928 -210334 -144911 -75854 -172298 -328499 -346095 -14721
19630 -228436 28357 -187878 -326597 -64616 59775 163049 -344072 85719 -149147 -87767
19620 -87767 296601 297689 -178864 -127149 52502 -94002 41783 50773 -95705 -233989 68979
19608 -134428 -137725 -129779 46531 -80272 60466 31051 -64919 -173527 -139557 -175192 41915 -78760
19595 -153740 -82743 -56674 45120 -92657 -440901 -120260 -165885 -220282 61307 -64765 158351
19583 -150355 -34917 14918 -167650 -127368 -51687 -288563 134641 -23214 -230892 -45312 146363
19571 -171777 213937 74534 -193629 -61860 263077 -42723 -54794 -259451 -186419 8871 -167321
19559 3951 -38200 -226592 -40063 35876 -106843 -24375 99477 -146613 25947 73218 -289028
19547 211901 -62867 -149725 248217 -24851 41725 -34913 -83282 -139875 -83333 -171229 -370705
19536 -370705 -115501 338407 177288 66414 -5759 -104506 -90732 -84310 -63804 26772 -249289
19524 278906 -64122 -28974 -272120 -227674 146174 -153245 66990 -406340 113503 -216833
19513 182896 76428 -326293 -235242 111674 -385416 -171642 194308 -4017 51457 202385
19503 202385 -144466 195259 132105 -104219 -30670 24779 -62955 290681 -368337 -267189
19493 -267189 304396 -91222 172573 -82797 65871 -197009 -157636 -197935 -31297 78793 -373212
19481 -81686 -131125 -484523 -39938 4209 226887 -167118 -200961 -79773 51815 -66186 23947
19469 -35325 -267373 -69197 211973 -127657 -138589 -144500 -24648 -133806 67829 -240488 -414853
19458 -414853 390218 -346769 39552 -415964 206659 -101347 -121325 -167008 199011 -125259
19447 -147074 183088 287691 -150011 -20317 11259 197534 -203255 -1122 -137094 -378591
19437 -378591 -174566 514072 89725 122620 -141466 -91198 -370505 230601 -103440 75348
19426 -244897 134252 -178684 -100161 -102247 -38555 128600 20772 105533 49399 -212159 103924
19414 188812 -138618 -38176 -67049 -43212 -303702 -197990 -125564 156266 263174 46551
19403 -2243 -140320 -96888 129624 -118283 178965 -141175 66741 -64715 194460 -113296
19392 -172543 -77856 -188058 150217 -99466 -201327 -156230 172247 -42413 147835 171432
19382 171432 -91016 -81261 -48015 -12370 -124111 122034 -206532 -110891 -151864 -155359 -243401
19371 -243401 -330972 -57494 226965 -76334 -14069 -29546 -129370 -198460 93163 -354310 3912
19359 -133640 72276 -147751 49298 77390 42754 -272700 61146 -68511 -240582 33395 78158
19348 78158 -107704 -225437 137175 -283673 -64750 -35572 -256440 4179 197027 -78670 -261991
19337 -261991 -201948 -197912 138331 -291610 -97447 16202 1507 -288067 203145 -6842 -40951
19326 -40951 40272 -226515 -298520 11122 -17645 122026 -497330 31264 -73789 118381 88051
19315 88051 -262518 -135394 52518 -73051 298443 13949 -513008 -110653 67104 -80148 249072
19303 -148356 47663 -122828 -50285 -248971 -375046 -134622 -131238 -205235 121588 136979 -120901
19291 -30738 187241 71877 -168211 -257343 -261158 35885 79617 29982 98275 77967 447842
19280 447842 226615 36564 60769 -5520 85170 -41110 2885 -355274 115603 -142590 221095
19268 69526 80887 -203381 -62016 -88179 -326133 -226208 -230596 -191962 106765 3181 -134584
19256 -137469 80072 -148134 -105724 -247883 18440 -92833 216931 -61635 102792 105261 -28438
19244 25876 -45944 -98805 -364374 -353985 -203991 231129 84478 -11101 -86688 -81314 -219087
19233 -219087 -35110 -76606 -67189 282434 -161374 -353425 18773 -33057 -224507 -49305 -252365
19222 -252365 -5976 316656 52293 -204946 285758 64816 -110443 -227000 -32198 8684 -207200
19210 89188 -31470 -226518 127577 -31380 -60895 -9372 -19692 350911 -42986 -49560 122752
19198 -124926 -291069 -102707 -49174 66872 215227 -120469 -29592 -322137 -436453 -33494
19187 -49842 -146387 53728 -93854 188348 93878 68268 -50299 -77670 -77404 -87778 -33724 -66435
19175 -66435 -47872 -140572 28398 -183655 -214646 422187 17749 117354 -139628 -153047 -173000
19164 -173000 33555 -216148 -201107 -164678 -17905 78257 -38437 -438567 -245078 -347953 -18397
19152 -29891 19024 -199645 -67426 -121070 -265843 192582 103049 -137375 -68469 28730 -215219
19140 -187060 -284083 -324998 -319139 141259 -186941 -575951 -263938 -55130 149333 160424 -87717
19128 73732 -260084 -51804 104466 -286522 116276 18590 -191732 -183375 32980 252927 37942
19116 -43012 -116757 -230301 -90555 -114272 -26223 -160382 -245447 153540 -53658 -68125 52999
19104 -128143 160005 212142 14498 -66896 40727 -45472 -27939 -144474 -253734 70601 -254607
19092 56261 -179637 -14798 243535 -297558 134736 -11411 136346 -132587 139196 -51426
19081 135318 270709 -170258 325770 -180416 -49490 164925 -83427 224280 53215 313265
19071 313265 135561 -317623 7463 -70090 -55676 -292379 -219681 -126089 -437980 -37970 -39480
19060 -39480 -297190 -7962 -98859 41331 -286496 43051 93081 -213224 -27223 -83237 -54882
19049 -54882 19774 -46 -147740 -234650 -185289 -136922 98981 -55896 -249578 -307794 -273229 -112131
19036 156334 52183 -412282 46667 416152 -163586 19518 -190878 199286 -214775 218405
19025 -110396 391385 -168534 110358 408950 -45728 71631 -218614 -79142 33917 -291606
19014 235124 151976 119695 113555 -103758 126563 -136091 -297845 -86059 18972 -385600 -154958
19002 162850 29311 114037 -87081 73473 162945 61205 31580 -53583 147251 136434 -287558
18990 212296 -80437 43417 -140293 30620 -93695 490290 -223312 -121846 -121570 -203547 -296499
18979 -296499 28883 11028 -408705 -204411 -72881 -309278 -309570 1105 -20316 -107114 -34212
18967 121624 196663 -162679 -369438 -207620 258793 78862 140017 -16514 -180355 177426
18956 -37004 52233 63477 -3001 -156559 175444 -140677 16646 -277245 -251848 -193166 30676
18944 -278130 -232261 -138570 -115065 -174481 161050 103360 172092 22582 -30625 133910 -112275
18932 -108654 -231689 -198922 -108195 166674 -32168 -215457 -85418 152647 -116588 52477
18921 104519 -193541 7230 -157344 17573 -196383 -65191 -11824 -57394 -4905 -52351 459173
18909 -15463 -220149 -182878 59042 338892 -48554 -85806 -221785 -123228 -181479 -149900 -62339
18897 -171336 -111066 -40240 341266 -236088 -602986 -222611 259432 380826 -137668 -22390
18886 92658 -474366 176351 -104531 -50044 158184 -91991 -146720 50306 -109543 70010 222148
18875 222148 -289816 203819 -52035 -454800 32359 -176808 151246 -218733 -134414 -257717
18865 -257717 68066 44003 -324015 36280 39932 -167231 -180678 -54541 -13794 -86352 -153514
18854 -153514 44230 92673 -373 -142364 255995 74911 150399 -156374 -83999 -352191 -32926
18842 -120114 -90252 8339 -147957 -180942 -161841 201803 312726 181066 -112037 -1252 -148679
18831 -148679 63735 -170332 -121072 -198036 -93298 124291 -85743 -113465 -136639 -157847 -3773
18819 -2749 40740 -71900 70667 97245 247488 111487 -108773 281256 189089 242015 40757
18807 88276 182511 10126 -67183 390300 -2773 -12699 -265034 -76013 143425 246485 150763
18796 150763 -153996 -41590 -267633 27252 -138335 -87061 -647928 -64114 -157460 -166977 -200340
18785 -200340 -26132 133548 -276750 198363 -91942 135950 91741 192825 -2652 24602 -251693
18773 -293113 -158830 44265 -126116 -185989 -46843 -201057 -186696 -81170 -583490 150993
18762 -230109 -82086 15054 -199880 -33574 152337 -110883 -291023 -253934 -154054 20830 85396
18751 85396 -146509 -57621 210234 39592 100318 58757 -75577 -714 -133385 -20622 30157
18739 -3303 195478 -145587 -260780 266471 -365814 -6758 -51919 -262419 56765 -10096 -133824
18728 -133824 334490 76428 37199 -437121 -153476 -218382 40864 38605 -84703 38161 -87470
18716 90872 -290999 -86852 158116 -237474 -29224 -60772 -271191 -191230 -21824 -245862 83180
18704 -13529 76628 -89862 373563 40268 -89557 -125216 19735 34510 333534 31592 -83649
18692 120999 21429 205931 -414820 -213192 -117108 -63813 51447 -155947 2555 46666 -251345
18680 -41473 -336692 -8127 152052 -20965 -67285 143212 -102710 -55491 -184712 416134 -74002
18668 147991 -44668 109490 -153161 -160265 -300987 -24152 -50603 -64124 -60666 72926 -306586
18656 -105847 21473 -57853 -352291 68604 152892 110204 -71831 -67282 -151222 -218380 -242606
18645 -242606 -168969 -152703 -146415 92954 -284207 -185453 -98420 1648 187495 -27524 -11896
18633 109727 -167704 -223762 43861 -163940 -109985 -104745 -244272 -569021 -44307 -196299 -323674
18622 -323674 -142292 -67355 -306091 -16413 -170196 -272028 202482 -25118 -284620 -177580
18612 -177580 -212296 -25045 -118183 124452 68214 45196 -144081 66608 -6921 112202 -365595
18600 238998 -269575 16788 -114651 -282154 -29946 -274757 -106446 282874 -339797 236494
18589 183186 -152958 -96310 183791 22825 -9159 225202 5576 -204644 144363 1351 -199140
18577 83934 -79617 -126534 -180331 -175803 3135 147200 -306512 280965 -96772 -165056 -115988
18566 -115988 85826 99187 48264 4172 30459 136486 65194 -218143 -137128 -91026 124608
18554 -157506 -48059 161776 181365 -281234 -59853 -94510 336671 -91000 278725 -136335
18543 4389 38978 -120185 -10979 -209708 -116931 301062 -80260 -273888 -252540 -275391 -149867
18532 -149867 -467009 -50349 -101965 -66294 266943 -106556 160757 35801 -20107 -92029 -179836
18521 -179836 -78495 169054 117306 -73535 -11844 -322276 -9470 -202586 -30348 -28967 -27184
18510 -27184 39056 -239986 -14453 163216 197321 121894 254556 -40511 -57483 83777 -33252
18498 -34529 -330349 -71159 -79033 107996 95609 -152366 -130026 -219951 -75591 -190611 -106791
18487 -106791 -134182 175605 -142753 -33336 91890 57203 -438212 -153286 -106317 8124 96831
18476 96831 -24809 -193775 46413 101617 -177931 50632 -124320 -29064 -57453 -95260 -135625
18465 -135625 7923 243567 -144058 278362 -174440 -75470 -158761 87825 -134011 -298197
18455 -298197 65139 -337492 134598 -79428 -119002 353074 25272 -173899 7100 -177091 119073
18443 306938 260216 -139233 -73297 -212213 -171173 -62889 -161976 -133746 -2323 -93948 252478
18431 94322 -23678 -415005 -346248 -95003 280731 -142257 -360680 -37240 132959 107043 205173
18420 205173 4872 -164646 84659 -498337 -149419 -58603 237375 -155469 -181652 167074
18409 175017 -178605 -54144 119507 25751 182240 165836 56617 -329739 112332 -263708
18398 -178726 14853 -218066 122465 -44110 168531 98052 -23688 -335249 -24003 111084
18387 -101857 -9169 -50053 15280 244066 49409 101244 51765 -109117 173708 341784 -389899
18375 -142291 -188803 331132 -85775 -102080 -98675 -90156 -543168 -126158 77625 167197 128444
18364 128444 333856 411157 36936 168176 -90635 436557 -203364 -95400 197930 415270
18354 415270 -65514 -282354 -314802 -58888 142137 -241667 -85957 -16745 -27001 -55967 -209122
18343 -209122 112873 -425376 62272 -112911 -258181 80863 -32826 185934 130892 -77897
18332 58070 134283 -7730 15310 70768 -496929 78320 -161052 -377585 147779 -147473 -116045
18321 -116045 64929 -148977 15792 185649 -152101 37154 -281836 -339118 -114063 -74665
18311 -74665 -100052 271452 160576 -253784 -40677 -36064 -233366 -233298 11614 -74610 -244259
18300 -244259 -268993 -405065 73513 -72556 95081 -73096 51565 82555 -203453 -66032 59488
18288 -56509 -151164 176791 -199478 -68042 276000 193678 367094 -390612 -128204 -60646
18277 6492 111888 -34470 -84554 166259 56891 -68810 78200 -334904 -185210 -42045 100511
18265 56842 87505 -152607 -10549 101078 -121972 -128356 -203710 -151537 -261761 -53663 -152768
18254 -152768 -322518 -107382 31279 -109759 28964 -157636 -345135 -132900 -2188 -155393
18244 -155393 -138105 102291 49236 135066 56244 479159 -54638 49719 105747 -55530 -57026
18233 -57026 -447195 14543 -131618 144993 -115367 -163331 116572 106798 149372 252525 -301391
18221 -85593 21393 -283231 23091 24276 168772 105321 213428 -144268 152492 -8849 -8573
18210 -8573 99685 -330194 -127368 -308863 -34662 149046 -3322 -529842 35554 -148242 -131248
18199 -131248 146936 -25839 77069 -3467 -352648 -42270 -322644 -252833 -224923 68652 -178589
18187 9159 -153347 -67831 -122510 -178345 39395 -139808 13057 120301 -143246 188189 -381941
18175 -224525 257083 237530 -352837 -155197 118145 -75418 107468 -52045 -186777 -389680
18165 -389680 -16041 71987 99721 -67577 -31744 22317 128089 -22186 105870 -1758 105420
18153 3354 -50209 246660 -149672 213937 193602 -160065 210763 -28554 210066 -175932
18142 95511 -153915 276965 -295043 -142059 -5424 108270 115100 -363277 -223998 -196936 -194963
18131 -194963 -156548 185850 -220907 24975 5073 -44356 -200420 107652 -179622 34532 -254337
18119 -163744 -311364 -30262 -257135 129456 -161012 23174 56957 210886 -54424 -256513
18109 -256513 61828 7267 187602 40265 -349168 -106298 39221 -21825 -120321 50687 173715
18098 173715 48972 13960 -68576 -182062 -70336 324361 -9204 39730 94951 -79694 -182224
18087 -182224 -141516 -103735 -291154 -369019 -103843 -123440 -35215 393273 -143063 123008
18076 -154991 9244 319701 81255 123359 -66629 133790 -73267 126302 107739 -51915 -128296
18065 -128296 -204945 387355 -117123 155463 -4215 10646 89157 -151392 -24216 175623 -169691
18053 -145765 39355 -320897 212718 -191123 140146 143875 7345 -211792 10696 72732 139608
18042 139608 344422 -54303 -77155 -5261 -95027 -172664 285806 86449 24200 143395 -308553
18030 -318417 -85455 -55276 -340904 -50633 -57836 198737 -192306 111503 269817 -83712 -176354
18019 -176354 -20616 -151828 -223543 -60148 82589 -13696 214998 348132 83449 -91785 -245407
18008 -245407 22769 -85440 205540 -98657 -53809 -106529 111552 -66873 229014 -78752 91431
17996 75085 -47261 -196546 191436 -120658 -90798 -145179 348191 -474576 -118134 196295
17985 323687 -93537 3135 -125327 -21769 -56517 309626 -187908 -248191 77001 -238406 -211384
17974 -211384 -105585 15515 -296433 53948 88020 -212787 -224894 86938 -24159 -37636 108917
17962 -91332 139650 144994 266242 -238933 115112 -52412 -248915 212768 65746 81075 -27026
17950 -62218 -89084 -266016 -233868 -149420 57905 386981 -142113 -409285 -72922 153381 -234475
17938 -89562 68734 45621 -24651 37450 305058 -172710 -73439 96821 -274707 -382505 -196299
17927 -196299 -200221 -66786 36746 -116447 52422 -139475 154316 -331251 65548 -1510 -45860
17916 -45860 -293595 -59089 -245990 63409 -68812 109791 -96496 308670 108194 144064 -61727
17904 57043 3592 58933 -275349 -147953 92961 -9877 351777 349599 -27566 -346087 -194260
17893 -194260 -168563 -74122 -370642 -49756 16068 128482 -162792 102748 -231856 193539
17882 179326 -123879 63026 134482 -109036 -56138 339230 18096 -67105 95587 -5435 -198526
17871 -198526 -102206 -185360 1214 203384 288667 157436 -165433 -23748 -304191 52012 -263145
17859 -8358 -8234 -218924 -85261 155285 26565 14231 27099 -86859 57559 131065 -101028 17818
17846 160839 -45295 -240155 -220827 30650 -69643 -160991 -50622 -133451 -174610 77536 -9865
17834 -112083 -343849 136607 124461 75715 125591 -155730 -217768 118840 -17324 261255
17823 108293 33878 162673 -317897 -263905 131265 -38031 255196 151988 148370 -139714
17812 -276745 109198 38142 11247 382945 64583 120692 62712 55678 140995 -145727 180401
17800 9624 -71581 -282563 22974 -64890 72095 -129605 -205399 -174555 -174796 6121 -168722 -266743
17788 -266743 178142 -53769 -139549 58034 -196023 -57195 114697 -16382 -103436 80278 -90450
17776 -13891 -137470 74295 7742 -362663 -75196 -159848 -317123 -68439 -45319 -39528 195583
17764 -225525 -103364 147435 -31529 20136 157172 -67825 -96443 1127 17857 32488 53496
17753 53496 70104 195106 43570 -16334 -25877 -95963 173266 5777 -448548 108006 54323
17742 54323 70439 75150 184791 -42857 -66404 -11612 -206046 -118405 -83912 -149172 262708
17730 -33012 -98398 35694 48960 222028 -31576 210724 120021 -82768 -63580 57642 -436850
17718 154154 152305 190254 183423 84872 100548 10402 -60136 -46189 -59759 52957 -77809 -116205
17706 -116205 22714 -271749 -115374 89421 -63620 -200952 147315 -158013 -20426 44318
17695 538869 -273074 -619314 -7769 -210664 143925 145249 -135641 79900 -66820 126972 -291661
17683 -145399 -37634 102602 108177 -261153 -259831 -130877 -41565 109917 -310754 -173985 230827
17671 364893 -149645 -78387 158934 -176020 238616 69892 -123560 202635 -263022 14724
17660 6603 40900 9047 -190236 36961 -24101 72481 180082 109731 217980 -75714 155826
17648 220177 -78839 -328821 271723 16992 -208063 -59223 96977 -158069 266208 -79675
17637 12754 -175910 -133405 215431 61557 -137348 -29684 -62628 33095 381254 -333608 -43384
17625 64923 62811 -135403 64924 -139266 182090 -35704 218745 -28293 -106939 328479 67376
17613 -118093 -62516 72546 -222472 299320 82302 85854 -231203 62835 152714 -9663 46996
17601 -15307 105381 -211130 153949 266855 -134451 70254 238665 -76738 345570 4945
17590 -19755 -185835 -303300 52820 174736 -142371 -100575 83184 96115 92368 -8213 -124837
17579 -124837 279829 -89522 -190921 -143680 -1037 226782 -73762 -65203 -68520 -475706 238794
17567 63497 463678 208613 -36622 4192 142754 9304 10155 185949 133276 97212 87622 73460
17555 73460 212172 -178973 -65172 -27821 -140164 147124 -210817 404547 -17233 19217
17544 -188165 63703 381014 126350 119258 32913 94120 62779 29017 213023 145725 211370
17533 211370 -21993 -69819 -228512 -245217 288992 -242236 182706 -278684 -59646 30330
17522 -142760 -111500 54705 -151793 207748 159920 26809 81649 1414 -132526 -23067 86664
17510 87238 282701 84668 -93634 251782 -248463 124356 197051 -87836 143670 -80602 -126567
17499 -126567 543509 -58013 -11617 -79549 -126539 -224469 -272260 -813 16736 -108928 41243
17487 108867 88144 -208846 13177 118573 231195 -13243 412993 8818 5325 350546 132453
17475 124935 90205 87525 80679 166676 -2890 64631 199573 214159 48877 259071 179415 286688
17463 286688 218280 -278288 88268 168022 371280 67189 83739 261022 135384 246913
17453 246913 123574 -151523 -88549 43983 493859 165473 205576 185240 350989 61714
17442 327282 218476 284518 7394 -92038 133988 298314 -110871 220976 -57262 380597
17431 30849 283628 1569 583374 191464 15063 406808 308650 677164 -16555 333258 253240
17420 253240 280656 197595 213520 169919 330102 545853 54151 394407 315852 203263 -35085
17408 11975 350495 318076 -320279 44942 -9513 287078 213857 19805 233811 67080 -33332
17396 320889 29695 -100752 -30447 124350 -179585 426791 29021 107689 182657 179866 33641
17384 150319 234995 2752 240167 291293 34292 -2353 -249567 89774 65018 -39918 54874
17372 -26953 -42015 -218122 -46736 -119229 107502 28319 251734 -121701 -133831 16784 388826
17361 388826 250274 -273127 -76456 336005 -58066 164660 200692 212914 19351 266836
17351 266836 34355 158222 -12317 110259 207976 135875 -136964 213552 177659 60634 18790
17339 144807 -77230 -127897 334327 102225 394508 -218296 188608 -302141 -279867 -68882
17328 -166996 324825 107204 65757 130557 20587 92481 59046 72710 48378 192299 109959
17317 109959 337600 -87620 499960 -88849 157315 61592 21448 127706 460272 55534
17306 140022 130185 -79279 286255 -63654 124432 -167323 14755 258426 -144758 -126355 -124239
17295 -124239 -45359 26365 68761 -88175 32341 102983 359452 -15364 253882 135353 -56065
17283 187185 342597 289308 326848 30575 108132 -13431 233979 347513 -95356 168604 314258
17272 314258 221559 -52529 152546 163201 -117088 -262121 425956 501332 130754 51732
17261 127146 177282 336882 78219 565953 24759 -103262 97850 246682 99246 111019 210884
17250 210884 87231 338617 314687 246446 65450 396711 218644 529786 445652 -88701 142022
17238 27090 197736 152427 144188 261540 205333 229240 -52530 -106016 -49908 197683 172629
17227 172629 313994 68133 247260 112707 81646 -104303 105636 224694 203294 -25279
17216 202853 -269543 -44876 165884 -163948 209541 195681 53121 285344 131077 183349
17206 183349 77571 198719 371003 606439 257901 107063 326405 508473 289197 433127
17196 433127 143412 40142 -148229 257719 405129 306667 115491 240730 54432 278897
17186 278897 134980 251505 175501 113068 8431 57278 98450 102186 61499 248577 458120
17175 458120 321025 417499 256882 368115 157650 199558 168527 354579 221385 52595
17164 340043 313008 161902 140041 333052 349720 -37610 341539 94714 179243 516573 139470
17152 281319 404204 168081 224245 254541 387494 387632 100654 169034 494247 59171 -15891
17140 218762 309266 294001 158661 101074 223940 402682 467807 453694 573930 357977
17130 357977 314944 473755 63270 75411 375934 173182 474054 473476 401149 41285 7469
17118 333126 524754 285791 409086 282673 247646 326113 312683 332837 345141 381496 234590
17107 234590 360632 104265 200644 454169 349913 322195 595434 318432 329496 247470
17097 247470 480749 133936 526814 465413 286537 410903 392717 154397 529202 381131
17087 381131 504483 356686 439561 151760 468443 652232 398624 699116 411192 41040
17076 254163 337691 450004 181188 310292 236187 365934 438073 334992 451325 449776
17066 449776 225579 396689 350146 573529 633491 434890 227268 198205 393493 601429
17056 601429 585621 739480 308029 452132 563811 391656 348884 484836 449214 440941
17046 440941 655569 264739 526423 245865 456539 326020 567624 437038 683661 654550
17036 654550 353787 761544 493134 446393 349878 458182 391553 588194 585695 200270
17025 631383 447193 190349 330916 474887 564814 475833 599784 288409 713714 382284
17015 382284 326289 855757 343718 500300 534301 632411 324568 470826 478711 536007 604206
17004 604206 700926 655486 401327 538541 411811 765446 624569 587575 753016 1146815
16994 1146815 811501 649405 1014392 476575 485243 913099 630305 854857 642398 631621
16984 631621 843148 703236 601934 713083 1051062 852137 558907 328369 715882 737555
16974 737555 556931 783800 775595 847889 465998 691330 572897 863385 1027106 982957
16964 982957 605316 1057588 795482 929144 835690 685446 805428 968503 750542 1206823
16954 1206823 859833 829158 933355 1035889 1157468 917284 834773 1363372 1189038 862247
16944 862247 913992 1077916 908330 992112 1015009 1155321 1057735 1136732 1336468 842856
16934 842856 1095663 1354628 962504 980914 1059451 840020 1266969 987636 1272047 1494460
16924 1494460 1271629 1125406 1218420 1172962 1075366 1564631 1358249 1070207 1607139 1370523
16914 1370523 1254441 1339502 1321259 1103875 1537641 1288137 1471139 1462326 1340459 1155820
16904 1155820 1427086 1378846 1588878 1282908 1513832 1471091 1517001 1561456 1765439 2075680
16894 2075680 1880546 1534740 1671766 1688054 1652010 1680223 1848105 1614317 1989963 1573051
16884 1573051 1907840 2018051 1768192 1964131 2051883 2001820 2125584 2000839 1926441 2075959
16874 2075959 2099541 2086883 2126450 2514570 2111814 2225926 2402881 2003520 2456410 2263402
16864 2263402 2435794 2385802 2552184 2688828 2515071 2560810 2491103 2470578 2560682 2590087
16854 2590087 3138553 2915781 2869841 2620206 3027320 2937339 2959323 2882269 3098260 3122163
16844 3122163 3133868 3265236 3409290 3523260 3411643 3552530 3575134 3661042 3540469 3828764
16834 3828764 3771873 3892717 3803814 3589691 3918979 4228772 4340897 4220350 4514358 4521664
16824 4521664 4054182 4694453 4627313 4522787 4782554 4818833 4943535 5258698 5568059 5052862
16814 5052862 5449075 5665401 5427960 5650443 5916796 6026990 6110049 6250649 6508701 6500835
16804 6500835 6456068 6929187 6692241 6998982 7351322 7461393 7681754 7586163 7729860 8157876
16794 8157876 8271041 8914107 8564349 9331362 9425095 9605255 9456902 10168354 10325122 10432813
16784 10432813 10486960 11139421 11604706 11922066 12301362 12636710 12686069 13083949 13600627 14296575
16774 14296575 14449208 14750904 15592830 15772531 16380444 16753424 17571331 18358444 18922863
16765 18922863 19192278 20184180 20826138 21435930 22850554 23708463 24249063 25495592 26460761
16756 26460761 27736234 28579318 29985778 31539459 32636368 33926365 35893737 37592804
16748 37592804 39415508 41487483 43403541 45401807 47820760 50301695 53186813 56011639
16740 56011639 58956338 62349487 65848766 69258879 73366506 78007237 82596671 87656454
16732 87656454 92833971 98289643 104239366 110158003 116608116 123434982 130555894 137680651
16724 137680651 144261131 151790881 158510137 164646162 170643220 176014706 180455057 183604322
16716 183604322 186184814 187099189 187180729 185755974 183204179 179920078 175389077 170024405
16708 170024405 163831507 157332589 150273305 143319839 136357096 129037179 122125222 115429844
16700 115429844 109288638 102791896 96719462 91533138 86032178 81266414 76413498 71710261
16692 71710261 68091573 64296335 60497439 57353965 54303916 51577448 48919026 46636467
16684 46636467 43898551 41802795 39531550 37815990 36426486 34264278 32787964 31257535
16676 31257535 29733625 28514291 27553596 26663015 25350849 24311844 23747773 22514148
16668 22514148 21626681 20712113 19988851 19109681 18394265 18095354 17297712 16497773 16025023
16659 16025023 15604653 15084700 14552494 14274780 13562555 13397791 12825498 12271019 11857695
16650 11857695 11744880 11429517 11059459 10727498 10482049 10180553 9850664 9358102 9578611
16641 9578611 8954224 8717166 8628384 8242531 8157959 7714387 7813965 7826435 7114872 7591569
16631 7591569 7229895 6823191 6894332 6724603 6427197 6378936 6242258 6198003 5580775 5945972
16621 5945972 5553686 5457353 5465903 5536096 5134220 5137687 4831365 4789352 4771710 4698343 4916479
16610 4916479 4649176 4237452 4360851 4199124 4372892 4135213 4230737 4129096 3932642 4022323
16600 4022323 3890890 3878828 3485434 3604596 3349006 3240778 3360208 3133431 3495397 3433822
16590 3433822 3209601 3228148 3246983 3053047 2899990 2769738 2764398 2957951 2915944 2886206
16580 2886206 2982913 2230314 2660253 2927381 2875141 2247545 2131846 2551730 2401474 2037873
16570 2037873 2163620 2039825 2171004 2209950 2184652 1955254 2084437 1843277 1801321 1767449
16560 1767449 2349820 1843379 2022049 1865706 2014335 1991674 1708820 1879913 1448233 1825597
16550 1825597 1701730 1681446 1779072 2176238 1500725 1455786 1714466 1689557 1469845 1668062
16540 1668062 1277791 1452083 1416550 1405452 1557175 1480543 1791376 1531773 1313613 1513323
16530 1513323 1488691 1250855 1471608 1411428 1475682 1229214 1100203 1525060 1508785 1152240
16520 1152240 1539688 1139221 1140280 1034993 1186451 1435435 1301988 1254016 1049310 1239954
16510 1239954 1058342 1392924 874503 1021721 1195954 956673 1102214 1147271 1131370 1109855
16500 1109855 1242630 1130188 929217 916178 998857 1122433 1049318 811647 1038374 802471
16490 802471 1172386 860804 1105021 1041666 1102109 675304 1016243 858600 670037 959129
16480 959129 810789 872351 395873 645676 680381 705581 786361 722824 698545 732909 538134
16469 538134 1012985 563925 502602 762636 952172 681073 1027729 481468 477558 517432
16459 517432 628178 805610 826941 565576 604496 578979 475920 471496 537295 348573 781823
16448 781823 805290 559011 619007 200934 490831 414096 662384 524804 407395 725352
16438 725352 765692 517898 688256 683939 357223 393262 859338 549756 572225 931544
16428 931544 869925 621800 678925 423275 250123 563304 427254 813803 396263 312516
16418 312516 457627 772779 741803 590038 484652 527662 197438 556392 723613 212859
16407 327223 634292 196601 594506 634710 433088 415080 470500 722114 73678 312167
16397 312167 410352 353251 234309 246678 -21012 289845 553687 517192 248421 533830
16387 533830 287522 417344 31937 -90973 375844 896769 569504 289446 596106 364722
16377 364722 252264 411513 500217 519826 361905 194803 191786 174112 680606 237599
16366 276937 9942 186706 653914 701191 239657 307644 650128 660766 359158 527042
16356 527042 411238 324976 323236 326209 211035 369795 301964 140016 166992 156465 60477
16344 415470 378894 -122600 296495 139438 28264 307694 496255 589065 148957 40887
16333 364438 427069 177774 126236 139655 88689 163769 215042 402598 307219 302000 226164
16322 226164 233213 311913 205282 434020 134025 409480 349441 450392 235867 295917
16312 295917 166403 162271 510225 128277 228217 258776 223261 100770 -113199 268725
16301 235401 457142 467631 270781 299237 -69540 240391 -114158 439895 29770 448373
16291 448373 42084 22266 -39918 154319 180146 151356 168141 264054 92712 30739 285242
16280 285242 153307 251215 -182647 44085 536314 154096 -40524 177087 -55688 291283
16269 124133 214873 127750 375768 388935 245108 102310 236256 402294 213068 436054
16259 436054 386552 134010 511803 283997 330836 -8908 381078 169189 329654 242849
16249 242849 -192710 158712 -268042 372482 147189 287083 42434 356463 208960 70299
16238 167708 146727 -426270 471 -143093 -27091 423390 -72741 68235 159698 241112 15206
16226 145201 -7127 67074 139913 -84239 -36708 202135 350302 182450 135639 -95015 368390
16214 -2504 -162307 -77908 -34930 -226298 247057 186933 256968 85126 -120184 37439 22771
16203 22771 -134901 53248 65280 -55831 16715 -96121 -20205 156188 -235348 -35024 54651
16191 125495 -14182 -146580 227179 129195 298052 -115591 -112412 -202360 -64704 326346 328016
16180 328016 -5048 -144864 -63164 303360 -27749 289723 82521 -65087 418982 -78733 341793
16168 -19074 229466 -7511 24300 214204 361282 -24484 -35870 235719 155784 38070 -82321
16156 180096 28752 168052 -151389 16933 128581 -47752 300593 -74971 -122840 -132526 -13371
16144 -16131 13362 -293411 223283 345723 115769 -172885 -80865 98098 -158478 -161799 -37103
16132 175994 401714 22512 164679 65073 41811 16629 -11612 -4520 276938 -370775 173218
16120 8260 143513 -24516 13836 12108 45592 78634 -11466 277638 -220759 2756 -61105 167376
16107 -181118 216743 -219064 -32475 -681 125705 37757 -53456 6200 348851 426986 -233550
16095 273650 146058 202121 -136843 -97507 3645 -160726 -145785 113220 44812 364217 -141868
16083 -302188 367400 124336 -238746 213776 -94446 -156739 136251 46731 41975 56281 -219927
16071 -36155 -17818 10649 -39901 21156 129517 17026 407982 148478 341059 -355464 -115216
16059 -16682 -171398 81436 -135401 13209 -208306 -170227 88398 -84097 -41448 254706 -254732
16047 385945 31337 169912 44315 203904 -2426 315986 -97757 -336204 -64506 158732 149056
16036 149056 -49084 -301271 137935 -131883 -24401 56994 21068 230256 21017 -94061 200337
16024 -71110 155719 -102867 -94350 295032 31446 122199 84275 93277 72563 -39547 156527
16012 -62739 356722 90034 -14427 32701 -109652 -263811 23934 75007 40423 12048 288753
16001 288753 -297395 138609 -81345 -111733 188970 -392166 -209084 -106022 98242 110067
15991 110067 145668 35831 -47851 -22422 69818 -377209 -77603 53947 120819 28826 382111
15980 382111 153586 15514 -50474 -75246 118997 -142869 152541 -103419 -48747 143163
15969 117766 -3732 -37194 -71923 230349 -174432 61154 80615 63009 -77687 -354545 278328
15957 -300176 -130080 -9578 -155015 -248300 202964 -127823 10055 195906 -249895 -453099
15947 -453099 -179561 -7828 -259302 116379 88013 -166818 -333677 -265822 -168106 56719 -111174
15935 -129882 6933 -233146 147659 105932 474593 -156630 -132889 -33092 -261230 354223
15924 17048 168573 -210964 -84150 -3184 -65000 141 -421771 56278 11931 -397092 132682
15912 -143985 -173814 -370998 -145488 173659 -301297 75799 52276 68262 -319660 -289245
15902 -289245 -84890 -181987 -22050 202801 -101579 7485 -76177 18405 -14492 -198054 155324
15890 248668 -191033 171735 -23858 -194167 -17302 -23355 -150687 202906 -186843 -83968
15879 -99344 -63493 219196 -44339 177989 -150920 36102 325850 224213 230518 -199903 65526
15867 -555823 -197222 -290805 -462103 -127082 122520 146210 196150 -274669 85072 -67055
15856 -313792 62053 160660 1511 709 218613 65112 204521 128486 86502 -334881 -19746
15844 126903 -91347 -274454 32565 -121515 -154989 89850 277083 -131841 -61936 -232891
15834 -232891 -220274 -140771 93550 -197841 146821 152262 -159059 -74225 80582 77381 250667
15823 250667 -82355 84208 42686 -308301 -12513 -181791 322430 247235 -189832 -37069 -177618
15812 -177618 -47987 -44108 -182690 -225898 7628 -117599 7018 -18119 25102 -26739 -131657
15801 -131657 30197 -89309 -157590 -106483 75215 140428 37505 89567 -198515 57715 150193
15790 150193 283915 -46636 -109211 -144373 65346 -251946 -108157 87137 -137970 106986
15779 -76602 -99460 -506937 313956 -174142 12251 35324 -29724 -72476 -218153 326570 139464
15767 -34502 89542 209775 -160811 166200 -54546 -30437 -13027 305812 -13577 -153450 103570
15755 -134748 65550 81098 -278177 60156 -123851 -128500 205892 -65548 79306 -74976 36562
15743 74979 226046 20813 36349 -95434 138705 3859 313644 -100510 169551 143302 12556
15731 244932 -214515 169962 -31442 1377 126032 -131490 -115810 -124505 -40648 -31585 -359761
15720 -359761 113657 143828 -256765 7393 71020 247135 136258 -8799 -152004 53849 -43504
15708 311692 53416 -252391 71981 -45621 -75891 -57449 292569 -394193 -44620 -296956 253178
15696 -263467 -144679 -161876 -163389 4477 -9129 -32287 70127 -87273 101736 16543 -8886 -284784
15684 -284784 -263751 -31575 31473 -68395 216835 -44193 -142224 49373 -261989 127625 116212
15673 116212 391475 -132712 119235 100095 222963 124360 157634 -269852 111604 -53956
15662 6254 89819 -10064 -102194 -30850 16025 30614 -181479 -72255 145597 89798 -121377
15650 -200316 131166 -22705 -165621 186432 -160164 -127594 -40728 39334 -22778 306018
15639 50668 -314990 -164588 -115459 -81047 150069 188544 -335562 89513 -112944 -174231 1425
15627 -276961 109452 -51995 -237699 -202166 541791 164394 66181 -128513 55976 140655
15617 140655 142351 258644 -200540 -36442 186153 89880 78587 -77446 65576 178200 -377183
15605 -352701 -19638 -321580 70724 -14434 -485448 126981 90837 -64434 -160007 95478 -82695
15593 -111534 -381842 -281505 17650 95529 -280828 29598 108145 8134 243556 -226400 49231
15581 -74536 -181812 66875 13286 -192662 -42214 -68474 73241 1035 -150104 53735 -314826
15569 -228375 299189 -44539 -153487 387672 3761 -5079 -129079 299801 -279504 321283
15558 98113 -287604 40304 122892 -145356 -58927 -202405 -6531 132725 -147962 287811 -274812
15546 186241 -246876 148759 154427 -311563 -158520 174252 45573 134099 -90601 -222807
15536 -222807 289555 12532 60356 -50877 -109777 -209463 -207621 131471 -458054 -197184 -343396
15525 -343396 -181199 11308 143557 303922 -191639 16292 -254199 -3713 -91009 -73015 32020
15513 -10204 185658 25679 13741 293899 -216139 203574 -89183 -204400 38981 -33082 172444
15501 -304268 -235760 -73167 -126053 -167041 283528 -420404 275168 -205890 109296 -84304
15490 162580 -145370 -364873 346936 60895 -291188 167378 -211156 172807 -62056 -67422
15480 -67422 -97476 -197236 -157203 -203160 252364 -222982 -135506 218268 38314 -149911 29827
15468 -311308 -46623 47772 135671 -249893 15379 192083 205898 -351367 -315686 -341373 -260159
15457 -260159 -69767 201899 -106192 55441 37497 61325 -4117 95015 100859 -28689 356441
15445 -163776 -443332 -3641 306269 -31544 -196578 105197 154024 -127285 103357 111322 238755
15434 238755 7232 -83886 -34719 135055 -314481 47935 -4626 9243 132285 63962 216504
15423 216504 73448 295749 -4058 9651 -98341 169327 344959 -210873 -190816 -179114 -122336
15412 -122336 104103 -27298 -83239 38120 -378725 28139 163434 -163998 -204759 250264
15401 269275 -197911 -166928 -191523 16507 95312 224861 115371 -152101 136439 323820
15391 323820 -276766 35698 -121904 132049 179518 -118168 211997 -30234 103460 315406
15381 315406 148978 -486315 146030 243318 -89840 112296 -50241 -54050 1968 -26421 -248344
15370 -248344 -9224 -328330 -165129 -178871 -72417 108141 160500 -211588 -239429 -244976 -243900
15359 -243900 -175724 98973 -169757 -103572 -272079 -96506 18627 -48725 364315 22919 -357604
15347 -11089 -154446 52930 158287 -19266 -156330 -145808 20189 -12910 255546 -19021 65700
15335 -163274 100286 117313 164415 78092 96980 -281117 94016 29845 -180356 -48218 18230
15323 46796 121193 84579 196497 -360552 -452742 15299 12959 -16963 -190586 -194973 119072
15311 -63798 -129684 328751 -61755 -76555 -161303 -26207 111460 -130571 -224638 22411 -14946
15299 -50176 104527 -103970 171867 -51029 67819 89082 242158 10551 -164165 -46256 -206689
15288 -206689 10186 -39983 -28690 -84334 22144 341125 -121749 130984 250007 37084 -155099
15276 171926 82668 -192612 179564 -34711 -90102 184424 -8642 -32300 -74253 276004 -1782
15264 38675 151425 -354420 -66145 -37251 -152323 99050 45751 170551 3501 133720 371064
15253 371064 -44830 124962 87611 334307 1069311 1606560 1440970 1102967 1402080 842411
15243 842411 529622 -176800 222909 27788 73055 106509 174255 286835 176686 223864
15233 223864 156768 140182 112296 -32825 -54509 94285 93010 -136454 77713 137035 264442
15222 264442 -10733 -54262 -150815 55360 147024 -214472 -25428 -287686 -58580 -2734 -370188
15211 -370188 140732 20647 -134595 -77895 146893 125190 -230493 -34484 -68655 -130386 6377
15199 -302531 -86629 -8161 361338 71883 1797 230308 -79252 250074 -51136 -201703 235144
15187 72782 139135 -102431 116819 228110 -33846 -268767 39002 149373 53608 -327185
15176 97 -119981 -37458 153817 -58056 -106003 2210 -65226 385379 274671 26453 149735
15165 149735 -94496 112845 -149769 229826 -32021 187312 -9357 219506 2983 58828 156287
15154 156287 -329381 110596 138151 -70351 49003 185960 143997 94375 25836 -273753 226305
15142 -80204 137902 -18766 386051 113904 166043 92850 38524 -122959 -263885 204005
15131 353619 -202824 238942 411559 27552 -194573 -224156 260809 -79378 225009 336915
15121 336915 -118690 44069 -71741 111073 213143 452781 133123 -158853 146042 157527
15111 157527 113014 -241532 38312 -63399 106288 398179 -19104 182652 -325267 322854
15100 182152 321054 70532 308353 -146256 244413 504503 -146149 -5042 62204 191767
15090 191767 297811 268429 -22491 -26040 88598 71366 218370 -23227 69955 -34385 178937
15078 89779 74689 545822 37734 78030 32046 267633 -67666 152153 175170 149909 352444
15067 352444 320820 -74864 85526 44982 266653 55049 -404962 321474 473874 187047
15056 329752 328318 184197 195032 82846 -115616 38562 159133 367738 -158477 276498
15045 275368 240054 -101354 208889 277914 64265 -9311 70321 261754 195413 -155773 98701
15033 386423 380114 231442 343217 125517 134798 -63229 255801 137427 -77459 -47967 321152
15021 21722 157009 77428 -184257 138014 271678 447027 452998 84076 -246746 172664
15010 157821 -119355 159170 -111099 26858 275677 288074 -41026 -80038 170914 268858
15000 268858 -185255 444834 -20749 227179 212018 494975 338506 161017 313404 142815
14989 290878 31315 324611 557920 103643 74834 70079 548334 268358 124185 149654
14979 149654 294273 295324 -67140 261580 110605 46032 188274 224048 68280 -75308 193047
14967 339527 79646 97664 306779 -36591 366133 273749 -140730 415517 109509 81865
14957 81865 -43276 253951 -59202 67204 211000 312624 132343 -163442 251811 -3180 -21077
14946 -21077 153840 285913 350122 91068 115722 328838 293477 149529 -51977 225320 403704
14935 403704 129644 29401 217911 182509 283027 -21271 371069 177692 333814 154712
14924 191022 272406 -70849 246269 38190 78794 167862 174085 43850 419727 11440 372338
14913 372338 258873 414991 -9772 206723 330021 183028 238225 214421 -89854 356714
14902 80375 -261279 308385 617991 450954 -2764 103804 134348 182455 422123 84148 368173
14891 368173 229616 340030 194348 509131 331835 360865 266563 364056 442738 356673
14881 356673 285252 258124 118641 482769 526051 335824 405361 166774 353957 360060 346024
14870 346024 174649 256909 517616 326817 560304 348490 410137 254961 219274 287008
14860 287008 309704 59060 177275 64215 615118 323886 231203 298983 322753 562771 517332
14849 517332 350092 517310 358488 403606 208868 345779 426111 392352 136954 481622
14839 481622 223903 624227 91373 170611 394860 472026 269888 531231 242144 548986
14829 548986 440840 530426 408002 970541 467433 512663 536560 388700 383141 344313 304211
14818 304211 257113 220777 437032 590066 653905 137975 220087 460530 260166 360211
14808 360211 707085 719384 517738 671667 404550 728623 105345 223808 312340 815589
14798 815589 508964 204578 386786 652528 572511 631003 393403 455119 462959 446737 832234
14787 832234 127390 69457 275318 524493 732000 398570 228894 378317 234014 424645
14777 424645 595194 459065 269928 437694 507916 519568 813249 651128 705888 744109
14767 744109 365739 216549 438684 464797 347595 275798 649733 230243 735513 752697
14757 752697 496010 509023 438261 432117 269204 394522 531834 665001 828260 288053
14746 712730 593034 512166 290357 644825 168381 737257 781201 749161 740303 369838
14735 623415 497350 826998 756919 488394 679963 555012 556451 912564 682318 508102
14725 508102 638124 687175 601562 851740 850650 774318 545537 593084 637200 562285 747743
14714 747743 747538 309545 607296 577681 526811 818961 796057 502246 599931 749351 824501
14703 824501 936821 529678 864402 518469 861214 861013 752813 791673 721806 768400 1009495
14692 1009495 642455 805732 922313 659088 607359 588949 580543 547967 819873 723859
14682 723859 1062945 693621 912541 716256 868434 845517 668051 477376 916164 841730
14672 841730 1116449 983880 456143 512462 871794 943614 876971 850292 889527 890860 952190
14661 952190 965037 1017030 946179 982591 1093479 1017213 973630 779092 1005843 885243 943526
14650 943526 1028866 676245 925564 1071628 1019663 791697 1170404 942105 999962 1315723
14640 1315723 795071 868223 1121293 878746 1011820 892619 1214294 1206997 1051349 1156297
14630 1156297 996775 1276001 1232460 1201628 1285299 1523101 1119009 1409311 1293092 802102
14620 802102 1508374 1359530 1327234 1480457 1430673 984632 1254730 1543581 1069247 1345337
14610 1345337 1404260 1497461 1542540 1087078 1260862 1474553 1403738 1372862 1051249 1366941
14600 1366941 1362877 1543639 1426094 1713830 1930767 1491634 1690947 1528703 1319701 1644253
14590 1644253 1428845 1485515 1656734 1668472 1760722 1737581 1798724 1723910 1858611 1766732 1541507
14579 1541507 2014114 1908697 1752170 1799502 2078236 2138937 2209922 1891914 1943811 2173060
14569 2173060 1984323 1748606 2319464 2134863 2047756 2267350 1916472 2515556 2005041 2547015
14559 2547015 2567220 2716602 2641254 2523177 2736494 2917645 3661063 3466544 4091766 5104131
14549 5104131 6642614 10310112 17703846 30711810 44455430 30304582 11953013 4865597
14540 2991794 2192572 2013063 1869043 2006305 1971405 1793802 1973965 2081234 1880105 1410536
14530 1410536 2063735 2061248 2160469 1993187 1924285 1792446 2037740 2073383 2078788 2060505 2275991
14519 2275991 2337201 2180859 2349223 2376592 2345614 2421663 2468181 2191094 2359869 2567138
14509 2567138 2637111 2906265 2600699 2511936 2325161 2578150 2442442 3127340 2607313 2559926
14499 2559926 2648141 2685481 3111534 2904082 2759426 3026565 2906525 3284944 2996793 3323898
14489 3323898 2756213 3315059 3167820 3036126 3206180 3516733 3141570 3407898 3211998
14480 3211998 3767921 3886179 3530032 3580621 3313290 3310624 3543916 3689516 3618121 3670810
14470 3670810 3769016 3924075 3893841 4148244 3799864 4401498 4049262 4496262 4399825 4415046
14460 4415046 4289014 4361721 4536513 4250760 4418924 4657133 4637172 4973010 4772487 5007278
14450 5007278 4880466 5232423 4869798 5082542 4998275 5104461 5591944 5248186 5396734 5455162
14440 5455162 5528006 5725290 5625409 5829555 5887959 5796091 5698197 5920313 6175924 6242889
14430 6242889 6495343 6616789 6383453 6717171 6243272 6788075 6646192 6990924 6706153
14421 6706153 7246235 7256084 7512341 7417611 7487801 7762056 7797940 7664764 7893185 7963689
14411 7963689 7816074 8395607 8544904 8445707 8559889 8647425 8929589 9014264 8883518 9115267
14401 9115267 9505291 9782327 9702411 9700933 9937914 9886793 10150444 10452072 10586025 10610938
14391 10610938 11002422 10993917 11292464 11343325 11866885 11996078 12416836 12190511 12488331 12752877
14381 12752877 12747527 13140615 13641783 13731147 13907254 14037042 14580908 15017240 15119725 15545771
14371 15545771 15752966 16269340 16654230 16893014 17383645 17786494 17958807 18484364 18917089
14362 18917089 19073344 19603062 20105750 20763628 20499662 21003456 21706057 22303127 22663688
14353 22663688 23426956 24100797 24167462 24681083 25645823 25916117 26811714 27558998 28122412
14344 28122412 28793486 29743237 30556806 31246119 32195989 32929774 33974471 34815928 36235642
14335 36235642 36598309 37737049 38977965 40078869 41286921 42815273 43958175 45605844
14327 45605844 46722313 48565471 50022551 51911632 53509384 55123752 57303566 59244277
14319 59244277 61058969 63862381 65956579 68460231 71204875 73983111 76621319 79952085
14311 79952085 83133690 86472448 90213200 93997008 98045653 102777703 106959348 111743362
14303 111743362 117366720 122344191 128452393 134841473 141176082 147985968 155825558 163853663
14295 163853663 172192805 181136472 190965291 201418699 211987509 223418153 235648324
14288 235648324 248545577 261737113 275735248 290394416 305713238 321575531 337844293
14281 337844293 354341539 371407627 387598545 403980423 419365519 433584991 447014678
14274 447014678 458531752 467159578 471596751 471293747 471033438 471705531 473746893 472576697
14266 472576697 467964371 459357482 448442802 436170110 421730309 406070411 389466669
14259 389466669 372595685 355686667 339029697 322346807 306865031 291754792 276699111
14252 276699111 262414874 248718269 235821185 223457882 212000092 200943163 190398828
14245 190398828 181121579 172007152 163918283 155463037 147963196 140767592 133966241 128235757
14237 128235757 122338837 117006047 111631647 106438959 102126313 97872076 94180630 90228995
14229 90228995 86463803 82878270 79594479 76564111 73332171 70790317 67848629 65823121
14221 65823121 63417045 61391915 59124233 56993122 54931919 53668163 51685289 50070524
14213 50070524 48839292 47206662 45615736 44168406 42912996 41542542 41206390 39996013
14205 39996013 38565942 37226357 36100093 35225008 34605642 33819062 32678406 31779713 30853467
14196 30853467 29991681 28923381 28382497 27664995 27052335 26177743 25644288 25015211 24785458
14187 24785458 23918418 23408827 23101160 22522320 21652267 21342412 20877283 20120880 19990033
14178 19990033 19347072 19240825 18883667 18192178 17826486 17418435 17520841 17122586 16582636
14169 16582636 16516809 16046514 15612054 15179016 15159056 15163384 14486494 14303993 14176989 13833245
14159 13833245 13341660 13498705 13484368 12921012 12747607 12808385 12482070 12211310 11877905 11682803
14149 11682803 11353629 11497967 11029279 10887955 11086676 10700564 10913534 10223573 10176931
14140 10176931 10328695 9610320 9630623 9527324 9541310 9448158 9278765 9092620 8840713 8373065
14130 8373065 8518594 8579561 8463043 8311078 8019063 7770114 7936863 7786649 7527679 7289623
14120 7289623 7184559 7130521 7236033 7149687 7012287 6833153 6631675 6977794 6578613 6774303
14110 6774303 6513071 6710431 6687728 6341807 6381505 5856384 6062557 5820334 6303357 6092378
14100 6092378 5660714 5873608 5816008 5362292 5977074 5608616 5191126 5465777 5425707 5035967
14090 5035967 4862929 5011929 5303673 4919692 4968114 4433433 4982177 4876866 5001580 4476725
14080 4476725 4542287 4737439 4588282 4781234 4665304 4677284 4307134 4527583 4454766 4307316
14070 4307316 4121743 4067982 4298909 3954511 4183585 3786594 4004090 4094811 3640361 3969443
14060 3969443 3888424 4048462 3924540 3882883 3657519 3594650 3705864 3697947 3454076 3266753
14050 3266753 3387565 3311638 3414443 3306263 3454520 3591700 2984045 3185615 3291417 3352896
14040 3352896 3163235 3378390 2841191 2983162 3154132 3084408 2816358 3004710 3158956 2843899
14030 2843899 2823273 3177001 2930976 2895634 2729632 2810741 2626803 2795693 2885627 2454031
14020 2454031 2473889 2413141 2789711 2677590 2722780 2469813 2540904 2264516 2289001 2007887
14010 2007887 2146848 2329366 2268207 2078853 2279728 2066186 2190965 2265464 2052803 2063872
14000 2063872 2179714 1717435 2085669 2041203 1716379 1974570 2298028 1870870 2233825 2260279
13990 2260279 2587824 3287292 5826282 12064719 24738941 41819709 33759164 16951673
13982 16951673 9437235 5975234 4811193 4099590 3813259 3483143 3266242 2917912 2702715
13973 2702715 2858509 2443652 2629835 2869865 2590500 2341675 2229998 2341564 2163339
13964 2163339 2065407 2411306 2336664 2139307 1968517 2256029 1810534 1773565 1928547 1811904
13954 1811904 1820787 1816839 1912206 1816751 2010123 1854281 2301222 1425773 1940358 1960889 1734948
13943 1734948 1898667 1975609 1565151 1381798 2012375 1895589 1731927 1648199 1345406 1810218
13933 1810218 1315392 1761140 1681751 1800041 1424625 1953486 1691024 1444172 1593287 1608932
13923 1608932 1339904 1472682 1604175 1622717 1468968 1390437 1372649 1580969 1072188 1268544
13913 1268544 1414345 1374276 1623153 1490672 1451001 1258166 1586416 1511648 1130777 1266059
13903 1266059 1416238 1555014 1591266 1115076 1381476 1417395 1518227 1154814 1214574 1108948
13893 1108948 1243810 1191449 1302323 929761 971090 1567150 1453679 1386593 1438508 961932
13883 961932 1335729 880352 1063483 879336 1130897 1046757 1379692 1171308 1170605 1061188
13873 1061188 1325195 1261606 853535 1123553 1112733 890865 1336728 923394 1094957 582639
13863 582639 960323 990557 873221 1091225 899480 1110634 813477 1039053 889019 1225446
13853 1225446 1082367 990842 890207 1562609 1014092 693138 1147044 1070573 538533 812967
13843 812967 1058855 1097227 1296759 998150 1374267 917357 909368 960742 1027564 1054830 1012320
13832 1012320 1065376 727149 795786 875539 940231 1131220 788267 973533 1147011 1292909
13822 1292909 987108 1009044 911396 824712 570807 1028219 498479 910181 1060813 666481
13812 666481 787861 796594 612914 519996 700441 954699 523403 686149 1119306 853066
13802 853066 752936 717245 983302 869474 641078 1067060 862624 544307 713835 540679
13792 540679 644729 592652 974847 852521 414238 490121 846431 960122 1158212 657883
13782 657883 666551 656160 1257743 669794 888607 773006 729647 559835 786399 673680
13772 673680 642771 771393 1050118 479303 999054 588947 580950 717070 888880 451048
13762 451048 706368 573245 941046 670164 535285 841347 630362 587192 521955 579358
13752 579358 560732 615607 788455 803166 490980 657378 785490 567573 629518 575621
13742 575621 529418 630445 844464 590770 233236 556137 461966 810238 888603 226272
13731 894696 536124 795179 384867 589377 411183 672533 227838 468095 886393 503531
13721 503531 729939 252923 336827 537994 395715 553532 569664 455263 610281 514381
13711 514381 370776 381775 512081 402622 457370 268450 327876 558172 117768 414217
13701 414217 569044 372489 311095 338554 557837 398194 805543 725762 516486 383067
13691 383067 316619 484895 520826 369020 319414 565243 390536 417218 550225 438824
13681 438824 1582 158539 621676 421895 847008 120693 260751 671736 693380 412846
13671 412846 532184 683900 759841 479951 600297 551155 472716 289833 558701 568391
13661 568391 452017 260929 602814 592351 274004 453935 445366 426475 590201 445425
13651 445425 315952 242563 406452 512550 437174 417926 490015 439561 285966 290617 727636
13640 727636 362001 298461 538036 248510 196143 498503 603528 263003 446519 476320
13630 476320 45181 597007 413732 414235 517404 608698 492457 316898 415958 172742 646083
13619 646083 463790 376910 642565 412186 621944 409587 339533 231290 270253 379834
13609 379834 33442 137847 420766 275230 291557 131623 437993 237282 4041 469097
13599 469097 427920 243664 436337 292405 350421 373805 503893 154343 388625 372566
13589 372566 369199 438141 539508 382204 410407 474542 479874 303464 360339 444422 572183
13578 572183 213621 563010 431879 316862 98820 403851 119076 95037 143270 223322
13568 223322 333820 304696 358509 566601 496974 616260 225962 521572 375135 369780
13558 369780 72901 560356 422198 258175 232263 273388 430758 386040 -78611 426262
13547 531225 292948 353633 481090 484755 223145 220291 300962 192272 224145 193373 331896
13536 331896 338639 352864 369735 108855 202738 501009 130102 317727 470763 367478
13526 367478 271271 331631 -146034 474023 458299 284366 249083 -64869 -60519 398247 272350
13515 272350 207336 213719 232976 213287 344612 -22126 349677 -69047 392144 536068 259563
13503 353476 409561 274441 322358 167467 266127 255359 243845 261547 493299 240072 259145
13492 259145 65816 262946 451148 495111 193590 307314 142740 180944 85998 370785
13482 370785 542049 328630 468608 195651 234502 98278 330950 -13792 300456 215557
13472 215557 16527 153743 -49652 394913 411448 196965 185491 -16500 67034 256160 80260
13460 37776 328289 518329 116293 164270 -40911 357762 197085 486044 30389 380827
13450 380827 205262 220971 135376 515763 172153 -31063 133390 91612 75808 -4827 249545
13438 352563 355680 521274 55658 91859 370236 123164 459771 240238 165846 389149
13428 389149 356618 212293 371581 288826 392682 -15592 -121028 -24114 309306 180284
13418 180284 -111629 223498 69077 320023 360857 167935 89555 143605 318990 546072
13408 546072 255877 495772 360515 234000 213365 393731 179441 -37149 114396 278854
13398 278854 507746 75974 430467 201571 205253 -29294 247888 227592 396939 299282 404582
13387 404582 -57347 -142221 394889 216541 491572 180830 249006 71342 -94583 383584
13376 147882 388303 378835 222246 199860 368590 -34936 297071 277268 256348 132512 188176
13365 188176 96836 -151741 192482 118467 106973 200750 250072 497162 245856 53120 312328
13354 312328 9065 55055 326360 230520 148609 63615 526796 13631 183572 434126 517370
13343 517370 107629 -41227 171622 284030 224793 430800 -25525 157933 377670 505068
13333 505068 378784 465035 60833 186871 75441 282821 81432 310021 211219 177320 362215
13322 362215 237463 223643 -143108 1466 35475 430670 38007 74129 245562 -48787 -16823
13310 37242 115536 52162 206113 549556 363615 112250 290754 117188 -4290 263054
13299 159139 278394 14735 -117924 14441 91270 46075 93813 16125 230844 -98977 70443
13287 -14523 20031 26994 94026 229007 173271 291347 306548 266040 363306 111267 402268
13276 402268 96755 113412 244234 -220515 -139850 440529 -24969 -137205 222410 186857
13266 186857 492427 70055 13581 224439 -18946 81415 245181 -78239 40865 554095 36685
13254 -106987 96358 125711 252600 271591 343151 102529 -39494 91172 -11138 22283 230462
13243 230462 -214375 365749 357458 147364 -14431 149201 65129 41720 4572 119735 213115
13232 213115 -35192 462912 124884 176266 227423 18859 -56015 -28247 -78274 264784 -131659
13220 -41878 259636 156933 295793 68176 -95988 88822 -119121 362817 212244 196793
13210 196793 -63762 -88134 136135 -99553 31318 22994 -40433 247576 299816 -175228 38962
13198 65852 11652 205137 109058 119605 354758 143100 140016 283841 164082 -70240 359146
13186 116952 12796 261680 55651 322775 313276 222465 2563 184394 -75751 293326 -437534
13174 -40199 54246 -13650 -5632 273851 476836 182998 258650 81966 -19183 141456 -54376
13162 -131898 33579 -76134 127450 181159 92283 300987 119662 -256030 5141 394606 17553
13150 27378 367220 170099 -106190 144244 114775 298805 163632 -216907 264665 444538
13140 444538 183346 32356 15776 94702 20100 160492 -134439 35303 -255999 84828 284156
13129 284156 -167744 203196 125684 229660 -125699 -249512 120336 68032 157723 -100213
13118 43272 130211 356417 308418 51083 112678 -281134 -47513 173933 -66289 -485617 349100
13106 110599 24953 212893 291030 104496 57109 -177409 -181179 54322 -75962 34681 113955
13095 113955 109697 230018 291396 29787 455405 481825 217373 -48223 160383 370230 143201
13083 75200 98390 -54695 418411 -420493 -247046 208915 -71313 -126241 -81423 -73138 319629
13071 -14698 105282 5583 293081 -34221 11804 95553 -145617 -14923 480701 2102 214400
13060 214400 409940 -89220 39023 -26841 -65750 -35405 165266 358562 110136 -178478
13049 82424 35329 112631 53053 1010 214632 76490 79744 87961 48030 48785 291704 -128261
13036 343396 -16462 367918 -120943 75960 104566 120186 -297595 -49604 -182033 268749
13025 74261 442296 101098 102131 145879 211058 270514 38530 181956 82567 25240 337375
13014 337375 -43902 -80603 295024 133609 -74270 115410 -40259 479034 167371 -195387
13003 -56381 161170 70032 -24614 -184324 218708 -80047 -60073 8302 -133392 8952 36315
12992 36315 -105594 382217 188113 -136275 16549 344959 -188923 -11926 -73674 102130
12981 249721 115544 -45179 171588 174781 -44428 307064 17410 33594 -7639 -286226 120162
12969 -71684 18734 12741 -99508 106383 207794 -190652 205877 -190015 -32687 43043 391369
12958 391369 264513 -67643 -213784 -83027 142986 4433 -139585 -11781 283218 156897
12948 156897 -223817 32879 -220502 -23837 170910 -47673 -156774 170090 -128014 94792
12937 -326630 68397 204707 69610 277474 -58774 66143 202025 -66782 -65687 280908 -110594
12925 354530 58662 46133 216024 -42112 163900 160698 248204 205756 -33779 -73696 167796
12913 16623 -240802 34291 128613 85194 -101861 187556 87070 -130274 -273426 371602
12902 40271 -49659 74524 193888 -59719 -4365 184972 -52976 47383 123649 362539 68573
12890 -116506 139933 -134174 193110 131650 6217 273590 -110445 85648 55639 56870 -36647
12878 225634 442172 -528707 -43378 -140386 34342 240903 402611 -21306 271906 51495
12867 116870 34759 247994 -15788 8166 12678 70080 137910 217403 135223 -81217 50936 10417
12854 -141631 -278053 266660 -114544 646237 25753 330568 171173 95340 -38487 -88217
12844 -88217 17499 -306566 269491 86585 90234 93979 55447 28232 57940 -78344 -43197 213337
12831 -75210 254704 -64059 -130373 -324209 -71381 -1922 -48423 -135307 157123 -100821 178602
12819 172106 -120749 262033 -92723 147432 52945 -178389 -385807 172389 178574 -21179
12808 13183 58047 -306821 133172 -52047 15387 134771 169393 221460 346109 -82253 408336
12796 -105740 -111489 -35817 210319 200539 -121236 572263 131222 59219 14513 -181607 -74070
12784 -161071 30531 446408 -57208 -16918 -75356 -186032 -48396 256830 5414 -29954 -151130
12773 -151130 149351 367114 297960 16492 100640 -253361 131051 -25577 204692 357046
12763 357046 -102927 -235186 12870 -65105 44249 -338826 131620 -71140 405423 185867
12752 -18467 147097 189286 -80682 425639 -175697 -84715 328993 178593 127822 86502 -68390
12740 269280 -50136 71695 -124174 -38171 -122033 31778 91663 400922 98357 121273 -155135
12728 191924 49064 -59219 9410 -172923 231391 -164743 167339 60234 63795 406027 351986
12717 351986 63729 -99679 -169357 4428 122282 -149749 -56291 85970 111930 209919 1772
12705 123866 123308 -90075 457219 156100 -94464 38748 350696 -262733 120154 -111690 296424
12693 -366775 -23387 -302113 113516 122301 -94920 101317 200074 54563 174035 -4478 175411
12681 229646 -78253 456725 56782 371665 409150 74774 -48140 76804 -32990 185986 -110567
12669 53410 100382 -39876 142323 202540 10950 122167 -151233 124954 -62689 236059 -15480
12657 127040 -139678 -4597 144491 -127559 255484 19851 93012 72782 39658 -75470 -54120
12646 -54120 161024 -38350 -11414 -305939 -167429 -90580 -88759 -81885 -23920 -40663 178765
12634 -43187 -138931 20538 158364 -17493 61221 84976 368700 19896 170048 -260960 249148
12622 24341 147622 115481 13146 324362 -51354 215009 124557 253992 88808 -290232 -124703
12610 75747 -67877 46541 203542 20466 59318 -157571 200182 152785 381348 376105 247069
12599 247069 199735 248228 174729 -146612 108109 33358 -180793 -60981 66513 -15440 229823
12587 -32634 -127442 -47162 26915 -51761 207745 -47894 319714 89789 -267782 -123370 45732
12575 266703 311120 -131432 -16153 -323352 -30993 -50496 47960 -41130 -258272 -61502 96944
12563 -35500 -18432 190660 -17295 52819 157757 86600 9212 -206107 21614 622 176978
12552 176978 63942 130089 -237077 446618 -233610 -115442 -196564 208407 108227 6702
12541 271290 33291 -21308 453118 -45931 -11900 154697 -362525 -21776 386437 99996 176251
12530 176251 186000 44644 276719 51836 172489 56537 -252152 27367 6034 -204680 78930
12518 78893 -41861 174948 -20122 -15385 -103037 317125 -245895 22542 159507 -136133 60073
12506 -202702 -168134 145513 -308153 -41103 -71342 180122 222753 21971 14626 146186 400310
12495 400310 465923 -110506 146553 12514 56271 156128 -192807 130258 9015 107119 -282285
12483 -67053 -49383 -132517 33577 34103 -14310 92235 111143 336834 -91779 148 243837 -359553
12470 -143622 -216587 324847 34068 137721 -326901 64142 58623 69811 -209080 14301 9030
12459 9030 61418 -127469 256409 57758 -258919 302127 -70568 -95627 -74784 -42688 118788
12447 -11318 -14088 61299 -182262 -78738 -358823 88760 -79306 18011 340103 -59172 -88308
12436 -88308 -270897 130536 119213 142598 350835 -168849 163253 -175861 -54454 -231054
12426 -231054 150081 -153656 211922 27975 -130300 -191146 357771 75476 145891 216642
12416 216642 83365 255499 -36982 -63843 30600 13205 422802 -1895 -378492 122009 95151
12405 95151 -55913 17947 -112649 87752 391737 108300 266646 -284711 -78788 351306
12394 -225930 69149 -103242 8853 -45751 -17429 145827 -354838 2041 -341938 -74901 -212228
12383 -212228 50406 3029 -458277 -28148 -212688 -54282 262951 -94820 184530 -65022 -55044
12372 -55044 172888 -267743 92136 -14485 -44796 61809 15910 571 52147 -62151 58813 -9301
12359 117036 -107571 15358 163474 -78805 -190387 163656 88989 -284880 375813 -228534
12348 160264 84133 349974 15539 -175443 -127041 2209 142171 51975 98498 -170110 180991
12336 342591 -338589 79753 235863 -112434 151631 69737 6273 -496663 133573 -147943
12325 116467 -335179 -97331 -34941 -28870 330356 175186 -38426 7277 26326 -366840 231266
12313 2054 236490 195248 -116499 1473 343965 -31428 176176 80273 -200488 -2930 339271
12301 -48765 -44515 383167 -178796 353083 86651 20979 43351 96919 -109440 143543 -218755
12289 2979 184930 88772 -28742 -64360 50461 -209403 -30777 -389629 -26751 -98783 119721
12277 190191 223959 -30705 -68645 132134 -149762 398902 -55464 -48601 -291046 58404 79711
12266 79711 230258 28183 -277267 196841 -66554 -95974 -244336 -76436 275633 -94344 320417
12254 -175105 -60485 33262 21975 -134859 68077 -104198 48353 -125933 245245 -143812
12243 30344 -36539 238278 524380 67503 -21762 -4790 40335 80980 171383 107721 149593
12232 149593 149865 281496 190071 149076 477285 490046 -19225 -157478 456236 306084 129483
12220 231123 62590 -94022 -3705 215716 75180 207660 201960 224104 -27160 -175972 206865
12208 92073 85153 210162 178816 226500 -21645 -29336 179912 90084 346242 24898 564954
12197 564954 143177 -139275 365935 254227 216417 17944 157681 368220 240383 29030
12186 45392 -38132 117870 -4967 -46728 164487 391935 126299 136537 -16212 151011 111234
12175 111234 63958 -55631 32557 261427 234180 153069 -12800 40568 235866 -31204 171754
12163 96633 83606 101077 -85674 -43046 109341 115780 -301161 196868 -123818 77670 238062
12152 238062 -164345 134020 -114514 41859 73664 30989 101023 27632 -39781 169340 -228055
12140 -73606 -144959 16308 350971 85199 -338396 176916 -76177 -99861 -23642 26176 44325
12129 44325 132509 317990 199127 237093 183583 153254 -286156 -180421 328844 -163195
12118 -29174 273944 143376 -32057 110073 77571 -341224 -235349 -125896 141439 188658
12108 188658 -98348 130721 -294487 36283 -161276 194120 -241184 161282 110982 -173218
12097 -211343 304973 -162724 -275853 112150 -134550 84796 400734 139526 16031 163324
12087 163324 253899 23651 123256 -25232 379069 11437 -121126 87888 62369 279928 16718
12075 82965 554471 799785 1392433 826561 291098 50090 91916 213073 189928 -119123
12064 122807 -170569 -146752 -44318 -1603 -360761 289144 96400 36278 -69912 37144 66319
12053 66319 66907 -28791 223657 23374 226803 -305483 228359 19172 -33726 -439399 -249267
12042 -249267 -1675 -204108 31847 -79495 -123530 32654 -324214 4937 -57256 -304458 119826
12030 -96352 -102586 -129468 -276539 56843 23072 -133995 -143563 114507 -215643 -183147 3061
12018 -156825 -10882 -73858 -21048 128655 278290 -268006 92561 5973 -186330 -209846 -186102
12007 -186102 -421697 79411 101631 88263 -73791 50002 -142782 -49255 135041 -205066 320417
11995 -250269 137372 172744 217225 155722 -143818 169193 193452 105329 1550 -34161 -194388
11984 -194388 -2123 -220837 70928 -38618 127392 163393 176089 72154 91670 -75975 138291
11972 19636 -275704 -451077 -62061 230497 -115882 14518 65291 124419 -91633 -316021 162949
11960 -366593 -196036 -114733 379469 -49695 -54242 -338632 -63544 -400680 116939 -72811 -59171
11949 -59171 -18558 132922 -284806 187980 -83437 -16031 474051 -50978 93547 -153834 -94101
11938 -94101 -359676 -160836 200017 12948 -10187 -236564 204425 36488 -29407 385946
11927 142493 150367 89077 183463 -44228 246453 54650 194407 -51071 244605 -71081 -35142
11915 189768 247235 -402328 -89558 198598 12599 406599 92791 14722 193184 -2880 -266775
11904 -266775 24322 170883 431708 239803 165890 -244937 -59567 -8704 191246 255117 62108
11892 63129 -51044 -56154 -210165 49742 -48617 163354 79277 188106 -47681 -222067 33750
11880 -87486 -20019 -90819 -353809 -223125 -136629 -159906 136237 153716 74145 22794 36445
11869 36445 -97012 -111772 -155693 -121739 -535724 232073 -21946 -326474 -249705 -146972 -20752
11857 -21846 -158450 218040 -230012 -66237 289187 -102772 -147528 -115164 53500 164198
11847 164198 -121441 -72099 185763 -65215 -43747 -115445 -200325 -98956 158445 -160886 139355
11835 172836 -97200 -138433 -189430 1476 -203239 218592 -188798 94786 -43822 173373 -273021
11823 186550 65734 -64136 -301110 -126503 194940 -53524 -303466 205741 121864 -73516
11812 -76139 198325 -143953 -156043 50821 -23541 -60609 93421 -216724 53137 -57047 -102487
11801 -102487 -51439 302539 146428 -177143 4171 -113856 133913 -254417 -99803 -206800
11791 -206800 238698 -49460 254347 -341647 -148457 -124065 -17932 126665 -18534 461872
11780 -60755 -198456 93523 5966 -245613 -96780 50399 197766 -227753 -323080 -208622 -25617
11768 123654 -307194 77360 274565 43655 -127533 -85026 -199545 87840 386178 -143637
11757 -205368 -260999 -107572 -251003 79724 323106 52256 155760 6684 282102 -184690
11746 -381582 -265039 -290844 -119814 -63165 151685 -119419 -29636 -167195 -262681 -295905
11736 -295905 176232 52915 -330380 -153191 -361118 -43849 -519710 -82394 220787 243421
11726 243421 98586 267281 149803 -57039 -199215 -178375 108710 -15146 -208389 140576
11715 -44138 246242 -37611 -25027 34186 -61954 -217327 -201593 378190 81720 -5549 107162
11703 -63414 -507018 -80320 87991 289859 -189774 52356 -6550 -77650 281884 59904 -200815
11691 33086 -311222 -84597 10185 -143540 -26669 -121201 26810 170117 -275446 -80547 29735
11679 201511 -68422 -145083 -180668 -41309 -27532 -49094 -98074 131198 220662 -26109 236268
11667 -215618 -31142 -231731 185120 140803 153867 -195396 -231988 97636 -38550 124086 46435
11655 196961 50370 -152122 89630 -16270 408997 -3828 -6355 71189 -94229 -83343 -155136
11644 -155136 -167216 81725 -177266 -52918 116337 -174107 -64507 -9722 -14533 -56232 -67550
11633 -67550 310026 229326 -76205 41366 181448 -221049 -28808 146686 -48993 -74808 43895
11621 261992 -154007 228956 449915 167479 11371 89193 25052 87147 -4415 -253452 -234860
11610 -234860 125691 243446 306705 364988 -36129 -223131 184385 73157 -95659 -45367 142840
11598 225511 14764 -40270 488182 46525 1230 229034 53369 -18776 -50521 216074 206344
11587 206344 46359 195037 -118740 -49737 -86306 301206 112682 -91937 263227 -98196
11576 30810 -54197 -139026 101209 -92530 -13650 8081 256891 231553 43214 125860 -78643
11564 40567 20864 202999 -41705 -57450 -31794 154064 206743 227525 75051 -26035 -238516
11553 -238516 -147145 270428 -231964 -210013 6116 -70953 117762 87882 -142965 76843 32069
11541 9934 3273 37375 5036 38938 23980 73223 -26858 -98868 195118 79053 121740 -37626
11528 48235 -43542 -156761 -61633 60738 -32808 -219290 98795 44638 -85308 376641 115943
11516 -387749 170871 -64018 -238031 84200 110275 295133 55832 97165 51430 300354 168340
11505 168340 215386 258271 -64269 -220502 162602 -36258 -120972 57997 -82522 -56524 30819
11493 53406 316948 10600 19168 -313716 185664 -382366 55989 -257192 361591 32263 87128
11482 87128 -304017 -262777 193974 143145 206015 55276 257447 438820 145621 -94474 -80301
11471 -80301 248146 164143 431388 -53011 222454 334551 3198 86820 -156449 -25986 291871
11459 265999 97122 -100045 291889 208538 319231 -88472 44366 143249 283200 227511 -26339
11447 307343 274873 199373 67141 -143445 294677 -117657 300011 -54053 260656 -127359
11436 -124928 329899 -291462 -322886 -59856 8779 -47238 107184 203107 -28156 -79950 272518
11424 13117 145442 -104593 -337516 -49621 -104504 323968 -70088 6691 239991 -187109 72982
11412 154946 -44898 169478 -54606 -109153 -174123 -108959 19747 3356 -52984 27996 -123076
11400 26864 99860 180021 186296 42365 -259937 5908 38096 191438 46394 -280485 55733
11388 341930 -263327 199816 136555 57641 -230445 -57206 -165602 72156 -183849 88307
11377 -117863 108913 30710 28261 158312 -261386 196723 -177242 -111367 30441 208405
11367 208405 -81230 -56830 -105519 -170683 -180918 148368 -48093 83058 -18538 87651 43324
11355 22950 58712 329178 -220811 -52344 42894 -358377 -117365 -130758 -30038 -158532 15995
11343 247190 308288 261529 -97246 59461 -103619 417182 199492 -80868 -118134 -281098 317179
11331 165840 -66222 109747 -363526 -73732 419738 168488 -146072 -469141 -22641 -6949
11320 175040 -70668 -210790 -49314 185615 -174301 86406 -242979 154731 -68419 127019
11309 -97769 -685 -247973 134570 -21782 117717 -299353 -49394 20157 -242584 -123550 214974
11297 340950 -121178 -73774 -279998 -146886 -59678 -181036 -226029 87193 -109167 -374735
11287 -374735 -120525 163325 42631 -199291 450916 193612 -150402 212450 38210 61420
11277 61420 -20293 -273583 -29258 -37833 334884 15992 -286930 -255123 40560 69088 34034
11265 -143320 15594 -469957 -27437 -48239 -75839 -146422 -200565 -50600 -192606 -133613 82646
11253 -101123 -104441 328477 421456 116533 148625 -269658 -415278 -283761 -73002 -116455 -238623
11242 -238623 94160 -232685 45355 36588 -89022 -177746 99180 125228 299263 -15557 -218244
11231 -218244 -340956 94742 -157191 423976 -23160 29258 157217 -141877 246116 -285314
11220 135041 -29204 -224131 35029 -224758 -140004 29568 -103036 122435 -43965 -141625 -42609
11208 76218 -234709 265141 147464 -11475 -555588 344815 -150903 -200015 191366 97342
11198 97342 5905 -42019 -44452 -164103 -246298 339067 102425 -129521 22305 -156614 -43191
11186 -281231 -255328 -194980 -134118 145134 -66685 -56012 -31320 -45528 -368217 -31368 -69355
11175 -69355 -34082 -93414 -163223 -95650 211940 -69566 -210743 -162384 246442 -242708 -118641
11163 -107657 -272730 11564 -100422 -157568 144468 -100644 -105163 -14609 -67638 -158993 160583
11151 146637 78608 15712 -463982 268518 -161784 -266226 83996 -151936 34367 143485
11141 143485 50461 -17788 -98870 144270 162955 -215641 196284 -500282 -40276 72666 25852
11129 223885 -59744 -79791 295395 11390 -119658 288885 152889 -184920 71872 52401
11119 52401 298016 139773 -302029 157610 138062 129937 83699 47862 168251 58600 18853
11107 -41564 -18264 -295038 228104 -342432 14637 77546 410211 29420 352271 -37209 222628
11095 348422 61484 26470 -102490 -33527 196128 6051 350266 183565 -25247 92257 46204
11084 46204 -340181 363081 323352 322426 240314 -65460 190907 365086 379869 190117 251843
11073 251843 179982 73270 187446 605631 285900 425970 286943 377175 153817 379402
11063 379402 147157 328663 279737 525758 355923 696256 455262 383682 873243 334601
11052 639905 852375 732664 732248 1109681 907472 884914 702052 420139 576112 560169
11042 560169 579785 634857 605713 642664 798575 688290 878049 593563 820244 763121
11032 763121 314064 368890 792114 583738 721548 548536 742205 581435 397418 101928
11021 266074 504266 421160 678697 515122 781790 430667 288756 619400 360551 376150
11011 376150 377130 589773 233704 651176 666023 569675 573210 346758 644275 698898 339747
10999 668770 562048 524915 666525 494732 638730 606960 478461 622979 539891 585608
10989 585608 933779 927363 693754 824508 920331 882196 1097974 1014697 1060832 908997 1296785
10978 1296785 1021900 1327722 1834268 1331990 2254864 2302771 2317151 2175914 2470134 2894336
10968 2894336 2217744 1928903 1599699 1453176 1472659 1429825 1395463 1383269 1751117 1352249
10958 1352249 1376481 1547299 1450074 1462588 1471241 1396848 1006603 908341 707936 678999 413924
10947 413924 780624 280165 219261 283467 401750 26603 86761 83700 -90061 100243 150955
10936 150955 116063 161122 201623 -139745 13693 -77998 57268 187842 397071 321687 306649
10925 306649 194378 251831 88279 -223295 -259094 211777 -148530 273478 46186 -233872
10914 195614 -399217 463612 115564 23573 53326 144726 34774 134485 279699 127667
10903 233940 24529 69813 51473 331711 -72777 -351835 -108523 183325 72826 -41637 154584
10891 2954 219998 -56325 -389485 -15331 -307917 -16800 -257594 -218642 145355 -209793 -170547
10880 -170547 56621 -151433 121959 44643 -10583 -10197 -116466 -68900 50640 158876 -166720
10868 -56956 -51351 292076 -261149 -49044 26653 -154371 -11672 12866 301019 -129926 -164201
10857 -164201 10912 409982 -139738 306456 79402 54847 -5736 -32909 -203331 -46393 -523659
10846 -523659 5613 -134103 156360 -67370 -341212 -167272 51348 80502 172970 9684 313199
10835 313199 60204 -416555 190908 -178050 174182 -220716 -154619 239546 -92877 -19837
10824 -8324 -35044 -125187 -81421 64697 -150829 -293127 -205181 265745 68649 81548 35823
10812 -173957 114719 148193 110012 -1372 376972 268479 -304075 -192851 -107098 14875 -144140
10800 -118196 56000 229453 39013 -183850 237459 -188761 -208529 -15255 -47996 -106820 -206877
10789 -206877 28358 154473 108230 -130676 -428760 10657 -353402 116824 104565 39723
10778 37439 -87816 -108961 140169 -187887 138620 41719 177030 54393 -211764 338464
10767 75726 -76503 -161963 22405 221702 -321015 238084 -290372 169582 -109397 -89555
10757 -89555 104969 -11379 -64756 -200460 -62544 -195805 110846 -254880 -471319 48289
10746 -108472 -366402 -207218 -476804 54117 -65538 94792 235072 23555 57890 230906
10736 230906 114639 -34567 -53796 -30982 395477 -308812 -161950 42797 -6278 38167 -52871
10724 433664 54061 -238992 432118 172710 -82062 -164262 -109518 -121150 7768 -27355 -71651
10713 -71651 -32033 -76561 294513 -185953 -57021 55246 -229936 -42527 -339101 148217 -112108
10701 -297798 49088 81971 81833 -71739 87895 -11675 -216938 -36230 -171901 -251999 -64391
10689 -221392 -76516 -223592 128516 -237445 159225 -321134 70016 -422903 -5298 -246974
10679 -246974 136853 174197 -37737 19799 280876 120409 -253759 -323927 -306651 -83345 87429
10667 67276 122890 56639 112681 51486 122557 -167396 -280245 28485 -360168 89886 -187189
10655 -88063 -15019 18680 -64068 -263615 34233 252258 107352 -232676 -172430 -313654 -252256
10644 -252256 212210 169807 -160745 -201324 -50982 206894 -118770 -68635 89904 -9271 -19793
10633 -19793 -148269 -130365 258221 -311900 25895 -203174 -307369 -90473 -3615 115997 -207060
10621 25386 -158635 -205950 32512 54267 4052 -63505 -180720 -101609 -39869 -125300 -26486
10609 52391 -341235 49365 -23369 -264842 -148115 278222 142029 -119165 -116288 -307074
10599 -307074 -191417 -147730 -129570 -20197 147710 36300 -148209 -328671 -76695 169649
10588 -165465 103605 115017 -15269 -76037 -222331 47967 121183 122450 -91151 214221 -399491
10576 -114811 -107026 -267355 46322 231683 371369 41732 -8647 -115202 -62055 9434 78871
10565 78871 20018 79089 259748 -289849 168706 224819 -188010 24613 89921 -11044 -88525
10554 -88525 -88181 -20148 -117152 -74554 186568 20514 -96236 70800 -12009 195665 1423 290922
10542 290922 -41130 -241285 60688 57362 -258817 112584 277094 227496 45896 124628 286117
10531 286117 104323 -68635 -202065 -3446 -423271 -287806 -157967 167762 139573 221802
10521 221802 75289 -435004 -329907 85679 497 -167575 199884 -116071 -27243 93450 -164522
10509 289827 -64027 -75515 99606 117848 44095 90084 -60236 -90998 -1706 -2578 -39977 42649
10496 78266 304605 105337 -371517 -349395 -149284 -79753 114409 -203298 -79232 50294
10485 -432818 89506 293048 20018 510757 -25585 278076 459907 86875 -26443 70796 -35823
10473 -55625 -13110 122490 231997 53826 -195385 164632 -172509 -121838 32418 -22420 319575
10461 -221493 197645 -8408 183288 -93579 -79703 114667 -185985 10056 -70593 -532896 -205476
10449 210900 -153433 -36476 -24687 -297583 -106181 -167421 -46539 57801 49664 245446 218653
10438 218653 -204117 -93153 -16885 -23560 -123407 -135894 167406 160867 -69173 -81111 202306
10426 86332 190126 -289569 -394084 42577 26632 -200508 206844 -26273 115546 -363644
10415 -41675 133909 -31095 72174 1150 141257 -297424 174875 -43257 -291561 -268940 -332230
10404 -332230 69609 -296735 237492 88135 201285 19347 -323457 185386 68054 -59856
10393 156095 -147110 395810 -260221 -68317 27356 -34876 66854 266085 153676 55008
10382 283202 -452844 608840 321260 231617 165398 96009 495610 238994 404998 7960
10371 373395 125749 -122949 94356 160453 145098 546628 321119 410780 364565 215134
10361 215134 -50849 401376 -189783 122948 420525 -92304 63242 551036 -87552 171994
10350 160800 263207 730045 247517 435672 132993 96961 109146 401325 95796 -114672
10339 310248 129529 -148851 699161 37344 169331 294701 56435 178959 -9053 -84063
10329 -84063 -101855 -37347 161567 225648 165983 185505 52643 41354 120588 224154 61443
10317 217851 17231 24260 214492 -30961 95615 150120 -1022 -208350 44155 111199 -393477
10305 -33955 -143118 -334244 -20143 72340 -53345 55379 54397 -89394 -267106 283490 97598
10293 26761 -470844 172502 48449 -440279 -237592 134782 30886 -156700 214822 170293
10283 170293 -141340 -58289 204620 -56382 12062 -207990 -175827 -115850 235589 -22411 -222718
10272 -222718 -62581 -60884 146237 -101060 19076 -67003 -256825 -27051 77594 -222233 -117476
10261 -117476 403172 105486 90463 9633 154136 238750 211809 97515 36151 -299001 -60287
10249 155580 -182217 -14218 141569 -203935 37383 -17524 87381 -266890 -122222 7494 -57582
10237 -109492 -78137 -420649 -148161 -137672 -164125 77641 -35436 -248172 -130374 142187
10226 -97168 -287095 17151 47446 -32598 -277514 -49564 -124535 40484 -174662 9075 -76286
10214 142960 161078 119347 -343442 -141746 90609 -4348 4296 96392 10300 78184 284431
10203 284431 316434 -275357 -35711 -522895 174605 -130639 95489 -301257 -114020 -286725
10193 -286725 -395969 -52388 -280020 -346991 -182346 -146194 -193804 -13263 -163552 -102075 93822
10181 -16632 -107669 50238 -145472 -70136 198675 -260673 22725 -334586 28981 41751 -359907
10169 -146263 122837 161756 262489 -174058 -263013 72204 -45757 -207553 176786 211035
10159 211035 -166335 184366 -207101 -112446 146411 91521 477 19452 -74152 -195988 68515
10147 -101811 -117007 6399 -115058 -238704 220298 -466071 62305 59257 -251564 114672 70760
10136 70760 -106910 244297 -14138 -113885 -45733 -36995 92389 342692 86319 -104367 101709
10124 248014 310490 98834 111434 -158021 -226942 -235103 -223849 -180036 179661 -178122 68832
10112 25837 163813 -9980 -1147 302976 -258269 -67991 182182 -419602 -93902 -329393 149240
10100 332629 -40128 -56058 22751 -99868 77876 390369 89720 -304629 -45059 -102220 83733
10088 -5656 -237144 10277 -294852 36379 45782 154526 13068 -260947 -69645 -178131 -63800
10076 -124757 286621 -125863 -181269 110648 -24353 -111317 -394274 -161123 -160411 170779 20466
10064 -198592 -139047 61693 162373 84197 -56415 -43420 -170310 64275 443281 201509 -206908
10052 487841 -164280 -390710 -89868 -56057 436063 -183654 -58326 -114257 163346 -200396
10041 -34832 -405333 54946 -61172 -181037 166346 -146608 -33627 115870 -23433 77060 39682
10030 39682 66169 -151001 79348 47420 -33183 26977 -152544 -30332 -204224 242443 121483
10019 121483 196277 42656 -397061 240873 156240 77975 -206549 -306761 -90770 145880
10008 -287870 127159 -185283 -59832 -165052 -21706 97466 -122585 -161466 -74186 49700 -28719
9996 -445306 -57940 -256968 -116154 52054 -25980 49668 -286237 -65712 61015 -27194 124355
9984 -180337 81722 -377339 -25623 70654 -178938 -156530 -78994 -82797 63952 37824 54812
9973 54812 187541 -222464 27117 -180096 -28531 126495 -19578 -132066 36422 16008 -434786
9961 9637 176737 -119121 186661 -282192 -4105 -88970 -185052 -299431 -181373 -178024 92018
9949 20190 -50353 92970 -119679 -138436 -25091 -41050 -100114 -185185 -44201 -90938 200434
9937 10881 180171 -141796 349720 196338 10662 80351 -208050 -352118 -126123 -57128
9926 -34752 320644 -220633 -403504 88388 26592 -14492 -168260 307950 -134367 -287617
9916 -287617 120798 14993 29627 -325921 -326524 -90568 91620 -50473 79444 26117 183481
9905 183481 -117090 -247444 -180612 -101531 -43478 200702 253448 -75841 -115538 -219137 28708
9893 47305 82041 191401 49838 72060 -188532 281904 -62902 -275702 54821 -139445 52741
9881 -307994 259641 -78102 5161 214092 -257283 -339156 -38200 -127197 -182029 -25822 43797
9869 167046 -302474 116706 -390005 -122722 103916 -391379 -155515 209215 -146993 -162344
9859 -162344 66262 24452 -206850 41002 91171 78472 -163027 83224 -7303 -255706 -139224
9848 -139224 -347832 -86769 -8435 -106777 101803 -41917 -122717 -43278 10659 -139034 -289294
9837 -289294 201636 53507 168045 56487 -203957 332783 -350041 -273950 295002 -77400
9826 -300523 52341 51178 -13225 -83675 -166707 -51983 -49152 -591 -81582 -256583 207867 328478
9814 328478 -183306 -86442 -182193 -251182 -129266 89585 131002 2669 78887 -145504 48801
9802 65527 147979 -26839 -188885 -1041 -440084 -96004 3873 -247433 -13844 -88789 -175860 -102254
9790 -102254 -38294 -183027 -100145 11558 -272819 -263219 160906 -58031 -393280 199941 -44354
9778 -125716 -147447 51325 -72569 87832 -202308 73809 -214375 174800 -88909 132182 -76203
9766 125548 -402277 146563 -115470 -101243 170317 -209945 317003 9730 -319139 -15201
9755 -240426 612932 92832 155964 35844 -95632 58075 -40351 488204 -45421 -328045 68226
9743 89627 68888 -108697 71655 -92410 -112968 -242737 292058 -216464 -179271 -307522 -443262
9732 -443262 -120247 -51708 -106564 88863 -129040 -122112 178714 -137310 175719 -290608 120407
9720 -208800 3146 -224853 -50243 -189462 56269 195656 -4133 -178374 -234716 129238 279784
9709 279784 -232369 -168497 -43255 -14086 462363 -245863 -171799 -168042 -28118 337049 286290
9698 286290 166390 -165095 -147252 66320 -129994 72071 233143 -174871 -229521 -262702 298796
9686 -67775 -117180 -119931 -102901 -115463 107684 144407 -291930 -78568 -15202 185224 -233320
9674 -143334 2450 198664 295859 -217838 -163850 -456068 -395184 178292 134433 124443 -6390
9662 161756 -134412 130034 -75033 -75752 -252565 47635 -172876 -20059 55509 -95206 111743
9650 120541 -254752 -192724 -47456 -117170 -201675 -60684 242206 4998 187895 17118 -137989
9638 118349 -152419 -286984 -117909 73890 122499 -230992 122467 -95349 -35035 -247793
9628 -247793 -6620 -433453 -87325 179798 94589 196389 146636 -98572 -40336 116007 151004
9617 151004 -369012 -45410 -191422 255490 -10292 -196603 -212881 -21751 14294 -155287 -129809
9606 -129809 -267545 -153758 26504 185336 -109971 -180875 -95804 121963 -258913 -132151
9596 -132151 -49788 155645 -134291 -56478 140733 -383736 -83120 -75308 -228491 172770 -167983
9584 -86226 -497921 136679 -316625 -222782 38301 -138060 -214113 -154334 110181 13772 136833
9573 136833 51798 434916 20074 -164398 -62203 120304 118305 -68017 -285286 -15179 -87836
9562 -87836 3743 409314 145382 -189766 -227190 -422416 -105669 -187202 89505 114583 -91961
9550 -398651 -15570 -60003 -256952 -53966 -189895 294572 -110294 -85304 112099 -207451
9539 341722 -111109 -240161 -104073 -248679 108782 -76369 14656 130090 91474 -306202
9528 -555432 -12831 61929 -41072 -84993 -414902 116507 -244814 -59289 122517 -269827 12988
9516 -203064 27700 212325 215180 -3519 -233501 -3758 168845 -164677 75480 97301 -368650
9504 -188825 -356136 -316362 123037 589 -189730 81951 92632 -165575 -69216 -239379 -225269
9493 -225269 27141 54887 -242785 -241062 233325 -29981 111913 -244660 -216961 -4410 -58842
9482 -58842 -40019 -518363 119693 38414 288697 33224 -106205 40751 -139427 -38509 90904
9470 104546 -203232 -434577 -65773 -395498 -453284 -156775 280703 -124458 9998 -177797
9459 158697 327293 -60848 -52017 19601 116640 -259811 -85867 -235263 161195 -182673 -142494
9448 -142494 109135 -40066 178593 -301027 -230818 -138346 -267193 -177995 19953 -304987 206611
9436 -58043 -166759 -529034 -126300 -72510 -152819 300077 -138349 -193103 -28001 -75894 131074
9424 131866 40492 -50703 -64661 174578 -48281 -62931 -90479 -125238 -212056 -51461 -287917
9413 -287917 60695 -60253 -85322 88573 -453133 -68713 60045 102750 -325573 -109125 16831
9401 292716 -31447 391803 16114 -112886 -25858 -256983 -191351 51417 -204154 1226 -139031
9389 -86581 75518 -102818 304247 -3323 164617 73821 43390 116401 62067 128673 -84887
9377 161906 -136101 -351743 -6229 135023 117902 142268 172856 -166884 -55326 -239842 142644
9365 -107100 69689 -40632 218202 -276181 -3939 149967 58879 -75752 -108695 289236 144785
9354 144785 -139845 68307 200002 -37601 -225573 161505 -79012 118420 102847 -336612
9343 69410 -510183 -305428 -539474 258074 -6046 93313 208788 99465 -159874 -182812 -145075
9332 -145075 372539 -698 118133 23888 199496 -71462 6904 -177858 -63094 -487224 -84449
9320 290794 -31048 -63918 -263684 -27062 59178 172974 -145667 -97467 -111447 -134978 -119107
9309 -119107 -144174 202268 -16647 58782 -155334 184562 76051 210529 -3208 115689 -192744
9297 57163 22193 28078 37861 9930 -83298 366054 123353 -51627 83868 -402335 -216789 -294231
9285 -294231 -217997 60921 -134823 5587 -168913 -324684 -111902 102393 66068 32941 -282129
9273 210384 113743 102973 -233023 -98147 164643 48396 100423 -155452 -14109 -32969 6567
9261 139994 52403 153334 -47198 31511 -5759 -169724 -176240 -23750 -141460 -50049 -281629
9250 -281629 14674 -387815 -195273 -308686 268840 246039 -118126 -143480 -272766 -275319 163159
9238 85340 -154582 -244383 301637 99658 115264 -34870 254942 114827 -99162 -281139 -52696
9226 -19166 -79270 184216 -138539 23413 -65710 -375679 -16212 -69829 -239974 -77789 -100338
9215 -100338 -198177 -438605 26783 -299895 -383604 -70390 -303695 -227984 49431 127586 21427
9203 -19009 101609 -110092 58034 -130823 90151 125287 -436080 -148645 -286752 62626 178636
9192 178636 91370 -80799 103703 -63152 -233500 -240260 -241464 62167 -143179 60274 -4163 33267
9179 229733 -222854 -100342 -108757 131133 92284 69188 15731 -11528 -390939 -61154 207666
9167 111201 31000 -38964 34676 -188413 75174 31791 102328 -202158 23917 -160441 -440042
9156 -440042 125402 -223225 325214 44673 148602 -22304 -6331 -144062 4085 -143240 -287336
9145 -287336 -200486 59750 -56853 -260503 -81003 -353526 -182058 152025 73383 154433 -397819
9133 -180305 -294559 -81822 145950 16202 261076 177736 312446 -336194 346322 -325764
9122 -19433 260469 91115 39407 -134814 152800 252719 51468 3705 -100746 218142 189175
9111 189175 476109 109883 150393 59572 -187645 -115893 107798 1956 118357 -144697 80711
9099 -132195 -230226 -25987 -33493 -73209 96474 -223349 -102190 221956 156542 -41603 104473
9087 165271 -270726 96405 119109 -63669 -46670 -424567 19457 -14787 134430 -5195 -47410
9076 -47410 -227776 -120681 131770 -245124 19983 -339765 -188741 25784 -208683 327064
9065 -15498 106855 -262453 -275915 55376 -2047 -110894 -308792 -19385 -209284 -15387 -126567
9054 -126567 142477 -140267 55109 -175551 -17811 19824 -139803 -417122 89055 20252 134901
9043 134901 14389 -7933 101788 -156793 -43759 -24467 3146 226780 24270 -225346 -264345
9032 -264345 -344 170150 -192749 -122908 -252270 -29453 -166100 313279 11853 31234 275716
9021 275716 -127515 -201446 117487 92915 -171175 -417988 250416 -161654 -357256 193920
9010 -33603 -123515 -50904 97635 -172411 13211 -13698 -162259 -179202 -82539 -440459 -52134
8998 92628 -38387 -423001 36878 -145546 27014 201876 85959 -275302 -13572 -41249 147373
8986 251716 -258182 -145764 48068 -62038 41503 -164588 31261 60050 -511852 -319869 -155624
8974 -1762 -15545 -133915 -271915 250620 -48717 5165 25538 -168490 31399 218216 -140007
8962 124313 -59274 -343936 116488 -183093 26642 412024 -246798 -71042 -139423 -172167 -16858
8950 175565 -208608 21053 53197 147520 43717 -57602 59132 48721 111292 -18997 -89276
8939 -89276 165245 -7672 -107261 -32848 239492 381893 227212 89907 -39580 -286499 -187941
8928 -187941 257254 -211148 242562 136140 742758 2197184 5678444 10049431 3533239
8918 830287 457414 327856 -91336 -152909 -215305 133573 -304999 204788 -241549 -86738
8907 174365 -32243 -137869 51141 -71212 188055 -171574 -56070 -95765 -300732 28419 116255
8896 116255 -174890 170024 274680 29606 -101001 -181113 103410 72486 69340 -86801 -293158
8885 -293158 369682 31592 98646 61162 -227381 136325 -82587 -29629 168498 20701 11124
8874 11124 -70818 145062 -128569 -131024 -51553 305024 -116838 -34086 -363924 161775 140199
8863 140199 -262386 -214794 -24510 -75568 -130627 -271344 -251212 -105098 8843 -145868 15460
8851 -99259 -68552 -43105 -102467 -113714 18259 -53457 69488 -39996 179981 -52460 55933 -84300
8838 -10200 105666 -51041 -151195 -223785 191034 -406715 149479 -179321 191441 70377
8827 -76951 49442 -158837 -132984 -30832 96990 -83159 238127 102282 -276273 -142634 -33790
8815 -166595 -106008 -103243 -27534 -159247 38593 -244632 247067 -309632 -281617 118199 -101779
8803 -52025 -100391 139750 -88564 -7790 290397 -145268 -13137 17388 -185452 -387037 -224294
8792 -224294 58744 -198069 -30436 -124951 -98871 -91650 -81458 -177167 -67959 333844 -446681
8780 66420 338338 178026 -101660 -225756 -37554 -278367 -157699 -293067 181366 269963
8770 269963 -240761 -494018 68105 -460984 -32792 -149691 21927 -263619 -52937 13285 58546
8759 58546 88915 27409 -133306 110484 -83708 -70507 -234149 -218592 -150334 30302 -77146
8747 -69360 221591 -302942 178352 -204487 -223986 77549 35009 -72899 -310204 211554 -148947
8735 -223913 -90726 -488360 -289081 96313 -359110 -9696 -23399 -247158 206822 -172173 -204107
8724 -204107 30064 -135092 -195495 -55151 -116952 -57349 28268 -215638 169180 279495 -112509
8712 -90271 -196441 -488254 -379972 263537 274650 49106 46609 -71729 46095 290432 -118747
8700 -18174 -8639 -72387 -60148 -298458 -288566 107894 226878 -360733 323171 20501 331915
8689 331915 115659 -179462 -96883 -60638 -71264 -109157 11958 -494149 92837 -401602 40061
8677 -144041 -207468 -103922 -210706 -161031 -141384 52239 127460 -178543 -290140 -435423 -121784
8665 -385001 -483131 -375466 -74140 -280055 141416 217306 -308172 214449 228023 264906 -65897
8653 97916 146020 -44026 -47547 -168914 -249641 141604 -19172 184104 217967 -49284 237544
8641 250595 -234825 -27974 293762 -220729 -44587 67980 116872 -2306 269092 56707 -86405
8629 54086 117967 -149330 -78407 -62409 154570 95400 306573 -341340 -207288 16698 115060
8618 115060 114157 187932 -222795 -156698 -202781 199925 -167448 -136351 28719 31771 -120449
8606 -122022 310066 134539 -139667 414627 -163610 -8317 -332249 181898 -62895 -113411
8596 -113411 78513 -238585 -354278 -214903 -353746 85904 107828 -292366 -59990 -188641
8586 -188641 -114945 -103788 263396 -23894 -9326 92680 84590 -190716 -228465 71252 -83931 213201
8573 107416 206153 -44810 60174 21362 171955 -208206 -58624 -115306 75109 -115374 -41892
8561 163964 -6161 196243 -32081 46530 -38422 -229072 65303 72884 -314056 172456 -74042
8549 -2804 -300033 -137068 259607 -199845 -66624 -292243 -339376 -313326 -233149 159491 -134076
8537 -271104 -124502 -243146 106226 -192259 -175936 -244606 281777 -264282 55433 -51852
8526 160637 -32282 -104350 -130373 -304151 -112918 -175081 156305 -157416 -341691 121387
8515 26008 -277742 -213377 -142178 -164228 -290177 84034 -216233 2569 -383911 -89434 -184973
8504 -184973 17291 40889 18222 39469 -538 131989 -146297 -191463 -255995 -46114 -247885
8493 -247885 94628 48620 38635 172952 253135 -147063 445905 -140138 -122709 257355 -8660
8481 185793 9851 -91075 -156783 -650 -21722 37028 40724 -70038 236977 47910 7827 -61449
8468 157640 -286540 363217 -123918 -32713 -201172 -9483 134627 -58846 159011 -280270
8457 113133 42854 -247679 -323665 -281095 -188263 110453 122881 -452444 136629 -369974 -169201
8445 -198692 28864 -66254 29897 -164418 -67992 252936 61939 217338 85843 -116371 47681
8433 -40303 -123410 -117369 -363982 -79705 18534 -158718 267521 -1825 53383 189356 -138716
8421 93695 -218485 -106723 121767 -180899 -140592 -237320 -139082 -291687 -582 -28665 151348
8409 -123771 56333 15050 -7336 -217531 -179101 -355378 -159874 -145061 212672 93638 -107826
8397 -33009 -12847 224508 -237022 53628 161678 -171289 245565 191797 -195766 11646 -43923
8385 -248552 162236 -435000 228896 -326920 -134768 73854 -223722 -99841 -60174 99358
8374 108705 -105694 -177272 73348 -344102 122508 -467857 -332020 -232400 -27160 -77164 107649
8362 -297769 -333360 12527 -69490 36101 242522 -167592 42471 -8839 327482 241176 -22633
8350 107370 102396 88945 -185959 156324 -440451 -186187 15989 110303 -91201 -145736 -47975
8338 33133 224323 -9014 -26145 -5046 -28252 -682647 -281487 55324 -16409 24894 -60849 -138600
8326 -138600 67445 14213 173491 160940 153604 296082 43033 66150 -292795 29970 -97328
8314 56987 -288170 -11618 -102284 -156066 -50724 151246 -187252 -88737 -157201 -30306 129260
8302 -126088 3231 39892 118224 -55655 -335449 118499 -265582 -194606 139503 -404654 -180055
8290 -420847 -172038 190514 -50739 -54130 16065 -283059 -28096 -55690 34550 79656 77794
8279 77794 -83594 42987 128908 86918 63954 37767 -86050 97538 -214774 79467 696 157001
8267 157001 214305 73607 -30060 315891 -6138 -168135 -38761 -23620 -39911 444715 67310
8255 -203264 -160597 -73303 -28008 126107 100435 -31189 64377 -7522 -187878 -70288 -7687 106413
8242 -92708 11518 -120773 -29867 67485 23669 -124721 -148776 -240782 -80263 174464 -160671
8230 -157548 -226913 127605 112865 -271656 -160856 12277 21546 -66618 34637 -57988 9596
8218 236068 -93232 -274322 203693 -108087 -10102 202432 170306 -91482 -236418 73722 11272
8206 -53167 -219469 107108 -89754 30064 310 -376449 -337399 -161862 319176 -40299 -163800
8195 -163800 -40160 -51467 -38615 252507 -307610 52283 446916 -111143 -205628 -49831 -124549
8184 -124549 -85167 -131257 -112874 77003 125443 39426 -42426 160821 -15443 13590 170686
8173 170686 -172044 45334 121115 -70677 -51683 -25617 -157803 -307653 -149585 -24583 -172533
8162 -172533 -39434 -325716 -191574 -14132 -122019 -114353 -14188 -76985 -35011 -38663 266772
8150 -129303 50022 -84559 -240597 -109468 19416 109449 203622 -160763 -137511 76028 -159234
8138 -354864 -60152 -200519 -24677 67475 39982 120678 -163428 135243 -118283 45817 -331441
8126 -115565 -140797 65310 7532 -180821 -140184 -19972 -183798 64352 -109964 -156519 452072
8114 -173378 15280 61054 -385900 321769 219289 -140350 -127792 24758 -33482 184610 -108283
8102 264730 -26818 -224890 30565 -408220 180606 -520835 -155087 -456 -109034 -143437 -87962
8091 -87962 -194615 207327 449928 -68568 244034 -162436 -158932 -444077 -390794 -125529 -107002
8080 -107002 -226742 -62468 -21138 14780 22109 281034 158404 421754 -52675 95882 -232383
8068 289979 -183939 24541 -70957 -352567 112337 -151320 -13948 -57457 -195440 -103840 -295275
8057 -295275 399834 -497431 -131218 -106245 204066 -165789 -101265 -96654 192312 12024 144000
8046 144000 133652 -197521 -42131 -171461 -415516 -330382 -287250 10978 -65104 19800 -122466
8034 -205665 -59162 2086 27388 129488 -109260 -12056 -103550 -12826 -131857 242767 4916
8022 133952 -159720 -5932 -213562 34752 -255863 -204405 -175461 -126030 -33449 -42876 -57737
8011 -57737 -195947 -86321 122917 -98022 223798 -197713 -40073 -191925 37891 35178 -102475
7999 -202086 -10592 -407538 -192732 -200689 -206349 195446 -210753 -148877 -200374 73537 170012
7988 170012 -290974 -15569 -214434 187194 -97029 -140883 -298146 3617 -42809 -396275 -72988
7976 187009 75177 -37988 177484 -202717 -19434 -70453 222035 25814 -48348 -177035 5217
7964 -18230 -95501 58130 -218404 9066 -21712 -14965 482 317740 -270080 -395393 -133902 -93945
7952 -93945 -64205 384562 -153962 -14461 130145 -143508 -233420 -45134 -239274 -169279 64625
7940 -220674 73581 6994 324167 -384418 -192645 -228054 -278324 338604 -212904 -51738 56087
7928 -188934 -83036 15226 296472 -78450 -305329 -193038 -18280 -69098 -305048 -155286 -125105
7917 -125105 -6274 -111241 160253 -137479 205465 43627 -120292 -57984 33741 149700 -66229
7905 54882 -162208 -54143 -89326 -137526 -407802 263452 -125782 -147442 -459341 60508 415142
7894 415142 -93095 -70647 -215775 53351 -164308 -33459 -64930 335428 -349460 -217983 26974
7882 -265660 89938 173786 47578 -180203 22617 61186 -76932 -62078 -98903 -298481 -134990
7870 -181941 -3894 -89296 16557 44171 -28115 -125150 30718 -142838 -182488 -101622 -87062 -149878
7858 -149878 -64442 9657 -46636 32678 -19898 -79933 64736 -143224 -414611 29626 -87118
7846 115833 -119810 107924 136746 -4193 55038 3469 -23583 -246225 218855 -252670 157176
7834 -109823 274124 -13087 35786 -59597 -13042 -59831 28066 -165627 -339837 -45684 -249100
7823 -249100 -6121 256868 92157 331725 -117316 -267504 23687 -184754 -115478 -142235 98955
7811 -214728 -123875 -306501 -134570 -38123 -143340 -105834 262726 253364 -83248 -214515 96920
7799 -202160 -191542 -55036 34286 -62336 -217237 -12466 11227 -70960 302826 7787 40235
7788 40235 -74589 12656 71482 140575 -189074 -208343 91737 -60860 45107 131197 -471 -64782
7776 -64782 -113757 -75791 -142919 -35526 -34549 -56307 -412451 170523 -224998 -34437 -51983 250811
7763 -91797 -32599 136259 -45251 -238406 78364 -241430 -284348 125182 -21769 87075 241714
7752 241714 35913 -282358 -61005 59090 -16127 -122519 121245 -55926 294642 -408392 -100579
7740 -72066 -160141 52235 46135 -9059 -201525 -101369 -34205 -96234 50621 11882 2496 -71351
7727 -82495 103415 -47710 101956 -88096 -207530 105569 296484 -94477 -242121 -75746 2961
7715 -153694 4783 -185190 -91533 -61491 315438 38562 -169171 -217451 183735 -106155 18825
7703 -159163 -444767 -42846 162505 509 57866 109682 94834 183616 -15445 -36970 -53647 230081
7690 -89267 -129004 181950 -229679 214692 -225179 23996 -76514 -315411 57129 -434439 294472
7678 126456 -25959 12932 165045 -125250 321303 -88121 -148743 -2417 -109777 223599 -275856
7666 2034 -40493 63118 -405271 -37673 -293484 79913 -53903 -173548 -308694 -309437 -25623 -76631
7654 -76631 124568 -177223 13284 99028 -278539 -296620 -57049 -105022 -159711 -83600 -532122
7643 -532122 -230992 32615 -150702 41623 137023 -115650 -394002 119752 289792 -41611
7632 -269401 380062 88752 -48074 194874 -395598 40125 143018 334261 -350248 -184645
7622 -184645 -130938 -23874 -137528 26325 -133897 67268 206291 83933 -6212 45666 228693
7611 228693 -10328 -73725 -464612 -225698 -191741 49077 -231251 -164664 106221 157129 -363564
7599 -26211 -252869 -173016 12139 185753 -198378 -36273 -100460 -245094 -194408 224828 143274
7588 143274 94136 -114572 -154562 100834 155633 -12220 401441 50744 45665 6669 57709
7577 57709 -137935 349523 101648 -142285 156323 -49794 -122754 -109859 -227535 348736
7566 -241041 104096 -99801 25056 15167 286492 -45784 -290052 160672 212399 189679 -283674
7554 -317709 178103 -32894 55199 95922 185352 190296 116936 -527194 -117774 16269 -67459
7542 123328 -97819 161859 16840 187199 -333420 375022 37979 -238653 -6968 -145485 -270092
7531 -270092 46756 163290 -86364 -71976 -30871 -210355 71936 66744 -148738 -273053 -50010
7519 18669 31517 162339 -79976 -22111 -116915 82497 98179 249633 224691 234648 -210991
7507 219524 -25759 -274633 118436 65837 -213523 -32217 -392702 -89558 -60120 310199 333
7495 170974 -85669 -143884 -93711 -101950 -379257 -445152 -190818 42377 260112 -127729 -101766
7484 -101766 215890 -139379 288764 -88325 -443474 4334 116943 -87361 -183165 152857 138711
7473 138711 -3630 -314938 6792 -198224 -70 152828 -311880 -200807 -16565 -28365 118856
7461 79362 157849 313062 180581 56853 -161140 -31906 -64655 68003 -6477 278210 33030
7449 -247618 57955 62749 -101635 -10952 -197856 218959 -185083 40214 302276 52912 -26856
7437 -192832 51849 -28441 -137674 -380109 -175744 -55817 -361214 48488 -30719 10966 23770
7426 23770 -200861 55510 102333 -92621 -330061 85955 -73022 65213 -85277 50919 -171554
7414 -119327 -338090 -350516 66998 -17925 449733 -104011 -93896 -2284 -200242 6817 181883
7403 181883 -250839 -200596 183418 301087 429843 100962 91373 -175790 -81686 183535
7392 -64839 141524 -251578 26432 -210864 -267827 72267 -222687 270669 433005 155328
7381 187229 -165770 182898 -41740 215197 121984 -386556 -289318 -28578 -102685 -25277 437636
7369 -231574 207481 -76048 100611 -55535 -112817 302918 -188946 101518 65641 107196 18588
7357 9483 62733 -105092 -61950 157624 202645 -63757 256725 96002 420711 8374 566588
7346 566588 5129 182963 138045 225399 44219 151721 -68828 -306603 210385 -254004 84915
7334 39797 170159 -16208 -343077 -58024 -257431 -152550 -61793 -216684 -49547 93518 -69661
7322 77956 -213825 -999 260020 -327315 -81390 -83564 -54070 16688 218845 20661 -154924
7310 -237540 -80077 28375 -195130 -215836 -220534 160139 -205600 -486425 -31198 -145264 -44099
7298 -80361 60882 -259552 132292 -133522 -4268 2853 142134 -304547 -8741 -16652 -68187 23675
7285 -266267 50034 335960 23197 17943 -35988 11047 -69262 -242273 -84952 -339425 -182106
7274 -182106 653 -48954 -146727 -72521 291056 61590 -370709 214739 63753 111602 69523
7263 69523 -83413 -4150 -369293 37414 77145 -314300 135147 64517 164490 -80047 91084
7251 -113485 1329 68348 121372 -25436 -115843 217370 -71593 -183264 -292360 164927 -180212
7239 -59327 -162238 24358 -253421 -95245 -255979 170063 -55540 -77185 -146330 328955 271080
7228 271080 -181731 96510 156347 -113154 -109761 -80602 -56980 216445 -320054 -452444 143839
7216 -130159 50258 -57854 72170 -11857 88884 -6524 -54799 4360 62530 -410504 241551 76838
7203 -76689 -99731 -140407 -129723 226191 131437 263488 246673 142936 -75511 26955 -190766
7191 -17714 -69023 9422 -185257 -82661 -14376 104829 60536 10489 134535 -9467 -10237 -294974
7179 -294974 195678 51546 -264119 65996 -51282 -55727 -28550 330443 -132184 -240627 214509
7167 68592 238198 -2286 -114015 9460 -29023 204394 34433 125182 93499 -37806 -91369 31123
7154 -23746 -42429 -118369 69220 -146402 158882 183446 165183 -371465 221326 -111431 -335357
7143 -335357 -73174 40300 112433 -163269 77029 68825 196877 231947 -133815 108125 -95902
7131 215470 -106535 -227779 40372 134819 -317017 -119143 40554 -347957 -81161 21909 192478
7120 192478 -69231 -250829 172030 -132203 -79285 48432 -18408 -59806 332649 -169646 168361
7108 -47613 94886 -83466 -64062 -176165 -233262 -204849 127234 -119489 -384689 58608 -576176
7096 -127033 -48185 -210433 -17894 -70024 -76402 -398669 14081 190390 8821 -47756 4721 -50457
7083 20068 10853 -185957 -182972 127411 -134605 -69314 24391 -240272 104009 9624 9181 -104631
7070 93245 44499 -54797 -172228 345747 -249232 44434 156179 -225323 -170207 333092 29590
7058 3060 -55880 -296877 -191344 -606 -223651 -285870 54042 339289 10302 -274569 18150
7046 -254865 -12743 101279 -64136 26278 -302008 -146145 83169 28121 99706 39932 -126451
7034 -260965 93352 -58462 -484411 8637 38468 -197164 -198504 53557 13623 161505 98272
7023 98272 -45339 56686 256988 246207 5452 -49492 -125623 138 -204754 -122419 135788 80502
7011 80502 197317 61397 42681 228873 -109418 -207840 -62615 -147686 -176976 44916 291915
7000 291915 -290965 112619 284921 -111971 112209 -318788 114255 38543 -355968 79305
6989 193069 -194460 -1614 -21879 204460 -59949 -208710 12790 -269387 103809 -246654 -103523
6977 -234138 -12395 -2647 -61668 -128153 175565 -54213 -51472 -84716 -33812 275152 -333126
6965 -196796 240426 -111347 74068 348917 -101648 188880 18750 -61700 337633 -21747
6954 35811 -318996 -15032 148491 -26069 -215324 120195 -155517 56738 516972 12802 86077
6943 86077 4603 -3537 392145 -188426 -12783 132771 -78032 -281098 -56339 -41165 -38071 157294
6930 -161096 -269899 -183132 287675 -80560 123494 70694 -120357 42080 113974 54931 -137698
6918 13794 9108 -103170 -180423 -206311 191583 63535 77283 174558 -193736 -62515 295328
6906 13816 -302888 17955 146586 51550 -107035 817 -206441 159214 -292650 -80761 -108615
6895 -108615 -119079 99878 -32939 -487811 -45604 -40757 -208403 -69974 8551 -102645 167569
6883 234116 45821 -276392 -23066 -62553 -291233 263092 33858 -137421 53354 -77191 -218181
6872 -218181 1673 263852 -222060 -6123 232412 251353 160703 -164925 -76208 237680 -101926
6860 212547 -311127 -289836 -162694 364610 -209288 59819 251630 -129821 26598 -7449 -207309
6849 -207309 61883 -108179 81424 91698 -163474 240074 -234239 336834 44519 -49808 74018
6837 -195011 -130673 259921 -134555 62570 21409 -229605 -30781 181714 371138 -57350 120320
6825 62389 -11747 -389154 -148240 -74830 -83102 139845 -6037 -388889 -99586 -23067 -187992
6814 -187992 -233152 24770 -208890 -226972 48527 -83366 -156249 -306521 -169741 226060 -44628
6802 262243 -253075 -5667 -23387 -204678 443818 -429245 212214 235523 -273080 200234
6791 144956 -245078 -265690 -139104 116972 -43219 -190557 164029 400641 84579 -182814
6780 218909 -141695 -147329 -176514 -205868 219785 -125168 39711 -233583 -49103 -106087 197941
6768 98595 -48361 -113758 230973 124784 -96832 -331097 16234 -122268 255608 -99459 -406985
6757 -406985 -88077 182699 -167637 -195785 267566 -76184 -98033 -24138 290444 113671 -89102
6745 137557 -40743 -66364 -98782 -93196 215783 -199012 -42756 161908 -142505 154542 323647
6734 323647 -80217 38193 -66832 -80678 -153379 -187371 -85591 -34813 200396 -309949 -40264
6722 118148 175495 121722 -338611 -69598 125401 -144630 -183711 -44702 33613 293305 90904
6710 -206320 364887 -183431 -126314 248965 118124 -18186 -210540 214516 197029 60028
6699 58933 -178506 -80976 -20498 120709 -144151 -368539 408458 553603 -51504 16437 -62452
6687 -29650 -259717 77545 106724 -145440 -254547 91560 -115073 154502 -23239 -114889 105382
6675 -170037 209036 -134366 -47557 70393 59812 10169 211787 91485 -232856 46319 7083
6663 63753 -155694 -124350 144788 27795 -5599 -2390 4295 -138694 95609 -68270 73026 87443
6651 87443 103414 126041 -131052 -89745 -206572 -192351 -209629 -59187 -73328 95450 19392
6639 -264972 -110583 38841 -8414 127114 -211431 3309 -26905 233065 175609 228496 -87840
6627 -39370 -325021 -95832 108699 -270 16533 -134225 -150118 -161909 84240 28964 83748 -197970
6614 109067 -43635 34651 37808 -80416 -270928 103128 132646 -174037 -260347 28670 -121271
6602 -57644 11002 -49110 117318 221380 -43818 -295206 265537 -33669 32253 -374462 237260
6590 -101409 -34367 -96560 183814 37913 34656 49735 -7866 -158488 82795 130752 281771
6579 281771 4736 -123725 -21974 187954 140101 106494 -104904 129444 -200993 87565 -116757
6567 -213689 61564 -33686 35925 -166605 -71473 -276997 -6325 99863 -101871 235694 -124674
6555 -4778 -229916 41048 80781 -12362 -151020 91835 479043 204350 70575 9630 106146
6544 106146 -214868 -107728 -48732 385000 -249543 164979 -103442 219573 -22700 243671
6533 17165 7916 70579 -92422 -239068 -51536 87235 222353 -472620 -101004 83526 -26871
6521 -85711 244623 135787 159307 -343931 -113149 14695 -311901 -106321 151426 124202
6511 124202 -60059 -2093 -152821 96403 118813 135702 -116927 -66569 -323354 -186362 -19856
6499 238124 18721 -93246 36400 -322266 -196093 -16727 -124344 -286535 43392 20410 28
6487 173176 215506 65732 242058 -142293 424741 -351133 73410 434421 -342116 -51138
6476 -261839 26068 -125953 -88397 -204433 -205646 191375 -207726 229297 -123207 -194662 -169211
6465 -169211 49990 55931 -260908 -133969 -85042 -388144 -78938 245174 -36522 -266558 151444
6453 13887 -1900 -89835 -337575 -85255 -161707 15651 33300 -117737 -340477 -131115 172698
6441 285198 -79942 -10112 -166817 161399 82554 -40681 -263129 -176850 71895 -14195 193738
6429 13109 -184345 50429 22770 -21120 283788 -75677 148668 156795 -152206 -156868 73072
6417 228679 111717 -46767 113587 -130742 79125 -123218 -184529 -282469 -205278 328387 32359
6405 178795 -172075 241757 -8655 241359 187687 63618 -112086 -194280 -350890 215185 -42685
6393 -190514 -61289 161214 -161608 -246107 -276788 23651 -164841 362542 67356 196631 122979
6382 122979 179659 52771 216648 100781 -143810 -35316 -200957 -120519 248297 -15363 -15737
6371 -15737 351472 20540 -363839 -212284 -100800 253307 148611 -298119 -228831 -166041
6361 -166041 -184310 189016 6053 88919 192452 22244 60140 -122573 -205835 -2677 149324
6349 -204138 -7333 -22346 149410 -202319 319958 145308 -12608 -249721 98731 -99976 -91416
6338 -91416 75829 132718 -1497 -185831 -168026 -187552 -17178 -11282 -202463 -41773 206212 6186
6325 40046 124301 -66130 -226944 430871 57942 -95578 223818 -68389 286535 -51028 118721
6313 -265352 -114654 81195 6489 7289 30603 222200 -40236 -72891 263199 7569 38032 277410
6301 277410 308328 149442 -169085 256333 204442 -150305 72267 -202632 -14965 137471
6290 -98796 -132206 -201065 255903 -25962 -288794 305620 -193967 -97246 100243 -35300 4707
6278 -157331 -273774 58200 134136 -17268 -123223 70178 51096 -231739 -42257 -225141 -109204
6266 -26286 -332298 -32552 -120196 85458 35122 127974 210230 -31546 132701 -66447 163786
6254 -179236 109501 102061 -4350 56467 -524740 -289294 157597 175773 -272205 360332 25218
6242 239530 -334318 -123454 -114189 22267 136846 -43845 -175644 -166478 138443 -176738 59584
6230 3301 -243697 49783 153270 -107715 -252334 238557 -297924 116487 -107514 302833
6219 -121987 -247845 93767 363934 -259758 23661 -98894 286382 344876 -313891 175533
6208 -10872 11837 55406 -165994 -23013 371061 -114065 55450 -232618 365294 290857 845
6196 338111 159204 -61189 -28677 -37160 -140850 217439 172374 -85713 131991 25120 -243368
6184 287900 274229 -50920 67338 125567 496571 -260478 -161429 -284916 -139056 -49668 183135
6172 -179170 28875 86105 -48243 -226749 42949 -1088 -211279 130105 94706 -112406 172119
6160 -211974 -244252 -377125 -201513 145374 -185969 64467 74914 -364594 147975 15425
6149 -105158 137092 16933 183362 110016 183843 250439 -535672 130330 -285265 -24389 317796
6137 278661 -234794 -9585 -197530 -326084 -31466 -19969 -31076 -213886 119407 -146825 -201894
6126 -201894 -4651 -263649 -44697 336855 242007 -301103 -356771 124795 46998 120373 157195
6115 157195 -167134 -223085 318227 115220 -115380 -17538 -40504 -82634 78554 22968 87768
6104 87768 167630 298818 -30702 215029 69723 -276507 274332 -43044 -275269 -160700 76323
6092 -176162 -239754 -195253 201928 78989 -102916 177849 34701 264778 -29609 -289050 -62659
6080 169723 120004 -234800 15145 -10934 21718 -37830 -248377 -190043 -6667 -167543 -22288
6068 -214094 160501 125279 -83205 154571 -298474 2057 11685 18568 71193 -238960 154444
6056 -22579 -3622 -71699 68298 155580 168358 -39282 -63326 -259485 -164133 -273772 373059
6044 -272484 157558 57309 7192 -31330 227095 -96776 -10992 27928 56567 30302 178761
6033 178761 174255 242094 131485 3366 -116643 16134 216580 146589 235641 -92424 -128278
6022 -128278 -50584 -58479 70021 -145971 -62424 -152291 -364148 117054 -201247 312704 -30578
6010 -58028 -345937 -45970 -1890 -169096 -244927 -74961 164760 198300 32847 -163145 -362 360632
5997 17045 10648 153831 359899 -33057 -1272 188573 -181929 55134 -105442 -26758 -50354
5986 -50354 -157740 -204551 114518 114927 -34378 -94913 -108375 84914 232319 -201662 -257611
5975 -257611 32558 81526 111525 -74616 79264 21112 90770 101250 212660 -211878 -16646
5963 103713 -117004 -164659 -65891 733 17325 199192 58640 72650 6177 124080 -36904 -217467
5951 -217467 113162 42976 97115 68191 -269119 -66522 -38050 -225344 -93652 52160 -23152
5939 -66249 -133282 -110629 265315 74713 165291 -85484 11788 105028 -24940 -166229 90202
5927 96552 96717 -114542 -271580 -23594 31587 -93102 131374 57537 -288473 -124855 292590
5915 20484 451816 35405 -60907 -6993 -53783 -15821 85977 862 -258636 18499 -303046 39879
5902 198452 273207 -83067 -28051 23750 -103891 86557 -12748 43279 196611 -29503 124177
5890 -21856 -282631 -29229 -305710 -142801 -130595 -140979 8165 -60078 102508 22072 -183514
5878 -242931 -116861 -204756 201666 -278924 151839 4065 -261053 -99234 -165854 -26726 43849
5866 -32138 126802 -332646 91976 -118168 -277451 -105877 89432 6272 -178014 -182826 61114
5854 100545 -181310 32468 37661 316317 -62634 180873 -198555 147019 57457 -100167 251962
5842 8002 -25705 272224 147673 53234 114142 -59024 97756 -197529 -400900 -132684 -167781
5831 -167781 178158 -5121 163684 68703 11795 -135053 114166 -283245 -83637 -42850 -20916
5819 158463 248811 265605 -177960 -10056 -158476 -34953 115432 -249569 102179 78549 103817
5808 103817 -30703 -86747 -144004 37772 -40885 33078 -72012 -47482 4445 -184889 206000
5796 -480361 -537111 -267489 -102420 56497 114071 -103936 205806 -321065 197402 -50926
5785 81810 117638 -120220 -24139 157619 252017 -118183 54563 221995 -272328 -141403 37397
5773 164627 -91424 -188296 11441 -125366 13278 157331 210700 5778 169859 -58534 14983
5761 150471 -271007 172111 68161 -326820 -120850 -461411 37883 -164642 -213304 -25493
5750 -177079 -64217 417089 120263 39802 121486 230066 -49320 -224392 186668 165703 -62934
5738 -13571 -783 -38588 187924 -279201 51102 -81522 106870 -26053 91167 -86264 -258860
5727 -258860 -7209 -69076 -27430 38005 -50104 -87696 -369480 -130766 246678 231730 -151004
5715 -197587 15224 -24831 -281542 -292160 38696 -189292 -170458 83542 59929 -150459 59186
5703 -113267 -27925 -40653 -237825 62861 -115322 138461 -95866 66994 -270216 -63069 -94474
5692 -94474 -61244 -144591 127299 -25880 -191462 -245334 -10173 -161281 66567 -14020 28479
5680 -214064 224078 157779 -56663 144901 31959 -200987 14039 -233573 -225232 -149986 -89804
5669 -89804 -17478 56451 -214091 -88612 -254335 384378 288682 244617 -210934 62894 -179998
5657 218264 -254841 -58555 -134345 -121649 49320 -6276 -53024 81383 -84272 178300 22051
5645 -226956 22592 -18264 24291 -78176 51110 13226 -219483 -219853 -127610 -75643 -201541 207138
5632 104815 -176644 -4498 -106974 207075 -45976 -1830 36380 216445 173466 34596 95452
5621 95452 -251205 87825 159362 239312 170481 -52723 -170191 44527 314187 -78398 38347
5609 117308 -53115 267620 183885 128797 -193060 -238016 72081 -76498 58527 50857 202242
5598 202242 -61013 -29920 183295 96487 -29559 99018 97923 63033 -1691 165966 -137480
5586 93840 403193 10961 -53937 -50422 404620 14736 21657 -115174 -88217 57934 -41123 -30743
5574 -30743 -9595 -73848 230994 -101011 63870 50310 -6157 -94852 107885 -132489 -44149
5562 130244 5838 36161 -111947 -67445 116117 -327118 140805 316838 79846 55237 124242
5551 124242 4717 345362 272263 -23534 -27697 -170993 203609 -196200 46049 -88488 275880
5539 -97894 152900 -108804 -21703 -16648 28246 146062 -58348 -82606 -150302 -113264 1911 49683
5527 49683 83233 178851 87866 -209755 429560 -123924 43525 186860 -37212 110105 -265704
5515 -2639 -282531 -120041 -288812 -170291 -412540 81752 15901 -37899 158284 85086 -34430
5503 -9306 -206043 -73401 -104613 -145825 177735 198658 154905 175788 216149 121700 277509
5492 277509 182210 116082 121118 -171565 237887 73510 -250574 -65165 -44074 286699 47444
5480 13448 25077 -96555 57797 -185572 -956 -107626 328689 -106486 -165286 -322351 -360131
5469 -360131 47556 -44134 60575 79812 143926 276358 179423 383212 -93624 -94389 -96198 -383
5456 -62747 -101503 145457 88828 -106339 -122068 83060 -23524 376209 30380 -45704 -63686
5445 -63686 10713 -88733 -88033 -185493 14434 54704 -165695 -238731 -270065 325305 53631 -212834
5432 348179 261921 24281 95284 77257 65843 203399 -248557 206378 -82795 -135263 -213270
5421 -213270 1297 -249982 252281 -234638 -242776 51116 -8193 -54428 -401500 -296458 105362
5409 -261743 -121571 -68706 254519 -89265 12083 25779 192122 228591 14311 87732 -134469
5397 163149 76333 118483 321304 101273 -174444 39747 -176635 39561 116206 85381 -103569
5385 -68295 145997 -168277 -196953 -11808 222204 -22755 16865 -24775 320243 117484 130721
5374 130721 17119 411305 -43626 85497 47584 -218069 -139869 -127113 90108 484272 -34601
5362 -250228 -107305 13425 11315 -9659 -43484 -39542 -28832 -55968 32244 -174646 -60018 -315728
5350 -315728 140928 -164064 -213494 31654 -278857 -240936 -147162 -153496 99906 141209 -89351
5338 30172 -149293 150509 -92506 -106872 37296 -279429 22216 -236287 225094 -20149 -381828
5327 -381828 290373 -3635 189293 508845 59011 -24517 25033 64879 115 3211 49093 318815
5315 318815 108502 168308 320810 -153379 -35391 88949 30233 77414 212918 181162 -298679
5303 14307 28928 26580 28732 152768 61045 -443594 -54909 -76732 -78036 181293 15521 209418
5291 209418 170713 72632 -170224 355322 -129882 42321 10879 -199040 -79965 -148288 -45215
5279 41853 -267424 88261 -8367 69081 -180981 178731 6591 -208436 -99465 26264 -119486
5267 103011 -74982 -192407 242895 -26555 -8468 196470 69208 132970 -74124 218425 -173163
5255 -69066 -327090 -88341 -64285 150035 -753014 127099 -69279 94043 -86409 85873 394069
5244 394069 -117678 12726 -162515 120654 -195582 -214598 105578 38669 -32708 -132099 -131633
5233 -131633 30772 373202 139237 30770 -38525 -9427 -336685 71839 221329 -308266 190014
5221 -305715 17047 124983 132456 -196738 2517 221927 -122603 -64643 -206683 167175 -313654
5209 -223930 -179888 82821 153315 -263059 -39840 124509 -88917 -158800 91745 3484 -116718
5197 188644 97036 -104829 -103544 170862 9778 178892 173396 -23744 -399 -155099 160565 -177662
5184 175525 -28596 -195191 1270 -57887 -457000 186298 -183953 88394 500131 141868 15802
5172 -244658 -167018 -189402 156808 -126180 136263 63592 -169794 -65167 70083 101755 -337521
5160 48557 200522 -35027 -79758 172292 232660 83869 123283 2777 -87631 33991 90392 -196983
5147 208593 -168632 -50713 376678 -519108 58371 132725 -60796 154058 271350 -177423
5136 149225 -11026 -101165 149390 175524 -142845 -97538 -89778 285779 167132 -78955 44825
5124 -30880 101087 -219914 14184 546144 -33371 -211136 -104847 -214911 248368 385113
5114 385113 -165510 -105336 41601 -263813 307749 -238282 217520 238033 -312506 -13914
5103 36271 195251 76782 -155714 294582 139601 -42936 -12286 -248129 370177 196007
5093 196007 21707 285372 160604 -130518 217386 -222272 113635 9089 -71491 8194 -31483
5081 -28607 254858 55654 279284 -25413 -134153 43370 -416055 7992 37589 -207765 206806
5069 91808 -34251 126920 8707 -183209 -106169 420444 -124371 133041 -453348 -16188 72774
5057 -6067 128169 764 -254077 -189859 249397 249263 -42501 85791 -190195 122665 -46539 119704
5044 140780 -45564 195974 -65821 -96390 -64628 178515 -241998 -44013 201336 475604 36437
5032 186820 251133 140735 -193185 -65773 -209528 203487 -251822 132729 83038 -21910
5021 -22785 238382 159524 58830 130205 -83600 31007 -319533 139170 -253573 -203067 46721
5009 -32069 85681 -69991 -228013 -196026 -227985 272674 214677 79665 -332617 -251710 96947
4997 -237584 83116 -28803 -55864 180451 2429 157695 -182661 221048 80728 328702 -144322
4985 -78706 73207 -50555 163794 -434312 48945 -366744 9470 42728 -131348 31552 41739
4974 41739 125296 -340574 -211741 153186 -194202 -8148 -259736 -80086 180125 -146907 128442
4962 -270077 258057 -124885 119548 -123635 -106920 -341740 -48893 -108488 29411 222145
4952 222145 244874 85374 -172268 -141681 64169 67135 -77358 -345897 -52734 26495 -31351
4940 -170681 -94989 43103 47570 82899 -20720 -19306 197373 20850 13909 -126614 1761 -168905
4927 -119865 55802 207254 12197 100892 -98596 234009 115989 -62236 -27942 -314641 42639
4915 -165070 352267 -39806 2439 72169 -77844 75833 272991 95887 -95509 -130328 429565
4903 155789 -234488 -155483 28895 97265 -191489 -77408 -12637 167276 171211 228228 4867
4891 141361 138144 95811 -187854 27449 173328 3285 33264 251107 249922 -16907 -251108
4880 -251108 222530 64565 -75666 -129864 95749 200145 -214311 -18354 -129176 -40424 -348405
4869 -348405 -73635 163598 -126374 -68000 -214066 -11992 -101229 72766 273824 95294 -195028
4857 -207577 217192 151601 158378 -20927 -156264 239799 -234694 -93233 512749 -72072 -2880
4845 172209 159859 73835 29250 -11065 232261 -210472 151065 -104792 55426 -9268 -144109
4834 -144109 146130 287668 70708 -118911 -23851 -115870 -29100 170417 283395 -141924
4823 128706 -7498 69730 -238512 -125068 -34925 -183331 274674 247684 -21430 146005 263220
4812 263220 -238400 68926 -149170 -131943 39007 -352681 -195121 376814 -140782 -426004
4802 -426004 22820 -253893 -2468 119564 126688 -393585 241609 -233419 -36493 -37056 -146401
4791 -146401 -46481 79237 -34829 -91530 228995 -237493 41545 37980 259244 -27975 86329
4779 -47897 35382 -335234 5850 176387 -170196 -106913 -110453 474768 -306851 -111262 -342925
4768 -342925 10221 244762 -107757 -452498 -179477 -77944 22532 -104559 -30090 58092 304038
4757 304038 -1635 134826 -113981 -66946 107776 25155 407226 283904 -50629 -63981 -23252
4745 42183 -64011 61645 377837 48778 -215626 111808 157525 -197761 -130140 34937 -20986
4733 19883 158004 191581 168600 -25414 245075 -29295 -119373 41743 -28529 120627 -302351
4721 154202 18109 -41007 92978 446582 185058 -48220 5672 334708 85170 57306 -63419
4709 -166715 82654 234805 -372661 17255 -243837 24558 69453 289028 -116928 33869 137212
4698 137212 65948 -4669 -86703 -74937 106989 15944 -342812 157194 -17152 75090 61919
4687 61919 83483 114682 171758 -370999 12079 -306600 111204 68043 195411 -132386 139790
4675 -173685 77757 184135 11593 188978 -239191 54581 -128460 84554 -184713 -25044 -172409
4664 -172409 -148647 300081 -9233 163471 85951 -221674 -234788 213716 117666 -200932 212245
4652 6730 139941 237236 127949 218787 76569 209131 100676 269850 -223496 -67435 -74888
4641 -74888 55161 344677 41478 -63823 -78003 -4977 -248658 -20320 16422 92322 -52063 320292
4628 -36290 -3061 -158624 -73743 85308 87056 292648 -157940 83299 371354 -44983 -110624
4617 -110624 -65265 182259 240201 195149 211837 -100174 -88648 172344 -182339 -219692 74042
4605 97735 -295183 75317 61177 209392 -359725 151981 -76530 -98241 -38841 -1208 283049
4593 206161 48561 294126 -140734 55410 195111 24547 276324 -447194 -65296 321681
4582 61041 -306521 -232273 -72512 -141280 185655 -41117 42314 -307630 -167322 -84899 -409256
4571 -409256 111290 -247715 -17057 -224251 -498371 231354 -166710 284358 -136347 10810
4560 202404 -356333 -294879 -218861 -66035 -378617 -16806 24662 304963 108696 236114 440254
4549 440254 -26977 71009 -25104 15835 150402 -188634 -266243 162710 -121254 80240 -86810
4537 40956 185902 -209453 -130667 -346534 -233592 -167704 -283289 -160632 97637 213840
4527 213840 334118 7293 -131015 -158981 220327 9630 379912 -150418 55967 -67016 27806
4515 -129729 -46518 -30765 -201209 -292724 -212176 -144442 -107544 -123384 -77303 69024 -123903
4503 192905 -166263 97319 -63000 -66634 -404843 -27576 -238520 176297 84250 50754 325076
4492 325076 -48827 33376 417000 288348 -9816 -33688 94283 39624 391788 -35309 -13715
4480 76688 -181842 -60995 -221120 112959 121431 22915 203183 -170409 -21867 239276 59955
4468 162116 -116 -163905 20782 248852 369395 205861 165150 -164622 -150401 370647 174186
$$ [...]
##END NTUPLES=NMR SPECTRUM
##END=
