
##TITLE=UV1102_M1_1161-1249_7185105_ww0NWCGROB
##JCAMPDX= 6.0         $$ Bruker NMR JCAMP-DX V2.0
##DATA TYPE= NMR SPECTRUM
##DATA CLASS= NTUPLES
##ORIGIN= BRUKER
##OWNER= Administrator
$$ 1.72 TOPSPIN		Version 2.1
$$ 2012-12-05 19:14:43.388 -0500  Administrator@X
$$ Compression mode = diff/dup
##.OBSERVE FREQUENCY= 400.02188249412
##.OBSERVE NUCLEUS= ^1H
##.ACQUISITION MODE= SIMULTANEOUS (DQD)
##.ACQUISITION SCHEME= undefined
##.AVERAGES= 64
##.DIGITISER RES= 22
##SPECTROMETER/DATA SYSTEM= spect
##.PULSE SEQUENCE= noesygpps1d.comp
##.SOLVENT NAME= COFFEE_meoh
##.SHIFT REFERENCE= INTERNAL, COFFEE_meoh, 1, 14.96106
##AUDIT TRAIL= $$ (NUMBER, WHEN, WHO, WHERE, PROCESS, VERSION, WHAT)
$$ ##TITLE= Audit trail, TOPSPIN		Version 2.1
$$ ##JCAMPDX= 5.01
$$ ##ORIGIN= Bruker BioSpin GmbH
$$ ##OWNER= Administrator
$$ $$ E:\/data/COFFEE/nmr/UV1102_M1_1161-1249_7185105_ww0NWCGROB/12/pdata/1/auditp.txt
$$ ##AUDIT TRAIL=  $$ (NUMBER, WHEN, WHO, WHERE, PROCESS, VERSION, WHAT)
(   1,<2012-12-05 19:14:37.310 -0500>,<Administrator>,<X>,<go>,<TOPSPIN 2.1>,
      <created by zg
	started at 2012-12-05 19:03:06.824 -0500,
	POWCHK enabled, PULCHK disabled,
       configuration hash MD5:
       86 BA 57 50 F2 9D 5C 9B 26 00 A9 28 5F 66 2E 89
       data hash MD5: 64K
       07 F8 AB B6 9F DE 75 87 AE 6D EA 67 59 28 BD C8>)
(   2,<2012-12-05 19:14:40.435 -0500>,<Administrator>,<X>,<proc1d>,<TOPSPIN 2.1>,
      <Start of raw data processing
       efp LB = 0.3 FT_mod = 6 PKNL = 1 PHC0 = 0 PHC1 = 0 SI = 128K 
       data hash MD5: 128K
       C5 0C 09 B3 3E AA 83 95 20 61 EB 0D 7E 34 E7 9F>)
(   3,<2012-12-05 19:14:41.498 -0500>,<Administrator>,<X>,<proc1d>,<TOPSPIN 2.1>,
      <pk PHC0 = -75.84961 PHC1 = 0 
       data hash MD5: 128K
       1F 93 6E 61 02 0B 46 63 6E 35 57 77 1A 54 AE 7D>)
(   4,<2012-12-05 19:14:42.216 -0500>,<Administrator>,<X>,<proc1d>,<TOPSPIN 2.1>,
      <abs ABSG = 1 
       data hash MD5: 128K
       3B 5D 1C 07 D8 6C E8 DC A7 55 2B 35 A8 20 15 63>)
(   5,<2012-12-05 19:14:42.404 -0500>,<Administrator>,<X>,<proc1d>,<TOPSPIN 2.1>,
      <abs ABSG = 2 
       data hash MD5: 128K
       FD DC 77 51 ED 26 DE 6C 0E 4F 68 78 23 2C 80 80>)
(   6,<2012-12-05 19:14:42.669 -0500>,<Administrator>,<X>,<proc1d>,<TOPSPIN 2.1>,
      <abs ABSG = 3 
       data hash MD5: 128K
       E5 24 4B 78 E2 4D B7 98 FD B6 79 52 3A 82 80 EA>)
(   7,<2012-12-05 19:14:42.841 -0500>,<Administrator>,<X>,<proc1d>,<TOPSPIN 2.1>,
      <abs ABSG = 4 
       data hash MD5: 128K
       D9 E6 29 63 86 10 7F BD C8 88 FD 60 DD 25 32 5E>)
(   8,<2012-12-05 19:14:43.029 -0500>,<Administrator>,<X>,<proc1d>,<TOPSPIN 2.1>,
      <abs ABSG = 5 
       data hash MD5: 128K
       AE B3 FC A3 B8 ED 3F 5C 83 E0 5A 8F 81 E1 FB 4D>)
$$ ##END=
$$ 
$$ $$ hash MD5
$$ $$ 8A E5 EE 0A D5 3F 05 9B F8 38 F4 AE 98 E5 A7 9B
##$RELAX= 
##$RELAX= 
##$RELAX= 
##$RELAX= 
##$RELAX= 
##$RELAX= 
##$RELAX= 
##$RELAX= 
$$ Bruker specific parameters
$$ --------------------------
##$DU= <E:\>
##$EXPNO= 12
$$ [...]
##$TP07= 0
##$TPNAME0= <>
##$TPNAME1= <>
##$TPNAME2= <>
##$TPNAME3= <>
##$TPNAME4= <>
##$TPNAME5= <>
##$TPNAME6= <>
##$TPNAME7= <>
##$TPOAL= (0..7)
0.5 0.5 0.5 0.5 0.5 0.5 0.5 0.5
##$TPOFFS= (0..7)
0 0 0 0 0 0 0 0
##$TUNHIN= 0
##$TUNHOUT= 0
##$TUNXOUT= 0
##$USERA1= <user>
##$USERA2= <user>
##$USERA3= <user>
##$USERA4= <user>
##$USERA5= <user>
##$V9= 5
##$VALIST= <valist>
##$VCLIST= <CCCCCCCCCCCCCCC>
##$VD= 0
##$VDLIST= <DDDDDDDDDDDDDDD>
##$VPLIST= <PPPPPPPPPPPPPPP>
##$VTLIST= <TTTTTTTTTTTTTTT>
##$WBST= 1024
##$WBSW= 4
##$XGAIN= (0..3)
0 0 0 0
##$XL= 0
##$YL= 0
##$YMAX_a= 5756818
##$YMIN_a= -11570358
##$ZGOPTNS= <>
##$ZL1= 120
##$ZL2= 120
##$ZL3= 120
##$ZL4= 120
##$ABSF1= 14.96106
##$ABSF2= -5.597122
##$ABSG= 5
##$ABSL= 3
##$ALPHA= 0
##$AQORDER= 0
##$ASSFAC= 0
##$ASSFACI= 0
##$ASSFACX= 0
##$ASSWID= 0
##$AUNMP= <proc_prof1d_extract.lims>
##$AXLEFT= 0
##$AXNAME= <>
##$AXNUC= <1H>
##$AXRIGHT= 0
##$AXTYPE= 0
##$AXUNIT= <>
##$AZFE= 0.1
##$AZFW= 0.1
##$BCFW= 0
##$BC_mod= 0
##$BYTORDP= 0
##$COROFFS= 0
##$CY= 15
##$DATMOD= 1
##$DC= 0
##$DFILT= <>
##$DTYPP= 0
##$F1P= 0
##$F2P= 0
##$FCOR= 0.5
##$FTSIZE= 131072
##$FT_mod= 6
##$GAMMA= 0
##$GB= 0
##$INTBC= 1
##$INTSCL= 1
##$ISEN= 128
##$LB= 0.3
##$LEV0= 0
##$LPBIN= 0
##$MAXI= 10000
##$MC2= 0
##$MEAN= 0
##$ME_mod= 0
##$MI= 0
##$NCOEF= 0
##$NC_proc= -2
##$NLEV= 6
##$NOISF1= 0
##$NOISF2= 0
##$NSP= 0
##$NTH_PI= 0
##$NZP= 0
##$OFFSET= 14.96106
##$PC= 1
##$PHC0= -75.84961
##$PHC1= 0
##$PH_mod= 1
##$PKNL= yes
##$PPARMOD= 0
##$PPDIAG= 0
##$PPIPTYP= 0
##$PPMPNUM= 2147483647
##$PPRESOL= 1
##$PSCAL= 4
##$PSIGN= 0
##$PYNMP= <proc.py>
##$REVERSE= no
##$SF= 400.020009611735
##$SI= 131072
##$SIGF1= 0
##$SIGF2= 0
##$SINO= 400
##$SIOLD= 131072
##$SPECTYP= <>
##$SREGLST= <1H.CDCl3>
##$SSB= 0
##$STSI= 131072
##$STSR= 0
##$SW_p= 8223.68421052631
##$SYMM= 0
##$S_DEV= 0
##$TDeff= 65536
##$TDoff= 0
##$TI= <>
##$TILT= no
##$TM1= 0
##$TM2= 0
##$TOPLEV= 0
##$USERP1= <user>
##$USERP2= <user>
##$USERP3= <user>
##$USERP4= <user>
##$USERP5= <user>
##$WDW= 1
##$XDIM= 131072
##$YMAX_p= 419567678
##$YMIN_p= -13529
##$CURPLOT= <Network HP LaserJet P1505>
##$CURPRIN= <$Network HP LaserJet P1505>
##$DFORMAT= <normdp>
##$LAYOUT= <+/1D_H.xwp>
##$LFORMAT= <normlp>
##$PFORMAT= <normpl>
##$SURQMSG= 1
$$ End of Bruker specific parameters
$$ ---------------------------------
##NTUPLES= NMR SPECTRUM
##VAR_NAME=  FREQUENCY,     SPECTRUM/REAL,   SPECTRUM/IMAG
##SYMBOL=    X,             R,               I
##VAR_TYPE=  INDEPENDENT,   DEPENDENT,       DEPENDENT
##VAR_FORM=  AFFN,          ASDF,            ASDF
##VAR_DIM=   131072,        131072,          131072
##UNITS=     HZ,            ARBITRARY UNITS, ARBITRARY UNITS
##FACTOR=    0.0627417313425164, 1,          1
##FIRST=     8223.62146879497, 1979,         -49954
##LAST=      0,             2771,            -50473
##MIN=       0,             -13529,          0
##MAX=       8223.62146879497, 419567678,    0
$$ Real data points
##PAGE= N=1
##DATA TABLE= (X++(R..R)), XYDATA
$$ [...]
67962 98333 95244 91871 89049 87084 85687 84448 83164 81768 80237 78633 77024 75277 73158 70754
67948 70754 68580 67093 66272 65845 65654 65570 65297 64667 63966 63628 63655 63697 63611 63657 64227 65701 68405 72199 76157
67929 76157 79225 81246 82898 84623 86235 87635 89062 90341 90689 89894 89049 89313 90383 91039 90940 90961 91735
67912 91735 92701 92826 91642 89293 86139 82704 79639 77316 75578 74101 72853 72052 71804 71924 72031 71790
67896 71790 71173 70439 69753 68969 68057 67538 68097 69779 71940 73933 75419 76121 75868 75092 74651 74905 75330 75336
67878 75336 75011 74773 74740 74840 75192 75862 76548 76945 77310 78147 79462 80711 81434 81505 80821 79262 77119 75208
67860 75208 74263 74295 74665 74751 74501 74319 74423 74384 73545 71826 69793 67912 66162 64569 63583 63420 63431 62729 61293
67841 61293 59946 59417 59919 61427 63596 65459 66020 65404 64800 64984 65498 65604 65467 65896 67321 69585 72446
67824 72446 75753 79230 82563 85646 88458 90816 92565 93882 95049 96005 96452 96287 95615 94434 92711
67809 92711 90717 88825 86915 84402 81023 77292 74024 71684 70338 69860 69857 69661 68824 67656 66947 67077
67793 67077 67578 67649 66975 65882 64785 63686 62348 60830 59615 59099 59115 59187 59130 59134 59285 59321 59065 58833 59157
67774 59157 60160 61447 62598 63565 64543 65623 66703 67675 68652 69930 71755 74083 76587 78861 80582
67759 80582 81526 81673 81407 81455 82336 83897 85515 86711 87387 87564 87267 86745 86364 86015 85009 83014 80908
67742 80908 80072 80724 81506 80991 79260 77593 76928 77067 77218 76707 75134 72451 69283 66769 65594 65247 64584
67725 64584 63061 61170 59725 59115 59252 59855 60539 60894 60738 60202 59437 58408 57152 56053 55535 55582 55832
67708 55832 56134 56719 57689 58619 58823 57969 56346 54671 53697 53853 55001 56535 57788 58426 58546 58509 58704 59286
67690 59286 60046 60576 60644 60404 60256 60520 61196 61872 61956 61206 60066 59227 58835 58445 57843 57477 57786 58463 58846
67671 58846 58844 58939 59338 59641 59478 59094 59127 60061 61973 64497 66901 68504 69271 69801 70628 71737 72849 73816
67653 73816 74476 74462 73572 72196 70960 69984 68850 67447 66488 66824 68297 69575 69360 67693 65851 64932 64842
67636 64842 64823 64682 64978 66133 67818 69361 70312 70482 69877 68896 68272 68435 69080 69582 69661 69515 69548 70169 71511
67617 71511 73066 73951 73854 73413 73305 73403 73374 73667 75080 77459 79676 80976 81616 81989 81894 81047 79724 78381
67599 78381 77046 75601 74331 73643 73387 72947 71988 70772 69733 69062 68756 68852 69377 70091 70411 69778 68243
67582 68243 66575 65532 65092 64680 64056 63482 62970 62009 60445 59129 59108 60365 61903 62932 63475 63856 64187
67565 64187 64436 64533 64207 63122 61428 59874 59092 58993 59091 59226 59584 60114 60332 59847 58865 57997 57655 57723 57781 57474
67545 57474 56701 55583 54388 53493 53320 54194 56131 58677 60999 62305 62342 61553 60692 60197 59901 59250 57852
67528 57852 55871 53954 52726 52287 52232 52083 51614 50745 49455 48018 47145 47488 48937 50630 51710 51999 51946
67511 51946 52174 53063 54508 55926 56651 56480 55802 55176 54898 54929 55056 55031 54748 54369 54160 54179 54270 54339 54397 54331 53976
67490 53976 53521 53510 54176 55006 55253 54734 53822 52782 51486 49865 48364 47676 48028 48876 49477 49776 50532 52411
67472 52411 55088 57529 59070 59831 60095 59824 59024 58181 57909 58317 58965 59302 58951 57844 56407 55485 55701
67455 55701 56921 58479 59787 60549 60634 60143 59468 58984 58676 58282 57716 57092 56529 56176 56255 56697 56957 56667 56412
67436 56412 57322 59745 62708 64782 65238 64349 63016 62216 62393 63132 63606 63472 63065 62725 62339 61775 61297 61197
67418 61197 61256 60971 60169 59084 57929 56775 55822 55443 55786 56538 57197 57475 57381 57094 56917 57254 58317 59761
67400 59761 60751 60634 59579 58433 57956 58244 58837 59131 58718 57635 56429 55763 55773 55979 55909 55536 54998 54344
67382 54344 53872 54222 55554 56925 57208 56543 56129 56556 57085 56866 56171 55935 56522 57418 57871 57476 56386 55326
67364 55326 55129 55904 56815 57043 56767 56813 57613 58908 60311 61610 62554 62939 63009 63279 63769 63843 63085 61941 61095
67345 61095 60542 59777 58765 58135 58294 58882 59392 59909 60742 61607 61829 61417 61313 62210 63584 64350 64218 63943
67327 63943 64359 65691 67805 70551 73602 76248 77727 77700 76379 74313 72124 70245 68816 67845 67399 67443
67311 67443 67574 67231 66253 65045 64178 64032 64779 66320 68142 69597 70545 71516 73129 75499 78253 80795
67295 80795 82494 82996 82616 82172 82218 82613 82888 82710 81889 80389 78618 77318 76811 76613 76093 75180 74110 72873
67277 72873 71443 70249 69817 70020 70188 69933 69431 68999 68895 69570 71528 74703 78296 81394 83596 84974
67261 84974 85763 86189 86340 86055 85145 83812 82666 82217 82433 82873 83059 82739 81935 80902 79972 79363 79106 79086
67243 79086 79127 79139 79248 79644 80278 80859 81207 81291 80913 79812 78340 77533 77965 78893 79125 78517 77951 78027 78527 79185
67223 79185 80107 81215 81981 82157 82204 82578 83009 82976 82516 82073 81783 81430 80999 80791 80963 81312 81613 81955 82619
67204 82619 83731 85063 86173 86681 86464 85629 84512 83761 84095 85625 87575 89098 90245 91681 93472 94792
67188 94792 94997 94356 93491 92652 91990 91987 92938 94268 94970 94679 93933 93462 93623 94411 95588 96728 97426 97553 97223
67169 97223 96617 96013 95719 95737 95683 95335 95054 95355 96269 97455 98698 99891 100713 100855 100510 100209 100209 100418 100810
67150 100810 101451 102242 103109 104358 106213 108023 108657 107851 106590 105896 105818 105871 105900 106095 106558 107242 107989 108428
67132 108428 108225 107739 107880 108934 110019 110233 109819 109584 109600 109303 108735 108810 110250 112837 115854 118685 120909
67115 120909 122366 123363 124442 125774 127121 128415 129874 131453 132679 133248 133347 133165 132573 131643 131035 131411
67099 131411 132655 134052 135075 135775 136547 137797 139625 141616 143100 143790 143923 143708 143061 142152 141726 142405
67083 142405 144009 145969 148021 149941 151087 151053 150600 151016 152475 153839 154276 154355 155232 157348 160227 162998
67067 162998 164810 165363 165459 166538 169150 172306 174764 176470 178202 180239 182200 183948 185849 188038 190064
67052 190064 191452 192217 192752 193536 195013 197330 200102 202714 204960 207113 209377 211607 213608 215428 217197
67037 217197 218905 220431 221676 222727 224005 226074 228994 232043 234466 236410 238685 241633 244780 247632
67023 247632 250262 252922 255616 258335 261293 264586 267963 271176 274237 277072 279398 281327 283703 287292
67009 287292 291823 296327 300240 303697 306882 309767 312545 315764 319778 324362 329082 333765 338405 342905
66995 342905 347192 351481 356122 361187 366371 371366 376199 381164 386455 391949 397321 402321 406901 411200
66981 411200 415496 420125 425287 430894 436712 442650 448805 455245 461960 468959 476184 483373 490342 497498
66967 497498 505609 514797 524085 532365 539600 546700 554389 562632 571139 579931 589234 599144 609624 620583
66953 620583 631800 642933 653786 664540 675585 687192 699406 712150 725316 738754 752303
66942 752303 765954 779993 794844 810651 827079 843692 860498 877819 895646 913457 930817
66931 930817 947836 964834 982012 999792 1019071 1040498 1063611 1087268 1110930 1134983 1159804
66920 1159804 1185132 1210614 1236426 1263004 1290471 1318640 1347369 1376602 1406248 1436291 1466892
66909 1466892 1498189 1530126 1562652 1595950 1630270 1665620 1701716 1738144 1774555 1810906 1847564
66898 1847564 1884973 1923149 1961768 2000741 2040328 2080578 2121135 2161876 2203234 2245392 2287519
66887 2287519 2328384 2367572 2405668 2443316 2480673 2517688 2554306 2590248 2624990 2658116 2689445
66876 2689445 2718817 2746188 2771925 2796496 2819701 2840703 2859082 2875360 2890083 2902756 2912244
66865 2912244 2918135 2921239 2922702 2922950 2921492 2917471 2910309 2899993 2886916 2871494 2853999 2834647 2813529
66852 2813529 2790365 2764676 2736511 2706680 2675900 2643924 2610042 2574294 2537585 2500528 2462825
66841 2462825 2424084 2384712 2345528 2306790 2268059 2228849 2188989 2148497 2107553 2066594 2026023
66830 2026023 1985750 1945336 1904664 1864139 1824171 1784877 1746431 1709299 1673761 1639479 1605913
66819 1605913 1572958 1540758 1509022 1477063 1444660 1412470 1381367 1351627 1322971 1295123 1267967
66808 1267967 1241271 1214661 1188008 1161699 1136379 1112396 1089519 1067166 1044997 1023292 1002662
66797 1002662 983340 964896 946770 928898 911557 894693 877796 860543 843284 826671 810921
66786 810921 795698 780641 765815 751564 738086 725175 712324 699070 685281 671217 657378
66775 657378 644352 632655 622389 612938 603264 592836 582192 572321 563499 555056 546232 536931 527521
66762 527521 518320 509601 501702 494618 487590 479620 470567 461388 453176 446303 440610 435959 432135 428460
66748 428460 424081 418735 412883 407041 401281 395454 389500 383351 376879 370301 364338 359554 355625 351696
66734 351696 347372 342915 338419 333457 327876 322420 318017 314630 311350 307580 303630 300105 297164 294556
66720 294556 292005 289337 286507 283726 281339 279282 276872 273427 269024 264430 260325 256787 253511 250349
66706 250349 247564 245604 244545 243756 242316 239841 236729 233541 230487 227704 225594 224382 223579 222432 220780
66691 220780 218962 216936 214215 210781 207402 204684 202349 199843 197217 194926 193086 191501 190224 189459
66677 189459 188906 187780 185661 182969 180405 178250 176419 174946 174017 173543 173018 172026 170777 169903 169629 169407
66661 169407 168596 167335 166339 165865 165316 164038 162139 160306 159106 158727 159043 159530 159424 158379 156820 155251
66645 155251 153438 150857 147782 145280 144020 143657 143519 143392 143323 143120 142479 141430 140350 139637 139457 139633 139660
66628 139660 139052 137835 136499 135450 134738 134338 134196 133892 132764 130780 128846 127789 127305 126478 125101 123905
66612 123905 123486 123611 123672 123366 122697 121679 120380 119053 117969 117139 116336 115414 114483 113763 113319 112990 112652 112395
66594 112395 112261 111856 110618 108596 106617 105413 104917 104712 104788 105290 105809 105636 104778 104008 103729 103416 102498 101267
66576 101267 100439 100155 99908 99331 98599 98073 97837 97604 97025 96093 95315 95250 95826 96358 96353 96016 95790 95778 95875 96046
66556 96046 96100 95546 94232 92875 92293 92242 91681 90271 88914 88612 89330 90289 90872 90825 89985 88372 86462 84919
66538 84919 84019 83509 83028 82524 82274 82543 83157 83467 83003 82106 81567 81591 81623 81344 81238 81699 82114 81503 79805
66519 79805 77828 76117 74635 73576 73575 74769 76295 77248 77715 78321 79045 79110 78021 76246 74697 73862 73584
66502 73584 73526 73565 73708 73796 73545 72974 72581 72857 73674 74385 74513 74170 73826 73953 74864 76508 78262 79213 78890
66483 78890 77650 76295 75484 75443 75934 76381 76387 76164 76148 76180 75605 74399 73565 73931 75046 75791 75745 75370 75119 75018
66463 75018 74939 74662 73783 72216 70755 70434 71289 72356 72909 73041 72946 72459 71688 71306 71698 72322 72472 72227 72137
66444 72137 72363 72741 73308 74125 74840 75104 75269 75966 77035 77602 77327 76868 76862 77073 76978 76622 76305 75756 74389
66425 74389 72368 70797 70526 71135 71474 71066 70610 71003 72162 73052 72812 71620 70402 69870 69933 69996 69691 69269
66407 69269 69263 69801 70363 70345 69743 69097 68807 68813 68985 69420 70089 70464 69936 68580 67210 66588 66756 67191 67456 67595
66387 67595 67922 68515 69044 69231 69370 70057 71386 72763 73709 74409 75134 75522 75017 73805 72685 72015 71467 70909
66369 70909 70809 71409 71990 71576 70110 68500 67674 67903 68853 69858 70227 69733 68911 68565 68917 69470 69769 69950
66351 69950 70421 71215 71880 71980 71565 71138 71197 71805 72630 73345 73821 73920 73423 72453 71756 72050 73086 73809 73628
66332 73628 73086 73030 73470 73683 73188 72140 70884 69676 68893 68982 69924 71088 71914 72465 73010 73333 72881 71514
66314 71514 69718 68071 66835 66113 65955 66070 65814 64820 63515 62671 62517 62652 62788 63164 64056 65212 66120
66297 66120 66659 67150 67774 68273 68360 68170 68141 68523 69201 69892 70347 70386 69895 68913 67637 66364 65468 65333 66095
66278 66095 67405 68589 69150 69044 68448 67432 66023 64449 63157 62520 62567 62980 63346 63524 63784 64470 65445
66261 65445 66047 65792 64974 64364 64360 64648 64691 64337 63845 63463 63118 62522 61575 60645 60329 60836 61755 62491 62801 62812
66241 62812 62721 62785 63342 64433 65447 65606 64934 64387 64859 66309 67957 69044 69254 68716 67836 66998 66236 65324
66223 65324 64235 63320 63017 63565 64975 66906 68554 69156 68804 68294 67972 67322 66126 65353 66106 68004 69463
66206 69463 69574 68996 68883 69589 70664 71585 72126 72378 72634 73051 73297 72821 71637 70471 69962 69963 69851 69233 68153
66187 68153 66857 65631 64728 64257 64282 65062 66912 69605 72252 74046 74949 75380 75515 75300 74997 75158 75977
66170 75977 76997 77636 77687 77240 76403 75354 74480 74131 74264 74509 74612 74616 74554 74190 73320 72263 71805 72451 73798
66151 73798 74775 74554 73219 71588 70506 70352 71029 72221 73544 74532 74757 74167 73243 72626 72537 72702 72851 73063
66133 73063 73490 73946 74013 73417 72175 70505 68817 67654 67298 67468 67624 67601 67689 68140 68870 69670 70448 71173 71795
66114 71795 72318 72738 72819 72145 70556 68520 66981 66817 68251 70552 72423 73008 72612 72276 72668 73651 74805
66097 74805 75948 77064 78155 79370 80950 82824 84502 85530 85860 85668 85188 84850 85106 85735 85733 84441 82550
66080 82550 81496 81911 83117 84049 84181 83573 82535 81503 80851 80555 80286 79978 80047 80819 81953 82750 82951 82941
66062 82941 83200 83779 84384 84713 84629 84174 83632 83456 83889 84652 85183 85194 84816 84275 83750 83579 84139 85252 86067
66043 86067 85967 85361 85197 85900 87245 88978 90872 92237 92211 90797 89086 88194 88453 89706 91717 93953
66027 93953 95640 96567 97366 98539 99750 100574 101357 102622 104070 104966 105247 105424 105630 105585 105434 105723 106478 107103
66009 107103 107289 107366 107638 108097 108933 110496 112488 113978 114636 115265 116673 118696 120825 123084 125622 128023
65993 128023 129898 131756 134424 137735 140683 142828 144713 146781 148698 150100 151294 152644 153667 153423
65979 153423 151700 149347 147366 146003 144802 143259 141247 138904 136304 133293 129694 125723 122140 119764
65965 119764 118675 118011 116741 114645 112410 110851 110290 110572 111241 111559 110885 109476 108532 108953 110235 111160
65949 111160 111408 111849 113264 115539 118281 121435 124865 127967 130291 132146 134005 135685 136715 137254 137919
65934 137919 138848 139638 140205 141002 142134 142925 142780 142079 141837 142678 144452 146630 148732 150514 152087 153938
65918 153938 156607 160296 164790 169645 174324 178312 181417 183966 186554 189483 192537 195284 197468 199074
65904 199074 200191 200954 201483 201751 201645 201332 201427 202450 204056 205166 205039 203943 202513 200821 198531 195758
65888 195758 193081 190638 187813 184145 180030 176171 172712 169393 166186 163186 160063 156321 152135 148310
65874 148310 145224 142398 139361 136423 134113 132278 130342 128319 126964 126806 127413 127815 127383 126163 124611
65859 124611 123243 122355 121851 121381 120812 120459 120699 121448 122286 122996 123688 124391 124971 125601 126852 128842 130607
65842 130607 130923 129780 128534 128450 129571 131177 132790 134252 135228 135392 135150 135551 137238 139811 142390 144483
65826 144483 146081 147278 148231 149463 151743 155485 160380 165682 170759 175312 179248 182569 185355 187704
65812 187704 189575 190796 191278 191131 190499 189360 187608 185261 182426 179121 175372 171468 167891 164883 162270
65797 162270 159869 157846 156443 155513 154604 153511 152512 152016 152123 152569 152994 153257 153638 154741 157042 160482
65781 160482 164609 169153 174381 180808 188655 197588 206908 215930 224340 232283 240025 247373 253405 256922
65767 256922 257305 254954 250789 245305 238171 228883 217712 205888 194807 185229 177289 171026 166596 164004
65753 164004 162927 162986 164043 166110 169077 172757 177311 183370 191549 201832 213652 226506 240221 254465
65739 254465 268362 280904 291588 300312 306826 310802 312354 311890 309341 304105 296038 285926 274635
65726 274635 262409 249466 236674 224767 213258 201115 188533 177081 167873 160383 153440 146691
65714 146691 140536 135143 130289 125963 122527 120184 118626 117311 115889 114403 113200 112652 112850 113506 114122
65699 114122 114207 113500 112270 111345 111526 112872 114848 117080 119465 121516 122268 121313 119507 118166 117824 118153
65683 118153 118858 120106 122137 124841 127758 130324 132319 134257 137078 141130 145796 150460 155464 161614
65669 161614 169117 177722 187639 199425 212968 227373 242034 257064 272406 287294 301026 313664
65657 313664 325455 336068 344938 351986 357433 361196 363029 363144 362208 360734 358868 356793 354989 354049
65643 354049 354342 355775 357774 359650 361092 362013 361763 358974 352592 342777 330427 316186 300510 284267
65629 284267 268364 252724 236539 219808 203992 190664 179967 170820 162297 154372 147549 142158
65617 142158 137995 134395 130731 126958 123526 120698 118262 116091 114550 113921 113700 112973 111480 109826 108643
65602 108643 107986 107648 107642 108095 108913 109827 110614 111086 111015 110356 109532 109205 109648 110485 111128 111421 111729 112466 113686
65583 113686 115193 116893 118957 121683 125337 130070 135792 142097 148525 155068 162309 170923 181073 192439
65569 192439 204744 217955 231909 246024 259643 272524 284675 295663 304459 310240 313167 314058
65557 314058 313338 310581 305075 296476 284848 270568 254571 238388 223413 210044 197788 186118
65545 186118 175013 164833 156017 148836 143047 137935 133131 129289 127299 126887 126741 126201 125950 126599 127439
65530 127439 127445 126913 127114 128501 130183 131132 131071 130064 128041 125151 122055 119483 117709 116573 115710 114699
65514 114699 113377 112072 111175 110428 109103 106982 104736 103185 102578 102711 103257 103839 104314 105143 106985 109654
65498 109654 112110 113695 114724 115488 115484 114353 112932 112431 112975 113860 114978 116902 119602 122103 123768 125083
65482 125083 126829 129143 131794 134742 137819 140264 141237 140753 139680 138782 138029 136875 134968 132504 129908
65467 129908 127285 124358 121025 117715 114921 112593 110386 108435 107344 107306 107679 107690 107209 106598 106130 105813
65451 105813 105571 105276 104767 104046 103405 103184 103478 104172 105128 106252 107497 108864 110307 111696 113039 114630
65435 114630 116635 118609 119901 120568 121391 122811 124410 125635 126470 127009 127018 126534 126375 127216 128368 128325 126547
65418 126547 124009 121872 120301 118886 117580 116721 116418 116400 116431 116570 117011 117794 118709 119478 120029 120541 121091 121419
65400 121419 121276 120956 121176 122392 124479 127085 129984 133013 135973 138748 141347 143663 145358 146107 145809
65385 145809 144574 142710 140744 139166 138017 137006 136124 135809 136335 137373 138418 139360 140311 141175 141806 142371
65369 142371 143067 143615 143638 143573 144576 147237 150780 153925 156282 158500 161273 164652 168356 172351 176875 182107
65353 182107 188031 194569 201699 209368 217311 224985 231709 236968 240606 242728 243464 242871 241009 237971 233852
65338 233852 228831 223320 217868 212779 207884 202806 197349 191532 185401 179074 172902 167294 162298 157565
65324 157565 152838 148299 144398 141523 139896 139475 139757 139921 139473 138598 137628 136377 134407 131826 129324 127367
65308 127367 125781 124271 122951 122089 121654 121402 121195 120884 120067 118384 116080 114003 112957 113184 114460 116473
65292 116473 119017 121924 124870 127327 128850 129569 130226 131456 133037 134034 133687 131984 129480 126896 124932
65277 124932 124055 124123 124355 123989 122971 121880 121267 121249 121666 122332 123016 123403 123232 122482 121374 120227 119299 118666
65259 118666 118219 117846 117612 117634 117794 117794 117579 117517 117957 118769 119576 120343 121360 122633 123688 124165 124236 124116 123448
65240 123448 121677 119007 116505 115060 114543 114204 113664 113229 113395 114297 115585 116691 117255 117439 117757 118419 118953
65223 118953 118716 117704 116582 115910 115638 115454 115274 115137 114849 114054 112640 110879 109228 108158 108058 109012 110582
65206 110582 112041 112946 113405 113810 114413 115191 115917 116273 116070 115477 114975 114936 115317 115778 116020 115993 115866 115948 116471
65187 116471 117360 118233 118732 118789 118532 118102 117650 117336 117141 116859 116541 116758 118094 120410 122901 124849 126022
65170 126022 126370 125820 124538 123020 121633 120291 118770 117111 115602 114657 114936 117142 121233 126003 129950
65155 129950 132584 134572 136737 139312 142092 144824 147339 149720 152447 156019 160332 164813 169355 174729
65141 174729 181743 190335 199803 209671 219877 230258 240370 249937 259213 268702 278611 288564 297748
65128 297748 305329 310864 314373 316052 316029 314494 311880 308666 305015 300771 295794 290164 284085 277744 271279
65113 271279 264711 257886 250624 242966 235146 227290 219303 211134 203082 195671 189226 183561 178132 172565
65099 172565 167072 162287 158626 155892 153558 151305 149123 147009 144849 142602 140359 138153 135975 134095
65085 134095 133129 133500 134887 136450 137596 138407 139269 140251 140980 141076 140586 139913 139390 138979 138407 137528 136509 135704
65067 135704 135353 135334 135251 134828 134218 133779 133533 133123 132420 131893 132066 132800 133509 134001 134631 135562 136424 136932 137408
65048 137408 138284 139338 139841 139372 138126 136540 134974 133728 132966 132489 131884 131038 130330 130158 130404 130475 129756
65031 129756 127994 125427 122665 120296 118474 116911 115296 113646 112193 111130 110502 110163 109676 108497 106565
65016 106565 104696 104098 105320 107778 110334 112243 113518 114597 115883 117522 119412 121325 123128 124934
65002 124934 126945 129085 130964 132329 133390 134499 135626 136491 137179 138167 139515 140468 140299 139329 138682 139084
64986 139084 140355 141988 143683 145161 146043 146284 146457 147230 148729 150586 152370 153737 154483 154797 155193 155751
64970 155751 155648 153988 151002 147926 145681 144170 142901 141645 140236 138287 135617 132672 130135 128237
64956 128237 126778 125662 125082 125195 125900 126955 128136 129268 130197 130721 130520 129347 127405 125366 123847 123009
64940 123009 122756 123001 123462 123464 122482 120850 119517 118993 118889 118599 118113 117901 118260 119080 120154 121351 122399 122792
64922 122792 122246 121300 121084 122180 123798 124460 123590 122044 121000 120747 120912 121357 122190 123076 123348 123022 123058 124210
64904 124210 126059 127637 128760 130214 132630 135612 138268 140416 142935 146769 151724 156586 160520 163966
64890 163966 167879 172412 176932 181079 185085 188941 192093 194399 196761 200128 204173 207585 209543 210306
64876 210306 210421 209932 208519 205944 202135 197149 191358 185513 180403 176441 173584 171560 170139 169220 168705
64861 168705 168361 167973 167659 167737 168065 167731 165810 162389 158531 155208 152536 150070 147532 145099 143099 141570
64845 141570 140130 138323 136134 134031 132412 131230 130302 129717 129610 129772 129958 130437 131699 133617 135423 136565
64829 136565 137025 136700 135193 132643 130201 129048 129195 129801 130466 131613 133544 135697 137126 137507 137427 137773
64813 137773 138998 140947 143289 146005 149434 153908 159398 165433 171321 176585 181362 186197 191179 195500
64799 195500 198310 199886 201297 202821 203391 201959 198795 194917 190754 186052 180854 175851 171740 168707
64785 168707 166529 164804 163149 161540 160364 159799 159355 158594 157997 158380 159500 160131 159775 159494 160595 163084
64769 163084 165946 168444 170548 172474 174519 177232 181068 185777 190608 195182 199773 204591 209277 213385
64755 213385 217113 221113 225628 230168 234191 237838 241649 245610 248936 251001 252142 253144 254126 254436 253562
64740 253562 251615 248796 244994 240224 235009 229846 224590 218794 212474 206154 200308 195181 191060 188246
64726 188246 186685 185931 185517 185144 184608 183947 183663 184345 185929 187626 188776 189532 190547 192236 194550 197244
64710 197244 200079 202814 205304 207639 210034 212479 214538 215586 215265 213744 211501 208830 205622 201638
64696 201638 196890 191643 186164 180699 175638 171445 168300 165957 164005 162157 160335 158669 157504 157198
64682 157198 157754 158778 159878 160999 162333 164061 166330 169238 172641 176100 179290 182421 186004 190221
64668 190221 194779 199400 204151 209088 213771 217458 219725 220661 220487 219295 217313 215042 212766 210055 206250
64653 206250 201492 196888 193410 190986 188983 187217 185984 185204 184197 182574 180949 180421 181495 183758 186468
64638 186468 189271 192398 196323 201203 206615 211986 217337 223354 230511 238335 245844 252599 258931 265140
64624 265140 270824 275168 277587 277924 276243 272809 268214 263199 258141 252781 246546 239167 231077 223277
64610 223277 216773 211924 208332 205419 203132 201880 201776 202268 202764 203390 204704 206735 208768 210147 210816
64595 210816 210895 210254 208954 207781 207720 208917 210605 212001 212891 213296 213145 212507 211859 211815 212659 214194 215880
64578 215880 217141 217830 218466 219778 221999 224828 228020 231527 235031 237921 239997 241678 243148 243750 242718
64563 242718 240191 237012 233702 230094 225791 220541 214296 207353 200410 194145 188816 184492 181316 179149
64549 179149 177286 175136 172945 171262 169995 168797 168181 169154 171626 174243 176126 177821 179968 182017 183105
64534 183105 183481 184041 184834 185008 184147 182822 181734 180979 180241 179143 177341 174818 172211 170427 169742 169619
64518 169619 169411 168948 168439 168231 168703 169999 171709 173172 174113 174743 175290 175898 176941 178805 181204 183283
64502 183283 184676 185999 188031 190922 194529 198936 204052 209164 213613 217686 222062 226493 229804 231339
64488 231339 231719 231867 231860 231146 229448 226979 224040 220974 218425 217117 217192 218024 218805 219166 219178 219003 218641 217863
64470 217863 216242 213406 209449 205058 201051 197870 195640 194571 194910 196438 198390 200125 201718 203616
64456 203616 205872 207991 209447 210071 210041 209832 210135 211321 212849 213613 213195 212421 212400 213346 214768 216541 219139
64439 219139 222829 227208 231743 236383 241400 246987 253279 260587 269282 279515 291167 304011 317889
64426 317889 332947 349881 369786 393559 421557 453972 491348 534491 583989 640076 702890
64415 702890 772494 848484 929685 1014242 1099875 1184025 1264046 1337547 1402787 1458811 1505174
64404 1505174 1541305 1566089 1578288 1577485 1564464 1540449 1506196 1462067 1408649 1346799 1277174 1200394
64392 1200394 1117886 1032182 946193 862470 783193 710206 644514 586049 534314 489101 450280
64381 450280 417296 389368 365938 346401 329600 314333 300409 288565 279168 271591 265069 259517
64369 259517 255057 251238 247318 243046 238650 234195 229487 224565 219781 215291 210876 206397 202116 198388
64355 198388 195254 192474 189824 187328 185391 184744 185962 188816 192285 195443 198258 201373 205183 209324
64341 209324 213008 215687 217323 218132 218093 216786 213856 209663 205329 201908 199642 198130 197086 196571 196589 196924
64325 196924 197565 198872 200952 203146 204596 205213 205622 206144 206380 205995 205400 205262 205677 206290 206978 207811 208419
64308 208419 208132 206963 205811 205239 204475 202295 198654 194786 191574 188499 184564 179772 175112 171265 167979
64293 167979 164911 162550 161756 162532 163709 164042 163361 162523 162417 163223 164479 165596 166387 167303 169098 172068
64277 172068 175660 179076 182252 185840 190212 194893 199236 203307 207714 212708 217886 222681 226749 229788
64263 229788 231390 231359 230074 228304 226619 225035 223289 221503 220449 220904 222646 224361 224830 224018 222680
64248 222680 221067 218570 214670 209708 204441 199267 194249 189570 185471 181893 178686 176213 175233 175953 177534
64233 177534 178883 179767 180802 182391 184079 185138 185524 185960 187107 188929 190901 192603 193937 194955 195737
64218 195737 196478 197476 198886 200529 202016 203140 204120 205403 207115 208692 209220 208246 206152 203643 201061
64203 201061 198408 195895 194037 193104 192722 192197 191087 189395 187418 185544 184092 183163 182719 182896 184108 186687
64187 186687 190511 195210 200692 207266 215131 223892 232738 241072 248811 255989 262144 266310 267617 265815
64173 265815 261175 254227 245777 236915 228545 220881 213738 207223 201716 197128 192756 188104 183457 179310
64159 179310 175712 172600 170372 169447 169408 169257 168582 167907 167808 168228 168845 169617 170624 171804 173190 175160 178089
64142 178089 181883 186095 190313 194218 197479 199902 201525 202351 202212 201145 199654 198240 196876 195362 193936
64127 193936 192967 192195 190996 189495 188647 188944 189724 190231 190748 192032 194049 196091 197967 200345 203809 208207
64111 208207 213139 218618 225021 232655 241395 250353 257979 263099 266093 268531 271395 274245 276406 278320
64097 278320 281113 285296 290533 296354 302336 307900 312738 317325 322185 326643 329249 329562 328600 327142 324531
64082 324531 319817 313357 306423 299666 292797 285620 278531 271954 265921 260285 254903 249617 244478 239993
64068 239993 236636 234118 231685 229190 227284 226350 225863 225137 224202 223497 223016 222331 221312 220416 220310 221494
64052 221494 224165 228030 232264 236024 239164 242298 246084 250665 255841 261532 267888 275038 282875 291091
64038 291091 299387 307704 316319 325611 335583 345555 354350 360951 365060 367111 367749 367230 365280 361477 355825
64023 355825 349024 342251 336569 332404 329495 327320 325542 324053 322722 321223 319094 315912 311541 306327
64009 306327 300931 295738 290489 284727 278580 272771 267821 263626 259979 257130 255455 254817 254678 254777 255265
63994 255265 256144 256979 257398 257630 258322 259891 262198 264792 267397 270263 274014 278986 284625 289837 294156
63979 294156 298382 303672 310127 316718 322715 328707 335821 344246 353079 361573 369947 378747 387918 397024
63965 397024 406183 416245 427959 441390 456296 472728 490967 511054 532801 556277 582050 610835
63953 610835 643029 678745 718387 763184 815186 876629 949234 1034029 1131690 1242855 1368023
63942 1368023 1507299 1660374 1826602 2004944 2193886 2391612 2596215 2805477 3016252
63933 3016252 3224167 3424152 3611372 3781681 3931286 4056265 4152785 4218005 4250629 4250451
63923 4250451 4217519 4152078 4055302 3929721 3778793 3606439 3417204 3216424 3009591 2801385
63913 2801385 2595426 2394675 2201647 2018405 1846892 1689253 1547189 1420773 1308422
63904 1308422 1208381 1119857 1042484 975318 917021 866685 823740 787146 755423 727572 703399
63893 703399 682690 664658 648459 633687 619919 606189 591573 576192 561169 547643 536156
63882 536156 526858 519682 514180 509717 506197 504316 504810 507661 512373 518819 527421 538546 552107 567839
63868 567839 585546 604869 625105 645649 666499 688031 710276 732712 754733 775993 796145
63857 796145 814587 830729 844368 855537 864108 869770 872259 871388 866998 859245 848835 836497 822190
63844 822190 805307 785782 764456 742088 718579 693621 667640 641395 614948 587864 560420
63833 560420 533840 509099 486085 464213 443283 423326 404166 385698 368311 352463 338062
63822 338062 324757 312683 302309 293497 285311 276968 268643 261144 255025 250185 246081 242129 238022
63809 238022 233878 230048 226806 224262 222457 221239 220050 218146 215254 211847 208633 205904 203531 201428
63795 201428 199761 198719 198215 197884 197337 196417 195161 193541 191408 188873 186563 185150 184614 184322 183883 183537
63779 183537 183536 183574 183158 182303 181463 180953 180766 180807 180886 180634 179843 178869 178280 178133 178048 177981 178360 179258 180033 180149 179904
63758 179904 179848 179865 179479 178852 178733 179287 179728 179433 178911 179103 179998 180545 179956 178664 177825 178162 179514 181264
63740 181264 182933 184361 185589 186756 188060 189637 191392 193033 194488 196228 198910 202485 205966 208436
63726 208436 210180 212395 215755 219773 223753 227794 232316 236944 240602 242777 244106 245538 247367 249306
63712 249306 250998 252059 252021 250811 249100 247657 246374 244445 241548 238333 235556 233216 230887 228513 226453
63697 226453 224984 224242 224507 225947 228038 229799 230884 232050 234204 237275 240462 243371 246343 249623 252790
63682 252790 255304 257272 259248 261426 263374 264557 264826 264387 263589 262840 262495 262681 263337 264521 266440 269007
63666 269007 271507 273006 273156 272450 271660 271168 270860 270450 269683 268324 266256 263703 261184 258994 256802 254015
63650 254015 250590 247224 244560 242413 240064 237201 234242 231775 230026 228954 228510 228569 228862 229241 229831 230700
63634 230700 231640 232623 234264 237300 241574 245987 249673 252900 256640 261527 267484 274087 280991 288109 295659
63619 295659 303962 313059 322678 332823 344135 357334 372391 388695 406022 424862 445690 468367
63607 468367 492491 517936 544627 572005 599100 625000 648921 669905 686855 698950 705891 707887
63595 707887 705729 700800 694500 687515 679860 671651 663361 655131 646240 635650 622860 607943 590962
63582 590962 571855 550885 528894 506964 485989 466573 449082 433638 420132 408381 398321
63571 398321 390129 384174 380717 379603 380312 382371 385546 389584 394043 398653 403729 409947 417720 426903
63557 426903 436997 447472 458055 468965 480789 493947 508470 524552 542977 564532 589134
63546 589134 616111 645299 677193 711782 747602 782062 812232 835277 849062 853151 849113 839482
63534 839482 826456 811699 796821 783332 772133 763349 756516 750663 744437 736664 726693 713945 697416
63521 697416 676341 651285 623971 595843 567334 538656 510681 484559 460851 439553 420726
63510 420726 404503 390522 377881 365896 354583 344222 334797 326208 318760 312895 308369 304208 299758
63497 299758 295463 292238 290288 288975 287669 286259 284812 283263 281617 280109 278972 278335 278385 279230 280507
63482 280507 281570 282344 283498 285547 288234 291126 294246 297617 300731 303158 305289 307719 310154 311686
63468 311686 311957 311256 309609 306719 302891 299094 295799 292522 288800 284899 281195 277616 274209 271652 270531
63453 270531 270532 270920 271522 272689 274588 277056 279986 283407 287318 291844 297423 304469 312997 322861 334110
63438 334110 346825 360963 376820 395247 416850 441163 467197 494459 522569 549865 573369
63427 573369 590607 601108 606065 607228 606485 605797 606722 610042 616247 626173 640746 660223 684136 711910
63413 711910 742976 776106 809133 839741 866417 888331 904565 914080 916660 913540 906732 897873
63401 897873 887920 877621 867593 857750 847057 834212 818488 799827 778393 754248 727390 698009
63389 698009 666862 635412 605297 577436 551847 528349 507070 488096 471095 455743 442223
63378 442223 430917 421846 414858 410074 407602 406993 407614 409556 413532 419740 427373 435491 443975 453429
63364 453429 464479 477384 492070 508338 526192 545976 567953 591833 617144 644108 673527
63353 673527 705540 738928 771937 803347 832318 857607 877621 891285 898513 899849 896023 887968
63341 887968 877049 864958 853093 841831 830479 818154 804655 790129 774011 754959 732203
63330 732203 706489 679356 651884 624552 597918 572787 549804 529381 511997 498158 488117
63319 488117 481953 479686 480684 482928 483400 479559 470397 456411 439127 420568 402467 385577 369988
63306 369988 356115 344788 336218 329502 323558 318083 313165 308491 303667 299054 295462 292925 290392 286938
63292 286938 282848 279241 276886 275655 274931 274177 273121 271675 269878 267942 266237 265101 264544 264207 263654
63277 263654 262722 261598 260660 260256 260411 260645 260289 259245 258249 258071 258581 258951 258695 258092 257585 257344 257592 258753
63259 258753 260843 263128 264941 266558 268728 271500 274208 276571 279122 282341 286004 289750 293788 298563
63245 298563 304044 309844 315848 322281 329294 336897 345235 354527 364705 375510 386981 399488 413234
63232 413234 428091 444061 461464 480413 500276 519931 538502 555813 572341 588845 605863
63221 605863 623381 641012 658456 675671 692653 709402 726166 743329 760835 777914 793547
63210 793547 806958 817554 824773 828276 827984 823680 814887 801502 784259 764154 741779 717771 693543
63197 693543 670712 649797 630234 611797 595274 581477 570399 561816 556149 554041 555453 559739
63185 559739 566360 575010 585334 597201 611049 627274 645230 663512 681379 699361 718290 738273
63173 738273 758819 779382 799334 817931 834897 850795 866210 880716 893174 902979 910319 915041
63161 915041 915941 911651 901909 887491 869154 847168 821815 793760 763782 732507 700612 668977
63149 668977 638376 609234 581883 556833 534466 514651 496991 481297 467483 455189 444050
63138 444050 434354 426800 421409 417154 413018 409039 405909 403847 402289 400538 398347 396012 394217 393616
63124 393616 394180 395087 395693 396429 398263 401394 405015 408357 411353 414231 417085 420033 423233 426485 429379
63109 429379 432175 435861 440826 446009 450035 452884 455708 459186 462815 465853 468280 470574 473015 475479
63095 475479 477641 479157 479864 479964 479907 480075 480628 481573 482660 483315 483037 481945 480704 479846 479372 479002 478567
63078 478567 478162 478151 479045 481090 483902 486765 489325 491800 494631 498214 502948 509143 516809 525746 535807
63063 535807 546756 558025 569164 580555 593194 607727 624213 642885 664349 688734 715336
63052 715336 743616 774025 807337 843645 882454 923292 965633 1008709 1052042 1095823 1140087
63041 1140087 1183984 1226692 1268732 1311309 1354467 1396957 1438051 1478469 1519107 1559744 1599488
63030 1599488 1637679 1673706 1706538 1735133 1758832 1776610 1786289 1785430 1773167 1750659 1719773 1681775
63018 1681775 1637339 1587286 1533005 1476378 1419457 1364057 1311571 1263203 1220184 1183446 1153093
63007 1153093 1128553 1109395 1095855 1088491 1087550 1092787 1103647 1119417 1139310 1162678 1189208 1218730
62995 1218730 1250806 1284549 1318911 1353127 1386886 1420162 1452944 1485099 1516440 1546844 1576162
62984 1576162 1603870 1628913 1650143 1666935 1679079 1685866 1685663 1676817 1658857 1632350 1597747 1555086
62972 1555086 1505007 1449368 1390399 1329667 1268250 1207422 1148442 1091970 1038335 988313 942951
62961 942951 902617 866721 834423 805106 778191 753163 729988 708981 690046 672441 655497
62950 655497 639168 623700 609155 595420 582277 569293 556106 542953 530473 518838 507652
62939 507652 496902 487256 478998 471382 463643 456087 449462 443794 438597 433876 429942 426511 422989 419658
62925 419658 417528 416777 416206 414655 412285 410003 408245 406904 405999 405717 405886 405978 405686 405154 404519 403507 401708
62908 401708 399169 396581 394705 393658 392918 392020 390997 389960 388606 386541 383954 381483 379455 377768 376579
62893 376579 376522 377951 380371 383004 385599 388282 390833 392624 393356 393478 393672 394053 394053 393018 390788 387768
62877 387768 384665 382255 381094 381130 381605 381709 381375 381165 381301 381278 380614 379476 378141 376314 373635 370620 368399
62860 368399 367528 367596 367940 368158 367956 367202 366306 365914 366039 366094 365943 366286 367612 369424 370945 372058 373012 373635
62842 373635 373514 372746 371960 371620 371693 371869 371834 371460 370976 370720 370558 369920 368739 367823 367777 368006 367466 366168 365137
62823 365137 365025 365523 366194 367107 368399 369873 371377 373169 375562 378537 381866 385322 388589 391313 393518
62808 393518 395700 398378 401716 405716 410413 415739 421465 427466 433832 440627 447856 455742 464630 474363
62794 474363 484214 493709 503190 513238 524007 535677 549223 565906 585980 608592 633238 660754
62782 660754 692488 728892 769486 814061 863301 917986 977966 1042239 1109833 1180181 1252611
62771 1252611 1325872 1398376 1468509 1534325 1593222 1642568 1680835 1707787 1723518 1727775 1720375 1701691
62759 1701691 1672268 1632353 1582464 1524330 1460660 1393888 1325511 1256615 1188450 1122212 1058693
62748 1058693 998462 942045 889619 840830 795361 753496 715730 681934 651402 623694 598935
62737 598935 577176 557944 540715 525418 512144 500605 490306 481108 473256 466948 462182 458869
62725 458869 456688 454927 453036 451401 451023 452199 454055 455770 457796 461311 466667 473052 479738 487112
62711 487112 496226 507666 521174 536242 552773 571119 591641 614454 639714 668011 700220 736875
62699 736875 777931 823222 872809 926637 984210 1045013 1109079 1176586 1246890 1318344 1389113
62688 1389113 1457733 1522783 1582412 1634346 1676162 1705587 1721084 1722432 1710497 1686287 1650487
62677 1650487 1603971 1548361 1485811 1418489 1348364 1277055 1205613 1134784 1065744 1000194 939412
62666 939412 883574 832322 785609 743495 705513 670883 639163 610204 583704 559508 538171
62655 538171 520363 505556 492072 478736 465921 454642 445106 436545 428080 419331 410472 402108 394907
62642 394907 389046 384066 379408 374887 370544 366417 362768 360212 359191 359475 360444 361579 362363 362071 360331
62627 360331 357803 355700 354533 353780 352873 351953 351466 351487 351897 352890 354794 357410 359942 361746 362997 364524
62611 364524 367035 370569 374667 379013 383804 389453 395991 402942 409862 416937 425010 434970 447068 460800
62597 460800 475587 491649 510020 531527 555923 582310 610276 640176 672293 706170 740894
62586 740894 775552 809132 840402 868321 892222 911174 923552 927979 924657 915125 900650 881471
62574 881471 857720 830314 800436 768699 735464 701699 668858 637936 609139 582426 557837
62563 557837 535209 514080 494192 475827 459409 444987 432277 421076 411449 403542 397230 391860
62551 391860 386435 380369 374124 368877 365455 363774 363245 363339 363633 363761 363642 363461 363158 362298 360780 359333
62535 359333 358806 359186 359842 360553 361690 363481 365767 368556 372119 376342 380696 385258 391203 399639 410310
62520 410310 422047 434357 447989 463947 482484 503278 526209 551668 580208 612081 647092
62509 647092 684808 724799 766567 809209 851315 891326 927965 960249 987277 1008153 1022175
62498 1022175 1029105 1029371 1023941 1013701 998848 979176 955159 928476 901241 874973 850530 828656
62486 828656 810062 795102 783830 776450 773421 775155 781774 792988 807923 825367 844556 865451
62474 865451 887693 909606 929042 945116 958243 968343 974025 973966 968162 957107 940496 917750
62462 917750 889515 857694 823947 788868 752648 715869 679389 643903 609919 577974 548733
62451 548733 523007 501522 484361 470644 459085 448956 440308 433416 428363 425115 423467 422805 422391
62438 422391 422171 422955 425505 429646 434522 439489 444355 448854 452306 454008 453790 451973 448857 444490 439043
62423 439043 433152 427462 421794 415222 407245 398565 390356 383022 376145 369489 363459 358484 354473 351048
62409 351048 347966 345134 342511 340127 337885 335328 332037 328365 325270 323188 321635 320236 319561 320328 322189
62394 322189 324073 325528 327011 328844 330626 331906 332919 334282 336282 338712 341250 343794 346531 349765
62380 349765 353552 357580 361631 366122 371865 379239 387864 397077 406378 415381 423838 431981 440502 449901
62366 449901 460111 471028 483060 496789 512375 529730 549155 571346 596778 625430 657199
62355 657199 692300 731208 774335 821571 871765 922713 972113 1018607 1061624 1100217 1132626
62344 1132626 1157179 1173264 1181263 1181977 1176448 1165773 1150456 1130048 1103942 1072539 1037291 999788
62332 999788 961277 923000 886307 852089 820477 791399 765209 742455 723227 706989 692905
62321 692905 680113 667786 655227 642013 628010 613285 598013 582360 566372 550165 534191
62310 534191 519064 504981 491601 478672 466480 455419 445396 436044 427348 419622 412969 407238
62298 407238 402483 398951 396541 394774 393519 393263 394295 395946 397121 397513 397934 399397 402070 405156 407628
62283 407628 409067 409923 411033 412911 415529 418678 422285 426227 430107 433533 436624 440041 444444 449980
62269 449980 456290 462941 469834 477299 485879 496074 508305 522986 540443 560704 583539 608811
62257 608811 636807 668226 703897 744339 789369 838103 889566 943241 998724 1054800 1109217
62246 1109217 1159513 1203749 1240433 1268392 1287272 1297804 1301011 1297266 1286527 1269211 1246090 1217410
62234 1217410 1182904 1142979 1099253 1053510 1006546 958542 910231 863188 819012 778630 742306
62223 742306 709850 680635 653730 628345 604268 581863 561721 544283 529648 517508 507185
62212 507185 497843 488917 480431 472774 466038 459798 453764 448461 444830 443098 442412 441693 440547 439198 437988
62197 437988 437268 437491 438905 441230 443968 447009 450636 455057 460256 466282 473244 480952 488980 497279 506377
62182 506377 516691 527841 538981 549643 559961 570090 579742 588381 595695 601830 607294 612735 618752
62169 618752 625851 634608 645810 660262 678412 700254 725667 754684 787318 823181 861311 900218
62157 900218 937970 972428 1001793 1025078 1042073 1052951 1058080 1058040 1053386 1044262 1030562 1012632 991447
62144 991447 967764 941423 911979 880018 847353 815810 786194 758567 733163 710670 691743
62133 691743 676551 664760 655817 649311 645181 643491 643876 645304 646581 647162 647504 648715 651830 657167
62119 657167 664155 671878 679924 688532 697727 706508 713309 717290 718871 718989 718163 716498 714255 711939 709679
62104 709679 706722 701793 694050 683757 671969 659644 647211 635088 624234 615736 609805 605603 602316
62091 602316 600085 599642 601264 604456 608518 613054 617937 623243 629294 636402 644329 652303 659851 667424
62077 667424 675918 685741 696697 708734 722373 738242 756458 776534 797636 818820 839362 859227
62065 859227 879058 899427 920202 940969 961928 983875 1007138 1030928 1053943 1075253 1094286
62054 1094286 1110184 1121769 1128304 1130019 1127763 1122216 1113461 1101135 1084935 1065040 1042089 1016653
62042 1016653 988797 958352 925580 891292 856320 821178 786442 753098 722075 693532 666998
62031 666998 642254 619739 599969 582850 567793 554342 542461 532237 523514 515826 508577 501279
62019 501279 493713 485914 477973 469917 461802 453813 446139 438747 431460 424279 417487 411333 405806 400928
62005 400928 397214 395482 395936 397638 399242 400336 401749 404429 408313 412574 416725 420899 425031 428333
61991 428333 430000 430167 429730 429298 428634 427132 424534 421047 416979 412426 407336 401730 395835 389919 384061
61976 384061 378216 372544 367513 363561 360759 358855 357414 355890 353923 351827 350400 349786 348841 346329 342596
61961 342596 339346 337674 337065 336566 336109 336126 336505 336737 336865 337505 339052 341412 344509 348425 352946 357538
61945 357538 362030 366933 372865 380026 388477 398611 410903 425229 440727 456490 472296 488625
61933 488625 505950 524122 542477 560422 577692 594080 609248 622958 635189 645824 654470 660855
61921 660855 665079 667169 666704 663362 657633 650447 642268 633116 623425 614288 606777 601622 599571 601355
61907 601355 606967 615523 626191 638853 653557 669726 686186 701587 714633 724488 731368 736211
61895 736211 739238 739246 734884 726315 715022 702295 688572 674083 659304 644627 630178 616123 602747
61882 602747 590140 578145 566750 556161 546420 537213 528112 518779 509008 498963 489302 480635 472784
61869 472784 464980 456944 449371 443252 439005 436388 434924 434363 435041 437863 443473 451289 459806 468081 476584
61854 476584 486433 498327 512582 529634 549825 572831 597842 624305 652102 681067 710743 740621
61842 740621 770235 798929 825766 849768 870057 885851 896611 902269 903098 899381 891497 880419
61830 880419 867833 855509 844517 835127 827411 821932 819899 822563 830251 841942 855844 870308 884117
61817 884117 896149 905286 910726 912019 908552 899381 883955 862883 837676 809745 779918 748849
61805 748849 717484 686956 658190 631743 607775 586013 565959 547407 530701 516289 504059
61794 504059 493373 483761 475294 468121 461893 455902 449702 443430 437548 432456 428305 424969 422164 419694
61780 419694 417547 415659 413682 411325 408897 407147 406339 405800 404655 402774 400691 398796 397053 395500 394524
61765 394524 394458 395139 396079 396857 397263 397279 397161 397367 398199 399600 401463 403904 406987 410264 412912 414374 414707
61748 414707 414366 413829 413401 413060 412453 411213 409336 407105 404702 402165 399719 397768 396425 395349 394239
61733 394239 393225 392562 392221 392069 392235 392936 394041 395186 396261 397446 398764 399940 400835 401722 402943 404467
61717 404467 406042 407765 410252 414000 418526 422414 424561 425371 426309 428137 430043 430744 429932 428105 425442
61702 425442 421731 417306 413137 409684 406352 402485 398362 394738 391790 389058 386188 383283 380595 378191
61688 378191 375850 373133 369682 365610 361422 357402 353379 349261 345453 342434 340193 338397 336831 335370
61674 335370 333858 332380 331393 331087 330875 330058 328815 327973 327866 327951 327566 326554 325158 323825 323202 323824 325585
61657 325585 327800 329803 331188 331659 331190 330364 329903 329775 329394 328838 329100 330732 332950 334753 336445 339305
61641 339305 343895 349400 354606 358987 362670 365808 368246 369667 369894 369064 367474 365242 362294 358823 355524
61626 355524 353034 351186 349062 345886 341730 337327 333353 329985 327092 324715 323194 322737 322983 323229 323093
61611 323093 322698 322146 321138 319339 316889 314277 311778 309283 306641 303906 301150 298191 294672 290471 285917
61596 285917 281500 277349 273235 269180 265776 263555 262266 261184 260037 259041 258044 256406 254022 251846 250818
61581 250818 250685 250479 249841 249197 248741 247958 246387 244403 242961 242690 243372 244145 244179 243255 241810 240448 239554
61564 239554 239330 239837 240764 241487 241701 241815 242338 243115 243579 243606 243612 243888 244361 245028 246021 247154 247975 248502 249351
61545 249351 250788 252153 252725 252802 253347 254726 256371 257645 258522 259275 259959 260483 260894 261348 261940 262793 264150
61528 264150 266147 268536 270872 272935 274747 276196 276922 276701 275740 274462 273138 271838 270569 269303 268035
61513 268035 267000 266609 266898 267259 267077 266478 265993 265646 265002 264174 264035 265085 266632 267547 267405 266461 264950
61496 264950 263004 261030 259498 258452 257670 257208 257273 257645 257766 257438 256941 256478 256029 255809 256317 257649 259244
61479 259244 260597 261884 263582 265762 268050 270046 271500 272299 272593 272876 273599 274669 275448 275360 274459 273393
61463 273393 272725 272321 271565 270324 269390 269639 270878 271943 271986 271293 270756 270936 271738 272667 273177 273048 272621 272471
61445 272471 272759 273112 273264 273511 274433 276366 279239 282626 285850 288362 290254 292155 294521 297285 300255
61430 300255 303399 306513 309095 310882 312152 313193 313880 314233 314932 316656 319120 321363 322877 323891 324638
61415 324638 325030 325115 325241 325521 325644 325471 325420 325924 326704 326887 325817 323666 321345 319753 318924 317903 315739
61398 315739 312590 309540 307312 305617 303968 302625 302280 303004 304000 304458 304344 304246 304611 305296 305774 305722 305307
61381 305307 304920 304726 304654 304732 305142 305844 306458 306773 307202 308396 310409 312561 314224 315484 316872 318601 320348
61364 320348 321744 322845 324010 325519 327458 329830 332506 335122 337377 339574 342514 346550 350979 354877
61350 354877 358476 363168 369900 377967 385806 392728 399387 406555 413949 420554 425825 430150 434095 437580
61336 437580 440112 441752 443448 446113 449512 452461 454163 454994 455712 456234 455709 453709 450819 447816 444765
61321 444765 441329 437678 434503 432117 430061 427871 425850 424760 424951 426191 428235 431112 434794 438948
61307 438948 443315 448129 453923 461048 469540 479333 490257 501793 513050 523112 531390 537690 542040
61294 542040 544461 544798 542861 538867 533678 528314 523144 517833 512093 506189 500451 494594 487956 480377
61280 480377 472502 465205 459030 454204 450790 448632 447445 447229 448321 450726 453661 456190 458212 460381
61266 460381 463060 465887 468537 471375 474977 479353 484163 489495 495862 503420 511690 520199 528909 537727
61252 537727 545992 552919 558415 562998 566905 569736 571093 571190 570529 569278 567341 564909 562417 559859 556568
61237 556568 552000 546522 541091 536290 532011 527987 524218 520778 517586 514663 512442 511507 512027 513530 515274
61222 515274 516856 518539 520956 524317 527983 531137 533843 537001 541097 545556 549694 553817 558659 564000
61208 564000 568675 571994 574376 576365 577746 578173 578150 578718 580350 582715 585536 589212 594463 601649 610598
61193 610598 620909 632304 644677 657869 671412 684575 696686 707316 716125 722775 727225 729969
61181 729969 731751 733020 733789 733931 733353 731911 729452 726113 722404 718814 715309 711363 706463 700569 694025
61166 694025 687120 679831 672050 663915 655765 647793 639925 632019 624017 615836 607323 598518 589789 581549
61152 581549 573908 566759 560169 554455 549878 546459 544123 542771 542035 541094 539065 535640 531153 525917 519774
61137 519774 512509 504539 496736 489609 483106 477359 473060 470671 469678 469274 469525 471191 474429 478513 483062
61122 483062 488803 496597 506204 516640 527425 538908 551496 565194 579934 595874 613204 631942
61110 631942 652053 673436 695641 717819 739179 759506 779136 798443 817290 834914 850380
61099 850380 863191 873439 881285 886438 888276 886444 881193 873179 863066 851293 838073 823507 807703
61086 807703 790847 773210 755220 737431 720283 703898 688252 673483 659772 646966 634718
61075 634718 623082 612563 603400 595172 587408 580244 574122 569159 565232 562428 560866 560248 560160 560798 562776
61060 562776 566062 569643 572646 575482 579457 585305 592452 599828 607230 615644 626177 638825 652512
61047 652512 666289 680221 695044 711303 729021 748013 768224 789872 813384 839072 866813
61036 866813 896286 927580 961148 996996 1034428 1073012 1113406 1156723 1203347 1252730 1303908
61025 1303908 1355716 1407005 1457545 1508713 1562682 1621144 1685394 1757246 1838748 1930863 2033308
61014 2033308 2146008 2270182 2408277 2564134 2744090 2957812 3218077 3540008 3939822
61005 3939822 4432843 5032462 5751945 6607102 7616543 8801238 10186958 11802739 13659495
60996 13659495 15707463 17802582 19722031 21236081 22196667 22590542 22535580 22235416 21916692
60987 21916692 21762078 21848825 22113396 22366473 22362328 21894038 20869371 19334777 17444779
60978 17444779 15399474 13381669 11518041 9872124 8459844 7270653 6282269 5467773
60970 5467773 4799337 4251042 3800421 3428541 3119644 2860820 2641506 2453075 2288841
60961 2288841 2143995 2014907 1898513 1792600 1696338 1609786 1532800 1464682 1404610 1351758
60951 1351758 1304967 1262762 1223750 1186706 1150483 1114466 1079046 1045095 1012924 982333 953560
60940 953560 927356 903876 882160 861089 840320 819966 799976 780288 761141 742700 724604
60929 724604 706330 687841 669552 651898 635231 619828 605606 592062 578956 566854 556579
60918 556579 548205 540962 534062 527207 520418 513906 508184 503837 500898 498693 496537 494432 492878 492098
60904 492098 491672 491038 490278 490246 491755 494695 498116 501190 503796 506083 507938 509271 510482 512048 513608
60889 513608 514035 512627 509850 506663 503471 500075 496297 492108 487201 481047 473626 465750 458325 451497
60875 451497 444870 438431 432710 427913 423436 418669 413970 410279 407815 405796 403546 401325 399654 398376
60861 398376 396970 395563 394857 395015 395271 394909 394108 393475 393160 392919 392764 392947 393398 393728 393900 394393 395447 396552
60843 396552 397003 396734 396239 395884 395646 395453 395328 395108 394366 392777 390431 387672 384835 382202 379963 378108
60827 378108 376483 375082 374086 373472 372803 371666 370183 368824 367825 367101 366660 366703 367172 367507 367113 365940 364394
60810 364394 362791 361106 359191 357015 354614 352010 349291 346666 344256 341914 339401 336771 334403 332551
60796 332551 331015 329352 327337 325033 322580 320139 318001 316399 315153 313756 311869 309499 306699 303539
60782 303539 300605 298971 299174 300421 301350 301480 301422 301751 302318 302821 303464 304616 306181 307760 309297 311150
60766 311150 313568 316440 319563 322848 326085 328738 330227 330508 330327 330757 332394 334928 337447 339150 339763
60751 339763 339455 338577 337529 336681 336245 336190 336325 336496 336759 337336 338268 339098 339124 338143 336689 335239 333349 330014
60733 330014 324902 318760 312576 306815 301696 297648 294918 293006 290999 288520 285995 283999 282621 281489
60719 281489 280105 278174 275882 273932 273050 273305 274041 274524 274526 274313 274325 274913 276170 277768 279112 279774 279816 279633
60701 279633 279595 279857 280420 281262 282474 284247 286608 289116 291084 292254 293153 294592 296859 299571 302229 304687
60685 304687 307081 309497 311806 313771 315315 316787 318857 321886 325357 328250 330118 331560 333397 335645
60671 335645 337626 338922 339744 340302 340273 339124 336733 333489 329951 326541 323370 320190 316731 313226 310345
60656 310345 308358 306733 304905 303160 302263 302378 302949 303632 304703 306434 308614 310973 313543 316217 318401
60641 318401 319552 319763 319451 318749 317642 316370 315095 313375 310669 307309 304303 302091 300180 298242 296836
60626 296836 296560 297039 297395 297376 297358 297411 297133 296501 296196 296781 298014 299316 300553 301910 303224 303922 303632 302532
60608 302532 301091 299825 299319 300062 301910 303969 305330 305860 306031 306138 306081 305957 306305 307463 309020 310366
60592 310366 311613 313407 315789 317767 318381 317874 317418 317817 318811 319576 319586 318970 318354 318427 319424 320921 322340
60575 322340 323694 325586 328465 332195 336538 341706 348175 356189 365767 376981 389765 403557 417494
60562 417494 430988 443762 455409 465260 472751 477515 479113 477130 471784 464095 455277 446227 437787
60549 437787 431007 426658 424610 424078 424483 425890 428752 433482 440216 448818 459219 471834 487392 506099
60535 506099 527174 549470 572233 594905 616490 635685 651527 663398 670470 671848 667521 658749
60523 658749 647290 634557 621645 609559 598856 589185 579606 569559 559445 550339 543172 538139
60511 538139 534882 533162 533188 535121 538558 542941 548385 555733 565778 578830 595045 614719 638187
60498 638187 665848 698332 736131 778902 825645 875729 929085 985063 1041661 1096383 1147289
60487 1147289 1192715 1230608 1259103 1277498 1285855 1283659 1269744 1243623 1206262 1159436 1105015 1045168
60475 1045168 982580 919900 859128 801732 748943 701520 659394 621926 588509 558757 532257
60464 532257 508455 486907 467587 450899 437277 426652 418288 411203 404799 399013 393996 389776 386133
60451 386133 382664 379030 375295 371858 368869 365931 362713 359668 357596 356528 355595 354135 352410 350984
60437 350984 349863 348692 347487 346646 346342 346249 345874 344933 343419 341529 339515 337484 335377 333241 331396 330168
60421 330168 329531 329186 328941 328875 329154 329828 330789 331777 332450 332591 332315 332036 332149 332717 333423 333950 334458 335514 337353
60402 337353 339362 340669 341194 341681 342592 343465 343696 343578 344076 345698 348032 350327 352219 353849 355624 357910
60386 357910 360749 363756 366442 368630 370456 372036 373370 374523 375645 376761 377771 378705 379820 381370
60372 381370 383424 385948 388870 391988 394935 397374 399194 400552 401837 403509 405787 408423 410893 412873
60358 412873 414474 416120 418401 421901 426833 432724 438753 444596 450758 457903 465994 474296 482135 489354
60344 489354 495921 501223 504024 503330 499332 493313 486602 479813 473180 467121 461926 457150 452041 446693
60330 446693 442098 438840 436359 433845 431282 429040 426910 424268 420998 417619 414597 412125 410484 409923
60316 409923 410156 410598 411242 412765 415672 419952 425706 433420 443298 454959 468206 483475 500973 519905
60302 519905 539297 559116 579707 600248 618580 632624 641336 644198 640604 630228 613656 592316
60290 592316 568050 542850 518611 496712 477828 462134 449430 439113 430488 423362 418024 414453
60278 414453 411899 409508 407076 404868 402955 401154 399458 398042 396780 395137 392713 389753 386947 384815
60264 384815 383350 382193 381076 380004 379042 378066 376866 375443 374045 372941 372312 372335 373057 374151 375057 375540
60248 375540 375907 376559 377555 378678 379678 380331 380546 380643 381222 382457 383747 384394 384421 384380 384533 384646 384536 384390
60230 384390 384491 384981 385954 387487 389440 391506 393570 395786 398133 400082 400980 400795 400333 400600 401902 403699
60214 403699 405379 407034 409224 412156 415505 419090 423169 427813 432567 437236 442474 448906 455866 461864
60200 461864 466317 470095 474228 478782 483245 487385 491264 494904 498373 501892 505384 508151 509445 509285
60186 509285 508432 507675 507346 507276 506914 505603 503127 499946 496660 493283 489316 484474 479086 473770 469008 465046
60170 465046 462034 459996 458669 457467 455841 453791 451930 450767 449981 448790 447051 445573 445069 445266 445444
60155 445444 445544 446127 447343 448582 449300 449728 450435 451497 452406 452754 452713 452803 453335 454213 455203 456264 457490 458874
60137 458874 460398 462418 465626 470381 476188 482094 487568 492778 498046 503309 508140 512100 514982 516900
60123 516900 518226 519384 520629 522074 523851 526076 528632 531140 533303 535175 537031 538967 540731 541971
60109 541971 542568 542718 542687 542562 542299 541896 541387 540687 539603 538035 536014 533547 530634 527493 524483 521656
60093 521656 518659 515276 511863 508951 506665 504903 503919 504248 505956 508433 511009 513372 515179 515689 514344
60078 514344 511596 508734 506787 505792 505128 504267 503025 501326 499071 496234 492853 488803 483789 477742 471171
60063 471171 464909 459497 454926 450888 446959 442571 437243 431162 425304 420627 417254 414682 412597 411035
60049 411035 409795 408326 406497 405118 405241 407001 409462 411686 413722 416429 420366 424989 429026 431668
60035 431668 433313 435041 437455 440172 442433 443888 444628 444680 443820 442016 439790 437902 436577 435162 432636
60020 432636 428520 423242 417727 412707 408400 404555 400594 395903 390324 384374 378813 373941 369508 365262
60006 365262 361326 358001 355432 353580 352257 351070 349605 347957 346859 347016 348388 350371 352485 354548
59992 354548 356266 357215 357381 357332 357556 357941 358208 358651 359989 362528 365826 369239 372430 375182 377056 377606
59976 377606 376873 375443 374023 373120 372971 373431 373815 373195 371154 368218 365368 363194 361719 360934 361088 362238
59960 362238 363854 365294 366599 368341 370592 372482 373113 372575 371636 370672 369548 368457 368133 368851 369826 370126
59944 370126 369877 370031 371157 372929 374648 375702 375593 374128 371825 369689 368367 367738 367384 367116 366978 367070
59928 367070 367511 368296 369143 369819 370613 372033 374029 376124 378466 381945 386874 392258 396971 401050 405079
59913 405079 408835 411514 413045 414166 415205 415746 415669 415702 416579 418323 420673 423568 426856 430048 432872 435626
59897 435626 438577 441381 443546 445153 446617 448043 449309 450537 451970 453549 455177 457299 460557 464757
59883 464757 468767 471760 474166 477035 480749 484738 488370 491680 495105 498764 502207 504830 506343 506811
59869 506811 506374 505068 502893 499948 496441 492593 488624 484839 481710 479705 478878 478678 478467 478336 479143 481485
59853 481485 484924 488637 492657 497935 505124 513897 523654 534208 545175 555069 561850 564580 564102 561977
59839 561977 559130 555822 552506 550088 549099 548806 547439 543456 536608 527867 518525 509469 501140 493742 487282
59824 487282 481611 476686 472731 469909 467877 465834 463091 459513 455503 451738 448899 447338 446766 446331 445213
59809 445213 443196 440621 437859 434984 431967 428988 426409 424478 423202 422462 422096 421862 421473 420731 419623
59794 419623 418299 417079 416391 416422 416810 416936 416632 416267 416042 415580 414473 412919 411450 410297 409416 408845 408543
59777 408543 408049 406956 405614 404769 404470 404057 403308 402866 403182 403717 403652 402941 402179 401841 402160 403442 405912 409311
59759 409311 413076 416817 420390 423705 426827 430068 433668 437572 441794 446681 452460 458802 465263 471862
59745 471862 478667 485065 490120 493624 496281 498902 501923 505584 509868 514176 517632 519832 520810 520313 517947
59730 517947 514225 510753 508802 508154 507711 506809 505512 504034 502461 500854 499153 497084 494550 492007 490109
59715 490109 489006 488224 487133 485371 483008 480610 478957 478347 478212 477695 476601 475531 475177 475731 476909 478231
59699 478231 479197 479502 479225 478762 478543 478817 479615 480739 481831 482612 483033 483120 482744 481724 480136 478413 477160
59682 477160 476865 477690 479336 481129 482335 482479 481489 479675 477504 475145 472179 468031 462800 457353 452471
59667 452471 448212 444281 440606 437172 433660 429857 426296 423910 422983 422854 422766 422620 422825 423756 425558 428204
59651 428204 431485 435046 438518 441603 444108 446081 447834 449532 450761 450778 449293 446823 444291 442393 441261
59636 441261 440423 439127 436993 434346 431712 429145 426473 424039 422598 422397 422870 423298 423222 422153 419694 416361
59620 416361 413541 412007 410924 408900 405585 401652 397615 393515 389505 385914 382724 379719 377184 375755
59606 375755 375492 375797 376460 378033 380848 384266 387423 390218 392998 395598 397358 398052 398290 398875 400084 401704
59590 401704 403503 405406 407255 408631 409118 408755 408052 407460 407012 406599 406305 406119 405504 403811 401196 398636
59574 398636 396884 395760 394635 393279 391984 391154 390965 391225 391388 390926 389823 388526 387328 386153 385044
59559 385044 384421 384571 385224 385868 386180 385944 385056 383983 383709 384654 385993 386695 387045 388469 391887 396870 402432
59542 402432 408073 413907 420306 427673 436308 446419 458541 473788 492930 514752 535600 551025
59530 551025 558047 556236 547337 534315 520331 507832 498075 491235 486861 484315 483061 482750 483087 483785
59516 483785 484833 486620 489345 492288 494021 493545 490954 486901 481785 475738 469112 462529 456333 450241
59502 450241 443731 436807 430250 424924 420846 417189 413291 409347 405896 402997 400367 398073 396493 395695
59488 395695 395405 395549 396265 397354 398313 399019 399831 400880 401879 402875 404481 406985 409781 412230 414574 417400
59472 417400 420597 423522 425990 428433 431095 433696 435978 438051 440013 441546 442231 442173 442106 442777 444196 445618
59456 445618 446373 446668 447394 449221 452238 456389 461737 468141 475099 482157 489119 495756 501715 506853 511089
59441 511089 513733 513708 510935 506868 502984 499275 494877 489647 484236 479041 474113 469919 467098 465400 463850
59426 463850 462222 461472 462386 464584 467367 470938 476290 484228 494808 507431 521179 535504 550885
59413 550885 568521 589161 612543 638020 664989 692046 716101 733108 740101 736703 725195 709463
59401 709463 693519 680230 670952 666204 666369 671421 679904 688513 693030 690196 679115 661207 638982
59388 638982 614990 591615 570985 554297 541365 531336 523728 518332 514444 511152 508367 506737 506261
59375 506261 505893 504956 504194 504836 507168 510586 514467 518300 521474 523777 525897 528646 531809 534389 535899
59360 535899 536751 537537 538645 540580 543854 548310 553163 557964 563025 568719 574942 581586 589012 597607 607156
59345 607156 617102 627167 637347 647591 657845 668276 678999 689683 699820 709251 717914 725074
59333 725074 729454 730471 728970 726299 722860 717990 711129 702571 693034 682945 672441 661703 650923
59320 650923 640058 628973 617780 606906 596827 587896 580251 573692 567781 562293 557497 553740 550951
59307 550951 548863 547591 547500 548649 550891 554594 560652 569480 580425 592277 603769 613177 618085 616460
59293 616460 608021 594245 577148 558446 539675 522376 507784 496397 487975 481832 477232 473674
59281 473674 470874 468578 466635 465327 465247 466508 468417 470322 472572 476149 481502 488264 496040 504853 514705
59266 514705 525313 536508 548394 560725 572513 582661 590809 597243 602120 605196 606268 605555 603520
59253 603520 600433 596213 590691 584050 576954 570114 563731 557580 551699 546669 542945 540240 538042 536658
59239 536658 537167 540072 544463 548876 552701 556270 559793 562947 565724 569019 573751 579615 585243 589533
59225 589533 592364 594026 594563 593909 592196 589529 585674 580360 573753 566367 558663 550991 543777 537314 531341
59210 531341 525208 518578 511774 505361 499641 494652 490433 487054 484459 482475 480964 479857 479055 478450 478054
59195 478054 477977 478149 478167 477671 476899 476647 477451 478975 480460 481659 482999 484865 487128 489478 491849 494322
59179 494322 496949 499947 503750 508451 513398 517728 521279 524559 527846 530749 532855 534506 536652 539979
59165 539979 544321 548938 553240 557200 561123 565166 569186 572867 575726 577083 576382 573727 569859 565439
59151 565439 560584 555159 549211 542883 536230 529421 522866 516770 510787 504457 497827 491267 484858 478417
59137 478417 472029 466074 460721 455796 451157 446851 442927 439488 436917 435538 434937 434093 432481 430783 430282
59122 430282 431773 435178 439932 445441 451333 457524 464052 470875 477925 485340 493410 502168 511247 520168
59108 520168 528641 536667 544561 552803 561526 570098 577640 583986 589709 595032 599260 601625 602322 602225 601842
59093 601842 601038 599657 597928 596133 594242 592075 589698 587497 585854 584791 583920 582789 581207 579091 576117
59078 576117 571858 566409 560551 555005 549682 543960 537534 530698 523909 517391 511246 505642 500766 496716
59064 496716 493473 490890 488664 486501 484374 482505 481007 479600 477752 475089 471705 468115 464921 462456
59050 462456 460705 459509 458784 458461 458315 458000 457355 456595 456080 455896 455783 455537 455371 455634 456245 456660 456571 456361
59032 456361 456641 457529 458700 460046 461853 464319 467345 470931 475378 480811 486866 493226 500251 508655 518636
59017 518636 529703 541287 553067 564584 575050 583822 590822 596162 599635 600962 600440 598819 596468
59004 596468 593160 588919 584645 581424 579449 578112 577090 576804 577741 579836 582740 586236 590051 593585 596277
58989 596277 598145 599615 600904 601860 602258 601962 600806 598663 595635 592027 588199 584633 581980 580696 580658
58974 580658 581382 582614 584477 587157 590816 595800 602537 611103 621096 631952 643188 654354 665098
58961 665098 675362 685343 695201 704924 714322 722914 730013 735335 739388 742651 744359 742761 736838 727290
58947 727290 715621 702837 689453 676157 663652 651921 640316 628533 617073 606625 597336 588947
58935 588947 581423 575115 570208 566209 562245 557928 553727 550370 548017 546246 544693 543393 542531 542174 542285
58920 542285 542675 542859 542280 540867 539136 537652 536575 535842 535544 535913 537029 538657 540392 541983 543565 545536
58904 545536 548152 551481 555821 561742 569344 577844 586464 595425 605368 616017 626330 636024 645976 656808
58890 656808 667937 678538 688768 699510 711413 724694 739351 755037 771101 787179 803285
58879 803285 818856 832289 842147 848468 852293 854206 853954 851191 845834 837845 827406 815309 802664
58866 802664 790166 778007 766274 755038 744290 734346 726067 720030 715569 711235 706101 700074 693113
58853 693113 684938 675577 665535 655173 644496 633751 623720 615102 607846 601272 594665 587829 581319
58840 581319 576015 572059 568337 563491 557350 550831 544540 538189 531430 524553 518027 511971 506413 501621
58826 501621 497732 494465 491578 489399 488543 489251 491208 493861 496727 499569 502466 505631 509093 512653 516196
58811 516196 519846 523785 528029 532302 536006 538461 539495 539683 539684 539483 538650 537148 535324 533155 530197 526382
58795 526382 522304 518461 514764 511022 507416 504166 501089 497795 494034 489672 484719 479670 475509 473095
58781 473095 472716 474282 477500 481645 485681 489010 491884 494850 498085 501404 504471 506591 506763 504443 500099
58766 500099 494725 489045 483418 478078 473003 467863 462653 458141 455149 453559 452498 451398 450358 449660
58752 449660 449521 450313 452337 455240 458170 460697 463121 465699 468084 469902 471483 473557 476352 479414 482294
58737 482294 485103 488380 492595 497803 503612 509475 515171 521005 527424 534404 541370 547725 553388 558730
58723 558730 564111 569509 574503 578609 581788 584698 588224 592606 597227 601554 606079 611878 619208 627024
58709 627024 634062 639977 645173 649842 653581 655785 656047 654230 650411 644773 637401 628278 617534 605438
58695 605438 592045 577169 560975 544264 527914 512325 497746 484701 473565 464062 455826 449163
58683 449163 444552 441516 438799 435663 432267 428720 424674 420177 416130 413412 411994 411322 411131 411517 412627
58668 412627 414689 418017 422641 428222 434614 442162 451130 461154 471551 481817 491405 499367 504750
58655 504750 507339 507730 506757 504974 502537 499346 495460 491430 487928 484989 481979 478495 474861 471483 468275
58640 468275 465193 462851 461909 461988 461802 460467 458190 455687 453359 451246 449450 448201 447516 446970 446052 444774
58624 444774 443711 443239 442911 441956 440254 438437 437053 436213 436077 437055 439238 442164 445475 449333 453814 458363
58608 458363 462344 465790 469144 472484 475441 477657 478949 479280 478992 478887 479571 480768 481610 481519 480535 478974
58592 478974 477120 475267 473818 473262 473995 475984 478686 481707 485480 490719 497139 503487 509171 515086 522253
58577 522253 530355 538329 545871 553398 560885 567702 573557 578815 583852 588746 593667 599019 605145 612368
58563 612368 621300 632629 646518 662640 680703 700509 721555 743019 764155 784319 802759 818832
58551 818832 832343 843254 851201 855820 857400 856613 853665 848313 840832 832374 824167 816683 809596 802137
58537 802137 793433 782879 770371 756045 740053 722865 705531 689073 673801 659700 647275 637244
58525 637244 629485 623017 617165 612111 608154 605076 602520 600483 599107 598305 597727 596843 595084 592347 589394
58510 589394 587214 585865 584417 582151 579330 576578 574089 571746 569558 567626 565859 564095 562348 560757
58496 560757 559412 558327 557460 556683 555897 555169 554697 554749 555691 557727 560374 562613 564058 565651 568624 573058
58480 573058 578165 583711 590284 598134 606762 615910 626111 637842 650696 663743 676155 687091 695454
58467 695454 700313 701402 699066 693964 686971 679036 670927 663281 656809 652060 649042 647520 647603 649530 652987
58452 652987 657365 662678 669404 677275 685106 692162 698838 705401 710773 713282 712300 708568 703256 697240
58438 697240 691123 685450 680761 677482 675658 674866 674729 675508 677678 680927 684179 686829 689388 692706 697156
58423 697156 702845 709894 717989 726185 733641 740193 745862 750271 753108 754743 755775 756136 755120 752172
58409 752172 747317 740969 733682 726070 718728 712169 706718 702314 698544 695247 692899 691920 691740 691265 690272
58394 690272 689604 689933 691134 693101 696223 700604 705604 710670 715925 721416 726508 730614 733944 736929 739522
58379 739522 741697 744002 746903 750145 753462 757408 762613 768625 774419 779793 785449 791816 798592 805423
58365 805423 812329 819442 826772 834263 841707 848829 855786 863316 871906 881122 890268 899384 908958 918847
58351 918847 928142 936036 942232 946680 949596 951770 954268 957612 961614 966026 970954 976568 982819 989627
58337 989627 997167 1005878 1016208 1028225 1041432 1055126 1069062 1083513 1098593 1113802 1128487 1142470
58325 1142470 1156007 1169334 1182370 1194624 1205281 1213725 1220150 1225456 1230492 1235663 1241107 1246733 1252162
58312 1252162 1257280 1262871 1270038 1278962 1288996 1299965 1312319 1325789 1339030 1351231 1363165 1376080
58300 1376080 1390321 1405623 1421913 1439140 1456970 1475225 1493988 1512826 1530852 1548148 1566293
58289 1566293 1586742 1609529 1634100 1660380 1688127 1716263 1743947 1771596 1799812 1828033 1855298
58278 1855298 1881734 1908246 1935277 1962921 1991741 2022491 2055414 2090575 2128303 2168529 2210355
58267 2210355 2253154 2297502 2344244 2393363 2444576 2498202 2554578 2613443 2674754 2739125 2806468
58256 2806468 2875250 2944194 3013689 3084447 3155998 3227849 3300977 3376633 3454719 3534891 3618191
58245 3618191 3705946 3798048 3894012 3994771 4101723 4215006 4334540 4461692 4597923 4742755
58235 4742755 4895143 5055992 5227231 5409348 5602010 5806258 6023875 6255438 6501230
58226 6501230 6763271 7044235 7345359 7667767 8014730 8390128 8795863 9233522 9707389
58217 9707389 10223043 10784520 11396199 12066091 12803737 13616274 14510754 15499413 16598862
58208 16598862 17825719 19198066 20740584 22483771 24459532 26703778 29264536 32205196
58200 32205196 35604837 39566603 44232023 49788771 56471045 64558247 74363641 86205657
58192 86205657 100383676 117184423 136901484 159830195 186240912 216338730 250122497
58185 250122497 287012914 325316650 361904079 392524181 412811775 419567678 411719379
58178 411719379 390572509 359317684 322053928 282744804 244489643 209272253 178084675
58171 178084675 151204217 128462546 109453699 93677340 80622830 69812540 60827487
58164 60827487 53321126 47016072 41690176 37165914 33303997 29993349 27140091 24664657
58156 24664657 22504244 20610179 18940916 17460003 16139034 14957122 13896370 12940614
58148 12940614 12077781 11299291 10596289 9958971 9379331 8851616 8370067 7928777 7523400
58139 7523400 7150179 6803386 6476425 6165525 5870048 5589576 5323331 5072156 4837988
58130 4837988 4620818 4418387 4229006 4052419 3887868 3733726 3589307 3454754 3328832
58121 3328832 3209139 3094911 2987466 2887335 2793014 2703058 2617354 2535618 2456611 2379766
58111 2379766 2306007 2236158 2169933 2107134 2048345 1993626 1941800 1891740 1843250 1796182 1749976
58100 1749976 1704734 1661508 1620782 1581729 1543656 1507090 1472668 1439918 1408013 1376981 1347307
58089 1347307 1318860 1290984 1263433 1236683 1211476 1188277 1166987 1147106 1128358 1110982 1095021
58078 1095021 1079661 1063920 1047727 1031583 1015384 998419 980400 961650 942381 922720 903379
58067 903379 885312 868581 852408 836430 821160 807151 794517 783329 773626 764961 756666 748593
58055 748593 740819 732710 723188 712074 700313 688791 677648 666773 656163 645767 635717 626728
58043 626728 619426 613332 607332 601003 594574 587777 580003 571651 564080 557923 552556 547408 542581 537804
58029 537804 532046 524793 516785 508828 500778 492155 482932 473176 462824 452446 443368 436279 430377 424575
58015 424575 418920 414193 410618 407693 404844 401689 398070 394372 391468 389825 388930 387965 386676 385198 383488
58000 383488 381403 379067 376786 374762 373150 372114 371658 371627 371970 372711 373761 375170 377490 381181 385648
57985 385648 389585 392374 394402 395842 395989 394173 390583 385836 380426 374952 370092 365837 361381 356340
57971 356340 351469 347657 344819 342330 340008 338021 336266 334493 332854 331769 331388 331515 331875 332297 332906
57956 332906 334167 336320 338649 339920 339661 338448 336760 334344 331044 327479 324438 322165 320604 319696 319098
57941 319098 318356 317769 318323 320426 323532 327472 333085 340794 349568 358258 367095 376738 386617 395472 402980
57926 402980 409477 414323 415947 413630 408180 400782 392183 383124 374522 366775 359498 352245 345120 338519
57912 338519 332715 327731 323309 319173 315696 313952 314489 316375 318168 319602 321399 323568 324958 324772 323634
57897 323634 322805 322933 323904 325264 326422 326921 326906 327029 327633 328379 328866 329194 329649 330203 330626 330816 330741 330230 329078
57878 329078 327266 324914 322159 319194 316301 313576 310614 306651 301227 294842 288788 284039 280319 276602
57864 276602 272542 268922 266540 265260 264601 264772 266461 269818 274275 279298 284821 290968 297744 304973 312248
57849 312248 319104 325474 331723 337866 343107 346654 348654 349769 350171 349630 348308 346615 344413 341240 337311
57834 337311 333408 329663 325326 320062 314668 310049 306136 302310 298405 294748 291498 288450 285440 282714
57820 282714 280879 280459 281240 282230 282666 282959 284062 285940 287358 287267 285561 282238 276726 268821 259680 251050
57804 251050 243694 237183 231022 225316 220319 215946 211939 208250 205137 203029 202266 202753 203862 204807 205148
57789 205148 204922 204455 204104 204067 204302 204756 205635 207279 209796 213212 217970 224730 233338 242487 250920 258708
57773 258708 266788 275443 283848 291103 297092 302090 306060 308796 310493 311713 312773 313496 313552 312722 310696
57758 310696 306969 301435 295056 289450 285506 282575 279315 275158 270641 266428 262511 258601 254924 252178
57744 252178 250781 250459 250595 250727 250571 249832 248380 246632 245425 245169 245361 245241 244810 244709 245122 245390 245001
57727 245001 244394 244355 245073 246369 248452 251680 255689 259544 262826 265856 268721 270786 271529 271262 270578 269503
57711 269503 267687 265133 262215 259084 255484 251154 246151 240802 235552 230857 226994 223967 221599 219626
57697 219626 217674 215383 212785 210459 209019 208425 207901 206605 204354 201714 199360 197401 195459 193459 192058
57682 192058 191924 192802 193773 194610 196343 200217 206386 214056 222752 233098 246464 264175 287100 315595
57668 315595 349542 388495 432046 480106 532425 587177 639593 682277 707622 710777 691193 652304
57656 652304 600225 542102 484261 430817 383610 343163 309387 281690 259168 241134 227211
57645 227211 216819 208959 202747 197867 194310 191926 190398 189336 188271 186929 185647 185083 185253 185388 185064
57630 185064 184907 185573 186458 186262 184694 182829 181664 181003 180004 178291 176173 174112 172351 170833 169214 167112
57614 167112 164591 162300 160870 160232 159709 158727 157320 155975 155179 155109 155556 156030 156031 155387 154323 153163 152047
57597 152047 150998 150155 149639 149158 148052 145969 143306 140708 138252 135480 132201 128849 125871 123101 120042
57582 120042 116645 113520 111319 110095 109324 108532 107772 107454 107733 108222 108300 107529 105708 102866 99460 96354
57566 96354 94192 92866 91955 91538 92100 93659 95520 97014 98006 98493 98218 97072 95596 94683 94897 96244
57550 96244 98342 100586 102371 103497 104285 105124 106064 106989 107918 108891 109790 110616 111819 113935 116902 119978
57534 119978 122389 123911 124751 124964 124086 121498 117282 112582 108818 106473 104909 103330 101540 99693 97831
57519 97831 95963 94236 92666 91041 89446 88614 89283 91343 94004 96680 99355 102162 104992 107514 109321
57504 109321 110069 109786 109004 108345 107946 107419 106278 104295 101665 99029 97110 95984 94827 92726 89606 86139
57488 86139 82926 80207 78217 77217 77040 76974 76364 75161 73884 73263 73829 75503 77461 78703 78920 78650
57472 78650 78539 78690 78845 78960 79311 80081 81005 81555 81534 81430 82041 83674 85801 87596 88683 89265 89684 90044
57454 90044 90160 89723 88612 87223 86379 86679 88017 89893 92051 94535 97157 99264 100224 100060 99496 99295
57438 99295 99541 99637 99137 98379 97994 97955 97617 96755 95941 95632 95486 95022 94402 93975 93490 92506 91263 90393 89904
57419 89904 89233 88250 87448 87038 86683 86321 86454 87212 87814 87527 86706 86290 86549 86933 86989 86909 87108 87668 88302 88591
57399 88591 88153 86853 85036 83511 83068 83865 85252 86259 86322 85621 84794 84434 84791 85711 86769 87641 88465
57382 88465 89624 91078 92208 92544 92344 92108 91786 90952 89696 88874 89316 90923 92545 92657 90491 86860
57366 86860 83680 82231 81987 81522 80317 79102 78561 78461 78243 77810 77400 77137 77084 77433 78311 79547 80817
57349 80817 81895 82694 83309 84055 85206 86579 87623 88009 87882 87567 87353 87578 88488 89780 90618 90279 88600
57332 88600 85846 82566 79697 78236 78404 79367 80077 80226 80173 80243 80420 80588 80796 81164 81631 81775 81053 79446
57314 79446 77721 76716 76408 76057 75264 74390 73841 73462 72908 72214 71682 71503 71747 72469 73545 74573 75118 74944
57296 74944 74042 72692 71466 70703 69965 68562 66746 65739 66258 67525 68192 67823 67076 66790 67371 68745 70484
57279 70484 72138 73788 75989 78908 81875 84195 86074 88354 91608 95880 100912 106103 110588 113954
57265 113954 116727 119635 122648 125257 127412 129497 131473 132811 133321 133434 133581 133860 134420 135643 137656
57250 137656 140049 142271 144022 145249 146146 147200 148795 150571 151601 151473 150886 150971 152201 154143 156074
57235 156074 157692 159342 161633 164663 167636 169550 170346 171079 172811 175576 178586 181203 183463 185833 188631
57220 188631 191639 194175 195720 196576 197813 200445 204737 210327 216712 223486 230288 236802 242770 247978
57206 247978 252445 256690 261558 267383 273520 279069 284070 289560 296382 304336 312700 321161 329815 338601
57192 338601 347327 356176 365602 375600 385678 395773 406607 418675 431406 443974 456575 470082
57180 470082 484555 499003 512837 526769 541790 557802 573774 588974 603506 617775 631833
57169 631833 645231 657332 667882 677404 686863 696815 707145 717708 728806 740750 753403 766649
57157 766649 781041 797331 815389 834134 852674 871162 890353 910581 931380 951993 972080
57146 972080 991889 1011816 1031900 1051808 1071204 1089899 1107748 1124740 1141281 1158017 1175217
57135 1175217 1192515 1209430 1225896 1242111 1258192 1274241 1290520 1307368 1325137 1344349 1365644
57124 1365644 1389349 1415401 1443911 1475530 1510918 1550049 1592199 1636395 1681734 1727700 1774677
57113 1774677 1823961 1876969 1934580 1997419 2066456 2142985 2228266 2323459 2429690 2548035 2679966
57102 2679966 2828435 2998505 3196760 3430411 3707206 4035954 4426801 4891145 5441171
57093 5441171 6088578 6842664 7708341 8683902 9758442 10911050 12113807 13336718 14552140
57084 14552140 15742799 16918370 18130132 19459132 20969525 22657389 24439208 26189230
57076 26189230 27789002 29148852 30198632 30874627 31122125 30909039 30236424 29139377 27680370
57067 27680370 25939311 24003841 21961778 19895159 17874586 15954747 14173208 12552107
57059 12552107 11100371 9815739 8687959 7703133 6846890 6105115 5463702 4908918 4428213
57050 4428213 4010684 3647261 3330716 3055138 2815097 2605440 2421909 2261393 2121204
57041 2121204 1998326 1889715 1793199 1707706 1632584 1566937 1509770 1460686 1420289 1389776 1369988
57030 1369988 1360621 1360220 1367080 1380463 1400838 1428039 1458195 1482389 1489344 1470709 1424825 1356513
57018 1356513 1274185 1186866 1102139 1024769 956357 896477 844346 799516 761457 729255 701956
57007 701956 678876 659337 642367 627049 613184 601310 591797 583904 575922 566410 555239 543330
56995 543330 531481 519653 507364 494548 481913 470534 461044 453161 446168 440066 436043 435518 438809
56982 438809 445041 452997 461351 468192 471343 469737 464019 455337 444009 429870 413593 396983 381935
56969 381935 369397 359282 350951 343796 337647 332850 329975 329471 331521 336018 342683 351492 362951 377529
56955 377529 394595 412192 427964 439974 446658 446796 440147 427864 411788 393537 374488 356155
56943 356155 339875 326229 315183 306673 300690 297096 295934 297819 303441 312731 325019 340103 358613
56930 358613 381105 406963 434027 458836 477309 486022 483578 470839 449920 423119 392712 361104
56918 361104 330558 302766 278755 258931 242943 229686 217959 207373 198441 191619 186377 181493
56906 181493 176316 171483 168235 167111 167506 168400 169257 170245 171839 174337 177609 181330 185520 190808 197941
56891 197941 207176 218450 231932 247939 266333 286616 308742 333130 359392 385402 408045 424761
56879 424761 434271 436383 431733 421666 407988 392680 377689 364552 354022 346411 342367 342820 347955
56866 347955 357006 369524 386300 408457 436167 469013 507118 550865 599451 650297 699627 742811
56854 742811 774433 789551 786006 765542 732615 692408 649694 608455 571599 540897 517302 501238
56842 501238 492792 492156 500054 517334 544025 579290 622627 674748 736902 809380 890612 976952
56830 976952 1062495 1139020 1196984 1227850 1226755 1194135 1135468 1059407 975318 891230 812702 742756
56818 742756 682734 633348 595014 567512 549984 541673 542479 552599 571948 600235 637311 683037
56806 683037 736802 797020 860212 919893 967058 993263 994149 970362 925926 866608 799245 730672
56794 730672 665851 606979 554650 509506 472538 444295 424374 411648 404882 403354 407101 416503
56782 416503 431636 452196 477840 507938 540573 572027 597523 612640 614438 602110 577080 542404
56770 542404 501728 458609 416267 377251 342964 313662 288991 268334 250799 235399 221537
56759 221537 209114 198165 188673 180718 174364 169243 164658 160219 156097 152529 149424 146576 143950 141615
56745 141615 139647 138141 136971 135514 133091 129821 126607 124130 122263 120652 119410 118939 119406 120592 121956
56730 121956 122777 122678 122234 122564 124080 126011 127413 128162 128678 129230 129863 130565 131083 131024 130546 130567 131832 134190
56712 134190 137128 140433 143685 145733 145669 144125 142727 142337 142582 143018 143779 144859 145603 145397 144378 143115
56696 143115 141955 140933 139960 138888 137752 137107 137679 139383 141137 141939 141839 141510 141347 141414 141890 142931 144177
56679 144177 145025 145443 146043 147224 148653 149731 150226 150279 150156 150202 150747 151768 152870 153847 155009 156615 158212
56662 158212 159039 159069 159118 159789 160748 161360 161767 162991 165911 170252 174649 177789 179619 181308 183778 186449
56646 186449 187863 187502 186415 185862 185937 185871 185131 183706 181657 178986 175771 172062 167825 163432 159855 157840
56630 157840 157108 156901 156967 157365 157604 156985 155798 155225 155753 156486 156444 155805 155414 155582 155917 155961 155514 154583 153409
56611 153409 152349 151486 150585 149637 149118 149414 150191 150623 150033 148284 145930 144092 143676 144361 144754 143954 142613
56594 142613 142062 142762 144065 145222 146072 146892 148005 149517 151090 152125 152514 153020 154480 156663 158406 158889
56578 158889 158393 157733 157339 157102 156867 156791 157202 158201 159467 160525 161252 162054 163493 165837 168995 172740 176852
56561 176852 181160 185558 190021 194607 199484 204818 210456 215805 220251 223603 225886 226913 226552 225332
56547 225332 224193 223524 222985 222416 222250 222700 223106 222675 221456 220076 218825 217517 216008 214304 212279 209816
56531 209816 207196 204925 203139 201511 199723 197750 195742 193983 192924 192881 193599 194320 194383 193660 192455 191218
56515 191218 190323 189906 189771 189544 188971 188103 187162 186263 185262 183989 182629 181659 181219 180795 179847 178565 177560
56498 177560 176974 176436 175843 175516 175545 175598 175572 175777 176243 176509 176451 176641 177394 178046 177804 176868 176137 176161 176872 177932
56478 177932 178727 178436 176852 174983 174157 174595 175382 175732 175714 175778 176172 176910 177899 178974 180093 181479 183354
56461 183354 185509 187328 188187 187854 186752 185923 186235 187398 188171 187852 187067 186717 186713 186329 185329 184073 182929
56444 182929 182265 182686 184452 186827 188719 189880 190769 191480 191656 191436 191641 192810 194666 196653 198409 199607
56428 199607 199942 199540 198987 198802 199206 200334 202199 204372 206154 207184 207555 207462 207171 207245 208195 209844 211502
56411 211502 212804 213904 214883 215509 215710 215730 215674 215396 215008 215010 215653 216527 217059 217193 217376 217989 218847 219250 218620
56392 218620 217186 215752 214650 213332 211342 209204 207826 207426 207710 208705 210556 212678 214024 214216 213661
56377 213661 212611 210992 209246 208346 208649 209459 210039 210390 210767 211157 211672 212817 214824 217145 219080 220637
56361 220637 222433 224926 227966 230894 233014 234238 235340 237184 239721 242099 243707 244650 245264 245870 247036
56346 247036 249271 252172 254511 255579 255929 256463 257275 257786 257583 256729 255595 254684 254372 254572 254911 255365 256286
56329 256286 257709 259148 260285 261371 262659 263986 265249 266812 268974 271404 273571 275449 277341 279226
56315 279226 280794 282022 283297 284844 286293 287006 286833 286507 287151 289326 292647 296400 300285 304329 308381
56300 308381 312140 315548 318761 321861 324942 328215 331560 334240 335690 336447 337694 340002 343143 346866
56286 346866 351071 355316 359090 362679 366939 372091 377580 383223 389610 397076 405122 413172 421163 429061
56272 429061 436617 444030 452151 461547 471956 483030 494993 508174 522611 538499 556356 576214
56260 576214 597307 619136 642317 667878 696279 727776 763162 803401 848736 898910 954179
56249 954179 1015659 1084613 1161705 1246853 1339537 1439166 1545166 1656744 1772829 1892381 2014349
56238 2014349 2136779 2256323 2369287 2472903 2564894 2642252 2701660 2741110 2760125 2758542 2736344
56227 2736344 2694771 2636192 2562581 2475449 2377609 2273420 2166456 2058138 1949397 1842301
56217 1842301 1738949 1639890 1544942 1454740 1370321 1291842 1218901 1151584 1090148 1034092 982596
56206 982596 935513 893039 854767 819946 788345 760049 734710 711772 691131 672850 656537
56195 656537 641642 628069 615853 604615 593927 583899 574905 567166 561014 556931 554709 553144 551207
56182 551207 548966 546865 544886 543140 542470 543449 545334 546942 548107 549435 551174 553162 555458 558074 560520
56167 560520 562462 564451 567177 570375 573246 575602 577905 580661 584435 589836 596726 604032 611147 618883
56153 618883 628242 638980 650369 662670 676787 693051 711424 732364 756465 783878 815156 852039
56141 852039 896193 947791 1006543 1073450 1150045 1236245 1330179 1429405 1530613 1628599 1717627
56130 1717627 1794371 1858607 1911523 1955024 1992457 2027669 2062143 2093763 2118754 2134121 2138482
56119 2138482 2132194 2117459 2097393 2074229 2048392 2018868 1983466 1938958 1882388 1813052 1732990
56108 1732990 1645727 1555076 1464770 1378132 1297775 1225865 1164204 1113314 1071893 1038029 1010631
56097 1010631 989053 972110 958677 948796 942980 940706 940658 942000 944349 946987 949363 951986 955543 959569
56083 959569 963235 966955 971786 977659 983689 989887 997012 1005038 1013371 1022356 1032898 1044715 1056596
56070 1056596 1068408 1081254 1095619 1110743 1125822 1140487 1154316 1167350 1180814 1195767 1211356
56059 1211356 1226172 1240969 1257957 1277477 1297562 1316978 1336534 1356954 1377543 1397725 1418147
56048 1418147 1439402 1461102 1482844 1504884 1527337 1549844 1572266 1594689 1616816 1638634 1661394
56037 1661394 1686349 1712737 1738757 1764404 1791511 1821146 1852879 1886566 1922658 1960648 1999322
56026 1999322 2038846 2080674 2125169 2171299 2218765 2268309 2319808 2372249 2425830 2481887 2540487
56015 2540487 2600293 2660969 2723493 2787984 2853728 2921592 2993841 3071227 3152701 3238245 3329287
56004 3329287 3425993 3526941 3631916 3742284 3858282 3978880 4104722 4238148 4379778 4528192
55994 4528192 4683467 4847823 5022240 5205863 5399381 5605474 5825291 6058131 6305197
55985 6305197 6569738 6852871 7153646 7474327 7821123 8198460 8607000 9048665 9528965
55976 9528965 10052854 10623172 11244996 11926825 12676026 13498470 14404569 15410473 16531886
55967 16531886 17783219 19185408 20768814 22567048 24615986 26962902 29671138 32815901
55959 32815901 36488062 40811641 45956366 52135713 59603189 68647849 79571780 92658485
55951 92658485 108169257 126367334 147522651 171885205 199656522 230899926 265222535
55944 265222535 301215513 336020957 365546894 385472581 392592778 385814621 366388541
55937 366388541 337387460 302734109 266181548 230614060 197835329 168732292 143561545
55930 143561545 122188319 104257081 89319205 76915716 66615223 58032950 50846827
55923 50846827 44799740 39684643 35331504 31605626 28404018 25642905 23249249 21162910
55915 21162910 19337892 17736092 16323120 15071218 13960107 12971624 12087123 11291368
55907 11291368 10574187 9926212 9336881 8797960 8304680 7851703 7431843 7040217 6675790
55898 6675790 6337340 6021497 5726022 5451178 5196350 4958730 4736711 4531164 4342005
55889 4342005 4166890 4004579 3856266 3722113 3599695 3487291 3385443 3293674 3208639 3127136
55879 3127136 3048191 2970927 2893522 2816009 2741136 2670288 2600862 2529445 2455298 2379057 2300411
55868 2300411 2219131 2136664 2054974 1975218 1898602 1826697 1759808 1696900 1638090 1585064 1537956
55857 1537956 1494190 1451803 1411749 1375396 1341876 1309580 1278344 1248344 1218534 1187981 1157350
55846 1157350 1127480 1097853 1067979 1038966 1012158 987380 963898 941976 922218 904448 888403
55835 888403 874388 862143 850218 837510 824296 810939 796928 782219 768077 755463 743884
55824 743884 732769 722477 712895 702659 691124 679600 669278 659388 648805 637961 627541 616700
55812 616700 604495 591982 581017 571750 563024 554534 546935 540426 534871 530837 528974 528687 528796 529221
55798 529221 530846 534043 538382 543340 548269 552112 554293 555441 556378 556915 556565 555713 555010 554208 552742 550814
55782 550814 548654 545132 538378 527584 513319 496564 478486 460697 444523 430126 417255 406507
55770 406507 398931 394675 392956 393016 394134 394967 393948 390422 384802 377881 370520 363646 357770 352718 348254
55755 348254 344499 341327 338110 334724 332038 330552 329289 326979 323667 320186 316779 313343 310372 308315
55741 308315 306436 303580 299835 296259 293197 290054 286569 283157 280036 277025 274207 271918 270122 268617
55727 268617 267603 267152 266324 263843 259591 254551 249374 243969 238397 233152 228481 224304 220856 218577 217357
55712 217357 216679 216543 217446 219463 222132 225191 228586 231719 233661 234357 234891 236245 238309 240148 240688 239200
55696 239200 235796 231634 228022 225199 222367 218859 214747 210476 206518 203356 201204 199768 198699 198137
55682 198137 198251 198543 198346 197878 198078 199534 202228 206047 210583 214537 216387 215868 214088 212082 210024 207921
55666 207921 206148 204940 204056 203265 202650 202197 201658 200957 200289 199706 199162 198962 199635 201252 203404 205776 208098
55649 208098 209698 210018 209685 210117 211792 213684 214714 214812 214135 212234 208829 204779 201259 198219 194464 189265
55633 189265 183291 177769 173168 168974 164548 159951 155824 152638 150355 148830 148083 147884 147497 146395 145038
55618 145038 144327 144341 144219 143268 141635 139778 137852 135811 133671 131459 129222 127176 125554 124244 122927
55603 122927 121565 120421 119654 119254 119271 119616 119733 119022 117582 115988 114411 112580 110682 109481 109301 109582
55587 109582 109712 109694 109605 109073 107870 106564 105999 106356 107216 108360 109956 111970 113876 115192 116105 117367 119565
55570 119565 122548 125672 128523 131208 133912 136502 138722 140442 141443 141318 140037 138300 136788 135239
55556 135239 132879 129665 126500 124181 122590 120949 118415 114508 109548 104695 101033 98516 96280 93979
55542 93979 92274 91926 92971 94894 97170 99451 101658 104020 106734 109644 112534 115538 118714 121481 123150
55527 123150 123873 124308 124503 123971 122863 122018 121708 121293 120385 119370 118409 116931 114701 112501 111043 109946
55511 109946 108524 106919 105685 104761 103673 102354 101065 99766 98260 96687 95290 93857 91961 89614
55497 89614 87242 85171 83518 82302 81299 80089 78647 77553 77150 76822 75670 73659 71626 70344 70048
55482 70048 70588 71529 72293 72715 73339 74705 76543 78083 78895 78969 78324 77201 76444 76900 78385 79864 80660
55465 80660 80925 80923 80537 79743 78984 78736 78992 79487 80115 80891 81757 82680 83780 85112 86399 87220 87492 87592 87882
55446 87882 88223 88119 87428 86687 86531 86914 87222 87079 86660 86205 85667 85037 84563 84431 84524 84736 85150 85652 85784
55427 85784 85353 84834 84766 85086 85484 86082 87139 88286 88727 88279 87664 87608 88080 88607 89011 89519 90278 91051 91492
55408 91492 91589 91637 91734 91507 90576 89104 87554 86060 84498 83116 82426 82378 82229 81586 81006 81220 82213 83401
55390 83401 84224 84237 83236 81815 81217 81975 83134 83464 82956 82375 81851 80895 79560 78576 78317 78513 78977 79768
55372 79768 80553 80715 80359 80386 81233 82188 82305 81469 80231 79142 78518 78319 77918 76501 74108 71856 70711
55355 70711 70434 70139 69532 69112 69370 70212 71108 71513 71279 70889 71155 72356 73796 74421 73800 72360 70853 69872
55337 69872 69723 70378 71421 72287 72759 73183 73984 74922 75046 73737 71710 70484 70731 71588 71943 71854 72054 72562
55319 72562 72772 72818 73736 75903 78222 79433 79551 79357 79052 78267 77118 76326 76230 76425 76542 76776 77302 77673
55301 77673 77348 76623 76510 77596 79337 80648 80941 80378 79358 78192 77248 76856 76820 76391 75136 73600 72693
55284 72693 72609 72817 73038 73656 75028 76829 78308 78934 78681 77911 77137 76679 76474 76378 76568 77320 78395 79029
55266 79029 78709 77709 76791 76603 77270 78217 78457 77586 76495 76514 77742 78857 78752 77752 76864 76580 76831 77511
55248 77511 78326 78630 78114 77367 77100 77141 76829 76141 75687 75761 76116 76584 77184 77662 77665 77411 77440 77638 77270 76176
55228 76176 75117 74643 74391 73951 73654 73881 74131 73638 72609 72130 72918 74699 76741 78469 79561 80003 80126
55211 80126 80326 80649 80890 80949 80795 80258 79305 78429 78215 78527 78696 78589 78845 79791 80749 80889 80293 79585 78859
55192 78859 77686 76106 74943 74924 75949 77395 78783 79908 80607 80712 80202 79286 78381 77970 78270 78944 79360
55175 79360 79183 78562 77722 76709 75673 75056 75204 76007 77191 78756 80770 82902 84545 85422 85734 85744 85547
55158 85547 85271 85130 85160 85173 85116 85124 85093 84555 83308 81888 80991 80601 80111 79285 78601 78547 79017 79688 80620 82022
55138 82022 83605 84686 84944 84726 84457 84158 83674 83048 82368 81530 80467 79427 78663 78027 77229 76372 75823 75684
55120 75684 75891 76693 78350 80302 81422 81479 81595 82692 84023 84053 82523 80828 80392 81347 82891 84288 85273
55103 85273 85918 86453 87036 87597 88091 88817 90093 91573 92372 92073 91246 90729 90696 90685 90336 89789 89467 89684 90413
55084 90413 91282 91781 91581 90709 89565 88822 89113 90509 92321 93648 94096 93811 93000 91826 90726 90289 90677
55067 90677 91466 92203 92858 93611 94520 95464 96137 96073 95023 93434 92173 91656 91546 91338 90873 90219 89558 89310
55049 89310 89842 90835 91416 91219 90833 90959 91642 92563 93457 93876 93232 91649 90159 89420 88872 87925 87334 88309
55031 88309 90615 92735 93758 94002 93754 92669 90772 88979 88014 87580 87177 87020 87490 88207 88335 87578 86341
55014 86341 85190 84596 84924 86119 87509 88334 88442 88245 88194 88581 89604 91235 93087 94730 96019 96939 97312
54997 97312 96989 96231 95563 95311 95487 96033 96869 97780 98534 99125 99712 100332 100811 100873 100176 98455 95946 93596
54979 93596 92520 93079 94594 96020 96822 97262 97895 98792 99338 98993 98204 98111 99157 100476 101007 100805 100666 100772
54961 100772 100497 99575 98636 98244 98057 97450 96581 96254 96846 97856 98599 98908 99025 99063 98860 98327 97717 97417 97542
54942 97542 97878 98231 98612 98977 99034 98590 97992 97793 97965 97835 97037 96177 96184 97204 98497 99402 100000 100733 101743
54923 101743 102828 103896 105191 107029 109520 112606 116264 120523 125368 130715 136482 142536 148539 154000
54909 154000 158507 161819 163634 163433 160763 155694 149001 141976 136088 132358 130594 129283 126744 122668
54895 122668 118316 115187 113743 113486 113761 114089 114060 113467 112609 112059 112033 112240 112381 112507 112776 113102 113322 113650
54877 113650 114749 117231 121067 125548 129918 134072 138574 143996 150301 156810 162509 166353 167671 166648
54863 166648 164254 161390 158183 154419 150367 146556 142783 138098 132163 126063 121260 118041 115559 113177
54849 113177 111089 109556 108161 106234 103688 101043 98774 96955 95535 94632 94365 94558 94797 94746 94334 93685
54833 93685 92994 92443 92048 91580 90840 90120 90163 91397 93306 94875 95628 95964 96473 97260 98046 98697 99382 100302
54815 100302 101378 102128 101925 100598 98842 97722 97642 98094 98520 99005 99823 100660 100857 100277 99480 99028 99036 99419
54797 99419 100143 101016 101562 101373 100618 100038 100372 101663 103142 103980 104190 104513 105261 105771 105428 104818 105127 106550
54779 106550 108074 108961 109646 110852 112499 114027 115312 116640 118073 119438 120816 122546 124787 127474 130627
54764 130627 134302 138265 142170 146157 150826 156418 162334 167709 172251 176166 179240 180380 178446 173563
54750 173563 167321 161341 155751 149518 142276 135310 130358 127853 126773 125903 124610 122542 119430 115608
54736 115608 112220 110408 110399 111556 113052 114278 114879 114880 114793 115237 116419 118164 120365 123041 125921 128430 130378
54719 130378 132411 135413 139582 144385 149301 154188 158895 162974 166043 168090 169093 168582 166001 161462
54705 161462 155793 149854 144092 138755 134148 130521 127915 126200 125059 123876 122009 119357 116504 114139
54691 114139 112483 111331 110374 109312 107949 106439 105245 104630 104355 104111 103995 104240 104642 104658 104095 103337 102822
54674 102822 102528 102137 101508 100906 100732 101018 101221 100714 99556 98569 98459 99100 99883 100520 101163 101875 102457 102794
54656 102794 102999 103180 103384 103834 104859 106416 107917 108708 108642 108102 107585 107272 106957 106435 106013 106342 107489 108459
54638 108459 108171 106849 105830 105920 106526 106685 106384 106324 106762 107186 107054 106374 105541 105008 105169 106147 107512 108451
54620 108451 108491 107942 107434 107102 106543 105618 104975 105410 106792 108017 108227 107737 107444 107602 107643 107123 106274 105493 104751
54601 104751 103847 102914 102283 101952 101532 100717 99624 98690 98341 98696 99450 100129 100547 100931 101466 101884 101707 100831
54583 100831 99682 98814 98526 98850 99682 100807 101871 102464 102311 101484 100461 99929 100369 101709 103283 104194 103922
54566 103922 102828 101994 102312 103651 105130 106221 107233 108575 109892 110397 109942 109266 109082 109288 109383 109378 109854
54549 109854 111106 112625 113660 114063 114263 114594 115010 115425 115857 116139 115993 115630 115779 116740 117823 118315 118607
54532 118607 119598 121177 122139 121754 120615 119701 119289 119158 119171 119169 118793 117938 117047 116526 116237 115981 116027 116609 117306
54513 117306 117593 117708 118253 119127 119593 119336 118742 118092 117219 116107 115196 114807 114729 114596 114305 113916 113588 113636 114184
54494 114184 114663 114279 113199 112646 113415 114852 115821 116183 116665 117574 118371 118513 118083 117484 116955 116590 116534 116905
54476 116905 117638 118530 119382 120102 120739 121361 121856 121940 121500 120819 120307 120134 120238 120564 121079 121673 122337 123354 124983
54457 124983 126849 127989 127745 126482 125216 124544 124136 123353 122179 121322 121413 122317 123418 124309 124886 124894 123933 122138
54439 122138 120431 119741 120176 121255 122685 124414 126020 126634 125706 123580 121120 118992 117482 116801 117156 118452
54423 118452 120117 121455 122268 123026 124317 126135 127842 128844 129053 128660 127804 126741 126023 126052 126541 126847 126777
54406 126777 126665 126704 126727 126805 127463 128971 130798 132170 132920 133429 134047 134926 136169 137575 138402 137956 136499 135131
54388 135131 134724 135315 136524 137985 139240 139812 139740 139595 139600 139126 137545 135267 133334 132155 131329 130687 130774 131986
54370 131986 133764 135155 135928 136668 137873 139368 140647 141489 142096 142846 144059 145958 148621 151905 155393
54355 155393 158483 160682 161945 162737 163666 164958 166233 166732 165776 163127 159123 154544 150247 146786 144241
54340 144241 142356 140799 139311 137720 135957 134153 132627 131647 131119 130636 129912 129056 128328 127752 127191 126751
54324 126751 126775 127299 127776 127593 126779 125964 125661 125862 126346 127109 128271 129752 131274 132627 133724 134420 134579
54307 134579 134380 134255 134279 133869 132495 130614 129423 129494 130067 130024 129276 128703 128855 129320 129489 129406 129487 129716 129617 128975
54287 128975 128171 127744 127906 128569 129548 130536 131071 130843 130050 129251 128854 128881 129179 129599 129849 129508 128478 127319
54269 127319 126793 127013 127382 127345 126941 126530 126376 126638 127348 128137 128414 128204 128428 129765 131564 132588 132706 133019
54251 133019 134260 135877 137022 137667 138323 139183 140094 140907 141337 140891 139488 137891 136977 136795 136842 136957 137301
54234 137301 137675 137544 136732 135541 134271 133221 132993 134024 135714 136822 136916 136701 136715 136553 135838 135142 135163 135524
54216 135524 135274 134261 133153 132208 130973 129375 128254 128356 129282 129973 129929 129497 129147 128950 128788 128649 128510
54199 128510 128203 127625 126974 126630 126812 127423 128158 128673 128810 128833 129279 130299 131232 131219 130244 129167 128598 128226 127543
54180 127543 126816 126834 127939 129772 131794 133532 134463 134302 133527 133047 133192 133405 133123 132552 132306 132650 133332 133901
54162 133901 133987 133508 132821 132468 132629 133034 133461 133945 134376 134317 133601 132756 132466 132788 133174 133093 132377 131204 130112
54143 130112 129828 130671 132177 133585 134555 135160 135351 134891 133835 132734 132212 132477 133235 133971 134373 134625 135209
54126 135209 136370 137879 139354 140539 141165 140941 139919 138595 137329 136031 134764 134262 135267 137506 139900
54111 139900 141699 142911 143750 144271 144613 144996 145311 145146 144376 143373 142494 141735 140999 140388 140064 140149 140832 142215
54093 142215 143924 145214 145643 145381 144875 144649 145523 148387 153310 159190 164697 169490 174222 179532 185326
54078 185326 190935 195677 199161 201180 201446 199732 196412 192591 189228 186225 182881 179132 175690 172944
54064 172944 170522 168256 166776 166544 166933 167019 166872 167270 168436 169858 171229 172705 174107 174708 174214 173445
54048 173445 173628 175217 177666 180126 182180 184066 186364 189461 193235 197304 201458 205765 210456 215969
54034 215969 222859 231200 240127 248380 255365 261369 266827 271832 276353 280379 283684 285931 287174 287807
54020 287807 287813 286612 283968 280554 277114 273570 269542 265467 262356 260403 258480 255272 250542 245056 239537
54005 239537 234067 228384 222523 216955 212086 207777 203630 199713 196601 194547 193051 191663 190817 191189 192373
53990 192373 192932 191888 189594 186961 184470 182249 180538 179489 178746 177735 176307 174753 173368 172323 171777
53975 171777 171738 171885 171877 171729 171588 171288 170549 169529 168741 168432 168457 168768 169532 170689 171848 172795 173752 174930 176236
53956 176236 177629 179371 181631 184174 186756 189528 192785 196578 200880 205778 211117 216325 221162 226419
53942 226419 233337 242358 252915 264282 275911 286883 295710 301084 302613 300817 296866 292429 289075
53929 289075 287245 286035 284356 282219 280649 280575 282072 284527 287213 289784 292434 295583 299438 303987 309438
53914 309438 316168 323964 331723 338427 344231 350119 356569 362967 368289 371879 373528 373374 372080 370705
53900 370705 369920 369337 367891 364919 360769 356359 352287 348434 344318 339635 334358 328426 321633 313947 305747
53885 305747 297550 289615 282027 275046 269027 263948 259258 254328 248984 243563 238607 234544 231538 229531
53871 229531 228412 227970 227564 226138 223003 218634 214246 210507 207141 203977 201711 200972 201026 200277 198118 195569
53855 195569 193869 193087 192511 191815 191173 190583 189852 189186 189040 189247 188984 187958 187020 187082 187797 187937 186904 185289
53837 185289 183977 183279 183029 183026 183119 183189 183272 183484 183659 183330 182220 180574 178889 177621 177219 178054 179967 182120
53819 182120 183650 184349 184575 184750 185188 186133 187590 189278 191047 193103 195502 197706 199259 200730 203357
53804 203357 207608 212682 217555 222022 226428 230900 235341 239880 244790 249931 254676 258531 261612 264401
53790 264401 267150 269645 271555 272876 273911 274890 275803 276631 277385 277715 276836 274293 270706 267253 264373 261381
53774 261381 257408 252310 246557 240649 234914 229508 224416 219658 215640 212902 211294 209848 207797 205405
53760 205405 203392 201920 200640 199423 198363 197117 194995 191930 188845 186737 185730 185329 185295 185815 186888
53745 186888 187922 188183 187523 186516 185754 185184 184313 183042 181951 181573 181715 181837 181912 182398 183411 184436 185060
53728 185060 185571 186492 187809 189021 189845 190567 191694 193456 195659 197825 199415 200093 199943 199435 199187 199623
53712 199623 200774 202349 204098 206103 208634 211597 214283 215904 216438 216796 218022 220326 222973 225137 226792
53697 226792 228662 231316 234468 237324 239607 241978 245292 249567 253909 257413 259829 261270 261676 260994 259767
53682 259767 258959 258938 258978 258100 256250 254255 252703 251329 249631 247766 246531 246573 247746 249142 249634 248602
53666 248602 246355 243903 242209 241565 241601 241742 241671 241523 241645 242082 242341 241860 240684 239396 238432 237817 237596 238030
53648 238030 239098 240250 240996 241454 242011 242763 243645 244732 245915 246645 246605 246457 247249 249222 251776 254482 257307
53631 257307 259830 261160 261031 260343 260269 261287 263339 266246 269539 272482 274863 277366 280625 284356 287974
53616 287974 291621 295840 300558 305196 309651 314345 319239 323593 326899 329401 331460 333021 334046 334987
53602 334987 336349 338108 339952 341801 343709 345412 346430 346676 346657 346964 347609 347973 347425 346046 344608 343733
53586 343733 343206 342372 341059 339720 338682 337779 336813 335878 334981 333802 332192 330563 329359 328522 327868 327668
53570 327668 328191 328890 328738 327386 325406 323358 321261 319191 317698 317227 317639 318754 320846 323955 327032
53555 327032 328606 328347 327346 326726 326554 326403 326352 326915 328183 329620 330775 331816 333191 335004 337013 339174
53539 339174 341891 345488 349556 353221 356232 359448 363871 369373 374967 380302 386222 393543 401883 410228
53525 410228 418291 426643 435743 445507 455809 466737 478203 489916 501938 514776 528699 543481
53513 543481 559083 575973 594263 613119 631713 650425 670338 691668 713518 735157 756749
53502 756749 778556 800184 821087 841325 861270 880888 899850 918162 936092 953533 969965
53491 969965 985277 1000227 1015798 1032248 1049041 1065596 1081898 1098289 1114848 1131111 1146433
53480 1146433 1160560 1173856 1187085 1200925 1215462 1229884 1242758 1252903 1260089 1264791 1267360 1267764
53468 1267764 1266131 1262965 1258500 1252210 1243476 1232581 1220530 1207952 1194750 1180956 1167251 1154250
53456 1154250 1141651 1128564 1114459 1099337 1083204 1065961 1047865 1029553 1011393 993227 974986
53445 974986 957119 940117 923874 908011 892650 878502 866244 856156 848207 842068 837028 832410
53433 832410 828235 825075 823156 822037 821426 821837 824016 827981 833119 839065 845936 853793 862410 871753 882248
53418 882248 894232 907414 921207 935544 951161 969014 989498 1012201 1036354 1061464 1087580
53407 1087580 1115030 1143982 1174268 1205503 1237357 1269862 1303551 1339186 1377183 1417430 1459680
53396 1459680 1503837 1549629 1596269 1642910 1689464 1736575 1784731 1833646 1882583 1930991 1978678
53385 1978678 2025497 2071068 2114799 2156249 2195491 2232952 2268762 2302501 2333775 2362668 2389154
53374 2389154 2412355 2431025 2444715 2453804 2458391 2457923 2452092 2441285 2425675 2404577 2377305 2344243
53362 2344243 2306477 2264810 2219830 2172633 2124644 2076706 2028937 1981504 1934939 1889581 1845247
53351 1845247 1801752 1759423 1718844 1680223 1643119 1606700 1570240 1533496 1496651 1459883 1423236
53340 1423236 1386997 1351964 1319017 1288551 1260536 1234877 1211399 1189742 1169724 1151684 1136041
53329 1136041 1122516 1110184 1098265 1086514 1074913 1063364 1051714 1039824 1027689 1015743 1004775
53318 1004775 995136 986296 977717 969829 963426 958327 953554 948905 945375 943836 944176 946027 949384 954001
53304 954001 959107 964465 970963 979386 989159 999273 1009993 1022636 1037858 1055099 1073748 1093897
53292 1093897 1115683 1138645 1162137 1186002 1210485 1235670 1261104 1285801 1308647 1329093 1347487
53281 1347487 1364430 1379873 1393153 1403853 1412156 1418252 1421790 1422256 1419688 1414804 1408386 1400569 1390774
53268 1390774 1378456 1363879 1347822 1330422 1310827 1288421 1264041 1239339 1215107 1190787 1165576
53257 1165576 1139374 1112557 1085452 1058366 1031720 1005877 981015 957193 934286 911844 889473
53246 889473 867369 846073 825576 805135 784144 762700 741160 719657 698419 678075 659206
53235 659206 641818 625615 610562 596832 584399 573035 562588 553042 544420 536765 530017 523765
53223 523765 517405 510684 503658 495946 486592 475193 462747 450768 439746 429045 418100 407045
53211 407045 396260 385961 376396 367889 360460 353770 347563 341830 336482 331262 326114 321200 316436 311395
53197 311395 305912 300407 295312 290447 285329 279897 274624 269976 266022 262549 259383 256567 254315 252758
53183 252758 251721 250807 249710 248279 246320 243631 240370 237193 234729 232978 231358 229336 226951 224747
53169 224747 223245 222370 221467 219985 218078 216302 214790 213160 211393 210322 210814 212639 214554 215464 215238
53154 215238 214511 213982 213888 213884 213400 212268 210952 209950 209165 208156 206961 206163 206090 206355 206471 206574 207173 208345
53136 208345 209525 210101 209932 209304 208655 208459 209122 210711 212721 214324 214978 214798 214299 213874 213680 213926 214951
53119 214951 216833 219146 221309 223056 224319 224828 224234 222700 221021 219988 219780 220065 220440 220643 220517 220001
53103 220001 219061 217593 215524 213126 210964 209364 208090 206747 205365 204334 203912 204010 204392 204818 205067 205028
53087 205028 204822 204660 204630 204702 204857 205045 205143 205156 205312 205675 205827 205321 204398 203819 203901 204125 203869 203150 202415 201876
53067 201876 201357 200678 199945 199502 199670 200410 201167 201243 200440 199174 197925 196845 195955 195330 194877 194299 193611 193387
53049 193387 194093 195357 196319 196539 196187 195547 194863 194649 195510 197369 199227 199977 199342 197983 196855 196519 196869
53032 196869 197361 197640 197881 198401 199082 199481 199439 199166 198738 197978 196940 196092 195788 195978 196567 197643 199022 200072
53014 200072 200429 200595 201338 202701 204053 204940 205405 205565 205396 204938 204287 203374 202191 201192 200960 201345 201476 200847
52996 200847 199951 199559 199831 200507 201598 203278 205258 206827 207610 207897 208082 208133 207799 207152 206650 206661 207033 207203
52978 207203 206782 206088 205991 207107 209130 211050 212036 212060 211792 212034 213207 215106 217094 218687 219971 221317
52962 221317 222724 223805 224431 224976 225607 225743 224710 222763 220872 219429 217747 215133 212003 209531 208353
52947 208353 207982 207392 205883 203474 200817 198742 197624 197088 196506 195754 195311 195671 196864 198517 200067 200891
52931 200891 200673 199816 199177 199108 199038 198295 197116 196420 196637 197184 197215 196596 195946 195856 196249 196456 195862 194506 193091
52912 193091 192410 192750 193861 195348 196952 198515 199875 200896 201532 201839 201975 202122 202278 202160 201469 200295
52896 200295 199090 198243 197880 198112 199132 200796 202352 202989 202685 202167 201985 201955 201725 201472 201654 202223 202590 202425
52878 202425 202005 201610 201042 200128 199371 199557 200791 202409 203836 205074 206282 207450 208722 210573 213176 215870
52862 215870 217726 218502 218687 218728 218709 218698 218854 219008 218566 217140 215026 212835 210867 209066 207344 205599 203497
52845 203497 200666 197241 193967 191549 190053 189058 188316 187944 187978 188080 187937 187750 187961 188556 188994 188911 188551 188344
52827 188344 188472 189031 190188 191704 192665 192352 191266 190640 190899 191302 191257 191202 191712 192356 192252 191464 191031 191599
52809 191599 192753 193927 195348 197538 200210 202243 202769 201880 200140 197786 194780 191438 188585 186897 186313
52794 186313 186186 185881 185106 183973 182952 182571 182876 183291 183365 183493 184473 186367 188292 189436 189814 189912 190074 190519
52776 190519 191433 192572 193133 192569 191337 190365 189939 189605 189029 188386 187851 187283 186583 185985 185748 185824 186014 186254
52758 186254 186570 186902 187067 186871 186265 185514 185104 185266 185691 185999 186345 187218 188721 190463 192147 193766 195191
52741 195191 196122 196660 197393 198616 199935 201015 202242 204133 206439 208423 209799 210797 211378 211082 209826 208362
52725 208362 207616 207755 208097 207799 206514 204505 202256 200079 198159 196858 196616 197329 198199 198593 198820 199610 200937
52708 200937 201951 202104 201843 201946 202582 203273 203525 203253 202755 202453 202539 202816 202969 202968 202893 202486 201360 199787 198762
52689 198762 198926 199829 200587 200935 201172 201410 201420 201147 200806 200458 199947 199350 199078 199390 200105 200898 201543 201780 201268
52670 201268 199996 198524 197521 197173 197224 197480 198004 198839 199804 200693 201605 202912 204833 207019 208685 209296 209159
52653 209159 209289 210630 213415 217117 220795 223500 224658 224341 223138 221587 219800 217666 215322 213160 211428
52638 211428 210105 209240 209055 209426 209550 208642 206974 205749 205733 206456 207111 207802 209289 211738 214475 216988 219340
52621 219340 221314 221941 220512 217613 214502 211821 209556 207893 207200 207200 207013 206236 205316 204639 203964 203032 202167
52604 202167 201796 201906 202372 203330 204715 205850 206127 205861 205881 206483 207310 208098 208896 209567 209790 209662 209816 210661
52586 210661 211982 213426 214978 216663 218183 219215 219875 220507 221121 221362 221044 220474 220168 220335 220724 220950 220922
52569 220922 220833 220759 220458 219737 218866 218347 218321 218466 218472 218367 218285 218173 217791 216883 215321 213351 211670 210917 210943 210928
52549 210928 210353 209549 209056 208852 208599 208380 208652 209518 210535 211307 211834 212141 211982 211216 210220 209545 209270 209062
52531 209062 208858 209140 210344 212201 213914 214903 215178 215060 214808 214589 214528 214648 214934 215549 216777 218549 220233
52514 220233 221168 221314 221109 220906 220904 221427 222663 224037 224538 223991 223558 224511 226820 229344 231141 232037 232140 231459
52496 231459 230182 228809 227742 226904 225944 224617 222919 221118 219708 219070 219045 219126 219243 220026 221971 224586
52480 224586 226733 227765 227933 227691 227046 225798 224138 222675 221936 222045 222790 223847 224914 225831 226600 227253
52464 227253 227753 228209 229103 231007 233975 237343 240258 242315 243682 244815 246129 247668 248866 248841 247259
52449 247259 244786 242428 240454 238341 235746 233123 231164 229920 228742 227022 224792 222667 221307 220889
52435 220889 221002 221024 220571 219644 218520 217697 217742 218807 220270 221183 221181 220695 220250 219967 219855 220161 221033 222104 222798
52416 222798 223003 223237 224172 226132 228914 231969 234867 237733 241096 245303 250358 256351 263627 272236 281567
52401 281567 290750 299038 305511 308932 308545 304858 299110 292193 284579 277002 270417 265164 260778 256735
52387 256735 252982 249735 247258 245927 246002 247204 248907 250734 252560 254037 254807 255218 256127 257808 259747
52372 259747 261661 263926 266681 269351 271589 273895 276660 279317 281273 283055 285540 288398 290320 290656
52358 290656 289924 288788 287452 286140 285273 284920 284805 285050 286227 288427 290947 293247 295565 298254 301009
52343 301009 303296 305113 306943 309194 311992 315234 318621 321974 325678 330380 336070 342077 348282 355617
52329 355617 364820 375349 386325 397965 411088 425463 439756 453231 466580 480875 496418 512922
52317 512922 530009 547141 563686 579576 595464 611758 627899 643023 656956 670134 682901
52306 682901 695436 708068 720947 733486 744682 754092 762125 769384 776129 782350 787927 792625 796261
52293 796261 798971 800933 801790 800803 797731 793225 788103 782508 776002 768350 760027 752139 745881 741753 739167
52278 739167 737150 735640 735745 738368 742922 747883 752460 757222 763166 770709 779713 789951 801170 812963
52264 812963 824901 836797 848614 860210 871313 881764 891615 900971 909824 918108 925866 933297 940643
52251 940643 948066 955607 963114 970096 975768 979509 981302 981521 980266 977210 972235 965858 958785 951257
52237 951257 943219 934896 926788 919119 911707 904374 897143 889983 882749 875488 868521 862170 856705 852530
52223 852530 849948 848566 847403 845922 844618 844234 844768 845649 846686 848367 851282 855546 860729 866068 870890
52208 870890 875183 879665 884961 890788 896260 900854 904737 908225 911471 914687 918163 921902 925614 929177
52194 929177 932669 935858 938178 939545 940723 942471 944641 946537 947829 948644 949043 948978 948688 948485 948064 946511
52178 946511 943190 938307 932438 925863 918525 910449 902001 893916 887088 882050 878530 875761 873305 871272
52164 871272 869706 868297 866999 866430 867152 868788 870454 871903 873663 876026 878503 880485 882035 883729 885959
52149 885959 888557 890904 892278 892383 891721 891229 891379 891848 892210 892605 893463 894831 896385 897950 899574 901122
52133 901122 902219 902798 903458 905146 908604 914162 921845 931494 942862 955774 970217 986296 1004063
52120 1004063 1023459 1044417 1067024 1091407 1117310 1143776 1169558 1193928 1216928 1238723 1258990
52109 1258990 1277175 1293126 1307165 1319578 1330254 1338772 1344659 1347721 1348411 1347737 1346493 1344661 1341909
52096 1341909 1338452 1334917 1331305 1326769 1320644 1313210 1305068 1296186 1286030 1274348 1261370 1247419 1232937
52083 1232937 1218871 1206410 1195965 1186770 1177911 1169740 1163895 1161815 1163393 1167238 1172087 1177702 1184481
52070 1184481 1192628 1201999 1212454 1223953 1236319 1249184 1262189 1275042 1287452 1299267 1310601 1321464
52058 1321464 1331317 1339447 1345828 1351198 1356122 1360378 1363375 1364701 1363994 1360809 1355088 1347480 1338755 1329111
52044 1329111 1318377 1306575 1293753 1279503 1263258 1245054 1225604 1205718 1186112 1167679 1151252
52033 1151252 1136905 1123960 1111906 1100928 1091336 1082878 1074942 1067148 1059415 1051675 1043799 1035755 1027532
52020 1027532 1019002 1010046 1000809 991642 982795 974240 965798 957340 948879 940494 932109 923308 913462 902168
52006 902168 889594 876308 862737 848795 834114 818675 803075 787952 773225 758184 742482
51995 742482 726727 711867 698225 685481 673393 662107 651761 642231 633371 625175 617526 610028
51983 610028 602182 593607 584165 574162 564375 555425 546928 537680 526978 515496 504590 494987 486484
51970 486484 478680 471519 465141 459617 455071 451895 450669 451785 455078 459766 464879 469895 474914 480162
51956 480162 485454 490302 494388 497680 500080 501216 500676 498344 494456 489506 484118 478889 474179 470143
51942 470143 467093 465761 466979 471002 477298 485122 494250 504999 517538 531413 545743 559688 572625
51929 572625 584112 593931 602067 608531 613310 616610 618873 620296 620543 619377 617381 615450 613488 610086
51915 610086 603644 593389 579278 561639 541461 520495 500323 481443 463790 447932 435004 425401
51903 425401 418273 412677 408729 407117 407824 409837 412084 414186 416237 418139 419361 419201 417202 413402 408284
51888 408284 402410 396080 389412 382728 376649 371672 367827 364914 362980 362322 363079 365072 368133 372290 377529
51873 377529 383567 390083 396963 404111 411108 417317 422224 425526 427036 426798 425271 423005 420034 415873
51859 415873 410241 403689 397385 392382 389067 387165 386189 385951 386584 388042 389791 391247 392308 393073 393172 391906
51843 391906 389110 385372 381263 376865 372275 367984 364253 360530 356095 351092 346468 343044 341057 340452
51829 340452 340995 342121 343179 344006 344842 345647 345951 345556 344960 344756 344853 344634 343713 342317 340961 340005 339466 339133
51811 339133 338870 338915 339786 341739 344343 346724 348243 348892 349057 349087 349139 349248 349305 348928 347633 345334 342670 340571
51793 340571 339449 338904 338214 336923 334934 332339 329422 326635 324304 322410 320828 319690 319221 319328 319639
51778 319639 319994 320550 321352 322111 322620 323149 324143 325657 327343 329041 331209 334655 339843 346499 353911 361631
51762 361631 369738 378298 386713 393927 399299 402910 404801 404312 400724 394436 386947 379489 372093 364287
51748 364287 356271 348914 342745 337511 332812 328691 325458 323298 322369 322939 325032 328084 331385 334890 339316
51733 339316 345399 353210 362051 370709 377826 382528 385002 386319 387498 388807 389948 390724 391264 391689 391719
51718 391719 390729 388233 384415 380086 376042 372564 369634 367373 365895 364817 363407 361257 358519 355522
51704 355522 352658 350710 350648 352639 355624 358293 360194 361563 362413 362408 361537 360349 359413 358940 359046 359990 361843
51687 361843 363985 365222 364624 362275 359139 356080 353142 349958 346653 343916 342196 341303 340949 341203 342215
51672 342215 343914 346274 349434 353312 357518 361998 367314 373859 381190 388630 396062 403567 410590 416098
51658 416098 419329 419871 417480 412632 406986 402390 399381 397340 395982 395815 397130 399442 402113 404714 406464
51643 406464 406055 402455 395532 385859 374529 363204 353399 345341 338214 331801 327068 324691 323872 323275
51629 323275 322492 321911 321793 322263 323672 326100 328803 330956 332632 334247 335334 334885 332959 330947 329936
51614 329936 329453 328239 325695 322226 318569 315290 312748 311080 310050 309061 307551 305544 303872 303653 305410
51599 305410 308749 312901 317384 322100 327186 333021 340066 348267 356714 364180 369858 373421 374603 373168
51585 373168 369247 363468 356821 350504 345611 342642 341487 342111 344941 350237 357491 366039 375962 387676
51571 387676 400758 413946 426455 438608 451000 463658 476259 488571 500161 510220 518376 525652
51559 525652 534137 545642 560922 580180 603715 631621 662851 694978 725170 751358 772407 787509
51547 787509 796020 797923 793875 784404 769418 748878 723638 695218 665011 634114 603628 574475
51535 574475 547047 521536 498453 478211 460322 443906 429140 417431 409716 405229 402387 400424
51523 400424 399547 399809 400497 400661 399864 398295 396320 393991 390966 386970 382324 377784 373858 370466 367276
51508 367276 364018 360447 356444 352309 348555 345137 341364 336913 332571 329468 327807 326871 326068 325403 324928
51493 324928 324371 323555 322768 322395 322406 322500 322564 322655 322540 321627 319625 317152 315376 314909 315223 315342 314899 314184 313279
51474 313279 311742 309358 306776 304884 303750 302558 300585 297908 295199 293111 291895 291302 290766 289934 289156
51459 289156 289216 290482 292474 294416 295988 297295 298315 298801 298787 298851 299666 301471 304131 307552 311749 316658
51443 316658 322285 329084 337833 348830 361353 373980 385260 393942 399000 400058 397954 394538 391619
51430 391619 389904 388791 386988 383483 378226 372000 365584 359148 352542 345966 340071 335447 332271 330315
51416 330315 329049 327864 326614 325872 326236 327412 328497 329191 330109 331660 333228 333909 333638 333095 332796 332766 332898
51399 332898 333130 333281 333238 333283 333881 335099 336563 338090 340005 342721 346282 350531 355489 361346 368135 375711
51383 375711 384179 394224 406820 422567 441464 463400 488684 517891 551284 588597 629243 672277
51371 672277 716052 758270 796645 829442 855478 874072 885176 889158 886115 875647 857585 832708
51359 832708 802458 768171 730865 691487 651055 610698 571855 536154 504683 477464 453927
51348 453927 433604 416047 400476 386200 373319 362402 353447 345700 338515 331891 326101 321277 317470
51335 317470 314627 312350 310105 307816 305844 304330 303011 301781 300836 300111 299168 297988 297302 297666 298669
51320 298669 299520 300015 300456 301047 301980 303746 306570 309676 311936 313287 314741 316821 318673 319167 318293 316903
51304 316903 315418 313463 310786 307899 305517 303668 301740 299363 296894 294890 293399 292066 290806 289956
51290 289956 289703 289725 289623 289444 289531 290075 291130 292847 295309 298240 301215 304147 307203 310307 313117 315569
51274 315569 317998 320527 322646 323667 323436 322495 321709 321761 322744 324104 325249 326323 328069 330772 333671 335705
51258 335705 336491 336257 335184 333376 331259 329412 327959 326569 325064 323480 321553 318824 315512 312635 310805
51243 310805 309333 307137 304184 301408 299391 297826 296362 295257 294895 295130 295497 295760 295897 295801 295362 294708
51227 294708 294061 293505 293218 293769 295691 298705 301778 304056 305474 306376 307003 307652 308926 311241 314101 316290
51211 316290 316992 316503 315795 315600 316051 316994 318343 320076 322052 323963 325550 326894 328414 330436 332683 334315
51195 334315 334546 333276 331178 329298 328470 328804 329548 329657 328758 327532 327000 327500 328502 329267 329399 328880 327985
51178 327985 327337 327668 329161 331079 332258 332031 330709 329232 328398 328239 328053 327199 325931 325257 325897 327572
51162 327572 329514 331444 333735 336716 340158 343461 346066 347638 348056 347385 345730 343109 339584 335523 331544
51147 331544 328147 325508 323621 322397 321579 320727 319474 317749 315753 313836 312375 311555 311092 310391 309213
51132 309213 308145 308166 309576 311494 312617 312562 312280 312957 314665 316404 317476 318314 319735 321860 324274 326903
51116 326903 330069 333736 337364 340620 343624 346269 347926 348281 348061 348445 349886 351857 353567 354650 355324
51101 355324 356141 357468 358978 359882 359869 359536 359559 359744 359323 357982 356128 354308 352877 352177 352397 353158 353736
51084 353736 353926 354276 355234 356430 357104 357012 356590 356383 356571 357064 357838 359025 360634 362228 363184 363485 364112 366252
51066 366252 370115 374852 379680 384723 390622 397814 406529 417160 430042 444769 460106 474763 488123
51053 488123 500185 511000 520481 528848 537081 546592 558201 571387 584588 596207 605325 611637 614984
51040 614984 615070 611571 604450 594168 581646 568130 555116 544078 535614 528675 521073 511211 499249
51027 499249 486481 474047 462663 453074 445806 440491 436174 432507 430077 429398 430200 431964 434556 437911
51013 437911 441542 444918 448107 451703 456267 462065 469074 476989 485458 494537 504618 515742 527397
51000 527397 539208 551309 563665 575546 586267 595985 605099 613179 619292 623180 625355 626141 625513
50987 625513 623936 622480 621775 621564 621604 622373 624435 627719 631970 637449 644534 652864 661464 669716 677853
50972 677853 686652 697077 710186 726847 747300 771197 798224 828607 862934 901598 944388 990563
50960 990563 1039242 1089759 1141657 1194480 1247734 1300961 1353597 1404718 1453186 1498104 1538841
50949 1538841 1574568 1604326 1627989 1646877 1662872 1676946 1688936 1698674 1706909 1714924 1723572 1732783
50937 1732783 1741638 1748650 1752190 1751184 1745717 1737004 1726568 1715179 1702410 1687154 1668537 1646224
50925 1646224 1619959 1589280 1553966 1514506 1471691 1425911 1377310 1326629 1275372 1224883 1175618
50914 1175618 1127578 1081196 1037510 997595 962007 930622 902744 877468 854109 832350 812093
50903 812093 793426 776720 762307 749843 738355 727231 716865 707877 700059 692619 685327 678785
50891 678785 673596 669822 667319 665949 665323 664950 664948 666019 668320 670855 672521 673419 674608 676865 680264 684686
50875 684686 690020 695847 701652 707583 714477 722934 732749 743459 755078 768016 782556 798700 816320
50862 816320 835265 855466 877127 900698 926553 954939 986379 1021884 1062422 1108187 1158608
50851 1158608 1213115 1272008 1336672 1408913 1489788 1578949 1675169 1777376 1884874 1996809 2112087
50840 2112087 2229978 2350040 2470925 2589757 2703248 2809082 2905642 2990821 3062054 3117612
50830 3117612 3157299 3181965 3193109 3193019 3184497 3170004 3151552 3131591 3113298 3099483 3091700 3090716 3097077
50817 3097077 3110250 3127544 3144758 3158066 3164815 3162733 3149306 3122358 3080772 3024424 2953791 2869833
50805 2869833 2773886 2667351 2551874 2430048 2305598 2182378 2063197 1949745 1843303 1745079
50795 1745079 1656002 1576624 1507233 1447725 1397389 1355181 1320319 1292386 1270872 1254928 1243639
50784 1243639 1236215 1231859 1229776 1229370 1230054 1230713 1229898 1226945 1222472 1217256 1210937 1202510 1191931 1180362
50770 1180362 1168637 1156248 1142312 1126876 1110633 1093689 1075430 1055555 1034552 1013012 991125
50759 991125 969184 948139 929112 912545 898235 886065 876211 868573 862513 857562 854149 853245 855312
50746 855312 859890 866283 874386 884669 897616 913521 932773 955961 983479 1015189 1050701 1089903
50734 1089903 1132976 1179849 1229917 1282495 1337426 1394883 1454592 1515619 1577174 1639320 1702322
50723 1702322 1765338 1826312 1883459 1936485 1986002 2031977 2073092 2107327 2132686 2147546 2151133
50712 2151133 2144042 2128047 2105246 2077624 2047424 2017339 1989969 1967289 1950759 1941451 1939514 1943740
50700 1943740 1952183 1963221 1975778 1988588 1999673 2006585 2006987 1999035 1981514 1953801 1915788 1868025
50688 1868025 1812043 1750271 1685324 1619470 1554901 1494050 1439010 1390655 1348792 1313229 1284222
50677 1284222 1261828 1245440 1234366 1228668 1229053 1236035 1249375 1268262 1291829 1319415 1350319 1383325
50665 1383325 1416637 1448461 1477582 1503307 1525184 1543183 1558079 1571058 1582834 1593463 1603063
50654 1603063 1612223 1621490 1630863 1640059 1648938 1657437 1665489 1673394 1682054 1692454 1705048 1719910 1737275
50641 1737275 1757673 1781665 1809629 1841515 1876505 1913192 1950501 1988170 2026000 2062986 2097831
50630 2097831 2130159 2160527 2189273 2216084 2240848 2264006 2285347 2302657 2312022 2309494 2292623 2261291
50618 2261291 2218075 2167881 2116467 2068541 2026855 1992696 1966797 1949652 1941146 1940140 1944576 1952173
50606 1952173 1961199 1970557 1979058 1984689 1984751 1976765 1959229 1931718 1894594 1848820 1795924 1737801 1676340
50593 1676340 1613109 1549375 1486449 1425884 1369135 1316907 1269000 1224945 1184700 1148492 1116061
50582 1116061 1086447 1058730 1032767 1009030 987943 969671 954410 942385 933524 927532 924437 924597
50570 924597 927834 932929 938557 944643 952244 962046 973562 985989 999284 1013890 1029844 1046825 1065015
50557 1065015 1085247 1108058 1133077 1159628 1187594 1217304 1248733 1281203 1313851 1346040 1377213
50546 1377213 1406710 1434012 1459153 1482758 1505710 1528876 1553063 1579041 1607594 1639613 1676060
50535 1676060 1717595 1764190 1815372 1871010 1931701 1998161 2070467 2148165 2230993 2319106 2412602
50524 2412602 2511222 2614476 2721479 2830337 2938221 3042608 3142282 3236617 3323916 3400959
50514 3400959 3464318 3511774 3542430 3555909 3551904 3530330 3491518 3436179 3365445 3281143 3186017
50503 3186017 3083600 2977849 2872847 2772651 2681072 2601209 2535133 2484123 2449239 2431406
50493 2431406 2430771 2446098 2474947 2514281 2560675 2610086 2657822 2698885 2728375 2741801 2735543 2707433
50481 2707433 2657138 2586211 2497851 2396333 2286152 2171424 2055889 1942965 1835251 1733985
50471 1733985 1639446 1552060 1472827 1402620 1341374 1288116 1241537 1200467 1164142 1132187 1104155
50460 1104155 1079115 1056119 1035201 1017337 1003025 991368 981021 971703 964174 959057 956387 956252
50448 956252 959000 964535 972002 980628 990555 1002427 1016312 1031323 1046243 1060295 1073320 1085407
50436 1085407 1096458 1106095 1114058 1120595 1126385 1132053 1137894 1143988 1150381 1157115 1164277 1172054 1180621 1189948
50422 1189948 1199910 1210599 1222354 1235507 1250354 1267387 1287254 1310366 1336853 1367044 1401702
50411 1401702 1441511 1486506 1536116 1589517 1645693 1703437 1761638 1819475 1876078 1930165 1980320
50400 1980320 2025531 2065187 2098670 2125258 2144233 2154609 2154819 2143207 2119123 2083318 2037245 1982362
50388 1982362 1920249 1853008 1783225 1713692 1647205 1586220 1532281 1485902 1447307 1417199 1396580
50377 1396580 1385881 1384490 1391061 1404022 1421774 1442629 1464727 1485993 1504118 1516616 1520976 1515186
50365 1515186 1498572 1472227 1438244 1398276 1353026 1303240 1250757 1198159 1147606 1100324 1056919
50354 1056919 1017521 981651 948571 918047 890506 866389 845781 828827 816056 807941 804343 804604
50342 804604 807853 812928 818234 822113 823377 821406 816033 807699 797547 786912 776700 767441 759729
50329 759729 754116 750594 748702 748267 749582 752622 756520 760287 763835 767879 772945 778875 785240 791726
50315 791726 797936 803190 806929 809187 810432 810982 810883 810357 810083 810807 812743 815458 818320 821010 823673 826676
50299 826676 830190 833961 837556 840880 844357 848498 853447 859115 865617 873177 881579 890068 898024 905565
50285 905565 913331 921846 931252 941368 951589 960765 967557 971055 971023 967746 962035 955330 949224 944529
50271 944529 940942 937790 934880 932444 930546 928928 927372 925836 924244 922428 920376 918342 916723 916111
50257 916111 917494 921983 930042 941130 954387 969576 987149 1007545 1030673 1055972 1082574 1109385
50245 1109385 1135413 1160214 1183846 1206302 1227331 1246969 1265823 1284328 1301865 1317017 1328558
50234 1328558 1335729 1337560 1332609 1319892 1299924 1274519 1245653 1214723 1182766 1150947 1120594 1092768
50222 1092768 1067900 1045884 1026362 1008671 991373 972279 949559 923018 893945 863742 833161
50211 833161 803007 774799 750061 729235 711888 697713 686607 677869 670219 662979 656689 652173
50199 652173 649337 647185 644731 641590 637943 634320 631268 628911 626857 624629 622066 619207 616053 612649
50185 612649 609140 605548 601732 597847 594506 591962 589341 585333 579789 574155 570096 567959 566809 565711
50171 565711 564621 564099 564476 565514 566767 568010 569177 570170 571148 573017 577010 583408 591025 598412 605321
50156 605321 612494 620322 628482 636856 645946 656086 666943 678174 690016 702674 715588 727893
50144 727893 739354 750397 761523 773296 786593 802156 820012 840112 863508 892081 926799
50133 926799 966895 1011042 1058555 1108874 1160488 1211312 1260065 1306722 1351651 1394874 1436211
50122 1436211 1475567 1512797 1547456 1578678 1604921 1623798 1632676 1629893 1615437 1590431 1556233 1514155
50110 1514155 1465750 1413017 1358225 1303522 1250482 1199828 1151754 1106638 1065298 1028383 995724
50099 995724 966551 940248 916568 895191 875478 856901 839481 823652 809803 798092 788602 781407
50087 781407 776432 773385 771958 772142 774292 778753 785296 792895 800170 806190 810945 815084 819128 822847
50073 822847 825336 825767 824105 821017 817156 812741 807908 803082 798654 794408 789734 784461 779093 774096
50059 774096 769269 764103 758542 753086 748279 744361 741379 739400 738543 738877 740261 742274 744487 746927 750132
50044 750132 754567 760215 766925 774912 784412 794928 805291 814648 823102 831317 839870 849084 859039 869296
50030 869296 878872 886889 893288 898688 903645 908302 912655 916773 920699 924405 928061 932257 937822 945338
50016 945338 954809 965836 978198 992263 1008636 1027328 1047473 1067991 1088274 1107984 1126471 1142935
50004 1142935 1157225 1170053 1182326 1194460 1206301 1217258 1226274 1231960 1233051 1228623 1217866 1200066
49992 1200066 1175216 1144436 1109482 1071897 1032892 993816 956244 921444 889924 861489 835510
49981 835510 811136 787655 764871 743152 722998 704576 687546 671263 655221 639601 625368
49970 625368 613580 604485 597414 591551 586522 582136 577897 573159 567809 562523 558208 555251 553382 552224
49956 552224 551817 552480 554280 556875 560015 563989 569331 576165 584074 592574 601481 610763 620263 629654 638468
49941 638468 646097 651943 655753 657786 658623 658778 658283 656434 652067 644464 633998 621653 607984 593056
49927 593056 577419 562467 549445 538485 529017 520761 513895 508608 504980 503069 502559 502595 502561 502916 504613
49912 504613 507696 511201 514455 517745 521445 525250 528785 532397 536730 541825 547269 553041 559675 567579
49898 567579 576636 586475 596770 607184 617233 626290 633635 638668 641290 642007 641405 639575 636224 631235
49884 631235 624908 617707 609982 601845 593078 583280 572383 560957 549729 538932 528424 518306 508994
49871 508994 500748 493603 487800 483739 481343 479908 478883 478440 479091 481065 484254 488378 492928 497389 501856
49856 501856 507089 513545 520769 528249 536424 546108 557137 568365 579033 589279 599077 607468 613345
49843 613345 616535 617727 617713 617095 616299 615312 613525 610205 605039 598054 589424 579856 570769 563399 557685
49828 557685 552552 547311 542242 537835 534130 531120 529293 529258 531056 534207 538365 543638 550281 558309 567388
49813 567388 576946 586345 595061 602853 609864 616531 623216 629787 635704 640674 644921 648490 650522 649802
49799 649802 646085 640360 633656 626176 617869 609215 600887 592898 584684 575934 566890 557955 549512 542090
49785 542090 536176 531672 527970 524734 522331 521162 520773 519957 517830 514627 511314 508545 506298 504592 504163
49770 504163 505882 509587 514039 518269 522499 527467 533334 539686 546233 552820 558979 564104 568053 571113
49756 571113 573419 574891 575672 575931 575135 572161 566438 558531 549419 539689 529751 520267 511772 504152 497003
49741 497003 490444 485159 481611 479541 478269 477323 476716 476737 477503 478714 479920 481004 482271 484056 486433
49726 486433 489285 492433 495675 498950 502564 506971 512273 518200 524648 531827 539721 547807 555631 563274
49712 563274 570848 577773 583093 586450 588314 589186 588855 586643 582265 576358 570106 564314 558855 553200 547374
49697 547374 542078 537849 534542 531823 529699 528180 526787 524958 522875 521475 521652 523733 527605 532922
49683 532922 539124 545527 551601 557205 562700 568900 576581 585795 595835 606120 616878 628600 641024
49670 641024 653013 663254 670757 674983 676145 675413 674273 673524 673114 672861 672869 673273 674106 675493 677412 679021
49654 679021 678619 674608 666383 654356 639650 623973 609222 596563 585859 576258 567322 559466 553474
49641 553474 549792 548238 548230 549265 551132 553620 556158 558036 558992 559290 559149 558304 556264 552821 548235 543098
49625 543098 538101 533706 529939 526513 523076 519244 514660 509464 504617 501232 499463 498464 497530 496792 496640
49610 496640 497029 497743 498855 500435 502070 503193 503785 504382 505453 507124 509358 512027 514775 517089 518639
49595 518639 519449 519831 520252 521072 522226 523271 523966 524613 525630 526955 528156 529034 529798 530674 531558 532059 531794
49578 531794 530744 529475 528795 528995 529610 530184 530993 532614 535050 537784 540591 543799 547722 552425 558097
49563 558097 565053 573078 581301 589040 596391 603602 610243 615482 618884 620416 619882 617104 612698 607976
49549 607976 603737 599677 595327 591121 587990 586198 585273 584967 585571 587071 588667 589570 589855 590051 590274 590397
49533 590397 590860 592617 596104 600848 606298 612595 620218 629244 639388 650576 663149 677513 693735
49520 693735 711314 729084 745501 759238 769597 776364 779621 779939 778534 776851 775935 776323 778318 782042
49506 782042 787248 793320 799493 804880 808408 809033 806068 799260 788700 775071 759872 744862 731007
49493 731007 718161 705966 694756 685303 677852 671829 666553 661945 658336 655768 653794 652022 650652
49480 650652 650280 651234 653254 655800 658444 660835 662524 663120 662724 662039 661861 662416 663273 663968 664701 666218 668894
49463 668894 672074 674530 675559 675478 675091 674921 674984 675090 675192 675486 676114 676696 676330 674400 671353 668313 665882
49446 665882 663697 661182 658226 654962 651484 648123 645506 643872 642718 641640 641177 642211 644826 648472
49432 648472 653049 659019 666369 674362 682617 691731 702308 713792 724869 734883 744498 755007 767254
49419 767254 781111 795661 809683 821912 830922 835167 833733 827295 817978 807987 798494 789947 783051
49406 783051 778882 778057 780249 784775 791488 800822 812931 826968 841399 855064 867856 880430 893388
49393 893388 906742 919872 931864 942133 950931 959086 966942 973700 978117 979725 979001 976427 971907
49380 971907 965278 956982 947889 938621 929224 919513 909684 900605 893343 888201 884400 881073 878453 877609
49366 877609 879017 881902 885125 888150 890829 892758 893329 892224 889505 885413 880395 875018 869465 863293
49352 863293 856115 848355 840877 834038 827619 821719 817042 814043 812272 810990 810171 810402 811830 813671 814913
49337 814913 815180 814661 813458 811441 808713 805778 803018 800329 797536 794928 792996 791809 791090 790907 791873
49322 791873 794574 799147 805463 813347 822490 832502 843262 854956 867539 880544 893660 907168
49310 907168 921377 935697 948560 958138 963018 962499 956668 946289 932432 916232 899017 882298
49298 882298 867270 854393 843669 835198 829192 825538 823645 822698 821934 820800 819122 817044 814685 811943
49284 811943 808790 805539 802597 800067 797797 795620 793400 791114 789167 788337 789034 790923 793620 797377 802510
49269 802510 808483 814343 819929 825828 832095 837857 842332 845460 847286 847622 846851 846263 846792 847972 849080
49254 849080 851025 856140 865954 879833 895950 912958 930352 947564 963136 974882 980881 980485 974336
49241 974336 963394 948258 929771 909856 890925 874289 859743 846906 836244 828319 822657 818213
49229 818213 814804 813275 814218 817150 821137 825649 830469 835337 840192 845473 851631 858435 865167 871380
49215 871380 877048 882114 886490 890581 895212 900671 906206 910848 914554 918277 923107 929619 937844 947513
49201 947513 958356 970361 983678 998114 1012925 1027388 1041459 1055562 1069845 1083962 1097510
49190 1097510 1110354 1122584 1134468 1146391 1158433 1169995 1180274 1189243 1197788 1206766 1216292 1226247
49178 1226247 1237097 1249848 1265298 1283596 1304458 1327628 1353248 1381987 1414663 1451529 1491840
49167 1491840 1533955 1575407 1612675 1641454 1658094 1661416 1653294 1637609 1618639 1599965 1583990 1571806
49155 1571806 1563369 1557980 1554817 1553299 1553174 1554387 1556781 1559881 1563079 1566108 1569345 1573561 1579331 1586645
49141 1586645 1595096 1604451 1614917 1626794 1639947 1653825 1668017 1682596 1697795 1713481 1729172 1744603
49129 1744603 1760112 1776373 1793698 1811634 1829284 1846077 1862191 1878183 1894338 1910507 1926528
49118 1926528 1942528 1958753 1975275 1992050 2009239 2027456 2047741 2071244 2098838 2131118 2168973
49107 2168973 2214168 2269106 2335770 2414507 2503058 2596208 2687124 2770788 2847162 2920337 2993275
49096 2993275 3062648 3118644 3149879 3149407 3118031 3063537 2996382 2924202 2848896 2768506 2681757 2590790
49084 2590790 2500293 2415157 2339025 2273890 2220073 2176688 2142512 2116313 2096454 2080878 2068091
49073 2068091 2057803 2050141 2044484 2039538 2034375 2028870 2023203 2017428 2011631 2006070 2000995 1996502 1992637 1989393
49059 1989393 1986560 1983763 1980821 1977997 1975840 1974769 1974737 1975199 1975486 1975386 1975356 1976064 1977700 1979781 1981664 1983257
49043 1983257 1985326 1989086 1995313 2003763 2013553 2023944 2034445 2044138 2051502 2055397 2056031 2054602 2052186 2049357
49029 2049357 2046663 2044786 2044031 2044028 2044153 2044025 2043508 2042528 2041157 2039750 2038754 2038312 2038085 2037625 2037052 2037353 2039684
49012 2039684 2044227 2050010 2056056 2062329 2069193 2076387 2083267 2090005 2097758 2107456 2118862 2130959 2142667
48999 2142667 2153039 2161415 2167941 2173582 2179163 2184546 2188966 2191839 2192924 2192089 2189415 2185396 2180684 2175632
48985 2175632 2170290 2164648 2158668 2152346 2145972 2140125 2135128 2130769 2126863 2123729 2121773 2120919 2120924 2121899 2123915
48970 2123915 2126302 2128022 2128667 2128499 2127600 2125734 2123148 2120781 2119327 2118561 2117914 2117293 2117029 2117398 2118558 2120705
48954 2120705 2123923 2128040 2132859 2138458 2145179 2153476 2163800 2176361 2190904 2206958 2224381 2243367
48942 2243367 2263912 2285696 2308635 2333121 2359453 2387448 2416866 2447857 2480661 2515253 2551666
48931 2551666 2590304 2631460 2674765 2719603 2765947 2814283 2864778 2916912 2969956 3023452 3077244
48920 3077244 3131409 3186227 3241927 3298275 3354483 3409470 3462283 3512512 3560530 3607057 3652232
48909 3652232 3695348 3735770 3773807 3810268 3845418 3878905 3910505 3940279 3968086 3993660 4017336
48898 4017336 4040071 4062475 4084293 4105028 4124575 4142887 4159478 4173664 4184946 4192830 4196622 4195898
48886 4195898 4191004 4182727 4171579 4157704 4141315 4122813 4102473 4080280 4056080 4029755 4001398 3971402
48874 3971402 3940051 3906769 3870144 3829188 3784375 3736991 3687734 3636572 3583856 3530711 3478112
48863 3478112 3426220 3374997 3324972 3276965 3231437 3188524 3148405 3111187 3076630 3044393 3014377
48852 3014377 2986514 2960503 2936210 2914142 2894964 2878680 2864846 2853511 2845266 2840203 2837513 2836457
48840 2836457 2837286 2840813 2847386 2856622 2867802 2880233 2893488 2907645 2923083 2939772 2957095 2974605
48828 2974605 2992536 3011105 3029725 3047552 3064584 3081522 3098700 3115833 3132812 3149943 3167261
48817 3167261 3184370 3201270 3218638 3236842 3255198 3272752 3289418 3305892 3322727 3339981 3357522
48806 3357522 3375200 3392807 3410264 3427823 3445849 3464537 3484056 3504708 3526574 3549161 3571813
48795 3571813 3594394 3617194 3640216 3662821 3684082 3703274 3720133 3734905 3748070 3759815 3769926
48784 3769926 3778381 3785712 3792357 3797861 3801187 3801686 3799156 3792951 3781655 3764000 3739890 3710426 3677178
48771 3677178 3641438 3603786 3564204 3522735 3479966 3436592 3392564 3347199 3300243 3252450 3204953
48760 3204953 3158502 3113491 3070262 3028888 2988967 2950066 2912409 2876788 2843843 2813655 2786033
48749 2786033 2760975 2738684 2719204 2702178 2687091 2673773 2662536 2653668 2646896 2641548 2637198 2633951
48737 2633951 2632103 2631754 2632719 2634625 2637075 2639818 2642670 2645097 2646154 2645312 2643301 2641672 2641421 2642409 2644032
48722 2644032 2645864 2647467 2648275 2648111 2647477 2646888 2646228 2645085 2643413 2641429 2639148 2636549 2634052 2632295 2631413
48707 2631413 2630968 2630699 2630933 2632104 2634106 2636338 2638288 2639932 2641556 2643240 2644625 2645303 2645417 2645718 2647028
48692 2647028 2649836 2654353 2660497 2667586 2674446 2680290 2685349 2690282 2695135 2699280 2702280 2704344 2705864 2706979
48678 2706979 2707753 2708516 2709689 2711417 2713461 2715288 2716074 2714736 2710343 2702702 2692552 2681022 2668786 2655731
48664 2655731 2641407 2625669 2608751 2590860 2571977 2552036 2531033 2508849 2485162 2459610 2431856
48653 2431856 2401556 2368635 2333821 2298583 2264359 2231998 2202012 2174934 2151055 2130044 2111198
48642 2111198 2093942 2077866 2062484 2047302 2032042 2016538 2000563 1984002 1967019 1949832 1932553
48631 1932553 1915476 1899178 1883918 1869272 1854796 1840718 1827352 1814105 1799931 1784765 1769662
48620 1769662 1755316 1741249 1726889 1712841 1700469 1690510 1682537 1675704 1669665 1664865 1662103 1661731 1663215
48607 1663215 1665622 1668444 1671600 1674692 1676859 1677619 1677379 1676788 1676048 1675149 1674362 1674010 1674097 1674640 1675977 1678188
$$ [...]
##END NTUPLES=NMR SPECTRUM
##END=
