
##TITLE=UV1103_M1_1161-1249_7180442_FnoH8Zh9zT
##JCAMPDX= 6.0         $$ Bruker NMR JCAMP-DX V2.0
##DATA TYPE= NMR SPECTRUM
##DATA CLASS= NTUPLES
##ORIGIN= BRUKER
##OWNER= Administrator
$$ 1.72 TOPSPIN		Version 2.1
$$ 2012-12-04 23:26:54.175 -0500  Administrator@X
$$ Compression mode = diff/dup
##.OBSERVE FREQUENCY= 400.02188249412
##.OBSERVE NUCLEUS= ^1H
##.ACQUISITION MODE= SIMULTANEOUS (DQD)
##.ACQUISITION SCHEME= undefined
##.AVERAGES= 8
##.DIGITISER RES= 22
##SPECTROMETER/DATA SYSTEM= spect
##.PULSE SEQUENCE= zg30
##.SOLVENT NAME= COFFEE_meoh
##.SHIFT REFERENCE= INTERNAL, COFFEE_meoh, 1, 14.98509
##AUDIT TRAIL= $$ (NUMBER, WHEN, WHO, WHERE, PROCESS, VERSION, WHAT)
$$ ##TITLE= Audit trail, TOPSPIN		Version 2.1
$$ ##JCAMPDX= 5.01
$$ ##ORIGIN= Bruker BioSpin GmbH
$$ ##OWNER= Administrator
$$ $$ E:\/data/COFFEE/nmr/UV1103_M1_1161-1249_7180442_FnoH8Zh9zT/10/pdata/1/auditp.txt
$$ ##AUDIT TRAIL=  $$ (NUMBER, WHEN, WHO, WHERE, PROCESS, VERSION, WHAT)
(   1,<2012-12-04 23:26:45.910 -0500>,<Administrator>,<X>,<go>,<TOPSPIN 2.1>,
      <created by zg
	started at 2012-12-04 23:25:39.832 -0500,
	POWCHK enabled, PULCHK disabled,
       configuration hash MD5:
       86 BA 57 50 F2 9D 5C 9B 26 00 A9 28 5F 66 2E 89
       data hash MD5: 64K
       EF F3 E0 D7 9B B4 4B 83 6B FA 30 99 9B E7 60 FD>)
(   2,<2012-12-04 23:26:49.035 -0500>,<Administrator>,<X>,<proc1d>,<TOPSPIN 2.1>,
      <Start of raw data processing
       efp LB = 0 FT_mod = 6 PKNL = 1 PHC0 = 0 PHC1 = 0 SI = 32K 
       data hash MD5: 32K
       BF 94 B4 53 EA C2 07 CF C8 39 35 DF 4E 79 0B A2>)
(   3,<2012-12-04 23:26:49.488 -0500>,<Administrator>,<X>,<proc1d>,<TOPSPIN 2.1>,
      <pk PHC0 = 92.80151 PHC1 = 0 
       data hash MD5: 32K
       58 67 4F 0E 82 0F 89 90 82 F6 09 7C 6A 3B FA 47>)
(   4,<2012-12-04 23:26:49.722 -0500>,<Administrator>,<X>,<proc1d>,<TOPSPIN 2.1>,
      <abs ABSG = 1 
       data hash MD5: 32K
       E2 42 84 AD 80 4E B3 01 36 5A 35 3A D7 0C 03 7C>)
(   5,<2012-12-04 23:26:49.863 -0500>,<Administrator>,<X>,<proc1d>,<TOPSPIN 2.1>,
      <abs ABSG = 2 
       data hash MD5: 32K
       29 12 99 8B 24 AA 11 BE 9C 90 9C EA 22 D3 CE 3F>)
(   6,<2012-12-04 23:26:50.019 -0500>,<Administrator>,<X>,<proc1d>,<TOPSPIN 2.1>,
      <abs ABSG = 3 
       data hash MD5: 32K
       0B 8F F6 76 30 5B 82 7D 8B 51 D6 0B 84 B7 4C BF>)
(   7,<2012-12-04 23:26:50.160 -0500>,<Administrator>,<X>,<proc1d>,<TOPSPIN 2.1>,
      <abs ABSG = 4 
       data hash MD5: 32K
       D6 3D EF EF 03 5A 3A ED D9 82 A3 68 F4 E0 02 D0>)
(   8,<2012-12-04 23:26:50.316 -0500>,<Administrator>,<X>,<proc1d>,<TOPSPIN 2.1>,
      <abs ABSG = 5 
       data hash MD5: 32K
       FC B9 5F 9C 06 CE B1 70 94 83 58 D2 DE 99 67 D2>)
$$ ##END=
$$ 
$$ $$ hash MD5
$$ $$ 95 92 0F 59 51 67 B0 0A DB 21 A7 20 29 5B 77 A9
##$RELAX= 
##$RELAX= 
##$RELAX= 
##$RELAX= 
##$RELAX= 
##$RELAX= 
##$RELAX= 
$$ Bruker specific parameters
$$ --------------------------
##$DU= <E:\>
##$EXPNO= 10
$$ [...]
##$TP= (0..7)
150 150 150 150 150 150 150 150
##$TP07= 0
##$TPNAME0= <>
##$TPNAME1= <>
##$TPNAME2= <>
##$TPNAME3= <>
##$TPNAME4= <>
##$TPNAME5= <>
##$TPNAME6= <>
##$TPNAME7= <>
##$TPOAL= (0..7)
0.5 0.5 0.5 0.5 0.5 0.5 0.5 0.5
##$TPOFFS= (0..7)
0 0 0 0 0 0 0 0
##$TUNHIN= 0
##$TUNHOUT= 0
##$TUNXOUT= 0
##$USERA1= <user>
##$USERA2= <user>
##$USERA3= <user>
##$USERA4= <user>
##$USERA5= <user>
##$V9= 5
##$VALIST= <valist>
##$VCLIST= <CCCCCCCCCCCCCCC>
##$VD= 0
##$VDLIST= <DDDDDDDDDDDDDDD>
##$VPLIST= <PPPPPPPPPPPPPPP>
##$VTLIST= <TTTTTTTTTTTTTTT>
##$WBST= 2048
##$WBSW= 25
##$XGAIN= (0..3)
0 0 0 0
##$XL= 0
##$YL= 0
##$YMAX_a= 671550
##$YMIN_a= -570367
##$ZGOPTNS= <>
##$ZL1= 120
##$ZL2= 120
##$ZL3= 120
##$ZL4= 120
##$ABSF1= 14.98509
##$ABSF2= -5.573092
##$ABSG= 5
##$ABSL= 3
##$ALPHA= 0
##$AQORDER= 0
##$ASSFAC= 0
##$ASSFACI= 0
##$ASSFACX= 0
##$ASSWID= 0
##$AUNMP= <proc_prof1d_extract_pilot.lims>
##$AXLEFT= 0
##$AXNAME= <>
##$AXNUC= <1H>
##$AXRIGHT= 0
##$AXTYPE= 0
##$AXUNIT= <>
##$AZFE= 0.1
##$AZFW= 0.1
##$BCFW= 0
##$BC_mod= 0
##$BYTORDP= 0
##$COROFFS= 0
##$CY= 15
##$DATMOD= 1
##$DC= 0
##$DFILT= <>
##$DTYPP= 0
##$F1P= 0
##$F2P= 0
##$FCOR= 0.5
##$FTSIZE= 32768
##$FT_mod= 6
##$GAMMA= 0
##$GB= 0
##$INTBC= 1
##$INTSCL= 1
##$ISEN= 128
##$LB= 0
##$LEV0= 0
##$LPBIN= 0
##$MAXI= 10000
##$MC2= 0
##$MEAN= 0
##$ME_mod= 0
##$MI= 0
##$NCOEF= 0
##$NC_proc= -8
##$NLEV= 6
##$NOISF1= 0
##$NOISF2= 0
##$NSP= 0
##$NTH_PI= 0
##$NZP= 0
##$OFFSET= 14.98509
##$PC= 1
##$PHC0= 92.80151
##$PHC1= 0
##$PH_mod= 1
##$PKNL= yes
##$PPARMOD= 0
##$PPDIAG= 0
##$PPIPTYP= 0
##$PPMPNUM= 2147483647
##$PPRESOL= 1
##$PSCAL= 4
##$PSIGN= 0
##$PYNMP= <proc.py>
##$REVERSE= no
##$SF= 400.02
##$SI= 32768
##$SIGF1= 0
##$SIGF2= 0
##$SINO= 400
##$SIOLD= 32768
##$SPECTYP= <>
##$SREGLST= <1H.CDCl3>
##$SSB= 0
##$STSI= 32768
##$STSR= 0
##$SW_p= 8223.68421052631
##$SYMM= 0
##$S_DEV= 0
##$TDeff= 65536
##$TDoff= 0
##$TI= <>
##$TILT= no
##$TM1= 0
##$TM2= 0
##$TOPLEV= 0
##$USERP1= <user>
##$USERP2= <user>
##$USERP3= <user>
##$USERP4= <user>
##$USERP5= <user>
##$WDW= 1
##$XDIM= 32768
##$YMAX_p= 487115399
##$YMIN_p= -705105
##$CURPLOT= <Network HP LaserJet P1505>
##$CURPRIN= <$Network HP LaserJet P1505>
##$DFORMAT= <normdp>
##$LAYOUT= <+/1D_H.xwp>
##$LFORMAT= <normlp>
##$PFORMAT= <normpl>
##$SURQMSG= 1
$$ End of Bruker specific parameters
$$ ---------------------------------
##NTUPLES= NMR SPECTRUM
##VAR_NAME=  FREQUENCY,     SPECTRUM/REAL,   SPECTRUM/IMAG
##SYMBOL=    X,             R,               I
##VAR_TYPE=  INDEPENDENT,   DEPENDENT,       DEPENDENT
##VAR_FORM=  AFFN,          ASDF,            ASDF
##VAR_DIM=   32768,         32768,           32768
##UNITS=     HZ,            ARBITRARY UNITS, ARBITRARY UNITS
##FACTOR=    0.250966925370066, 1,           1
##FIRST=     8223.43324360094, 66907,        8244
##LAST=      0,             -136509,         -152217
##MIN=       0,             -705105,         0
##MAX=       8223.43324360094, 487115399,    0
$$ Real data points
##PAGE= N=1
##DATA TABLE= (X++(R..R)), XYDATA
$$ [...]
19552e68056K37226Q5766a429m8602j0608o9310C6550a36997B745N2697b38773
19540d598A61454c58221a5362A41526B0422a62661m4070k62191h5569L6877j28140
19529a76832E5281a63911M1536A13795h3384j23851N5745L8411k16630J06114
19519b23595A55107b57008E2668J60571O3111A16312E1784A4567Q8038c02101
19508G3610c1173j41697B98012j35815c23909Q8391a12273p7771c5050C45219
19497a49061K9809L3006G5029Q8628b16829R1443A12499a34357B46221a20339
19486d13344D7401Q1238E1742Q051b36829r696A59854b64270i1169l06379D9932
19474b22557A27669a75239e5962l2837c4809Q293j30056N6424a555H3910d43101
$$ y = [-568056, -330830, -245064, -1429, -50031, -60639, -129949, 36550, -136997, 2745, 55442, -238773, -4598, 161454, -358221, -15362, 141526, 20422, -162661, -206731, -468922, -85569, -48692, -176832, 55281, -163911, -122375, 113795, -83384, -207235, -151490, -113079, -329709, -223595, 155107, -257008, 52668, 213239, 276350, 116312, 51784, 14567, 102605, -302101, 73610, -31173, -172870, 298012, 162197, -323909, -235518, -112273, -190044, -35050, 345219, -149061, -119252, -86246, 75029, 163657, -216829, -125386, 112499, -134357, 246221, -120339, -413344, 47401, 128639, 51742, 59793, -236829, -246525, 159854, -264270, -91169, -397548, 49932, -222557, 127669, -175239, -55962, -88799, -34809, -26516, -156572, -100148, -1555, 83910, -443101]
19462A178b27147A73113f8282B11663r8556a01805r578k7983j2498I5127a13513
19450A74429a58402b2625k3693r2069A7649J10575J94772E4715a06477K7506A6028
19438A06368L82a72270d3239B09039b12103B64270j06307J94438A4724A37e2523
19426b44032D2544a92435f8624K9087D9872K14952j11258a08458m3949p7054A07883
19414b33376K4686l0450B33511J78099i8616K4894j43679B90961e3897k32371
19404b86268a03921l1247F106g8872A070e0155b3515k1730A19201j1532g8051
19392A00209c42610e7392k2106j96214p9248A62882b41168A47103h0910j9442
19382a00352H0793a79107C6922b49671O3898l4231J1521o2658G5078b61024A77880
$$ y = [1178, -227147, 173113, -68282, 211663, 113107, -101805, -111383, -139366, -151864, 95127, -113513, 174429, -158402, -22625, -46318, -138387, 17649, 128224, 322996, 54715, -106477, -78971, 16028, 106368, 106750, -172270, -43239, 209039, -212103, 264270, 157963, 352401, 14724, 137, -52523, -244032, 42544, -192435, -68624, -39537, 49872, 264824, 153566, -108458, -152407, -229461, 107883, -233376, -208690, -239140, 233511, 411610, -98616, -73722, -217401, 290961, -53897, -286268, -103921, -135168, 6106, -78872, 1070, -50155, -23515, -45245, 119201, 107669, -78051, 100209, -342610, -57392, -79498, -275712, -354960, 162882, -241168, 147103, -80910, -100352, 80793, -179107, 36922, -249671, -185773, -220004, -208483, -271141, 75078, -261024, 177880]
19370A18579b52996e659l14015i6594I9942C1380J36182n2534a25430D3029Q9777
19359A32806d7861m69981H7145B2288b53591O5613h905l76481a60805A5133K9633
19348D4766N489j8610L8503J1172l9975M3418n974i3272o0540f2050j22892l6884
19336b21826J3603P1501m80676b16281R9219A1900a0025l1445J4727l77830H4288
19324F7574J77279g0965l34518B48239b4768q7284j73596A68237a93649j47199
19314c40848A71295b02012A51604a76115j08702B7421a35089M0021j34750C62536
19303g3475D37584a85482l5078j9989B38096c10624K9298R1493C7538a82484g2597
19291a57679J27E6935h582k42043G2752I305c9938k56334F401d40803A54695b9148
$$ y = [118579, -252996, -5659, -319674, -96594, 99942, 31380, 167562, 115028, -125430, 43029, 132806, -47861, -517842, 87145, 22288, -253591, -187978, -8905, -385386, -160805, 15133, 44766, 50255, 31645, 70148, 81320, 41345, 84763, 78789, -93272, -153812, -62050, -184942, -221826, -208223, -136722, -617398, -216281, -117062, 11900, -10025, -41470, -26743, -404573, 84288, 67574, 244853, -70965, -405483, 248239, -24768, -112052, -285648, 168237, -193649, -340848, 171295, -202012, 151604, -176115, -284817, 27421, -135089, -95068, -229818, 362536, -73475, 437584, -185482, -220560, -240549, 238096, -310624, -281326, -189833, 37538, -182484, -72597, -157679, -157552, 56935, -8582, -250625, 72752, 9305, -39938, -296272, 6401, -440803, 154695, -29148]
19278a66142j9111A21559a6627A7830c78840a35632A24854E9486a24663I5610
19267F3088a93265o10b5835D9686a47782r9548B9088J6941o136K539a78967O2974
19255a15993H8083J64705c37177A49156a18796M522j60537E1306f6259k50073
19245c16332i7615j18451A15986F113K54652i5998j05394q0725Q3207E3354a13610
19233a22045G8861a63137j1624l74172K01315N1944N9777H9972a07014p0753d5555
19221b12137B23098a04497P381M0298d123D653c06921i5713A14206a0773j5096
19210b5869k4697o2266l96982d3075C7292b36783a12724M9737A25576C2219a72019
19198b41800B97448c18067A36051M5077b4744A59007j8530a70929h1588E7117
$$ y = [-166142, -185253, 121559, -16627, 17830, -378840, -135632, 124854, 59486, -124663, 95610, 63088, -193265, -193875, -25835, 49686, -147782, -247330, 29088, 46029, 39893, 42432, -178967, -115993, 88083, 252788, -337177, 149156, -118796, -114274, -274811, 51306, -66259, -316332, -97615, -216066, 115986, 6113, 260765, -95998, -201392, -282117, -198910, 53354, -113610, -122045, 78861, -163137, -174761, -548933, -347618, -295674, -235897, 89972, -107014, -177767, -45555, -212137, 223098, -104497, -97116, -56818, -4123, 4653, -306921, -95713, 114206, -10773, -25869, -50566, -112832, -509814, -43075, 37292, -236783, -112724, -62987, 125576, 32219, -172019, -241800, 297448, -318067, 136051, 181128, -24744, 159007, 140477, -170929, -81588, 57117]
19187g3876j6365L6545a4907j06454q6120C0076b85828a19603A81254j9438d8913
19175B67906A29710i4733p8563G7485C6844h5519j28998J388k18735b5829F8287
19163a27833j25342C736O3428O8004D1168J24983G1185J35244a61755n4270J2069
19152b03956B3752l928a21576M2616j93914i6987g300r3304j75273Q127A20456
19140B49982d3860A37054m4581b3242j54265l7163C8307P8823b46951J9294P6071
19129a51586A11914L7294c82235a21577m2359f8509k6557C160J06823c14794A16462
19117F7348J31278b21055c4018E7896f3508A08628b30965B42578J09608E1641
19106e1426A09994p204h286n332k42455C7744a16080D8127J86682A9463f5635
$$ y = [-73876, -90241, -53696, -14907, -121361, -207481, 30076, -285828, -119603, 181254, 161816, -48913, 267906, 129710, -94733, -173296, 77485, 36844, -85519, -214517, -213129, -431864, -25829, 68287, -127833, -253175, 3736, 67164, 135168, 41168, 166151, 71185, 206429, -161755, -216025, -203956, 23752, 19824, -121576, -78960, -272874, -96987, -7300, -100604, -275877, -267750, 120456, 249982, -43860, 137054, 92473, -23242, -177507, -214670, 38307, 117130, -246951, -227657, -151586, 111914, 149208, -382235, -121577, -163936, -68509, -95066, 3160, 109983, -314794, 116462, 67348, 198626, -221055, -34018, 57896, -63508, 108628, -230965, 242578, 352186, 51641, -51426, 109994, 102790, -8286, -13618, -256073, 37744, -116080, 48127, 234809, 19463, -65635]
19094a3669F5765I989a49561j14477B82547a21963A7280e0389j261p8680A36320
19082i2082B49435B7071A1635a71697C56239F7237a07816j14364A6131J52046
19072A68177a60054M2669M8671q8384c9493F6569b21385L141G6622k4862d2733
19060i1382o9092i405j29628p4112G9057O0074b14758K9695H3147C4410a04098
19048i7950A02940a94336c6513J2174n4673k6082l79491R0514e217k28412A7769
19036g798o9258A24470a65382P6656j85964g1209G7538a05530c1524B1403b8951
19024A15440J71436j25330B5010b26370B22647b83222A3179i9239j24548j01595
19014c25382a29415j43103M2691M1420j60683k2611L6523c5764p0108a249j89270
$$ y = [-13669, 65765, 9989, -149561, -264038, 282547, -121963, 17280, -50389, -51650, -130330, 136320, -92082, 249435, 27071, 11635, -171697, 356239, 67237, -107816, -222180, 16131, 168177, -160054, -117385, -68714, -157098, -39493, 66569, -221385, -218244, 76622, 51760, -42733, -91382, -160474, -9405, -139033, -213145, 79057, 139131, -214758, -185063, 83147, 34410, -104098, -97950, 102940, -194336, -36513, -24339, -79012, -105094, -484585, -394071, -5217, -233629, 17769, -7798, -77056, 124470, -165382, -88726, -274690, -71209, 77538, -105530, -31524, 21403, -28951, 115440, 286876, 161546, 25010, -226370, 222647, -283222, 13179, -99239, -223787, -325382, -129415, -272518, -229827, -188407, -349090, -371701, -335178, -35764, -105872, -1249, -190519]
19003a90519A03067e5322A40485o3945i4097B46964a00243j13197A7947J68793
18993A86740n393j3428N4945c50059A60168f8468C8586b51553f3873q3454p1106
18982b18433A91781e5640j31083A7658a41303A86237a08084L1380C4972a9164
18971A92506f4103n153j81883p3455J10542A2306J27835A3439J23636h344A43107
18959a56775k02218a12167j59982A08325a91052K2996E5359b09314i1395j6558
18949a07953j11267b8923o6772M6482j5763c1059j43883A63263R3756a6865F2456
18937a07056j48695J6044f6680D2603A4943L5854Q6228b42032C46823B2856a89109
18925i625q6030o5150C7125K08054F483f6648l43373a76130F5386Q6454g8364
$$ y = [-190519, 103067, -55322, 140485, 76540, -94097, 246964, -100243, -213440, 17947, 186740, 181347, 167919, 222864, -350059, 160168, -68468, 38586, -251553, -63873, -147327, -218433, 191781, -55640, -186723, 17658, -141303, 186237, -108084, -76704, 34972, -19164, 192506, -64103, -69256, -251139, -324594, -214052, 12306, 140141, 13439, 137075, -8344, 143107, -156775, -358993, -112167, -272149, 108325, -191052, -168056, 55359, -209314, -91395, -107953, -219220, -28923, -95695, -49213, -64976, -31059, -174942, 163263, 257019, -16865, 62456, -107056, -255751, -239707, -66680, 42603, 14943, 50797, 137025, -242032, 346823, 22856, -189109, -9625, -95655, -160805, 37125, 245179, 6483, -66648, -410021, -176130, 65386, 151840, -78364]
18913B28059a30300e9831l24599f0738A44897a52795M0642K6830j84962A85201
18902A24125E729L598J84847b2285B25039b07955A4409b47578h7567D1983J88384
18891B30367a7764A37746J29715i6205n9892C72960C0652J04896F5274j0975b61092
18879A45790d6783j23884A6444g7072k24773a2997A62887b2562I9456a33382E9497
18867A62914G3186c4797k44337J28442G431Q4969a181A9988i8776k1201K6283
18856i3694I0949b05528n8354a10707N493I9300k0755m210R6371a10073f958A7932
18843f4966C4281i8404m1308B61455a37336I0246m1457a71150j41505A59203N5363
18832B14566b00919A0939a34216q9672M2564A60898B855a27458k74592C30334
$$ y = [228059, -130300, -59831, -384430, -60738, 144897, -152795, -112153, -85323, -270285, 185201, 124125, 5729, 9327, 194174, -22285, 225039, -207955, 14409, -247578, -87567, 41983, 230367, -17764, 137746, 267461, -96205, -156097, 372960, 30652, 135548, 65274, 54299, -261092, 145790, -46783, -170667, 16444, -77072, -301845, -12997, 162887, -22562, 99456, -133382, 59497, 162914, 73186, -34797, -279134, -150692, 7431, 92400, -1181, 19988, -98776, -119977, -93694, 90949, -205528, -263882, -110707, -105214, 99300, 78545, 74335, 170706, -110073, -6958, 17932, -64966, 34281, -98404, -139712, 261455, -137336, 90246, 48789, -171150, -312655, 159203, 214566, -200919, 10939, -134216, -223888, -181324, 160898, 2855, -127458, -402050, 330334]
18821i7034K0803C1136J7648J62695C7194j7294a86024C34770B2511L48172j80459
18810A90224a89585D93467k22929a2488G8581d6414b1305A61693K1335c15361
18799G4849k3519J52960f7209k62310a14135j16488A42412o9278a0214F3922c11638
18787A0027i5673c4550c033n1294k82560A98985c35529i3965j11456D2404a83168
18775D366P8106b05795p375H2116Q0467A27a88766A0897K33927A2653P6390a42724
18762C940a71496j8827I4015c50279A55752c32568a24536A01171a57877j92837
18752c50714K4750a11780j61429F2001K59471A11820e2629N972j78226o2692j21248
18741d08823C7526a39477j43813J21238o7654A34150m131a41350G156K67101b74994
$$ y = [-97034, -76231, 31136, 48784, 211479, 37194, 19900, -186024, 334770, 22511, 370683, 190224, -189585, 493467, 270538, -12488, 78581, -46414, -21305, 161693, 183028, -315361, 74849, 51330, 204290, -67209, -329519, -114135, -230623, 142412, 73134, -10214, 63922, -311638, 10027, -95673, -34550, -3033, -54327, -336887, 198985, -335529, -93965, -205421, 42404, -183168, 4366, 82472, -205795, -213170, 82116, 162583, 127, -188766, 10897, 244824, 12653, 89043, -142724, 3940, -171496, -190323, 94015, -350279, 155752, -332568, -124536, 101171, -157877, -350714, -325964, -111780, -273209, 62001, 321472, 111820, -52629, -46657, -224883, -287575, -408823, 37526, -139477, -283290, -162052, -229706, 134150, 130019, -141350, 7156, 274257, -274994]
18729a01548M8789b5086A23307J9491P277n8938M8838m9143a20436B80923n4293
18718B26630d09366b979j429r2638e321j32414F6225k8336a29170A8819g7095
18706B36640i0437H731a69111k29109J29693d9966J8528G3646L17288A2571K52121
18695B64692E9145j7863b61590h4620A4487O3458c3185B41542b07911O9249k67707
18684d06369J88520B27404h874G9572i1034C18720A38190D5523g4833A06619D1023
18672b44284H1822j9176a44102n1647F0372B0042e72170b36288d418m1441A30381
18660a91681A26479a20746B27564a51732D224K87489b33705E6222a44969B00413
18649A32706a49584l0984A09378b45395H6340a17842A68954b75506k355b9239
$$ y = [-101548, -52759, -25086, 123307, 142798, 150075, 91137, 139975, 90832, -120436, 280923, 226630, -409366, -2979, -4408, -97046, -5321, -137735, 66225, 37889, -129170, 18819, -77095, 236640, -90437, 8731, -169111, -398220, -268527, -49966, -31438, 73646, 390934, 12571, 264692, 59145, 41282, -261590, -84620, 14487, 77945, -33185, 241542, -207911, -138662, -406369, -217849, 227404, -8874, 79572, -91034, 318720, 138190, 45523, -74833, 106619, 41023, -244284, 81822, 62646, -144102, -195749, 60372, 20042, -572170, -236288, -4418, -45859, 130381, -191681, 126479, -120746, 227564, -151732, 4224, 291713, -233705, 56222, -144969, 200413, 132706, -149584, -180568, 109378, -245395, 86340, -117842, 168954, -275506, -277861, -29239]
18638a00660L0373k63827a24176k81508f558j14093p08B1441a76113N8589A0179
18626b40337A89330d4395j14571A09543a10084L0701m214I709d0614A14316c8508
18614a74038q0725m6820r437E896K4890a93831R3009j05112I0002b86317j08183
18603c94500A93004e0404D5345P8761f0391q0851E0998J56830b7639F7274e9417
18591g4946k87846g7202J0792k11801Q4302l0206e3075F5743B2240h8230q4393
18580a72623j8792B48676E0899f7554F0792O5567a36753A37308l1651e4566p4159
18569a28725j57046D0662Q4409A7636a08005k9613f8566A87815a74521j07625
18559b82146F0456J98427h4058a3875j18583j48277i434I8743c1633A228a06806
$$ y = [-100660, -70287, -334114, -124176, -405684, -6558, -120651, -121359, 21441, -176113, -117524, 10179, -240337, 189330, -44395, -158966, 109543, -110084, -79383, -83597, 9709, -40614, 114316, -38508, -174038, -254763, -301583, -311020, 5896, 30786, -193831, -100822, -205934, 90002, -286317, -394500, 193004, -50404, 45345, 124106, -60391, -141242, 50998, 207828, -27639, 67274, -59417, -74946, -362792, -77202, -66410, -278211, -193909, -224115, -53075, 65743, 22240, -88230, -172623, -191415, 248676, 50899, -67554, 60792, 126359, -136753, 137308, 105657, -54566, -128725, -285771, 40662, 125071, 17636, -108005, -137618, -68566, 187815, -174521, -282146, 60456, 258883, -84058, -13875, -132458, -280735, -9434, 98743, -31633, 1228, -106806]
18547c59858h091B14170J2081A06606c5106j87434k2616B08410B2769b72206A07165
18535A07875E934f4969j73072K6586D53187a21116j92351B28841r1188k8419K1817
18524A31051J19876a79854a2792C9373a53903N2710k2436o1445D5708d4556j5693
18513f0249k79952a41714J7640M6596A25506J23593a04635B14282j6486k7434
18503A70362k9837F9098b34744B80484f3898l20191a75627A71351a05062M8797
18493e6265f086C66523b4718A41238e7113B15707b2651b187B22411b13593I7527
18481g6218j17452B22409a8945B30701b7988B11092a44717e7600j00261M9200
18471a08661c0377B71196H9879L9914d6382D9585a46989k1413K9180L9875j6738
$$ y = [-359858, -8091, 214170, 226251, 106606, -35106, -222540, -245156, 208410, 22769, -272206, 107165, 107875, 5934, -64969, -238041, -211455, 453187, -121116, -313467, 228841, 137653, 109234, 131051, 250927, -179854, -12792, 39373, -153903, -101193, -123629, -185074, 45708, -44556, -60249, -340201, -141714, -124074, -77478, 125506, 249099, -104635, 214282, 197796, 170362, 140525, 69098, -234744, 280484, -63898, -384089, -175627, 171351, -105062, -56265, -6086, 366523, -24718, 141238, -57113, 215707, -22651, -2187, 222411, -213593, 97527, -76218, -193670, 222409, -18945, 230701, -27988, 211092, -144717, -57600, -157861, -108661, -30377, 271196, 89879, 129793, -46382, 49585, -146989, -168402, -139222, -99347, -116085]
18460a16085A11558b8739r5573a0175m0157D6890r280O5414J8804j3460b86402
18448b41322I3386a30088e7766n5440j69293J08665A51230K51928a84339e078
18437b72589A86326K1856a20952A97721H8762f8871E8428L37476f6626B35488
18426b75151B93500a81342B2556h8085l2002k43534b7978o197A58779L1649a94402
18414b65967p0699h8427d466B0915h0375b9110A15148a05184c862D085f9471k49945
18402c19416a43539B18972f6499j67525B57141c84214h4003m4410B3003J65361
18392A88364a88922A10215a72368K2619J4757B23660k9012a17259l08412a68468
18381B3230c379m2434H2051d6298A76502d7587k80587b416m41975B5979g6563
$$ y = [-116085, 111558, -28739, -124312, -10175, -50332, 46890, 37610, 103024, 121828, 108368, -286402, -241322, 93386, -130088, -57766, -113206, -282499, -173834, 151230, 403158, -184339, -5078, -272589, 186326, 208182, -120952, 197721, 88762, -68871, 58428, 395904, -66626, 235488, -275151, 293500, -181342, 22556, -88085, -120087, -363621, -27978, -34175, 158779, 190428, -194402, -265967, -336666, -88427, -4466, 20915, -80375, -29110, 115148, -105184, -3862, 4085, -69471, -319416, -143539, 218972, -66499, -234024, 257141, -384214, -84003, -128413, 23003, 188364, -188922, 110215, -172368, -149749, -134992, 223660, 194648, -117259, -425671, -168468, 23230, -3379, -45813, 82051, -46298, 176502, -47587, -328174, -2416, -444391, 25979, -76563]
18369A7722G033J27554J86965A08066g696l08826f4414m9900c8503J7777k01089
18358b21815B49064c76834f0468p698B71423a5724j12495B18672b1644A44570
18347A30121b8966r9081e0906B58970d30805A90670H712P3655d0007B838K70699
18336B73537r5839h5166E7103B7645e240A45785a97311m401A8822J60241F9303
18324A3961b65075D1637J445J69525m3083a5843j61493q1132j84848A74773b22609
18312C32609D9532a38633K1343G010J20472i6852L9326n4344k26576J62577Q4941
18301i0928E12664b21074J00214E1452i0641k76293J20114p2399J6143A22604
18290I1584e3442C1988b39124A32057a39723M9170k35573j7665A2857a78163A58521
$$ y = [17722, 7033, 134587, 321552, 108066, -7696, -316522, -64414, -114314, -38503, -20726, -221815, 249064, -376834, -60468, -68166, 271423, -15724, -128219, 218672, -21644, 144570, 130121, -28966, -128047, -50906, 258970, -430805, 190670, 8712, 82367, -40007, 2838, 273537, 177698, -85166, 57103, 27645, -5240, 145785, -197311, -201712, 18822, 179063, 69303, 13961, -265075, 41637, 43082, 212607, 169524, -15843, -177336, -258468, -443316, 174773, -222609, 332609, 49532, -138633, -117290, 7010, 127482, -96852, -57526, -111870, -338446, -175869, -90928, 512664, -221074, -120860, 51452, -90641, -366934, -246820, -319219, -303076, 122604, 91584, -53442, 31988, -239124, 132057, -139723, -90553, -326126, -343791, 12857, -178163, 158521]
18278a18550A64914b62400J13812c1268B14280n5553n1239M3788h4597j14554
18268a99151J0511m3709c2580C5245a54928A12502J0566a18812H427f0778p8639
18257a39417P719e8870B13486a73280I5458J40903a09184B20249b37822N9714
18247a78108P7139A38493a49537i325j29304A66583o5864d5185B6529b23076h2236
18235b71353P8493D9935J48092E6708a06841H0352k1818J22054E838a38842j7832
18224a56674B5842Q0411a16606k42719k5361j089A93436D8347B699a46406f6532
18212a3903A33448d05150J74303B10409j3386i8383k05605d8801o5099B28648
18201f7665m9529K5569m0992d0470B63a5870j66603C3549g7588j7372L9339B49449
$$ y = [-118550, 164914, -262400, -148588, -31268, 214280, 158727, 107488, 151276, -84597, -199151, -188640, -232349, -32580, 35245, -154928, 112502, 123068, -118812, 8427, -60778, -139417, -131698, -58870, 213486, -173280, 95458, 236361, -109184, 220249, -237822, -178108, -100969, 138493, -149537, -9325, -138629, 166583, 100719, -45185, 26529, -223076, -82236, -271353, -192860, 49935, 198027, 56708, -106841, 80352, 58534, 180588, 5838, -138842, -156674, 25842, 106253, -116606, -359325, -384686, -385775, 193436, 48347, 2699, -146406, -66532, -13903, 133448, -405150, -230847, 210409, 197023, -98383, -303988, -48801, -113900, 228648, -67665, -117194, -91625, -132617, -40470, 263, -15870, -182473, 33549, -77588, -94960, -55621, 249449]
18188I6164g2879C5232a44760B29271b4303l71567J46888b31j65C26480A03141
18176B77582b1771l8502E1047D56L0677c19633a19117N1198A3533d69020A13064
18164a98660J2074R1566l9476C23749c879E3962b32341p5925h044B27888H822
18152D1439a2919k74244J23348E5315F893M9256b46895G7244a13670A32806a81658
18140B31494D8014J52758i6699E5557L76606B8471a49611H2341c0070k85395a38830
18128i804k57167k27635b39524b4368B42631a88858f9638n6284C8285J1215b21660
18116b74817e8804A80318l2322B6686M7407M1752m4706o929f8180k26130J3322
18105b80988A05681O3357o3137a59952C4566i6781J9412E6886L7384A3170b24922
$$ y = [96164, -72879, 35232, -144760, 229271, -24303, -395870, -248982, -231, -396, 326480, 103141, 277582, -21771, -60273, 51047, 456, 31133, -319633, -119117, -67919, 13533, -469020, 113064, -198660, -186586, -95020, -134496, 323749, -3879, 53962, -232341, -308266, -8044, 227888, 8822, 41439, -12919, -287163, -163815, 55315, 6893, 56149, -246895, 77244, -113670, 132806, -181658, 231494, 48014, 200772, -96699, 55557, 432163, 28471, -149611, 82341, -30070, -315465, -138830, -9804, -266971, -494606, -239524, -24368, 242631, -188858, -69638, -125922, 38285, 49500, -221660, -274817, -58804, 180318, 147996, 26686, 74093, 115845, 71139, 64210, -68180, -294310, -280988, 105681, 169038, 105901, -159952, 34566, -96781, -77369, 56886, 94270, 13170, -224922]
18093b73878B1170l908J30210A3442n934h7761C5862J00744c87326C1451O455
18082C7906c31110B801c53768F988J08259a16447B08021b04003e3855l08776J73454
18071a89177B09280l1001p6319b09556A79231b09134E72Q3277j3632J44190H1347
18059B53909B8428i829l33860D7388c95002b4809j9178m5456C9266a29121j0407
18048a39528K0489B86130a77701b3273j8859k04696R9473c5158A49277a59957
18037B68782I5516K47462A29217c16787a18644A61485K756a75243l6060Q9349
18027a21954b5461A99744d4310M962j66210G9928l7042j6507a11652A99474a24860
18015B72487a35329A62626L8231a1900j58155e8094j28390A181R362K69755a29237
$$ y = [-273878, 21170, 17262, 147472, 13442, 7508, -87761, 35862, 136606, -387326, 31451, 37906, -331110, 2801, -353768, 6988, 115247, -116447, 208021, -204003, -53855, -362631, -189177, 209280, 178279, 101960, -209556, 179231, -209134, 572, 83849, 70217, 214407, 81347, 253909, 28428, -9829, -343689, 47388, -395002, -24809, -43987, -89443, 39266, -129121, -139528, -119039, 286130, -177701, -23273, -42132, -246828, -147355, -35158, 149277, -159957, 268782, 95516, 342978, 129217, -316787, -118644, 161485, 164241, -175243, -211303, -121954, -25461, 199744, -44310, -39348, -205558, 79928, 42886, 26379, -111652, 199474, -124860, 272487, -135329, 162626, 200857, -11900, -170055, -58094, -186484, 1181, 10543, 280298, -129237]
18003c16879K4214j25381B49752c40956k12899A45247b36056c4482q3767K7944
17993i0305l09444c6097n8678G6426k7495c9814P729j66235A94442l2598b26459
17981b26124i7787A6205a03103j6251j4797A37259n2274i0462b1728G5438J08947
17970A84385K5203q0550k8980b6105r2751A51030a05952D641O4110a42138k15640
17959c57778C78071C0326c4352j59768B36042B8004J60839R8411d56845a99121
17948b18440H2237R3318a34498M788N7352F197J233h9924j07720k98037a34828
17936B85023c3666k23669k2744F4503e5812C23513a7132j32980l3988A01676K3422
17925A25098a50802k74714G2953B1373M1175j3554c30112a12729B17240j07215
$$ y = [-316879, -292665, -418046, 249752, -340956, -553855, 145247, -236056, -34482, -118249, -90305, -399749, -36097, -94775, 76426, 48931, -39814, -32085, -198320, 194442, 161844, -226459, -226124, -97787, 16205, -103103, -119354, -134151, 137259, 84985, -90462, -21728, 75438, 184385, 209588, 129038, 100058, -26105, -118856, 151030, -105952, 4641, 68751, -142138, -357778, 378071, 30326, -34352, -194120, 236042, 28004, 188843, 287254, -456845, -199121, -218440, 82237, 175555, -134498, -129710, -72358, 6197, 7430, -89924, -197644, -495681, -134828, 285023, -33666, -257335, -280079, 64503, -55812, 323513, -17132, -150112, -184100, 101676, 125098, -150802, -425516, 72953, 21373, 62548, 48994, -330112, -112729, 217240, 110025]
17915A10025e9749n8047j33107A92228a16295B85294j30786a66782A7973c74894
17904A73286h8950M0722k38697B3432J45417b9361n1938p811j38411A0548J27221
17893A37769a34698E7219a9645M937D21b24160E7050b704B43632a3324H3068e8352
17880B49313g7909A0378J21816d12171a05053a428k6217A38447b5311j80367Q244
17869a97434A23578B1614d35911B23801q7217a3977I7697m3949J37551D2162O9531
17858A11693a86006j34988E4616M6063J5568n5628J8500C7752A1090J88135b65811
17846H8509J49533j06550n7982r017J95700a45786I9898a0337F5286J87710c30132
17834d5385j47742E4232a18417A93565a02580r4202C8032a12432A49674P1728
$$ y = [110025, -59749, -117796, -250903, 192228, -116295, 285294, 154508, -166782, 17973, -374894, 173286, -88950, -48228, -286925, 23432, 168849, -29361, -81299, -89110, -227521, 10548, 137769, -134698, 57219, -19645, -14708, 421, -224160, 57050, -2704, 243632, -13324, 83068, -58352, 249313, -77909, 10378, 132194, -412171, -105053, -1428, -27645, 138447, -25311, -205678, -197434, 123578, 21614, -435911, 223801, 136584, -13977, 97697, 53748, 191299, 42162, 111693, -186006, -320994, 54616, 100679, 116247, 60619, 79119, 37752, 11090, 199225, -265811, 88509, 238042, 131492, 73510, 64493, 260193, -145786, 99898, -10337, 65286, 252996, -330132, -45385, -193127, 54232, -118417, 193565, -102580, -196782, 38032, -112432, 149674, 221402]
17824B21402d49558b4227j47777l9740O4151A72469i6640p8145j50834a05478
17813h6831A57458a56300b2285I3758K12122F2739O4793J842B9743c11475R7464
17802b14011L1330j0724O0852j19854a18570e0302B34399A06697i0250C78868
17791H1867M6302K4011E9538J3707b08246B52785c6206o4803n9123r146O036B68754
17778A31387j9871b74515A50804A0319b44113L5410A66120b53830c8205J8336
17768a9869j68k91776a11272K9240G8959e4773l75361F8112l0754O5675m2528
17757F0505J36072D7114K66204C3109K24312b55708A34183P3212a61483A41119
17746a29689D6919J66209L1097q6481e2893H8943J19648F975a58573f0450n7336
$$ y = [221402, -449558, -24227, -172004, -211744, -147593, 172469, -96640, -174785, -325619, -105478, -86831, 157458, -156300, -22285, 93758, 305880, 62739, 127532, 129374, 29743, -311475, -214011, -182681, -193405, -132553, -252407, -118570, -50302, 234399, 106697, -90250, 378868, 81867, 128169, 152180, 59538, 73245, -208246, 252785, -36206, -101009, -160132, -169278, -163242, 268754, 131387, 111516, -274515, 150804, 10319, -244113, -208703, 166120, -253830, -38205, -19869, -20037, -311813, -111272, -82032, 78959, -54773, -430134, 68112, 37358, 103033, 60505, 196577, 47114, 313318, 33109, 257421, -255708, 134183, 207395, -161483, 141119, -129689, 46919, 213128, 244225, 157744, -52893, 88943, 208591, 6975, -158573, -60450, -117786]
17735a17786J9037A9732a5291A93243B0034g0192J6904k8197A8463d8371I9764
17723h7828H2319N0347d581F0422a313E1747J76030b62223a9349C00553r9987
17712B00566K47746a40847M9563L8687j16934c3565k91855A56377f5449H9202
17701b99582G8503A0197e87j59167k04482C09882j22145c43699Q5757B48399j04862
17690A43537a73829B1692a89740C01531A12604Q4324f4059I6180L5311a42813
17679A09231N3544a28764a7311G9603a03256p0715F5926h8218k32110A58233g5501
17667A77703o2118J66412A35689a29633C27621D9915q057L33800b9003E5352L96411
17656D51763a2146j04690l7482A63442f471B94354B2601a92925D3124a59068B42115
$$ y = [-117786, -98749, 19732, -15291, 193243, 20034, -70192, -53288, -81485, 18463, -48371, 99764, -87828, 82319, 132666, -4581, 60422, -1313, 51747, 227777, -262223, -19349, 300553, 200566, 448312, -140847, -91284, -52597, -169531, -33565, -325420, 156377, -65449, 89202, -299582, 78503, 10197, -587, -159754, -364236, 309882, 187737, -343699, -257942, 248399, 143537, -173829, 21692, -189740, 301531, 112604, 196928, -64059, 96180, 131491, -142813, 109231, 162775, -128764, -17311, 79603, -103256, -173971, 65926, -88218, -320328, 158233, -75501, 177703, 115585, 281997, 135689, -129633, 327621, 49915, 41858, 375658, -29003, 55352, 451763, -12146, -116836, -154318, 163442, -6471, 294354, 22601, -192925, 43124, -159068, 242115]
17644A37786E3364b06092B20755r2487a60155g9698A15516l1158A7679a37205
17633i5831A33823l3436M0848J38416a57115A78317k5277C9820b01474L2306A85722
17621D9736G881b60984a7120A41467o2318d7035F5617N5832a55299D1383J294
17610D2677a20943D8808R664K17644a16454M7542C46684j06487d8347B64906n3707
17599B11199K98366A85631a32646D7492a8156l6282A3860c7615j33891D5492j9576
17588B5916N0154d4294j70988c6972A31825M8783g5077A76099H202L99547a00649
17576f0083C3972J07336A6744b8881k03604B87022b94788B16777o7810F7792a12286
17564A44390C9039J12643c2793A26587N4871k2928o4136Q3152a80306g3775I7688
$$ y = [137786, 53364, -206092, 220755, 128268, -160155, -79698, 115516, 84358, 17679, -137205, -95831, 133823, 100387, 141235, 279651, -157115, 178317, 153040, 39820, -201474, -169168, 185722, 49736, 7881, -260984, -17120, 141467, 79149, -47035, 65617, 121449, -155299, 41383, 42677, -120943, 48808, 58472, 276116, -116454, -68912, 346684, 240197, -48347, 264906, 211199, 509565, 185631, -132646, 47492, -18156, -54438, 13860, -37615, -171506, 45492, 25916, 76070, -44294, -215282, -36972, 131825, 180608, -75077, 176099, 8202, 407749, -100649, -60083, 33972, 141308, 16744, -28881, -232485, 287022, -294788, 216777, 148967, 67792, -112286, 144390, 39039, 151682, -32793, 126587, 181458, 158530, 94394, 177546, -180306, -73775, 97688]
17552d6645F5952K43492Q9463e0405C71467K3060d5597l3597N687f999A1667J89137
17540B00804a26476C13249A01564a68841I7586a71786I2556l6218b2946j32507
17530a55453K9186A82539k5860a33952C93080A9992J37473D3075b7441A71687
17519A91868a12978F320b9396j74420E5557K38835N9234E3366J14580K7433g7561
17507C47747a95515A20197D9318N9797F364J07368d663A74838f8415G5187b6343
17495a913D34573g1051K8721r2312B0668R3152Q7592F6488R0770F078i998J28
17483i870C47719r6761n5425J04522n1153b30191B58926a91082G137K89298D0293
17471a5862A42417J0625B6162Q7224b6974k72091G159f1679a6352B86969a59178
$$ y = [-46645, 65952, 309444, 398907, -50405, 371467, 394527, -45597, -79194, -73507, -6999, 11667, 200804, -126476, 313249, 101564, -168841, 97586, -171786, 92556, 56338, -22946, -155453, -126267, 182539, 156679, -133952, 393080, 19992, 157465, 43075, -27441, 171687, 191868, -112978, 6320, -29396, -203816, 55557, 294392, 353626, 53366, 167946, 195379, -77561, 347747, -195515, 120197, 49318, 109115, 6364, 113732, -4663, 174838, -68415, 75187, -26343, -1913, 434573, -71051, -42330, -134642, 20668, 113820, 201412, 66488, 157258, 6078, -9998, -9870, 347719, 250958, 195533, 300055, 248902, -230191, 258926, -191082, 7137, 296435, 40293, -15862, 142417, 153042, 26162, 113386, -26974, -299065, 7159, -61679, -16352, 286969, -159178]
17459C90115A57188J05693a39652G0845b16367B7359R9849b3390C11140J12004
17449D23144j57949L47393k58900p4161A7639J85319L94338b7483B45286A20246
17438B46838R3843D6635L72829C8297J40485J04751K90076A76033J59491a62605
17427c7942A30541j0252c802B12379M45409B79257j06849r785J96778e9381A00265
17415E10446A11533K11503r7087i4197I3171L6166L84475B18603B1396b11097
17404G5445B0692L85365a62736F5355J22888O0810J8081H6508b5690C04299b2718
17392b6162l2144G9487b2946A51006G335J13082J35946A10579L40872A8523K20398
17381B38921E6742K02102G3691A6497J10190k8954K84568k2753G3509Q730q344
$$ y = [390115, 157188, 262881, -139652, 70845, -216367, 27359, 127208, -23390, 311140, 423144, 265195, 612588, 353688, 279527, 17639, 202958, 597296, -27483, 245286, 120246, 246838, 340681, 46635, 419464, 38297, 178782, 283533, 573609, 176033, 335524, -162605, -37942, 130541, 120289, -3802, 212379, 657788, 279257, 172408, 162623, 359401, -59381, 100265, 510446, 111533, 323036, 225949, -94197, 93171, 129337, 513812, 218603, 21396, -211097, 75445, 20692, 406057, -162736, 65355, 188243, 249053, 267134, 86508, -25690, 304299, -22718, -26162, -58306, 79487, -22946, 151006, 7335, 120417, 256363, 110579, 451451, 18523, 238921, 56742, 258844, 73691, 16497, 126687, 97733, 382301, 359548, 73509, 82239, 73895]
17370G3895K53888A15076J43928p0222O6620p8888k6963N9301J8187r7274M7421
17359A77186G2316J47211J68505A7015a92161C24837A51137A044L36788F0819
17348C21228A25145J2137L78618B32383B1644O1664J1488N6609R17n3458J99705
17337B98569I2740K53342j69657o4483c8120j29213f5236I1172N6363J21719L0020
17326B99274A20273L03225j76511A8482M17196k09621p5439a89790E24669B60354
17315A52451A7266J98905L00453k46331L9072E7274g115C47968j57050a2396A60525
17303B40574p58r125a94124D5505g4657a5063B0785O3047M49975A05297K41719
17292C47016J17528A44952C4757K32611G8317L81103r1276E3459L595K90106A57115
$$ y = [73895, 327783, 115076, 259004, 188782, 255402, 176514, 149551, 208852, 227039, 129765, 177186, 72316, 219527, 388032, 17015, -192161, 324837, 151137, 1044, 337832, 60819, 321228, 125145, 137282, 515900, 232383, 21644, 83308, 94796, 151405, 152322, 98864, 298569, 92740, 346082, 176425, 111942, -38120, -167333, -65236, 91172, 147535, 269254, 299274, 120273, 423498, 246987, 18482, 435678, 226057, 150618, -189790, 524669, 260354, 152451, 17266, 216171, 516624, 270293, 309365, 57274, -7115, 347968, 190918, -12396, 160525, 240574, 239816, 230691, -194124, 45505, -74657, -15063, 20785, 83832, 533807, 105297, 347016, 464544, 144952, 34757, 267368, 78317, 459420, 368144, 53459, 57054, 347160, 157115]
17280C11339A13870D9914P147c8639C99810a52867D43554A44834m9725k2213J89432
17269B62328K24560r0516A77268e0018C93500l5874a12398B41598b7361A10806
17258a26522a5036B44762M203N6281m7628o0126K1236A04983f0990H0553R7891
17247A78444b09270B51917K1436A11852L28970C2942f0777C52001M4149A75824
17236C09856A41888L32174a12181A66132F0869O7056K46238P1072I7938J84816
17226B82754L9892a26741H41M15825P351B06983Q1879O8131d0895E5235M21638
17215D76873D6238k2843K26132R6868J7529j06348D1764J37822c6046B29622j6890
17204B12732J15634K9090q1274r8316J25205A03856J06906J27551o3198e900C78223
$$ y = [311339, 113870, 49914, 57061, -38639, 399810, -152867, 443554, 144834, 95109, 72896, 262328, 486888, 396372, 177268, -50018, 393500, 357626, -112398, 241598, -27361, 110806, -126522, -15036, 244762, 248965, 305246, 257618, 197492, 218728, 104983, -60990, 80553, 178444, -209270, 251917, 273353, 111852, 440822, 32942, -60777, 352001, 396150, 175824, 309856, 141888, 474062, -112181, 166132, 60869, 127925, 374163, 445235, 97938, 282754, 322646, -126741, 841, 416666, 424017, 206983, 288862, 356993, -40895, 55235, 476873, 46238, 23395, 249527, 346395, 363924, 257576, 41764, 179586, -36046, 229622, 212732, 328366, 357456, 276182, 177866, 303071, 103856, 210762, 338313, 275115, -5900, 378223]
17192B33692J12186A72191D1626J84869C8745K92563J5131a35877H5959L57510
17182D43469j93212J87194K65219D1245L55233m1963J0294A41012Q6998F8210
17171C31332J82343k39696J07433j67201b15654F83844E1411L42722A43509K0367
17161A63876J20319M35488B64087R40L62372k97400E0751L30329o4471L4161A58157
17149A75888J52173A22077M75585A7015K81496N6415K29891A38997N906K76813
17139D21716A73365F6300J41384A8725L12094j07627L62635k8588B24532J26821
17129C51353M5035O619G1702J10294c2745A75372d4496D90384j96539O9077L01693
17118F64615q1281P773k55249J51565A21428M40458J92489C31451A34466L86578
$$ y = [233692, 345878, 172191, 41626, 226495, 38745, 331308, 346439, -135877, 85959, 443469, 250257, 437451, 702670, 41245, 396478, 354515, 364809, 141012, 228010, 68210, 331332, 513675, 273979, 381412, 214211, -215654, 683844, 51411, 394133, 143509, 163876, 284195, 719683, 264087, 265027, 627399, 329999, 50751, 381080, 316609, 350770, 158157, 175888, 328061, 122077, 597662, 17015, 298511, 354926, 584817, 138997, 144903, 421716, 173365, 66300, 207684, 18725, 330819, 223192, 585827, 557239, 224532, 351353, 396388, 403007, 71702, 181996, -32745, 175372, -44496, 490384, 293845, 362922, 664615, 583334, 591107, 335858, 487423, 121428, 561886, 754375, 331451, 134466, 521044]
17108E21044k54881J35147A07715M07470k42365J99658C2247L17852q2053l697
17098B64349M5343K12584M3891j37284A16131M49915k12048J63026K3769k29057
17088C11736K09687J96931A91091J94504n5927j02154J67713N790K33944j18305
17078E16656J64508p1569j89688P306B02057P7935K1880J67759J16213p626l8527
17067E39691o1793m272j24288H7752N46368B03917M1351L6661K68007A02503L66099
17056D68602J18511j10216J32900L76773l59745j31895n9409J731K63314j19025
17046E81541n5045M26566k67469A81487K68511j1328O2379q3451K67859r3502
17036E91955j8388M0121K68005A00922N09055k0906Q8731j21066B51284K82883
$$ y = [521044, 266163, 401310, 107715, 515185, 272820, 472478, 32247, 350099, 268046, 264349, 309692, 522276, 566167, 428883, 116131, 566046, 353998, 517024, 540793, 311736, 521423, 718354, 191091, 385595, 329668, 227514, 395227, 401017, 634961, 516656, 681164, 609595, 419907, 427213, 202057, 279992, 301872, 469631, 585844, 578218, 539691, 477898, 473626, 349338, 87752, 634120, 203917, 245268, 281929, 549936, 102503, 468602, 587113, 476897, 609797, 986570, 626825, 494930, 435521, 437252, 700566, 581541, 526496, 953062, 685593, 181487, 449998, 438670, 501049, 417598, 685457, 591955, 573567, 613688, 881693, 100922, 609977, 589071, 677802, 556736, 251284, 534167]
17026E34167J42638J49332j29725Q0456l13036L57820j28451J754o1545K04430
17016H37840B35273O7809M75428k29081q9515L29809J04231L9379J3968m45230
17006E02071M23814l53061K19313L27242m27856K34957j83309j91884J2252K1165
16996E84704M1089N3669J18426J41829l73403K40414o1965N9949j43342j41140
16986E20230N97998m32167j37396J98861L8066l0K36530k09170q8745P9964J97210
16975A001351m2636l47648J8756J40099J11926l39228J77009M37602k58058K53704
16965A152877l68731l11925P09347r8236J72725k02910j60995K82767J7376L59343
16955A551638o24997L13750m5753k57081l0295J43174J35028j59951J98941l41894
$$ y = [534167, 676805, 826137, 696412, 776868, 463832, 821652, 693201, 694955, 633410, 837840, 235273, 303082, 778510, 549429, 459914, 789723, 893954, 933333, 947301, 502071, 925885, 572824, 792137, 1119379, 691523, 926480, 743171, 551287, 563539, 584704, 625793, 679462, 797888, 939717, 566314, 806728, 744763, 804712, 661370, 520230, 1118228, 686061, 548665, 747526, 785592, 785562, 1022092, 812922, 724177, 804141, 1001351, 958715, 611067, 629823, 769922, 881848, 542620, 719629, 1157231, 899173, 1152877, 784146, 472221, 1181568, 1083332, 1256057, 1053147, 892152, 1174919, 1192295, 1551638, 926641, 1240391, 1194638, 937557, 907262, 1050436, 1185464, 1025513, 1224454, 882560]
16945H82560M79804k46522J98152M1579n4374k78987j23512K45632m8235J37525
16935A233622J7846Q4347l10735J56327L0021J71769j13098j06388L44732p0151
16925A438292M8019Q1361j61633J70401j30617L4618k4986P8782r3525k66967
16915A173745L15044K11468m50886K28783M5689l1530L42416j96421k5471j53074
16905A459763J69975N064L83279L6923j54069k37758L81251j46368p9381j37612
16895A681067K58398j4509r4398k25545K12910J96412O5721j47215j85849K37597
16885A984589K57551r5820J32428O7751p7568j94443J59683J90863N6082p6168
16875B404948j65890O4602J86261j74280J30645M77772m39723Q43080q16681K21758
$$ y = [882560, 1362364, 1115842, 1313994, 1355573, 1301199, 1022212, 898700, 1144332, 1096097, 1233622, 1251468, 1335815, 1025080, 1181407, 1211428, 1383197, 1270099, 1163711, 1508443, 1438292, 1486311, 1567672, 1406039, 1576440, 1445823, 1480441, 1455455, 1534237, 1440712, 1173745, 1488789, 1700257, 1249371, 1478154, 1523843, 1492313, 1834729, 1638308, 1612837, 1459763, 1629738, 1634802, 2018081, 2055004, 1900935, 1663177, 2044428, 1898060, 1818679, 1681067, 1939465, 1924956, 1830558, 1605013, 1817923, 2014335, 2080056, 1932841, 1746992, 1984589, 2242140, 2146320, 2278748, 2346499, 2268931, 2074488, 2234171, 2425034, 2481116, 2404948, 2239058, 2303660, 2489921, 2315641, 2446286, 2924058, 2484335, 3327415, 2510734, 2732492]
16865B732492J2587J02396k35807n138J45306p9396K51248K87565r2498J21189
16855C239944k22779N56577k41353Q1576k70802J14060M17997r4354J64973L5785
16845C781624K85241n27488L48900K9186N1153K0922L19605j56528k13745L11421
16835D250291J04423k4973j83895J46590j3575K78834O5202L3346J19962K35796
16825E012001M5236K50834k15373N3296J77874J21370J79013J40159K93561l4286
16815F023685j15479N24679j08114K60332J23139l943n9976K96332J25412J97247
16805G263314J10090K59823j70583P69209r5042l46751N20999M61097l575K41933
16795I010514J31925L51240L90599k81797L32962M11429M95403l84499P45476
$$ y = [2732492, 2745079, 2847475, 2611668, 2606530, 2751836, 2672440, 2923688, 3211253, 3118755, 3239944, 3017165, 3573742, 3332389, 3413965, 3143163, 3257223, 3675220, 3580866, 3745839, 3781624, 4066865, 3539377, 3888277, 3917463, 3968616, 3989538, 4309143, 4152615, 3938870, 4250291, 4354714, 4329741, 4145846, 4292436, 4278861, 4557695, 4622897, 4656243, 4776205, 5012001, 5057237, 5308071, 5092698, 5145994, 5323868, 5445238, 5624251, 5764410, 6057971, 6023685, 5908206, 6432885, 6324771, 6585103, 6708242, 6704299, 6644323, 6940655, 7066067, 7263314, 7373404, 7633227, 7462644, 8231853, 8136811, 7790060, 8311059, 8772156, 8768581, 9010514, 9142439, 9493679, 9884278, 9602481, 9935443, 10346872, 10842275, 10457776, 11203252]
16786A1203252K88895O49867J08676L84476M13153J58717K05444N41702P39667
16777A4693849J65012O61123N46516K87488J070948J80092O78984J92403O58436
16768A9134851N56495R77218L67418P71334Q24781J235548J047436P05457J356995
16759B6977533M73581J610103J322254J219085J395884J225668J639601J787446
16751C7651155J075487K391785J758025J873020K566422K392078K488908K904769
16743E5101649K632310L285421L353827L453109L492437M554631M322737M427643
16735H4623764N024769N400191N690793N761633O607501O276333O803431P639618
16727A33828033O826176P494562P435143P554295O776699O602304O155027N412742
$$ y = [11203252, 11492147, 12142014, 12250690, 12635166, 13048319, 13207036, 13412480, 13954182, 14693849, 14858861, 15519984, 16066500, 16353988, 17424936, 17605028, 18284012, 18476415, 19134851, 19691346, 20668564, 21035982, 21807316, 22632097, 23867645, 24915081, 25620538, 26977533, 27451114, 29061217, 30383471, 31602556, 32998440, 34224108, 35863709, 37651155, 38726642, 41118427, 42876452, 44749472, 47315894, 49707972, 52196880, 55101649, 57733959, 61019380, 64373207, 67826316, 71318753, 75873384, 80196121, 84623764, 89648533, 95048724, 100739517, 106501150, 113108651, 119384984, 126188415, 133828033, 140654209, 148148771, 155583914, 163138209, 169914908, 176517212, 182672239, 188084981]
16719A88084981M138626L918618K218185J068309k14123j497483k610335l740365
16711A91366413m739272n631740o247441p050450o909707p762256p365040p654856
16703A38005651p288037p183528o825709o228140o578589o027453n307751n182601
16695H7383843m920841m939870m199356m175091l921311l490318l030772l309273
16687E5397011k522041l310305k031398k419978j934508k273599k139301j801944
16679C6963937j692245j321179j429471j358897j749583r28814j394921j082148
16671B6006679r72000p62152j282798l15860j250397o33599q00136o80147p67933
16662A8541657o49930p09939m90065l35789o51960o18360l43526j06959p66501
$$ y = [188084981, 192223607, 196142225, 198360410, 199428719, 199214596, 197717113, 195106778, 191366413, 186627141, 180995401, 174747960, 167697510, 160787803, 153025547, 145660507, 138005651, 130717614, 123534086, 116708377, 110480237, 103901648, 97874195, 92566444, 87383843, 82463002, 77523132, 73323776, 69148685, 65227374, 61737056, 58706284, 55397011, 52874970, 49564665, 47533267, 45113289, 43178781, 40905182, 38765881, 36963937, 35271692, 33950513, 32521042, 31162145, 29412562, 28483748, 27088827, 26006679, 25034679, 24272527, 22989729, 22673869, 21423472, 20789873, 19989737, 19309590, 18541657, 17891727, 17181788, 16691723, 16355934, 15703974, 15085614, 14742088, 14635129, 13868628]
16653A3868628m19892n29869k78774n99697k00560n74483m5110k05042k39430
16644A0775771n70296l34844q8644l68372k11991K22705o52329K20615p22657
16635H269958j37430k59461j75371j97628j23219j86372l8262n12687n8885K95549
16625F876192n10397J63510l34379l0716j06612j42797k43680j76099k14668j3004
16615E267350J79341l78778k05875P7008K8820j72706n62209J77649n3244O1007
16605D418363j29446j16481J10704j36642o0626k49402J07564o531q3245l93334
16595C460924J84814j27540j99276k11943j704N66084m97352q613m38911K90110
16585C016593L2006J711k74600q0275o0140M13037n8646j80506q8994J12054l15761
$$ y = [13868628, 13448736, 12918867, 12640093, 12040396, 11839836, 11265353, 11220243, 11015201, 10775771, 10205475, 9870631, 9781987, 9413615, 9201624, 9424329, 8772000, 8992615, 8269958, 8132528, 7873067, 7697696, 7500068, 7376849, 7190477, 7152215, 6639528, 6580643, 6876192, 6365795, 6529305, 6194926, 6164210, 6057598, 5914801, 5671121, 5495022, 5280354, 5267350, 5446691, 5067913, 4862038, 4939046, 4967866, 4795160, 4232951, 4410600, 4357356, 4418363, 4288917, 4172436, 4283140, 4146498, 4085872, 3836470, 3944034, 3937503, 3854258, 3460924, 3645738, 3518198, 3318922, 3106979, 3105275, 3671359, 3174007, 3165394, 2726483, 3016593, 3048599, 3050310, 2775710, 2695435, 2635295, 3048332, 2989686, 2809180, 2720186, 2832240, 2516479]
16574B516479K39455r471m71856n7640M24633r5615k91069r4898M35515k19392
16564B376141k83542k3156K15J60338J54376n07544q7846J46431L4695r5009J75327
16553B050426m21525M18902l15835J23980k13096K26811q5845k07511N6005K36888
16543A869200R843l2420l84180L40792k85688Q0282o5978q2040J57882k14874
16533A392819J31079q0417j71811L85154l7305G73324R22148m70741L10712p3853
16523A461590j27061K7154J03450j12673m73626K10205N8030K01997N2368L3932
16513A435366l63492N33857n70512j45031J34546M69488j96572J01717j25570
16504A273797L5035N8487k30993M8443j41339k81711M59008k44385r9956J39425
$$ y = [2516479, 2755934, 2746463, 2274607, 2216967, 2641600, 2545985, 2254916, 2160018, 2595533, 2376141, 2092599, 2069443, 2069658, 2229996, 2384372, 1876828, 1788982, 1935413, 1970108, 1875099, 2050426, 1628901, 2047803, 1731968, 1855948, 1642852, 1869663, 1783818, 1576307, 1632312, 1869200, 1879043, 1846623, 1462443, 1803235, 1517547, 1597829, 1531851, 1449811, 1607693, 1392819, 1523898, 1443481, 1271670, 1656824, 1619519, 773324, 1695472, 1224731, 1535443, 1461590, 1334529, 1361683, 1465133, 1352460, 878834, 1089039, 1147069, 1349066, 1401434, 1435366, 1071874, 1605731, 1035219, 890188, 1024734, 1494222, 1297650, 1399367, 1273797, 1308832, 1367319, 1136326, 1184769, 1043430, 761719, 1220727, 976342, 876386, 1015811]
16494A015811p9939K52761o5408m24693O76533k83414j36962o763J8678j87521
16484G79083j70140K51288P5615j30260K38570k20843j20773K36045M0917P5933
16474A055435k47002K64422j80301m40m3794j1979j5185J04504l56125P9458J71775
16463H20768J87762k01549l22845L27888O4562k02616o8074k94868L24546k1410
16453F14164K63836q0346Q0653k42239L48289N4209m64254j35950M12271k35963
16443F14670j50187L34498l19580J50214j46620m9665K72196n9444M30368m18584
16433F57866j34378N5612J88356A81128L58543J31518k48518o7527K01836K42432
16423G99412l54286J52726j56306j74702K99940k61630N57563j37189j89991l3621
$$ y = [1015811, 935872, 1188633, 1123225, 698532, 1375065, 1091651, 954689, 947926, 966604, 779083, 608943, 860231, 935846, 805586, 1044156, 823313, 702540, 938585, 979502, 1055435, 808433, 1072855, 892554, 892114, 848320, 836341, 821156, 925660, 569535, 648993, 820768, 1008530, 806981, 484136, 812024, 876586, 673970, 605896, 311028, 635574, 614164, 878000, 797654, 878307, 636068, 984357, 1038566, 574312, 438362, 850633, 614670, 464483, 798981, 479401, 629615, 482995, 433330, 705526, 646082, 1076450, 657866, 523488, 579100, 767456, 181128, 539671, 671189, 422671, 355144, 556980, 799412, 445126, 597852, 441546, 266844, 566784, 305154, 862717, 725528, 535537, 501916]
16413E01916N4087K17613l35053m7816J80491o2707j78588L26674R6228A43439
16402C22024J66026k07610J45532k1928A42251J33175J61648n7378O5552j04474
16392C40774p1182J51180j58617m5048l5817B9191K97907j4022L19641P9527C42940
16380D29409J03795k06872L17028C05131J31514m4671r5232J55709j09286L29102
16370F72267C08513j15608M49260l5808A69589L01478E7714L20595k5045b21720
16359C78697J07862j74233p0788c623D99180k13828j4807k1228J50248A42383
16348G21256A16952J46970J4060J0060P9782a10804B80282n9946K37884f7180
16337A55691P1054L1425n0885F0305L11992j33329r8817J37919A16159J57594
$$ y = [501916, 556003, 773616, 438563, 390747, 571238, 508531, 329943, 656617, 752845, 143439, 322024, 488050, 280440, 425972, 404044, 142251, 275426, 437074, 379696, 445248, 340774, 269592, 420772, 262155, 217107, 181290, 29191, 327098, 313076, 632717, 712244, 342940, 429409, 533204, 326332, 643360, 305131, 436645, 391974, 296742, 452451, 343165, 672267, 308513, 192905, 642165, 606357, 169589, 471067, 57714, 378309, 353264, -221720, 378697, 486559, 312326, 241538, -3623, 499180, 285352, 270545, 249317, 399565, 142383, 721256, 116952, 263922, 277982, 288042, 367824, -110804, 280282, 220336, 458220, -67180, 155691, 226745, 258170, 207285, 60305, 372297, 238968, 140151, 278070, 116159, 273753]
16327B73753K01535j58156I8338K39036f897j10210B29762p4708F9569a08058
16316A07621a4238m6851C26229K8613n1472j01586O9460N8685J17895j63487j24143
16305A60194a9844l6165D52245A26649L28303C3045L07368j47466M80025c8584
16294C01693k4314M1350j0253q6161B409J13580l2387J30480K8936F7249K75762
16283C43011b8249I744J62642m0448M6561b14565D06805A44456E2066J96561a64048
16271A27133l3901J76690A24936j7054a63654J9391C13441n5702o6980b98427
16260C9637d4254a8562C0077a7098E7011O0990Q810o0261i8856C989b11806C61284
16247c95393A66031J65689j2446q5772L60315k88394I2832J46863I6117a91117
$$ y = [273753, 475288, 317132, 98338, 337374, -6897, -117107, 229762, 155054, 69569, -108058, 107621, -14238, -61089, 326229, 354842, 303370, 201784, 271244, 329929, 447824, 284337, 160194, -19844, -56009, 452245, 126649, 454952, 33045, 340413, 192947, 672972, -38584, 301693, 277379, 318729, 308476, 222315, 2409, 115989, 83602, 214082, 243018, 67249, 343011, -28249, 9744, 172386, 131938, 178499, -214565, 406805, 144456, 52066, 248627, -164048, 127133, 93232, 269922, 124936, 107882, -163654, -144263, 313441, 257739, 190759, -298427, 39637, -44254, -18562, 30077, -17098, 57011, 118001, 126811, 66550, -98856, 3989, -211806, 361284, -395393, 166031, 331720, 319274, 233502, 593817, 305423, 92832, 239695, 96117, -191117]
16236B03140o2233F3196K42602q2664H9352b29007A73749J5057k0743a40773B63430
16224F76075B10891e2930B45193a33856G3417P6141K71589c3928B38277A8368
16213d20732A28732K13777j57462j8991J0067b03288C93818E969e5746M131A43690
16201F6593d8202j4936j6594I5164a27244B98854i9877B8012b77936F1268e975
16189b45090J12856A48409J283k0269N0446J3298L5933c03822A42548R9949E2661
16177E10K02745N285q4186b01311Q9933d0991B73893j516A25530a5099H6388c1710
16164f1753D60916B22949g5637B73164m5734a17670B00978b3926H6396b072A23359
16152B57729A11808d6705G0199O3443m3417K23587D766J98254P4705r5764b69639
$$ y = [203140, 140907, 63196, 305798, 223134, 89352, -229007, 173749, 188806, 168063, -140773, 263430, 676075, 210891, -52930, 245193, -133856, 73417, 149558, 421147, -33928, 238277, 18368, -420732, 128732, 342509, 185047, 166056, 176123, -203288, 393818, 5969, -55746, -51615, 143690, 66593, -48202, -63138, -79732, 95164, -127244, 298854, -99877, 28012, -277936, 61268, -5975, -245090, -132234, 148409, 149692, 129423, 179869, 193167, 229100, -303822, 142548, 242497, 52661, 510, 203255, 208540, 124354, -201311, -111378, -40991, 273893, 272377, 125530, -15099, 86388, -31710, -61753, 460916, 222949, -75637, 273164, 227430, -117670, 200978, -23926, 86396, -2072, 123359, 257729, 111808, -46705, 70199, 133642, 90225, 313812, 4766, 203020, 277725, 181961, -269639]
16140A40159J23912Q3491A25698C7170K3252K02121l2543c0336m8398A6561c05133
16128C48058I3981d079I9095a15885M7820l2494A95143b68926D5442L04034G5267
16116a11515c0542B7309g2974B89420c08771C63540c151n2165F9222g0215B03388
16104B37988d5634j18831A84587b3270C09053e25n3318K1927n6442k456A06581
16092H7520b14317A23394c39092B31650F1040d3785J0115C43906a66244A53754
16081C75285A10634a50028a3335F1320N3648J50952a62854A20224b4463E5724
16070A96758A6797o644K74134a00001C2403f1322B09212F2235J31102r1154c426
16058A9142J85762C2875K50942a26049B41851b3492F2312d07925B72408a14237
$$ y = [140159, 264071, 347562, 125698, 37170, 60422, 262543, 230000, -30336, -78734, 16561, -305133, 348058, 93981, -4079, 99095, -115885, -68065, -100559, 195143, -268926, 45442, 349476, 75267, -111515, -30542, 27309, -72974, 289420, -308771, 363540, -3151, -55316, 69222, -70215, 203388, 237988, -45634, -164465, 184587, -23270, 309053, -525, -53843, -31916, -88358, -90814, 106581, 87520, -214317, 123394, -339092, 231650, 61040, -43785, -33670, 343906, -166244, 153754, 375285, 110634, -150028, -13335, 61320, 114968, 265920, -162854, 120224, -24463, 55724, 196758, 16797, 10153, 284287, -100001, 32403, -61322, 209212, 62235, 193337, 102183, -3426, 19142, 204904, 32875, 283817, -126049, 241851, -23492, 62312, -407925, 272408, -114237]
16047c43702G182d611G1235a9008k85893A76445b9821j42739M2813C21111a4339
16035D9410N5081j8610a03720A28318D8787L7236b04709A28209L8111h0489p1034
16024a51523C561P4112m669a39776H5846f5415H6015l8074J606d2239A18156c8490
16011a86703a4543B5031c93315J81851g5681B2316E375b03840F168J06322b84075
15999b42239C1007a1442A05044h3369n3141G3271K37967f7896o8622B73054a27210
15987a36384D126a48876B6657J66744J29743m4886K35521b53253C4799M0221F087
15975I6140J11746a19400o3464d9208k46119a00232Q610A54893D5744j5489B00
15963a08664b5021o6363L5052j07869l87935C4678c07123F32b30391e5432I0827
$$ y = [-343702, 7182, -4611, 71235, -19008, -304901, 176445, -29821, -172560, -129747, 321111, -14339, 49410, 104491, 85881, -103720, 128318, 48787, 86023, -204709, 128209, 166320, -80489, -151523, 3561, 77673, 73004, -139776, 85846, -65415, 86015, 47941, 49547, -42239, 118156, -38490, -186703, -14543, 25031, -393315, -211464, -75681, 22316, 5375, -203840, 6168, 112490, -284075, -242239, 31007, -11442, 105044, -83369, -136510, 73271, 311238, -67896, -136518, 273054, -127210, -136384, 4126, -148876, 26657, 193401, 323144, 278258, 513779, -253253, 34799, 75020, 6087, 96140, 207886, -119400, -182864, -49208, -295327, -100232, -91622, 154893, 45744, 30255, 200, -108664, -25021, -91384, -56332, -164201, -552136, 34678, -307123, 632, -230391, -55432, 90827]
15951f069k14785L3091B11155a78800A68679H3863A9293J89512g4556b9095B05959
15939A38978b12279l550B2296J71348m4268c16156A50367a43307l300d7150p0745
15928a17895B763K4852M5198g9437m4402e5195j61238e8020G2974K50221a98159
15916a30086j36253J19261A31002i6857I6702d7578G8093K05259b18239A89625
15905b10785k3434A12136g8276p935q432H8982m2094a12564K8298K5994o8173
15894a26445A92701a75643C881c66721J09176G9432J9643A265a33195I6433m5170
15883E1263B361a35808q7463R6013C8670e3752A99955o2109E2330a51365a7234
15871B35730e9994O300p8132C4484a04037B29372g7916G6823e04127a3266A46214
$$ y = [-6069, -220854, -187763, 211155, -178800, 168679, 83863, 19293, 208805, -74556, -29095, 205959, 138978, -212279, -215829, 22296, 193644, 149376, -316156, 150367, -143307, -146607, -47150, -117895, 2763, 27615, 72813, -79437, -123839, -55195, -216433, -58020, 72974, 323195, -198159, -130086, -266339, -147078, 131002, -96857, 96702, -47578, 78093, 283352, -218239, 189625, -210785, -234219, 112136, -78276, -86211, -94643, 88982, 46888, -112564, -84266, -58272, -126445, 192701, -175643, 3881, -366721, -257545, 79432, 99075, 1265, -133195, 96433, 51263, 2361, -135808, -223271, -127258, 38670, -53752, 199955, 137846, 52330, -151365, -17234, 235730, -59994, -53694, -131826, 34484, -104037, 229372, -77916, 76823, -504127, -13266, 146214]
15859e4360D1034r107J90284i8907A09806a6753Lj11520n3145O3580H7297c607
15846A6946b38529R6630h312j48989A58637G622K57921h0908A38716E3799K8404
15835H2203h5416A20739b20572c572A318J17733K6240o8898a10078B1881J83789
15824B05670a13881M4633m3979m5244j982m7980O0249k51151g1467I0359i7657
15812F3298d9868k41501c7244j94146F5631b84704a32186d1353k48528A32032
15801A32568g7204A94576b56398C15165j31288a26787A21546l0746K26076g9159
15790a07708b2048j83535F830b34240A97283a01140A14447b70948J21266E328
15779A08117a79684b6436F541b42889e4763k67450B30203b17251h5194j65535
$$ y = [-54360, 41034, 31927, 222211, -98907, 109806, -16753, -16750, -128270, -181415, -117835, 87297, -3607, 16946, -238529, -141899, -8312, -157301, 158637, 7622, 265543, -80908, 138716, 53799, 82203, -85416, 120739, -220572, -3572, 1318, 119051, 145291, 76393, -110078, 21881, 205670, -113881, -69248, -113227, -158471, -160453, -208433, -148184, -399335, -71467, 90359, -97657, 63298, -49868, -291369, -37244, -231390, 65631, -284704, -132186, -41353, -289881, 132032, 132568, -77204, 194576, -256398, 315165, 183877, -126787, 121546, 90800, 316876, -79159, -107708, -22048, -205583, 6830, -234240, 197283, -101140, 114447, -270948, -149682, 5328, 108117, -179684, -26436, 6541, -242889, -54763, -322213, 230203, -217251, -85194, -250729]
15769b50729C26845c4893E2498K659e1379l14571g3720j40277C36225j28080F7797
15757A41999m0413a09370j3601A60274b15498A6123b390E346L21539H2547d2999
15745b9604o9961m097k2888A31980b66057C20210J65140a62844j28124O5478O7530
15734a57960P2864L9004j04682F6553N6146D1833e7410k72714I5570a80145m4354
15723b24499O8034G2381J92619a41484m631A48952c38163l1636G7906P5210j5867
15712A37249a17739j0962p5604o355i2212K8076k84233C06564g675I5452h400
15700b79212d7080A06018O7519C4002J23195M5075D4933K15654a70447E3088c6880
15688b31446A60212K61265A61968N9989h6683j82600P992h3830E1207c58691C62382
$$ y = [-250729, 326845, -34893, 52498, 55157, -51379, -365950, -73720, -213997, 336225, 208145, 67797, 141999, 101586, -109370, -122971, 160274, -215498, 16123, -2390, 5346, 326885, 82547, -42999, -29604, -99565, -103662, -126550, 131980, -266057, 320210, 485350, -162844, -290968, -225490, -157960, -85096, -46092, -150774, 66553, 122699, 41833, -57410, -330124, 95570, -180145, -224499, -156465, 72381, 265000, -141484, -146115, 148952, -338163, -369799, 77906, 153116, 137249, -117739, -128701, -204305, -210660, -92212, -64136, -348369, 306564, -7675, 95452, -8400, -279212, -47080, 106018, 173537, 34002, 157197, 202272, 44933, 260587, -170447, 53088, -36880, -231446, 160212, 421477, 161968, 221957, -86683, -269283, -261291, -83830, 51207, -358691, 362382]
15676i4007a5442j32636M5195A34572l6393d4270H5216g4377F8777a7877B3231
15664C81063e9355k07600a7307A90415c10874a05075l3142A27302k7561E618J71229
15653A76847b31085B1219c04317B23296h7791C5596J44622c50991c87B66414g127
15641B3734j0125P1036J19351q3033a33151M4587I0526i5964b0503h990B16907
15629c39783Q6861I0763C0813c51849Q5264P1836i4590A12703J57290A14502m9822
15618F4680b20901G4245P2465b75627B92687d45742H4383a72095e7695B05714
15607C4908L0886c05495B4229a6138A18905c4874B25114l4370j0939c34647J44368
15596a90279m7639G92g4545o5107K6762B60836K5847e5355F005a98336A49972
$$ y = [-94007, -15442, -148078, -102883, 134572, 98179, -44270, 85216, -74377, 68777, -17877, 23231, 381063, -59355, -266955, -17307, 190415, -310874, -105075, -138217, 127302, 99741, 5618, 176847, -231085, 21219, -304317, 223296, -87791, 35596, 180218, -350991, -387, 266414, -7127, 23734, 13609, 84645, 203996, 120963, -133151, -88564, 90526, -95964, -20503, -8990, 216907, -339783, -252922, 90763, 30813, -351849, -266585, -194749, -94590, 112703, 269993, 114502, 64680, -220901, 74245, 146710, -275627, 292687, -445742, 84383, -172095, -57695, 205714, 34908, 65794, -305495, 24229, -16138, 118905, -34874, 225114, 190744, 179805, -334647, -190279, -237918, 792, -74545, -139652, -112890, 260836, 286683, -55355, 6005, -198336, 149972]
15584c2437g093G2431k6814j0329K68487a82369c5076B2496d7474a5719C01867
15572b97720A12953i302A90281a03172j75990d666k6384j0546a1418r2754B29143
15560A66541a17234A84349a51760c0312j70988o064c9617k1648D6426i5340j03731
15549a99071B42251b50354q093l5281Q6702J2464P7662A31750a25437I1575l4532
15538E7043j9457L20036A39920b85296B63351H2793N9288A4082J27987G871K16717
15527B24588D8568a44222A05587j4054M7530b24300K5629C5268j7374O5729J72931
15516B56554A5044J27394e1008a3560B70320b07846a6884j3391B1637c691E3393
15504f6699G6043b06387J03026j32862R7096F4252a0592H1687a4555A50636a14444
$$ y = [-32437, -7093, 72431, 45617, 35288, 303775, -182369, -35076, 22496, -47474, -15719, 301867, -297720, 112953, -9302, 190281, -103172, -279162, -4666, -31050, -41596, -11418, -104172, 229143, 166541, -117234, 184349, -151760, -30312, -201300, -207364, -39617, -61265, 46426, -95340, -199071, 242251, -250354, -258447, -293728, -207026, -194562, -116900, 131750, -125437, 91575, 57043, 37586, 357622, 139920, -285296, 263351, 82793, 142081, 14082, 142069, 7871, 224588, 48568, -144222, 105587, 91533, 139063, -224300, -198671, 35268, 17894, 83623, 256554, 15044, 142438, -51008, -13560, 270320, -207846, -16884, -30275, 21637, -3691, 53393, -66699, 76043, -206387, -103361, -236223, -139127, 64252, -10592, 81687, -14555, 150636, -114444]
15492H6443B5218b5330A8522P0442j3659J34731C9078A0815a38231o0864F8853
15480B48092j21728g5073A31976a6594j28661k0168B33431a90329A74760c05877
15469A58982b80467B95212j09045c38706N6617p510A70275D943i6751D22912A37376
15457b62756H0604O362k1535J46463n1918I51a95265E3466g7802E4349d405p1815
15445g6220j2740A4764P5766O219g9927C77654c074A01518a24673C20402a5639
15433b01024O3237D7632b36477A04705J33932j10602f2740K0289B32813i0876
15422a72455A91768l114o5563c31437B38266a72173J7539A62475b00724M0796
15412a59928K9756e3764A05516p596a83275M9626B14616b73806B1845r934L03843
$$ y = [86443, 25218, -25330, 18522, 88964, 75305, 210036, 39078, 10815, -138231, -199095, 68853, 248092, 126364, -75073, 131976, -16594, -145255, -165423, 233431, -190329, 174760, -305877, 158982, -280467, 295212, 186167, -338706, -282089, -289599, 170275, 4943, -96751, 422912, 137376, -262756, 80604, 86966, 65431, 211894, 159976, 951, -195265, 53466, -77802, 54349, -4405, -76220, -88960, 14764, 90530, 96749, -79927, 377654, -3074, 101518, -124673, 320402, -15639, -201024, -137787, 47632, -236477, 104705, 238637, 128035, -62740, -42451, 232813, -90876, -172455, 191768, 188654, 123091, -331437, 238266, -172173, -154634, 162475, -200724, -159928, -130172, -53764, 105516, 97920, -183275, -133649, 214616, -273806, 21845, 11911, 315754]
15401C15754i0627G7618a93281d679G619d8749G090P4271d8155B38609a44360
15389c1741A3511a9726B6754b29711A14023a42179a6906F1945b34040f7571k1187
15378h8758L8678j21995h0593G2821c31475J12997f3584A07992f0013l4783Q209
15367h6587L6785A92901N7247E7155b38894R0949H8893d1576D93517a6120C0515
15355C45284F1784h0995r0568M1087M6906j67066e3658k05707A42107J3650G5024
15343f2021m5911A32126M745N3935a877F6665b6628k20222A57876d2894B38764
15331e6915j58707h167j2614A57773b18336A48393N1419a86527E6126K13081J8025
15320B87232H0425j9682a46615C48303j43494a94628A40780a01920p5622A68461
$$ y = [315754, -90627, 77618, -193281, -4679, 7619, -48749, 7090, 81361, -48155, 238609, -144360, -31741, 13511, -19726, 26754, -229711, 114023, -142179, -16906, 61945, -234040, -67571, -88758, -50080, -172075, -80593, 72821, -331475, -218478, -63584, 107992, -60013, -94796, -86587, -49802, 192901, 250148, 57155, -238894, -147945, 88893, -41576, 493517, -16120, 30515, 345284, 61784, -80995, -171563, -130476, -83570, -250636, -53658, -259365, 142107, 155757, 75024, -62021, -107932, 132126, 136871, 190806, -1877, 66665, -26628, -246850, 157876, -42894, 238764, -56915, -215622, -8167, -20781, 157773, -218336, 148393, 199812, -186527, 56126, 269207, 287232, 80425, 60743, -146615, 348303, 204809, -194628, 140780, -101920, -177542, 168461]
15309F2899B2165b9562A69111g6028n7693A83058J40888j48758c2619A01577B2458
15297G2181N476M0988l3377a24429A09476d3239j16883A13966C1224a94468B44615
15285i5335j2951r3265A25381i1328L2066A5012J47451M076F6079P8174M4949
15274A89202B8540J22022k141N8450r3153g148A53327K02189d7024C15206H2244
15262A76347J32725j0853Q5833j9342a23686e8890A07157L27595j94223H0523
15251B78596j2038r2561L70300J052313M0018n1340k8181n94382C83139A82564
15240B99869K29347a08721C18668b63006Q5527A54907A2948L0490J49658b35995
15229B08568F4779a8864A31276H718K54046k0612a32925B33911I4588Q1530G8468
$$ y = [62899, 22165, -29562, 169111, -76028, -133721, 183058, 323946, 175188, -32619, 101577, 22458, 72181, 77657, 118645, 85268, -124429, 109476, -43239, -160122, 113966, 31224, -194468, 244615, -95335, -108286, -201551, 125381, -91328, -59262, 15012, 162463, 166539, 66079, 144253, 189202, 28540, 150562, 148421, 206871, 113718, -7148, 153327, 355516, -47024, 315206, 82244, 176347, 309072, 298219, 384052, 364710, -123686, -58890, 107157, 434752, 240529, 80523, 278596, 266558, 173997, 544297, 1596610, 1636628, 1585288, 1557107, 962725, 383139, 182564, 299869, 529216, -108721, 318668, -263006, -177479, 154907, 12948, 43438, 193096, -235995, 208568, 64779, -18864, 131276, 8718, 262764, 242152, -132925, 233911, 94588, 176118, 78468]
15217e5416B76010L6296q1149n5810p6155J48209R6660j40460e742m6705m1059
15206i3506N607D1406A3550J26161b51413B71245G8755N9348N3927D5199d945
15194A87106M9696P1039j24362J03791j38844m7529J98030a76656l6912B48587
15183C51187b43579A6239O093N5729j7866a1774C77495a06244A65312L1565A3466
15171D8573J37169K34488A28614R5504E3654L5045R5011L9200J89394A51504a8426
15159A38964R5463o3679G9429j4212d03573N7899E0079J65518c270k40071B00060
15147A8099b0676q653A58819b6516j49203m9384B56430d750j01279H6203K98468
15136C84671a51176j4578B20049b69296E5543L24914A66662a969A29878f1259
$$ y = [-55416, 276010, 312306, 231157, 175347, 99192, 247401, 344061, 203601, -5742, -52447, -93506, -87899, 41406, 13550, 139711, -251413, 271245, 78755, 138103, 192030, 45199, -4945, 187106, 236802, 307841, 183479, 287270, 148426, 100897, 298927, -176656, -213568, 248587, 351187, -243579, 16239, 22332, 78061, 60195, -11774, 377495, -106244, 165312, 196877, 13466, 48573, 185742, 420230, 128614, 224118, 53654, 88699, 183710, 222910, 412304, 151504, -18426, 138964, 234427, 170748, 79429, 65217, -403573, -345674, 50079, 215597, -3270, -243341, 200060, 18099, -20676, -29329, 158819, -26516, -175719, -225103, 256430, -4750, -106029, 86203, 384671, -151176, -165754, 220049, -269296, 55543, 380457, 166662, -1969, 129878, -61259]
15125d0852C02249r7515n6492n9667M08999E3779A1428J62580o9405J3734P5831
15114A94168I6911N4420J68645A1645M19023j54104a00800C56869A354e28770
15103A09069j6814K16907A14874M99429B32123p6685b23453A69552C7564K41982
15093B79546r6900M2234g8577B9476K64114A20693K52998L9977K2699A88786L3307
15082B22093I4116J26783j8259r6110M5800M08929j51945A37254I239Q3747L6747
15071A29733P1821J45920A6092J62580J58736o6682D5520K865M36402j79525n6236
15060B49026o9224a14687A32129K73755A99839n4952K22910C5692L08370A07201
15049C75026p2580a37406A30108J41147L0560J15075j87771R3005L2544J2003
$$ y = [-40852, 302249, 204734, 148242, 88575, 497574, 53779, 11428, 174008, 104603, 118337, 194168, 96911, 151331, 319976, 11645, 430668, 276564, -100800, 356869, 1354, -528770, 109069, 92255, 309162, 114874, 614303, 232123, 155438, -223453, 169552, 37564, 279546, 182646, 224880, -78577, 29476, 293590, 120693, 373691, 413668, 436367, 188786, 222093, 94116, 220899, 202640, 106530, 152330, 561259, 409314, 137254, 9239, 92986, 129733, 201554, 347474, 16092, 178672, 337408, 270726, 45520, 48385, 484787, 305262, 249026, 179802, -114687, 132129, 405884, 199839, 144887, 367797, 35692, 344062, 107201, 375026, 302446, -137406, 130108, 271255, 301815, 416890, 229119, 322124, 354668, 366671]
15039C66671j34486j9334A9884K59720o4821O6835c9113A90044P4971A18126R7557
15028B15683D4763M9116L73539a54699B53145k767I2317a1454E00640n9952J85118
15017F25806e142l8029G0543f2091A18988j6042J22666j3213h981C93599A66067
15005D6903i0573a3217A28671L6785L88943B66542I7449M6383E8004K62008Q1675
14994D01687D2957J10264L64568B08626R0874A250J46234L8779K23817A18883
14983A31621k3509K33188K97821G8076C8107K41517E4301P3559K8102J45416m0653
14972B60725J20076g4073B58223J9027M0648P03B9868M53130k14937j00715J21608
14961B88954K0738D0501e2119C18002a234A43567K70820k9190b27207A51782K89967
$$ y = [366671, 232185, 212851, 19884, 279604, 214783, 281618, -39113, 190044, 265015, 118126, 215683, 44763, 93879, 467418, -154699, 253145, 250378, 92317, -11454, 500640, 440688, 625806, -5142, -43171, 70543, -62091, 118988, 102946, 225612, 212399, -8981, 393599, 166067, 46903, -90573, -13217, 128671, 165456, 554399, 266542, 97449, 143832, 58004, 320012, 401687, 42957, 153221, 517789, 208626, 299500, 1250, 147484, 186263, 410080, 118883, 131621, 108112, 341300, 639121, 78076, 38107, 279624, 54301, 127860, 155962, 301378, 260725, 380801, -74073, 258223, 277250, 317898, 318601, 29868, 482998, 268061, 167346, 288954, 309692, 40501, -52119, 318002, -1234, 143567, 414387, 385197, -227207, 151782, 441749]
14950D41749a3390C10625j2646q9656l9811l3587J81870K51270j33501j32899
14940C01665J4070P3797A44292n4480K6648J34994P8049J60306j52036l7266N8750
14929C59257j09582r4295N57L14221a05048D02651j84104L84948k97370H5155
14918E69227e2564F33153q2078k997A38397n0685J59926J76633j30575A32048
14907F13424l809r4125P8329M4044j83654k03733q1665J79565A73093q2329L08721
14896C99485j63113L73477k65841L39654j39596B20323M43020n3726B73241K86391
14886E59632k41512N1212j00347K10374j84143Q6678j56079J58668r8254J62567
14876D48796j29036M958j46408o6213L36653K28467j21684Q1962j50083j46211
$$ y = [441749, -13390, 310625, 297979, 208323, 168512, 134925, 316795, 568065, 434564, 301665, 315735, 389532, 144292, 89812, 116460, 251454, 329503, 489809, 337773, 300507, 359257, 249675, 155380, 155937, 470158, -105048, 402651, 218547, 603495, 306125, 85155, 569227, -52564, 633153, 551075, 548078, 138397, 87712, 247638, 424271, 293696, 132048, 613424, 609615, 515490, 593819, 637863, 454209, 250476, 168811, 348376, 173093, 90764, 399485, 236372, 609849, 344008, 683662, 544066, 220323, 663343, 609617, 273241, 559632, 318120, 369332, 268985, 479359, 295216, 381894, 225815, 384483, 286229, 448796, 319760, 324718, 178310, 112097, 448750, 677217, 555533, 637495, 487412, 341201]
14866C41201L1075M6140M9176j78101B1826K95884j36113K79744A96637J05644
14856C02281L25366k10759N9596j24238o2056K58482K5412j91766J04146j03357
14846C83107K08819B02477K68427J84103j39502m3577k09607K62416m1241M65831
14836I49327m49562j80148L10990j53928J63843C19808A27597K80841M71507B99791
14825E30147K42932k54128k1515J12676n3866j56572A82002M77142J3866k54945
14815D18065K17110p7048K75706C94075M56302j81728E8066N70210R1646M6339
14805G66261j69124J20232j89640J44794K64123C48153M5044Q4366J0885J03860
14795E92308K3622N5462R9118C03403J69691L08793m4965J56949l85076K689B07278
$$ y = [341201, 372276, 418416, 467592, 289491, 21826, 317710, 181597, 461341, 196637, 302281, 627647, 416888, 476484, 352246, 290190, 548672, 574084, 382318, 486464, 383107, 591926, 202477, 470904, 655007, 515505, 471928, 262321, 524737, 483496, 949327, 499765, 319617, 630607, 476679, 640522, 319808, 127597, 408438, 879945, 299791, 530147, 773079, 518951, 497436, 610112, 556246, 399674, 182002, 659144, 673010, 418065, 635175, 558127, 833833, 394075, 850377, 668649, 58066, 628276, 719922, 766261, 597137, 717369, 527729, 672523, 936646, 348153, 393197, 477563, 488448, 592308, 615930, 671392, 770510, 303403, 473094, 781887, 736922, 893871, 508795, 511484, 207278]
14783A142229m22465k52924j16843L20411j78183L56003B55937M22809j34163
14774E44583J2001N9509j8235J97272j59919L24273j74486R9839j53806j21080
14764F09951N09950E45358K73265j33109o0342j79339J89008J49189B48997M20339
14754F69336p8808k91723L60563J1935L410N7958k95023K23982k99310K79067
14744F41387J24732j23762l7283L8175L74721j92827N2519J59908m77212k159
14734E58199k0048M13490j30763J6595j87942J45157l2131o1759p3601K04268
14724H31465L61j48624K63851j00496q4952K40058J80082k03725j13241K19195
14714A083974k46257L39032k77854j79517j98090L24472N5577o3425J53766O0565
$$ y = [1142229, 719764, 466840, 349997, 670408, 492225, 848228, 255937, 678746, 544583, 556584, 616093, 597858, 795130, 635211, 959484, 784998, 884837, 731031, 609951, 1119901, 545358, 818623, 685514, 625172, 445833, 634841, 784030, 248997, 669336, 590528, 298805, 659368, 671303, 674713, 732671, 437648, 661630, 362320, 641387, 766119, 642357, 605074, 643249, 1017970, 825143, 877662, 1037570, 560358, 558199, 538151, 951641, 820878, 837473, 649531, 794688, 762557, 700798, 627197, 831465, 831826, 683202, 947053, 846557, 761605, 1001663, 1181745, 978020, 864779, 1083974, 837717, 1176749, 898895, 719378, 521288, 845760, 901337, 837912, 991678, 1052243]
14704A052243l93652L5599J44756N7896L63449k74631L1979j78930Q841N56310
14694A403860m91923k73897J58881q43J42251M05164m44815L15976l11663L9411
14684I42402K33654j73701k29509J23100M62667l69022K307L35131l45915K18666
14674A199780j69697K4030k8272k6012J49082q0899J72062m5461M5843o4990k20598
14663I54868N90206m58951J85095j19230j81175p2634M31286o9383m52015P54240
14653A562307l82293j44443K59806k99209J27081Q3590j11225Q8516O8422J70477
14643A423029K28065m67524K34379J33379J32305l59191L03961j57101k61299
14634A210003J64924J10247n7013L7662q3509j46811P9108Q6198j90238L46359
$$ y = [1052243, 658591, 694190, 838946, 896842, 1260291, 985660, 1017639, 838709, 847550, 1403860, 911937, 638040, 796921, 796078, 938329, 1343493, 898678, 1214654, 902991, 942402, 1176056, 1002355, 772846, 895946, 1358613, 989591, 991898, 1327029, 981114, 1199780, 1030083, 1054113, 1025841, 999829, 1148911, 1068012, 1240074, 1194613, 1240456, 1175466, 954868, 1545074, 1086123, 1271218, 1151988, 970813, 898179, 1329465, 1260082, 808067, 1562307, 1180014, 1035571, 1295377, 996168, 1123249, 1206839, 1095614, 1184130, 1252552, 1423029, 1651094, 1183570, 1417949, 1551328, 1683633, 1324442, 1628403, 1471302, 1210003, 1374927, 1485174, 1428161, 1465823, 1382314, 1235503, 1314611, 1400809, 1210571, 1556930]
14624A556930j33951J07992j90467L189J63085L0178j70465j96925M87091l45607
14614A311050M88092j86336l19387J62239j36246L61407j52877J96255k33979
14605A490218n9443M56851l81736j264K83813r0634L55770j57319p9837k06956
14595A609463J48633J81876k80868K81469M35634l90728j25900K5102L80957k78822
14585A986816j07999K2909N26653m60616L02520m25168J57006p610P8535J96610
14575B269656m32438L51509q2876J3649K38592J72543j39893K64763m11065J36497
14565B380937O9674J42924R6862j51907N6372O77826l78210R002L91754j45240
14555C149994M38965l537M47766K39344N05909J078507J528906M094309R238243
$$ y = [1556930, 1422979, 1530971, 1340504, 1343693, 1506778, 1536956, 1366491, 1169566, 1656657, 1311050, 1799142, 1612806, 1293419, 1455658, 1319412, 1680819, 1527942, 1724197, 1490218, 1430775, 1887626, 1505890, 1504626, 1788439, 1697805, 2053575, 1896256, 1816419, 1609463, 1758096, 1939972, 1659104, 1940573, 2376207, 1985479, 1859579, 1884681, 2265638, 1986816, 1878817, 1901726, 2428379, 1967763, 2270283, 1845115, 2002121, 1994511, 2073046, 2269656, 1837218, 2188727, 2105851, 2119500, 2358092, 2530635, 2390742, 2655505, 2244440, 2380937, 2450611, 2593535, 2690397, 2538490, 2594862, 3272688, 2894478, 2903480, 3295234, 3149994, 3588959, 3585422, 4033188, 4272532, 4778441, 5856948, 7385854, 11480163, 20718406]
14546B0718406J5173564Q840904j4602810A4183671F972890k730524j219775n41231
14538B481360n03282N41885l85299m0820l8803L94926k20119K14635o8208k50388
14528B125887K03396O6141J6759j37528O08741k67543M293r3826K16105j00095
14518B642330J09096J26628r4425l37041Q33868k43026l86621N82929M4797k03882
14508C074653l18432J92697J31401J98858k16796N23485l94177K04719p0317K55386
14498C581477l99287J78787K63861l88184L12128L64115n00179J70484J24461
14489C707663n3715J79223P2753m2596j30537M98946l38122j48445N56769n8004
14479D243935k3803J4356L1524q4430N52681m09086N4114J67480j28855K93721
$$ y = [20718406, 35891970, 44732874, 30130064, 14183671, 6972890, 4242366, 3022591, 2481360, 1978078, 2519963, 2134664, 2093844, 2055041, 2449967, 2229848, 2444483, 2376275, 2125887, 2329283, 2395424, 2412183, 2274655, 2883396, 2615853, 2620146, 2526320, 2742425, 2642330, 2751426, 2878054, 2783629, 2446588, 3280456, 3037430, 2650809, 3233738, 3278535, 3074653, 2756221, 2948918, 3080319, 3279177, 3062381, 3585866, 3191689, 3396408, 3326091, 3581477, 3182190, 3360977, 3624838, 3236654, 3548782, 3912897, 3412718, 3583202, 3707663, 3653948, 3833171, 3905924, 3863328, 3732791, 4231737, 3893615, 3745170, 4301939, 4243935, 4220132, 4234488, 4266012, 4181582, 4734263, 4325177, 4379291, 4546771, 4417916, 4711637]
14469D711637J21683M245L4470R9802N9230Q4786j40187J58110o1447J37289M10121
14458E619739j08807m04278K43539R0104M81132l14633M72742m37450K53639K06446
14448F102173k39227o5118L63415J9150K11575Q1889j22018k0429J49904j19228
14438F362086L23352K08564M4486k6228J53769j82321J62114j5654K75563L90727
14428G696458m87687M31226M03735m82950L81716L22034j59957M38365k30206
14419H312734K22110L57499K40494J6559L1697P762Q7524J70300L41974J93954
14409I982607r4465K76048o8323K65725L26179L9897L31345J42757K84067k88386
14399A1197451O65074J17876K62770n8405N37998k05126O21852J38729K50403
$$ y = [4711637, 4833320, 4837565, 4872035, 4971837, 5031067, 5115853, 4975666, 5133776, 5072329, 5209618, 5619739, 5510932, 5106654, 5350193, 5440297, 5921429, 5606796, 6079538, 5642088, 5895727, 6102173, 5862946, 5797828, 6161243, 6180393, 6391968, 6473857, 6351839, 6331410, 6481314, 6362086, 6685438, 6894002, 6938488, 6912260, 7066029, 6883708, 7045822, 7030168, 7305731, 7696458, 7208771, 7639997, 8043732, 7560782, 7942498, 8264532, 8104575, 8542940, 8312734, 8534844, 8892343, 9132837, 9149396, 9181093, 9188855, 9276379, 9446679, 9788653, 9982607, 9888142, 10164190, 10095867, 10361592, 10687771, 10727668, 11059013, 11201770, 11485837, 11197451, 11862525, 11980401, 12243171, 12184766, 12722764, 12517638, 13139490, 13278219, 13528622]
14390A3528622R251j73474K82336O39437J4172Q9752O28958L48337N4100N30668
14380A5952159J48373J44760L27144R6889M80684N78778L05460J51314J99876
14371A8385437N82834N26938K36488K28587P02579M38717N10685L43006M22014
14362B2377285M14368k6092M85400R03942N64460M48308P52429O47803K14328
14353B6782231Q46074P65999M67097R11335Q35654P62871M61028Q82902J263704
14344C3978895M60057R70415Q21635J085828J264479J291629Q78361J109618J667848
14335D3528765P67099J044424J389250J759145J442505J199090J868615J965079
14327E4963972J488255J814115J769201K165949K105834K227815K660998K456946
$$ y = [13528622, 13537873, 13364399, 13646735, 14286172, 14300344, 14390096, 15019054, 15367391, 15421491, 15952159, 16100532, 16245292, 16572436, 16669325, 17150009, 17728787, 18034247, 18185561, 18385437, 18968271, 19495209, 19731697, 19960284, 20662863, 21101580, 21612265, 21955271, 22377285, 22791653, 22765561, 23250961, 24154903, 24719363, 25167671, 25920100, 26567903, 26782231, 27628305, 28394304, 28861401, 29772736, 30608390, 31371261, 31832289, 32715191, 33978895, 34438952, 35409367, 36231002, 37316830, 38581309, 39872938, 40751299, 41860917, 43528765, 44295864, 45340288, 46729538, 48488683, 49931188, 51130278, 52998893, 54963972, 56452227, 58266342, 60035543, 62201492, 64307326, 66535141, 69196139, 71653085]
14319G1653085K667390K452449L260393K905127L217670L387115L380710L773393
14311I6697332L907440M356349M452508M823895N052089N055856N805976N725034
14303A35876479O739694O448244P004539P714399P930362Q576003Q602091R541950
14295A98433761J0159227J0585302J1576696J1317571J2165547J3046599J3661501
14288B80946204J3766105J4930095J5374875J5270478J5708330J5837999J5942965
14281C87777051J5334929J5025139J4389408J3334143J1782866J0862499Q358405
14274D76864440O553979L696980k49396m588523n194837l631404m099888o437778
14266D62913573q813839r946638j1250455j3864046j4322302j5148285j5756303
$$ y = [71653085, 74320475, 76772924, 80033317, 82938444, 86156114, 89543229, 92923939, 96697332, 100604772, 104961121, 109413629, 114237524, 119289613, 124345469, 130151445, 135876479, 142616173, 149064417, 156068956, 163783355, 171713717, 180289720, 188891811, 198433761, 208592988, 219178290, 230754986, 242072557, 254238104, 267284703, 280946204, 294712309, 309642404, 325017279, 340287757, 355996087, 371834086, 387777051, 403111980, 418137119, 432526527, 445860670, 457643536, 468506035, 476864440, 483418419, 487115399, 486866003, 482277480, 477082643, 473451239, 469351351, 462913573, 454099734, 444153096, 432902641, 419038595, 404716293, 389568008, 373811705]
14259C73811705j5993663j6076847j5901360j5531778j4951700j3857369j3755275
14252B67743713j3656423j2122617j2178417j1378952j0816760j0136764r402197
14245A88051583r086102q295298p749961p782122p182957o615094o513413n754311
14237A29072325n293011n161287n186484m839971m564737m084601l206106m140418
14229I2595710l433214l806373l067505k800616l001498k931350k742169k141478
14221F8671507k646143j867063k175548k324946j807178j735815k006236j229924
14213E2878654j503159j802805j546662j283245j328214j443202o19110j221389
14205D2130868j024487j769620r57466j097477r37156n19928r57831j297434q87567
$$ y = [373811705, 357818042, 341741195, 325839835, 310308057, 295356357, 281498988, 267743713, 254087290, 241964673, 229786256, 218407304, 207590544, 197453780, 188051583, 178965481, 170670183, 162920222, 155138100, 147955143, 141340049, 134826636, 129072325, 123779314, 118618027, 113431543, 108591572, 104026835, 99942234, 96736128, 92595710, 89162496, 85356123, 82288618, 79488002, 76486504, 73555154, 70812985, 68671507, 66025364, 64158301, 61982753, 59657807, 57850629, 56114814, 54108578, 52878654, 51375495, 49572690, 48026028, 46742783, 45414569, 43971367, 43352257, 42130868, 41106381, 39336761, 38379295, 37281818, 36344662, 35824734, 34866903, 33569469, 32681902]
14196C2681902o80554j120561m80498q19409q63687n43868o20931m71893o27734
14187B6452767o67804q97019o07948j21786o82427k56950m94012o53249o91171
14178B1380401l87984k10562n53255m28445l32031p57773q7470n94549n0743m01343
14168A7576246j84605m82914k05717o35446N7441m32314o13798q0056m32810l2545
14158A4533482n59432k84956q7785R8618m63511J8903m60531J31636l71391l10045
14148A2244988m30210k27693L28418n22635L2272J13875n54003o7752m02531J5660
14138A0530389j65618l04779k06301J27924n5618k47638l85122K33798k17243
14129I309792o8448k45081k67161J65014p515k11730J28999o12768K69362j84967
$$ y = [32681902, 32001348, 30880787, 30400289, 29580880, 28717193, 28173325, 27552394, 27080501, 26452767, 25784963, 24887944, 24279996, 24158210, 23475783, 23218833, 22724821, 22071572, 21380401, 20992417, 20781855, 20228600, 19800155, 19468124, 18710351, 18622881, 18028332, 17977589, 17576246, 17391641, 16908727, 16703010, 16067564, 16125005, 15692691, 15078893, 14998837, 14566027, 14533482, 13974050, 13689094, 13601309, 13699927, 13236416, 13255319, 12794788, 12926424, 12555033, 12244988, 11814778, 11587085, 11915503, 11392868, 11425140, 11539015, 10985012, 10917260, 10514729, 10530389, 10364771, 10059992, 9853691, 9981615, 9925997, 9678359, 9293237, 9527035, 9309792, 9241344, 8996263, 8729102, 8894116, 8886601, 8674871, 8803870, 8191102, 8460464, 8275497]
14119H275497Q7591m39311M36275o83787o9710N6528l65228m5033K11744l77238
14109G087328j45798j55245j34467M60123o41492M24069l23023m2514L24201l30371
14099F522811k92948L94866o66786L36647l26457j8401K53051o14453K82404n87168
14089E283566J79994J91663r8163k55405J83872j75084J5412k0614q5164L3744
14079E253821j30459l62826L30856k21863K75429m05082K39663l92316q5873M8450
14069D549800k90726M25913j76093n48609K64860N2949n743j17947K99301j50115
14059D303590l7715l30555M14104k75610k25635J59226M729k4539P7914k86497
14049C779012k50742K11441k41580L75194j74170p7696Q8232m41388R8193M346
$$ y = [8275497, 8363088, 7923777, 8360052, 7676265, 7606555, 7663083, 7297855, 7252822, 7464566, 7087328, 6941530, 6786285, 6651818, 7111941, 6470449, 6894518, 6571495, 6528981, 6853182, 6522811, 6229863, 6624729, 5957943, 6294590, 5968133, 5949732, 6202783, 5588330, 5870734, 5283566, 5463560, 5655223, 5557060, 5301655, 5485527, 5310443, 5325855, 5305241, 5220077, 5253821, 5123362, 4760536, 5091392, 4869529, 5144958, 4739876, 4979539, 4587223, 4501350, 4549800, 4259074, 4684987, 4508894, 3960285, 4225145, 4278094, 4272351, 4154404, 4453705, 4303590, 4265875, 3935320, 4349424, 4073814, 3848179, 4007405, 4012134, 3987595, 4065509, 3779012, 3528270, 3739711, 3498131, 3873325, 3699155, 3621459, 3709691, 3268303, 3366496, 3370842]
14039C370842j42478J74545k39967m4891J19417R4638J36661m06174j69810K40881
14029C133664m5913K4520J2725j13643p4372j33509L7861K82589m2701P1963m79042
14018B674142M3107r3601Q2218j0868q2731L15019l60191K14847j62068o21940
14008A997934J07628L13983o58J87648l78378L47406j83424j6949N3762j70427
13998B258525k35020L91351m86452J91327K00519K37704m67935J55830P25885
13989B971734O57729K207001P072576J5388155J3963790j0011536j4462037o951487
13981A0835925l578580j867936m37445o38958n66003m39709l41771l0345L54148
13972C289326m79571k4536j71742j58268j6090L58756k99901O4506k10244J3502
$$ y = [3370842, 3228364, 3402909, 3162942, 3118051, 3237468, 3332106, 3468767, 3062593, 2892783, 3133664, 3087751, 3112271, 3124996, 3011353, 2936981, 2803472, 2841333, 3123922, 3081221, 3153184, 2674142, 2717249, 2623648, 2705866, 2694998, 2612267, 2927286, 2567095, 2781942, 2619874, 1997934, 2105562, 2419545, 2418887, 2606535, 2228157, 2575563, 2392139, 2375190, 2428952, 2258525, 2023505, 2414856, 1928404, 2119731, 2320250, 2557954, 2090019, 2245849, 2971734, 3629463, 5836464, 12909040, 28297195, 42260985, 32249449, 17787412, 10835925, 7257345, 5389409, 4951964, 4313006, 3747003, 3307294, 2965523, 2935178, 3289326, 2809755, 2785219, 2613477, 2455209, 2439119, 2797875, 2497974, 2562480, 2352236, 2365738]
13962B365738K4761l0761r3457J74126m60895k3280J80346K4429k11400J191K09715
13951B160513j76930o4681N4717l30823M36466L07474k55167J63205j31074j41893
13941B021807l62122M83110l53266L77240l63886j35939K04693j1653k08498l6668
13931A614818L42094k46364L69779p23610J35557L30630m7729k63168j92905O29114
13921A948216m64350R7304N8412j97838n3943K68703J63807m29086l9555M07342
13911A759012q4400j43886K21745j71171J25160M4884k23187l79954j17869R14077
13901A944411n17069J4630n1680M38882n45160K63217j71072j46358L7513Q2187
13891A349501R2104j25194Q6363j58853k08472L00021j54498n358M2547N2517
$$ y = [2365738, 2390499, 2359738, 2266281, 2440407, 1979512, 1956232, 2136578, 2161007, 1949607, 1950798, 2160513, 1983583, 1918902, 1973619, 1642796, 2079262, 2386736, 2131569, 2294774, 2163700, 2021807, 1659685, 2142795, 1789529, 2166769, 1802883, 1666944, 1871637, 1859984, 1651486, 1614818, 1956912, 1710548, 2080327, 1356717, 1492274, 1822904, 1775175, 1512007, 1319102, 1948216, 1483866, 1581170, 1639582, 1441744, 1387801, 1656504, 1820311, 1391225, 1351670, 1759012, 1674612, 1530726, 1752471, 1581300, 1706460, 1751344, 1528157, 1148203, 1030334, 1944411, 1427342, 1441972, 1390292, 1829174, 1284014, 1547231, 1376159, 1229801, 1267314, 1349501, 1441605, 1316411, 1402774, 1243921, 1035449, 1335470, 1180972, 1175614, 1218161, 1270678]
13881A270678J30666j27678j02621K08299n0803k12589j69015M1683Q7840L17427
13871A393887o9284k05430K80820l42601J05389j43920j8716k57540K95368l8314
13861I99659L03444p4324l31557M03246l86604K66857k05125L4512j70439K33389
13851A073058J75101j38260k45765M43757m86890N12099l79470Q3469J9233K18150
13841A274482k00728k56993j44900K05482K50352j68120N7298N8447m54381K09654
13831H30593K37606J24280l99923L02770m8847l36237J3841K07083R918R834R8347
13820A049265l82827L41864k42834Q3109K32562k56048L7813R8139L4434j82066
13810H13411K34957k19301L4741L6646K6783R0217j02851j89163J3002p5962J10207
$$ y = [1270678, 1401344, 1273666, 1171045, 1379344, 1328541, 1115952, 946937, 988620, 1076460, 1393887, 1324603, 1119173, 1399993, 1057392, 1162781, 1018861, 1000145, 742605, 1037973, 999659, 1303103, 1228779, 897222, 1300468, 913864, 1180721, 975596, 1010108, 839669, 1073058, 1248159, 1109899, 864134, 1307891, 821001, 1333100, 953630, 1037099, 1056332, 1274482, 1073754, 816761, 671861, 877343, 1127695, 959575, 1016873, 1075320, 620939, 830593, 1068199, 1192479, 792556, 1095326, 1046479, 710242, 724083, 931166, 941084, 950918, 1049265, 666438, 1008302, 765468, 848577, 1081139, 825091, 862904, 961043, 995477, 813411, 1048368, 829067, 863808, 900454, 927237, 1017454, 914603, 725440, 738442, 662480, 772687]
13799G72687l25117M15711K28701k14376l47842L97427k54147k42346M77670l74012
13789E34356L61812p32j23407K54543l24182O8421l1595J26147C56001N00854
13779H56855j54116J56506J46732k1920l47716N25553m82418K67741j69595Q1399
13769H59021J54185J23431m51275K5839M8584o7004N0648j16117j1812R863O9360
13758F94723l46145L88146j67401j08352L43997l28398P9779K44139q2587N6252
13748G74153l31408J62772O44578E79965L4881J10381k89785K74593R2267K29224
13738A031526D12690k4185N4003L53857p8945j59884k39887j22661M73490j59790
13728E08688o8573P1455K70233j62834m2800k2077J72863Q6984l38145L60686
$$ y = [772687, 447570, 863281, 1091982, 877606, 529764, 927191, 673044, 430698, 908368, 534356, 896168, 895436, 772029, 1026572, 702390, 770811, 739216, 865363, 356001, 856855, 702739, 859245, 1005977, 984057, 636341, 1161894, 679476, 947217, 777622, 859021, 1013206, 1136637, 685362, 711201, 759785, 692781, 743429, 627312, 615500, 625363, 694723, 348578, 736724, 569323, 460971, 804968, 476570, 556349, 800488, 717901, 774153, 442745, 605517, 1250095, 579965, 614846, 725227, 435442, 710035, 802302, 1031526, 412690, 388505, 442508, 796365, 717420, 557536, 317649, 194988, 668478, 508688, 440115, 511570, 781803, 618969, 576169, 554092, 726955, 813939, 475794, 836480]
13718H36480l55263j87090K96083J08255k57057K06451k17469J2539K63047k48547
13708D57429L37188j55826l4598K4236k50720J11545K43106B51308N70224j15423
13698G06109k8515R0163J79329C88304L25318B11640N79750l73930J05011J35429
13688F57900j49258k47735K9331R627P9087L3567J59656J19556B90556L27182
13678F17738r1077j1857A78838M07818B72870q5534M71108j91461j2622N6874
13668E11235K853P3251k60165J85176J96533j13700j76505q6864n7609K09232
13658D83437J46406j05207Q0833B34549L18035k42139K30839k14300K72489l8962
13648E60511r7042k3839P6203A11562O00161j24202k34310l663j37861J73991
$$ y = [836480, 481217, 294127, 590210, 698465, 441408, 647859, 430390, 442929, 705976, 457429, 794617, 638791, 604193, 628429, 377709, 489254, 732360, 251308, 821532, 706109, 677594, 767757, 947086, 388304, 713622, 211640, 791390, 417460, 522471, 657900, 508642, 260907, 290238, 299865, 378952, 412519, 572175, 691731, 290556, 617738, 526661, 514804, 178838, 586656, 272870, 187336, 658444, 466983, 454361, 511235, 514088, 587339, 327174, 512350, 708883, 595183, 418678, 331814, 274205, 483437, 629843, 524636, 605469, 234549, 552584, 310445, 541284, 326984, 599473, 560511, 463469, 439630, 515833, 111562, 711723, 587521, 353211, 349548, 211687, 385678]
13638C85678O9477n3366R0850K63958l28830J44661Q8996B09600K77372j30986
13628C55986j3400A7455O25540j18756A58556L36959k34827N7866J04828K20514
13618F43896k17431j70830Q8129j29539M59236B59348J31564r1j06811P9336A36943
13606B71882p1683J78557I6256M68172B35734L12312k31813n840N1979k0027J03050
13595D45395K6660L3841j29597j78171K06759A43209Q7297J44383j20441J20487
13585C74935L03836l35572N7903k2644A09265L45161J26947k0420k3660o3279
13575D74014F6951N07266k79313J29312l4657A62580p8372C7669L25879K5542
13565C89090A73537J21291K67782B36091K6725J99489j80977j02543J50186A59989
$$ y = [385678, 455155, 401789, 492639, 756597, 427767, 572428, 661424, 209600, 486972, 355986, 342586, 17455, 642995, 524239, 158556, 495515, 260688, 318554, 423382, 643896, 426465, 255635, 343764, 214225, 673461, 259348, 390912, 390821, 284010, 363346, 136943, 271882, 200199, 378756, 96256, 564428, 235734, 548046, 316233, 310393, 362372, 342345, 445395, 472055, 505896, 376299, 198128, 404887, 143209, 230506, 374889, 254448, 374935, 678771, 343199, 401102, 378458, 109265, 454426, 581373, 560953, 537293, 474014, 66951, 574217, 294904, 424216, 389559, 162580, 84208, 37669, 363548, 389090, 173537, 294828, 562610, 236091, 262816, 462305, 281328, 178785, 328971, 159989]
13554C70576j83216K19527A26665J45786n1132k1373K54964k26677J94074G8285
13543C13450a4032A15864K00862K1661l9648q8632I1419J20681M13433F6559d6912
13531A72077P1999J4407b698D86310B36237e5653J3195I1999J34136R4576K11877
13520E32588B17829n0448L66558j37337n8493k108l460M5342I6352L67927H1757
13508B11524a00574G0355J33301J55840J58424J94775B57531G5710J80857n4204
13498B02363M51708j91482q2190p8990L09441A85785D7765L61932d0820a001C8266
13486A71849h1595A71303F8514K52082j26843l0678J45881j32733K83070j22079
13476C37214j21633e0075B68016a01197B51355a98452B02726G2014K04859j38164
$$ y = [370576, 187360, 406887, 126665, 272451, 221319, 199946, 454910, 228233, 422307, 78285, 313450, -14032, 115864, 316726, 338387, 298739, 210107, 91419, 212100, 625533, 66559, -46912, 172077, 244076, 258483, -2698, 486310, 236237, -55653, -42458, 91999, 226135, 320711, 532588, 217829, 167381, 533939, 396602, 338109, 336001, 332541, 377883, 96352, 464279, 81757, 211524, -100574, 70355, 203656, 359496, 517920, 712695, 257531, 75710, 256567, 202363, 654071, 462589, 380399, 301409, 610850, 185785, 47765, 409697, -40820, -1001, 38266, 171849, -81595, 171303, 68514, 320596, 193753, 163075, 308956, 176223, 459293, 337214, 215581, -50075, 268016, -101197, 251355, -198452, 202726, 72014, 276873, 138709]
13466A38709K31749J20471q8264A0837K50097a0575B25757p7921c00820C38309
13455A82587F9554J08602O319M3607k4005P8558j03656r023a31452A63817K8286
13444A92103m4215J70300A25733M46178j21683j40580P4398I8014M3234M4070
13434A85318B3220O9378J05574P7651m5945n7834J22105j02906L49293B65540
13423B61875I7031O1183D3375a4711A91235K13953A72080a18723A0245M96049
13413E06294j9389r4835A95912J72711f451B64702N15D1702a42398D43500p2035
13402C71465C1545K20698j21454d9808H7020g1458C64672J0769J6372A54243M6957
13391B01200m9882M53946B82696E7240J53881J77728R2861B09407k2161J00818
$$ y = [138709, 370458, 490929, 402665, 10837, 260934, -10575, 225757, 147836, -300820, 338309, 182587, 69554, 178156, 184475, 228082, 204077, 282635, 178979, 169956, -131452, 163817, 192103, 147888, 318188, 125733, 571911, 450228, 309648, 384046, 98014, 141248, 185318, 23220, 92598, 198172, 275823, 229878, 172044, 294149, 191243, 540536, 265540, 261875, 97031, 158214, 43375, -14711, 191235, 405188, 172080, -118723, 10245, 506294, 486905, 392070, 195912, 368623, -6451, 264702, 265217, 41702, -142398, 443500, 371465, 31545, 252243, 130789, -49808, 87020, -71458, 364672, 375441, 391813, 154243, 201200, 151318, 605264, 282696, 57240, 211121, 388849, 481710, 209407, 187246, 288064]
13381B88064h1927D29324J00432B56249b00911B06458N8545n8038J92050m3148
13371C55867A25049%K94441D8855L57642g9802B41699K2749A27124J90192A44569
13359D37838C1956c2751D8010L80954A04980P2736a87808A42719m7394M412J17812
13348B17549K24029j92549P190J38129A54543D7295L1594j0205L24844L22j49794
13337B44056J21240j17321p9969A5371h6543j278E40811k08717f0379C21509G9178
13325A83930K33720A51984g4417H8990O5564K44272L2690n118j43470O2315Q4742
13314D29985d7698B56954J10733b7625A39431J55765J12285l0560H2816J73624
13304B56440j18983A6664L11639G6859J09022P3383M2108r070d3478G3337C4064
$$ y = [288064, -81927, 429324, 529756, 256249, -200911, 206458, 265003, 206965, 399015, 355867, 125049, 125049, 419490, 48855, 406497, -79802, 241699, 264448, 127124, 317316, 144569, 437838, 31956, -32751, 48010, 428964, 104980, 177716, -187808, 142719, 95325, 99737, 217549, 441578, 249029, 256219, 394348, 154543, 47295, 78889, 68684, 393528, 393850, 244056, 365296, 247975, 168006, 15371, -86543, -87821, 540811, 332094, -60379, 321509, 79178, 183930, 417650, 151984, -74417, 88990, 154554, 398826, 431516, 426398, 282928, 345243, 429985, -47698, 256954, 367687, -27625, 139431, 295196, 407481, 376921, 82816, 256440, 137457, 16664, 328303, 76859, 185881, 259264, 301372, 292302, -43478, 73337, 34064]
13292D6310K34999r4993K05503A26854c10530i0078g681B41140G8011R7595C7386
13280G7999L88266j12026A06057c6159q905B06079h3571m6920b583A68864a21369
13268B34693G432K60958m3791J18872a20913j9244C06274j575j0861O1633b1374
13256B16476j0960N0637g8043H5173K62944J8326H8433f718C16301a07450C57858
13244a5486j31977I2512M3489Q9804p2164l3913n4297M9410m2585A0038i259r1022
13232a00281B45842E7878N5295b6847G2696J23736a4666j92553D78808F3867J03590
13221A67457a47601A5890Q8320j4945R255j7988b0212k96403A64697K35035j39071
13210B60661N5116C4496h9322B37310g7810A83615J2104R5591E0627K08097a5196
$$ y = [46310, 281309, 186316, 391819, 126854, -310530, -90078, -7681, 241140, 78011, 175606, 37386, 77999, 466265, 354239, 106057, -36159, -45064, 206079, -83571, -130491, -2583, 168864, -121369, 234693, 7432, 268390, 224599, 343471, -120913, -140157, 306274, 304699, 293838, 355471, -21374, 216476, 205516, 256153, -78043, 85173, 348117, 366443, 88433, -6718, 316301, -107450, 357858, -15486, -147463, 92512, 136001, 225805, 153641, 119728, 65431, 114841, 72256, 10038, -9259, -100281, 245842, 57878, 113173, -26847, 72696, 196432, -14666, -207219, 478808, 63867, 167457, -147601, 15890, 104210, 89265, 98520, 80532, -20212, -316615, 164697, 399732, 260661, 315777, 34496, -89322, 237310, -77810, 183615, 195719, 291310, 50627, 258724, -15196]
13198e65n6858A74360H5055b35505h6534I8081b0295C5532a14236j63443c6460
13186g9055A51112C5835J03696J73043C6107g1977c413j10729A97493I4691K9300
13175A23991J9910c73041a38924A09582K7703L21813a5004I2025J3024P2196c8576
13163B69388K64358B31505K53080A82532h265A09432l4368L64440A88477b73945
13152A57081a96734g2376o5507I6374Q4174D9039M71983a52660l7257P6023O244
13141a07650B30710b6715B22975m1048M9157a68601J3601B95156a3322D0555M93368
13130E33923E7686a2668B6134K55115j38380C2656J47745n9308M59045k77823
13120C02315b2763j01544A07101D5020f3940B9992K01076j5666H4193P1975N7876
$$ y = [-565, -57423, 174360, 85055, -235505, -86534, 98081, -20295, 35532, -114236, -277679, -36460, -79055, 151112, 35835, 139531, 312574, 36107, -71977, -3413, -114142, 197493, 94691, 123991, 143901, -373041, -138924, 109582, 137285, 459098, -15004, 92025, 105049, 177245, -38576, 269388, 533746, 231505, 484585, 182532, -8265, 109432, 75064, 439504, 188477, -273945, 157081, -196734, -72376, -137883, 96374, 180548, 49039, 521022, -152660, -189917, -113894, -107650, 230710, -26715, 222975, 181927, 231084, -168601, -155000, 295156, -13322, 40555, 533923, 57686, -12668, 26134, 281249, 142869, 32656, 180401, 121093, 580138, 302315, -22763, -124307, 107101, 45020, -63940, 29992, 231068, 215402, 84193, 156168, 214044]
13109B14044I2020K13662i4526H3360l8943L12589A05934p127J55386r6891B1021
13097G0218J60915c2377G3405o182P544b02711A07039M8510o2909N7857f085A89461
13084A68137f8876K5633A95237J61966G9180d9762D976K44132B3471Q4292R0022
13073A97785I3962J66398J330a91533C17438j15939M8093b97423a5298q138C9688
13061C15647A17697K15525H2399a59349d9863A79100H4054J17133a46842B12478
13050A3239a55166C53481a78770N5964K561L9666A6130L05666J2705j34958i2581
13038g32m05928h0188a4391A74551c2613C6260Q4701M8646J77986b83371B44379
13026B76311I8807a18835I7521a01632A4019f981B8322b4365p2884B17393D7194
$$ y = [214044, 92020, 305682, -94526, 83360, 44417, 357006, 105934, 98807, 254193, 157302, 21021, 70218, 231133, -32377, 73405, 67223, 74767, -202711, 107039, 155549, 92640, 150497, -6085, 189461, 168137, -68876, -43243, 195237, 357203, 79180, -49762, 4976, 249108, 23471, 107763, 197785, 93962, 260360, 261690, -191533, 317438, 201499, 249592, -297423, -15298, -23436, 39688, 315647, 117697, 333222, 82399, -159349, -49863, 179100, 84054, 201187, -146842, 212478, 13239, -155166, 353481, -178770, -122806, -120245, -80579, 16130, 321796, 334501, 199543, -92581, -732, -406660, -80188, -14391, 174551, -32613, 36260, 120961, 169607, 347593, -283371, 244379, 276311, 98807, -118835, 97521, -101632, 14019, -6981, 28322, -24365, -97249, 217393, 47194]
13014G0348b1076C37333e9081A92255J5050a5674k6649C8484J85980g4041G5387
13002C49492c3993a0228G4123l2597L55113A07924e1854a288A39077Q9136j07416
12991A20797L8678d16007D73681A69035E9055j4644P1924C2278J13639i4210A92092
12979b4471D8237c05684C64613e0503G072k63b47924B79255C3757B152b7849D4434
12966f6265A83007k46h8082A26730a41509j84712C09972I0463M6377k2927a36010
12954b15191N4832B84524G9018c29988J04763A59048b49047e9969C02782L3829
12944C36611H2820L1739l0370K13825a04595J5111G8169b7719B92511p2263M4868
12933B65116k5173h5350A60683p6871J96824b0213k0612l5320j1592A79495b73481
$$ y = [70348, -21076, 337333, -59081, 192255, 207305, -15674, -42323, 38484, 224464, -74041, 75387, 349492, -33993, -10228, 74123, 41526, 396639, 107924, -51854, -1288, 139077, 228213, 120797, 159475, -416007, 473681, 169035, 59055, 44411, 116335, 32278, 145917, -94210, 192092, -24471, 48237, -305684, 364613, -50503, 7072, 6809, -247924, 279255, 33757, 2152, -27849, 44434, -66265, 183007, 182761, -88082, 126730, -141509, -326221, 309972, 90463, 136840, 113913, -136010, -215191, -160359, 284524, 79018, -329988, -225225, 159048, -249047, -59969, 302782, 336611, 82820, 114559, 84189, 298014, -104595, -89484, 78169, -27719, 292511, 220248, 265116, 239943, -85350, 160683, 83812, 280636, -20213, -40825, -76145, -87737, 179495, -273481]
12921A42390o2041K40527J40299A73002l9892a5404l19617I4851m6014b05470
12910d4992k02746a0876B33868I6209c4184j24311B89592E8498a65916k2450r1780
12899b80146e6334B21671d7830r094j70467F9109b19194P0605e6084k10634A50949
12887C2910P3743L14458f582l39516i0759G2925J94138a43212E9847g6000A62034
12875a05729j14233E6236N8016B3739L1101c26282h1332A9721a80526C778K26305
12864B30083h9331A60524a14252B67982E0322K4116b48354P4188N5767K6835o9922
12853a61486f6821a4972B02209i7697a2248k26013f8380D2079b7512G0168k6941
12842D3227J59474K78355b17576a08074G4368b4538C54278a0539l32032A32886
$$ y = [142390, 80349, 320876, 461175, 173002, 133110, -15404, -335021, 94851, 48837, -205470, -44992, -247738, -10876, 233868, 96209, -34184, -158495, 289592, 58498, -165916, -188366, -280146, -56334, 221671, -47830, -56924, -227391, 69109, -219194, -148589, -56084, -266718, 150949, 32910, 106653, 421111, -6582, -346098, -90759, 72925, 267063, -143212, 59847, -76000, 162034, -105729, -219962, 56236, 114252, 23739, 54840, -326282, -81332, 19721, -180526, 3778, 230083, -89331, 160524, -114252, 267982, 50322, 74438, -248354, -174166, -118399, -91564, -161486, -66821, -14972, 202209, -97697, -12248, -238261, -68380, 42079, -27512, 70168, 43227, 202701, 481056, -217576, -108074, 74368, -24538, 354278, -10539, -342571, 132886]
12831A74243a09220B54074o9702Q9561i7246j91703C65624d76126D0288J95047
12821B35335h799k24805j4227J20378k6350A82761C7967i4137o7106H8472b2723
12809A5543M4289K51007K13866A9188J44956D6342J83481d00653A77974q0517
12799I7457e4377B5447b66207A4216M8412g4961c190B88313h3018m9999b5139
12787a75740a942k10786A73750J79633f488j06652B1578a01881M8295A86503l4822
12776A51681f2478D37117B156P7381L7498a29794d1027m19397a27421n3778f3686
12764a96448f9386l2582C0306J97878F6900C2938d0342A33171K76985b57799h9290
12752i7044m8570m7781j01800K3126I9374b15548A69943a134D9839J19592M605
$$ y = [174243, -109220, 254074, 184372, 273933, -97246, -288949, 365624, -476126, 40288, 235335, -8799, -233604, -247831, -127453, -153803, 182761, 37967, -94137, -161243, 88472, -22723, 15543, 59832, 310839, 524705, 19188, 164144, 46342, 229823, -400653, 177974, 97457, -54377, 25447, -266207, 14216, 62628, -74961, -3190, 288313, -83018, -133017, -25139, -175740, -1942, -212728, 173750, 353383, -6488, -113140, 21578, -101881, -53586, 186503, 151681, -62478, 437117, 2156, 79537, 117035, -129794, -41027, -460424, -127421, -181199, -63686, -196448, -69386, -101968, 30306, 228184, 66900, 32938, -40342, 133171, 410156, -257799, -89290, -97044, -145614, -193395, -295195, -272069, 99374, -215548, 169943, -1134, 49839, 169431, 174036]
12741A74036o9032c9381B48310J47972c85471A1213b5704C67539D0307J75022
12731B15329r5761J20147C0846J2290e4711j1795o4417A47844J062l8801h3949
12719a135B44886H3617L6658C5155d5759B87034R1003B2615K8378R1670F3907
12707B89337a31430D68138k05664F120J67586K19663B8779A2197J9948M72148
12697E04293A91853a68813A08807J277M4545f4226G7955d0843j6838j07402A61195
12685A34616c9354G5525k3494M0322R0475R7320c96009B60144a98889I5016D1169
12673A03596a30288D1533a94182f2915I2877L9280K6121e2369C32043A33030K17084
12662C50114G5547h6183c9934J8867j2240E0671J2558J25436R4887a49421B24094
$$ y = [174036, 105004, -39381, 248310, 396282, -385471, 11213, -25704, 367539, 40307, 215329, 119568, 239715, 30846, 43136, -54711, -66506, -130923, 147844, 148906, 110105, -83949, -1135, 244886, 83617, 120275, 35155, -45759, 287034, 378037, 22615, 50993, 142663, 63907, 289337, -131430, 468138, 262474, 6120, 173706, 393369, 28779, 12197, 32145, 504293, 191853, -168813, 108807, 110084, 154629, -64226, 77955, -40843, -57681, -165083, 161195, 134616, -39354, 75525, 52031, 92353, 182828, 280148, -396009, 260144, -198889, 95016, 41169, 103596, -130288, 41533, -194182, -62915, 92877, 132157, 158278, -52369, 332043, 133030, 350114, 75547, -86183, -39934, -21067, -33307, 50671, 63229, 188665, 283552, -149421, 224094]
12650a2035q4730C37357A68444b60624F9412N9635b16750H7944a63145G1250b11109
12638A89196l0204R7043m8934P1448e0555A82574R0542r134J72607B02280J76300
12627C78580j72523a16700B06408A0612J53985J57489F9317J52373g6477A94914
12616C15004a03578B06506h7609B3960f3718C6741M7277b9281j86343I6795a30160
12604A92762c15750c3103r877B77417c8956C74310E1207J45538b47321a3992D06490
12592B04642L0869k8668A02602P1429K80814f053A82077i6782K7973A06203J66688
12581B72891B5865d25810C57860c7014a0521k59185B78320h2670j59955B6567
12570c34271a33043B55513R3488b08126A82142J03092C576J35390O9397d55555
$$ y = [-12035, -96765, 337357, 168444, -260624, 69412, 129047, -216750, 87944, -163145, 71250, -211109, 189196, 158992, 256035, 207101, 278549, -50555, 182574, 273116, 263982, 436589, 202280, 378580, 206057, -116700, 206408, 10612, 164597, 322086, 69317, 221690, -76477, 194914, 315004, -103578, 206506, -87609, 23960, -63718, 36741, 84018, -29281, -215624, 96795, -130160, 192762, -315750, -33103, -42980, 277417, -38956, 374310, 51207, 196745, -247321, -13992, 406490, 204642, 235511, 206843, 102602, 174031, 454845, -6053, 182077, -96782, -68809, 106203, 272891, 25865, -425810, 357860, -37014, -10521, -269706, 278320, -82670, -242625, 26567, -334271, -133043, 255513, 349001, -208126, 182142, 285234, 3576, 138966, 208363, -455555]
12559A67052o5448b07004B12042a97987N8617l19035h0240j21072C5766J28837
12549A64603j3679A7299a33731m9875j21200J20248C9610J2915e7171b3022j6942
12538c9964A67973i7213A37200c18847a8967A72701b34427B11372l5516e4411
12527E8557K9156K1862e7108A18055P1352F94J7592K85565i5340J3688A02285
12515h7840j29349i831k29533A48431C343K80035H6657f0302A56065L0299m8094
12504A38270b278A22408D3009a07026d4269n6912o5119a0402B52603A20398Q8568
12493B08966d3838j577A48237b04818A46974J36339a90071Q8183j22187d4022
12482e9498j6404G0492d11401B25632a04021D8135b3684j77739G7859L8049h771
$$ y = [167052, 101604, -207004, 212042, -197987, -139370, -458405, -80240, -201312, 35766, 164603, 150924, 17299, -133731, -183606, -304806, -184558, 39610, 52525, -57171, -23022, -39964, 167973, -97213, 137200, -318847, -18967, 172701, -234427, 211372, 175856, -54411, 58557, 87713, 109575, -57108, 118055, 189407, 694, 18286, 303851, -95340, -81652, 102285, -87840, -217189, -9831, -239364, 148431, 3343, 283378, 86657, -60302, 156065, 186364, 138270, -2278, 122408, 43009, -107026, -44269, -101181, -166300, -10402, 252603, 120398, 208966, -43838, -45415, 148237, -204818, 146974, 283313, -190071, -101888, -224075, -44022, -59498, -75902, 70492, -411401, 225632, -104021, 48135, -23684, -201423, 77859, 115908, -8771]
12470A19405J22552i0738r5982B93522h3152n2727A92918C5957b44779B30088
12459a2286k60571a5436C4055J34706R2072e8189A26286d55419K26658k74710
12449e03471I2257R8890K0247a44479C7573J2292g216q6582A76059g0519K7794
12438d2725j4855k41067C12094j24001K6117b5999o6731p9821B6438f3480B43124
12426A9896a52189A51213h4360r366l26864a83965O8272o8900b2413k01772i040
12414A33901J28768H9614J66839i9196K3069e393C0091e54G0921d3701q9639a0211
12401A82717M8222m5212A5669M4504J41780j2876b3018B90893d10900B02106b22257
12389a66502l028C09988a7783A87329a70561B1493a36437A94923n6520L94366
$$ y = [119405, 241957, -90738, -186720, 293522, -83152, -135879, 192918, 35957, -244779, 230088, -12286, -272857, -15436, 34055, 168761, 260833, -58189, 126286, -455419, -228761, -503471, 92257, 191147, 211394, -144479, 37573, 49865, -7216, -93798, 176059, -70519, -42725, -57580, -298647, 312094, 188093, 214210, -25999, -92730, -172551, 26438, -63480, 243124, 19896, -152189, 151213, -84360, -93726, -420590, -183965, -115693, -184593, -22413, -224185, -9040, 133901, 262669, 89614, 256453, -99196, -76127, -5393, 30091, -554, 70921, -43701, -133340, -10211, 182717, 230939, 185727, 15669, 60173, 201953, 189077, -23018, 290893, -410900, 202106, -222257, -166502, -169530, 309988, -17783, 187329, -170561, 21493, -136437, 194923, 138403, 532769]
12379E32769B54170C7868f9131p2548D1464c29571f5724K5523k5589l06166A80899
12367D63977a39985b4039A46480A2517h3638A14193f4470K3326n5367A29599k5165
12356A04434C0351Q3713J73112j05285j9324B6531g0012D3977J04303b55093H736
12344H2478a38540L1190J7426G9742M9711b63470P1341A87391c39499e256A01208
12332a38858B58340r6073F785M970i9779I8059J65033o4614a43994j40654d083
12320D3943O0356f0997E7552i3147j38627A14485Q4073a63882D00573o8123a33312
12308a27872j9677A79736a52037k04925A45421a13988G5547C4134J31102A3101
12297d32311D638a35386L2359h139E6016L94135f7044l614H0746C9527N8595i3657
$$ y = [532769, 254170, 37868, -69131, -141679, 41464, -329571, -65724, -40201, -65790, -371956, 180899, 463977, -139985, -24039, 146480, 12517, -83638, 114193, -64470, -41144, -96511, 129599, 104434, 30351, 114064, 287176, 181891, 162567, 26531, -70012, 43977, 148280, -255093, 8736, 82478, -138540, -107350, -89924, 79742, 129453, -263470, -192129, 187391, -339499, -5256, 101208, -138858, 258340, 162267, 6785, 11755, -99779, 98059, 263092, 198478, -143994, -284648, -4083, 43943, 104299, -60997, 57552, -93147, -231774, 114485, 198558, -163882, 400573, 332450, -133312, -127872, -147549, 179736, -152037, -356962, 145421, -113988, 75547, 34134, 165236, 13101, -432311, 4638, -135386, -103027, -8139, 56016, 450151, -67044, -70658, 80746, 39527, 98122, -93657]
12284a98178H1152a84038C3238P4388b94340a14655A24166a19178j33318A88165
12273A30363n0679c65904C88963A58323D8933M31992b1063j89824C43781A13162
12262b8929j10903r2919B06570J22023b56459B49613n0497a54033f5469A16279
12251A80476b82201J00734A1879J04753M47406A80779c5355k47321a283k71639
12241b72922d2338j79617A19941P2632F9786b01436A05770M865K99817b0644m890
12230b5534C37187b803I7629R1296b5682A83621H7344K9699J59477n1099Q006
12219B33427b44891B24213m6924c4137F4765J80716f3261E0993Q7007j6903a55170
12207I4602J23833a58480H916K91495J62593j49194r1482d7440D73271A95886
$$ y = [-198178, 81152, -184038, 33238, 107626, -294340, -114655, 124166, -119178, -252496, 188165, 130363, 79684, -365904, 388963, 158323, 48933, 480925, -21063, -210887, 343781, 113162, -28929, -139832, -232751, 206570, 328593, -256459, 249613, 199116, -154033, -65469, 116279, 180476, -282201, -181467, 11879, 116632, 564038, 180779, -35355, -282676, -1283, -272922, -42338, -221955, 119941, 192573, 69786, -201436, 105770, 110635, 410452, -20644, -25534, 337187, -2803, 97629, 188925, -25682, 183621, 87344, 117043, 276520, 225421, 233427, -244891, 224213, 177289, -34137, 64765, 245481, -63261, 50993, 138000, 121097, -155170, 94602, 218435, -158480, 8916, 300411, 463004, 313810, 222328, -47440, 473271, 195886]
12196C80177j86480K54509A08847i6796D0547J53449c4497B84950b40913C0885
12185B15853q9799j5353M9212c311C0248K97038q7838n2466K2358H3206J3915
12174I7121b66315A163K54936C6759M3674R1860J23248M9495m438j14177I7566
12162I6793b16937A87996J30873b39211O6398B1527f46B7550a90346C3124K2239
12151E5363J10494R0976i1277D0291N9700R647J26855f7764n3988G59K08451a63775
12138H6750O2435F0138a06060r4752k16563a07413G2377K56683n0485g3924r4785
12127a68709B8848a60004A93113k3731q2012K3978K63101I0232M5678f8451D4986
12115a14913a7553n3109A80831k1620L184c1358G7162D096d5059A54607k3824
$$ y = [380177, 193697, 448206, 108847, -96796, 40547, 193996, -34497, 284950, -240913, 30885, 215853, 126054, 110701, 159913, -3311, 30248, 327286, 239448, 186982, 209340, 83206, 97121, -266315, 1163, 256099, 36759, 80433, 172293, 295541, 345036, 340598, 226421, 97566, 96793, -216937, 187996, 318869, -239211, -172813, 21527, -646, 27550, -190346, 33124, 55363, 165857, 256833, -91277, 40291, 99991, 109638, 236493, -67764, -121752, 759, 209210, -163775, 86750, 149185, 60138, -106060, -200812, -417375, -107413, 72377, 329060, 278575, -73924, -168709, 28848, -160004, 193113, 169382, 87370, 111348, 374449, 90232, 135910, -68451, 44986, -114913, -17553, -70662, 180831, 159211, 162395, -31358, 77162, 4096, -45059, 154607, 130783]
12104A30783b69889j64675c0075A94125m122d32122A79369D54b1870o1351A10957
12092a11576J5723k19066A42079B3713i5733A213g7214j0334B70656b5682F400
12080A84619c37844a44373A18478i0070C08681k0754N48800N06736L71209q04556
12070I10116A76627R997q0074b0257A25505J27148k6521N659a41187b0955r9557
12059a20512B41841a05178E4371A5787a9952k9370j09783f4218q9832I9769k3171
12048G6598a74533F2987a57731d0218G796b68085B96542i6648C3589K02651b38448
12036D9382b85302F397c0157j328F2079I450J62260a09595b4231F4579J3545b71010
12023A7140J60233J20666d7031A29628Q0041c23910a10725j15126R5586d3162
$$ y = [130783, -269889, -434564, -30075, 194125, 190003, -432122, 179369, 454, -21870, -83221, 110957, -111576, -95853, -314919, 142079, 23713, -95733, 1213, -77214, -87548, 270656, -25682, 6400, 184619, -337844, -144373, 118478, -90070, 308681, 287927, 836727, 1343463, 1714672, 910116, 176627, 186624, 106550, -20257, 125505, 252653, 226132, 231791, -141187, -20955, -120512, 241841, -105178, 54371, 15787, -19952, -49322, -159105, -64218, -154050, 99769, 76598, -174533, 62987, -157731, -40218, 7796, -268085, 296542, -96648, 33589, 236240, -238448, 49382, -285302, 6397, -30157, -31485, 62079, 9450, 171710, -109595, -24231, 64579, 78124, -271010, 17140, 177373, 298039, -47031, 129628, 209669, -323910, -110725, -225851, -130265, -43162]
12012i5155M4916p7221b3653A26333c00280a6558B43783H6037b48242a5625k6774
12001d2399m8768d0409A66255a9306r3992A62559a15092F9911a44696B9636j1807
11990A7829h9989d1187j55199m572k0830A920c43059h2231J1456A25086a57802
11978a28034k11739D0991a08417j16475J07523b4734k62131Q4370R6622J8660
11968h7213c4616k95994J41909A51073h1136A97226J50084F1233c8121F7155O0614
11957A27769J29721a55080A60714c6660j13078C9030O7369h230H2895d8613l25436
11946c74049J51204m373j89561B82575j17609i200j87406j06058a18369j14396
11936b32765g4851j24372Q2496F8753l2594e3128j44097j82679G8035J10620q4559
$$ y = [-95155, -50239, -127460, -23653, 126333, -300280, -16558, 243783, 86037, -248242, -15625, -42399, -91167, -40409, 166255, -19306, -113298, 162559, -115092, 69911, -144696, 29636, 17829, -89989, -41187, -196386, -200958, -221788, 1920, -343059, -82231, -70775, 125086, -157802, -128034, -339773, 40991, -108417, -224892, -117369, -24734, -286865, -202495, -105873, -87213, -34616, -330610, -188701, 151073, -81136, 197226, 347310, 61233, -38121, 67155, 127769, 257490, -155080, 160714, -36660, -149738, 39030, 106399, -8230, 82895, -48613, -374049, -222845, -227218, -416779, 282575, 164966, -9200, -196606, -302664, -118369, -232765, -74851, -199223, -116727, 68753, 36159, -53128, -197225, -379904, 78035, 188655, 104096]
11925A04096R478k5069b2596k62627A8260h3768c8345I5472K23310A8827d4628
11913a54696j93604A51573a17838B25912a67473B3201a22513j67693A23594a38762
11902a283A69933b7828k17554h3270j1519j72057a0350C4089J06482b33376p5370
11891c08746B614Q3789f6273k44898b8413A65738c0586j73021a1494k01293K319
11880b10468J7125a398j03300r1721A5579b61029C9604g5877q8455A74532O4066
11869B38598b44966A42765g5156I8023d34380H9145J2467J30547h0848G9997R3181
11858A73178j1672k9591k7729Q9187a27889m0950M9907b3224A84590a22516A0315
11846A13276J1809n3484K51408b47288a9873I5445J17358n7450F0136a75866D2119
$$ y = [104096, 113574, 88505, -22596, -285223, 18260, -83768, -38345, 95472, 318782, 18827, -44628, -154696, -348300, 151573, -117838, 225912, -167473, 23201, -122513, -290206, 123594, -138762, -1283, 169933, -27828, -245382, -83270, -94789, -266846, -10350, 34089, 140571, -233376, -308746, 2614, 86403, -66273, -311171, -28413, 165738, -30586, -203607, -11494, -212787, -210468, -193343, -1398, -104698, -196419, 15579, -261029, 39604, -75877, -164332, 174532, 238598, -244966, 142765, -75156, 98023, -434380, 89145, 101612, 232159, -80848, 79997, 173178, 161506, 131915, 104186, 193373, -127889, -168839, -118932, -23224, 184590, -122516, 10315, 113276, 125085, 71601, 323009, -247288, -19873, 95445, 212803, 155353, 60136, -175866, 42119]
11834a23687B69429c43501J08045A88625H7671b87212L6684a00594R322L8933
11824e2339b2229j32355B51026D8936b78528a14343b5865j53061h1132L1455F9777
11812A41320b05886N4294b4361j2355k43401a11714A03103g3448a3873j62616
11802a76489K5866A01027D8105c132B37295l0398d6951o2391o2700P0595A3126
11790B19189b46675b3284A06816j8704K8332j8895K9003B0886J80081a29235B14679
11778a84343D3379c30309C71399L826D606J92339c06255A52726b22597j0552B95094
11766G6400a11463l20A20031J75679b6908k56688B26354d3518a10o333A0718b26126
11753H0294E880M3371g2241j3563O959A94943C2212P0287b07976B6844i7553I9587
$$ y = [-123687, 269429, -343501, -235456, 188625, 87671, -287212, -250528, -100594, -91272, -52339, -22229, -154584, 251026, 48936, -278528, -114343, -25865, -178926, -81132, -49677, 69777, 141320, -205886, -151592, -24361, -36716, -280117, -111714, 103103, -73448, -13873, -176489, -150623, 101027, 48105, -3132, 237295, 206897, -46951, -109342, -172042, -101447, 13126, 219189, -246675, -23284, 106816, 88112, 116444, 97549, 126552, 20886, 200967, -129235, 214679, -184343, 43379, -330309, 371399, 375225, 4606, 196945, -306255, 152726, -222597, -233149, 295094, 76400, -111463, -111783, 120031, 295710, -26908, -283596, 226354, -43518, -110, -6443, 10718, -226126, 80294, 5880, 49251, -72241, -85804, -78845, 194943, 32212, 102499, -207976, 26844, -97553, 99587]
11740E1869J21683a85687R2121A90528E3087b25189l3568A52870a03768M4310
11730e9458b0248A26132a62871A61050M8778d7291F2243J98384a91268g1447r6707
11719a68154h636j10123A57161K21133n8984C8541b48622a08375b5520j53691
11709a79211n0882B99722e8238j94609A51629d7570k600j52533D11971a15293
11698H6696B6140c8577q863B32334A1177J86926f6435A36114J18851E2318b7615
11686B86422C0928a65989A51698h3877G5304L5210J33394G7854L9670b39041J08943
11675a30098A6377a17857A13265g5239R782A87549l0096k1191J11399C4040a01357
11663A0961N5726a04829I0794a35872A46891c0232A85766b751l1958B93386f1170
$$ y = [51869, 173552, -185687, -93566, 190528, 53087, -225189, -258757, 152870, -103768, -59458, -20248, 126132, -162871, 161050, 209828, -47291, 62243, 260627, -191268, -71447, -168154, -8636, -118759, 157161, 378294, 319310, 38541, -248622, -108375, -25520, -179211, -230093, 299722, -58238, -252847, 151629, -47570, -50170, -202703, 411971, -115293, 86696, 26140, -38577, -47440, 232334, 11177, 198103, -66435, 136114, 254965, 52318, -27615, 286422, 30928, -165989, 151698, -83877, 75304, 110514, 243908, 77854, 117524, -239041, -130098, 16377, -117857, 113265, -75239, -65457, 187549, 157453, 136262, 247661, 34040, -101357, 10961, 66687, -104829, 90794, -135872, 146891, -30232, 185766, -2751, -34709, 293386, -61170]
11651h9396J9604A4170K35999A12252J61582a76098H831a28004I5920C5548K1885
11640E7433K2722J19221r317f5570N824q8687B5475a42002I4429j0447J06910
11629A90892a4825C9396M6455b0774G4833A6139N606b64723q4645E4148a18366
11617b39801A57594c54673J63737j22837B23022d8922q2559l8524C4832J27721
11607A62553a22941M8524F0694a09921A68510a5546A48065h1676B21166c0359
11596E8510K79597a42764B60946I8117b11324B65109E200L5979J10285k1446b0388
11584C24472b39984P8853G6765A7018h3717C6713i7274A79467a52809A1433K61244
11573B72677L4226a0832H4479C6307b09153M29B93541a77506B23049a70410g6144
$$ y = [-89396, -69792, 14170, 250169, 112252, 273834, -176098, 8831, -128004, 95920, 35548, 57433, 80155, 199376, 190059, -65570, -59746, -148433, 25475, -142002, 94429, 83982, 190892, -14825, 39396, 85851, -20774, 74833, 16139, 21745, -264723, -349368, 54148, -118366, -239801, 157594, -354673, -190936, -313773, 223022, -48922, -131481, -170005, 34832, 162553, -122941, -74417, 60694, -109921, 168510, -15546, 148065, -81676, 221166, -30359, 58510, 338107, -142764, 260946, 98117, -211324, 265109, 5200, 41179, 151464, 130018, -20388, 324472, -239984, -161131, 76765, 17018, -83717, 36713, -97274, 179467, -152809, 11433, 272677, 306903, -10832, 84479, 36307, -209153, -208724, 293541, -177506, 223049, -170410, -76144]
11561A25270c3651B13252B0514J03716J91356a01876L6367J0832F6689K75553
11551C42242I6952K0958B5027b2157C33199j66116K2865o1073i1395C6465b02027
11539f2962b6969a1809A30388P7358F131d1553k9394H6061B4231d014A090J06496
11527A07586C5110e7336C14767E3533c4872B0078b71243B49248f3797F0057a71085
11515B21084f0077A52655G699K96541d2689C73620C1273b12399A88016J34882
11505C22898A10956C5248M7856K8965d5322F7616b8348C21005J00890j22183e7596
11493A18107K8026D5986J54808b6309I0838m835L19327A97968q1492i7111j80537
11482b77648C78736d7191a7229P540j92714B202J04852K62726C6884K23697L390
$$ y = [125270, -33651, 213252, 20514, 124230, 315586, -101876, -65509, -54677, 66689, 342242, 96952, 117910, 25027, -22157, 333199, 167083, 189948, 128875, -91395, 36465, -202027, -62962, -26969, -11809, 130388, 207746, 6131, -41553, -70947, 86061, 24231, -4014, 1090, 107586, 35110, -57336, 314767, 53533, -34872, 20078, -271243, 249248, -63797, 60057, -171085, 221084, -60077, 152655, 7699, 304240, -42689, 373620, 31273, -212399, 188016, 322898, 110956, 35248, 83104, 112069, -45322, 67616, -28348, 321005, 421895, 299712, -57596, 118107, 146133, 45986, 200794, -26309, 90838, 86003, 405330, 197968, 116476, -97111, -277648, 378736, -47191, -17229, -9689, -202403, 2202, 107054, 369780, 36884, 260581, 263971]
11471B63971j12052Q2893O0074a31610L0515A74006N6021o3463l8164h8860J4719
11460g4141A83668o2227g5322A70138c9951A64005a6080I1170K90215i4966C57745
11448F2360i520n2559a2605C9184K1667K01578a23772D6422a14700F7313e8107
11436D76618I8663J77112I0728c03407B48435B3694J7994R2078f9355m8340B23038
11424C29175D5777a59110B27888b3454j83404g5430A59780A6274J71530E0181
11413i3390B05570h4606c8408D17414A84081f7255C7115O5517A5992O8618L3036
11402A17646a69158B12749n5537G1369a37593A31883n0175p215K2895C9621L0028
11391F9649a74516B64995J24511F2557M6158P9196c4336C0225J76016a70861B76103
$$ y = [263971, 151919, 234812, 294886, -131610, -101095, 174006, 230027, 166564, 128400, -88860, -74141, 183668, 121441, -75322, 170138, -39951, 164005, -16080, 91170, 381385, -94966, 357745, 62360, -9520, -62079, -12605, 39184, 60851, 262429, -123772, 46422, -114700, 67313, -58107, 476618, 98663, 275775, 90728, -303407, 248435, 23694, 41688, 133766, -69355, -117695, 223038, 329175, 45777, -159110, 227888, -23454, -206858, -75430, 159780, 16274, 187804, 50181, -93390, 205570, -84606, -38408, 417414, 184081, -67255, 37115, 102632, 15992, 84610, 117646, -169158, 212749, 157212, 71369, -137593, 131883, 81708, 74493, 97388, 39621, 69649, -174516, 264995, 389506, 62557, 108715, 187911, -34336, 30225, 206241, -170861, 276103]
11379I8931c24280B93889j44832k2113a39338A09136a65862q5943A50357N2867
11369B03224F0592g9369r1729p0723J16479B0336J45722f2250K0766r0707f0591
11357d3395G6614b5839j08364A57623n2410K07347A30165d9206m7137A11902L4377
11346A46279p1045A5434d21249A6815J3912J46334J6215j7523b47738b4111G842
11334C6537j6503J37970a97025b8865B6629H7f2038r5573f785A1120J34874k0459
11322A25535J8345L5671a05764M613D2937O5518e6254A30619c5262r5424k7794
11311a58480B48015a27272R908d6494m33914H1106h5514k90482a00312B29336
11300C79200i3171j51688j43559A95972a19529N9275A5132K5531B06L50a395j26083
$$ y = [98931, -324280, 293889, 149057, 126944, -139338, 109136, -165862, -251805, 150357, 203224, 60592, -79369, -171098, -241821, -125342, 20336, 166058, -62250, -41484, -132191, -60591, -43395, 76614, -25839, -134203, 157623, 105213, 312560, 130165, -49206, -96343, 111902, 146279, 75234, 15434, -421249, 16815, 30727, 177061, 193276, 175753, -247738, -24111, 7842, 36537, 20034, 158004, -197025, -28865, 26629, 87, -62038, -157611, -6785, 11120, 145994, 125535, 143880, 179551, -105764, -101151, 42937, 108455, -56254, 130619, -35262, -130686, -158480, 248015, -127272, -117364, -46494, -480408, 81106, -85514, -375996, -100312, 229336, 379200, -93171, -244859, -388418, 195972, -119529, -60254, 15132, 40663, 206, 556, -1395, -127478]
11288a27478a7839g881j82084A94318i7919A37282L1728a38351H7750B2575K5632
11277D8207b27860f7611a5317k5558M593A79657a77637a2376D6078i2876g932
11265i1759k09197J35459j8021a5251j22918D8686h2526o351q940a4377C1773
11253F7182j7447h6969E3177a42509q9283l9104E1680c0219r6752e4671j69654
11242b24325J6798A12632b38037k13223g6226o1630J3589o709q2825L7851F7608
11230a260E2279K4135c04789e980n6499b6742B2132b16210A70603a74941L9214
11219a35727j15643H967J04007a28032A16611C2712a20606J5984A82744b97855
11208b98122I5276a9551k62908b7873q3850D8212K5832R1573J68712H0326L11
$$ y = [-127478, -17839, -7881, -189965, 194318, -97919, 137282, 169010, -138351, 87750, 22575, 48207, -227860, -67611, -15317, -40875, -36282, 179657, -177637, -12376, 46078, -92876, -7932, -91759, -300956, -165497, -183518, -15251, -138169, 48686, -82526, -88877, -97817, -14377, 31773, 67182, 49735, -86969, 53177, -142509, -231792, -270896, 51680, -30219, -126971, -54671, -224325, -207527, 112632, -238037, -451260, -76226, -137856, -124267, -130976, -213801, -175950, 67608, -1260, 52279, 76414, -304789, -5980, -62479, -26742, 22132, -216210, 170603, -174941, -135727, -251370, 8967, 112974, -128032, 116611, 32712, -120606, -104622, 182744, -297855, -298122, 95276, -19551, -282459, -27873, -111723, 48212, 74044, 165617, 334329, 80326, 80637]
11197H0637m0250f5952k00191I277J0230M6862J10457b19897G0724C3966b46706
11185A07457e2805n2004A9014J26041G006b62615a30754k23915J73771B54288
11174A54003g9788G9701j12a45798E5942e6205A69921a28010q2150H4741b37608
11162a66759j9876d7907H6971A9311K18047J43316b8318j63896l8571i4103r1568
11151a85671G6439B2051K9872Q1992A2578a03605C6728a52768j2739B43258h1965
11139I8891B6262f5823p1530c7052A81473K554b87308J21712G099J51398a21866
11127E6333b92725a12700B057c7584D5773a07371J4749C84157a2132F9738A516
11115C17384A10691J89635f9073C12805A03867b44152A6407L80869A26460P8042
$$ y = [80637, 40387, -65952, -266143, 9277, 19507, 66369, 176826, -219897, 70724, 33966, -246706, 107457, -52805, -104809, 19014, 145055, 7006, -262615, -130754, -354669, -180898, 254288, 154003, -79788, 79701, 79589, -145798, 55942, -56205, 169921, -128010, -210160, 84741, -237608, -166759, -186635, -47907, 86971, 19311, 237358, 380674, -28318, -192214, -230785, -94103, -185671, 76439, 22051, 51923, 133915, 12578, -103605, 36728, -152768, -165507, 243258, -81965, 98891, 26262, -65823, -137353, -37052, 181473, 184027, -287308, -165596, 7099, 158497, -121866, 56333, -292725, -112700, 2057, -37584, 45773, -107371, -92622, 384157, -12132, 69738, 1516, 317384, 110691, 300326, -69073, 312805, 103867, -244152, 16407, 397276, 126460, 204502]
11105B04502A6057B446J36701P0861O641K6827k5149H6091K28526j7657A5801
11093E33189H9494d0743A83425b43970A67741O8357P2420K08970C9862K85444
11083C25306J19879A71933L6566q4256j8224m7365J15389o1412N0793m7912c0883
11071B68311J75607c9318F69778B33963K93441j53889k0861j17322K55683j32247
11061C58768J90762J46941k06208o7123K39679k28072L1758K7282J2908M95254
11051A001949D74400J38004L80668N761p9802k95760Q2925k41238J65030M57229
11041A087217m28816J9770K27886C36523K68040K27521j52418J18237j63632J541
11031F35812j3099j74518M77540k20499k12710K71559j02785A85579L84006Q5877
$$ y = [204502, 16057, 2446, 139147, 210008, 216649, 243476, 218327, 86091, 314617, 296960, 15801, 533189, 89494, -40743, 183425, -243970, 167741, 236098, 308518, 517488, 39862, 325306, 445185, 171933, 208499, 124243, 106019, 58654, 174043, 112631, 163424, 115512, -30883, 268311, 443918, -39318, 669778, 233963, 527404, 373515, 352654, 235332, 491015, 358768, 549530, 696471, 490263, 423140, 662819, 434747, 466505, 493787, 506695, 1001949, 474400, 612404, 993072, 998833, 919031, 623271, 706196, 464958, 629988, 1087217, 658401, 678171, 906057, 336523, 604563, 832084, 679666, 797903, 634271, 635812, 622713, 448195, 925735, 705236, 492526, 764085, 661300, 185579, 569585, 655462]
11021F55462j46102J28608J34581l85348J53064J41505j50003k25344J16251j54753
11011B67921L20639K23407l26426j32938M626K97854k83241J21891K02941J20195
11001H16869m3534j15149J82702n0439J7644k81219J13446n5822j33483K61835
10991G12850J69997j41202r1656K32033J97896r9667J16317n10845K79072K92581
10981A157376j82256K24997k83443N71431K99074n2750L51313K98184J48438K94517
10971B826881q2677J9606J19313L7451j022869L29341k70129l26363J87763l26668
10961A491649J9902J76448N3172k62470J1878m5391K1233J28744l77199k89230
10951I28736k85222K71860k07632l46834K34604q6512j13691R0431h943C35897
$$ y = [655462, 509360, 637968, 772549, 387201, 540265, 681770, 531767, 306423, 422674, 267921, 588560, 811967, 485541, 352603, 357229, 655083, 371842, 493733, 696674, 816869, 773335, 658186, 840888, 790449, 808093, 526874, 640320, 584498, 451015, 712850, 882847, 741645, 649989, 882022, 1079918, 980251, 1096568, 585723, 864795, 1157376, 975120, 1200117, 916674, 1488105, 1787179, 1734429, 2085742, 2383926, 2532364, 2826881, 2744204, 2763810, 2883123, 2920574, 1897705, 2227046, 1956917, 1630554, 1818317, 1491649, 1511551, 1687999, 1741171, 1478701, 1490579, 1445188, 1466421, 1595165, 1217966, 928736, 643514, 915374, 707742, 360908, 595512, 509000, 395309, 485740, -8943, 335897]
10940F7737L70401j57401m3589l2483f1841o7369C2817R0838J25156K0706j24429
10929A45088h4182j19361H1242N5023c53413A67731B3443K02354j02572h6555
10918a73851A24999i4142c6694p9054B30785L3411C8676L24909H6229c34362E4126
10906D3128b3634G5558M065C3532P8222k7046h4859A29018j183J94401c30209
10894a19303l36c9027p3297l6463j26755a24786j30506B96937F1492L5707d5121
10882a5888l5117A86944D5130b16774E1738b26821B16335I742c35055G2955P672
10871H0627J26758a85275b6597A03902L6626a88926C5170i3084a0518k29602F3687
10859E3227K49825I0312c9777j8544l7941I2082p581b61755a00539H5509C6948
$$ y = [67737, 438138, 280737, 237148, 204665, -61841, -129210, 32817, 123655, 248811, 269517, 145088, -84182, -203543, 81242, 136265, -353413, 167731, 23443, 225797, 123225, -86555, -173851, 124999, -94142, -36694, -115748, 230785, 264196, 38676, 363585, 86229, -334362, 54126, 43128, -23634, 75558, 79623, 33532, 111754, 84708, -84859, 129018, 127835, 322236, -330209, -119303, -119639, -39027, -112324, -148787, -275542, -124786, -255292, 296937, 61492, 97199, -45121, -15888, -51005, 186944, 45130, -216774, 51738, -226821, 216335, 9742, -335055, 72955, 80627, 207385, -185275, -26597, 103902, 140528, -188926, 35170, -93084, -10518, -240120, 63687, 53227, 303052, 90312, -39777, -58321, -96262, 92082, 84501, -261755, -100539, 85509, 36948]
10847h0406B0579L1565G602b5638F3424a50892e3518l809P240J9160A08760b34915
10834G559a95777a4285G7066j1600a43285c1622j68045m4150A4732N1180J05935
10823A71847a17000k26802H6087K46712A34818a21083F2101f9542n9807p5242
10813b04591i18k9239F8758a02209j77587J0980B2951i042k73613A15035j3936
10802A01099h4008j13232e7386B3408O7449h0528B19237f2284l0613B3433J33290
10791A56723a44775j4459j71372h7066K1245C82905A91434b02341M6527B14343
10780H9059J85716i7078a6156C4138d0616l22295r0725a30702B56324f639H1797
10768a50840n1910R0326A26652b9524j26553B7014c78696E1393b02068A63817
$$ y = [-80406, 20579, 52144, 7602, -25638, 63424, -150892, -53518, -57327, -50087, -30927, 108760, -234915, 7559, -195777, -14285, 77066, 65466, -143285, -31622, -199667, -243817, 14732, 65912, 171847, -117000, -343802, 86087, 332799, 134818, -121083, 62101, -69542, -129349, -204591, -918, -30157, 68758, -102209, -279796, -268816, 22951, -9042, -282655, 115035, 101099, -84008, -197240, -57386, 23408, 90857, -80528, 219237, -62284, -92897, 23433, 156723, -144775, -159234, -330606, -87066, -65821, 382905, 191434, -202341, -155814, 214343, 89059, 274775, -97078, -16156, 34138, -40616, -362911, -453636, -130702, 256324, -6639, 81797, -150840, -202750, -112424, 126652, -29524, -156077, 27014, -378696, 51393, -202068, 163817]
10757A80591a13907H222N3481J77527a15855m6409A66773a1786D5434f4494j78478
10746b42972i9843j88497d2814n2550k10344a31831M2394c2767k5679a927j83588
10735a85515A9732f0720C13591A4718b42498a17211F4992Q1517f5981n47416a17474
10723B29119o1652a45181B27526Q808a34361A91321f6149E0588L6064o882L411
10712H3181R3602e0060q5833a505B5798M2665i7896d6040j36239A34825J10056
10701B44881G2054b15476A82099c8157B40874c42092A4202b38405p7740M7220
10691b68925g647l46300A96063g2648j62062J159C17198a56391m7005g2256A14378
10679c839k82067J6470B1401J40765a51622A20422C7353J08848l5273c78492a70608
$$ y = [180591, -113907, 8222, 61703, 239230, -115855, -162264, 166773, -11786, 45434, -64494, -242972, -99843, -288340, -42814, -95364, -305708, -131831, -89437, -32767, -58446, -1927, -185515, 19732, -60720, 313591, 14718, -242498, -117211, 64992, 146509, -65981, -613397, -117474, 229119, 167467, -145181, 227526, 236334, -134361, 191321, -66149, 50588, 86652, 79770, 83181, 176783, -50060, -135893, -1505, 25798, 68463, -97896, -46040, -182279, 134825, 244881, 72054, -215476, 182099, -38157, 240874, -342092, 14202, -238405, -316145, -268925, -7647, -353947, 196063, -72648, -234710, -233551, 317198, -156391, -203396, -72256, 114378, -3839, -285906, -269436, 21401, 162166, -151622, 120422, 37353, 146201, 110928, -378492, -170608]
10667F9309L4515b26944f6974A69848a90396i3639k932J7795k30341a42935m0784
10656a83719j50190i5105A26923d2828b1400A25814A7594c2849A99072g4229A00383
10644f7885A68561b67818A69316d31639a1940j41748m3369K2804B04098g7906
10633G860f2506k06090A3853i9941A7823H383b18862C5630L1826l1864b3994m5424
10621f9418L2664j21919j74261a0959E6053i7208p3588B6081O0732c9308q5188
10610a24496k38931i4654A00589b15043q1577B20413i7542I5331f5177D8003a91839
10598D2736a68078A27827J17703e1602B6799J83380a08766A21189a86715A2405
10587H3146c7122k0879H505a69205f6019B55450p2689o3830j7506f40k32259a01717
$$ y = [69309, 103824, -226944, -66974, 169848, -190396, -93639, -96571, -78776, -309117, -142935, -183719, -333909, -95105, 126923, -42828, -21400, 125814, 17594, -32849, 199072, -74229, 100383, -67885, 168561, -267818, 169316, -431639, -11940, -153688, -197057, -174253, 204098, -77906, 7860, -62506, -268596, 13853, -99941, 17823, 8383, -218862, 35630, 67456, 35592, -23994, -69418, -36754, -158673, -332934, -10959, 56053, -97208, -170796, 26081, 86813, -39308, -124496, -363427, -94654, 100589, -215043, -296620, 220413, -97542, 95331, -65177, 48003, -191839, 42736, -168078, 127827, 245530, -51602, 26799, 210179, -108766, 121189, -186715, 12405, 83146, -37122, -58001, 8505, -169205, -66019, 255450, 182761, 118931, 101425, -640, -232899, -101717]
10574c64849A32165D2855a95075M1623j5727A21770c752k48500d3679l22193d8336
10562i6352A50149C9474d26237a17286b8579L740E128a56414r3952c3523A27474
10550C6582j7606b51237E1145a13593A69614C9835J43455c45085h6890k40251
10540c27141A75434b07128J3616B5782a85373j99903a58202l95162c7827A01418
10529b56886f8111C8008N7187m4269d8517C2290F909d1601B99393a81640B62843
10517A8611J33003J8229b3330A01851l9308f9662D8166j9906e7962k36246L3416
10506b60792k24615B61685a45045r9345B22259k7967E7479c36873A33228A2550
10495f10869G5332i2653j08043G2829i8941I8643e3483O100A28652E6014d6229
$$ y = [-364849, 132165, 42855, -195075, -153452, -169179, 121770, -3752, -252252, -43679, -365872, -48336, -96352, 150149, 39474, -426237, -117286, -28579, -24839, 5128, -156414, -250366, -33523, 127474, 36582, 18976, -251237, 51145, -113593, 169614, 39835, 183290, -345085, -86890, -327141, 175434, -207128, -193512, 25782, -185373, -385276, -158202, -553364, -37827, 101418, -256886, -68111, 38008, 95195, 50926, -48517, 32290, 6909, -41601, 299393, -181640, 262843, 18611, 151614, 169843, -23330, 101851, 62543, -69662, 48166, 28260, -57962, -294208, -260792, -485407, 261685, -145045, -244390, 222259, 194292, 57479, -336873, 133228, 12550, -610869, 75332, -92653, -200696, 72829, -98941, 98643, -53483, -47383, 128652, 56014, -46229]
10483c7397A3994M42235A27000L53180A94289K70422A90238k7773K59F5186a43893
10471A65543j3539a04677c6378p1185B00901j5463M6568a43028C7647b36900O5238
10460a71662l0190K8998O644A92157b20464A59469a6156r5008j22894A62403p3982
10449H8421K22620j5910A12731c9424A11858B936e8616C0869b44644d7364A03601
10437i6957j33370d0167j22558A48243c20043f5722F0125R1504a47226A37360
10426A57019A1814b74869A74145a43927N0104q8305B46399F4355A7047O9368c1561
10414a50691B44019I6208P2590g6594G0748c6503k35118A18789c06554i3878A40992
10402a50018g115A23333a00139A72613n0140A182i5785d391A17080E6631K17203
$$ y = [-37397, 13994, 456229, 127000, 480180, 194289, 464711, 190238, 162465, 162724, 65186, -143893, 165543, 152004, -104677, -36378, -107563, 200901, 185438, 232006, -143028, 37647, -236900, -171662, -201852, -172854, -166210, 192157, -220464, 159469, -16156, -111164, -234058, 162403, 88421, 311041, 295131, 112731, -39424, 111858, 2936, -58616, 30869, -244644, -47364, 103601, -96957, -230327, -40167, -162725, 148243, -320043, -65722, 60125, 151629, -147226, 137360, 157019, 11814, -274869, 174145, -143927, -93823, -182128, 246399, 64355, 17047, 86415, -31561, -150691, 244019, 96208, 168798, -76594, 70748, -36503, -271621, 118789, -306554, -93878, 140992, -150018, -7115, 123333, -100139, 172613, 122473, 1182, -95785, -4391, 117080, 56631, 273834]
10391B73834I6164J91554F3386h8673P23b1367B9180i8643C7045d192A45939F8843
10378i6432E03856A9556K3924J4027J66163H9668b01793a5201l5466B74338K91925
10367E66263k26880P4189q2594m7163F7948i3906B05058c6054A93969a1891C7641
10355e2988A53844J62339m6922N1721O0124K1405j52003K85417d0384B19788J97412
10344D17200j26803K28515B57633J45165J62228k19925j47434a28646D10111j12566
10334B97545M013a46911B5915L8658P7107l299A0213N01945B37304d2009D1899
10322B82036H6073N9239D925M11111A3632J57207K0893a53889j20654A60543K3954
10311A84497a13010q7568g845E5530b6804j271c85j68067B97670h1650j21192
$$ y = [273834, 96164, 287718, 63386, -88673, -87950, -21367, 29180, -98643, 37045, -4192, 145939, 68843, -96432, 503856, 19556, 43480, 57507, 223670, 89668, -201793, -15201, -50667, 274338, 566263, 339383, 413572, 330978, 283815, 67948, -93906, 205058, -36054, 193969, -11891, 37641, -52988, 153844, 316183, 269261, 320982, 381106, 402511, 250508, 535925, -40384, 219788, 417200, 290397, 518912, 257633, 402798, 565026, 345101, 197667, -128646, 410111, 297545, 301558, -146911, 25915, 64573, 141680, 138381, 10213, 512158, 237304, -42009, 41899, 282036, 86073, 145312, 4925, 416036, 13632, 170839, 191732, -153889, -274543, 160543, 184497, -113010, -200578, -7845, 55530, -26804, -28075, -385, -168452, 297670, -81650, -202842]
10300b02842g7516A53614a39161A42110b44694E6968K23462A1409a26537K8890
10290i7647E9523f3083k23275A08371j1885m7220P0103c7102A07588a51372j13918
10279b65290C39207c92018a67802b0531j63559d5647k38007a35692o1134A36075
10268a79813B37633I6502J60055a73258h0533o6876B89643b65603B52502D1510
10257E07607j85410r5611l6244N0905f5995C19400a00805k09960F0767c02467
10246a1460l71136A01192a55707O6723p7768C53078H3551C1275a23327m6692A46723
10234C1377g4624C83525b95265L1562A70608c63464a45971A56612b43053q1105
10224c24158C5475Q5356d09231a27742r1841b9158H0360a75613j3350D1496N8648
$$ y = [-202842, -77516, 153614, -139161, 142110, -244694, 56968, 280430, 11409, -126537, -97647, 59523, -63083, -286358, 108371, 96486, 49266, 119369, -37102, 107588, -151372, -265290, 339207, -392018, -167802, -20531, -184090, -45647, -283654, -135692, -196826, 136075, -179813, 237633, 96502, 256557, -173258, -80533, -147409, 289643, -265603, 252502, 41510, 507607, 322197, 226586, 190342, 241247, -65995, 319400, -100805, -310765, 60767, -302467, -11460, -382596, 101192, -155707, -88984, -166752, 353078, 83551, 31275, -123327, -170019, 146723, 31377, -74624, 383525, -295265, -263703, 170608, -363464, -145971, 156612, -243053, -324158, 35475, 120831, -409231, -127742, -219583, -29158, 80360, -175613, -188963, 41496, 100144]
10213A00144a07026D9808K02204A04472K03109j47512l1352k1850e21185H4012
10202A0689a24598A3249a16527A8845e31677c1394k29780J05977B16053a07237
10191a29764p3625A74571a4349C5081J61824E1531g205C51140l5047a06959N1517
10180e5442A25205a79801B34934b12334e107A0851i9677A99625d00051C3208M4793
10169G8001a40440B58289i8023D5864N892h5297k484q2056A03648A5122d7235
10157a39521K3429A17282c45141A03238d3924B08210h3843B3872a14936A86017
10146E24235b11444l42767B3580J37710b78835d3288K1554A26631K47039a97885
10135a33803e1464j05440G7813a11759k54429a23355K0904l0467B8559R8441a26362
$$ y = [100144, -107026, 49808, 252012, 104472, 307581, 160069, 128717, 106867, -521185, 84012, 10689, -124598, 13249, -116527, 18845, -531677, -31394, -261174, -155197, 216053, -107237, -129764, -203389, 174571, -14349, 35081, 196905, 51531, -7205, 351140, 316093, -106959, -55442, 125205, -179801, 234934, -212334, -5107, 10851, -99677, 199625, -400051, 33208, 78001, -140440, 258289, -98023, 45864, 51756, -85297, -87781, -169837, 103648, 15122, -47235, -139521, -116092, 117282, -345141, 103238, -43924, 208210, -83843, 23872, -114936, 186017, 524235, -211444, -554211, 23580, 161290, -278835, -43288, -21734, 126631, 373670, -197885, -133803, -51464, -156904, 77813, -111759, -366188, -123355, -102451, -132918, 28559, 127000, -126362]
10123b2854E6163f1347j91656a289k06552a4129k65516a8713k92751B12450e9982
10111b29247H999d6714K2696l8950A6364b16843m8893b5748j63605h6082L4911
10100e1171b3566r9729a2662A7287a52656B6572a62558P1214C7885M5109c02069
10088c6505j19094a050A50262c592p5603A2231N1972b09858A29591b76224k14968
10077d91192G5379d0407B10400b17598E811b13368j02372D44489j29371b40811
10066B05238a38489b6407A2377b19829O2833B26809b29719a9566E064b5257j57336
10055a82593k51896b500F4820A08a18898L3129l7602B28169p6435b48240O8787
10044a79453b5597r6941o4006A21304c31003b4713j43095m584L7367j92644e1135
$$ y = [-22854, 56163, -61347, -253003, -1289, -207841, -14129, -279645, -18713, -311464, 212450, -59982, -229247, 8999, -46714, -24018, -62968, 16364, -216843, -265736, -25748, -189353, -86082, -51171, -23566, -123295, -12662, 17287, -152656, 26572, -162558, -91344, 37885, 82994, -302069, -36505, -155599, -1050, 150262, -3592, -79195, 12231, 64203, -209858, 129591, -276224, -491192, 75379, -40407, 210400, -217598, 5811, -213368, -315740, 444489, 315118, -240811, 205238, -138489, -26407, 12377, -219829, -156996, 226809, -229719, -19566, 5064, -25257, -182593, -434489, -2500, 64820, 108, -118898, -85769, -123371, 228169, 151734, -248240, -179453, -25597, -122538, -186544, 121304, -331003, -24713, -167808, -172392, -135025, -327669, -51135]
10032g2675j75303G2207b44531d9149k30603a33730E5530J01551b86246j906h3951
10020I5000k9736a01298E6719H358J57660b08060F41J06908a3855k3468G2510
10008c67631G0863a14131B18856c6743k6310B56786b58656Q8441A82783a25223
9997D2008e2013n7148A94881d09683J25497j80144h1658e722k65387A51181e4871
9985A177J1460J36825a05351l05240a63866d4265C7748b05589c4416K393q1635
9974a13658A28430b44786B82539i883k50658A7902d5930K1978j14474A50177b68589
9962B6665g5483B00743b42613O9704j097e6989k17453M9848j31104a44908a7797
9950c7574I3076f1158k1567k7495n6599L8395j33247A70979e9918p0845l66001
$$ y = [-72675, -247978, 72207, -244531, -49149, -279752, -133730, 55530, 157081, -286246, -288152, -83951, 95000, 65264, -101298, 56719, 8358, 166018, -208060, 641, 107549, -13855, -37323, 72510, -367631, 70863, -114131, 218856, -36743, -63053, 256786, -258656, -170215, 182783, -125223, 42008, -52013, -109161, 194881, -409683, -284186, -464330, -81658, -5722, -271109, 151181, -54871, 1177, 12637, 149462, -105351, -410591, -163866, -44265, 37748, -205589, -34416, -32023, -113658, 128430, -244786, 282539, -9883, -260541, 17902, -45930, -23952, -138426, 150177, -268589, 26665, -75483, 200743, -242613, -172909, -174006, -56989, -274442, -224594, -355698, -144908, -17797, -37574, 93076, -61158, -82725, -110220, -166819, -128424, -261671, 170979, -59918, -130763, -496764]
9939d96764J21843e9298r3510J8428B76252e13585h3938A265K10285c15250M0121
9928b75129G0471a38701j85414A62496b18937K7505n0942l9065A40062b18846
9917A89786N9987I7377i5834L5482E8874c48894C42367j62792c94686a32523m0095
9906a72618O068A25724B6242c5018j44370J2200A26425a60800B20634A3046a84883
9894d78961a25198N2583k19076a00756e520j11641C64026A2161J56756l5657a36600
9882G7497O8769f3406o4452m5623Q2010K3429J8809K1104k79907J10316B82618
9870b59435L9074J6641c3982q4982A50685a61181B2696c21538G3183c03371M9124
9859b54247a22647n1587M3521J8857A9983J71824c46082b0136o0811p6304f7970
$$ y = [-496764, -374921, -59298, -152808, -134380, 276252, -513585, -83938, 1265, 211550, -315250, -275129, 70471, -138701, -324115, 162496, -218937, -191432, -242374, -281439, 140062, -218846, 189786, 249773, 97377, -95834, -60352, 58874, -348894, 342367, 179575, -394686, -132523, -172618, -166550, 125724, 26242, -35018, -179388, -167188, 126425, -160800, 220634, 13046, -184883, -478961, -125198, -72615, -291691, -100756, -5520, -117161, 364026, 12161, 168917, 133260, -136600, 77497, 146266, -63406, -127858, -173481, -91471, -68042, -49233, -28129, -308036, -197720, 282618, -259435, -220361, -203720, -33982, -118964, 150685, -161181, 22696, -321538, 73183, -303371, -254247, -122647, -174234, -130713, -111856, 19983, 191807, -346082, -20136, -80947, -157251, -67970]
9847b80687A78938a55101A67151O8298b383l21586b3654a0711M194l65226i5185
9835A45818a9848j74319r077j65286h5027j75862f6778l59615G9089c06105a28575
9823d6728H4859B3240a91019f0888C8679c9808j36877N6418j63935c0389J3080
9812a7309I9797J18554J77269b06524o9162m8756C32655G071K9982a9788B03199
9800a1711j79737B69108e52315A64813a43923F7796d52235B53028a92269A47202
9789b31991J14062k26656H8815l1666a17486e7764A14613B5199J09974a14805
9778f2500l8802E0342J67871C2648J5619j6137a57161l7546k38628i4582A65081
9766b54358R4874F9081a32304j00074l4445I9810l0630a3759B4249K02645K78597
$$ y = [-280687, 178938, -155101, 167151, 235449, -2383, -323969, -23654, -10711, -6517, -371743, -95185, 145818, -19848, -194167, -203244, -368530, -85027, -260889, -66778, -426393, 79089, -306105, -128575, -46728, 84859, 23240, -191019, -60888, 38679, -39808, -176685, -120267, -284202, -30389, -17309, 99797, 218351, 395620, -206524, -275686, -324442, 332655, 7071, 37053, -19788, 203199, -11711, -191448, 269108, -552315, 164813, -143923, 67796, -452235, 253028, -192269, 147202, -231991, -117929, -344585, 88815, 57149, -117486, -57764, 114613, 25199, 135173, -114805, -62500, -101302, 50342, 218213, 32648, 48267, 32130, -157161, -194707, -433335, -94582, 165081, -254358, -159484, 69081, -132304, -232378, -266823, 99810, 69180, -13759, 24249, 226894, 505491]
9755E05491b53964A11417e1847o4873p6499B10848c67581a43494A45467o9097
9745G6370a07008J5392j02060b2848A75255e2452k20379P5865j13522i4264j62179
9734b56443D3176k0562Q1484a01047k5446B4388b37428g0233p2854p0874f9597
9722d931j9434A0037h3079A65708n0008e6330r5626K5189E9423J27824b02193
9710d6853G9377a03266m8598k32413g8728A1395J16763d11254B13608a7305l55691
9699c72996a78971h0427j44791l3386h4582k8361n694e3649j58751M5485c8282
9687I7445K55231j60426b77412J11997j95086A28126b62106c8830j71671k23169
9677d33670e4025C76608a31143n123o1472m3294J02012j15015l0022a31801H9659
$$ y = [505491, -253964, 111417, -51847, -116720, -193219, 210848, -367581, -143494, 145467, 76370, -107008, -91616, -193676, -22848, 175255, -52452, -272831, -196966, -310488, -94264, -256443, 43176, 22614, 104098, -101047, -126493, 24388, -237428, -70233, -143087, -213961, -69597, -4931, -24365, 10037, -83079, 165708, 115700, -56330, -151956, -126767, 59423, 187247, -202193, -46853, 79377, -103266, -151864, -384277, -78728, 11395, 128158, -411254, 213608, -17305, -372996, -178971, -80427, -225218, -258604, -84582, -112943, -118637, -53649, -212400, -166915, -38282, 97445, 352676, 192250, -277412, -165415, -360501, 128126, -262106, -38830, -210501, -433670, -54025, 376608, -131143, -136266, -197738, -241032, -139020, -254035, -284057, -131801, 89659]
9665a01084D8353a3523A97187J7282c61680a34416a7020k97880d6619k34255P3690
9654b07184A22340E7098a86957A9959e6349K6586r7426A26736g7956L1372l11712
9643c58296n4252C0798J22841a884C2662a41585E3085a67528j74156J58272P1805
9632a11607J5305A8988J13486A0910b77355J17149n4810p3002A10524b44459M1647
9621b02812l65543B71577a82175B39186G0252b39185n2598A59017c06925O2761
9611b44164a15188K5029q4566d0851l9823n7422A64868g6407C18085l9884a35123
9599a97757B6866a24433J838F828a3234k08838j7360r203J13456p9931A80570
9587A63775c36030d9377j42520J0990j87274F7103Q2792g6450D5525b6318B18046
$$ y = [-101084, 48353, -13523, 197187, 214469, -361680, -134416, -17020, -314900, -46619, -280874, -207184, 122340, 57098, -186957, 19959, -56349, -29763, -127189, 126736, -77956, -46584, -358296, -412548, 30798, 153639, -1884, 32662, -141585, 53085, -167528, -341684, -183412, -111607, -96302, 18988, 132474, 10910, -277355, -160206, -215016, -288018, 110524, -244459, -202812, -568355, 271577, -182175, 239186, 70252, -239185, -291783, 159017, -306925, -244164, -115188, -90159, -174725, -40851, -80674, -138096, 164868, -76407, 318085, 278201, -135123, -197757, 26866, -124433, -122595, 6828, -13234, -222072, -239432, -248635, -135179, -215110, 180570, 163775, -336030, -49377, -191897, -180907, -368181, 67103, 149895, -76450, 45525, -26318, 218046]
9575A6334K28274j10364P5390E5115h848A61202e0703j417o5182j19904j03071
9564c40277J62743F4733c14324a12100D1756P9833c0362A03886Q4515H3161a44238
9552a55714O1898k0191m9966L0857O126F0334Q6395c19094j91301K26572g6796
9540B47071a08506C8776K7917c44264B32958j882a43887H1869b09636G6003d9266
9528c45205c9540A06877D7321a37213k05703D22504b7285A86208f7288j41223
9518b08511A13020e77583b28519L5319l2311A05875i5586j82693J26133M2773
9508a09373d7905k6930p3754F715L47946f8807b2414k44971d3312k6642k09388
9497b79342J15735m5093I3560e04479a40306K9879N3411q2633A55656a05520b6038
$$ y = [16334, 244608, 134244, 209634, 55115, -8848, 161202, -50703, -52120, -117302, -237206, -340277, -177534, 64733, -314324, -112100, 41756, 121589, -30362, 103886, 188401, 83161, -144238, -155714, -93816, -114007, -163973, -133116, -126990, 60334, 146729, -319094, -510395, -283823, -76796, 247071, -108506, 38776, 66693, -344264, 232958, 231076, -143887, 81869, -209636, 76003, -49266, -345205, -39540, 106877, 47321, -137213, -342916, 422504, -27285, 186208, -67288, -208511, 113020, -577583, -228519, -193200, -225511, 105875, -95586, -278279, -152146, -109373, -47905, -74835, -148589, 6715, 354661, -68807, -22414, -267385, -43312, -69954, -279342, -163607, -208700, 93560, -504479, -140306, -110427, -57016, -139649, 155656, -105520, -26038]
9485F6144c62150J22756g3056J1146j1926a4382m15579B9112e5995B754i8397
9473A62152J5862k8583h4147l77043A09466a45597c6667o6268D28038h2799j9636
9462a02435H8679P877a64896b3378n561D0158b14151j25488f3816H5709e9294
9450E4316f8128L0500G5595c7639R730n5589G6988b58865G2375g9508l3688p1115
9438a84311j10671l9274a19286I938c27142f0756h522q5871o7582k7437A31037
9426E4742J61937A786K15099b13898h3125j56498i1330l8886C656P961J10028
9415A21645a08746a1201q5182H7980b278k11956g3280A10019K44976a333j42705
9404a44038b7837g478j48848n437M1709A14491a85153H1886L30404E6893j5310
$$ y = [66144, -362150, -239394, -73056, -61910, -73836, -14382, -429961, 29112, -55995, 2754, -98397, 162152, 178014, 149431, -84147, -461190, 109466, -145597, -36667, -102935, 428038, -82799, -102435, 88679, 96556, -164896, -23378, -28939, 40158, -214151, -339639, -63816, 85709, -59294, 54316, -68128, -37628, 75595, -37639, -27909, -83498, 76988, -258865, 72375, -79508, -113196, -184311, -294982, -334256, -119286, 9938, -327142, -60756, -8522, -94393, -161975, -189412, 131037, 54742, 216679, 1786, 216885, -213898, -83125, -239623, -91330, -130216, 3656, 11617, 121645, -108746, -11201, -96383, 87980, -2278, -214234, -73280, 110019, 354995, -1333, -144038, -27837, -7478, -156326, -161763, -120054, 114491, -185153, 81886, 412290, 56893, 41583]
9393D1583R5928c28474J35659Q4859B15995G1869b21499H0467h8378a5579l89920
9382d05499J37641d1800r100A93427D1593K457L4576a8902B36291p5831c4096
9370D9498j4924a20101A19282i7359A35252f2467r2024e003q7206m9927A2316
9358I9307N4195G1324O3523f8062E8625a86490i277G5501a53022G30f3335E9502
9345A13481b05595B25095a92434h037k24021B3299g7179B05025d4826l44711J22606
9334b66931A83332a56765N0660j78130A68768d03803A30620K03559l4587m3165
9324B56427c47430J30379j29488a3018F883P574a22911L0588j04517I036b04574
9312a65043d6828A50883a83080C86778a30037q8991D8840a32494d3233j35888
$$ y = [41583, 137511, -328474, -192815, -107956, 215995, 71869, -221499, 80467, -88378, -15579, -405499, -267858, -41800, -50900, 193427, 41593, 44050, 78626, -18902, 236291, 160460, -34096, 49498, 34574, -120101, 119282, -97359, 135252, -62467, -154491, -5003, -92209, -142136, 12316, 99307, 153502, 71324, 134847, -68062, 58625, -186490, -9277, 75501, -153022, 730, -63335, 59502, 113481, -205595, 225095, -192434, -8037, -232058, 23299, -77179, 205025, -44826, -389537, -266931, 183332, -156765, -106105, -284235, 168768, -403803, 130620, 334179, 299592, 256427, -347430, -217051, -346539, -13018, 6883, 14457, -122911, -92323, -196840, 9036, -204574, -165043, -46828, 150883, -183080, 386778, -130037, -219028, 48840, -132494, -43233, -179121]
9302a79121A88644d1796m2701H1641N6067g5290k18414A4495J16442d98719D31633
9290g6817e249G1810f2247j61228B4947f9724n9104A97329B2758H092a58391E4425
9277a13294E3977a23283K7914M3749k01278G7776a09511a6309E5120h0996A76652
9265a12933r3285K129A19040j2504a20025b1931q667k06972L1529G4562l10b03242
9252a24602n6328r8881L9999C42285e66311D6598a93440k17552J95808R9003l07943
9241d24124q2434F4046c1443A73525h2638j17775L2545a2303A44219a83448k53019
9230d36467B16030E0516b49366d2520j02701K4474o8418E797J18524b08328A12302
9218b16371B78253o2959a87383A47456f2691j55979A35511g0773A96833a96746
$$ y = [-179121, 188644, -41796, -84497, 81641, 137708, -75290, -293704, 14495, 130937, -498719, 431633, -76817, -5249, 71810, -62247, -223475, 24947, -69724, -128828, 197329, 22758, 8092, -158391, 54425, -113294, 53977, -123283, -95369, -51620, -252898, 77776, -109511, -16309, 55120, -80996, 176652, -112933, -206218, -204089, 119040, 106536, -120025, -21931, -30598, -237570, -206041, 74562, 74252, -203242, -124602, -180930, -279811, -239812, 342285, -566311, 46598, -193440, -410992, -215184, -116181, -424124, -506558, 64046, -31443, 173525, -82638, -200413, -167868, -12303, 144219, -183448, -436467, 216030, 50516, -249366, -42520, -145221, -120747, -189165, 5797, 124321, -208328, 112302, -216371, 278253, 215294, -187383, 147456, -62691, -218670, 135511, -70773, 196833, -196746]
9207D9792a51347A78865g847k24403C4606b87771A26996b08868f1537A35862e6685
9195A78166E7451a54334f3532A56067e9869k67311j414a26391J4642A44025a72369
9183H7397h8007k17817O185G38a4389A22001d33487d6632j31496e654k75690B71729
9170a56070f6511k79681D9691o952a80633q1008C81780b69612J01181P3457B53083
9158f9663j30921F7694c69885a29076A20957A8684g0260a9260j9668k02539J01550
9147a39917f0781E8536a47432C5336a35369b1827j47530k51073J62961N0227P0398
9136a36844O6749M041A8459b89875A91294F5575b4641k25598i2096E3309d3753
9124a5754A57193a03981I0177I540g4363n8166C5355j5480a61355e4805n6113
$$ y = [49792, -151347, 178865, -7847, -232250, 34606, -287771, 126996, -208868, -61537, 135862, -56685, 178166, 57451, -154334, -63532, 156067, -59869, -327180, -328594, -126391, -111749, 144025, -172369, 87397, -88007, -305824, -299639, 738, -14389, 122001, -433487, -46632, -178128, -5654, -281344, 271729, -156070, -66511, -346192, 49691, 42739, -180633, -261641, 381780, -269612, -168431, -94974, 253083, -69663, -200584, 67694, -369885, -129076, 120957, 18684, -70260, -19260, -38928, -241467, -139917, -60781, 58536, -147432, 35336, -135369, -21827, -169357, -420430, -257469, -207242, -136844, -70095, -66054, 18459, -289875, 191294, 65575, -24641, -250239, -92096, 53309, -43753, -15754, 157193, -103981, 90177, 9540, -74363, -132529, 35355, 19875, -161355, -54805, -110918]
9113a10918o4899q8765a15303B01625c85314H6142a54569j02203B43507a75793
9102E707a74958j23935B180c05595a37492j45537A55134B8614h6071j95649B4367
9090A35791c83144G869P2112C6215b35638f2959j26511H435M16637H5660b36718
9078C373O2984J66406e7848D110b48070D07958c18132c5395H5894g8299k07035
9067b85334G7256C7274a35553N4333A6640e5773k08607p6092I0080e1882d656
9055E0966a75907O1409E6042h7408k43313B50665C5413j2308h4962A43523A8277
9043c93897A80305d40F3811J5452g4361n6548q2926C2774i645l86740a35834p845
9031a43679j21614B56516A12474J7506a86729G8906b61095a9648o6157j28407
$$ y = [-110918, -175817, -264582, -115303, 201625, -385314, 86142, -154569, -256772, 243507, -175793, 5707, -174958, -298893, 2180, -305595, -137492, -283029, 155134, 28614, -86071, -281720, 24367, 135791, -383144, 7869, 79981, 36215, -235638, -62959, -189470, 8435, 425072, 85660, -236718, 3373, 66357, 232763, -57848, 4110, -248070, 407958, -318132, -35395, 85894, -78299, -285334, 77256, 37274, -135553, -81220, 16640, -55773, -264380, -340472, 90080, -51882, -4656, 50966, -175907, -114498, 56042, -87408, -330721, 250665, 35413, 23105, -84962, 143523, 18277, -393897, 180305, -440, 63811, 79263, -74361, -130909, -213835, 32774, -9645, -396385, -135834, -143679, -265293, 256516, 112474, 129980, -186729, 78906, -261095, -19648, -85805, -214212]
9021b14212F6188b1168B65881F2396M979P6788B6731a62777j00703A27644e7488
9009c0702B06934F9148a85954j38491A72816c93652J88560A07078B1164b48201
8998A8262b48878J05647G0106c02681O1757n4573e2587B0894c5713C38561a73024
8986a31087A82175a3703a869I5393a19493A35856c1779k12211N8950o8174k33138
8975d86352K36337f5966B16620a23145A45106a79673A78968n4087a83141h153
8964C4063f2114D37941g0464j25950B52144p4585a74601o0742k27066A69243o0599
8953A08644a29658G3566k303a77985E5381b40052R6162A03001G732i4178A2685
8941b5874k35740A05976J9654H594J16077J89845A32222o5861B4391a31891k605
$$ y = [-214212, 66188, -21168, 265881, 62396, 67375, 144163, 26731, -162777, -263480, 127644, -57488, -30702, 206934, 69148, -185954, -324445, 172816, -393652, -205092, 107078, 21164, -248201, 18262, -248878, -143231, 70106, -302681, -240924, -295497, -52587, 20894, -35713, 338561, -173024, -131087, 182175, -13703, -1869, 95393, -119493, 135856, -31779, -243990, -185040, -253214, -486352, -250015, -65966, 216620, -123145, 145106, -179673, 178968, 124881, -183141, -8153, 34063, -62114, 437941, -70464, -196414, 252144, 177559, -174601, -235343, -462409, 169243, 108644, -129658, 73566, 71263, -177985, 55381, -240052, -143890, 103001, 7732, -94178, 12685, -25874, -261614, 105976, 125630, 8594, 124671, 314516, 132222, 66361, 24391, -131891, -134496]
8930a34496o074A95784i3926A79894n9535J55885M79156J923857M374402J482657
8920H536316D077633A369736C00828J55964Q940a96082A0335L95967c22951C7430
8909I932J97563L17238B09296D2994J93275g9920E1620C559a39745o5542i4580
8897A16189g8037B33217A8088b58084a19692F9510l0056K543J741a06410j2524
8886a18934j05889C5473a65563O0417b2934A35273a10523p5825h7628I582b09923
$$ y = [-134496, -140570, 195784, -93926, 179894, 120359, 276244, 755400, 2679257, 7053659, 8536316, 4077633, 1369736, 300828, 456792, 465732, -196082, 10335, 406302, -322951, 37430, 9932, 207495, 524733, 209296, 42994, 236269, -79920, 51620, 3559, -139745, -205287, -94580, 116189, -78037, 233217, 18088, -258084, -119692, 69510, 39454, 41997, 43738, -106410, -118934, -224823, 35473, -165563, -105146, -22934, 135273, -110523, -186348, -87628, 9582, -209923]
$$ [...]
##END NTUPLES=NMR SPECTRUM
##END=
