
##TITLE=UV1104_M1_1161-1249_7180354_UJUVtSyq49
##JCAMPDX= 6.0         $$ Bruker NMR JCAMP-DX V2.0
##DATA TYPE= NMR SPECTRUM
##DATA CLASS= NTUPLES
##ORIGIN= BRUKER
##OWNER= Administrator
$$ 1.72 TOPSPIN		Version 2.1
$$ 2012-12-05 04:54:26.939 -0500  Administrator@X
$$ Compression mode = diff/dup
##.OBSERVE FREQUENCY= 400.02188249412
##.OBSERVE NUCLEUS= ^1H
##.ACQUISITION MODE= SIMULTANEOUS (DQD)
##.ACQUISITION SCHEME= undefined
##.AVERAGES= 8
##.DIGITISER RES= 22
##SPECTROMETER/DATA SYSTEM= spect
##.PULSE SEQUENCE= zg30
##.SOLVENT NAME= COFFEE_meoh
##.SHIFT REFERENCE= INTERNAL, COFFEE_meoh, 1, 14.98509
##AUDIT TRAIL= $$ (NUMBER, WHEN, WHO, WHERE, PROCESS, VERSION, WHAT)
$$ ##TITLE= Audit trail, TOPSPIN		Version 2.1
$$ ##JCAMPDX= 5.01
$$ ##ORIGIN= Bruker BioSpin GmbH
$$ ##OWNER= Administrator
$$ $$ E:\/data/COFFEE/nmr/UV1104_M1_1161-1249_7180354_UJUVtSyq49/10/pdata/1/auditp.txt
$$ ##AUDIT TRAIL=  $$ (NUMBER, WHEN, WHO, WHERE, PROCESS, VERSION, WHAT)
(   1,<2012-12-05 04:54:18.830 -0500>,<Administrator>,<X>,<go>,<TOPSPIN 2.1>,
      <created by zg
	started at 2012-12-05 04:53:12.094 -0500,
	POWCHK enabled, PULCHK disabled,
       configuration hash MD5:
       86 BA 57 50 F2 9D 5C 9B 26 00 A9 28 5F 66 2E 89
       data hash MD5: 64K
       E3 D5 79 F5 EC 1F FE CC 0F AE C0 FF 38 F8 EC 31>)
(   2,<2012-12-05 04:54:21.955 -0500>,<Administrator>,<X>,<proc1d>,<TOPSPIN 2.1>,
      <Start of raw data processing
       efp LB = 0 FT_mod = 6 PKNL = 1 PHC0 = 0 PHC1 = 0 SI = 32K 
       data hash MD5: 32K
       16 30 5A 47 71 80 73 2E 5F F6 73 5D 7E 2F 3A 95>)
(   3,<2012-12-05 04:54:22.424 -0500>,<Administrator>,<X>,<proc1d>,<TOPSPIN 2.1>,
      <pk PHC0 = 93.89465 PHC1 = 0 
       data hash MD5: 32K
       FF 38 7E 1A C4 71 FD 98 66 48 13 38 F2 DD A8 6E>)
(   4,<2012-12-05 04:54:22.642 -0500>,<Administrator>,<X>,<proc1d>,<TOPSPIN 2.1>,
      <abs ABSG = 1 
       data hash MD5: 32K
       9E 74 DB DD 22 5A 08 A7 2D AB 53 B3 FC 19 FC 09>)
(   5,<2012-12-05 04:54:22.783 -0500>,<Administrator>,<X>,<proc1d>,<TOPSPIN 2.1>,
      <abs ABSG = 2 
       data hash MD5: 32K
       C2 BA 4B E1 55 B1 A9 F2 6A 23 AF 23 ED 97 1F 1E>)
(   6,<2012-12-05 04:54:22.924 -0500>,<Administrator>,<X>,<proc1d>,<TOPSPIN 2.1>,
      <abs ABSG = 3 
       data hash MD5: 32K
       38 AD 3E CC FC 84 FD 09 22 4F 69 B2 FA D7 5B 36>)
(   7,<2012-12-05 04:54:23.080 -0500>,<Administrator>,<X>,<proc1d>,<TOPSPIN 2.1>,
      <abs ABSG = 4 
       data hash MD5: 32K
       14 C3 92 6F 4C B5 C0 F9 FB 45 58 43 7D 0D 3A 28>)
(   8,<2012-12-05 04:54:23.236 -0500>,<Administrator>,<X>,<proc1d>,<TOPSPIN 2.1>,
      <abs ABSG = 5 
       data hash MD5: 32K
       05 79 6C D4 E1 BD B1 A4 BD 06 F3 08 97 18 72 75>)
$$ ##END=
$$ 
$$ $$ hash MD5
$$ $$ D8 02 35 B0 D4 01 E1 65 B7 79 78 9F 73 F4 8D BB
##$RELAX= 
##$RELAX= 
##$RELAX= 
##$RELAX= 
##$RELAX= 
##$RELAX= 
##$RELAX= 
$$ Bruker specific parameters
$$ --------------------------
##$DU= <E:\>
##$EXPNO= 10
$$ [...]
150 150 150 150 150 150 150 150
##$TP07= 0
##$TPNAME0= <>
##$TPNAME1= <>
##$TPNAME2= <>
##$TPNAME3= <>
##$TPNAME4= <>
##$TPNAME5= <>
##$TPNAME6= <>
##$TPNAME7= <>
##$TPOAL= (0..7)
0.5 0.5 0.5 0.5 0.5 0.5 0.5 0.5
##$TPOFFS= (0..7)
0 0 0 0 0 0 0 0
##$TUNHIN= 0
##$TUNHOUT= 0
##$TUNXOUT= 0
##$USERA1= <user>
##$USERA2= <user>
##$USERA3= <user>
##$USERA4= <user>
##$USERA5= <user>
##$V9= 5
##$VALIST= <valist>
##$VCLIST= <CCCCCCCCCCCCCCC>
##$VD= 0
##$VDLIST= <DDDDDDDDDDDDDDD>
##$VPLIST= <PPPPPPPPPPPPPPP>
##$VTLIST= <TTTTTTTTTTTTTTT>
##$WBST= 2048
##$WBSW= 25
##$XGAIN= (0..3)
0 0 0 0
##$XL= 0
##$YL= 0
##$YMAX_a= 625691
##$YMIN_a= -532341
##$ZGOPTNS= <>
##$ZL1= 120
##$ZL2= 120
##$ZL3= 120
##$ZL4= 120
##$ABSF1= 14.98509
##$ABSF2= -5.573092
##$ABSG= 5
##$ABSL= 3
##$ALPHA= 0
##$AQORDER= 0
##$ASSFAC= 0
##$ASSFACI= 0
##$ASSFACX= 0
##$ASSWID= 0
##$AUNMP= <proc_prof1d_extract_pilot.lims>
##$AXLEFT= 0
##$AXNAME= <>
##$AXNUC= <1H>
##$AXRIGHT= 0
##$AXTYPE= 0
##$AXUNIT= <>
##$AZFE= 0.1
##$AZFW= 0.1
##$BCFW= 0
##$BC_mod= 0
##$BYTORDP= 0
##$COROFFS= 0
##$CY= 15
##$DATMOD= 1
##$DC= 0
##$DFILT= <>
##$DTYPP= 0
##$F1P= 0
##$F2P= 0
##$FCOR= 0.5
##$FTSIZE= 32768
##$FT_mod= 6
##$GAMMA= 0
##$GB= 0
##$INTBC= 1
##$INTSCL= 1
##$ISEN= 128
##$LB= 0
##$LEV0= 0
##$LPBIN= 0
##$MAXI= 10000
##$MC2= 0
##$MEAN= 0
##$ME_mod= 0
##$MI= 0
##$NCOEF= 0
##$NC_proc= -8
##$NLEV= 6
##$NOISF1= 0
##$NOISF2= 0
##$NSP= 0
##$NTH_PI= 0
##$NZP= 0
##$OFFSET= 14.98509
##$PC= 1
##$PHC0= 93.89465
##$PHC1= 0
##$PH_mod= 1
##$PKNL= yes
##$PPARMOD= 0
##$PPDIAG= 0
##$PPIPTYP= 0
##$PPMPNUM= 2147483647
##$PPRESOL= 1
##$PSCAL= 4
##$PSIGN= 0
##$PYNMP= <proc.py>
##$REVERSE= no
##$SF= 400.02
##$SI= 32768
##$SIGF1= 0
##$SIGF2= 0
##$SINO= 400
##$SIOLD= 32768
##$SPECTYP= <>
##$SREGLST= <1H.CDCl3>
##$SSB= 0
##$STSI= 32768
##$STSR= 0
##$SW_p= 8223.68421052631
##$SYMM= 0
##$S_DEV= 0
##$TDeff= 65536
##$TDoff= 0
##$TI= <>
##$TILT= no
##$TM1= 0
##$TM2= 0
##$TOPLEV= 0
##$USERP1= <user>
##$USERP2= <user>
##$USERP3= <user>
##$USERP4= <user>
##$USERP5= <user>
##$WDW= 1
##$XDIM= 32768
##$YMAX_p= 485394273
##$YMIN_p= -746053
##$CURPLOT= <Network HP LaserJet P1505>
##$CURPRIN= <$Network HP LaserJet P1505>
##$DFORMAT= <normdp>
##$LAYOUT= <+/1D_H.xwp>
##$LFORMAT= <normlp>
##$PFORMAT= <normpl>
##$SURQMSG= 1
$$ End of Bruker specific parameters
$$ ---------------------------------
##NTUPLES= NMR SPECTRUM
##VAR_NAME=  FREQUENCY,     SPECTRUM/REAL,   SPECTRUM/IMAG
##SYMBOL=    X,             R,               I
##VAR_TYPE=  INDEPENDENT,   DEPENDENT,       DEPENDENT
##VAR_FORM=  AFFN,          ASDF,            ASDF
##VAR_DIM=   32768,         32768,           32768
##UNITS=     HZ,            ARBITRARY UNITS, ARBITRARY UNITS
##FACTOR=    0.250966925370066, 1,           1
##FIRST=     8223.43324360094, -43439,       -54835
##LAST=      0,             21255,           -113907
##MIN=       0,             -746053,         0
##MAX=       8223.43324360094, 485394273,    0
$$ Real data points
##PAGE= N=1
##DATA TABLE= (X++(R..R)), XYDATA
$$ [...]
23869 -27257 25304 293676 -103880 -296017 -254467 -284935 95402 62886 -95346 -213052 86473
23857 64757 424255 176044 64413 -18475 -43529 199145 -166584 84387 46493 260220 -50347
23845 -299788 -70545 -74374 144647 -56921 -127955 152940 -80374 -75844 509 -240834 89429 48919
23833 48919 13613 -184413 38363 241033 237539 222563 -26962 -315563 182578 -209775 206730
23821 -171397 -35088 134591 108000 94984 -53737 113492 64388 130440 -109061 159662 34299
23809 -40358 -46713 89957 108144 29710 -91221 362906 320907 155324 -225363 -364239 -108695
23797 22272 -174518 152082 42426 -46307 142730 -121197 44461 76606 -23091 158540 -164815
23785 34503 -95619 287672 57072 18874 -39995 111791 -36451 -374942 48492 26399 -74653
23773 -155423 387616 -110363 -274711 -384105 230993 -76866 180788 49163 -29468 98699
23762 29152 -35210 154973 -118414 16388 -290891 73558 -87285 -22614 66924 77768 -236651
23750 -206156 -209749 257328 312364 3917 -60100 -206500 233881 114659 10907 207756 -11635
23738 -193625 -70587 -47555 -83859 -32578 102084 -197817 -84966 -95767 -72250 153281 -29457
23726 22909 -290422 -290969 -87890 3508 -162076 -241106 148324 115841 -105029 68597 -109674
23714 -343650 184639 74862 76143 -92639 44031 -78212 64732 -264440 396348 3479 -169223
23702 163941 159697 -36975 -93300 -340604 -440120 -153212 86338 109886 -59498 131549 -235481
23690 -308063 11568 128809 143872 144607 261832 -491782 208866 -309564 64410 -259845 79852
23678 210568 -309271 111494 217536 59152 22092 -46721 52812 -66238 99747 -291955 -298817
23667 -298817 -266891 78102 -141211 45634 -73713 145822 -87956 -350545 -89689 179 -399583
23655 -63173 -303328 -260994 79974 146832 115658 -215498 -3139 -73095 414728 -25071 -193219
23644 -193219 110807 -271185 77113 68487 -97590 156473 -107976 9488 -262439 -136902 137348
23632 271815 170000 -106356 198131 281264 -229790 -227732 -30046 -90160 -117306 69133 -332953
23620 -91281 -271204 -70185 -198071 5168 -295148 77648 81039 -66422 289481 -7450 -65141
23609 -65141 245157 354432 -362339 161985 149118 -424553 -92089 -244539 435470 -73837
23598 155168 94292 -292360 211244 160534 396355 -30485 165720 76854 73353 33902 -95115
23586 194497 70548 91205 -241344 -153862 257562 -64639 72375 92804 -221274 85435 92736
23575 92736 81359 11102 9239 -44908 -137439 -45388 301076 49272 -212864 -188448 241340
23563 -318941 -81293 -326158 103777 -140428 457843 -84371 -144076 -72130 17285 -99223 42020
23551 -301108 164480 -220615 -281074 97555 -260024 -313351 -60781 41636 246958 23132 40340
23540 40340 -298643 -93035 -76918 41766 -40826 -150873 268 -279636 439561 -167013 49502
23528 46455 -82210 59716 340461 -100645 -271737 -202678 250378 43539 46731 274955 13061
23516 -7321 28775 38766 -30596 141452 137358 -116681 -114247 -20914 -86863 -159353 119665 101167
23504 101167 202183 40894 102962 18316 -288257 87358 225800 -17709 -116662 137087 39442
23492 327417 92850 -93717 38583 168342 -175477 -626 -212756 -2191 112492 72062 190246
23481 190246 40635 56847 -105558 -228332 -356897 -171033 -238749 -13785 -117270 106832
23470 -346790 103848 -31941 81338 -40043 -142632 -55458 -528849 79108 90178 -352681 -213285
23459 -213285 21775 -210592 -79076 207363 28851 251036 -150098 3465 364029 -26775 362638
23447 -84721 -2465 -138049 180650 -59098 244441 -137381 -99217 -83381 43396 -177338 211763
23435 256283 -228205 -129493 257496 61261 -238350 45696 -214947 -349037 -267683 -174218
23425 -174218 -142693 58686 -31980 -129841 -110036 -13261 -161232 -20394 -189220 -59915 -103581
23414 -103581 -169137 81692 -105215 -12431 66959 -186448 -66656 171175 157865 -213779 -191981
23403 -191981 83829 130786 -51232 167525 -375072 -250391 37376 195705 10533 67698 -263375
23391 80617 29782 -263840 282432 -114485 220812 72618 307122 -95883 -32880 -151500
23381 -151500 -229996 -137902 -271912 86022 -69852 -43525 -55676 -66072 208961 -43555 330448
23369 -174670 44662 148194 63036 -196216 266533 -131921 -32905 66305 -155911 101873
23358 -162953 -116787 -48199 188288 125965 -132503 -280046 164006 -124677 -66864 -204754
23348 -204754 -212143 -182691 202701 -74220 -87288 -7634 -90288 -33280 -140579 50179 -23331
23336 28232 16050 -138950 132660 32074 127338 39510 128868 79069 -158549 49175 21352
23324 -67622 -156613 -252498 255563 210262 211299 -384179 -12488 322812 217471 -478852 193017
23312 135252 10179 169225 6723 198818 -56218 -128719 22960 -84389 10929 -179479 -244171
23301 -244171 -99115 -399578 -68079 -233532 -164971 144850 360874 234991 -62583 132293
23290 -90291 -161492 75893 -19056 -241510 -244106 79633 119428 19275 -236294 -329229 -44079
23278 -164036 -32638 -11476 -42574 -53829 -425238 -116693 -43999 -270819 -25363 29887 -348776
23266 -48639 -42561 -89282 127145 -85838 170384 674356 -71935 271887 -64857 58870 -170059
23254 -6163 103112 -49317 245355 65088 -37586 -84932 -213566 -93909 -109518 -253058 -3228
23242 203715 -4778 -27983 -84844 150871 113590 267262 -19854 54615 -110246 -10201 50761
23230 -123799 51701 316325 -11892 -217719 -182793 42207 -273658 -188309 46915 -153713 -32498
23218 192466 -500779 263425 -214833 -32913 264140 -55768 -266268 -50555 -319505 236046
23207 -90084 -388752 126384 104946 219840 -65487 79639 -258643 179365 253837 47569 -197582
23195 307932 132188 72564 -132176 -244109 -412011 109185 136124 -134790 -397362 -529
23184 -494053 -79679 155162 61576 122285 -67817 41208 -319483 110511 31987 -138182 208677
23172 -71176 -154490 -267235 -73141 -242428 -390 -277594 -16991 130894 -45436 -57366 -205366
23161 -205366 -33347 -164134 -436112 82855 -162950 192550 73013 107064 182948 230834 20813
23149 -154738 -253278 -162385 -129784 45705 140304 7244 -62274 -47539 -119436 -152452 -186763 -29960
23136 -32910 67590 -155088 255119 12646 56529 249932 118515 35547 2883 103754 -87432
23124 357127 119170 245752 81425 -176892 139819 30493 -87041 -259261 -76157 32284
23113 141566 69540 141333 -34043 -387396 105254 53204 -239204 -172646 -276424 -188402 119518
23101 -51845 210132 67784 -35873 -80660 -58577 -49493 -191639 -212459 40742 -191940 172041
23089 -103147 26664 -46313 62697 -356256 35147 -78409 184887 190160 9321 -338479 -45532
23077 -315463 180599 215833 -39568 -163051 -268107 122818 -39378 388851 61715 -101798
23066 -142603 -140415 62337 2068 -118403 -16931 32097 45899 -54535 3484 -66509 265566 -305783
23053 18240 -113693 318468 -80703 -10356 -43448 -12013 30093 -298822 31795 114512 -39581
23041 -154745 -207150 240623 -188960 11259 156238 -271895 -40269 135569 67171 173388
23031 173388 182070 -313292 77800 197350 -165321 -13305 1984 -339075 -55970 -22101 146037
23019 -197598 60105 -157846 250997 24018 -12111 -259857 -16267 172931 -180550 -382810
23009 -382810 44302 -104784 -80449 101993 -66575 -93325 106945 -233469 88448 40845 -214641
22997 50709 81200 234583 54223 -66309 -14353 -71823 -417616 -194136 169952 -211033 -202918
22986 -202918 -84577 369334 308078 116484 -94608 -205611 -133805 212056 21466 27612 -204735
22974 127891 -108531 64745 -39669 -165276 -4147 44474 -200589 202506 182223 -50717 -183922
22963 -183922 -40981 6542 172093 22853 -297305 -139461 44507 -95871 28520 -14796 33437
22951 77221 -208857 430590 233603 -43489 44749 92349 -148470 -90957 -141696 -21411 -67261
22940 -67261 12612 -224624 145946 -7526 -50743 -29047 195904 173249 -163284 -338093 -113797
22928 -250671 -202340 27142 26834 -92907 188116 -26009 -171493 -106059 83886 43148 -71088
22916 -101644 -210397 30422 -402070 382429 -79613 -51925 312831 -145779 -45614 55348
22905 -28550 -73643 108614 -192195 224888 210271 77266 -282894 -189043 15862 -52374 -371709
22894 -371709 89124 -202436 -52278 -118561 -64430 -177681 -84583 -42112 -372892 -95140 -146102
22883 -146102 181556 -12300 -158042 90922 -247342 -61998 -166612 -218515 6604 186866 -215804
22871 28119 159935 -209677 -258140 -2293 293224 -368423 -45107 60702 -747 385718 45093
22859 -114593 82799 253029 18900 119997 -58100 -64395 -219769 148596 56370 -58771 142602
22847 -14152 17672 -33105 -28958 -17882 -151109 72939 -99121 265619 -225121 -125986 -75725
22836 -75725 -266000 -19572 -247876 -177353 222326 -60419 -134239 29531 219736 -96194 14291
22824 -52564 48076 120457 -107337 -352466 -279559 173044 175733 -199576 301407 -259591 6599
22812 230521 34454 -85544 -179227 271361 -163047 206202 -84777 -90616 -89529 -161093 -434435
22801 -434435 -194810 -87090 -71977 189505 -326619 -226976 -144898 -384686 -399091 -5241 -91217
22790 -91217 92362 140604 -43393 -88348 -244121 -161374 -250512 -238963 185430 343945 -168571
22778 -175834 289223 -334537 -71533 131739 -349240 -261923 397301 252633 -270653 34133
22767 60713 32610 118269 10479 49508 -331417 -152671 294321 -140082 28566 150048 77848
22756 77848 23617 291753 -97986 60592 78675 -221504 48630 394875 44536 -120267 -113181
22745 -113181 -79951 -31814 -297672 36788 232331 -88569 -253306 5852 -41863 116111 124213
22734 124213 33300 -84232 20378 -88447 77925 -97980 77354 -80112 -32645 -41154 -81765 321802
22721 -162010 -72707 109694 -201013 -159623 20112 -19751 -346299 264430 257993 133729 64613
22709 557 -97489 98547 95478 -213532 296847 -163897 -337394 69627 197849 -87795 -43107
22697 -73695 -113607 -21889 -123097 81532 -131068 8964 384386 -148524 102415 -230496 -33832
22685 -121607 -168113 37009 33841 -374178 -332921 221524 91404 22074 -89468 369183 162409
22673 15088 254681 128177 370331 -232617 -91488 -5293 -14212 -89004 -18566 -158185 117954
22661 133621 -64196 -72179 -52712 26186 274184 -95099 13681 251064 -154295 -51901 137891
22649 20360 -39478 60116 -24312 -30944 -323259 -187709 -33454 -125327 -42892 -32054 -121419
22638 -121419 -84547 -43450 157520 -56501 -67553 -182662 -104202 -148285 290255 337411 22230
22626 -321482 242436 86502 133996 -226826 43433 -10234 -436000 -11994 -113448 10028 50984
22615 50984 223525 -667099 -456690 -64914 160787 289835 -111806 198260 166196 13053
22604 244218 -130764 -125858 -160476 66064 -21941 89036 -3610 248641 9671 203018 131411
22593 131411 -129872 -232312 156011 -436533 51302 -242963 -192126 198555 -3534 -123524
22583 -123524 218038 91803 -112637 249951 34144 -277277 -143701 -84201 257464 -138804
22572 -44119 -6556 94736 201391 -290215 -48813 189952 351215 -198452 32081 133577 -114289
22560 -218926 -22967 35007 -28894 142350 -174943 -332165 -231115 229896 -303880 -376134
22550 -376134 116472 -469404 -426566 -86389 -53175 -64841 76081 -39854 -148735 -216031 -163743
22539 -163743 -202208 114336 -344226 125230 -31794 -100707 215677 17441 -383659 21338
22528 -151103 52805 -85369 -112486 20243 19048 46450 75260 -422164 -37123 253515 366080
22517 366080 102748 141910 99648 79240 -6813 73380 138267 -128120 -133999 163945 -263326
22505 -242916 -104055 25133 -230241 -106070 35913 -257920 121632 167245 347921 -72586
22494 89306 -498513 191648 67336 -184126 -170487 159933 -135538 -118288 284306 -187527
22483 1231 -44332 48458 -71587 295460 -158398 411996 246161 3801 -75199 -2255 -162028
22472 -162028 -134210 -123186 -51504 -27393 -107466 189484 -222441 -269957 -129127 -57504 -128266
22461 -128266 -125960 -17462 54892 -61144 32589 114425 -34605 -220453 -70774 -50505 -254144
22450 -254144 -19126 20857 -59539 140387 -254958 -168852 58482 -12965 -12281 140825 -97963
22438 111363 105924 65854 207237 57878 25925 152252 140714 61310 25893 -379345 -155522
22426 -5142 -335366 -286306 307964 71889 -100031 -121211 -259890 17119 -17158 143367 -217648
22414 54327 -303942 -143844 -37636 165838 -180123 -18218 333879 100623 -191849 29879
22403 -165192 182665 -400068 163367 2664 8205 88013 -33942 127554 202018 113345 109364
22392 109364 -64608 98541 -25260 -41480 77393 5701 -555472 -72471 -2767 -165623 -8928 -31156
22380 -31156 -176323 4333 70900 -54887 270594 -214651 244677 -95692 -337476 12187 20278
22369 20278 -76015 -342980 -142331 186340 238797 -152551 20901 194869 -50858 20379 -30975
22357 349794 16594 -75021 64641 -51048 323814 287522 303374 -47031 -342498 -93663 47052
22345 554505 306797 -49388 -268344 282035 -4958 -27628 -118613 258569 230681 -31308 158009
22333 -126184 57598 -174185 119491 -152646 -21472 -168903 2516 -236633 -144275 -49765 -141350
22322 -141350 -176367 -64370 -264583 -95791 -2047 -220399 -117852 -9249 -108564 -124292 -109751
22311 -109751 250786 -5496 -129713 22121 -225086 -67379 -290709 170530 -39967 -242665
22301 -242665 -388230 65382 19082 412841 -85073 72166 -93344 57030 -441743 206834 -161684
22289 -81835 129851 -71322 -148128 202857 12354 -235632 -77449 39956 -265764 181996 -145744
22277 -191519 -151025 -57126 105462 -87371 83820 -9235 -226203 26205 56810 104810 -295807
22265 -167004 -36242 38550 -158521 -192481 -19735 -343676 201622 -36325 -19073 -53155 -36820
22254 -36820 315483 -512036 -48939 -166843 -132648 -113728 -21374 -124435 -320376 -202230
22244 -202230 21613 -140145 -91843 101747 -72416 -231986 16920 -159804 392232 -258464
22233 64135 -104328 -20365 -92003 -42085 -173261 157888 -76500 53676 -419299 30717 -270227
22221 -289447 -21145 -248494 10450 -98449 220810 65581 188236 -460901 68598 -202809
22210 152517 18470 122636 199305 -165081 109334 -46416 198775 187184 180011 -294933 -178174
22199 -178174 72863 324444 -131156 -202151 -55599 -45951 -156842 -121986 -149295 40939 -395806
22187 357677 -5725 395733 -442837 -215660 18774 -41058 -60154 234599 207468 169270 -208153
22175 131371 176486 -69559 183371 101081 -176211 -93016 -194977 -113004 115241 80895 128760
22164 128760 -11018 -187128 -204153 30616 317621 -44870 15360 389616 -12022 152206 466999
22153 466999 -205180 -182470 36685 -99055 -2148 -240157 4001 2756 -253966 8293 -40012 186946
22140 106639 -60381 21526 172374 96618 -134878 -144840 41823 -226798 -128638 185233 -212078
22128 40503 -1281 -340221 -351280 -136240 225255 -221806 -165336 -35827 -59771 358919 172806
22116 -272039 206709 87971 16271 -134297 -272503 -399720 -87 -162972 113527 -222451 -32697
22104 -137323 -264346 -100195 -225406 192103 48579 190811 -31482 -191615 -395566 -235229
22094 -235229 -90172 -210447 160371 -87830 399016 -122041 105604 13898 -409449 -4566
22083 37726 -19251 -128208 -187731 -58376 95870 -5127 -131128 -145474 73711 -286340 112488
22071 44248 -157355 -12613 -26804 162197 -191101 -89036 -40546 -184689 -348710 224495
22060 186741 144992 -379048 138157 -87024 -172556 261419 75843 -23874 23800 -45487 -397733
22049 -397733 -46920 187945 13062 -34143 -159111 193230 -140301 -158759 -80059 -66471 218721
22037 -135246 388634 -67915 -152579 -106328 -121550 40230 -144151 -194128 206944 -280641 142587
22025 199577 208215 -616078 46 -173403 -163157 146861 -356715 60 -71560 -249818 -196917 -124127
22013 -124127 -21131 -163046 -77510 52596 -95706 5078 -38385 -267959 -140522 -284587 -6814
22001 -129182 -32796 -16334 -47692 -148574 117414 96169 -459806 151494 -206799 -179116
21991 -179116 -170435 -348056 -53038 -34453 94737 -157727 -175381 -144021 188608 19922 -43993
21979 -470640 358572 147472 -266194 110231 105994 -348265 -22812 -102254 -62503 -466373
21969 -466373 -182605 65289 104070 229899 -231420 44877 -338660 24923 -175180 -246624
21959 -246624 261367 -44416 79559 301259 -459396 471 6918 -463318 203547 -69225 -2117
21947 -32064 -380361 64422 -45033 45565 269039 72526 78823 41556 -47917 -51620 -178952
21936 -178952 111244 -317771 284322 263148 -214882 125794 23299 21581 97593 201115
21926 201115 -182000 -203775 -463305 -350008 30857 161585 146818 -78961 365571 -108366
21915 -206576 81429 -17167 78404 -60831 177295 234609 -337084 101653 233967 -113553
21904 -215852 24868 43938 18505 43024 -423710 214103 -24118 221560 72442 -35318 31692
21892 93642 -231278 126761 2608 -321796 -26494 -155354 195388 39202 300923 52541 147094
21881 147094 181478 140882 81341 -71344 54053 -38666 -142609 270443 50235 -179786 158291
21869 3221 -99733 -156282 83731 104585 60540 -260441 132873 139645 1825 -401494 -96590 154042
21856 -225103 -301706 -219197 -278798 -145454 -361732 219290 -99203 -356246 235257 201873
21846 201873 -96241 -151836 -160049 -258025 246026 -160417 155219 10468 113296 -280163 -29635
21834 -87293 -107353 9475 221914 -156139 -239600 83221 -35583 30133 -100703 30871 -196482
21822 111606 86515 -72910 100962 9949 124373 273374 148726 217903 27458 -610081 81229
21810 -55594 134909 32423 137158 -195235 -85126 -392680 -53735 345486 192512 -50452
21799 -40441 -48400 14793 -192740 31869 -354677 -746053 -105613 113327 -145987 -79844 176470
21787 -150358 56431 -25089 -57279 83785 -144087 -239145 -138128 247045 -52738 59988 -67007
21775 -157549 -133185 -8068 157446 205205 283083 -140101 233446 -177427 148664 61095 145607
21764 145607 -329270 -201653 115557 -156532 250969 130652 -155736 -7282 275673 -137669
21753 -299007 -356969 187507 274874 23528 -223255 166505 -253519 -34029 213585 112508
21743 112508 120400 -81526 41190 288340 -201811 -83304 -175948 -149887 -285116 370765 -9680
21731 70101 -9051 -116029 -28751 1561 -99804 -210883 -38420 131065 60243 7440 115403
21720 115403 -197330 -347889 -88749 25771 67445 131688 -359228 -139416 -81926 -165725 -11874
21708 59067 110748 77080 -5327 -276123 193847 399140 -104308 -246256 -107404 -306323
21698 -306323 50728 82243 -172922 244335 -336794 -31891 -366783 -39359 106922 -102879
21687 -136115 -34047 -168279 -29730 93184 246733 268118 167721 -115197 -43987 -66345 -61561
21676 -61561 -104813 -122217 116146 -136594 -148004 113387 -139384 -205514 -64744 74351 -136858
21664 46721 33273 -56927 -251174 -88461 -68714 -414580 -8476 -258428 -215693 -108533 37638
21652 -9391 116532 -107291 -208030 13591 -184955 -133236 92257 -121801 -31600 54068 25747
21640 -24503 -270186 -227014 268158 -110432 6137 -86463 -6335 -251285 -169694 186629 82224
21628 168917 -190161 220072 168581 169449 51740 33607 167954 -5733 -81354 20683 -135312
21616 9400 -104156 -169153 -113771 -283985 -288908 -201987 -20271 -125855 -46396 -195494 -132438
21605 -132438 -183679 1757 -84648 283920 -47973 125379 88742 -96976 -89134 76926 73751 -63921
21592 -175688 19122 36022 -330862 67390 176197 5666 -144319 172178 111128 -117390 78080
21580 -119992 -265698 88293 -273247 -60248 177808 -144279 89864 -21202 -92185 -246778
21570 -246778 163860 -185718 -95555 -15563 145823 -176447 23597 178797 -176210 -245884
21560 -245884 75714 -341475 225942 71256 53575 22100 58739 132039 258221 184254 -50669
21548 154724 91072 -133075 296609 172976 25600 23549 -238242 12423 120513 56558 -31570
21536 -3205 263518 417078 -315444 -244928 10563 100269 71287 -139446 6068 -86587 164248
21524 66278 33085 73748 139019 -130888 -257371 -60274 173353 -220673 121063 -294768
21513 -135573 44890 193450 74987 30938 -22677 -38680 -275107 -102168 23659 -135069 57825
21501 72653 -51329 -72290 -191651 -114271 180420 -302887 -11863 251473 -82706 178201 -322517
21489 -118613 -213961 80239 -144256 150123 -218738 -223253 82141 4746 183994 176773 8932
21477 -293749 -159715 236909 168736 -274862 75962 -7467 149204 -120228 97966 -313702
21466 -13907 167945 -96175 -361171 -191278 -56786 -231994 -183819 305293 -247873 30641
21455 194761 -225852 29146 9258 -5838 195796 -62021 61940 -159373 -9230 147089 -56200
21443 6034 -158273 -53649 122459 -38053 -176541 51197 191286 193677 50185 302894 146178
21431 -93410 21049 508684 21787 134401 -309438 -112112 -53949 -274478 -16839 28148 -215096
21419 -149288 108525 86918 8370 -112852 177626 192298 -27367 -15074 -527301 -125427 -386928
21408 -386928 -112647 -64266 -207459 -70101 -218978 15771 159388 197854 256078 -101428
21397 165149 -25084 -176054 -126560 346620 212630 140476 -96042 20324 36916 -93162 -212592
21386 -212592 -74327 -34210 -301482 -235255 -72849 264830 -44696 -280088 -175147 94604 -33819
21374 -6231 -83374 -128096 -134656 -55140 -357143 35074 214451 -222175 291725 214920 285155
21363 285155 146339 -13423 -212066 -242909 129454 16599 21892 -83013 27500 -91081 -80952
21352 -80952 -126820 107012 -300041 147842 62667 -35998 127428 -214561 17105 -3849 -69116
21341 -69116 -251308 -268557 36089 -85617 104499 125631 103889 60524 149012 59606 104925
21330 104925 322226 74154 -79152 -76037 -51527 148641 -222582 144878 -170736 -337803
21320 -337803 215732 128452 -205585 -311597 149511 -155921 25478 83776 -71324 -67400 -34264
21309 -34264 -224619 169241 -87198 -41966 29339 -139281 -502100 -265016 -223856 -370868
21299 -370868 -231125 -158330 -351293 146316 -168672 -70132 327453 -269503 -90610 30025
21288 -31621 110515 -70156 -16265 322380 -337887 20329 72202 -80699 -108916 -97761 36373
21276 -242914 47706 130818 344798 58362 116202 -148316 -207512 110986 -294824 -148520
21266 -148520 -78634 -221810 -206244 23087 -195426 -60828 -159339 -417387 -203115 93982 -28466
21254 259584 -324150 29790 50006 -328647 -9074 15842 89900 -42319 -414930 225631 4423
21242 -31380 -339485 -128278 174783 161210 4342 92502 220298 97463 -152528 -19859 42166
21230 -330805 221521 -264100 -358861 -33097 43756 -340454 274846 116340 -233313 21797
21219 -43684 -123704 -51563 66810 96572 -118788 258117 -44500 -234801 218447 -386418 54488
21207 -20198 -33642 2429 41929 101471 -165418 -49555 -19870 -64018 172341 -127232 24512
21195 -74888 189689 34074 -216842 69580 59399 203945 -479206 -58080 -184355 -33547 35644
21183 -125453 -150413 -124522 161341 397935 16247 -101302 -112975 -58914 -32469 72785 11501
21171 302678 -162980 207712 231606 150081 145463 19690 449187 21529 184486 -294553 -95938
21159 101151 -291409 72058 54700 -361022 -264313 178804 -210838 -43555 105197 -133063
21148 50086 67621 17661 -110562 -126088 -4346 -99298 44289 209437 -467 -74072 -155406 -291627
21136 -291627 2428 -67128 120078 33087 989 -42943 -141098 50744 41073 -48951 -229470 153254
21123 -151321 205930 -230760 149063 45700 189448 -18296 456321 -234431 337057 -223391
21112 -175340 10755 115964 -171328 10457 -122275 -126684 45484 52716 -164261 -49042 -328418
21101 -328418 216778 390809 -69286 56051 -29977 43261 -3310 -80654 -334560 -76586 -206792
21090 -206792 -183775 -65488 -69732 -245023 31347 -177454 154156 323324 69884 -315905 -14594
21078 -211371 236824 316390 -126776 -90489 -27167 -105781 33542 -409080 -37489 -242689 246361
21066 10459 -69846 111386 163544 94736 425669 -173872 29353 152287 -30887 -302048 -251528
21055 -251528 -88065 -230417 -47644 -289298 -155905 -14946 240931 -34987 81203 -66633 4183
21043 -189486 201204 -229055 46479 253045 -15820 214995 308969 -175789 -53483 -317659
21033 -317659 -325967 -88181 -124565 -7734 -2861 236828 231847 -182676 -71712 -38353 -142077 -205834
21021 -205834 -13029 -88012 -322621 -147224 117519 -362040 77422 -224651 -77809 104161
21010 -274531 -20500 -135585 -324107 -197468 -330251 93880 28049 -11327 279706 78319
20999 22510 148228 15933 -211368 -221462 143530 54386 1921 -80415 -14457 146878 -5881
20987 -182726 -229693 155610 20916 -182584 104860 -206934 62404 -196159 -33192 -219318
20977 -219318 -142584 -114968 -224229 60460 152924 29018 -86006 144399 -120409 -241630 24773
20965 -60429 -611490 -449340 -231018 149899 142831 -71252 36553 -90916 -104191 -208094 17742
20953 441419 110831 -144861 5830 -213355 56548 -142654 85314 -180868 -87323 -62407 155128
20941 -174804 201417 100406 -168440 -75149 -142163 -19340 -422288 311136 17594 -193207
20930 -216288 -262185 -23976 -103474 -69878 41185 83989 -92287 -185873 -90931 -233541 -23943
20918 252679 33028 -96413 -306362 -23499 -423388 -199571 -96105 61344 -10397 -206274 42970
20906 61279 -51018 -143042 -298974 165757 272423 -278759 312789 104841 121635 9250 45926
20895 45926 -75093 -220494 -121546 -254463 34125 -165893 131856 -363103 -32854 -183807
20885 -183807 240090 -329329 -6246 -102376 58550 251954 -95759 -106429 -87667 54805 -317170
20873 -172237 -349194 -42312 -72537 -64499 114571 -236534 300827 94099 -395357 -74301 268099
20861 13435 -275392 -233782 145817 -122917 136444 163286 178111 -26100 -46444 15118 -200813
20849 -44667 81302 87202 -86051 47000 -194041 174899 32709 -59661 -166914 -157646 -87946
20838 -87946 109008 -122528 376650 -213819 42838 65343 88973 -132833 -328865 -39337
20827 -246855 80632 47253 4114 -110011 -305596 2026 -174619 104229 -334602 -188462 -91652
20815 -354220 110061 -143355 202888 -288622 -198798 -9174 -480 31918 -25930 -246365 89105
20803 112725 -14018 -91952 97928 -146341 32250 74163 -323765 -176361 -239736 -346127 -516
20791 25404 -406953 250116 -124027 -321398 12675 -203404 -121681 26965 -85650 35786 -369004
20779 -258127 -2578 -183424 23426 22440 104463 -31881 -71344 240952 -130243 -137660 -4839 -75818
20767 -75818 -4563 -257161 -222177 -46998 219669 -109007 -275331 -373869 306620 -244726 -305791
20756 -305791 -141930 207285 -525508 -369705 -172292 263640 -171240 -175317 -145120 -94149
20746 -94149 224734 9568 -143939 -310562 122795 -172810 16665 -88322 97107 -186161 -34336
20734 175668 -138816 -314073 202171 -112831 4337 -100893 -13598 -96229 -74963 -158426 35246
20722 -148488 -137441 -259031 177987 145124 188240 -247138 -164025 289060 207028 -344222
20711 -171508 -196626 -105821 -4686 -841 -231669 -129374 -204592 58683 82653 111426 -185394
20699 -109567 -167702 59926 150025 65549 205980 -123851 140675 74701 -59585 -125423 -59518
20687 351743 -233342 -214757 -476613 166530 16483 92734 56322 325938 227075 -115911
20676 177440 3535 -66660 134388 -150015 35260 41204 456395 347939 118947 -233915 -34231
20664 -74422 288197 27793 -102027 -236321 -72355 -336837 168026 -123878 -180819 125484
20653 -211099 144758 -213357 -148755 -180854 29708 -62036 -77402 24311 18818 -103073 923
20641 133273 -139746 -120983 120776 143281 192421 -158726 131797 -391526 -173605 270297
20630 -166251 79848 -41201 -8592 -116374 -91350 153846 96484 171426 304369 13923 42635
20619 42635 -152906 -290629 172341 255506 16939 1481 -69185 25416 60832 12783 -144653
20607 66787 -151986 41704 -56498 97988 101195 97990 -298108 123066 139774 -408806 -518718
20596 -518718 219302 -8707 -42270 -350363 -170192 -43797 181910 -9349 4038 -32981 38139
20584 70179 -124898 -20316 -34698 -69079 -176380 -16998 41034 -335984 287887 197310 -16009
20572 -242539 103584 -341656 -16132 95452 -1619 -40985 -152214 5373 202774 -137846 -21278
20560 -109244 -47088 -342813 -70585 54991 66427 120977 -72983 -135741 -82435 288339 -11504
20548 193421 111542 -27494 47614 -126371 -168569 -379922 -62387 215245 -135859 186042
20537 134335 -60251 -16172 -252541 -179618 382682 152130 -213776 -439740 -391271 141609
20526 -348483 -105665 272569 -153979 -250288 -79930 243821 14096 23786 -296561 101454
20515 -170230 342394 -232234 -168150 -175596 -136048 50266 10969 -13292 -217266 -53218 -68652
20504 -68652 -155836 -207247 -149089 90878 -164167 92717 68260 4712 -61801 3946 -15595 110536
20491 96119 -41223 -252472 215166 -318288 -205845 -128327 -249519 -173935 -118048 -584387
20481 -584387 37251 35052 -14406 -114418 -34142 -374280 322971 206227 -165883 142729
20470 222125 132897 189928 13464 -259171 -111284 442063 -294111 96856 74326 69062 41251
20459 41251 -397599 48372 -32396 116080 -340955 214422 307239 -111229 83223 174325 5231
20447 136570 303453 208866 84123 109210 -83057 -90069 -55921 -162922 -298823 331359 -235761
20435 16179 315520 -374636 -15224 257367 293381 -246391 -151040 -241927 -114142 104792
20424 -203545 -85462 -174658 -19322 223063 -159313 24121 44027 206171 5326 62050 -351905
20412 -179950 -93394 282408 -416845 -26718 -277246 -243828 53663 47550 36686 -125214 218174
20400 -30959 -102882 -324932 -5666 277444 -173350 370001 -274228 73525 -301198 -213892 109880
20388 -2733 -296346 -208338 -79252 -140147 -106302 110424 190691 -8362 -89789 -9339 58664 -489151
20375 -213116 76254 -35400 -28775 -124274 -111647 47192 6674 -127815 192790 -61365 -21733
20363 -240174 29466 37441 312058 49185 -137915 -204731 113573 -143558 -36580 75970 -79655
20351 -120741 -104766 -133149 -249227 247847 -275069 25279 127752 26892 90151 55342 -51410
20339 -136052 210682 -221551 -192872 -216571 -149569 71700 -47110 -237893 -1994 170553 -175313
20327 107611 13054 355739 -238847 -4153 -191907 -5955 40871 224099 142613 -102385 -18828
20315 -11509 -206925 -257104 107497 -76239 -141019 -163246 -105121 61600 94911 -143122 -162649
20304 -162649 148389 227068 -98336 124387 -288888 -329524 89449 -182451 35065 -28634 121515
20292 -207277 -183058 -325214 163406 -41357 179631 244695 -216901 161674 -97499 50814
20281 -176318 -90897 94622 -270450 -196956 240883 -151717 147364 124186 -143386 239198
20270 -60312 -15191 -202517 217170 322906 -45243 159806 102203 74960 -72511 -321939 -371958
20259 -371958 -198243 -28701 172526 55862 -279220 -247057 -190966 -173182 91183 -67531 91460
20247 -18539 186722 -110198 -95724 164149 -50774 -207447 96637 111390 96027 32538 -396961
20235 195410 -26001 -154052 -42543 103556 -312980 -146055 -158360 -97285 -65101 -123927 -120540
20224 -120540 53809 -174145 124173 -77533 -13377 37070 227625 -73441 94521 -121371 -83614
20213 -83614 95099 257788 -241190 -135455 -258991 221451 17636 26156 223174 272385 -256126
20201 54359 -66307 -57908 -32553 -173916 -79264 282674 58622 -33187 -9980 284606 -98344
20189 89351 -136728 -113233 -241357 113839 98264 -109636 -66177 293066 134324 24222
20178 -41912 222394 148872 -92113 -196559 67853 183947 -18196 206634 171454 20801 -115617
20166 176359 -55905 71352 -392740 -38596 -48987 99139 -334280 178626 200274 213866 199413
20155 199413 37510 -40350 -76481 -82075 -114639 106740 -174996 42073 257885 19105 -293305
20143 -111833 265313 44632 73453 115746 15037 -3512 107189 152030 246410 22423 -7315
20131 194447 -373911 57471 -314576 88861 156036 -127966 -86575 227710 -318853 -201723
20121 -201723 81993 -163970 -150510 288192 139218 94795 -208527 -173424 232225 -120064
20110 -187641 -140906 -463273 -173475 -109413 -314208 181376 -167336 230602 -29267 62097
20099 -52889 -108457 -279060 -262005 134473 -204216 5032 -144960 -494462 -397715 -120970 -357085
20088 -357085 171348 4482 231874 291728 -101662 84231 -129619 39678 76445 -436144 -63542
20076 -117007 366661 224641 52511 -64855 92294 9133 20228 -16586 -140572 100115 22682
20064 -47105 -16569 124715 -297549 30611 -214178 -179406 -22879 165544 -345848 -1768 88102
20052 -476825 53549 25826 -291027 188544 76662 15837 108912 -55348 -56258 -212329 73691
20040 -150305 229682 -84828 -317765 -181068 -247047 -264837 -214556 27953 -12974 -60744 -48068
20029 -48068 39225 80380 -410633 262411 6364 -43027 -60009 -119531 -66791 75594 -442560
20017 -275372 -121874 209336 -202787 -196910 -140933 48500 -309098 26292 175151 113456 60134
20006 60134 -166121 -96841 -180360 -253255 -105699 -69609 58294 -338280 -77645 -71190 -68257
19995 -68257 -86863 345348 -110895 87166 133112 162390 -47523 -223760 -307899 -114690 87866
19983 23143 21075 -210681 -107570 -184459 -229536 266888 1060 -315155 -64613 256447 -170530
19971 -43643 60307 -66109 -445900 -116763 -312065 104552 -235314 235284 -325264 116981
19960 -222506 379710 -177841 220991 174345 203263 -285261 -262256 28430 179302 -375587
19949 54663 -226083 -67120 121388 -83757 16418 -5650 8856 103486 93152 25169 -111544
19937 -8407 417747 341939 -38539 -62708 -1266 295712 -131435 -207270 -307756 -12867 -237906
19926 -237906 -130004 -323315 498004 -416981 92983 -194702 -117806 62485 29890 227603
19916 227603 -20433 -371751 -4737 -14295 -10480 -306414 -192718 -128450 -113966 -160662 8406 45033
19904 45033 -150968 97134 34962 166007 -328686 -305791 77287 -124787 110133 100101 -143045
19892 -162351 -52216 145850 -26996 -186028 -188827 -334513 65191 -61156 -210186 22977 -173602
19880 -211856 207524 72541 -299449 -126880 -24549 -97843 23674 -486477 -63405 457818
19869 -162737 -141111 -257792 155591 95172 -472067 -319512 95365 -211718 120289 49238
19858 162244 68684 75064 119958 -43868 188626 -53641 32128 140677 -81946 -329666 54216
19846 172270 240183 -374754 7833 230294 60819 -248781 30510 -55493 61971 125448 27722
19834 -397782 -78183 -116532 12089 175577 -324500 -229507 105886 -77419 130274 34838 30980
19823 30980 136194 -45547 -198664 40582 17997 -50914 56305 -287478 18516 -103724 213662
19811 45931 271523 -213596 116824 -241953 -188134 -46374 -184547 117032 16347 -164837
19800 145772 -149213 -168141 -27782 -166698 -61155 -226782 -308604 232018 54622 -42108 -153095
19789 -153095 -207029 -15181 149020 -151656 -70513 239783 58826 -219531 -161500 -260961 121864
19777 142150 94397 -254087 -6768 13397 43114 -80967 -109617 -263196 -231744 266814 135696
19766 135696 128272 115569 -68060 183875 -67451 143463 -56549 200782 55664 48121 -248336
19754 -189942 -113340 -1466 173290 123644 -117987 22771 -98698 84100 76412 -123021 264078
19742 135048 -50456 -357870 -177192 -289766 25209 166605 -53167 -159086 -155819 318472
19731 49000 -21545 -156235 95547 -75228 39149 -118329 -376234 179955 -4004 -129600 -2860
19719 -234471 -317223 -13080 51909 -30117 -382192 35991 147825 -240844 83734 9954 -220531
19707 -180763 415964 222001 234498 51648 -38436 122850 -110484 -196277 149463 -249969
19696 -232385 -41188 -176210 -329756 -4686 -167269 -184404 -43131 75485 52620 -74810 -11024
19684 28117 -211142 -170060 55508 111469 -340089 -252961 -160713 -184436 40437 -108268 -153935
19673 -153935 -355262 -185135 -109816 18408 -376316 -114609 173988 -414718 -38871 -19664
19663 -19664 66988 35049 91079 -239324 34996 14116 -166612 82722 24204 -165177 -102157
19652 -102157 -89810 68652 23113 -62036 397799 42820 -377296 161317 -514 -130891 -187062
19641 -187062 -24143 -193460 -96358 -26897 -287775 72012 -176114 -7337 134480 -113408 -20603
19629 -54763 -179025 34674 -25981 165886 -4669 59902 90474 -215859 -251316 -54865 69939
19617 55543 -117342 -351486 552496 8672 -81123 -207302 -95612 105903 -217295 -62364 -265767
19606 -265767 10781 -65923 56454 -100338 -377016 -85249 153452 97925 -104065 147739
19595 -205642 -426035 110541 210529 -78421 193599 219955 54300 -229954 -116135 162290
19584 -177918 -132809 126786 -27737 223169 218178 -389422 -252637 -180166 -293026 -178133
19574 -178133 167599 -60505 -50517 -64900 133761 -59925 -31178 -116146 -114398 -110053 316874
19562 -161734 150734 -80521 -202719 -130820 214280 42726 -138693 -8622 171700 -15400 99012
19550 -98363 -79451 1938 16233 27673 -190027 -158600 -127940 -94429 -88670 -56719 34744 2402
19537 -125856 -119193 -52167 103409 36359 153450 -14597 -159027 14764 -186973 -182388 17208
19525 -57706 45528 -122019 -191168 -73599 -117993 255284 -87489 -64091 -30383 -99624 149369
19513 46893 -413019 -80468 26623 -70970 16586 -71572 88115 45794 -61441 -9468 -320865
19502 -320865 -37637 -180056 108705 -251289 113971 -253838 -143908 -58337 -399608 -315022
19492 -315022 223778 -104740 135162 -140752 212022 484310 -250415 217061 -73098 1172
19481 -1364 117952 -231160 -189932 -23678 -97724 -137674 127708 12138 -27010 -99657 -35086
19469 39991 162354 -127818 -122145 257980 -56447 -118086 -128681 -40899 -98166 -151381 -273807
19458 -273807 -268573 -64162 -23672 -108681 -57670 -319547 -10272 -43840 -106002 33493 -59431
19446 -290384 -21121 -268678 -262339 -45077 -157137 -90164 172193 -596447 121229 54918 117947
19435 117947 98839 -146480 295555 68630 64638 52727 -98257 349898 175965 219125 -160606
19423 -176507 47556 -268076 -259902 115678 -75484 -27222 -121887 -265510 -34927 134408 68976
19412 68976 -344890 44887 -277567 370499 -489185 -134289 7366 -48542 -275799 42853 -217026
19400 -128361 56696 -2198 -86018 -63321 28749 75479 -11605 -11091 84902 15962 -174311 -128933
19388 -128933 -124417 172103 -110883 -189377 -24030 134638 63472 -119926 192763 -85310 46870
19376 -231196 59603 -58895 -147842 49627 -186143 -35686 -219465 63418 238632 160432 -288527
19364 -46437 18815 -125805 -122892 178781 -148221 -238009 -137512 -73064 -472269 -225331 33291
19352 -47919 -85642 183178 -159251 20937 -382172 -101275 -398540 149374 17959 291076
19342 291076 306427 -370934 -63715 -109365 -347466 89366 -50326 -99665 -193055 -80417 -104239
19331 -104239 135111 -136118 -142089 -50379 -83766 -36006 -500957 -22010 239789 -250636 244313
19319 -449528 37793 231127 156210 170143 2307 -35408 9200 -403132 -164201 112968 84060
19308 84060 135197 -333334 -406362 59120 37612 -53062 -291764 -238997 -278055 -235515 7505
19296 63908 34534 20091 16259 -203671 -54822 -81374 -228958 -383953 243292 -308649 -334889
19285 -334889 -489805 -115753 -232123 -185637 -263724 152365 -91891 -13720 -137428 -64651
19274 -213764 -60421 154590 -5967 32006 95246 102676 63491 18656 -290337 128205 211723
19263 211723 305039 -231300 259892 60328 7606 -152117 54678 -521592 118454 -153256
19252 216696 -228156 -32451 -67838 28408 5028 -100810 -278481 397392 -122011 -390913
19242 -390913 96640 68128 -198138 -534550 -16146 100234 237121 -351348 45873 54783 221818
19231 221818 31747 -207512 27374 137915 -558 257498 -107138 -136577 -76910 -139214 -195532
19220 -195532 -256208 101327 -147808 47650 -149345 -183586 -248801 164336 -217239 77999
19209 156678 20749 42914 -7599 -173688 -191725 1758 -14918 145461 -31396 161971 110746
19198 110746 -158092 -184423 -36553 -12329 -289032 149199 4934 -289234 198988 79834 109497
19187 109497 -75053 -56561 -145755 73349 113231 86218 -151 -531085 -166598 14071 -283677
19175 182924 -34501 -13570 -142822 20326 -313920 -283974 32433 144273 59064 -161572 -192869
19164 -192869 -13966 -33802 163825 -151467 -296404 -100014 204749 -193288 -344043 141755
19153 -212139 -57384 6862 -8593 95267 -167850 304130 213561 -389421 45827 -80701 -89261
19142 -89261 -99540 -107235 -62432 254450 91253 49878 -216357 67391 -231236 -91459 30175
19130 -17901 -255735 -150171 -156631 -167738 -33179 268830 13043 -98289 66369 203892 -4906
19118 121433 205807 44127 -89616 36861 99386 -55021 116772 -6859 -130291 74103 -129554
19106 76137 -124634 452016 -4737 297164 -160864 -89062 -20443 108271 145748 -471 -191223
19095 -191223 118140 225784 334063 -34503 -185179 172539 -79033 161595 -135983 100762
19084 -27617 152163 -25965 22795 81413 -178349 -128193 -379947 50600 101271 -287061 -6653
19072 22206 -102073 -15973 -134691 234809 91947 -42082 -258881 -31047 -264360 -540682
19062 -540682 -36533 -141956 -164981 -73497 157674 292720 -298823 8676 -285357 -125879
19051 -80249 63528 -64432 131346 -65495 86345 -302945 -89710 -23783 -156308 -377162 46635
19039 -167843 107630 154803 -144278 87490 458468 -79591 -310386 76050 -127745 -286587
19029 -286587 -41773 125479 92473 -131999 -55093 66734 178988 65093 223861 69533 -196347
19017 84501 151716 87662 -505131 46509 -6534 84021 -37982 -194695 -28486 -144210 -325683
19006 -325683 125074 -113638 124050 -26122 -148345 -179593 -341463 99674 -192654 -236361
18996 -236361 -174179 1625 23210 155053 -102109 305612 -173316 247053 -111863 -129961
18986 -129961 -68482 -479615 -383878 -366310 16121 -145677 -93268 -590980 -118699 -162466 -162854
18975 -162854 -157570 -379981 -235553 -386155 -133715 -39571 142471 91015 -51128 -160983
18965 -160983 -450367 -169316 -44051 61020 -159652 -136107 -23556 78579 -239217 -67253 -236750
18954 -236750 -305425 247988 132765 -238096 101779 -125519 100123 -157213 -291781 -90640
18943 -275543 74125 -12079 -132954 234986 194676 586983 -64672 -207075 152381 -25579
18932 -233281 -51206 -336589 -76395 -108651 -82405 -110062 61149 -300841 43812 -215536 -58125
18920 -215113 -182282 -183049 68969 126488 165707 280083 -332537 22617 -141539 23600 -203272
18908 160780 247533 -73559 -112551 132552 -74824 -285949 17931 -488155 -241380 -11887 12076
18896 134569 -136161 -173211 12625 275128 306195 -248850 10234 -68469 -174570 -199317 -337198
18885 -337198 -89584 -141301 -70374 50052 -26003 173883 -173102 -83080 7078 6788 -133354
18873 10084 41169 87078 -173317 138384 -219653 -61137 2002 -96828 -152371 96072 -271899
18861 -155823 295599 -22215 -542819 -154213 56182 363753 249220 276047 166108 67938
18850 38756 -197982 80240 -148193 66799 -189889 -325480 -121079 -126694 -27481 112814 10452
18838 -173690 337115 -7493 24704 -43678 91863 -122586 -55433 -114231 -162000 -85805 -226345
18827 -226345 260304 55959 61435 -188184 175795 -105297 -385362 -148531 84178 329152
18817 329152 53710 198061 149368 -169524 96905 476589 13667 259781 -111545 -40640
18806 149673 -288332 50381 96949 -776 -97316 86292 -295901 -9931 -78750 -205030 -44249
18794 -31740 273337 112878 253590 66475 -126349 -208757 79928 -121224 76138 59903 -166637
18782 57457 -95512 281336 -250079 6741 7603 -151676 156521 231361 -236358 -125718 -92357
18771 -92357 -159786 -411265 -553878 133308 126702 -25606 -181508 -81148 27283 -282613 -89705
18759 233736 20110 -138452 -118789 -165765 -223715 -53374 35577 -74935 -26235 -17789 -267879
18748 -267879 -74435 206895 95900 215640 -92030 -178553 22825 -388059 -113233 398030
18737 -180882 -17344 64259 -388349 196482 -181223 -249785 -44363 -157768 -68123 -13279 340869
18725 -138713 65484 -414283 -182471 38343 -200453 -338350 200714 -266277 -16531 151573
18714 -2979 170155 243558 -286785 -3545 -456355 -180322 -61524 123009 -196596 -204703 155748
18702 -215879 99073 154813 -449701 -164053 -205506 -100997 -104109 -76803 -330428 -50067 -11966
18690 109205 -100430 -229662 -147695 354291 -214840 -207178 -114805 -13736 -35977 14755 -82148
18678 -331542 510951 -165214 31991 -51794 -141975 12417 -369330 130202 53448 318223
18668 318223 -139284 -136559 217458 -332587 -242296 78927 136586 138137 -21726 121399 -170387
18656 -18933 94607 -3775 117948 -13841 20714 -28500 32534 -303260 -284144 7012 -51290 -348406
18644 -348406 -180402 -77461 -119848 -6364 -159373 -184916 62973 -52468 11767 -230276 117494
18632 72744 38570 -26295 323027 -402127 -293930 -181181 140278 -167673 -211446 68096
18621 -31091 164986 326426 -67927 -91488 109182 -66665 143935 -328443 -72354 -42328 -12006
18609 81964 166952 -202411 -122495 44033 171427 -21570 -115952 -126890 -152883 -165179 -611006
18598 -611006 89238 -141315 -292823 149772 -241728 -325040 200068 173051 -423069 167146
18587 13427 -125416 -273713 -279773 156903 -32166 119373 69420 -222427 191149 -80157 -5359
18575 2309 207422 -209838 -471502 91913 98025 228474 -253930 -87939 -24051 -62596 -60 -95291
18563 -95291 -206790 -66343 54589 151029 65577 61580 -7109 3620 167335 200196 -324286 -141315
18550 -94764 -156263 18628 -150147 -22336 38748 115917 27068 384994 234080 46987 -129393
18538 -49580 -372577 -211768 -162261 129424 77230 -51619 -98850 159856 -6645 -47505 -336543
18527 -336543 -295232 210323 -88653 -222551 85485 -199458 -104512 120373 -190858 -250402
18517 -250402 -230462 -293108 -213837 -44327 -88157 70719 160888 -196444 51727 22101 -206916
18505 -379861 112015 -1890 -115553 -410296 -110665 -85638 -279743 -515557 -192022 -24457
18494 38532 -121989 -156409 71745 106948 -416917 288474 -185428 -326008 126189 -50449
18483 60355 -278148 -137869 -180346 -125097 -191730 -93410 123868 -31308 -43964 -43181 -6372 -65713
18471 -65713 -112954 -173878 112801 -63534 -1835 -215692 36362 -217211 -228282 -150652 148944
18459 177089 255028 -84977 62087 328180 365425 29354 48717 15982 203340 245447 -80673
18447 51591 47501 196134 -26524 256626 241286 93508 -381008 -36962 -177212 183964 -170403
18435 412712 56272 105363 11 -70767 -54632 42439 -132263 208157 -216376 -35409 -6066 -271901
18423 -271901 -111220 -75565 137725 -83158 161516 69742 260486 -119913 -162899 110946
18412 88416 -181826 474675 -25133 -34264 242202 133772 60882 6822 197757 -51611 -126868
18401 -126868 -7875 -73908 114144 -76392 -225205 56694 99010 128395 -40395 -84024 88250
18389 107866 -252670 149148 -141668 278269 -191110 -257767 -160283 37645 68505 195521
18379 195521 -157453 -404656 -50785 -48043 -53830 38625 -263120 -155644 -107963 118095 -44858
18367 34886 -33464 333934 54587 66603 856 -151479 253770 58299 -202246 -391259 -268501
18356 -268501 -130983 143971 146837 396766 54875 -46477 -177853 -271053 -92568 216219 166110
18345 166110 -11726 75506 282895 128380 101436 76986 185803 15943 -130504 -95000 186140
18333 -24213 37835 -222786 -246954 -203243 -256909 116993 78923 226774 80271 91556 -142468
18321 -179768 -206782 131040 -7900 -371715 -112509 1533 -31955 -326592 -69677 -152255 -375707
18310 -375707 16721 -165228 -234078 116332 -86731 65644 79316 -84360 12193 199444 -375308
18298 319686 270154 176930 -75447 174101 197529 -166412 -230885 -81375 -266233 -60838 -56414
18287 -56414 -54197 -80208 108319 -116264 -256796 126183 -330156 410704 -184029 -270821
18277 -270821 -179964 -334199 -214796 -88025 -182955 -319635 682847 177803 138497 -134766
18266 264091 129000 -74785 212144 64501 -95522 -90256 -52752 90060 -72475 -270554 280209
18254 257985 -60345 -169671 16287 -231330 51331 244656 -88134 42224 197832 -337479
18243 156487 -151525 -95733 191118 -247397 -53301 109995 -49146 -197959 -9999 -83792 13958
18231 -207496 243279 -97400 37550 82675 -120038 27673 -360733 -19363 -164243 162835
18220 -151652 532113 -239403 -10267 -114253 -306312 1701 45750 -533114 214091 51191
18209 184340 148207 -140832 -368062 159446 -51494 -216931 98861 -43547 -127880 208400
18198 49375 -79784 -329217 192715 -171224 116327 11924 -88047 17179 118063 48837 45131
18187 45131 -196213 -142527 336865 348400 65390 132293 104906 187735 -397021 25768 149823
18176 149823 156759 -405382 109654 37569 67573 140045 93677 -557138 -93935 -179267 -92230
18165 -92230 -353627 -168597 114561 87892 -371912 129714 -198971 91010 -25859 83914
18154 -66684 -73332 -55778 -85637 132529 -138101 -10181 10959 -236832 180279 106168 -286187
18142 -180674 -150403 10038 82044 355149 9379 -320530 244803 -155470 -96790 -151135 -1384
18130 -167763 12285 13531 -64850 22637 55097 -181722 -240606 -1510 -116495 29130 -117894
18118 7177 175141 85705 112371 99225 -66445 -113127 58872 140689 117920 -267898 -421603
18107 -421603 50282 -314787 -103076 105806 -122776 157934 272751 -71600 -536742 -127033
18096 90419 13372 -36762 -168642 118681 71420 93939 -41208 250178 60127 -52212 -216408
18085 -216408 324075 -202623 -79415 -190386 111215 -185637 220935 -107239 -282737 304374
18074 31721 122926 82996 -244390 60869 -205489 -158217 348970 133387 -52047 -108511 66310
18062 28212 -244165 65212 -196638 -214328 201449 75702 -110250 -38163 -63624 133409 -58853
18050 -185195 62456 -29632 -75604 -53498 -203894 54015 -108340 68284 37932 -228706 -108925
18038 249153 103435 -195446 -152373 358283 -105756 -74487 -42429 -41678 -244181 89941 307964
18027 307964 -104097 94969 130035 73109 140067 212112 -163771 -195273 180343 -8653 -181942
18016 -181942 -23720 455620 119041 -283835 300699 50170 64427 -163746 -152997 -69134
18005 -145657 102809 -207187 104306 161965 365204 -179904 48846 -250050 157803 -110646
17994 -92144 -289177 -126757 236659 39307 -121641 -129107 -124036 56090 -487027 -209214 -45844
17982 204602 -38860 89882 -15684 -113841 -204978 37659 88075 -200292 -122061 270051 -83686
17970 -41643 -256231 131394 24208 243019 -99642 -410648 -229388 201934 91735 -76237
17959 -201457 350 -49643 198726 -351612 76440 208272 14784 198075 -304484 -1721 15532
17947 57590 19286 11756 -271208 26701 -91845 -132001 142502 -377157 -114448 12238 4231
17935 231683 -64365 299197 -167788 241516 85044 -307714 -139659 8730 -76122 -52146 218487
17923 276938 -305174 234172 -20663 206486 128141 -291598 -278817 -203895 174407 126337
17913 126337 -321982 2811 -22721 175271 25990 2732 -282450 -31883 -211645 -22052 -222025
17902 -222025 -157277 -8691 82624 -183326 91446 13361 -71988 -311660 -74754 -158818 98598
17890 216746 70784 136549 -102463 -90969 -116925 268129 -57999 -114484 -145900 -48343 266
17878 135103 -16397 116378 43630 141376 -74838 228586 118254 -116323 72084 119507 -20747
17866 -116985 -53735 -274922 -70133 -37106 -244755 -181305 102897 -101842 -256891 -208471
17856 -208471 8223 -283389 -47945 -109182 -80560 -55160 102095 -110418 30621 277336 178024
17845 178024 -67014 213351 40842 -52918 163811 8581 157522 57063 133544 259921 -81955
17833 -145378 105623 -19831 -85734 -101108 56667 39673 439587 248679 231154 230902 11222
17821 -21440 97410 -88484 5485 122682 -74625 -95836 -237736 337014 -338497 40222 -26801
17809 3736 -45594 227446 426322 197200 -104622 -7155 316275 -92377 50305 -147148 424756
17797 -50842 82740 -227676 34675 101597 -192802 -100475 -30754 155775 -493323 83643 -102500
17785 3614 -5608 115318 -304012 315508 -49627 -191083 56876 215449 -60384 -47833 166711
17773 -29758 -415548 260968 -898 119631 -2016 -96433 -49196 -178160 80187 47880 66308
17762 66308 55982 -27518 182132 80230 87515 -309062 -252411 -73547 -34891 -108851 -27598
17750 -189481 -84925 -144944 73534 -212329 -227464 -645 70375 -188281 -228141 27550 -163339
17738 -95950 -257773 -143664 -39516 -46423 -90357 188435 23511 310116 243772 279580 24226
17726 -221987 -129770 93921 -133237 -18439 -3379 -269789 -219385 4040 -211551 -136068 194832
17714 -36420 -36525 -157039 -224093 335641 -6584 -64643 -238563 -326497 -284398 66459 -134468
17702 38496 -11951 -197357 175688 201495 -37325 -212386 76400 269380 -71424 140246 -209300
17690 143579 -375698 295753 -98603 -288278 174257 200391 -99789 130272 30370 136238
17680 136238 103909 206269 15688 38097 61787 -39768 -30169 77315 -390274 -11772 -220940
17669 -220940 62027 -45971 106160 251836 44959 257917 8786 -24562 77377 -79692 10471
17657 288978 -32848 117069 54405 -173491 211795 112940 94369 76271 64147 -52607 272671
17645 37316 -260041 -41544 -104059 300298 -65166 219655 236905 120137 -280818 -84635 128188
17633 -49523 14797 -6175 293432 15071 -190986 -44643 -73110 290248 -16169 90616 -88585
17621 71163 -54730 -165628 -104346 -84968 -63295 127616 306700 -25319 75099 126582 256934
17610 256934 77116 112924 109636 156480 308597 23428 -59424 55330 -127467 -96033 212157
17598 -230517 83672 -55626 9362 -241552 34507 182702 -63582 -7761 90573 -209439 -143048
17587 -143048 -69102 129824 -128504 165959 -144413 67428 6231 -190719 40450 -95673 -25046
17575 -60396 -344156 267485 320503 131722 -104360 5027 -8958 -304575 319049 -86810 -150582
17564 -150582 116427 -56507 -109005 334625 200295 -9917 -384138 -10189 107551 138424 -84487
17552 -49441 102689 -101973 93005 124081 -1672 -39804 -45958 538071 99019 -375148 75274
17540 -139046 208898 113328 209130 424023 3008 11000 4622 -283245 -105065 98153 207998
17529 207998 -41747 186544 236838 114228 105403 156042 5685 -98287 49779 118258 -41583
17517 5034 200791 162944 66270 219376 472249 24344 -22530 238325 -35331 117459 127184
17506 127184 -38911 277614 18128 -68021 82317 196111 79601 -135633 156210 73163 -111827
17494 -33552 -51508 140505 192726 -191260 -118920 -6061 -42276 124604 424105 30076 194596
17483 194596 -215785 93363 224384 60452 140549 359590 -152723 381475 183690 -116083
17472 319030 375345 105223 320229 -30215 263854 228299 103011 -43550 -94131 96434 -8511
17460 170227 -93735 170239 -32021 99461 280177 305502 269546 128789 243708 304031 85176
17448 176562 115066 161061 -74298 191433 174733 164623 184137 262344 190261 48825 673266
17437 673266 21085 302214 278713 480579 226138 272686 -140361 201862 351738 16294
17426 -136519 385651 60665 467795 476733 199468 340014 271047 224913 340467 19643 802026
17415 802026 249197 164158 468313 -85313 159529 179260 54767 173223 288941 -44370
17404 -46514 38574 134911 301815 -303445 148140 -172361 30188 -109789 -147521 227066
17393 256647 148487 290575 409357 354054 412419 267027 255819 61437 40111 108233 -86689
17381 -37107 -8940 115268 45277 246524 -34089 226905 112257 212124 324156 339565 -52672
17369 306146 -139607 489751 236362 110745 -208339 502689 74388 231436 -303721 -365527
17359 -365527 43522 -424756 -45901 -65240 205776 43742 -276547 96207 260618 36022 -3550
17347 41611 112713 58664 280918 -148406 88373 309001 -46689 130165 94551 508349 -258872
17335 299163 200504 8023 -285247 297302 222221 82211 138300 17575 -85993 -1645 94211
17323 353387 56263 7979 -149342 15838 -42894 91690 168693 56558 64314 15528 357580
17312 357580 148413 -70316 -62380 113568 -7392 -24526 -133595 140499 -63906 330801 91500
17300 286266 39323 162570 94441 128139 309229 26850 479993 139307 356322 -148636
17289 253315 265155 94513 -10022 211690 232302 344409 250701 145973 171997 -80655 166140
17277 181931 47489 -96247 34553 307360 264674 68130 408267 -63137 -248230 130825 442397
17266 442397 222940 279428 -139713 -190831 -153869 346548 225677 -46080 126534 246954
17256 246954 156780 -116771 312940 82582 80499 -121025 114416 -111610 139753 -28445
17245 -120903 249187 -123343 320772 305925 194304 214753 124910 92220 106390 165571 341397
17234 341397 2725 409493 -74363 53686 254564 142780 391445 412970 200071 -19470 113361
17222 -221936 190569 353361 195615 15688 186656 289242 335813 336018 245746 -122124 331009
17210 472460 165925 440915 218020 12488 -71096 229530 25662 283337 93704 223996
17200 223996 581310 249363 -191259 330208 122476 61232 318529 191691 125901 206898
17190 206898 254554 359599 310243 250767 150383 155851 245177 477103 243193 -40441 361918
17178 134209 155166 -84401 256017 74186 380264 90304 264977 138439 603537 390470
17168 390470 308533 522062 59369 172950 46174 104661 363597 448080 663085 146148
17157 389180 245652 301328 468941 226624 432048 -116569 279791 477689 172312 53484
17146 99138 196339 145410 363076 27729 42644 383416 355252 211762 487476 321127 467366
17135 467366 203216 139609 394755 47296 476000 566697 -67396 310882 474204 413931
17125 413931 283301 517575 617989 127536 248574 151161 131840 404902 231119 48931
17114 45312 504933 134820 331042 418908 365519 327908 197650 276778 342597 380105 438366
17103 438366 443256 330231 416520 76905 442675 362519 442771 4913 621368 366365 296940
17092 296940 309160 183327 225426 124008 224662 307251 13385 168555 191260 224647 143829
17081 143829 593785 356833 379925 227130 412008 189574 425281 595233 419310 392971
17071 392971 502782 370735 363672 417812 513171 549659 360944 479899 264046 428848
17061 428848 308800 496160 191619 313837 676924 662761 258890 314732 516651 359987
17051 359987 554762 513151 261916 535992 562580 369521 579438 773179 62557 599209
17041 599209 388586 754306 350564 369036 374120 314034 266378 397463 157468 397131
17031 397131 833252 532684 504001 351301 511403 588331 542065 408621 502460 655382
17021 655382 669275 533682 459450 596304 655422 211373 904734 568324 760419 436521
17011 436521 327181 589177 693208 608532 486875 732960 835557 263737 491229 275236
17001 275236 382109 388052 831510 491310 387948 453861 518804 800733 557526 835748
16991 835748 604005 840076 882777 456964 845877 831348 726525 514794 646254 868860
16981 868860 694668 975052 785899 711508 689214 756046 458462 979899 685819 690088
16971 690088 725205 776344 843320 321356 703991 485356 523614 884485 1003722 853810
16961 853810 845691 564625 1234281 963634 877042 974538 914851 746134 686414 995084 754571
16950 754571 1028481 911165 1008789 636838 862670 749940 800816 812016 1154680 749723
16940 749723 891816 1028298 770533 865564 955788 1131888 1123403 968929 1042903 716821
16930 716821 1370569 1159459 1125015 1191689 1202473 1156464 1236543 1111377 1385076 1010419
16920 1010419 1109596 1166384 762999 1232448 1116342 1506860 1240068 1181210 1298775 1410278
16910 1410278 1498169 1761526 1582181 1392039 1337414 1635567 1646020 1312799 1410766 1457875
16900 1457875 1543607 1674012 1562972 1817087 1567961 1836772 1605237 1524699 1808433 1542317
16890 1542317 1415612 1759198 1771495 1584615 1316790 1820390 1653260 1806029 1802443 1829774
16880 1829774 1657070 1755077 1850771 1983306 1910333 2130394 2181012 2060509 2028712 2049558
16870 2049558 2292539 2106973 2468015 2338744 2245116 2203755 2269933 2520652 2179794 2423049
16860 2423049 2603468 2739276 2496165 2197134 2284416 2345957 2695766 2529513 2947782 2585400
16850 2585400 3055463 2864771 2922130 2926643 2988008 3027964 2870386 3110647 3358298 3420260
16840 3420260 3236747 3441428 3036535 3722798 3644922 3609758 3767189 3792605 3950967 4072510
16830 4072510 3603424 3984228 3903699 3906391 4181277 4116338 4536371 4646152 4477501 4643702
16820 4643702 4706977 5122580 4790204 4913539 5184335 4916249 5466942 5281273 5595869 5521100
16810 5521100 5571922 5694548 5663643 6157886 6393217 6471455 6475960 6827037 6828185 7329461 6771225
16799 6771225 7466065 7306740 7532146 7881332 7995025 7969185 8226493 8839154 9197693 8960440
16789 8960440 9082191 9824427 9944348 9890312 10697141 10500359 11101310 11294947 11924215 11747681
16779 11747681 12497542 12696281 13058689 13012610 13838401 14376372 14343928 15402011 15253443
16770 15253443 15865215 16683931 17518043 18017059 18692888 19205793 20226649 20925106 21788466
16761 21788466 22527414 23730826 24517446 25039562 26786047 27996727 28687918 30271489 31745976
16752 31745976 33102307 34697949 36114038 37839165 39722426 41957441 44066726 46587409
16744 46587409 49152158 51541648 54512950 57611948 61539056 64485543 68692629 72753792
16736 72753792 77568898 81985142 87418478 92663382 98786889 105129028 111556436 118642449
16728 118642449 126005731 133535403 141220312 148856533 156651408 164164572 171292117 177869656
16720 177869656 184376367 188697560 192957293 195516610 196546939 196222220 194398001 191510689
16712 191510689 187515885 181894128 175465065 168694647 161471777 153681326 145753393 138276067
16704 138276067 130476678 122771903 115805652 108404825 102225356 96087415 90486200 84854552
16696 84854552 79829388 74863520 70612362 66655051 62537915 58870641 56018885 52839762
16688 52839762 49879036 47247840 44671928 42811767 40382320 38277048 36380632 35090296
16680 35090296 33233440 31956501 30240784 28874826 27693453 26644732 25451854 24297486
16672 24297486 23234522 22712155 21657484 20555876 20235035 19422744 18429594 17731646 16946711
16663 16946711 16571778 16229726 15435357 14869493 14431531 14015747 13303817 13404525 12610526
16654 12610526 12314213 11893670 11494413 10996992 11082162 10210409 10571554 9695252 9401466
16645 9401466 9248665 9069204 8708027 8435214 8275050 8440962 8239095 7848968 7630939
16636 7630939 7287053 7295619 7075591 6872344 6679878 6544462 6355038 6274976 6155310 5692091
16626 5692091 5947235 5870085 5531599 5475542 5051343 5053891 4979823 4736371 5145226 4839413
16616 4839413 4579489 4626616 4342643 4475863 4672065 4496725 3993755 3961145 4084287 3872306
16606 3872306 3932841 3940763 3908653 3953521 3783269 3460280 3481156 3360944 3413874 3184452 3100271
16595 3100271 3333133 3020125 3203382 2811593 3205061 3047984 2788990 3133732 2724247
16586 2724247 2637571 2875546 2562051 2431308 2550887 2661930 2658377 2427360 2220487 2364989
16576 2364989 2571267 2180246 2675986 2264979 2099170 2210536 2132248 2240955 2098493 2337538
16566 2337538 2121505 2028918 1980219 2011424 1784037 1863806 2013450 1844099 2094901 1677352
16556 1677352 1708997 1675009 1831557 1449018 1803940 1598237 1862968 1656588 1425958 1792223
16546 1792223 1755611 1545742 1833553 1477949 1630213 1575092 1462164 1517601 1449757 1254606
16536 1254606 1455825 1371855 1308556 1541252 1544479 1331523 957826 1577948 1249142 1266589
16526 1266589 883948 1119683 1429250 1092506 1057292 1255606 1206274 1030762 1136382 1197352
16516 1197352 1368701 1099151 931470 908948 1255614 855875 1029425 1049538 1045557 955513
16506 955513 1152445 894711 1076242 863354 883733 950203 879098 766483 913072 842805
16496 842805 1037214 945643 1115630 619158 1177159 629633 991125 911336 617350 1065425
16486 1065425 1061243 1073522 783207 798039 752180 735388 932159 1000572 891269 1040809 634668
16475 634668 1025717 402452 732961 405473 632362 830138 724612 636793 646220 708785
16465 708785 679120 726585 1062939 785769 606497 435934 497775 535437 453387 865335
16455 865335 581824 607563 312023 785063 396351 735829 345155 893390 611830 644344
16445 644344 667694 217919 331637 606012 600760 934519 650058 785786 254739 475130
16435 475130 429101 162645 643178 483528 724712 545991 490609 643090 718101 372291
16425 372291 649422 354520 724356 582895 451034 263487 384568 378165 359268 532903
16415 532903 64360 40763 746005 483775 330046 268678 572716 631345 442209 635279
16405 635279 139456 784684 371161 491844 308330 238428 367499 274726 581187 428884
16395 428884 364356 247822 385372 112044 385065 -95339 678800 662051 393757 498711
16385 498711 247793 379290 468797 728223 422624 199319 412103 304295 243499 345156
16375 345156 365815 552672 353208 570885 324560 129232 290432 437581 279965 104286
16364 228719 141101 261080 -98380 64301 449858 168063 470574 420431 299854 125581
16353 466529 245089 155700 782757 362649 435114 193921 2594 172797 495364 509561
16343 509561 419977 449414 543469 584581 247914 582672 134735 191205 -57436 432648 201643
16331 375026 287640 103885 256429 376136 418531 -162635 118874 283382 412424 350020
16321 350020 230590 -9716 291799 187967 272163 510128 372859 140577 156693 427328
16311 427328 296137 407165 -19976 429556 297936 35226 -114377 368136 293580 525085
16301 525085 386508 128801 133173 125721 183360 346279 -23107 446861 -164239 338768 -92352
16289 -147209 353507 395101 13209 312442 142179 86147 266738 120413 152022 198211
16279 198211 167016 -62958 285333 375280 237207 344194 254367 64575 -157914 419803
16268 59657 344417 205979 259464 389456 111173 8104 99287 -94760 83740 132719 100170
16257 100170 59341 202564 216432 58967 -35408 88225 -35039 106094 381882 180941 242229
16246 242229 201863 385009 94626 72577 168965 42364 297793 556740 110109 -162471
16235 72748 -196713 458137 149858 -58799 -96217 158398 98812 128889 80959 369741 105175
16223 144358 109859 482986 420069 221419 158237 -22969 -98595 95794 -108413 420506 294959
16212 294959 -339561 334887 65430 25380 168305 355478 -16165 184758 55762 10118
16201 69825 83672 303973 -8800 218114 242039 158510 -88513 142315 365912 -124212 -126905
16190 -126905 581074 544896 117400 -83405 261712 -13628 -329712 -24270 -47931 265467
16179 -6907 66832 211380 -100047 111648 98415 42269 114834 -351004 266711 -102529 110854
16167 -35531 87430 37127 18853 286746 -310661 -296229 114118 195133 -88672 -112415 -260778
16156 -260778 473574 -478184 278839 -32445 -68185 -28571 47595 -66528 84488 360225 496773
16145 496773 114971 -96191 -116610 -277145 -188643 -301772 -100977 74441 -197874 -220730
16135 -220730 230493 -111730 -316969 100304 333293 80884 -358560 -218686 124358 -12832
16124 288239 235566 8870 146213 256920 -91855 74179 -10559 79694 -295723 7800 414627
16113 414627 132159 -115717 -21062 74744 -95134 -410015 -407479 9163 -30886 318174 -149853
16101 640001 215394 -184921 131021 -270643 175440 -73451 87189 155546 48424 191641
16091 191641 38881 -292253 -277242 115070 23131 34936 -6875 200256 -250476 -110621 -247826
16080 -247826 -164660 52930 1228 129799 13389 83371 -26632 -284267 -597471 211685 -57359
16068 54226 239173 -151145 15640 -29097 87561 139135 159085 19767 244058 74307 -188869
16056 167772 149093 -422943 -39366 -112068 -71216 175653 -62233 315022 -125692 -21618 8547
16044 65227 165203 -5049 195154 -194559 -46421 21716 -105570 62656 227305 -118211 378416
16032 -298875 -36454 218743 40840 443387 4459 -180100 -248805 -9197 -131770 -56677 -71811
16021 -71811 -230913 69015 161865 -83270 189969 -8557 -63522 -99959 169828 -300023 -275918
16010 -275918 41930 -164878 -209188 257469 -119697 -11485 246054 3365 299435 -6470 -72370
15999 -72370 -266620 205909 -37709 186110 -88898 36609 -85716 250170 -226389 34339 -46941
15987 138000 -139090 120323 167 -216866 499081 285818 307479 272215 90223 15820 529560
15976 529560 166706 -10201 -169056 -178462 -70624 63795 108536 -78150 -152020 -366903 118270
15964 -203269 -58721 227611 22865 98719 -68277 -231596 -112433 269152 141688 -495 150230
15952 -277680 69817 -3746 179484 -141233 -179848 36981 483302 178442 -42670 18527 -34388
15940 48345 -42732 -118495 -42074 -262757 -259476 310968 339049 -15467 -276134 12595 -287461
15928 216352 326335 98704 -40716 -198492 -189332 -243009 -338197 63060 101739 60148 -230324
15916 41650 -121345 -31831 -28207 -61429 -48965 84205 -204755 199931 -4768 -353552 363455
15904 15735 63635 -115899 -204266 113612 195060 -286051 -198433 -354112 31780 -30856 247070
15892 -303368 375495 -225633 -333081 -154675 -16732 -59157 -170366 -175064 -222496 -35767 -73858
15881 -73858 -133385 32497 360031 -63004 22046 -77192 -84045 45828 -142803 76570 -62356
15869 182366 94645 -171459 157550 -105122 -343724 196587 -173432 132051 20988 236599
15859 236599 -108728 -112726 25175 -164739 106482 -130168 -139489 170137 -124068 7163 -60554
15847 -76112 -379331 -114713 -57699 45304 -64220 -97210 -118448 -59808 -40827 329408 217155
15836 217155 317324 210821 -18043 -77259 31798 -9386 168876 -231348 42778 -186015 -316782
15825 -316782 -43546 -381960 98933 84863 -376790 227853 -27842 -26546 -25401 -271217 29460
15813 74766 -122519 -35344 -169460 -170140 -86096 -301551 -110695 290261 -14167 -297286 -225134
15802 -225134 -250996 20869 135751 -1291 -184106 -196304 -249553 -45631 80009 118821 346148
15791 346148 -390812 -128138 -16432 30879 -14619 -87556 13672 63931 -290092 -200425 -185950
15780 -185950 113289 107323 155525 117653 -62175 -123473 -81704 5989 146761 66636 -497179
15768 9340 -418587 185367 18893 -199125 -133442 -167748 -258062 -120249 -28647 -264139 -221663
15757 -221663 94790 -107869 169782 -24010 -9945 -172250 -124688 -153109 -123943 152977 178401
15746 178401 131452 -119955 149627 -31618 -82556 131226 -187491 -248708 -32237 -8483 191093
15734 -105231 -12873 -95209 -52863 -32564 -149893 -237460 236075 -72625 162457 -222705 -33193
15722 -312945 -109108 -8033 20195 5693 80375 159303 -68709 51234 63472 43868 -220942
15710 -28584 -100709 16824 -116434 204252 3735 -171536 -303142 121717 -348732 511 -392397
15698 -4228 -165208 84327 20630 -233776 -199161 -183764 65883 -317103 51834 -117085 -338670
15687 -338670 227739 337749 -260345 -163491 -240281 -24679 -37589 -279588 -104079 -417141
15677 -417141 -134036 -68422 82361 -241512 -15704 400492 -119086 -60188 17871 52931 7560
15665 -68237 -330868 78371 -343187 198076 -337271 331164 -19569 40734 270521 247401
15655 247401 -251872 -95429 -2830 -84619 -185408 -72251 -78221 72880 54547 -229615 -98306
15643 131975 -347824 340526 -42422 -177873 39666 -56257 -326061 -66460 396828 -339574
15632 88842 198534 -217135 147694 110352 -113754 33974 -17981 21577 421605 -72332 -44936
15621 -44936 166287 -183318 -54236 150272 228152 -85812 84129 -186935 53189 -203957 -44377
15609 -38889 -104115 106914 -26795 215759 -256971 -86269 155651 109346 210839 -4833 -102525
15598 -102525 127939 -227875 -246939 -2731 -260177 -29277 -209354 -22245 -25482 -42337 282561
15586 -20426 47136 -187332 3449 93007 -217214 61292 -809 -115982 23862 178602 99524
15575 99524 -159247 56673 141258 122613 203534 -8849 -307621 -109343 257676 -223691 -10609
15563 243190 88102 -275568 14200 10668 244107 53000 137992 -74797 -143823 -288999 -60651
15551 -217922 -157965 536934 106452 -20181 -124692 -229140 -37200 33531 -20434 -38967 95600
15539 181227 -69354 -52999 58743 368713 107515 60512 -367107 -272159 -76396 -324474 -269223
15528 -269223 -223727 314488 -150556 -30611 109512 -188379 25879 -74956 -170684 45667 74258
15517 74258 -394853 -61395 109874 119505 -18916 -292922 198278 -106520 104167 36488 48164
15506 48164 -80480 37202 39008 40068 42106 -381014 -259682 -34889 -73716 216154 -38612 -143619
15494 -143619 212738 -51965 79070 -272194 -100786 -43471 139095 -44298 -343038 -192065
15484 -192065 155762 12149 -311403 -143535 196707 -124171 -70005 -43323 -68898 209062
15473 171707 -123749 -200344 -114402 -155636 -225198 3419 -12509 -135249 4787 -91748 140527
15461 -105829 576227 12363 188473 48175 -148979 -171890 135414 206541 181330 -118658
15450 248489 365441 -303941 -199870 -33453 -69532 -168741 -152855 158050 251075 204408 306192
15439 306192 43328 125757 -331187 39640 -222601 -135556 104600 -257280 -186189 -95045 295815
15427 -115354 -65856 3847 3769 -56674 146727 240767 -152829 -64940 -5298 -117256 335956 -6312
15414 76619 -90677 -183581 300436 -72739 176878 -137686 296465 147636 146211 -280410 143421
15402 -81365 174625 79207 279890 -191033 -152406 -33788 -44128 -167150 -271714 -103401
15391 49246 347758 -109991 41239 -141118 199473 321625 283058 -261430 205830 155183
15381 155183 -70658 -30669 -307247 11986 15430 210664 -195261 -78141 53648 205824 -153512
15369 -473884 -94071 278148 -17031 -140449 47676 -340879 499351 128036 -68347 -218930
15359 -218930 190281 -311208 -65409 9130 -108957 361138 37729 -26242 -220236 228382
15348 115557 119525 -41238 168449 -128809 110944 -162410 -64382 -315210 -62608 -340031
15338 -340031 -120395 -26478 -374055 -25809 99211 -45269 105712 -169449 -279226 190658
15327 290702 -35629 339937 82780 -81061 -16624 4319 48512 -264742 162791 6629 -141051
15315 10373 63778 -36205 -91946 -105361 72763 80118 111362 -75264 144633 126269 -19130 160334
15302 12850 -104232 -969 -16542 -230440 110906 -69113 -112491 -45621 23502 55772 128988
15291 128988 -47320 25993 89565 361242 23258 -173926 49422 334995 266807 331941 91778
15279 -99315 -157024 -162184 -240639 -36267 -41949 9444 234067 -337607 -130323 67856 307394
15268 307394 -141657 -1637 48121 -81978 175160 247720 -309564 251056 -39338 412101 165325
15256 -335558 97345 -246728 78388 -32077 338994 380400 279606 891156 1717454 1513717
15246 1513717 1574356 1114072 628656 477822 -6678 -152828 -13596 79575 403295 -180098
15235 -10872 -87434 72775 -169230 33767 -294746 98716 57397 -193429 -75122 -55741 282673
15223 322228 110705 208910 187762 54067 -69229 -17915 18851 298161 195057 -135642 308068
15211 -33441 153766 54728 284204 -306768 -1901 64240 -475196 138924 -128942 -8098 458017
15199 -83545 -252034 262618 -170722 61503 445594 281418 229850 508401 -91093 -35296
15188 -322267 -50512 -101450 148807 1625 -67917 27022 296574 130389 -77745 -144973 -58845
15176 77304 362329 242952 -79416 -52038 -47084 191653 44049 124865 61406 173785 250242
15165 250242 157681 -49379 44014 237186 262735 -65093 490453 104965 64124 -116835 177069
15153 -233606 -72976 -98514 -78451 178078 447872 25256 -75656 -19704 29726 190360 -286053
15141 -92363 154099 -54390 188067 408595 16550 -4331 47049 43320 -24645 243809 299702
15130 299702 22082 65828 298714 10098 -75710 335373 127918 323881 369593 309004 120845
15118 419166 304475 358764 279379 23276 74606 96298 117411 163940 -149338 109436 460517
15107 460517 134858 -58368 312137 69917 430493 17403 -156648 472522 -75352 189492
15096 159754 239902 80612 99674 -84852 264337 36658 94378 194511 -29668 409218 31693
15084 -236336 195622 266348 -172404 -132291 221781 146036 177933 35512 3288 396159 155571
15072 341672 -123631 4765 212078 465223 -143904 -308114 500161 -67178 -190190 123360
15061 188506 104152 -274548 -123924 134005 182567 121629 -112196 298444 -27581 176709
15050 115470 -69905 -169793 73433 127320 79417 44111 336461 197056 -3561 404818 -73564
15038 220345 512707 88389 -41763 -185202 466157 332332 -147122 -403617 40801 331229
15028 331229 283832 189763 346911 11951 350408 -132156 167662 18811 820 180012 167468
15017 167468 29752 109537 63537 79637 397131 147537 -55971 191472 381801 243766
15007 243766 295148 -160903 183675 -52745 465174 52200 61671 332225 353264 -114406 299465
14995 11063 276317 281918 -252834 311182 173143 168721 289025 -26525 476606 208927 202268
14984 202268 509262 269538 162943 -3621 -42456 205298 -32146 320961 58246 251933
14974 251933 -134283 -112057 140271 410319 -96655 69192 580060 297438 302644 291827 456519
14963 456519 804261 140257 365854 -4960 300721 177268 265773 105216 238819 219291
14953 219291 91916 581649 67867 51659 57953 396840 171621 311566 391798 -31966 201719
14941 203737 29375 147395 -92711 265412 -101121 38968 370463 319369 -21321 457204
14930 263998 476496 430435 479322 16801 373719 223637 407731 313023 431690 221575
14920 221575 378215 387296 434580 195964 416364 427612 161353 468219 138620 149602
14910 149602 200054 334065 268212 450666 269087 257447 132520 513284 438336 303636
14900 303636 178307 115790 426600 125334 442979 217090 639364 196261 300370 508886
14890 508886 473541 240136 -33312 297208 494972 223280 266158 278666 572804 462860
14880 462860 545265 -176221 494587 342296 368469 344018 134230 -5509 492308 73260 35653
14868 128160 283726 26406 192873 529076 368510 56349 591848 108563 369935 520469
14858 520469 437839 524223 247443 222514 493958 329341 207745 101565 496615 425774
14848 425774 497114 636225 660462 332906 165447 566079 233593 174433 364263 211869
14838 211869 312816 359335 334750 214339 481586 150229 313705 581488 267757 316924
14828 316924 433227 202744 408828 434511 585836 309937 124192 362206 506361 477576
14818 477576 367734 516316 506692 633522 534505 289702 465256 300881 439890 459581
14808 459581 602176 631099 367325 426061 787007 377909 647465 155572 699347 679186
14798 679186 619049 246017 524662 280904 806185 410490 675411 585579 567143 486645
14788 486645 248036 472575 811272 182501 625655 531697 517669 517618 706486 445483 400152
14777 400152 253402 254248 484703 425701 227283 472710 587220 612961 689199 479496 296080
14766 296080 481632 620171 864660 355602 563693 421207 526352 531238 608098 370465
14756 370465 760375 101005 377767 545217 624108 586233 541111 653672 728268 850586
14746 850586 885694 392007 153584 616851 482339 771349 627462 471706 425290 869487
14736 869487 1007831 430055 366018 345671 696853 558331 527336 879639 878010 658636
14726 658636 838803 704020 236219 684362 365204 695004 817832 412518 894171 983881
14716 983881 427190 820064 423408 684265 738921 714822 639520 885269 932982 922488
14706 922488 856059 804148 804518 822123 1165521 695488 709740 949950 916495 710111 1042671
14695 1042671 661978 758824 1096681 886181 979874 1034426 789142 324032 842728 779084
14685 779084 873687 953842 666223 1011679 850787 732238 694329 785923 878569 1149789
14675 1149789 912524 999138 734483 809956 673386 1011367 900431 845223 825569 1235472
14665 1235472 955257 1021401 704160 856280 924707 1062411 1057672 1015243 1065480 812878
14655 812878 683347 954866 989793 1079056 1106355 891628 1330050 938692 1261314 1005450
14645 1005450 1128429 1204848 900434 1269255 941976 1059107 759348 1039575 1032335 743455
14635 743455 1139803 1441500 1038831 971671 1221478 766284 1554266 1061381 1554335 971547
14625 971547 813987 1395507 1442530 905979 1210525 1202863 984509 1228677 1134555 1391282
14615 1391282 1123001 983472 1611801 1526236 1280822 1495624 1316557 1535723 1255709 1563777
14605 1563777 1175242 1655522 1358558 1535134 1315208 1487740 1112546 1545144 1375913
14596 1375913 1874247 1354054 1490331 1817374 1641624 1824468 1692394 1197555 1439515
14587 1439515 1723122 1215648 1574481 1810965 1715913 1816824 1969685 1893734 1923945 1850524
14577 1850524 1715179 1831209 1813449 1544129 1963437 1952062 1455727 2086694 2236876 2194107
14567 2194107 1915593 2040206 1989014 2219818 2106995 2388532 2290723 2470512 2352559 2647158
14557 2647158 3144608 2566748 2954032 2819793 3400232 3764758 4577531 5165586 7556591
14548 7556591 12001641 21554755 37880031 41690383 23325478 10304166 4909321 3396305
14540 3396305 2575812 1944870 2016627 1617878 1625264 1943505 2014078 1981528 2122791 1986546
14530 1986546 1706360 1848764 1927924 2095990 2083710 1948149 2092778 2302227 2289134 2103800
14520 2103800 2162861 2528669 2387671 2369684 2279569 2357371 2454923 2510852 2439261 2456465 2592131
14509 2592131 2279386 2667975 2848435 2742472 2710653 2773101 2691090 2830753 2782877 2972825
14499 2972825 2875197 2723106 3121724 2823831 3063531 2935908 2899416 3215426 3735276 3173110
14489 3173110 3240488 3519379 3140063 3139906 3304285 3446838 3715713 3420982 3360493 3657566
14479 3657566 3422877 3784675 3548106 3858309 3284312 3699281 3941506 3916034 3775577 3524198
14469 3524198 3741850 3812957 4117563 4124784 4058947 3970347 4192864 4468807 4225195 4615232
14459 4615232 4249087 4224728 4670081 4772029 4521693 4583380 4701216 4898709 4734050 5129357
14449 5129357 5156062 5119323 5241416 5439345 5332889 5663785 5111900 5430918 5608415 5785477
14439 5785477 5845104 5560100 5687059 5927645 5751421 6132581 6120229 6095507 6083317 6057679
14429 6057679 6618749 6346742 6665872 6887852 6848905 7202573 7196883 7138909 7286581 7649277
14419 7649277 7603124 7414317 7756376 7938105 7861124 7947335 7866716 7908419 8477941 8451174
14409 8451174 8403821 8891327 8966413 8919655 9031659 8991050 9592449 9261009 9915651 9728419
14399 9728419 9984652 10102738 10379570 10376623 10397034 10502385 11199291 10973311 11028762 11329923
14389 11329923 11663193 11849155 11972493 12123082 12609132 12654921 12998469 12846472 13451815
14380 13451815 13612699 14177294 14220914 14512371 15037261 15043469 15471027 15774688 16290449 16423875
14370 16423875 16587486 16972291 17220107 17719186 18268072 18619548 19068008 19461055 19841793
14361 19841793 20195513 20666631 21255600 21676264 22086197 22562317 22910824 23432628 23670683
14352 23670683 24751419 25096026 26157096 26772732 27335029 28012447 28669697 29368656 30044825
14343 30044825 31112467 31561694 32681884 33570253 34458346 35335325 36598374 37197473 38715304
14334 38715304 39620199 40940496 42269559 43527732 44995349 46202555 47767434 49238649
14326 49238649 51272643 52844164 54661838 56722201 58152056 60535798 62900144 65374710
14318 65374710 67853399 70166895 73061984 75785433 79187482 82284866 85809333 89202896
14310 89202896 92844328 96874372 101695699 106485987 111075185 116479634 121997410 127869435
14302 127869435 133940492 140718828 147637701 155290835 163069772 171748775 180756018 190335647
14294 190335647 200633954 212018731 222987868 235567702 248612672 262072002 276534501
14287 276534501 291671775 307161969 323218692 339756283 356729465 374206496 390785821
14280 390785821 407553863 423432772 438880833 452297122 464300731 474407286 481744552
14273 481744552 485394273 483547216 479301004 475665963 471957979 466987220 459911970 449852596
14265 449852596 437073717 423143162 407775924 391920641 375279020 358216548 340998647
14258 340998647 324158727 307601850 291530603 276834085 263132204 249236508 236007496
14251 236007496 223495561 212049450 201010068 190649205 180769600 171601529 163363832
14244 163363832 154995111 147645037 140789078 133901378 127460593 122008226 116802301 111833258
14236 111833258 106451234 101680834 97638599 93326850 89830760 86637928 82615247 79798049
14228 79798049 76327581 73678413 70934861 67919122 65661441 63195336 60581513 59042697
14220 59042697 57205419 54827675 53038989 51298069 49759680 48211950 46867374 45438609
14212 45438609 43813232 42607784 40941329 39976578 39327606 38605553 37526992 35885777
14204 35885777 34863643 33786941 33208802 32414349 31556914 30732539 29770426 28736499 27904160
14195 27904160 27163771 26959835 26391102 25441638 25044171 24461684 23757191 23318335 22770216
14186 22770216 22106096 21393994 21208088 20679526 19998804 19797410 19567926 19142983 18432260
14177 18432260 18190502 17679676 17421828 17056086 16584641 16473209 16538343 16078149 15042235
14168 15042235 15136831 14747329 14570117 14630516 14166876 14015189 13585110 12949000 13194463 12661644
14158 12661644 12757251 12439458 12251298 12121215 11908988 11580235 11631852 11382688 10969134 10824809
14148 10824809 10800206 10536476 10310356 10248911 10166826 10244377 9977412 9778521 9350561 9264805
14138 9264805 9383959 9301969 9185854 8700007 8829712 8438171 8451050 8331851 8268812 7791749
14128 7791749 8033724 7975603 7768605 7648735 7662584 7686517 7597858 7136496 6971495 6965382
14118 6965382 6866451 6818007 6744765 6896000 6627211 6511469 6487108 6517396 6166862 6346792
14108 6346792 6253375 5891083 5851695 5994709 5491388 5753758 5924171 5679853 5867121 5658722
14098 5658722 5549258 5414706 5528799 5257509 4729044 5165467 5182903 5102897 5110541 4836923
14088 4836923 4821898 4953811 4817781 4768736 4411483 4378539 5045636 4742443 4466729 4235608
14078 4235608 4445895 4481929 4460671 4195588 4198418 3702221 4323109 4143732 4017423 3869855
14068 3869855 3838258 4052857 3667498 3506990 3993047 3941405 3721008 3637936 3465227 3631751
14058 3631751 3406546 3722039 3545383 3413481 3299655 3496036 3516700 3620987 3217428 3259692
14048 3259692 3046365 3136418 3295545 3212620 3226961 2842799 3053542 3070922 3084854 2860981
14038 2860981 2878791 2887803 2843410 2710243 3004646 2822709 2916263 2977929 2883838 2751433 2784900
14027 2784900 2757611 2542474 2685475 2870394 2777679 2953863 2550986 2355480 2524603 2270103
14017 2270103 2163459 2265786 2326760 2100043 2318980 2379131 2485321 2337052 2712861 2244190
14007 2244190 2439194 2325023 1998724 2455324 1672188 2067191 2074624 1941786 2136654 1934124
13997 1934124 1669961 1863212 1862552 1789142 1984236 2190697 2105967 2643359 3367688 6758326
13987 6758326 15038719 31289547 41784681 24732039 13367477 8041946 5712795 4622863
13979 4622863 3936079 3441411 2976647 2984133 2604413 2497951 2358094 2394235 2494026 2331185
13969 2331185 2222744 2353665 2516305 2317054 2327741 1990056 2574378 1969419 2349376 2061030
13959 2061030 1980120 1615394 1970385 1772428 1652853 1702341 2022718 1984691 2174474 1945979
13949 1945979 1588833 1893757 1702583 1997006 1884759 1782321 1659103 1870716 1775965 1719095
13939 1719095 2014628 1803311 1721653 1614638 1630075 1345066 1560890 1626873 1368053 1870165
13929 1870165 1824321 1540103 1459066 1428795 1620595 1657795 1488497 1631979 1317370 1386961
13919 1386961 1606902 1194388 1364932 1611949 1698417 1526387 1527723 1199674 1518713 1302343
13909 1302343 1598780 1165504 1392704 1374798 1207263 1278239 1318699 1105597 1370575 1223179
13899 1223179 1147542 1289723 1277089 1146371 1336730 1447981 1332216 1199478 1016177 1378690
13889 1378690 1183658 897625 1181789 1093433 1023993 1141112 1038848 880397 1249014 1078226
13879 1078226 1326621 1024627 1088414 1296791 1351532 926709 706135 1245973 1201201 1277314
13869 1277314 1076789 931685 1095949 902930 927476 1234687 934561 1163550 871848 1078864
13859 1078864 1332568 941884 1087276 811706 849058 969999 995354 875091 1026334 1098427
13849 1098427 804330 857546 775513 978918 1066619 690717 619008 940579 1264837 1069204
13839 1069204 880808 1277313 1117104 996250 808417 979464 1004282 674720 888486 967209
13829 967209 844648 774256 861697 648411 753368 690828 878061 801020 493578 668643
13819 668643 1112320 599643 473833 795097 815171 738587 646592 856247 995645 795534
13809 795534 722323 846289 936891 877575 1023279 819693 615290 841421 839038 639373
13799 639373 486137 649890 953050 755387 777439 847155 651609 673106 660648 888984
13789 888984 793181 675775 1017348 688587 757505 642785 896606 950508 793160 815314
13779 815314 605091 521007 733821 489567 865215 563514 628557 929260 732661 326735
13768 836475 871272 915384 643181 974568 773866 715708 627944 450179 627942 485249
13758 485249 535044 395618 803471 530623 592597 428845 877851 645649 472644 775283
13748 775283 463410 839848 679073 774121 484611 378408 593934 714245 545427 576686
13738 576686 252676 597139 556888 487589 468566 603102 755092 494041 628550 450388
13728 450388 583448 471085 454113 581452 686428 451830 439797 756613 346929 519568
13718 519568 546027 600592 499755 541576 418722 795198 537911 742184 805692 842670
13708 842670 361839 746437 557947 526620 425404 504910 467462 705722 563906 485017
13698 485017 610197 453802 351476 643314 302053 446280 413927 340839 394014 556724
13688 556724 374238 419673 548035 324332 145684 532765 463780 536954 472347 468868 732995
13677 732995 422796 487945 571720 445258 402246 94981 594435 225856 717269 658469
13667 658469 503075 630966 448303 681344 285466 413029 218991 701901 708786 284414
13656 478694 550785 374402 593380 787106 561155 540564 545519 321763 169253 276063
13646 276063 501643 445850 506235 164513 514960 -48000 480514 777086 446649 327240
13636 327240 332355 475409 586022 412210 564078 660526 468675 -114915 475187 372551
13626 372551 355600 573684 377562 424507 311823 140849 155517 333615 701664 402648
13616 402648 117901 122434 533519 351936 343197 388516 229903 434878 486501 264965 292999
13605 292999 257510 383816 424545 747000 353473 122848 245214 249406 500961 389871
13595 389871 321982 564817 468639 290144 479583 530582 290297 201337 518799 153097
13584 142082 167623 197312 52662 221155 549098 104372 385861 313046 193243 311267
13574 311267 579448 626365 275968 323169 408498 408237 -68266 116676 313561 796300 46470
13562 452244 358054 348785 533117 585176 181071 469123 330877 268329 231014 272038 447629
13551 447629 57416 141478 20406 141310 554163 252248 27401 227760 517262 334301
13541 334301 87928 498981 301146 437147 291244 108088 181065 239483 411032 357394
13531 357394 221681 133179 443629 596409 -12698 164810 248719 144943 50166 407682
13521 407682 295364 255897 452821 190479 194452 56796 -14698 222937 444025 270031
13511 270031 231913 209885 146267 422249 355517 430474 294512 338124 203316 -77160 23050
13499 174593 299783 -81516 212988 218750 398810 313250 594986 666378 256563 20618 212377
13488 212377 312536 364601 258088 162067 266286 244367 64446 516640 502298 254249
13478 254249 20537 63970 -70848 591265 486297 277091 245625 387525 105766 21184
13467 64624 317833 315638 132350 45513 -42865 407601 -42073 310275 330335 149326 289362
13456 289362 -64561 254982 273135 279725 -108160 65143 -15429 131722 406531 659019 96997
13444 345036 172825 37529 290621 32271 -309114 223825 227414 186137 147995 460186 -42837
13432 255529 143894 404437 -62316 464707 101212 287500 175749 330552 181124 92595
13422 92595 251017 276499 -64751 61682 519363 618603 404389 18088 209833 312250 -47390
13410 57022 100572 300994 -99204 239934 129733 290282 42215 149347 167952 -103203
13399 28833 54492 -66369 410589 58963 205293 246822 -45038 166595 269256 507359 233549
13387 352327 344620 133969 141094 25697 -31193 249606 402915 122640 454549 95214 168340
13376 168340 -155423 313984 294156 61677 155360 86790 364488 470531 34392 235432
13366 235432 216395 545218 253798 144782 200447 123949 196642 57166 550412 36245 217255
13355 217255 -359 278951 92310 -69405 340424 282246 290840 382455 224083 201296 384740
13344 384740 255094 254620 252344 109967 221620 379001 30359 419211 567396 -73186 170695
13332 479710 224166 45630 92702 110752 170400 245613 306466 229720 350091 164199 441874
13321 441874 62009 113228 169703 403260 -11368 444707 -87210 -54367 256723 203430 -59580
13309 332104 207874 313521 -139402 -18155 243295 121200 -161469 -44725 109690 226863
13299 226863 133147 307126 122472 304685 223054 299520 87787 120585 22868 460099 293782
13288 293782 250006 47768 80366 115236 -67822 300183 369844 116288 256799 -13648 -52769
13277 -52769 -350776 356390 200474 42218 197161 -162851 274825 -81028 513034 353724
13267 353724 181758 224129 589178 186485 365946 176378 -5759 -51996 92559 277272
13257 277272 297857 419530 150942 -242019 -23792 200196 -212557 345032 -31623 138292
13246 234229 124746 9680 -285328 261812 -7996 191595 -24788 145263 -181554 -18665 146147
13234 -24972 183154 280675 183580 346909 285081 149472 120904 217308 -66812 32238 163139
13223 163139 57970 55083 -30756 33769 162916 307882 155404 60887 10846 303809 107341
13211 74628 47829 -156336 -12460 -146447 -99238 -182081 153345 -208888 100358 145361 131216
13200 131216 -222797 123695 189184 4480 -133298 -97134 498918 -215621 -11136 232909
13189 289890 -253498 117350 -173034 160511 -180577 26723 154345 -173502 269819 151579
13179 151579 -250393 205427 90818 89680 162260 -36041 63337 463172 54902 -100906 260901
13167 135540 -132867 166113 255957 111099 215835 532725 -79008 34168 381177 -58015
13156 338585 239622 -113861 23776 183047 353398 -196723 146883 -106615 66779 12943
13145 78475 30934 250570 107694 204037 260274 49693 110575 146577 -154570 302758 57029
13133 -150783 109981 171875 -24818 363445 149086 -144279 33740 301276 124109 159023
13123 159023 -60966 -244360 110198 -23839 -165247 28298 -78726 -156352 153436 -97572 205611
13111 271548 155679 108032 -278873 21240 -193802 405680 52655 60558 209927 193884 237938
13100 237938 -138987 -36791 227766 225844 256008 108324 -221352 -357091 230600 -21794
13089 97074 -79728 172859 71832 99534 75676 -69670 -60698 126122 133758 212798 359343
13078 359343 237939 53444 -82464 18600 -188568 364499 143726 -85249 60894 346666
13068 346666 80436 321177 172173 359158 218258 168638 -22550 153489 241461 -281860
13057 7668 -126610 24477 -45965 -55635 -278410 142407 252170 108318 224895 -109986 95777
13045 44773 80920 -77904 8795 169683 89504 128264 153114 106830 -11136 -32643 114429
13033 398399 131321 -166374 7148 307599 345401 575333 146071 159928 495 56048 223315
13022 223315 86217 105421 76601 267225 -78886 -134832 -105467 306071 390735 -56553 85307
13010 -185986 113123 -444317 -13157 275231 453264 165089 7242 115841 101834 314661
13000 314661 -49805 87264 -217340 -837 -87596 -108734 48207 27111 -10508 154452 -188492
12988 -182992 -7849 -175639 131307 -41478 180125 -152231 -206603 51746 -140496 93064 698920
12977 698920 58311 -207957 -224093 74878 -33515 332029 42770 211288 146920 94170 55221
12966 55221 21477 70124 148634 -69362 425562 21027 -303072 33937 -25114 -33740 171705
12954 -263499 -53504 101079 85580 -219831 55180 52764 -116418 372393 -178258 440979
12943 -238143 207499 -50599 151553 -113001 86088 -60122 -382407 506275 92407 -16963
12932 12827 -171219 57440 -226610 -148586 201869 143252 -87664 -221213 -66705 -87011 -62904
12921 -62904 177714 -68754 178629 169678 36122 -40496 19605 -54239 -114434 399059 29258
12909 -2897 387790 243823 74272 -7671 -69305 -190826 246825 372872 -262931 -25591 83990
12897 365779 -174513 38534 -138526 173051 181427 3559 -346538 -224794 -40066 -295204 1867
12885 334744 27345 -42800 -180196 156775 131123 -160225 406182 -473711 383645 207600
12875 207600 159476 -25727 146770 81370 405521 -240037 333906 139579 66980 35905
12865 35905 -242191 266910 -135514 51897 47492 146182 -52553 -324462 -94267 -28063 171801
12853 -139000 18307 244888 211030 72952 43588 -29131 189881 -212159 -60680 -39863 -32301
12842 -32301 137331 -10135 16871 130658 415562 -186758 -42016 102691 -35401 205555
12831 -116791 213526 137297 -63554 -337071 186413 174933 128751 -177346 -244431 -15598 212145
12819 166807 -70904 -109932 10709 72499 79091 -76816 -112704 -135843 -77557 157968 -351292
12807 405620 45353 -223544 -60949 -137144 -182126 106273 -20857 145150 -122101 362256
12796 338989 53262 256044 120118 26995 -45234 -262438 -205312 -146536 -182005 -91517 -70665
12785 -70665 260989 -159089 -130415 -9920 24497 188236 13497 -172768 -150183 -92537 208074
12773 148111 -20311 -85312 -41854 -36277 37250 46068 45865 135094 110306 58776 184108 -235238
12760 -85656 531593 89171 87790 -134000 166615 -73134 -351257 -247540 195907 -300835
12749 184461 -138800 96688 153768 58658 -106670 131408 -394703 228628 -28872 96637
12738 160648 237997 118732 -87728 27354 88007 77372 -70550 202848 46113 163320 -116291
12726 280029 50619 122202 -19124 -176808 -27409 -51580 -50729 79819 -70125 233575 47661
12714 326027 -83086 -100153 -210130 88817 338193 -114962 277291 248452 150551 -14867 85330
12702 69562 -30943 372633 -8328 191527 260166 -632546 37868 -151895 106104 4728 19169
12691 19169 72640 274659 32436 -259137 206143 -143785 149256 -96974 -180984 -7074 201704
12679 156607 67956 -129760 167366 137698 -4839 -63445 311046 390734 -194065 433986 350946
12668 350946 -93996 -157628 -3888 -53523 83602 -122545 -157456 208900 6453 48856 137460
12657 137460 295001 152225 198120 178707 3666 34145 140290 61372 -155013 31734 84325
12646 84325 475815 -71288 -210588 -27700 105234 -339135 243785 59621 366691 180635
12635 240281 473593 140999 46046 -87934 254154 240452 -79319 302864 307772 4636 445080
12624 445080 198430 25686 165448 -178801 143484 -73449 405786 200247 -273571 -82902
12613 -21256 -227277 -147229 -14178 -127763 14898 81827 70568 10711 47056 46202 188471
12602 188471 47879 483875 71885 438483 211218 -86358 -32023 71374 450832 -66455 108019
12590 105244 -31918 -132975 -48009 109260 -320819 21252 -368918 -3649 88941 46862 -69257
12578 218390 -17205 334855 205082 -90972 121991 90211 -317156 -11730 84821 -16363 86761
12566 -77275 -36725 25270 165304 121709 -185359 -297750 99718 142199 -106058 314709 -454017
12554 162620 168178 416851 52230 51290 -120435 121367 -439611 76670 212464 27962 -3288
12542 70211 -9452 16315 -79733 -190012 21591 135655 247680 -26937 -39372 117315 124342
12531 124342 220241 268066 34920 159237 179029 21372 491507 -192030 -132767 -260486 40439
12519 270909 -40036 11882 23815 137073 282328 36944 289594 -38485 137874 192641 -151430
12507 -101210 -334142 67683 -71694 -81433 -135124 219356 -122738 159187 -108842 326633
12496 246768 -241050 340768 -34762 209693 12898 -110518 -9234 190382 351692 -42641
12485 82241 -221724 -164804 252421 -267229 -46820 -78008 -302300 -301114 92610 -149528 131608
12473 42444 15025 3628 156203 -131335 -100498 369307 19556 -65898 57055 202597 156459
12462 156459 253676 343939 -79456 -44392 -401480 -107461 -29250 -46089 134655 -32573 280661
12450 -111977 41478 123828 187706 27417 130606 -67680 -64361 -242508 -488508 59925 -174274
12438 108539 102879 7298 -484167 138365 -269966 23748 -42033 -99722 214902 275373 -17789
12426 15644 -41323 -107005 -421972 -99731 -34134 76737 -120072 44562 -71267 26059 -101523
12414 42590 -214932 -106 -259937 64317 -53577 -379038 113585 -69033 181562 -308184 61634
12402 -187859 -26845 -450680 166509 71341 298292 92350 -199537 -217712 117686 -66434
12391 156498 -193700 -127165 -173198 -185460 148378 -109974 330712 -276562 134373 39474
12380 80 -239364 30363 224418 -439409 59021 92896 -250186 217877 75122 -100919 -172104
12369 -172104 -29051 266407 -100948 93967 -25382 -245190 91149 -77720 -154005 -63700 -139685
12358 -139685 192330 141846 -186480 -184903 -17080 -325256 309128 35858 293291 65142 -191291
12346 -77118 33589 -34581 -17268 352278 -68829 286579 6168 -53548 -6400 -287662 -240593
12335 -240593 38776 -192426 -300333 -343147 -66374 283361 59301 212149 -156678 -62634
12324 -137446 -275268 57667 190942 27664 -136069 284980 245551 238180 -186128 -77954 216905
12312 -239985 -54480 58895 52319 302480 -8856 -84299 -117680 56042 -229953 -31863 -179576
12301 -179576 130436 145146 -336733 109019 94602 -202899 -110133 219587 9086 35566 86429
12290 86429 209438 -95031 224419 114902 -52006 81606 161136 -104177 199857 28550 41575
12279 41575 -242270 -72451 254971 40952 -187297 248484 55707 28170 478823 4023 245971
12268 245971 72964 -1355 62143 -97327 231254 -1487 214417 335836 130215 112455 -170872
12256 173814 16139 343307 145095 -13911 -100668 56285 20870 128455 -94716 -180329 397837
12244 106110 -105448 523952 3958 727 280563 180412 226977 98406 406492 -264463 104120
12232 -136323 149888 108413 -55149 323843 102633 136350 -8181 222313 219748 114086 230375
12221 230375 -172216 -205005 494803 106759 55527 166607 142087 -134368 298623 -60997
12210 -73337 138371 3779 153327 237043 -141918 -134280 395770 203418 279324 -233781 -39486
12198 -174987 -38057 27804 -29946 17447 191802 162301 200997 324284 196699 414048 -127399
12186 1652 258965 -125029 -112889 268330 16214 348078 123193 -98822 149716 75006 120579
12175 120579 -219505 -108056 -138865 -2709 66358 93073 307284 124755 51899 -41792 94765
12163 131170 -68645 184691 160747 106885 -157050 366696 336874 -22229 -160717 125535
12152 359792 323774 -213797 154316 121651 -27680 212684 399594 64014 252774 297701
12142 297701 -62755 -207123 -180865 -226920 -82458 164579 209121 -39146 236753 -138143 -131247
12131 -131247 17809 42418 41069 223996 -240612 -37458 122192 66479 -308663 37799 -54541
12119 -57780 -355520 139652 -137159 210053 -42411 247188 221170 143881 90485 230805
12109 230805 789 198595 9906 5442 -85356 -90808 44359 -22449 138974 197505 34135 -214008
12096 -162331 -267128 319198 -167530 7913 289810 -196345 273607 302640 -271111 298351
12085 -216177 -424730 -312441 150761 -299230 -56758 151074 -99385 -110160 524522 -22455
12074 -297526 275918 -203078 -389115 -119381 594187 1737037 686718 185767 404972
12065 404972 -170157 -21789 189497 -240947 -393802 -231394 179416 -90273 -188777 163951
12054 -146743 -54109 28936 -44464 298299 37004 193088 385558 333951 -98736 136186 -259479
12042 66123 -238484 166728 138618 -293742 -112539 -156045 179203 91527 194481 269658
12032 269658 100757 113541 32363 -147233 -32227 -139917 162475 108878 -57385 481726
12021 -68492 90952 -100090 66995 -46370 129390 -146587 155331 -27392 98787 -338241 -180196
12010 -180196 -179537 -162427 90355 -82327 4672 -62718 -15935 -121254 17691 -64450 -127488 -140512
11998 -140512 -74613 -69282 156811 41020 -124661 -158298 340719 -107025 9352 -263471 -75746
11986 -293939 -63883 -85146 -45580 266547 -16719 32850 -218325 251792 212758 14220 -108570
11974 175704 4236 19917 382728 -167737 -10124 -323375 -44817 104938 -85526 53966 -121293
11962 -131255 -76516 161376 -226732 127627 -279165 -95942 -113286 285031 219438 -195195
11951 -183654 62067 -278456 -272188 46830 -269410 -121452 -24533 -286078 38515 191261 -67624
11939 271633 148102 160912 207779 -64542 -42360 -375197 -114300 84806 149234 -156451 -36523
11927 274895 -339569 -235266 -108199 80100 -25406 -126511 2285 15345 -38709 71991 -68461
11915 -64043 396480 238200 -276543 83900 -187328 -12834 -323053 12815 -327916 -8241 57025
11903 240166 -43103 195954 -32461 -203036 177254 -112719 -302028 -212401 193837 183839
11893 183839 -85289 -321381 23245 -163273 -86379 -129675 -47410 -238001 -340797 43441 -14757
11881 44205 -64658 -47436 121878 -441040 -114214 274601 25423 80661 149552 -110876 159251
11869 -469578 -174518 10050 162113 -283928 -284615 -109174 174428 59490 -51063 -193019 18203
11857 -134158 -118880 -12127 -83964 190829 -111118 -61510 -25643 49345 -35775 -44610 -20697
11845 164378 104932 -252459 224030 -192701 48272 130542 50953 -102724 -59886 -175879
11835 -175879 107751 28409 -26441 -38611 107551 66310 2466 18756 88549 -1098 71527
11823 -187664 -16111 -79592 101196 -248369 -89365 -256983 -111505 49898 -306098 -145846
11812 -73556 188633 -62304 28084 -354126 -188516 9809 5641 -253744 -121290 -284736 -91982
11800 -322293 310646 153055 180677 -106043 21849 -19018 69638 137396 -170134 -275374
11790 -275374 71286 -42496 -18362 -229384 275989 -105282 72034 37690 -427469 -132803
11779 350958 -171188 189180 107533 -246103 -403429 112570 -394723 -183306 48106 -35969
11768 49012 386633 -388378 -28238 -12724 44894 -258551 9836 87567 133939 387584 50350
11756 -357783 -245055 -141004 -161580 -84198 -157956 259509 120927 83973 -26660 53104 -62487
11744 -358093 -2990 -156017 -61534 228961 117093 209034 -332917 -169642 38781 250753
11734 250753 1051 -62178 -212235 47388 -93875 88010 18080 -264653 208939 -65066 -286675
11723 -286675 -147850 -30137 46604 -58483 197192 153715 201137 69531 14646 224933 -86712
11711 -31992 142372 65227 434669 -109163 235550 79162 -494121 6877 124418 84728 -259319
11699 -165199 -134346 31269 124516 -162744 71775 139303 333484 352018 69389 520778 309796
11688 309796 -73497 67359 66459 115148 288441 -74221 -30035 206516 -16793 -13220 -43379 -275965
11676 -275965 62873 -40633 -305701 17686 2794 140859 8054 241260 -75916 207294 256907
11665 256907 34684 379333 -205871 178559 4009 -28025 75844 -44979 -158284 -340175 411408
11653 34139 235841 174379 12739 -227924 112450 -221307 -78614 -165843 -136565 -272395 -4297
11641 36142 -47112 -588402 -202158 -241245 292840 173786 63440 -102076 -68455 134880
11630 -61441 240210 -73540 151790 -245966 84983 -128573 162055 272941 30236 -159630
11619 -462811 91394 116955 -287308 -492464 112523 -255612 131736 210419 38509 85909
11609 85909 -24357 -160749 38773 -125235 -152188 237088 194847 -107493 88085 -153395 -13059
11597 -96549 -29395 135502 -190400 123662 51746 -8199 -132903 23382 140547 101609 -382349
11585 191103 250265 53309 149637 -72262 -241308 -178004 -58110 79148 3082 3010 133355 121779
11573 121779 -38307 -102922 -13261 -141268 351557 91375 -30129 182169 132968 19813 -208265
11561 175680 -98579 -71669 96874 -148378 -260304 55008 37972 -50004 210378 385980 24761
11549 -209907 3668 -24431 -122737 -231285 -166075 19504 230453 186598 17446 -128352 244544
11537 -216104 -258797 153200 -16612 -133728 124543 32052 17030 -81454 178588 113291 343755
11526 343755 -2877 -52764 -317705 -24720 109835 -200159 264472 188804 -125123 6946 -44853
11514 216505 -138058 -181456 170784 42034 110194 131203 18026 139941 378014 -82038 34309
11502 -210 -189820 -70850 -53813 -121764 184077 284234 297383 -63384 217657 156444 269971
11491 269971 56937 -25663 9402 53582 259199 -92986 -38505 -46692 430051 28787 68724
11480 68724 -46766 -26546 180450 -106289 296344 71527 44271 -107174 203387 290638 53975
11468 104813 151939 142193 59984 -92094 188925 229669 120230 383730 -117703 103458 108889
11457 108889 249126 122976 173091 32391 241207 304076 -185941 7105 -228469 -100438
11446 192994 -62336 -29660 360562 -207152 -14209 139214 -45021 9002 -183467 -46685 -32003
11435 -32003 215906 24289 -55588 27877 44187 559578 22886 -205281 -35577 220935 209060
11424 209060 77159 -299 346919 -15920 -98811 77361 -35775 -58330 374061 116543 219041
11413 219041 -62174 -52802 158265 55592 2010 -89156 -293589 77421 237796 5085 75846
11402 75846 89268 -206571 -360125 172059 205374 165395 162689 65443 -309196 143130 22402
11390 118011 86775 146776 -101915 -114235 209089 142356 -99644 218873 216363 -103321 144412
11378 211103 248166 194968 -215106 -235784 73644 -36716 137700 -133169 215266 157582 133704
11367 133704 165554 -105357 -387654 -75078 -9408 27367 11329 -113182 229389 -224260 391146
11355 45475 -42530 -3883 -74456 -134257 -250616 36893 -168223 -159280 -154966 -110875 90002 -307846
11342 190427 -163598 -214042 113408 426286 -283883 -63171 -76384 302999 187442 11168
11331 34601 -197932 67649 -219643 -24691 28981 -222309 -110947 223706 -187473 153096
11320 -128915 -150850 -244503 137948 -103454 -233399 -92757 49134 256353 -97481 -149258 -469245
11309 -469245 129541 -166184 -254544 -101705 -205348 28559 19056 238114 -174931 167907
11298 57591 -288744 -319290 -67616 -172019 -65442 177425 2556 16583 -186384 -69243 153841
11286 -84485 61488 84974 97612 -26715 -187851 -86566 -100959 80409 -57231 100223 -218666
11274 -64922 57324 -209416 199978 -87785 20490 -184813 -333149 165873 111214 352186
11264 352186 126150 -183183 -86568 -288659 115532 117271 51023 -114196 -131013 3173 106975
11253 106975 278598 177956 108072 -105509 -183445 -36482 -76814 120396 -20779 156360
11242 120590 -27977 -27957 281419 -104799 352213 -317679 -78847 -275001 57522 172003 217703
11231 217703 -50583 93468 40653 -36434 -4219 -175660 135693 176722 -297461 -465393 -152516
11219 -359275 -97867 67263 -224074 34154 186519 135400 -290824 -10645 -212800 -169079 -34837
11207 -62654 -285315 -208515 330764 120461 -79192 3260 110364 -353506 15510 94252 -298253
11195 133182 -266134 -2616 132471 290735 56367 -197437 215948 -26904 -127224 -208205
11185 -208205 -1734 -46332 -108264 -273724 -276346 21431 251881 -132262 -286042 148314 -162690
11173 24355 -305725 -182313 -36425 91904 54907 -12631 -244208 -268504 245461 9318 56978
11162 56978 -121607 -90011 185522 23114 -324966 298284 -27650 277499 -13653 97323 -65634
11150 233694 138514 192253 -98043 -140857 183823 -179964 -255869 23824 -309416 43158 46518
11139 46518 -102136 113518 -137486 -7327 15879 324846 -272735 -12324 -84059 125457 -213467
11127 -130578 176598 -190734 11931 109910 88725 -101017 177235 -238077 -79590 -185182
11117 -185182 92194 -104859 64644 93362 -325292 -225973 -252591 -5472 -238861 319081 184418
11106 184418 -77837 168664 334978 223994 93670 -7443 -84842 -39233 -21692 204593 187147
11095 187147 174174 273956 2147 57199 115646 15000 79015 260128 292459 248178 215346
11084 215346 143585 450236 169518 -14256 467194 339079 311366 -291424 -66646 424960
11073 271934 153233 288570 399796 279548 234290 214814 328904 101111 148598 321208
11063 321208 435222 436801 490333 456945 195394 546800 219460 114252 781862 709520
11053 709520 744624 749001 662834 587238 368866 466177 645217 677682 487378 733576 449715
11042 449715 805748 708313 752715 692946 781202 797843 647860 666362 824531 776847 395361
11031 395361 548275 981785 961094 584071 423480 659352 654001 720564 629280 763746
11021 763746 459534 585335 469188 603554 552139 128590 602192 616796 690848 456406
11011 456406 522675 104534 378869 328579 680996 890964 124778 535629 455840 501607
11001 501607 430395 430368 500533 718626 699154 283373 679173 355909 665611 483802 918756
10990 918756 700727 653616 442804 501695 545249 619236 635241 865325 806489 1123037 1034425
10979 1034425 1186586 1500740 1560621 1935031 1936491 2430652 2674596 2731769 2744002 2318282
10969 2318282 2652824 2306514 1924612 1734286 1602185 1631630 1405688 1259921 1389757 1335121
10959 1335121 1267102 1277957 1394632 1321424 1511308 1229231 837115 757210 493544 704722
10949 704722 318540 -85050 458219 153548 246824 288188 326390 39153 129039 -105151 148332
10937 160948 264962 -246331 65629 365142 -197950 289870 -200810 -118559 -152858 146587
10926 -69438 -51242 -23767 80659 136242 351259 -115571 -1421 -272050 88625 -10761 213714
10914 -59514 55836 5085 -168084 -193834 256829 60129 171831 -168141 -247574 285272 -281844
10902 -398913 351291 55191 216967 -320151 -36431 45339 28009 116924 -259734 9201 -317429
10890 -435711 38981 -338243 108794 164602 64872 -224818 142098 -49052 -250393 -74645
10879 -170613 114007 283897 -33987 278988 -2459 -297412 75073 -280449 32413 -22768 95900
10867 -121162 -213514 -263016 -232109 162832 -183474 -87624 174424 124681 -192838 100532
10856 -92536 -8226 -74572 -499712 -68422 -157896 177209 -361693 73387 -141870 -260182 -17174
10844 -313482 38810 -221387 26339 -361335 -24082 -44887 -95329 248972 -20112 -106659 4998
10832 -397435 383224 204324 -225887 140019 143566 -152591 -254213 -141647 117238 -70839
10821 -155252 -39866 -34553 62022 -757 -179510 95739 146290 139087 -291067 -177811 -21789 27286
10808 -34943 12285 -87979 116856 138749 -234560 198152 95294 246999 -122170 69559 120052
10797 120052 33735 -8886 -56129 -73649 -149806 -22868 31675 406596 -14109 183537 277263
10786 277263 91203 5257 -145441 147693 -184046 -331792 129750 -177131 267927 -200625
10775 154835 42162 36273 -148798 -239591 -198340 -75727 -311368 149255 3817 -219934 -56780
10763 -223065 187966 -80971 290928 62389 129402 -114802 26099 6601 -284493 -18517 -50086
10752 -50086 -93056 -82631 62145 222880 33454 60182 -12816 903 -2048 -25186 106306 37289
10739 48627 170760 90622 -272860 340746 -117079 352180 274151 130296 195114 -245684
10728 -20698 -41301 -118421 162348 -50901 -88616 -137229 -321354 -174768 -152509 42452 -36392
10716 -186418 -155634 -52811 334537 -228585 -23810 -11685 -32471 -207979 -103849 -399415
10706 -399415 -227363 12116 -141920 -47816 -81620 -9403 -221757 -122067 139264 86211 -27766
10694 177513 27966 -62342 67053 55079 128705 -247127 41338 91632 160774 -93281 36839
10682 -46088 116476 -411934 87294 52671 -64786 -339325 133868 -120091 78990 -201289
10671 -261851 -260213 -19432 -218538 286315 -64254 -136009 361462 -183826 -156900 -43677 5103
10659 209783 -400936 -254050 -145008 -37498 -257702 225902 -46594 -164589 99732 -179085
10648 43956 62110 142073 -406283 -145896 17026 -315534 118841 194380 331326 17902 87693
10637 87693 -105540 177445 14998 13270 21835 40005 -130771 76441 -79837 201527 -196557
10625 72336 -30880 -120372 -145809 83327 -196894 -390928 320712 -151899 31162 -180053 74073
10613 34529 -66335 80524 -77589 -68149 82606 -26948 -96190 -70047 -160714 167558 -153749
10601 -77146 -160864 -98600 3188 224051 79837 93078 -77334 -128943 13940 -145555 55254
10589 3703 -214045 -27205 -131187 289364 -109928 -11113 1687 -354761 -115659 -160039 -69971
10577 -135436 -62703 -280456 -115588 -8185 -15884 58151 -27380 -93534 161874 10235 62875
10566 62875 -62770 -179512 -77012 -221973 -130542 221241 106884 -11685 449173 -181652
10555 69586 -266520 30005 72584 -78953 -62586 73078 -235992 -379163 -109979 191766 -249340
10543 -190962 -45711 -84821 308507 37666 -236022 154498 -132274 19949 -164125 -98111
10533 -98111 11053 -231151 -196328 338220 -156232 329147 -120419 -50205 104743 -146083
10522 -161409 -235718 177737 202733 -227400 -71135 -104950 -94774 200343 118571 262034 -57120
10510 57057 -177929 -172386 217171 -15602 234238 -93671 -7013 165392 -173357 -196910 -241024
10499 -241024 -234185 111875 156665 194085 190778 -20569 -40464 73217 199652 -127365 -118667
10488 -118667 -87050 167037 -82999 315969 -25955 177685 125682 39639 419656 -27326 -33169
10477 -33169 243688 212154 102941 208293 315767 -109871 36153 -24215 -41794 99840 -38701
10465 -216447 -265523 154961 65075 311686 -174380 -46474 -56617 -168614 -97490 3442 89502
10454 89502 -168055 408500 -194166 220025 -30639 -186360 -169404 -337943 303702 -107029
10443 102855 -37905 317922 6470 -28476 -445361 -9342 -96209 -147943 46155 53604 -462239
10431 -132461 -89476 -134929 185795 -44171 -324305 130517 293265 53788 -234595 163760
10420 175919 -227875 76306 24826 100572 50534 -195195 191467 -154291 -183351 -3259 89816
10408 -103530 -175703 208178 -377639 -259414 -45746 -51412 80033 268177 -70428 -150787 -140178
10397 -140178 330458 -123549 53576 44732 187455 -195382 -147639 214395 153139 230981 143713
10386 143713 21245 154787 2537 90697 -59793 244803 252511 -20202 56421 -462958 113051
10374 219552 29232 316675 377689 183670 349797 390864 456047 61593 213024 101413
10363 298792 -83383 291551 249132 456733 122900 150027 87542 218058 22296 261763
10353 261763 428268 621994 416182 516443 283609 193955 306211 350467 30174 168366
10343 168366 100766 409992 239256 244944 48889 187086 50956 18290 -40717 -49631 -101708
10332 -101708 215511 112888 128663 513962 432865 -83785 -95570 -71503 243692 585479
10322 585479 39792 -149698 165867 37929 322599 265559 207506 -27512 -122557 149358 -317173
10310 166667 196164 13503 80923 -248436 -34180 -136001 -4839 -14360 -163244 -33967 283134
10298 -54431 -264639 260690 9156 252968 149701 96660 165366 -228451 88589 -34968 -402363
10287 -402363 6789 364550 86360 -112070 293045 84966 -442601 -14479 -180731 -157809 -228128
10276 -228128 -262295 -77065 157650 -154205 -276735 151539 114692 162363 36891 235323
10266 235323 99508 7894 -327330 -109140 134478 178825 322934 336294 44722 47756 380023
10255 380023 -122195 235352 129154 -15330 339106 383602 -215268 -220041 179155 -267158
10244 -79383 -3535 95767 -174959 -89739 187927 39720 254879 -21833 2864 -109113 -151570
10233 -151570 195988 -90314 91705 -20555 131589 -103583 -29553 -117120 81407 -190930 -42702
10221 -85130 245204 -52144 60382 98965 -3353 7336 -269157 46822 54773 -108356 -71332 152113
10208 -481632 -15597 78184 -9517 -92092 33169 172751 2494 116973 50183 -362212 102195
10196 -240454 -132698 -147256 -159427 -168237 -257202 -99186 -363848 98752 48422 116428 -186675
10184 180203 -107193 -190333 -37429 161816 224281 154359 -286562 -364502 -40531 -60237 139084
10172 429737 -15160 -96088 -40366 -302341 -215064 -234867 -119939 -48205 154443 -213706 106688
10160 56044 274491 -20577 99023 -105728 -208283 -383997 -105540 -233894 -200567 98741
10149 90306 -49297 -286241 22565 -6316 -58053 -149911 -58555 108635 -418577 188315 -11902
10137 -264907 58087 -52720 5363 -58994 -100835 -307923 -67310 -323500 -76023 51192 -344458
10125 307400 -170745 110182 -197265 -51218 36801 -164854 -94481 31627 -203522 -423345
10115 -423345 -317256 196335 -113817 -144694 -62969 -85716 56997 -77142 -96781 35852 71305
10104 71305 417396 106224 -77288 81407 -55189 212553 287181 -92231 -284698 -51165 122302
10092 -178519 182516 -111461 -255825 -142315 -31951 -332134 -205772 306156 -45722 203423
10081 37698 -482508 -46632 -28657 23433 -154590 137376 -116323 186701 -294633 -152425
10071 -152425 -13708 -388731 -322926 197247 -109340 -87019 -179570 -154080 314506 -265752
10060 163183 34457 -109231 192420 -71409 -167197 95709 106212 47992 -20869 -23196 -70066
10049 -70066 -166933 -109957 187794 13052 78517 -193413 -71492 -95838 -203088 -153751 236062
10037 269320 -266305 132127 203515 -323011 75344 -270796 -128365 -68434 18100 -32367
10026 -356609 -238047 -3063 -14326 162131 -46099 -114641 -29775 -13202 -269007 -105997 -13668
10014 131909 -159279 -53655 -321556 84807 158046 -71205 319822 -35395 -150892 -51684 -226801
10003 -226801 50220 -14096 -89393 -336676 4398 125968 -48196 -298909 -83394 27489 -168178
9991 62573 -120012 -112488 -193081 -155067 -11911 -26760 58764 -138260 -236435 23447 154539
9980 154539 -153029 -208923 -131007 369293 -71890 -105481 28773 -275399 -12545 -485363 -212883
9968 131428 -485526 -157338 172629 -162872 -165831 -162949 148284 31817 -269508 50017 232841
9957 232841 140105 21467 -54074 -330745 -210705 84556 -197512 -147414 221517 -198342 -190540
9946 -190540 -373866 -96721 -66417 54960 -130854 -403 -175118 379380 -113323 29638 60648
9935 60648 -40425 -182733 -180469 -43606 -90065 207313 67900 48486 -33382 99917 -1641 -219689
9923 -219689 -208059 191981 24289 180310 90834 52485 -171174 -101560 146171 -461124 -300775
9912 -300775 -155527 38532 -41787 -310643 -229319 -180539 -139929 -11660 -283922 -151082 -48335
9900 309189 65447 210923 124750 285805 181087 -63026 -42907 156163 360477 -282422
9889 -220076 -75836 -219893 -286069 -147846 130499 301585 -268307 156806 -48502 -34148
9879 -34148 -560868 -270695 -19687 -9485 -67737 -51485 -171327 -92273 -61901 100144 -114951
9867 -333666 -179187 -199420 27415 -65470 -218216 -55213 -7141 327849 -378211 107278 231545
9856 231545 27926 -146074 -55557 -193049 129441 -294131 134505 -34679 -92931 -2290 71098
9844 46 -261685 331812 305677 -153352 -196987 -349877 -50479 153285 -202146 27080 118699
9833 118699 188056 -17560 -59900 -279156 -38438 -134724 -292872 -156465 -318058 107847 176686
9822 176686 -123143 -215261 -291085 -92120 -171862 100331 75547 -248943 120518 -137759 173531
9810 254371 -13617 445752 144852 -32421 -188218 -110096 -2788 -189250 -169701 64664 27274
9798 219334 -238316 123695 -39641 -109710 329652 -391385 351403 -4190 231072 -403148
9787 -309310 26933 334360 -265728 125797 -207551 360347 -108050 270319 -259926 -344160
9777 -344160 -437341 -216269 46391 62930 -55922 62341 -189440 -80131 -110822 -91904 -451593
9766 -451593 -345531 -328586 -85819 -182126 -90728 243474 -213195 -150972 -122929 -118041 -172019
9755 -172019 192406 232682 -25886 -292042 149712 -315356 -27796 -97939 -70393 -106057 55226
9743 -107620 153225 -291548 -123383 -233203 -281338 217510 -127513 -225964 32356 -525013
9732 112814 45759 -16967 77950 130931 -122201 366494 113417 -13219 81593 -192949 169790
9720 -109737 -91642 -208804 -380735 43091 8802 -164410 -37429 -226252 -177227 -220729 73392
9708 -112203 -335087 -5125 112008 194514 -315590 -158849 -31509 -154783 -371109 94917 247336
9697 247336 20716 -170455 -285585 -90425 -3489 -421810 -49772 384955 -187012 108993 -92142
9685 35155 -142408 -252829 -208607 -201579 -194912 -269973 -522553 -78781 -204444 69932 105548
9674 105548 -86562 222145 -59820 -76494 -210780 -107058 53933 95177 13356 163183 70140
9662 -26798 90156 -300683 -151833 -238013 70616 -126765 59793 -366192 154293 -33181 -202917
9651 -202917 -426101 -209896 111819 191806 -400722 -85321 20823 -133958 -113889 -185322 121231
9639 -41743 20446 92492 139748 -400103 297271 -134753 -184366 121003 57505 91564 212118
9628 212118 119170 -75028 -151773 -162109 157020 -474399 105510 -2977 -76677 -177041 177980
9616 -297849 101289 -28578 -74601 161587 -404736 286793 5395 -137291 28796 -87091 -10961
9604 -209576 91480 2658 -206241 -141770 102677 198293 295097 10035 -48578 75088 -257081
9592 99493 107607 7615 225500 -233171 -45563 209191 -218802 75706 41595 -76512 105403
9580 4025 -77988 -122265 -76304 -60930 -118646 100779 275614 -62762 -336205 -228586 -210074
9569 -210074 -151575 -265871 -45612 105216 70939 -3097 -183061 -353743 -75506 -49064 4307
9557 -34129 165917 -297823 -15681 -497972 -64806 -18482 52509 -2249 164294 34837 -226599
9545 255693 46774 349105 -339445 10861 -156606 -100609 -105859 19077 -255422 -140682 -209969
9534 -209969 -325801 -234656 -240889 -1215 -138510 -47494 32872 -209218 -237632 -58233 -88763
9523 -88763 -135428 108468 51880 -99197 -136813 54318 248454 -109622 -394753 -224105 110774
9511 382285 -141110 -111037 -293581 228839 -86732 -50771 40641 134519 -213065 -119154 -365995
9500 -365995 89393 -194002 234791 -177369 176453 126301 72704 -112008 -338358 -202791
9490 -202791 -56556 -28208 59660 -243993 -12749 -426 256556 -225815 -213605 -419833 95719
9478 -79114 12783 -204490 -383692 109200 -270474 17726 -179524 85554 -312331 -372941 -197903
9467 -197903 -150873 -361249 -270799 -292655 422602 -27971 -145590 81859 -92189 -368828 60831
9455 -178424 36295 32976 193941 56006 -234827 -20795 -226155 -136366 -164927 -8037 49570
9443 -144712 -163100 -175739 -55276 76328 362148 -147926 74359 -63393 -316548 -8171 -291459
9432 -291459 -56978 -104948 52890 -287707 174308 -5429 -272779 -47057 -160792 -190940 312479
9420 116035 -152573 -198677 -62429 22244 194733 -111012 36063 155045 -398528 -281552
9410 -281552 76164 40871 32556 -136498 -134049 -161494 418206 36020 103450 -5825 89840 -237014
9397 -367221 -209187 -314714 63589 -16229 141481 45305 99659 -199440 -213702 -165310 -220444
9386 -220444 311012 25470 -210527 82552 -152269 281841 55854 -51474 -183863 -128287 -220091
9375 -220091 -141577 228929 -205906 182577 85960 -12176 -87520 -295193 297604 108313
9364 296437 -128328 102975 395283 32243 -402856 197772 -124109 -157716 232187 -383291
9353 -108227 118262 -71654 153614 48352 -190671 -152221 153319 802 -245455 -37315 -157021
9342 -157021 -399260 -298066 -103255 -68236 31671 -3055 -63082 -149342 243634 -67281 -187455
9331 -187455 10276 -28961 -280693 -62224 -1080 -184119 -196881 -87848 -177414 -92131 -236595
9320 -236595 -191637 -104378 102971 9171 -153720 -50184 -184928 -57900 -112317 76914 -119149
9308 -479466 21328 -136363 153078 -39497 325330 -89680 -114994 -25221 129982 -10652 106972
9296 118351 54403 -106411 -110963 -48936 -222842 -87119 -72222 -25859 -261715 65820 5781
9284 -321008 170523 2034 -19252 54035 -348968 213241 -5197 178595 115235 125972 -15174
9272 -66488 241086 10953 169863 130857 -190740 46265 35127 -172915 -292951 6925 258756
9261 258756 -115738 195241 37288 -208369 -286549 -78914 -85779 -64598 -73536 323642 223256
9250 223256 -50349 78768 -147112 35419 69588 -125392 -186086 7702 -244099 -285105 -53545
9238 13505 -89962 -100867 221075 155425 100798 311909 -115039 -235355 -290867 114904 -122363
9226 -92428 56907 -88829 -100468 236282 -204943 -107307 3283 -25421 162914 139262 -343110
9214 -50477 -154215 -144088 7605 -195007 92063 -279246 83205 -251393 171994 -200524 39156
9202 -96622 -112098 236976 -23311 80733 -151401 -92541 -169226 21972 21059 47226 -244012 7193
9189 -201879 342570 -106408 11913 13847 -390465 -5821 -108184 -139312 219811 -217886 -225255
9178 -225255 -32556 -120620 28156 108808 -668 -182122 -52476 -76937 75707 -201581 -47657 -32090
9166 -32090 17293 -72650 -46157 96699 -20816 247347 -12020 -26365 68886 155609 -82413 -149174
9154 -149174 116260 -295496 -208331 -23017 -91791 -354676 87861 139145 46669 -137372 70386
9142 -336246 -259865 -5314 -66517 -74836 63570 -78647 -63190 -37701 -163531 104174 -120674
9130 81869 98642 69770 157572 -129255 177604 4355 11225 114524 -151395 114543 60453
9119 60453 193411 -134174 4536 -154671 68351 -260465 -145100 -187714 130051 46619 122778
9108 122778 -222013 89816 -121179 -126888 18676 -605544 -119558 -219748 -89202 -291237 -250524
9097 -250524 -33856 -36967 -185398 -74234 92350 158362 -224397 218078 -144275 87514 330775
9086 330775 -72343 -332369 -89707 14454 -3309 -139838 -256103 51916 217445 231993 -334277
9074 -82531 -23577 78641 -65617 -281154 -267785 -246292 -55942 250270 165099 174868 -55477 516403
9061 -104962 -74705 -121529 -297320 -99763 -162941 211914 -399788 93594 8036 -42840 4969
9049 -66929 77934 -186788 -250259 75774 129786 -16716 -267441 -211880 61418 83626 53186
9038 53186 78458 58071 -331949 23688 29199 66817 -21022 201 -37567 16009 -46686 -370446
9026 -370446 15166 -233725 109378 113972 44833 -369273 167729 -8647 134948 -168792 -162854
9015 -162854 -38005 -10442 -161975 9813 -110787 -48080 44742 -153010 -181885 -36485 406744
9003 -152292 133216 -106623 -429186 -97270 -138103 49393 8103 316071 -6733 93846 90217
8992 90217 -107719 -390842 23721 -17817 184377 -88842 -12375 136117 139748 -165799 -37614
8980 -229016 119441 -99833 157006 112005 -214728 -79313 29075 -217074 30764 -114687 -206281
8969 -206281 35461 -91677 81147 -226467 -295131 -402375 -40120 -243090 -194018 117826 200054
8958 200054 140755 209531 425454 -41825 45053 167634 -203260 243867 25438 -74187 73228
8946 -253671 -116211 -317728 223077 251367 18864 16603 47406 -3964 98343 172331 -518526
8934 92503 13347 179809 58219 70241 216728 -449138 -15851 262412 160947 339872 1023983
8923 1023983 3421045 10794575 6625289 1929914 463170 87796 430476 153739 29811
8913 128582 -199851 158835 -88787 -92081 371164 85740 -55102 -78765 -255360 37635 106799
8902 106799 -451496 -152939 165121 97690 -99758 130312 133704 220351 -232214 -178923 97127
8890 190703 -1499 -246685 -87821 -130388 452028 -169833 202958 64370 143242 -36122 -77411
8879 -77411 -247664 -316309 -111821 19541 297525 234159 16700 -242427 86244 74035 -148950
8867 -104909 167039 -50151 225550 -306805 -186262 -12171 1149 -96787 -301159 -255300 16896
8855 -162478 203611 -174723 -16388 -111615 -27716 57621 -241833 -5419 73813 -486949 181790
8843 254468 96217 1968 -106004 82134 104095 -206008 31126 69665 257185 124697 18698
8831 -158260 -38391 -213547 -166247 -31084 93463 -68767 -33559 -99246 84201 -94876 -116838
8820 -116838 146854 -142788 -29713 -180809 22459 -83137 -162093 -191009 -59866 -39573 -59844
8809 -59844 -22813 127384 -366862 -133256 -10774 -170438 4814 -44481 -52187 -114080 115419
8797 -182309 32386 -196919 -11735 119132 -410230 109658 -210621 344828 5916 -135676
8786 134494 -121306 -52565 -48193 -103299 153028 172711 -51293 14896 -107632 14305 -54935
8774 -223998 -108470 -111601 -215853 -144957 106873 252390 165967 -244075 -28295 235619 189204
8763 189204 -166181 -29432 69584 2523 -36764 275942 -118290 91802 -4797 -2987 -231762
8752 -231762 -231194 166500 329945 -139539 -135063 69324 110100 119250 -284108 -111656 -133137
8741 -133137 -46729 -172454 129830 79378 48839 -73600 -244015 -84738 -50211 -28302 -121534
8730 -121534 -206758 -38357 -104459 -5131 70975 118688 68626 268963 -24121 -171683 -45455
8718 -13013 -309384 45172 -134458 -52856 30015 -385920 -22403 -73257 -128340 28019 -71427
8706 -241071 -186912 -136476 -77766 -20413 -15990 -126837 -18801 16973 -61595 267474 -37081
8694 195408 306582 -85750 79519 42939 -14303 248434 80180 232459 -154821 273869 -227520
8682 201091 -70903 -93675 171418 30428 -404187 -221186 -9599 -167522 59816 -371706 -11951
8670 64782 124850 18206 155250 41141 -99942 122062 -48268 -308579 -133205 -93680 284736
8658 -36671 -116419 -123570 143011 -105785 -198322 -115615 -326103 -95423 20962 104589 236589
8647 236589 -167324 178728 -33991 181536 -220912 251113 415720 228892 -341462 19374
8636 17213 12528 -25899 165046 -135915 -127668 -251112 -197015 597 -391665 -383157 -463809 -84767
8623 255226 73300 -23577 -267193 93645 17206 -114382 -131960 -121943 -46696 -159699 86322
8611 -230471 112307 -27665 -109073 -49391 138830 -134880 96781 140883 -179075 187874 166569
8600 166569 75299 -191074 102423 8105 117675 -216070 -281725 -36249 147864 -38508 -520531
8589 -520531 132670 -158829 -10719 -352764 -260466 -384857 -176028 -69972 -160386 -82414 361963
8577 8309 51845 -33821 -203830 388953 -305422 -246089 -46393 140408 -83287 213561 91251
8565 -119051 -126978 -285550 -193481 -29601 -188305 25381 -35418 -205457 -267064 -168684 184923
8553 -173273 75767 3518 -136831 -11679 243279 -2738 116757 77782 -17237 -472119 -167840
8541 287723 14146 251851 -87806 -451811 -225672 -91416 94592 104681 171657 20496 -345416
8529 -25373 195243 -212461 -132870 -39955 -213796 -212308 34673 -47431 -160458 143387 -362454
8517 -80102 -65527 -75386 172698 -485574 336778 85935 232020 210514 255538 2456 6569 25383
8505 25383 7057 42869 -326222 -118631 199385 -45039 -270311 10659 -267551 -35563 -132960
8494 -132960 200734 -107278 44714 180580 -28477 -302731 123883 91391 -3794 -37286 212943
8482 -8980 -181873 56766 196773 1244 -286976 -21170 -243444 -326948 4924 210623 215421 -164099
8469 53995 -76543 -114308 -14037 39127 214181 -186280 -314377 44799 -70545 -111687 341602
8457 -80407 184472 -182136 -9533 -75659 -8309 -28530 -447748 15786 73710 -240449 164282
8445 227648 -164808 -106077 -210647 -36498 -212912 -27577 -79464 139159 -95349 78324 -44049
8433 -158039 58320 -89712 76103 63606 -275112 8147 -154808 214269 99706 65106 -279632
8421 -13624 76590 90119 -44528 146166 -173459 -200051 -191362 53717 77567 -142780 303592
8409 -100177 189077 -97761 -32768 77467 -257919 -282040 140556 194821 -130301 -46924 606
8397 -90031 -51349 -293402 -39945 -132665 -224368 116241 -248059 51199 -21477 17799 -249524
8385 12953 20757 -272600 -305427 -117631 142892 438582 114143 -60525 -357420 -117673 -281910
8374 -281910 55567 64366 61393 -376080 57994 -109246 241827 -185599 -274966 77785 107352
8363 107352 403843 -242665 87958 -288353 111601 -86606 -70681 -92537 10056 48225 -79510
8351 -25173 264425 -431080 185441 -301100 -153826 -208502 -252117 -108115 -50184 -214144
8341 -214144 -194119 68862 -160771 366948 -182976 89020 -321982 48505 -240401 56417 80644
8330 80644 -95051 -188053 -205554 -470610 -11143 -318662 -126794 -38720 176281 -250424 93344
8318 -208264 142885 302282 75702 192017 -239851 -132349 -119271 -248291 -128761 262150
8307 -379395 -63466 68867 -126960 -135058 893 98084 -170611 107433 -226152 -17861 -272801
8296 -272801 -29169 -15171 -51508 -59269 -60731 -44527 103601 104177 178550 203732 -181350 -120174
8284 -120174 63486 120428 -71319 -79454 39635 136945 10186 133813 -3932 174011 7913 -361744
8271 -308662 -281323 -131717 -183609 8290 -190706 293932 209577 58629 -26950 -113378 77516
8259 99722 233514 -166643 110289 -38475 4146 218981 28067 -161882 357661 416357 139977
8247 -74014 20549 185604 -123856 326833 258793 -99875 34224 230069 59318 -78422 -70241
8236 -70241 157439 12793 134558 -223680 351052 -309434 35575 -271696 -11259 240633
8225 -19059 -253730 132524 22181 -101989 -22868 24679 -560684 66888 257411 -91348 -194592
8214 -194592 -31067 38012 -95110 153573 251998 -196034 89381 -125729 48335 6944 -47121
8202 -179357 -294488 95077 -141834 -262485 -90120 53114 -201290 40491 -144280 -256927
8192 -256927 10400 -49800 -125469 176707 -263757 6147 -342020 -255808 -206345 159981 -168354
8180 -58635 -76965 -114500 83078 6528 -79770 -250827 -83788 206840 -74979 18701 -146058
8168 -216441 -295030 172209 86999 -110586 -84362 235754 74510 -178241 202688 -209960
8157 8302 -230498 103425 -150035 -216171 -109989 -219321 -63677 -337879 -283531 -50955 -162440
8146 -162440 21252 365199 -145647 -196489 -211327 -39259 -36107 -117069 -82183 -115067 -311042
8135 -311042 416662 -131727 -15426 -152428 -327554 -170305 -151973 -55507 -323543 -216936
8125 -216936 -42645 -124431 175856 -161725 125969 -12464 -69615 -213911 -50285 -79377 419680
8113 104765 -157572 55145 -26587 -369328 -105632 -245527 -534415 -21081 340794 -20267
8102 -312640 20877 95188 -235234 -78801 123605 96080 24075 47906 66617 -279710 165495
8090 -86685 -76011 -210337 106264 211561 -54055 -23243 22515 -166634 193497 -270443 220945
8078 88288 136138 121165 17777 117443 91632 -59950 77981 -282049 -288175 112419 42745 17761
8065 -106931 -207588 -147175 -59189 -150563 -238790 -121836 -26168 106062 -258771 -315006 -46943
8053 125284 -159628 347404 -97225 327358 83367 -87687 -180023 100233 -163712 32696 -284111
8041 40032 -107526 22580 299562 83533 -245211 -153665 128163 137673 252964 201198 -271110
8029 72957 1764 89913 167385 -171381 -72265 484198 130726 49355 -357268 -334854 28357
8017 49981 -214262 38458 249244 -295260 -224416 -242438 51956 -288417 -233292 -240379 -48184
8005 339509 -126143 161636 17544 57036 -283286 129996 92945 -140471 83134 37026 -176823
7993 -210651 -226498 -131385 -47989 -141899 253248 163300 46805 24982 -91618 59129 41554
7982 41554 192504 238241 -419127 -40080 -2356 74089 -268177 -2263 -126026 113974 -27160
7970 -132363 -254420 -67881 142195 33707 129943 -28645 162303 -64193 29825 145974 25986
7958 -362734 -72357 -114386 122697 -98184 -44110 -427649 372997 135432 41334 -198996 205551
7946 62966 -106317 -35924 -30163 -134214 -94927 -192185 -40106 -32867 -347495 -92363 80430 90225
7934 90225 -214236 144896 -128363 41385 124029 109444 -267938 133137 210433 -28024 -83823
7923 -83823 -64943 -95654 171981 160627 68233 3223 79546 127957 -174384 -40793 157169
7911 268599 85203 193675 -77639 -114937 -38686 61245 -120190 -92480 304966 127474 -142578
7899 -208602 -347953 -80432 78446 -185378 -319373 -127192 105877 -109451 249337 -12559
7888 -91679 -103833 138747 -39661 147191 206796 -3826 -24687 -503276 29044 -185150 -295901
7877 -295901 -23146 -190183 -146943 126065 -37969 150924 -390383 -87097 -32181 -405484 -45963
7865 -82268 -41638 -17910 114549 -156522 152357 118621 75801 52022 51039 49408 -64886 328326
7852 -384320 82205 -258647 -31381 -306581 -50218 198580 145766 -330134 -114592 105342
7841 83238 -91487 -199931 54773 286757 -67778 -73596 -75931 -68848 27759 38341 -121709 238287
7828 -107677 218451 119805 162634 -88179 -433055 -150044 97145 200908 133854 -53601 -33644
7817 -33644 -110100 -344254 38181 228367 -60416 32721 -146865 111 99201 -68448 -36983 -236350
7805 -236350 113671 -102479 -99995 5128 -70902 311988 -23408 -170755 -50289 150525 -291823
7793 -67281 263538 -120745 -265692 118953 97912 -103936 77291 -33590 -49546 -149190 -266577
7782 -266577 -435141 -242869 -193868 -59647 124343 -446813 -226135 293019 240921 -45979
7771 -138335 414008 38702 -190509 -5668 -232671 442268 118164 81775 -51649 -10199 226605
7759 411335 -139250 335374 126301 126094 98289 209079 -136498 50634 77495 113848 4058
7747 -545917 -181673 -118145 -59998 56264 120525 -104093 -99258 201931 28665 -6067 135559
7735 209775 -236719 -192660 -176957 -21055 165704 4827 95118 107741 -253211 17301 23623
7724 23623 -271384 -172889 173224 -53447 -253868 134039 -262585 186395 -320340 -39767
7713 -119558 -256387 -55733 -58521 180558 -110452 -198419 -217527 -151935 -174184 72510 -129389
7701 -195748 40218 -45084 -91070 -246218 18143 1176 -132689 34376 -311793 -62519 196760
7689 -111284 67798 57366 18170 -30749 -453831 -15966 83722 37567 -130689 89564 -150971
7677 151234 -61919 -210597 -87093 -148251 76518 -138891 24964 94759 12495 -263214 -117746
7665 100975 -128237 -200211 -339321 73892 98481 28100 53052 179487 -112822 -100558 338210
7653 44667 243442 -197093 -52645 -188904 -163801 -219489 -23357 27962 -23042 -184527 313025
7641 -166020 -151148 -326759 -74642 -222162 13725 19347 -82779 -167190 -227948 -588308 100742
7629 -61245 4012 96336 -253012 42419 199100 -172091 -32091 -197347 -189057 -44905 -60124
7618 -60124 113908 216243 -43035 -12757 -202886 28188 -150283 -3359 92707 208434 -180913
7606 55700 -237004 -35936 180211 -77170 -94805 -475345 167325 56079 214447 -121750 -49827
7594 17561 49365 -58696 15762 228378 41560 -70469 279971 -88355 71135 254285 2648
7582 -83409 191176 -213663 -122650 204715 -214987 -272087 -78356 226501 227044 -26711 -54367
7571 -54367 70737 -51801 -388678 -199602 -81723 -19940 1442 -77715 127328 106872 -109186
7559 -252961 38962 13612 145898 -31476 -49041 264405 78306 70209 -342245 141316 -364546
7547 15745 -210320 -9050 397500 -401312 -5663 54480 -81440 234073 -391176 74611 175509
7536 175509 40731 289570 -128142 -69662 -58939 109173 47687 216487 -90549 -14828 -102499
7525 -102499 -301934 224742 86830 -545289 -57349 -151584 21845 -166395 -239972 22375 64462
7514 64462 -40607 154885 -88680 -310720 -365390 310591 33565 72888 -137925 167371 272269
7503 272269 -40452 -86930 -464052 -233311 -12929 -303577 -204160 -165004 1462 -186060 80250
7491 722093 126525 66242 7449 176505 39698 102261 86780 -29687 -18312 -87300 -274577
7480 -274577 -374478 -836 22006 5908 -112738 -122208 -79762 42647 -301218 -16398 -137442 99352
7467 -341444 202357 -43061 -90192 -201214 274237 285190 -127983 -154699 38996 31785 -186468
7455 -91644 76905 -171129 221849 -219217 -150778 -182880 -338732 77584 -82792 367661 8380
7443 293936 -135739 277015 268457 240712 -34830 -437439 46216 195271 -109731 287035 -44101
7431 30607 -139211 -159201 -246800 77706 6198 -206773 -173715 -187226 201157 -209315 27609
7419 273117 132052 -73976 280519 249759 -49276 -69100 181335 54401 -13519 -348270 -5248
7407 277359 55483 43749 141714 -200349 200011 240248 134068 260645 -14765 -83035 -174678
7396 -174678 -167167 -187245 243581 179153 -148286 -121528 -74188 199525 98505 -103993 -85102
7385 -85102 -263863 59085 -11419 -263367 -310438 158399 -223472 149114 -140543 121885
7374 4784 13471 116414 134268 84722 31423 130318 -223866 -53837 -53410 11035 233606 -45135
7361 -122210 -53662 112185 -66546 148881 -152090 121570 78533 -195338 -315387 -334604
7351 -334604 -43725 -210718 -23843 -434394 -334846 -162977 -209691 269188 -155704 -8013 -122404
7340 -122404 -121134 26083 -15809 228756 -87064 229955 164644 -109006 -231940 50747 -59468
7328 -73572 -120540 -36251 182286 59285 -236315 444044 -223908 -136010 315962 -340607 137212
7316 62052 40933 206475 86245 313796 222609 94600 -23508 2401 17613 -54147 -94587 130133
7303 -14192 -131403 -22795 -230448 430241 39481 -55149 -178617 163850 -98420 -11864 -214875
7292 -214875 -34944 -187869 -31087 -108437 -469020 -24209 -215546 -50498 -202218 184535 174803
7281 174803 -142658 118362 -154282 228301 -216928 -217500 5870 72523 272558 -163628 -543606
7270 -543606 273815 12951 -131994 -57684 64410 -320833 65437 89473 -127769 -219239 -158832
7259 -158832 -57349 -29587 18145 -63940 -43179 281187 -89520 289212 173778 -113496 13181
7247 -7974 420544 -138905 121262 50280 160309 -309922 76861 -33399 -149210 136480 -78562
7235 149138 -6087 171417 132692 -214634 -51309 -43442 36390 -65013 -134071 -138699 225661 199137
7223 199137 -104377 201957 82923 -203349 121351 -34333 -265061 10076 149376 -33486
7212 -229154 -625 95208 148724 -25594 127564 141151 -60289 -58063 231918 97207 -96444 138393
7199 -152235 -222329 -243521 333739 -331431 249802 -100387 104508 131003 -25315 185476
7188 -392548 25456 -21832 -69453 -156135 -178030 -186575 22655 -63728 -20883 -59273 263929 11215
7175 -155735 -143184 -68071 25520 -166390 324024 -154284 194748 -96392 123237 -3075 224019
7163 93264 -163153 -157739 2047 -66741 307057 -20543 -18631 -96032 116453 -95654 49692 -81276
7150 86482 4178 41519 -44696 391396 -214899 181242 -114267 -241815 163614 224916 4849
7138 -35371 -18780 -127495 -292829 11598 -64751 86125 -102095 -84675 -94500 16816 -33210
7126 130340 -133357 11445 -131370 143001 150468 -101723 -95336 170837 -285070 -170656 -151467
7115 -151467 110000 -145196 130660 -186079 -147345 156634 -190380 254072 129522 -273796
7104 63215 -15907 -274815 -20509 -244108 -125882 -70218 44479 234222 -41331 -283148 5896
7092 -259057 48612 -380015 -96448 27918 -47306 -69460 -18849 141301 -106683 -104833 42172
7080 -270515 -109804 118894 -173376 -52970 177219 37503 -48433 -147016 -73792 93816 167597
7069 167597 -84146 -73175 98423 -25000 -119380 285271 -115586 -47066 -150378 -142854 -190795
7058 -190795 108030 -276478 -90832 249818 -183221 227110 133820 -20120 -185657 247018
7047 136397 23935 -27949 -281661 -273295 271803 -79192 202465 -221064 -106746 73232 -127964
7035 -43448 -162383 -142211 152628 -13126 -161200 -60999 -242202 250865 -126639 -23582 177470
7023 142500 93768 -262997 -159185 -155971 109854 237952 -140625 59295 144796 52056 127854
7012 127854 -119135 -15277 -245800 219419 247725 117889 1885 -69270 54907 85093 -12327
7000 -6577 257730 -218078 92909 -169651 203726 119618 -121872 -122991 -139400 -129626 407154
6988 -71248 -109232 -101641 -28911 -50706 -210561 200054 20518 -151142 110977 -201285 102926
6976 94407 85238 381196 36254 55185 -216802 -186622 217605 -85109 77360 96871 -25288
6964 -22526 -228428 -35615 -204494 -39493 -98712 111953 278255 308004 -11346 263413 -386681
6952 135803 63146 -298848 91257 -284001 1524 -237282 233806 26253 -74699 -331548 -180854
6941 -180854 380632 126268 -109017 -92227 382650 51132 -176699 -52166 -190432 -49999
6930 -119770 -133687 288427 3447 -278346 -15179 60450 -425961 -94997 -164555 -169585 -190545
6919 -190545 73849 -375109 -134652 -93155 251851 129308 -359827 10807 -2706 -195422 -324923
6908 -324923 -220350 -113942 2946 -82759 76912 -70277 216338 -204294 -240498 -191386 -250407
6897 -250407 -109599 -263204 -3342 119705 -259405 -55121 -79058 -127079 -14232 149143 105750
6886 105750 -36179 -8701 -59813 223927 -150721 -194505 -202862 179750 -10976 -33461 -96910
6875 -96910 10047 -142073 60811 278446 -121839 -87983 158850 67270 18509 -59372 43813
6863 68291 217747 32459 146563 -20946 90246 52968 -266735 73889 156518 125323 -310440
6851 -191254 112601 -73637 -68606 -58513 266693 -66021 -372470 -53032 120726 -29520 -50779
6840 -50779 -93975 206250 -2998 34242 7269 11467 135296 -11103 67519 -436259 77712 -292698
6827 104570 89899 209978 2787 -23223 -238748 242095 22054 -147530 -153747 71108 145878
6816 145878 -146968 -68620 28409 -47603 -193197 -177393 -221754 145344 -331962 151704 45039
6804 47920 285017 -479146 98127 -268245 311593 -70401 -143128 364618 31681 86450 -132034
6792 33805 -85737 -87297 51672 -179324 181774 272326 192022 -310163 53520 -227753 -37041
6780 73906 -108234 64117 -545213 -137279 60714 -160883 174159 -112243 138646 195545
6770 195545 -94230 69491 180993 193142 278399 -115309 -90508 17915 68143 -158281 -64232
6758 -301116 110854 -119097 -271093 228024 63788 43426 68291 450355 -95786 -107870 -198546
6747 -198546 167379 -216270 -55898 -1292 -119021 -289311 -55785 454027 -160130 -468371
6737 -468371 208026 -105370 180318 -18867 -7372 -224253 181881 -332083 171017 81328
6726 220207 -332520 -186871 -230187 57496 -49283 142460 29014 -353959 -78578 -27998 -258907
6715 -258907 128479 136536 -39998 42498 -136342 -378946 -107480 -34937 141534 -35651 21178
6703 78461 179579 121732 285604 23623 99262 -248653 -257044 126089 183676 -16582 159025
6691 17636 -329429 25734 42074 19592 -150043 -186738 -106651 -138274 89490 -6583 85069 -318410
6678 -54778 227656 11491 -96971 -186460 124270 250952 -25635 268627 -49041 -97871 -149863
6667 -149863 -97825 -280518 195375 -171012 -334784 -435291 -23000 -39506 46153 -51097 -95289
6656 -95289 -132643 -309720 -40180 151234 174151 -299747 195800 83384 -90321 -17714 190674
6644 -59587 140613 228167 -319441 14177 286003 -291264 -34006 -429972 -254137 -133097
6634 -133097 -190566 -77166 133006 -176043 254863 129451 208953 -97194 -173118 261282 -16079
6622 -75064 -211251 -34479 -99 -168236 338021 -68174 352432 40858 64972 204782 189443
6611 189443 46600 -185948 -183234 430896 -158706 73440 -164183 -70800 34339 69695 -3081
6599 9404 -332205 -138812 29598 -11597 1022 27266 -304285 297431 -303755 -166035 -63634
6587 -84472 -121284 171584 122149 -128644 3132 -172046 22508 -184598 148256 -98096 -27371
6575 -69925 205602 -269233 178553 4229 -76842 -2289 -264624 116800 -65930 41915 31392
6564 31392 290543 25918 15882 -158860 -165631 111790 -81888 -6185 118459 -120363 -31286
6552 176360 341439 -300700 -269631 -393032 175285 159605 282174 -3832 83054 -121509 -131521
6541 -131521 -190128 -57199 -123083 445105 -100657 -93514 201840 155413 151657 15480 185276
6530 185276 -65240 -47034 -20459 -165822 -197402 174295 58241 281820 -31274 -376743 362626
6518 -198162 222173 -9150 -154429 -291621 -48209 -8966 256072 -140565 -207343 -9848 292639
6506 -62046 -46020 -444259 136835 -117591 -20143 -128247 -224103 -11283 -148003 -39317 -311772
6495 -311772 158378 67310 -137469 238835 -97797 547 2923 212333 47561 -180733 39542
6483 57173 307844 237029 -233592 -49128 -56676 153664 -118057 -198736 -219363 366710 47532
6471 56405 -155220 -288849 -205156 697 -77858 -4321 -72960 -43534 -162330 -112102 -182309 -238858
6459 -238858 154282 -79590 101553 173709 111715 131050 -35554 157496 188360 -71438 -77997
6448 -77997 -48153 246193 -66396 -374673 -21604 333638 -200649 -185050 -272647 60404 -20764
6436 254883 146762 253765 -111335 122881 -126828 16387 77856 44836 -75863 289311
6425 549070 -29995 116549 182503 -632264 -165145 275684 -294051 27779 317849 227618
6415 227618 -24475 -151813 -14684 303418 67318 -62393 107271 -318484 145937 256034
6405 256034 -34573 197383 90150 277345 107418 -411129 141227 173450 -248118 -164925
6395 -164925 128198 139549 128645 -274220 -310057 -25178 98734 -87925 76710 59206 31891
6384 31891 55110 60252 314584 -169777 -104227 133785 -74681 152492 -2451 -159268 174725
6372 -87175 91817 -212877 178409 -4290 -201235 83350 -213722 51186 -109893 -125343 234575
6360 140839 306371 -17986 -82269 -100013 -111408 -177430 -57678 -192628 -249610 -244259 -419018
6349 -419018 -81527 328270 58518 -57293 -82325 -64261 17952 -90642 164721 -151524 -31671
6337 112 -80597 113817 -86148 -175791 -192735 34065 299788 44821 151771 163432 -7881 114322
6324 188445 -107173 -6232 207496 232003 -113622 -124700 188736 215024 236216 53101 167945
6313 167945 4731 227089 192558 1504 48704 198842 229029 116835 198370 -8455 -60649 89502
6300 -43209 127705 18905 26114 121827 152448 72929 -291495 -37600 97644 57608 14907 -34226
6287 141179 -83274 -218604 426076 -89641 286720 26384 207605 2986 358894 -123840 13027
6275 -166058 111510 -118047 40638 -268414 88309 -47838 -469136 372905 188151 -48689
6264 -179038 -10894 -129316 90273 -114042 160626 -65244 -53136 -245818 24302 -12342 15506
6252 217328 -74767 -55957 -220225 -182869 63248 -219691 -258805 -85535 -204794 353923 190496
6241 190496 117083 -9004 -121143 16970 -463332 -2605 -22165 219764 51275 -117857 -99286
6230 -99286 -166620 -153667 -137317 142665 -409779 -102195 -211596 184195 -71042 124345 -169648
6218 204957 357670 -317715 129951 -164722 11246 345026 103331 203617 -245504 -32498
6207 -164301 -224206 -74204 -134034 -285387 140958 91119 69147 -188722 -216868 294593 77518
6195 -223388 -169013 -254868 11034 -323431 160689 181664 -224882 361299 -37058 -171235 -82045
6183 -88437 187005 40452 116922 60250 100552 -196974 -442737 5111 -339742 68490 230399
6172 230399 94243 -189355 -155012 -197259 197409 105394 138186 42383 -366933 456343 182149
6160 55135 -288175 -161918 -33847 -212710 79771 75113 -126093 -63681 -55895 202054 151135
6149 151135 66090 -202964 -193498 -27205 -302137 -53778 82093 -163600 169520 287586 20691
6137 -80043 -100761 134902 -40237 -184817 -163196 13459 -62235 42627 22604 -416630 158230
6125 212976 -147239 -41762 -48566 -42406 -256395 103940 41879 150139 -81518 316552 -31920
6113 -51909 -189823 63595 16925 -28673 -147989 104723 -247111 265771 92614 123586 117872
6102 117872 -208730 302594 139288 445640 39851 -49319 -26623 77110 -361988 -250770
6092 -250770 169085 -128953 -132377 -151337 -269746 -316755 86025 -15644 -106346 110896 232199
6081 232199 -23827 100434 -74704 548505 -137842 103663 -111848 386620 -79769 202762
6070 -192901 353517 159582 -251928 185455 -64757 -251092 -215952 -37187 11984 -172637
6059 -154917 57848 -31452 -199902 -90700 -56660 -178542 -24262 -181374 -285143 134294 256985
6048 256985 40496 -88975 290389 34386 -221440 94959 -167017 257809 342743 -119368 -73643
6037 -73643 322544 -192316 328378 -41195 -154307 163059 366264 -316443 -150413 -7430
6026 71527 60328 -87319 34714 -346597 -287487 -394115 760 52648 -113972 -141290 -180293 -181045
6014 -181045 -209102 -116492 164671 -57827 174449 -291386 -457 -258322 118309 -18766 119959
6002 -107868 -106917 88434 122311 -432194 152699 50971 313913 -44369 58679 -131313 47950
5990 56746 193446 -87670 -81522 222647 -49857 -281069 -89718 173768 -77430 92107 -122619
5978 46822 -243187 -222187 117281 -80619 -116179 112027 116627 163164 12488 -236624 129701
5966 -216634 302013 253378 129138 15213 -56048 351518 -232079 151931 -11493 -137987
5956 -137987 -242223 -228179 48986 -228645 -17360 -223201 -1329 -42738 25545 212517 110356
5945 110356 -261363 190237 -10090 223378 -101988 33379 -47553 279741 -4799 -300312 21393
5933 343306 377385 -110818 81994 111310 -35286 68776 -5107 207396 178739 91896 -2834 108475
5920 -106683 3571 86835 -131921 -33091 185127 -130941 -2705 107101 217720 -128506 -12514
5908 94597 -329244 -21848 46818 75210 128347 128397 27318 -131395 53438 -55950 267685 -120406
5895 317292 -164984 253559 -113339 -259610 13577 -142227 -134090 -289219 -122952 -357264
5885 -357264 131566 147396 -214061 274257 191879 99118 75119 -310281 72203 -63123 136882
5873 12174 94786 -91509 -371078 -76656 46969 77894 248600 -192599 142283 193218 -135249
5861 -46172 301952 135486 -92599 -32013 -316628 18537 -174901 -26072 101453 -46643 43914
5849 -231886 -311650 -80225 -89197 -54390 -283890 -22445 -128156 -120784 -84594 177288 248461
5838 248461 -204535 -33448 93994 105763 -257974 42101 -218190 -243418 -85681 152493 -49646
5826 55399 -105092 -81426 50424 27622 48563 -306907 227037 85289 -380418 28343 -195698
5814 -212481 101028 -25801 -89295 -128236 21665 163055 -370701 146238 -90017 -105659 380503
5802 -103219 -49090 -152098 -333423 -23620 52357 -288731 -157923 -9394 -10985 28670 -32362
5790 111920 34956 174144 45219 98835 -252483 125641 -122400 -98897 218601 220847 -247574
5778 -44636 29200 158983 -453885 -86092 -148622 3627 138830 71997 180669 154087 265643
5767 265643 109300 -236019 -122537 -26870 48640 -263101 -191143 26595 -118709 74060 -124589
5755 203596 -161061 46457 -218675 -60626 -58504 57216 276076 130032 41006 237396 10
5743 103534 304234 41254 -125852 -44575 85554 -151065 -80676 93667 -368233 220740 -39196
5731 16672 -24250 73133 118996 -121194 -198895 -70134 251819 -190418 -89262 50487 94942
5720 94942 -126653 -323152 -189157 -52767 155709 75475 -43765 46589 135418 -133282 41038
5708 -27968 225831 178104 411493 -206820 24284 -135830 -34665 418031 37025 -150425 -262739
5697 -262739 44356 -104737 260001 110658 103318 -147925 14126 -195191 81671 -229189 -16260
5685 278259 38192 102179 -239339 -119319 -230158 131568 218875 25610 62493 -111311 22923
5673 -94451 -35460 -194953 213183 -99724 37470 -77804 110465 209683 -274128 -259145 -90697
5661 -64379 -218465 161037 -47037 -52788 37089 -199907 126001 301673 187482 88552 -53561
5649 -1112 201623 132336 -131434 137952 -106128 26909 290307 129438 -82524 -15803 236353
5637 -49453 -110957 35365 -314098 211222 101452 60433 38336 183973 219190 -152418 146227
5625 56543 -30821 117521 -27174 -2777 9361 -238356 32927 98503 28888 137671 120072 -212242
5612 127063 -205650 188344 -150158 -182722 -396253 -8921 -43833 70508 126252 183427 -39459
5600 -189059 -188825 -137969 229848 -243537 -229974 -96919 -129614 -79509 118876 -529501 88319
5588 133553 45372 214446 170898 -171483 246804 276459 4247 -35175 -72240 -289226 -55147
5576 -97496 -75327 -132603 -108359 153109 172800 73522 66919 -206856 261654 -145939 -292439
5565 -292439 -321283 424229 -103907 -69141 102178 -49083 -49231 -381410 147713 51218 38603
5554 38603 -217980 202605 -16852 -16317 -130181 58479 -30298 200344 -10807 -53130 159049
5542 -2246 -215178 99682 137999 158770 124827 -63219 153168 -107165 -190545 30726 304758
5531 304758 150632 -280230 -251050 -54417 -67629 -44502 5952 -26338 -12780 170878 -292991
5519 -234845 -190119 205205 -475369 -96489 -60130 -75858 -197960 71627 465416 224538 304987
5508 304987 409944 328084 97695 51021 -17783 175216 132802 68797 -164194 -206381 86406
5496 128724 185152 -271136 173729 -228398 180541 -172043 27050 289820 -101682 -199903
5486 -199903 109758 -136211 92123 -34278 64223 353038 -2944 245327 149743 130019 -19681
5474 5074 -152752 -27397 4109 61440 -14347 -229676 42312 75130 -164564 -307225 -11197
5462 -121145 -142809 -194193 -92522 -54020 145017 186658 -190200 -160678 -146286 203726 244982
5451 244982 -110297 29239 -96221 198392 95479 -164155 -261300 -74744 -162212 -250979 124137
5439 -73277 203161 38751 1813 380473 164865 -148 91687 166118 -209818 48011 -50478 53738
5426 -295256 76774 79393 -485379 -105151 -105692 -176483 138492 -110394 -17052 -114617 133702
5414 252587 142424 -277755 -222039 -237803 88882 -103561 -46875 120044 266850 -186452
5403 40615 -1302 281685 -675 136543 -148978 -128243 -293367 33906 -26445 187452 103732
5392 103732 -38034 -164382 189365 259322 -7053 145899 330248 -78855 -95617 -48428 2807
5380 15973 -95315 165933 -231726 359932 -185815 -123279 159259 -73742 -5531 184197 21965
5368 -23840 -99364 -203892 92991 35906 -231037 -299200 -68090 237205 -274208 120259 87081
5357 87081 -101544 -92619 -2149 99040 104336 -272881 141609 -24984 8137 209360 -212933 -293911
5345 -293911 -101154 -54574 -79983 224047 -33872 -25764 60166 72846 -65861 75143 77342 -62992
5332 54535 88199 153173 -15381 -188855 74103 -123345 -99225 -83103 -239589 67125 -178112
5320 164160 -22373 96737 -30233 216027 -428656 -237790 -193353 22150 -157754 2631 -232344
5308 -115393 54258 -399371 -26240 45805 7175 -14929 -100295 -250451 114942 235945 81838
5296 -150148 149353 32773 230130 221001 459086 532250 -132512 -1785 -184729 -164907 -115719
5285 -115719 302618 -100378 -335850 95324 88130 17602 222327 147666 142936 -12564 218312
5273 -81377 -85063 291636 28587 80888 -85950 -136966 128465 -356083 -301569 92516 60951
5262 60951 -205967 164523 -120927 24693 19563 -115784 -6381 -27606 -283303 202777 257749
5251 257749 249396 285060 -55574 247104 -102716 223339 -94180 139118 65460 -152069 -106046
5240 -106046 155772 477425 46199 152824 189843 142360 42002 -174832 -7426 -276541 -238210
5229 -238210 -106695 -155513 8810 -225670 -213318 182399 -25726 -313414 74828 148413 186937
5218 186937 15312 60384 28015 153711 -89442 121913 197510 -22801 -174614 4821 -2128
5206 236626 -225462 139779 7770 46209 41201 89069 114731 -260269 180643 26291 -15721
5194 123911 -117747 200203 -70530 42171 -150198 137377 88648 186063 167827 151281 -10789
5182 -50065 257322 -84255 139082 171093 71239 226791 -48811 -128238 12254 -105834 -20240
5170 -29515 241110 -239325 -88127 384759 -94456 -91041 84335 66191 -87765 43696 -102957
5158 110683 79449 -104470 68350 22189 -15947 260862 33240 68302 -110508 56906 184272
5147 184272 -199277 -153525 111734 43344 323576 -67760 47623 -68093 42107 -107835 23301
5135 -562599 174045 604370 -209241 -2627 112038 47523 52483 46926 244735 -173696 -54488
5123 -110680 -115242 87391 -63705 -164730 -110331 -309805 244981 -73162 -41514 53248 113658
5112 113658 128194 -36642 248389 -239324 54709 -20484 -11349 210545 295731 277810 424926
5101 424926 151032 -80962 -132247 69421 92014 -93366 192951 -49054 -168929 -105115 236123
5089 -62328 195251 -194748 -255837 85784 -260026 133181 344187 -236901 -9635 -160381 -19545
5077 72197 88698 113179 174843 238158 308930 -426240 -226599 360559 113165 74067 -156028
5065 486928 83933 -12516 -139319 -319794 180739 -67961 23526 30675 29325 42728 79595
5054 79595 -67787 49077 -287191 47340 -7880 108707 -133040 26949 90391 72084 177845
5043 177845 -82621 292966 256014 -24587 -145004 -434973 -235183 -6028 116646 -304360 -374454
5032 -374454 101410 23565 119631 163256 -31955 -112133 117614 16876 17129 -125713 -245142
5021 -245142 -178028 -17611 -325975 187935 115217 9680 -57701 117270 12557 108836 -109217
5009 -13426 -37057 -67538 -27941 -13262 252196 -199385 -10461 -224744 88441 -20641 -25126
4998 -25126 -9479 -88679 188224 -307558 420976 253016 87837 95653 58802 139950 -89954
4986 -103969 23955 81003 -177876 -87443 141876 -243509 -204994 164810 63169 -264580 -47888
4974 234614 -112137 202136 -29468 57435 165825 -48428 -71613 36813 58334 -98570 -90867
4963 -90867 401026 10642 198007 -304053 -92070 20397 -81206 -198025 242114 -90132 -126573
4952 -126573 -30737 83113 127849 -71098 -212533 -37152 -258122 244033 -95479 155691 132155
4941 132155 -2730 137808 -355205 160261 172677 -136340 51096 176691 -74965 -63380 179756
4929 111634 -163121 -13911 17158 -82437 132560 35528 -14551 -53511 -216968 249745 -43143
4917 -108117 -159048 125251 69892 -16840 -173649 -233722 -322874 -139739 -85818 -140926 35404
4905 281832 428999 152792 316354 160357 73894 45822 -72708 -223414 -24822 -80494 92679
4893 -95851 32810 56771 -212156 208712 -12600 -115015 294233 340156 -21914 -166154 -10955
4881 148143 -487712 -232765 -320609 85070 440788 -296569 -20239 354038 -12838 128656
4870 37149 -113329 43301 -248686 -186646 325664 -54397 120471 177564 -69847 -19614 -308729
4859 -308729 368187 83464 52617 -177289 132671 -199050 125004 1344 -227250 -302170 -113318
4847 20818 137893 212594 100135 -52236 50210 -189887 127596 47097 38944 110536 -20438
4835 -253890 -286676 -108927 274451 161394 -30066 -156761 171398 323751 -239632 71080
4824 219637 -6884 -106316 31176 178970 -82433 37243 37646 -328803 -126968 52921 -186570
4812 -194460 252027 -18184 70207 116653 -13195 -122315 45969 224895 -208160 -190639 -163502
4801 -163502 -403338 -228899 -63123 -179292 -305848 -69232 -197037 252424 -8718 -274805
4791 -274805 -330512 175332 367447 183306 99945 -72496 183821 -438997 240191 316869
4781 316869 253647 77434 47510 -119720 445939 123110 62027 -26839 -67366 49497 124062
4770 124062 191958 57617 -95229 -220544 26810 -61437 26580 46346 178254 89275 252310
4759 252310 -56507 -139545 -391236 -214472 -217865 -204108 -191066 -189188 -88661 -23444 -38326 234315
4746 109931 223802 -81467 86959 52507 56679 226940 240979 137693 1636 -67427 227826
4734 37416 -376254 242255 166416 -7034 -154165 211811 -63522 -70717 63344 107325 -159886
4722 -80609 57678 -86153 47928 118847 -58627 -197727 143615 -226352 -13305 12980 51470
4711 51470 287410 -259782 -53208 27424 -64358 52891 145706 -31935 79582 -26216 -183541
4700 -183541 -36330 230370 -82764 69072 -93933 202855 -126100 -36499 -38168 -17816 123381
4688 177905 -179234 -112089 58423 232047 -98365 -101654 -113606 -94563 -235677 80726 6156
4676 206806 -380070 -34747 8448 298240 -20369 243734 209677 219244 -125411 -19507 -167437
4665 -167437 -23624 54584 -311799 -46248 -297830 74151 -44779 -36913 -139543 -213764 -218900
4654 -218900 -129095 -16895 -266950 95168 196896 67882 -15635 -100459 28851 147860 -131105
4642 139535 471669 -71586 261835 -86611 -30180 30432 -81736 134115 -128847 -324893 -190294
4631 -190294 -126579 79336 27438 -31992 -482912 110002 28623 -287747 41358 78923 -93098
4619 317511 -44086 -296630 43441 129309 -8138 29453 51139 152658 29091 15525 -17379
4607 224872 67081 -182529 -285798 165115 -78275 74806 -17384 166213 145062 -312223 -164715
4596 -164715 90153 132006 -51159 116272 216183 43662 -15777 -215885 112666 -23079 -90103
4585 -90103 33921 -366639 -42894 170811 143573 241878 -39426 164238 -94651 299132 -99484
4573 -40781 -103724 42737 -179923 -94917 9745 -246503 13693 -233549 -32210 306825 -376029
4561 84024 -216399 815 295389 -129212 -18027 36120 -27166 41876 77407 42616 -153907
4549 253772 -154181 105678 279541 216172 81553 68687 284820 -59408 -95550 21325 39922
4538 39922 15858 -52696 -183284 -237893 6741 332542 -205395 13717 121261 3086 75442
4527 75442 -54887 122674 61186 -30174 -56795 37356 30060 -63694 -32878 68903 -1864 -120979
4515 -120979 -142216 124597 70318 34430 -49302 361096 224066 -15367 91083 -57091 337527
$$ [...]
##END NTUPLES=NMR SPECTRUM
##END=
