
##TITLE=UV1104_M1_1161-1249_7180354_UJUVtSyq49
##JCAMPDX= 6.0         $$ Bruker NMR JCAMP-DX V2.0
##DATA TYPE= NMR SPECTRUM
##DATA CLASS= NTUPLES
##ORIGIN= BRUKER
##OWNER= Administrator
$$ 1.72 TOPSPIN		Version 2.1
$$ 2012-12-05 05:07:29.441 -0500  Administrator@X
$$ Compression mode = diff/dup
##.OBSERVE FREQUENCY= 400.02188249412
##.OBSERVE NUCLEUS= ^1H
##.ACQUISITION MODE= SIMULTANEOUS (DQD)
##.ACQUISITION SCHEME= undefined
##.AVERAGES= 64
##.DIGITISER RES= 22
##SPECTROMETER/DATA SYSTEM= spect
##.PULSE SEQUENCE= noesygpps1d.comp
##.SOLVENT NAME= COFFEE_meoh
##.SHIFT REFERENCE= INTERNAL, COFFEE_meoh, 1, 14.96074
##AUDIT TRAIL= $$ (NUMBER, WHEN, WHO, WHERE, PROCESS, VERSION, WHAT)
$$ ##TITLE= Audit trail, TOPSPIN		Version 2.1
$$ ##JCAMPDX= 5.01
$$ ##ORIGIN= Bruker BioSpin GmbH
$$ ##OWNER= Administrator
$$ $$ E:\/data/COFFEE/nmr/UV1104_M1_1161-1249_7180354_UJUVtSyq49/12/pdata/1/auditp.txt
$$ ##AUDIT TRAIL=  $$ (NUMBER, WHEN, WHO, WHERE, PROCESS, VERSION, WHAT)
(   1,<2012-12-05 05:07:23.566 -0500>,<Administrator>,<X>,<go>,<TOPSPIN 2.1>,
      <created by zg
	started at 2012-12-05 04:55:53.361 -0500,
	POWCHK enabled, PULCHK disabled,
       configuration hash MD5:
       86 BA 57 50 F2 9D 5C 9B 26 00 A9 28 5F 66 2E 89
       data hash MD5: 64K
       5B 74 EC 8C 24 06 E9 61 1A 0C 05 B8 C9 2F 95 81>)
(   2,<2012-12-05 05:07:26.644 -0500>,<Administrator>,<X>,<proc1d>,<TOPSPIN 2.1>,
      <Start of raw data processing
       efp LB = 0.3 FT_mod = 6 PKNL = 1 PHC0 = 0 PHC1 = 0 SI = 128K 
       data hash MD5: 128K
       C8 9D 9E B0 7E 13 19 36 40 11 F7 D9 B7 3F 60 69>)
(   3,<2012-12-05 05:07:27.675 -0500>,<Administrator>,<X>,<proc1d>,<TOPSPIN 2.1>,
      <pk PHC0 = -84.24316 PHC1 = 0 
       data hash MD5: 128K
       88 4B 2E D8 2D 7F BC BA E8 B7 6E 76 E8 1B 50 25>)
(   4,<2012-12-05 05:07:28.379 -0500>,<Administrator>,<X>,<proc1d>,<TOPSPIN 2.1>,
      <abs ABSG = 1 
       data hash MD5: 128K
       F2 EA 55 73 11 C9 40 8D 0E 14 96 C1 70 06 D1 6F>)
(   5,<2012-12-05 05:07:28.566 -0500>,<Administrator>,<X>,<proc1d>,<TOPSPIN 2.1>,
      <abs ABSG = 2 
       data hash MD5: 128K
       41 8D 7C DF 05 56 25 50 0D 5C 03 DA B3 26 2D 3A>)
(   6,<2012-12-05 05:07:28.754 -0500>,<Administrator>,<X>,<proc1d>,<TOPSPIN 2.1>,
      <abs ABSG = 3 
       data hash MD5: 128K
       E6 D9 D4 CC 00 F5 60 35 5E 03 8D 2F 83 F4 6C 9E>)
(   7,<2012-12-05 05:07:28.957 -0500>,<Administrator>,<X>,<proc1d>,<TOPSPIN 2.1>,
      <abs ABSG = 4 
       data hash MD5: 128K
       F1 57 53 DE 85 6C AF 68 3D 0D 2E D2 4E 0F 9C A4>)
(   8,<2012-12-05 05:07:29.129 -0500>,<Administrator>,<X>,<proc1d>,<TOPSPIN 2.1>,
      <abs ABSG = 5 
       data hash MD5: 128K
       C4 89 3A 7B 28 5D 11 0F 93 86 94 A8 D7 61 67 BD>)
$$ ##END=
$$ 
$$ $$ hash MD5
$$ $$ 28 A5 C8 57 67 78 44 9D 4A 4C F7 3F 47 99 9B A6
##$RELAX= 
##$RELAX= 
##$RELAX= 
##$RELAX= 
##$RELAX= 
##$RELAX= 
##$RELAX= 
##$RELAX= 
$$ Bruker specific parameters
$$ --------------------------
##$DU= <E:\>
##$EXPNO= 12
$$ [...]
##$TP07= 0
##$TPNAME0= <>
##$TPNAME1= <>
##$TPNAME2= <>
##$TPNAME3= <>
##$TPNAME4= <>
##$TPNAME5= <>
##$TPNAME6= <>
##$TPNAME7= <>
##$TPOAL= (0..7)
0.5 0.5 0.5 0.5 0.5 0.5 0.5 0.5
##$TPOFFS= (0..7)
0 0 0 0 0 0 0 0
##$TUNHIN= 0
##$TUNHOUT= 0
##$TUNXOUT= 0
##$USERA1= <user>
##$USERA2= <user>
##$USERA3= <user>
##$USERA4= <user>
##$USERA5= <user>
##$V9= 5
##$VALIST= <valist>
##$VCLIST= <CCCCCCCCCCCCCCC>
##$VD= 0
##$VDLIST= <DDDDDDDDDDDDDDD>
##$VPLIST= <PPPPPPPPPPPPPPP>
##$VTLIST= <TTTTTTTTTTTTTTT>
##$WBST= 2048
##$WBSW= 25
##$XGAIN= (0..3)
0 0 0 0
##$XL= 0
##$YL= 0
##$YMAX_a= 5564722
##$YMIN_a= -10692000
##$ZGOPTNS= <>
##$ZL1= 120
##$ZL2= 120
##$ZL3= 120
##$ZL4= 120
##$ABSF1= 14.96074
##$ABSF2= -5.597442
##$ABSG= 5
##$ABSL= 3
##$ALPHA= 0
##$AQORDER= 0
##$ASSFAC= 0
##$ASSFACI= 0
##$ASSFACX= 0
##$ASSWID= 0
##$AUNMP= <proc_prof1d_extract.lims>
##$AXLEFT= 0
##$AXNAME= <>
##$AXNUC= <1H>
##$AXRIGHT= 0
##$AXTYPE= 0
##$AXUNIT= <>
##$AZFE= 0.1
##$AZFW= 0.1
##$BCFW= 0
##$BC_mod= 0
##$BYTORDP= 0
##$COROFFS= 0
##$CY= 15
##$DATMOD= 1
##$DC= 0
##$DFILT= <>
##$DTYPP= 0
##$F1P= 0
##$F2P= 0
##$FCOR= 0.5
##$FTSIZE= 131072
##$FT_mod= 6
##$GAMMA= 0
##$GB= 0
##$INTBC= 1
##$INTSCL= 1
##$ISEN= 128
##$LB= 0.3
##$LEV0= 0
##$LPBIN= 0
##$MAXI= 10000
##$MC2= 0
##$MEAN= 0
##$ME_mod= 0
##$MI= 0
##$NCOEF= 0
##$NC_proc= -2
##$NLEV= 6
##$NOISF1= 0
##$NOISF2= 0
##$NSP= 0
##$NTH_PI= 0
##$NZP= 0
##$OFFSET= 14.96074
##$PC= 1
##$PHC0= -84.24316
##$PHC1= 0
##$PH_mod= 1
##$PKNL= yes
##$PPARMOD= 0
##$PPDIAG= 0
##$PPIPTYP= 0
##$PPMPNUM= 2147483647
##$PPRESOL= 1
##$PSCAL= 4
##$PSIGN= 0
##$PYNMP= <proc.py>
##$REVERSE= no
##$SF= 400.02000974163
##$SI= 131072
##$SIGF1= 0
##$SIGF2= 0
##$SINO= 400
##$SIOLD= 131072
##$SPECTYP= <>
##$SREGLST= <1H.CDCl3>
##$SSB= 0
##$STSI= 131072
##$STSR= 0
##$SW_p= 8223.68421052631
##$SYMM= 0
##$S_DEV= 0
##$TDeff= 65536
##$TDoff= 0
##$TI= <>
##$TILT= no
##$TM1= 0
##$TM2= 0
##$TOPLEV= 0
##$USERP1= <user>
##$USERP2= <user>
##$USERP3= <user>
##$USERP4= <user>
##$USERP5= <user>
##$WDW= 1
##$XDIM= 131072
##$YMAX_p= 378832945
##$YMIN_p= -13430
##$CURPLOT= <Network HP LaserJet P1505>
##$CURPRIN= <$Network HP LaserJet P1505>
##$DFORMAT= <normdp>
##$LAYOUT= <+/1D_H.xwp>
##$LFORMAT= <normlp>
##$PFORMAT= <normpl>
##$SURQMSG= 1
$$ End of Bruker specific parameters
$$ ---------------------------------
##NTUPLES= NMR SPECTRUM
##VAR_NAME=  FREQUENCY,     SPECTRUM/REAL,   SPECTRUM/IMAG
##SYMBOL=    X,             R,               I
##VAR_TYPE=  INDEPENDENT,   DEPENDENT,       DEPENDENT
##VAR_FORM=  AFFN,          ASDF,            ASDF
##VAR_DIM=   131072,        131072,          131072
##UNITS=     HZ,            ARBITRARY UNITS, ARBITRARY UNITS
##FACTOR=    0.0627417313425164, 1,          1
##FIRST=     8223.62146879497, 2529,         -49205
##LAST=      0,             3150,            -48698
##MIN=       0,             -13430,          0
##MAX=       8223.62146879497, 378832945,    0
$$ Real data points
##PAGE= N=1
##DATA TABLE= (X++(R..R)), XYDATA
$$ [...]
63987B35485K326K359J910J440J688K520L054L078L506N021O913P938P938P833
63973B93009Q221Q706Q758Q518Q404Q368Q094P789Q163R541J1314J2637J3386
63960D14908J4136J5282J6665J8102J9870K2370K5633K9494L4090L9720M6291
63949F96561N3367O0875O9413P9695R1816J05193J19015J32649J45711J57910
63939A712205J68837J77943J84878J89691J92332J92063J87687J78577J65081
63930C349294J47857J27166J03146P6493M8411J9898q681l7289o5691r3169j18650
63919C548785j41027j59458j73386j82402j86467j86297j83236j78414j72143
63910A985955j64206j54485j43087j30210j16421j02881r0749q0267p0781o1750
$$ plain form
63987 235485 237811 240170 242080 243520 245208 247728 250782 253860 257366 262387 269300 277238 285176 293009
63973 293009 301230 309936 318694 327212 335616 343984 352078 359867 368030 377571 388885 401522 414908
63960 414908 429044 444326 460991 479093 498963 521333 546966 576460 610550 650270 696561
63949 696561 749928 810803 880216 959911 1051727 1156920 1275935 1408584 1554295 1712205
63939 1712205 1881042 2058985 2243863 2433554 2625886 2817949 3005636 3184213 3349294
63930 3349294 3497151 3624317 3727463 3803956 3852367 3872265 3863584 3826295 3760604 3667435 3548785
63919 3548785 3407758 3248300 3074914 2892512 2706045 2519748 2336512 2158098 1985955
63910 1985955 1821749 1667264 1524177 1393967 1277546 1174665 1083916 1003649 932868 871118
63900H71118n3344m5906l9292l3088k7278k2345j8765j6577j5355j4448j3339
63889E71381j2015j0951j0563j0690j0736j0327r596q892q341p807p098o112m794
63876D53459l038o72K288N384P857R347J0361J1787J3902J6146J7933J9276K0415
63863E84445K1203K1333K0982K0704K0597K0092J8721J6778J4897J3240J1435
63852G84427R138O373L319Q7l247o518r470j1854j3589j4921j6323j8094k0122
63839F89206k2068k3716k5000k5792k5991k5738k5348k4934k4288k3192k1695
63828D21444k0074j8624j7484j6544j5414j3705j1474r348q096p933q216p892
63816B66640o526m914m423n421o690o726n444m063l386k941k059j106r27j428
$$ plain form
63900 871118 817774 771868 732576 699488 672210 649865 631100 614523 599168 584720 571381
63889 571381 559366 548415 537852 527162 516426 506099 496503 487611 479270 471463 464365 458253 453459
63876 453459 450421 449749 452037 457421 465278 474625 484986 496773 510675 526821 544754 564030 584445
63863 584445 605648 626981 647963 668667 689264 709356 728077 744855 759752 772992 784427
63852 784427 793565 799938 803257 803344 800097 793579 784109 772255 758666 743745 727422 709328 689206
63839 689206 667138 643422 618422 592630 566639 540901 515553 490619 466331 443139 421444
63828 421444 401370 382746 365262 348718 333304 319599 308125 298777 290681 282748 274532 266640
63816 266640 260114 255200 250777 245356 238666 231940 226496 222433 219047 216106 214047 212941 212014 210586
63802B10586j565q22p3n08k010l171k947j861j220j481j874j655j110r09j061
63787A88319j102j022j183j416j150n47n77j490k115j423o6N42K05r4J17K62p5
63770A77185n05o97r21j279j243n10L06M88J96k9k33p77j416j523j094p53o98
63753A66497m04M27J279J506J139O52K77p3m22o00l88L41J476K512K812K280J553
63736A80864J294J467J650J747J989K319K364K056J846K044K377K484K480K684
63722B09665L088L485L940M649N394N658N286M630L945L067J868N73o29j844l055
63707B49720l811l795l395l240l316l083k383j610j016m15K22M71J03l27j0J158
63691B25273K405K898K548K029K015K468K726K397J916J937K374K564K210J633
$$ plain form
63802 210586 209021 208199 208126 207618 205608 202437 199490 197629 196409 194928 193054 191399 190289 189380 188319
63787 188319 187217 186195 185012 183596 182446 181899 181322 179832 177717 176294 176228 176770 176975 176881 176998 177260 177185
63770 177185 176680 175983 175062 173783 172540 172030 172336 172824 173020 172991 172758 171981 170565 169042 167948 167195 166497
63753 166497 166093 166520 167799 169305 170444 171096 171373 171300 170878 170278 169890 170231 171707 174219 177031 179311 180864
63736 180864 182158 183625 185275 187022 189011 191330 193694 195750 197596 199640 202017 204501 206981 209665
63722 209665 212753 216238 220178 224827 230221 235879 241165 245795 249740 252807 254675 255248 254619 252775 249720
63707 249720 245909 242114 238719 235479 232163 229080 226697 225087 224071 223656 223878 224349 224452 224125 224115 225273
63691 225273 227678 230576 233124 235153 237168 239636 242362 244759 246675 248612 250986 253550 255760 257393
63677B57393J088M90p7k51p5m9k40j00M99Q79Q00J162K467L506K849J090J44M86
63659B72061P02j46j366k249l241m702n808n817n374n365n330m351k886k317k812
63644B20999l041k071m27R65J889K545K982L133K902K109R74N68J876M205N601
63629B45209N253M488M743N560N652N195N671P578R628J0488J0402J0584J1685
63616C42136J3424J5303J7071J8690K0282K2119K4297K6449K8047K9031K9893
63605E86742L1055L2245L2516L0814K6668K0621J4013Q053K959j776o159r210
63593G68541j0113r506r013r472j0351j1030j1931j3859j6778j9799k2128k3477
63581F01084k3776k3132k1967k0677j9161j7131j4774j2576j0580q426o088l990
$$ plain form
63677 257393 258481 258971 258894 258643 258568 258519 258279 258179 258678 259557 260357 261519 263986 267492 270341 271431 271575 272061
63659 272061 272763 272617 271251 269002 265761 261059 255251 249434 244060 238695 233365 229014 226128 223811 220999
63644 220999 217958 215887 215460 216425 218314 220859 223841 226974 229876 231985 232959 233527 235403 239608 245209
63629 245209 250462 254950 259693 265253 270905 276100 281771 289349 298977 309465 319867 330451 342136
63616 342136 355560 370863 387934 406624 426906 449025 473322 499771 527818 556849 586742
63605 586742 617797 650042 682558 713372 740040 760661 774674 782727 785686 783910 777751 768541
63593 768541 758428 748922 739909 730437 720086 709056 697125 683266 666488 646689 624561 601084
63581 601084 577308 554176 532209 511532 492371 475240 460466 447890 437310 428884 422796 418806
63569D18806k278o51R17J933K213K387L272N085P480R847J1334J1271J0062R171
63555D90849R672J1228J2994J4931J7499K0419K2756K4321K6171K9351L3618L7614
63543G51423L9982L9963L7172L1305K2441J1724J358o584j1531j4254j5495j5314
63531H72190j3888j2133j0927j0328j0130j0720j2656j5828j9649k3735k7597
63520G04599l0216l0901l0374k9937k9674k8527k6119k3328k0849j8459j6070
63509D20145j4371j3669j3069j1616r586p855o665n783n362n559n742n048l680
63496C12140k759k844l311l322k750j961j243p09l94k25l0K75P07J367K303L177
63480C00421L448L015K490K596L338L971L819L017K259J874J459N94m47j163j746
$$ plain form
63569 418806 416528 415877 416794 418727 420940 423327 426599 431684 439164 449011 460345 471616 481678 490849
63555 490849 500521 511749 524743 539674 557173 577592 600348 624669 650840 680191 713809 751423
63543 751423 791405 831368 868540 899845 922286 934010 935368 928784 917253 902999 887504 872190
63531 872190 858302 846169 835242 824914 814784 804064 791408 775580 755931 732196 704599
63520 704599 674383 643482 613108 583171 553497 524970 498851 475523 454674 436215 420145
63509 420145 405774 392105 379036 367420 357834 349979 343314 337531 332169 326610 320868 315820 312140
63496 312140 309381 306537 303226 299904 297154 295193 293950 293241 292847 292622 292592 292867 293574 294941 297244 300421
63480 300421 303869 306884 309374 311970 315308 319279 323098 326115 328374 330248 331707 332301 331854 330691 328945
63465C28945k895m627n983o146n291m095k946k051j726k014k416k521k521k558
63451B81155k083o10J233K276K403K661L708M965N656O018O983Q967J1397J3368
63437C48097J4609J5790J7903K1129K4532K6964K8107K8204K7101K4256J9761
63426E96453J4699J0280P096N363N353P092J0048J3571J7527K2077K6989L1496
63414G68044L4877L6900L7579L6695L3819K8749K1835J3772N317k560q582j1863
63402I94582j2856j3101j3713j4558j5215j6117j8057k0967k3995k6616k8970
63391G90417l1123l2724l3429l3124l1699k9228k6337k3691k1117j7951j4317
63380D95677j1211r129p466n626l944k915k187r12J281M105O955R071R941R984
$$ plain form
63465 328945 326050 321423 315440 309294 304003 299908 296962 294911 293185 291171 288755 286234 283713 281155
63451 281155 279072 278462 279695 281971 284374 287035 290743 295708 301364 307382 314365 323332 334729 348097
63437 348097 362706 378496 396399 417528 442060 469024 497131 525335 552436 576692 596453
63426 596453 611152 621432 628528 633891 639244 646336 656384 669955 687482 709559 736548 768044
63414 768044 802921 839821 877400 914095 947914 976663 998498 1012270 1017587 1015027 1006445 994582
63402 994582 981726 968625 954912 940354 925139 909022 890965 869998 846003 819387 790417
63391 790417 759294 726570 693141 660017 628318 599090 572753 549062 527945 509994 495677
63380 495677 484466 475337 467871 462245 458301 455386 453199 452287 453568 457673 464628 473699 483640 493624
63366D93624J0311J1443J2842J4195J6243J9545K3124K5491K6688K8102L0373
63355G11981L2651L4082L4920L5660L5835L4349L0610K4908J7945J0490L361k688
63343A004104p279j0570j2951j4556j5178j4898j4638j5556j7823k0521k2962
63332H37172k5399k8086l0358l1392l1266l0436k8741k5985k3019k0911j9215
63321E42364j6381j2041p512l910j208L35n56m415r603j3883j6611j8287j8820
63308D19472j7679j5292j2900j0968r015o988n603n129m937m576m356m449m383
63295C13197l910l548l637l610k973k339k700l919m814m557l394k022r65n16p14
63280B69579j224j630j932k406k912k802j749l43M76L96oj6L88N54K6p20p12K50
$$ plain form
63366 493624 503935 515378 528220 542415 558658 578203 601327 626818 653506 681608 711981
63355 711981 744632 778714 813634 849294 885129 919478 950088 974996 992941 1003431 1006792 1004104
63343 1004104 996825 986255 973304 958748 943570 928672 914034 898478 880655 860134 837172
63332 837172 811773 783687 753329 721937 690671 660235 631494 605509 582490 561579 542364
63321 542364 525983 513942 506430 502520 501312 501647 501091 496676 487073 473190 456579 438292 419472
63308 419472 401793 386501 373601 362633 353618 346630 341027 335898 330961 326385 322029 317580 313197
63295 313197 309287 305739 302102 298492 295519 293180 290480 286561 281747 277190 273796 271774 270809 270293 269579
63280 269579 268355 266725 264793 262387 259475 256673 254924 254581 255057 255453 255447 255431 255819 256373 256399 255679 254967 255217
63262B55217J168R98k8p42m90K63P91R57J030J129J200J283J549K155L145M217
63246B73842M651L957K728K312L326M968O146O765P372Q050Q463Q709R295J0256
63232C60840J1023J1292J1374J1570J1738J1767J1870J2197J2553J2774J2996
63221D91994J3251J3195J2583J1678J0908J0398J0122J0133J0210R648P924N429
63209F17473L060J082j142m184p703j0759j2778j3924j4619j4913j4522j3357
63197E13714j1762j0059q201o120m204k911k007p34J190L293N242P375R976J2531
63183E07323J4211J4869J5096J5457J6037J6563J6683J6289J5747J5595J5837
63172F79707J5885J5434J4860J4406J3477J1350Q256N137K528K14k263n280r040
$$ plain form
63262 255217 256385 257383 257355 256613 256123 256386 257177 258134 259164 260293 261493 262776 264325 266480 269625 273842
63246 273842 278493 282450 285178 287490 290816 295784 301930 308695 316067 324117 332580 341289 350584 360840
63232 360840 371863 383155 394529 406099 417837 429604 441474 453671 466224 478998 491994
63221 491994 505245 518440 531023 542701 553609 564007 574129 584262 594472 604120 612044 617473
63209 617473 620533 621615 620473 616289 608586 597827 585049 571125 556506 541593 527071 513714
63197 513714 501952 491893 483692 477572 473368 470457 468450 467716 468906 472199 477441 484816 494792 507323
63183 507323 521534 536403 551499 566956 582993 599556 616239 632528 648275 663870 679707
63172 679707 695592 711026 725886 740292 753769 765119 773375 778512 781040 781254 778991 773711 764671
63159G64671j3237j7015j9865k2225k4633k6574k7036k5958k4232k2453k0593
63148E20850j8877j7815j7203j6123j4294j2456j1110r837q349p236o834o296
63136C74420m692k498j041p61r34q30l66K63Q99J307J339J263J549K286L125L670
63120C78999L677L164K565K564L280L938L809L219L119L841M843N559N916O027
63106D34520N920N674N462N349N318N367N393N165M807M940N820O553N914L957
63092E10159K143J671K317L065L304K995K121O03j291k801l247k760k393l186
63078E12700m946o248n934m357k778j856j296p47k82M7M29Q62J192J711L030N051
63062D96578O771P594Q191R508J1435J3157J4452J5838J7585J9414K1155K3024
$$ plain form
63159 764671 751434 734419 714554 692329 667696 641122 614086 588128 563896 541443 520850
63148 520850 501973 484158 466955 450832 436538 424082 412972 403135 394786 387550 380716 374420
63136 374420 369728 367230 366189 365428 364494 363664 363298 363561 364460 365767 367106 368369 369918 372204 375329 378999
63120 378999 382676 385840 388405 390969 394249 398187 401996 405215 408334 412175 417018 422577 428493 434520
63106 434520 440440 446114 451576 456925 462243 467610 473003 478168 482975 487915 493735 500288 506202 510159
63092 510159 512302 513973 516290 519355 522659 525654 527775 528378 527087 524286 521039 518279 515886 512700
63078 512700 507754 501506 495572 491215 488437 486581 485285 484538 484256 484303 484732 485594 486786 488497 491527 496578
63062 496578 503349 510943 519134 528642 540077 553234 567686 583524 601109 620523 641678 664702
63050F64702K5075K6953K8452K9770L0902L1275L0497K9143K8261K8161K8244
63039I81435K8066K8017K8653K9760L0519L0461K9799K8778K7134K4465K0818
63028A287905J6631J2152P222J592m656j1059j7051k2294k6803l0715l3983l6409
63016A142532l7823l8029l6635l3451k9124k4834k1047j7042j2150o928k425J379
63004H84423N444J0018J4101J6875J8880K1173K3906K6333K7897K8672K8921K8765
62992A135408K8368K8012K7800K7528K6879K5676K3883K1509J8595J5203J1378
62981A390239P054K009m067j1232j9029k6581l3042l8051m1847m4999m7808m9796
62969A082850m9985m8006m4771m1799l9837l8346l6235l2810k8246k3574k0170
$$ plain form
63050 664702 689777 716730 745182 774952 805854 837129 867626 896769 925030 953191 981435
63039 981435 1009501 1037518 1066171 1095931 1126450 1156911 1186710 1215488 1242622 1267087 1287905
63028 1287905 1304536 1316688 1323910 1325502 1320846 1309787 1292736 1270442 1243639 1212924 1178941 1142532
63016 1142532 1104709 1066680 1030045 996594 967470 942636 921589 904547 892397 885469 883044 884423
63004 884423 889867 899885 913986 930861 949741 970914 994820 1021153 1049050 1077722 1106643 1135408
62992 1135408 1163776 1191788 1219588 1247116 1273995 1299671 1323554 1345063 1363658 1378861 1390239
62981 1390239 1397293 1399302 1395235 1384003 1364974 1338393 1305351 1267300 1225453 1180454 1132646 1082850
62969 1082850 1032865 984859 940088 898289 858452 820106 783871 751061 722815 699241 679071
62958F79071j8649j8236j7530j6009j4330j3249j2823j2724j2646j2299j1577
62947E18999j0996j1280j2202j2539j1601j0145r231q871q449p879p444o936n925
62934C95501m648l784l387k950k478k610l463m161l871k760j600q63n68o05q41
62919C56912j079j154r90n79n8K28P0l10n99q55j246j466j063k62K49L93Q64J891
62901C50946K639K320J334Q03J284K395L397L767L486L141L437M245M583L904
62887C91681K891K385K027Q48j065k482k744k623l100m006m413l916k977k266
62873C70240k067k302k712l042l247l423l480l110k310j649j685k184k393j988
62859C34648j384j042q42m40J36N32N78M30K51L0k58n64q30r95r19n11j2J05l02
$$ plain form
62958 679071 660422 642186 624656 608647 594317 581068 568245 555521 542875 530576 518999
62947 518999 508003 496723 484521 471982 460381 450236 441005 432134 423685 415806 408362 401426 395501
62934 395501 390853 387069 383682 380732 378254 375644 372181 368020 364149 361389 359789 358926 358358 357753 356912
62919 356912 355833 354679 353689 353110 353052 353280 353350 353040 352441 351586 350340 348874 347811 347549 347798 348191 349055 350946
62901 350946 353585 355905 357239 358042 359326 361721 365118 368885 372371 375512 378949 383194 387777 391681
62887 391681 394572 396957 398984 399832 398767 396285 393541 390918 387818 383812 379399 375483 372506 370240
62873 370240 368173 365871 363159 360117 356870 353447 349967 346857 344547 342898 341213 339029 336636 334648
62859 334648 333264 332222 331380 330940 331076 331608 332186 332616 332867 332897 332639 332075 331245 330250 329331 328820 328808 328913 328611
62840C28611q20r56p28n15m71m37l85n37q67q63j51Q38J305J127J029J478J896
62823C29554J451L71j98K96J093J242Q42O12O88O15M10P27J773K803L127K971
62807C48377K899K901K647K282K223K446K618K885L736N071O039O085N633N467
62793D01309N854O592P534Q743J0262J2032J3934J5707J7094J8212J9699K2177
62781E59149K5649K9508L3113L6267L9180M2066M4773M6829M7919M8118M7546
62770A000117M5942M2831L8009L1632K3956J5405O746j324q839j6303k3700l0260
62758A124212l5371l9132m1789m3183m3239m2529m1817m1254m0440l9043l6955
62747F79460l4179l1003k8126k6065k4511k2708k0386j7926j5708j3783j2166
$$ plain form
62840 328611 327791 326835 326107 325592 325121 324684 324299 323762 322895 322032 321881 322719 324024 325151 326180 327658 329554
62823 329554 331005 331376 331178 331474 332567 333809 334651 335263 335951 336566 336976 337703 339476 342279 345406 348377
62807 348377 351276 354177 356824 359106 361329 363775 366393 369278 373014 378085 384124 390209 395842 401309
62793 401309 407163 413755 421289 430032 440294 452326 466260 481967 499061 517273 536972 559149
62781 559149 584798 614306 647419 683686 722866 764932 809705 856534 904453 952571 1000117
62770 1000117 1046059 1088890 1126899 1158531 1182487 1197892 1204638 1203314 1194475 1178172 1154472 1124212
62758 1124212 1088841 1049709 1007920 964737 921498 878969 837152 795898 755458 716415 679460
62747 679460 645281 614278 586152 560087 535576 512868 492482 474556 458848 445065 432899
62736D32899j0941j0023r121q063o855n454l809k198j141q46r49q42k11P44J476
62721C74666J528J080R36J702L130M468N382O129P005Q103R541J1448J3551J5293
62707D63962J6544J7824J9660K2045K4730K7669L0948L4499L8120M1623M4849
62696G82473M7754N0527N3301N5721N7114N7249N6490N4964N2088M7216M0464
62685A355361L2415K3329J3122J980r476k0586l0855l9776m6873n2000n5429n7554
62673A113658n8565n8384n6837n4052n0700m7603m4874m1841l8118l4355l1484
62662E96845k9466k7391k4715k1705j8797j6113j3725j1808j0266q797p520p009
62650C99533p422q070q244p921p283o092m268k612k106k626l033k662j970j615
$$ plain form
62736 432899 421958 411935 402814 394751 387896 382442 378633 376435 375294 374448 373499 372657 372446 373190 374666
62721 374666 376194 377274 378210 379912 383042 387510 392892 399021 406026 414129 423670 435118 448669 463962
62707 463962 480506 498330 517990 540035 564765 592434 623382 657881 696001 737624 782473
62696 782473 830227 880754 934055 989776 1046890 1104139 1160629 1215593 1267681 1314897 1355361
62685 1355361 1387776 1411105 1424227 1426207 1416731 1396145 1365290 1325514 1278641 1226641 1171212 1113658
62673 1113658 1055093 996709 939872 885820 835120 787517 742643 700802 662684 628329 596845
62662 596845 567379 539988 515273 493568 474771 458658 444933 433125 422859 414062 406542 399533
62650 399533 392111 384041 375797 367876 360593 354501 350233 347621 345515 342889 339856 337194 335224 333609
62636C33609j555j365r46n18k24m6M6N7m0m01j049j545j299m26K03M7l78k47M61
62617C24384J088J265J215J225J385J786K480L186L452L233K989L119L611M279
62603C58697N017N756O482P326Q392R555J0697J2047J3942J6254J8496K0398K1885
62590E14944K2662K2498K1879K1572K1351K0031J7112J3497J0089O498J973l131
62578F90975p743j1472j4625j7221j8961k0013k0846k1320k0897j9793j8888j8388
62566D80808j7536j5970j4406j3486j2786j1554r873q354p222o294n553n081m657
62553C48036l981l193k715k716l029l468l764l439k219n11Q63J451J410J119Q48
62538C24692P34P48P04N78O79J269K074K545K526K371K413K673L102L744M591
$$ plain form
62636 333609 332054 330689 329743 329225 329001 328955 329001 329058 329018 328617 327568 326023 324724 324298 324501 324548 324170 323923 324384
62617 324384 325472 326737 327952 329177 330562 332348 334828 338014 341466 344699 347688 350807 354418 358697
62603 358697 363714 369470 375952 383278 391670 401225 411922 423969 437911 454165 472661 493059 514944
62590 514944 537606 560104 581983 603555 624906 644937 662049 675546 685635 692133 694106 690975
62578 690975 683232 671760 657135 639914 620953 600940 580094 558774 537877 518084 499196 480808
62566 480808 463272 447302 432896 419410 406624 395070 385197 376843 369621 363327 357774 352693 348036
62553 348036 344055 340862 338147 335431 332402 328934 325170 321731 319512 319001 319864 321315 322725 323844 324692
62538 324692 325426 326174 326878 327456 328135 329404 331478 334023 336549 338920 341333 344006 347108 350852 355443
62523C55443N526O563P911R691J1755J3921J6200J8664K1224K3691K6011K8284
62511E44884L0489L2343L3521L3957L3764L2874L1037K8261K4951K1327J6998
62500H64406J1606N711M04m006q276j2947j7368k0424k1742k1687k0567j8398
62488G36712j5285j1557p621l975j125J038L434O869J0972J4598J7183J9115K0893
62475G91251K2471K3434K3209K1037J6536J0583M936N23l493q460j4412j9982
62463H67633k3974k6506k8579l0847l2977l4121l3948l3021l2032l0850k8770
62452E32008k5674k2439j9907j7923j5753j3139j0496q223o343m767l519k524
62440C81301j479j39J339K388K514J848J230J463K348K718J708k06j739k256k353
$$ plain form
62523 355443 360969 367532 375443 385134 396889 410810 427010 445674 466898 490589 516600 544884
62511 544884 575373 607716 641237 675194 708958 741832 772869 801130 826081 847408 864406
62500 864406 876012 881723 882127 878121 869845 856898 839530 819106 797364 775677 755110 736712
62488 736712 721427 709870 702249 698274 697149 698187 701621 708490 719462 734060 751243 770358 791251
62475 791251 813722 837156 860365 881402 897938 908521 913457 913980 910487 902027 887615 867633
62463 867633 843659 817153 788574 757727 724750 690629 656681 623660 591628 560778 532008
62452 532008 506334 483895 463988 446065 430312 417173 406677 398454 392111 387344 383825 381301
62440 381301 379822 379683 381022 383410 385924 387772 389002 390465 392813 395531 397239 397033 395294 393038 390685
62425C90685k927m063n104n553n557n578n809o113o242o003n212l828k220j063
62411C25413p28q78r13p38p74j193j546j321o20m2K8k46l97j03N54J136J241R68
62393C19841Q84J401K262K826K781K368J979J802J865K180K736L425M122M771
62379C55243N330N735O019O388P068Q067R130R952J0405J0621J0876J1492J2657
62366D68983J4305J6102J7755J9352K1355K4147K7673L1560L5530L9584M3837
62355G60183M8268N2547N6076N8250N8740N7446N4201M8737M1107L1957K2178
62344A289690J2439L192n134j2278j8426k3976k9123l3864l8206m1966m4502m5225
62332A012621m4356m2721m0754l8221l4993l1484k8080k4700k1288j8266j6138
$$ plain form
62425 390685 387758 383695 378591 373038 367481 361903 356094 349981 343739 337736 332524 328696 326476 325413
62411 325413 324685 323807 322894 322156 321382 320189 318643 317322 316702 316660 316688 316442 316045 315942 316496 317632 318873 319841
62393 319841 320725 322126 324388 327214 329995 332363 334342 336144 338009 340189 342925 346350 350472 355243
62379 355243 360573 366308 372327 378715 385783 393850 402980 412932 423337 433958 444834 456326 468983
62366 468983 483288 499390 517145 536497 557852 581999 609672 641232 676762 716346 760183
62355 760183 808451 860998 917074 975324 1034064 1091510 1145711 1194448 1235555 1267512 1289690
62344 1289690 1302129 1305321 1300187 1287909 1269483 1245507 1216384 1182520 1144314 1102348 1057846 1012621
62332 1012621 968265 925544 884790 846569 811576 780092 752012 727312 706024 687758 671620
62321F71620j4971j4613j4956j5684j6120j5892j5389j5172j5163j4926j4374
62310E04360j3710j2920j1910j0928j0231r543q457p226o416n871m843l270k028
62297C97007j620j388n15P54J516J400Q46M36M60J008J975L006L731M079M253
62282D16948M415M607M790M810M478L859L398L553M384N569O687P406P629P637
62268D90170P929Q742R908J1295J3060J5361J8093K1202K4925K9314L3854L7980
62256G21833M1828M5972N0516N4873N8381O0560O0844N8625N3842M7031L8646
62245A292951K8826J8054P523j764r890j7559k4985l1776l7761m3241m8274n2300
62233A079804n4769n5671n5202n3285m9901m5693m1624l8055l4508l0498k6255
$$ plain form
62321 671620 656649 642036 627080 611396 595276 579384 563995 548823 533660 518734 504360
62310 504360 490650 477730 465820 454892 444661 435118 426661 419435 413019 407148 402305 399035 397007
62297 397007 395387 393999 393484 394238 395754 397154 398000 398436 398896 399904 401879 404885 408616 412695 416948
62282 416948 421363 425970 430760 435570 440048 443907 447305 450858 455242 460811 467498 474904 482533 490170
62268 490170 498099 506841 516749 528044 541104 556465 574558 595760 620685 649999 683853 721833
62256 721833 763661 809633 860149 915022 973403 1033963 1094807 1153432 1207274 1254305 1292951
62245 1292951 1321777 1339831 1347354 1345590 1335700 1318141 1293156 1261380 1223619 1180378 1132104 1079804
62233 1079804 1025035 969364 914162 860877 810976 765283 723659 685604 651096 620598 594343
62222E94343k2450j9441j6999j4685j2361j0326q969q236p530o362n012m220m155
62209D53597m090l317j997p78J55J119K187K973L274L520M329N736P072P611P399
62194D88790P410Q572J0576J2024J2062J1393J1139J1246J0868J0006R547R665
62182F13298R399Q317P333P165O984N701L757K449K021J802J963L583O841J0465
62168F91078J3502J6512K0449K5257L0220L4920L9131M2241M3560M2918M0543
62157A040331L6678L1702K6130K0011J2808M458l954j1190j7155k2440k7033l0422
62145A059924l2783l4988l7288l8841l8841l7404l5058l2053k8485k4684k0993
62134F98506j7598j4704j2555j1000r531p980o719n930n171m045k739j513j48
$$ plain form
62222 594343 571893 552452 535453 520768 508407 498081 489112 480876 473346 466984 461972 457752 453597
62209 453597 449507 446190 444193 443415 443570 444689 446876 449849 453123 456643 460972 466708 473780 481391 488790
62194 488790 496200 504772 515348 527372 539434 550827 561966 573212 584080 594086 603633 613298
62182 613298 622697 631014 638347 645512 652496 658197 661954 664403 666424 668226 670189 673772 680613 691078
62168 691078 704580 721092 741541 766798 797018 831938 871069 913310 956870 999788 1040331
62157 1040331 1077009 1108711 1134841 1154852 1167660 1172118 1168164 1156974 1139819 1117379 1090346 1059924
62145 1059924 1027141 992153 954865 916024 877183 839779 804721 772668 744183 719499 698506
62134 698506 680908 666204 653649 642649 633118 625138 618419 612489 607318 603273 600534 599021 598873
62121E98873J592L377M854O369Q368J0264J0780R483P231M943K672K61j716k364
62107F64987j622n09j55r23k447m290o356q607j0583j1478j0841r078p052n249
62093E85797l589j858q2J545K847L798M667N852P329Q431Q639Q503R166J0933
62079F51978J2921J4340J5476J7049J9096K0987K2267K2999K3471K4009K4860
62068H69453K5907K6655K6864K7012K7737K9095L0725L2435L3982L4508L2978
62057A197351K9262K4224J8609J2490N981k39n594j0334j5074j9864k4238k8018
62045A184556l1549l5091l8374m0869m2293m2701m2271m1100l9294l7141l5042
62034G58831l3131l1126k8720k6059k3444k0719j7476j4049j1602j0809j0846
$$ plain form
62121 598873 600465 603842 608696 615065 623433 633697 644477 653960 661191 666134 668806 669067 667351 664987
62107 664987 663365 662856 662701 661778 659331 655041 648685 640078 629495 618017 607176 598098 591046 585797
62093 585797 582208 580350 580268 581813 584660 588458 593125 598977 606306 614737 623376 631879 641045 651978
62079 651978 664899 679239 694715 711764 730860 751847 774114 797113 820584 844593 869453
62068 869453 895360 922015 948879 975891 1003628 1032723 1063448 1095883 1129865 1164373 1197351
62057 1197351 1226613 1250837 1269446 1281936 1287917 1287678 1282084 1271750 1256676 1236812 1212574 1184556
62045 1184556 1153007 1117916 1079542 1038673 996380 953679 911408 870308 831014 793873 758831
62034 758831 725700 694574 665854 639795 616351 595632 578156 564107 552505 541696 530850
62023E30850j0355r133q196q226q697q764q390q118q122q059p717p323p065o740
62009D15945o022m920l776k857k129j378m26P45J998L134M008M602M929M942M556
61994D23351L809K858J818P23l15j101j634k241l260m681o198p509q348q433p718
61979C81121o653n775n080m201l193k596k545k382j560m56J91K85K57K34j4m07
61963C47226n85n48o36p00q0J269K289K065J095O70J286K300L005L408L782M166
61947C70012M551N155O103P152Q066R091J0687J2827J4933J6523J7640J8549J9296
61934E20585J9758J9931J9943J9775J9228J8151J6669J5092J3611J2077J0043
61923G04863P220L975J175o99k165m095o546q599r474r285q451o839m148p80K387
$$ plain form
62023 530850 520495 511362 503166 494940 486243 477479 469089 460971 452849 444790 437073 429750 422685 415945
62009 415945 409923 405003 401227 398370 396241 394863 394437 395182 397180 400314 404322 408924 413853 418795 423351
61994 423351 427160 430018 431836 432559 432244 431143 429509 427268 424008 419327 413129 405620 397272 388839 381121
61979 381121 374468 368693 363613 359412 356219 353623 351078 348696 347136 346680 346871 347156 347413 347647 347633 347226
61963 347226 346641 346093 345457 344757 344677 345946 348235 350300 351395 352065 353351 355651 358656 362064 365846 370012
61947 370012 374563 379718 385821 392973 401039 410130 420817 433644 448577 465100 482740 501289 520585
61934 520585 540343 560274 580217 599992 619220 637371 654040 669132 682743 694820 704863
61923 704863 712083 716058 717233 716534 714369 710274 703728 695129 685655 676370 667919 661080 656932 656152 658539
61908F58539N096P905J1049J3764J5146J5253J4799J4006J2361R472N703J728
61896G84821k140n901r368j2109j3978j5502j7376j9505k0830k0416j8648j6924
61884F12124j6108j5664j4572j2712j0921r918r689r872j0228j0590j0732j0511
61872D70607r977r232q329p350o321n062l378j452K85J743L197M650N658O173
61858D41212P016Q953J1600J3917J5708J7800K0672K3608K5729K7276K9219L1786
61846F74496L4040L4956L4496L3333L1860K9803K6734K2689J8069J3153P924K414
61834I63967k964p606j1096j3196j3644j2239r223n330j334K373N738Q809J1601
61821I15856J3942J5315J5061J2929R318M869n3n360j0927j6547k2050k7201l1545
$$ plain form
61908 658539 663635 671540 682589 696353 711499 726752 741551 755557 767918 777390 783093 784821
61896 784821 782681 776780 767412 755303 741325 725823 708447 688942 668112 647696 629048 612124
61884 612124 596016 580352 565780 553068 542147 532229 522540 512668 502440 491850 481118 470607
61872 470607 460630 451398 443069 435719 429398 424336 420958 419506 419791 421534 424731 429381 435039 441212
61858 441212 448228 457181 468781 482698 498406 516206 536878 560486 586215 613491 642710 674496
61846 674496 708536 743492 777988 811321 843181 872984 899718 922407 940476 953629 961553 963967
61834 963967 961003 953397 942301 929105 915461 903222 893999 888669 887335 889708 895446 904255 915856
61821 915856 929798 945113 960174 973103 982421 987290 987237 981877 970950 954403 932353 905152 873607
61808H73607l4551l5975l5939l4851l3274l1727l0219k8159k5141k1694j8911
61797E43166j7189j5845j4089j2008j0262r128q299p466o734o317o152n960n581
61784D18136n058m403l515k432j604j603k365k987k624j470n31m02p15q23n97
61769C87007k36J92O63Q99P49O38J149K119K734K564K048J746J686J727K052K769
61753D10506L340L081K223J751K105K574K255J110k74j490k408k820k674k501
61739D16778k860l419l267k238j167o75m71k28k62o93p17L22J708K285K171K382
61723D09649K945K822J839J221J657K205J915J370J557K124K067J492J280J422
61709D35565J032k2r07j292j822k739l309l130k980l591m429m577m135l877l870
$$ plain form
61808 873607 839056 803081 767142 732291 699017 667290 637071 608912 583771 562077 543166
61797 543166 525977 510132 496043 484035 473773 464645 456346 448880 442146 435829 429677 423717 418136
61784 418136 413078 408675 405160 402728 401124 399521 397156 394169 391545 390075 389544 389142 388427 387604 387007
61769 387007 386771 386963 387626 388525 389274 389912 391061 393180 395914 398478 400526 402272 403958 405685 407737 410506
61753 410506 413846 416927 419150 420901 423006 425580 427835 428945 428671 427181 424773 421953 419279 416778
61739 416778 413918 410499 407232 404994 403827 403152 402681 402453 402191 401498 400781 401103 402811 405096 407267 409649
61723 409649 412594 415416 417255 418476 420133 422338 424253 425623 427180 429304 431371 432863 434143 435565
61709 435565 436597 436575 435668 434376 432554 429815 426506 423376 420396 416805 412376 407799 403664 399787 395917
61694C95917l461k451j511j248j546j950k306k715l152l338l012k328j867j994
61680C63038k240j717l49Q13Q66J59l79o07j064j690j676p58J68J89m12p12m99
61663C53130m29r28j590j811j551j225j055q26k66N44J204J421J301J234J473
61648C50626J907K256K377K294K046J645J293J434K396L888M989M830L409J717
61634C87107Q48R75J204N69r93k729l982m695m961m643l753k938k875l251k946
61619C52937j536k0M11j52o60o75p68j448k380l034l435l828m048l778l303l372
61603C20911m312n613o540o827o664o221n479m476l470k742k278j848j378j067
61589B61996r93q23k34M54N00l40j451k061k014j682j398j290j387j617j798j853
$$ plain form
61694 395917 392456 390005 388494 387246 385700 383750 381444 378729 375577 372239 369227 366899 365032 363038
61680 363038 360798 359081 358732 359545 360411 360570 360191 359584 358520 356830 355154 354396 354564 354753 354341 353629 353130
61663 353130 352701 351773 350183 348372 346821 345596 344541 343715 343449 343993 345197 346618 347919 349153 350626
61648 350626 352533 354789 357166 359460 361506 363151 364444 365878 368274 372162 377151 381981 385390 387107
61634 387107 387955 388930 390134 390703 389710 386981 382999 378304 373343 368700 364947 362009 359134 355883 352937
61619 352937 351401 351381 351792 351640 350980 350305 349537 348089 345709 342675 339240 335412 331364 327586 324283 320911
61603 320911 316599 310986 304446 297619 290955 284734 279255 274779 271309 268567 266289 264441 263063 261996
61589 261996 261003 260180 259946 260400 260900 260560 259109 257048 255034 253352 251954 250664 249277 247660 245862 244009
61573B44009j926k046j959j497r16n01r3N65J157J068L36k64k57q8l47q66j019
61556B35356o67k96k19j01N44J672K682K997K507J550N77q7l13j10M14J043J505
61539B49054J594J325R52Q03J031J508J958K244K411K436K036R37o11j833k094
61524B63751j556r96r33j170j273j236j384j734j844j426p44k34k9n9l33p73j034
61507B46993r25p92r62r50j2J504K161J221k51o70J28R19Q07J83r6J62M28K24
61489B50072l79r12j038q23n10j75J92L47J5n06m59L31J059J009O00P41J497K082
61471B53143J979J434Q38L32L8K6J6k80m30K98J619K148J095n63j274o98K42P61
61453B60724Q84R06Q63P41O82P42P15L72j72m54l1J106K420L224L250K810K394
$$ plain form
61573 244009 242083 240037 238078 236581 235665 235164 235071 235636 236793 237861 238197 237933 237676 237588 237241 236375 235356
61556 235356 234689 234393 234174 234073 234617 236289 238971 241968 244475 246025 246602 246515 246202 246092 246506 247549 249054
61539 249054 250648 251973 252925 253728 254759 256267 258225 260469 262880 265316 267352 268289 267678 265845 263751
61524 263751 262195 261199 260266 259096 257823 256587 255203 253469 251625 250199 249455 249221 249192 249133 248800 248027 246993
61507 246993 246068 245276 244314 243364 243352 244856 247017 248238 247987 247317 247445 248364 249171 249354 249258 249420 249848 250072
61489 250072 249693 248781 247743 246920 246410 246235 246427 246774 246789 246283 245824 246155 247214 248223 248823 249564 251061 253143
61471 253143 255122 256556 257394 257726 257764 257790 257806 257526 257096 257394 259013 261161 262256 261693 260419 259721 259963 260724
61453 260724 261608 262514 263377 264118 264800 265542 266257 266629 266457 266003 265972 267078 269498 272722 275972 278782 281176
61436B81176K265K390K540K386J785J074Q85J446K238K521K112J444J036R79R91
61421C07268Q44P73J273K409L432L498K661J835J690J999K130J761R60m4r08j379
61405C30202j584j826k006j695r60n16p85j335j652j884k265k367j713p64m43
61390C08407p97r42l28N84J058Q50J38p18j178q20J13P99P62L81L15P05J159J329
61372C11817J280J327J635J980K001J699J463J449J290P50L00N57J291J653J372
61357C31864J090J447K284L001L276L290L548M518O091P457P906P762P921Q451
61343C99906Q350O977N076L894L769M053M077L637K825J899J250J140J375J527
61329D49755J337Q03Nr61j964k909l683m035l753l054k463k164j791j081l43n
$$ plain form
61436 281176 283441 285831 288371 290757 292542 293616 294501 295947 298185 300706 302818 304262 305298 306277 307268
61421 307268 308112 308885 310158 312567 315999 319497 322158 323993 325683 327682 329812 331573 332533 332489 331581 330202
61405 330202 328618 326792 324786 323091 322131 321615 320830 319495 317843 315959 313694 311327 309614 308850 308407
61390 308407 307610 306668 306340 306924 307982 308832 308970 308252 307074 306254 306367 307166 307928 308309 308624 309329 310488 311817
61372 311817 313097 314424 316059 318039 320040 321739 323202 324651 325941 326691 326991 327548 328839 330492 331864
61357 331864 332954 334401 336685 339686 342962 346252 349800 354318 360409 367866 375772 383534 391455 399906
61343 399906 408256 415233 420309 424203 427972 432025 436102 439739 442564 444463 445713 446853 448228 449755
61329 449755 451092 451895 451900 450939 448975 446066 442383 438348 434595 431541 429078 426914 425123 424042 423699 423694
61313D23694P3M96J676L432N108O004N994N783O229P373Q527R388J0364J1523
61299E05664J1977J0824Q217M924J443j836m179n165n412n784o110n717n026n331
61285D98489o782p792p090n462m621m947n250m533l131k021j568j253l53J296
61271D44982L164M459M699L982K862K025J885K339K982L642M429N237N637N619
61257D97943N972P287Q886R473Q736P525O468N323L943K944K790K910K360J027
61243E73587m37j511k117k345k418k749l475m064l890l092k355j992j782j639
61229E39721j736j911j570n13O61J376J881K823M118M853M311K820J385O73N75
61214E59467O35O42P01Q50Q84O72M65O53J187J418P61n83j693j779p93P78K475
$$ plain form
61313 423694 423767 424263 425939 429371 434479 440483 446477 452260 458489 465862 474389 483777 494141 505664
61299 505664 517641 528465 536682 541606 543049 541213 537034 531869 526457 520673 514563 508846 503820 498489
61285 498489 491707 483915 476825 471363 466742 461795 456545 452012 448881 446860 445292 444039 443686 444982
61271 444982 448146 452605 457304 461286 464148 466173 468058 470397 473379 477021 481450 486687 492324 497943
61257 497943 503915 511202 520088 529561 538297 545822 552290 557613 561556 564500 567290 570200 572560 573587
61243 573587 573150 571639 569522 567177 564759 562010 558535 554471 550581 547489 545134 543142 541360 539721
61229 539721 537985 536074 534504 533991 534652 536028 537909 540732 544850 549703 554014 556834 558219 558892 559467
61214 559467 560102 560744 561445 562295 563179 563851 564316 564969 566156 567574 568335 567752 566059 564280 563487 564265 566740
61197E66740L980M932N163N227O151Q351J1017J2916J3552J3243J2342J0899Q941
61184F83454O606M078J745K68r5j04p94k109k980k877k507k626k936k726k038
61169F74359j589j850k807m286n949p198p638p561p557p832q202q590q992r193
61155E85115q947q357p705p029o215n283m216k812j074M63J269J327P42o95k900
61140E33683m928n917o246o810p411p024n647m542m294l934k547p22N29J342K477
61125D78009L750M238L922M036N539P888R748J0565J1010J2013J3649J5184J6124
61112E95675J6818J7780J8766J9090J8691J8264J8191J8033J7339J6321J5387
61101G90355J4462J3224J1546R452O893L913P05k673o184r309j1290j2193j2973
$$ plain form
61197 566740 570720 575652 580815 586042 592193 600544 611561 624477 638029 651272 663614 674513 683454
61184 683454 690060 694138 695883 696151 696056 695952 695158 693049 690069 687192 684685 682059 679123 676397 674359
61169 674359 672770 670920 668113 663827 657878 650680 643042 635481 627924 620092 611890 603300 594308 585115
61155 585115 576168 567811 560106 553077 546862 541579 537363 534551 533477 533940 535209 536536 537278 536583 533683
61140 533683 528755 522838 516592 509782 502371 495347 489700 485158 480864 476930 474383 473661 474190 475532 478009
61125 478009 481759 485997 489919 493955 499494 507382 517130 527695 538705 550718 564367 579551 595675
61112 595675 612493 630273 649039 668129 686820 705084 723275 741308 758647 774968 790355
61101 790355 804817 818041 829587 839039 845932 849845 850550 847877 841693 832384 821094 808901 795928
61088G95928j4128j5032j5164j5155j5743j6399j6070j4857j3833j3423j3067
61077F33057j2396j1718j1176j0443r414q404p424o097m516l400l031k711j736
61064E40591l12Q43J355J293R67J002K116M254O274P002O472N778N913P032Q669
61049E99249J0232J1370J2141J2936J4137J5793J7565J8923J9593K0004K1083
61038G73026K3287K6001K8212K9691L1027L2717L4799L7313M0392M3763M6715
61027A146943M8808N0195N1150N1885N2838N4596N7310O0804O5333P1585P9765
61016A791212Q9315R9744J11055J23283J36795J53521J77030K10874K57604L19482
61006C469915L98555M95207O08213P37597Q86249J057865J255888J486200J754273
$$ plain form
61088 795928 781800 766768 751604 736449 720706 704307 688237 673380 659547 646124 633057
61077 633057 620661 608943 597767 587324 577910 569506 562082 555985 551469 548069 545038 542327 540591
61064 540591 540279 541122 542477 543770 544737 545739 547855 552109 558383 565385 571857 577635 583548 590580 599249
61049 599249 609481 620851 632992 645928 660065 675858 693423 712346 731939 751943 773026
61038 773026 796313 822314 850526 880217 911244 943961 978760 1016073 1056465 1100228 1146943
61027 1146943 1195751 1245946 1297096 1348981 1401819 1456415 1513725 1574529 1639862 1711447 1791212
61016 1791212 1880527 1980271 2091326 2214609 2351404 2504925 2681955 2892829 3150433 3469915
61006 3469915 3868470 4363677 4971890 5709487 6595736 7653601 8909489 10395689 12149962
60997A2149962K046379K305710K433781K333402J969170J399448P56045J89840
60989B5583737j81487l03966j98905L9488K66295L32992J46030k92959q89027
60980B4502198j496778j980398k260857k330545k234686k036802j791218j534306
60972H836608j288693j068137q78711p20071n89012m82245l96455l27922k73506
60963B811856k31182j98838j73477j52535j35232j21498j10108r9054q7544p6497
60953A425891o6939n8742n1186m4184l8464l4792l3203l2884l2744l2056l0589
60942I70108k8261k5145k1822j9222j7710j6728j5686j4869j4889j5533j5796
60931G64447j5114j3988j3292j3221j3189j2554j1328j0137r460r055q331p228
$$ plain form
60997 12149962 14196341 16502051 18935832 21269234 23238404 24637852 25393897 25583737
60989 25583737 25402250 25098284 24899379 24938867 25205162 25538154 25684184 25391225 24502198
60980 24502198 23005420 21025022 18764165 16433620 14198934 12162132 10370914 8836608
60972 8836608 7547915 6479778 5601067 4880996 4291984 3809739 3413284 3085362 2811856
60963 2811856 2580674 2381836 2208359 2055824 1920592 1799094 1688986 1589932 1502388 1425891
60953 1425891 1358952 1300210 1249024 1204840 1166376 1131584 1098381 1065497 1032753 1000697 970108
60942 970108 941847 916702 894880 875658 857948 841220 825534 810665 795776 780243 764447
60931 764447 749333 735345 722053 708832 695643 683089 671761 661624 652164 643109 634778 627550
60919F27550o312n905n666n222m680m137l170j417O93K419L638M739N838O784
60905F15152P771R135J0573J1357J1491J1830J2812J3847J4355J4678J5351J5987
60893G64339J5720J4554J3493J3198J3176J2537J1091R255P183M512J165k133
60881H78090m503n908p068q384r557j0407j1442j3070j4683j5297j4936j4564
60869G48271j4636j4537j3797j3035j3083j3658j3636j2489j0830r547q882q519
60857F01622q210q063q347r050r719r772r129q343p933p775p455p065p189p972
60843D85600q696q589p732o780o070n510n222n617o632p439p422o996o904p001
60829C88990o481n171l850l041k392j594j101j287j550j103k90j49q32j353r49
$$ plain form
60919 627550 621238 615333 609667 604445 599765 595628 592458 591041 591734 594153 597791 602530 608368 615152
60905 615152 622923 632058 642631 653988 665479 677309 690121 703968 718323 733001 748352 764339
60893 764339 780059 794613 808106 821304 834480 847017 858108 867363 874546 879058 880223 878090
60881 878090 873587 867679 860611 852227 842670 832263 820821 807751 793068 777771 762835 748271
60869 748271 733635 719098 705301 692266 679183 665525 651889 639400 628570 619023 610141 601622
60857 601622 593412 585349 577002 567952 558233 548461 539332 530989 523056 515281 507826 500761 493572 485600
60843 485600 476904 468315 460583 453803 447733 442223 437001 431384 424752 417313 409891 402895 395991 388990
60829 388990 382509 377338 373488 370447 368055 366461 365360 364073 362523 361420 361130 360981 360149 358796 357847
60814C57847J11J145J755J724J012J45p0M17Q11O73N28Q43J184J038P78J022J495
60797C72458J426Q26M39M96M13k16j038j549j689j640j508j431j531j686j690
60782C62080j746k320l364m209m417m205l859l251k412j986k490l374l537k678
60768C18232j601j061r15o36k46k22o59j014q07k59O8mk00l39n22o80l75O20J831
60749C11211K535K589K485K635L006L440L951M535M932M750L806K272N80q90k065
60734C49772l088l917m247l967l480l215l124k934k716k705k741k574k518l154
60720C05392m231m677l957k783k100j918j635j058n21l04l90o19p91p74p62j115
60704B77757j700j826j144k27K44L16L42J86l87r31p74r0L53L96N87J016J074
$$ plain form
60814 357847 357958 359103 360858 362582 363594 363739 363669 364086 364897 365570 366098 366941 368125 369163 369941 370963 372458
60797 372458 373884 374710 375149 375645 376058 375842 374804 373255 371566 369926 368418 366987 365456 363770 362080
60782 362080 360334 358014 354650 350441 346024 341819 337960 334709 332297 330311 327821 324447 320910 318232
60768 318232 316631 315570 314655 314019 313773 313551 312892 311878 311071 310812 310880 310876 310676 310337 309815 309135 308760 309380 311211
60749 311211 313746 316335 318820 321455 324461 327901 331852 336387 341319 346069 349875 352147 352727 351837 349772
60734 349772 346684 342767 338520 334553 331073 327858 324734 321800 319084 316379 313638 311064 308546 305392
60720 305392 301161 296484 292527 289744 287644 285726 284091 283033 282512 282208 281818 281199 280408 279634 278872 277757
60704 277757 276057 274231 273087 272860 273104 273420 273762 273948 273561 272630 271856 271766 272119 272515 273102 274118 275192
60687B75192N77L10Q90J856K417K565K848L413L948M300M575M680M339L617L030
60672C18557K974L267L371K999K409K073K066J904J165J78k73M3M86M37O3r7L3
60655C41655N8k36o83j105j417j363n97P04J632J343M3j090j181o51o63j609k632
60638C32208k866k727l279m553n310m744l599l035k958k284o82Q19J133L92m00
60623B98115n68k56N4N9k53o68q14l87N21J388J704J434R18M46Q9l0K96R21J211
60604C04180Q21L69P66J932K715K303J101P4l30j89L71J159J682J558J005N44
60588C20061L26J28j02j75q2RJ34N10J109J670K183K962M059M990N287N128N209
60571C53406O060P604R344J0895J2343J3946J5612J6845J7336J7185J6391J4514
$$ plain form
60687 275192 275769 276079 276969 278825 281242 283807 286655 290068 294016 298316 302891 307571 311910 315527 318557
60672 318557 321531 324798 328169 331168 333577 335650 337716 339620 340785 340963 340690 340733 341219 341656 341719 341622 341655
60655 341655 341713 341477 340794 339689 338272 336909 336312 337016 338648 339991 340034 338944 337763 337112 336449 334840 332208
60638 332208 329342 326615 323336 318783 313473 308729 305130 302095 299137 296853 296171 296990 298123 298515 298115
60623 298115 297547 297291 297345 297404 297151 296483 295669 295282 295803 297191 298895 300329 301247 301693 301782 301752 302048 302969 304180
60604 304180 305001 305370 306136 308068 310783 313086 314187 314261 313931 313742 314113 315272 316954 318512 319517 320061
60588 320061 320387 320515 320413 320238 320156 320165 320299 320809 321918 323588 325771 328733 332792 337782 343069 348197 353406
60571 353406 359466 367070 376414 387309 399652 413598 429210 446055 463391 480576 496967 511481
60559E11481J1246P021K602j696n831r327j1363j1631j0569q791o729m725k786
60546D58902l45L067O809R580J1114J2626J5275J8879K2559K5931K8964L1202
60534F44563L1884L0686K7784K3446J7942J1630M744k581r700j5270j8311j9221
60522G27596j9159j8671j7504j5607j3561j1974j0919j0035q792o769m104j593
60510E88908J25J392L028N229P591J0068J3099J6719K0459K4358K9205L5371M2063
60497G97615M8326N4118N9743O4803O8487P0522P1025O9641O5688N9191N1015
60486A480174M1797L1405J9642O864o454k0245l4416m8171o0335p0165p7433q1812
60474A180851q2741q0150p4958o8546o1829n5079m8482m2490l7454l3139k8970
$$ plain form
60559 511481 522727 529748 532350 530654 524823 515496 504133 492502 481933 473142 466413 461688 458902
60546 458902 458557 461624 468433 478013 489127 501753 517028 535907 558466 584397 613361 644563
60534 644563 676447 707133 734917 758363 776305 787935 792679 790098 780398 765128 746817 727596
60522 727596 708437 689766 672262 656655 643094 631120 620201 610166 601374 594605 590501 588908
60510 588908 589033 590425 593453 598682 606273 616341 629440 646159 666618 690976 720181 755552 797615
60497 797615 845941 900059 959802 1024605 1093092 1163614 1234639 1304280 1369968 1429159 1480174
60486 1480174 1521971 1553376 1573018 1579882 1573428 1553183 1518767 1470596 1410261 1340096 1262663 1180851
60474 1180851 1098110 1017960 943002 874456 812627 757548 709066 666576 629122 595983 567013
60463E67013k4776k1039j8293j6417j4759j2898j0992r348p969o736n777n357
60451D12652n410n553n486n153m518l607k840k843l664m434m213k994j572o28
60437C59737k83l74p02j071j413j867k354k306j344j73j8j047k047j980j217p66
60421C40775r22j213j258j030n60j9J59j74m15Q1R74J310Q54L66M86R89J296J147
60403C42846N70k77j018j244r57n42j61L84J076J547J694J916K433K844K652J906
60387C55669R82J74k20J07J010J812K078K125K298K257J566O32L42Q85J600J891
60371C75208J733J255N76J00L09J026J439J150P53R79J688K108J901J484J410
60356C93119J801K380K816L003L138L604M574N777O712P188P446P630P370O091
$$ plain form
60463 567013 542237 521198 502905 486488 471729 458831 447839 438491 430522 423786 418009 412652
60451 412652 407242 401689 396203 391050 386532 382925 380085 377242 373578 369144 364931 361937 360365 359737
60437 359737 359454 359080 358378 357307 355894 354027 351673 349367 348023 347850 347832 346785 344738 342758 341541 340775
60421 340775 339853 338640 337382 336352 335792 335773 335932 335758 335343 335424 336398 337708 338562 338928 339414 340403 341699 342846
60403 342846 343416 343139 342121 340877 339920 339378 339217 339601 340677 342224 343918 345834 348267 351111 353763 355669
60387 355669 356651 356825 356605 356712 357722 359534 361612 363737 366035 368292 369858 370490 370832 371717 373317 375208
60371 375208 376941 378196 378772 378872 379181 380207 381646 382796 383549 384528 386216 388324 390225 391709 393119
60356 393119 394920 397300 400116 403119 406257 409861 414435 420212 426924 434112 441558 449188 456558 462649
60342D62649L828J375n49k062l681n305o192o013n389n009m753m144l362l081
60328D18312l401l572l011k026j347j237j404j482j382j232j105q10L3J442K749
60313D00527L239L237L987O216R216J1719J3395J5023J7447K0813K4703K8454
60301E57976L1206L2099L0667K6958K1227J3777N082m183j3360k1809k8676l2991
60289F17973l4325l3144l0263k6156k1089j5838j1651r212p933o648m942l457
60277D13315k850k898k872k464j923j466j028p00r09j819k820l073k509j931k043
60262C82010k680l059k619j467k18M62K75m99j172j167m49M67R78Q63M52L18P59
60245C73254J527K070K022J439O52Mk87k43j36k54n13m75J73J200K039K342K182
$$ plain form
60342 462649 466477 467852 467303 465241 461560 456255 450063 444050 438661 433652 428899 424755 421393 418312
60328 418312 414911 411339 408328 406302 404955 403718 402314 400832 399450 398218 397113 396303 396336 397778 400527
60313 400527 403766 407003 410990 417206 426422 438141 451536 466559 484006 504819 529522 557976
60301 557976 589182 621281 651948 678906 700133 713910 718992 714809 701449 679640 650964 617973
60289 617973 583648 550504 520241 494085 472996 457158 445507 436295 428362 421714 416772 413315
60277 413315 410465 407567 404695 402231 400308 398842 397814 397114 396205 394386 391566 388493 385984 384053 382010
60262 382010 379330 376271 373652 372185 371967 372429 372704 372205 371033 369866 369417 369884 370862 371725 372177 372495 373254
60245 373254 374781 376851 378873 380312 380964 380968 380681 380438 380302 380048 379535 379060 379233 380433 382472 384814 386996
60228C86996J835J497J230J003Q03O86O84O32K79k60m20J52J033J488J470J622
60212D00730K273K943L133L112L443M124M687M914M901M542L675K767K740L764
60198D51748M759M588L395K348K211K703L117L098K739K209J615R96L64l34j175
60183D84381k128k931l199k837k311k253k675k908k457j666j236j349j642j829
60169D52960j908j865j582j081n85k90l37q99j883k601k355j383p28q78j161p73
60153D32651J02P00Q39J072J809K811L532L573K900J908J222J170J556K192L304
60138D61341M951O390O742O302O322P350Q434Q390P185N561L826J747n42k250
60124E31749k797k509k238k398k548k002p50L79O98N41Q39J826K769L143L395
$$ plain form
60228 386996 388831 390328 391558 392561 393364 394050 394734 395366 395645 395385 394965 395117 396150 397638 399108 400730
60212 400730 403003 405946 409079 412191 415634 419758 424445 429359 434260 438802 442477 445244 447984 451748
60198 451748 456507 461095 464490 466838 469049 471752 474869 477967 480706 482915 484530 485526 485890 485556 484381
60183 484381 482253 479322 476123 473286 470975 468722 466047 463139 460682 459016 457780 456431 454789 452960
60169 452960 451052 449187 447605 446524 445939 445649 445312 444413 442530 439929 437574 436191 435463 434585 433424 432651
60153 432651 432753 433453 434292 435364 437173 439984 443516 447089 449989 451897 453119 454289 455845 458037 461341
60138 461341 466292 472682 479424 485726 492048 499398 507832 516222 523407 528968 532794 534541 533999 531749
60124 531749 528952 526443 524205 521807 519259 517257 516507 516886 517584 518125 518964 520790 523559 526702 530097
60109E30097M101M806M462K826Q60l22m50j28k59j389l186m567m746m089l544
60094E24472l400l126k411j654j286j184j015o59p6Q08J789K432K625K632K389
60079E22336J402l32j884k487k540k886l533l814l579l359l465l681l931m505
60065D83742n461o326o682o608o369o067n783n645n555n205m492l696l036k446
60051D10371j851j389j118q29l94k6O3M8L07R66J800K497K906L084L196L248K990
60034D25869K241J311P77P88Q67N13k04q16j045j123j578k656l878m375l932l378
60018D09381l534m021l843k969k471k926l617l720l383l074k612j668p02m97j034
60003C69310j558j603j265p08m1L48M5q05j651k130k098j340OJ046R62K28J06
$$ plain form
60109 530097 534198 539004 543466 546292 547152 546830 546380 546252 545993 544604 541418 536851 532105 528016 524472
60094 524472 521072 517946 515535 513881 512595 511411 510396 509737 509661 510469 512258 514690 517315 519947 522336
60079 522336 523738 523406 521522 519035 516495 513609 510076 506262 502683 499324 495859 492178 488247 483742
60065 483742 478281 471955 465273 458665 452296 446229 440446 434801 429246 424041 419549 415853 412817 410371
60051 410371 408520 407131 406013 405184 404790 404764 404827 404875 405182 406148 407948 410445 413351 416435 419631 422879 425869
60034 425869 428110 429421 430198 430986 431853 432366 432162 431346 430301 429178 427600 424944 421066 416691 412759 409381
60018 409381 405847 401826 397983 395014 392543 389617 386000 382280 378897 375823 373211 371543 370841 370344 369310
60003 369310 367752 366149 364884 364176 364135 364483 364528 363723 362072 359942 357844 356504 356510 357556 358518 358746 358852
59986C58852Q94J623J635J518K026K917L452L336K624J341j52r90p78k91m93j112
59970C76402j071j31P76R18O01M38M69M56N43J056J838K284K081J573J345J562
59954C91140J866J881J569J118N60j63q02q35q1R41J605J830J878J694R97K4m30
59937D04792RO77O45r4o55m07L02P07N69L28M62R59J478J796J940J921J631J086
59919D18146O29O44J079J523J846K433L569M781N225M697L812L134K590J940J326
59904D57374R27M41m98j554j992j690j242j018p81l40J04M99J090J678J538O99
59888D55235M59J796L784M701M328L936M159M247L643L010L006L095K473J536
59874D99408J366K111K765K487J410O5j356k907m386n279n236m552l955l778l490
$$ plain form
59986 358852 359746 361369 363004 364522 366548 369465 372917 376253 378877 380218 380066 379076 378298 378007 377514 376402
59970 376402 375331 375200 375976 376894 377495 377933 378402 378858 379401 380457 382295 384579 386660 388233 389578 391140
59954 391140 393006 394887 396456 397574 398134 397971 397169 396334 396253 397194 398799 400629 402507 404201 405198 405222 404792
59937 404792 404801 405478 406123 406029 405374 404967 405269 405976 406545 406873 407335 408294 409772 411568 413508 415429 417060 418146
59919 418146 418775 419419 420498 422021 423867 426300 429869 434650 439875 444572 448384 451518 454108 456048 457374
59904 457374 458301 458742 458244 456690 454698 453008 451766 450748 449967 449627 449731 450230 451320 452998 454536 455235
59888 455235 455694 457490 461274 465975 470303 474239 478398 482645 486288 489298 492304 495399 497872 499408
59874 499408 500774 502885 505650 508137 509547 509612 508256 505349 500963 495684 490448 485896 481941 478163 474673
59859D74673k491j157n21p98j022l86P81J924L321N441P711R048R360R581J0082
59844E25547J0000Q444N674K741M86p13o69N30K223L339L036J216j421l897n676
59829E50860o899p858q483q573q293q043p909p618o997o103n049m037l460l505
59815D58033l710l461k801k203j691r20j87l69j564k642k620j884j457j643k045
59800D28836k366k470k095j263p16j123k003k195j373l11K95N32O25M19j19m81
59784D14192j90N56J167J295R05Q0r23j641j877j960k263k590k397j548n22O8
59768D02352l2n83r87o96J70P51L43o34j072n67J07J46j67M1R93K081K777L162
59750D08185L448L572L480L427L588L692L404K935K811L139L483L458L069K448
$$ plain form
59859 474673 472182 471025 470504 469706 468684 468298 469079 471003 474324 479765 487476 496524 505884 515465 525547
59844 525547 535547 543991 549665 552406 552892 552179 551510 552040 554263 557602 560638 561854 560433 556536 550860
59829 550860 543961 536103 527620 519047 510754 502711 494802 487184 480187 474084 469035 464998 461538 458033
59815 458033 454323 450862 448061 445858 444167 443247 443060 442691 441127 438485 435865 433981 432524 430881 428836
59800 428836 426470 424000 421905 420642 419926 418803 416800 414605 413232 412921 413216 413748 414373 414792 414673 414192
59784 414192 414002 414558 415725 417020 417925 418005 417082 415441 413564 411604 409341 406751 404354 402806 402284 402352
59768 402352 402320 401737 400750 400054 400224 400975 401318 400684 399612 399045 399152 399298 399131 399172 400165 402246 405023 408185
59750 408185 411633 415205 418685 422112 425700 429392 432796 435731 438542 441681 445164 448622 451691 454139
59736D54139J654Q38K81M6j37m15n42k87J12J94j68o96j069j126q57m47k52m58
59718D50810q24r11n44J14P19P95p0j677l022l109j938l28J059K047K460K136
59702D47717J534J501K120K464J956J313J452K101K362K274K680L570L723K399
59688D79166N43m07k73j0j91m78n13n60r14j287j219q93r65j643k326k388k025
59671D63617j984k635l623m401m654m213l115j962j659k308k793k092o45L60P46
59656D28639J407K534L018K182J097J237K442L238K886K089J668J563J369J029
59642D56398O45P3p91j670k191k317k275k314k579k985l121k651j904j619j940
59627D28759k133j617p92m10n37o73p04j035j844k679l006k852k727l145m114
$$ plain form
59736 454139 455793 456631 456912 456958 456821 456406 455864 455577 455689 455883 455715 455019 453950 452824 451967 451520 451268 450810
59718 450810 449986 449075 448531 448645 449364 450159 450089 448412 445390 442281 440343 440015 441074 443121 445581 447717
59702 447717 449251 450752 452872 455336 457292 458605 460057 462158 464520 466794 469474 473044 476767 479166
59688 479166 479709 479302 479029 479019 478828 478350 477837 477277 476363 475076 473857 472964 471999 470356 468030 465642 463617
59671 463617 461633 458998 455375 450974 446320 442107 438992 437030 435371 433063 430270 428178 427533 427893 428639
59656 428639 430046 432580 435598 437780 438877 440114 442556 445794 448680 450769 452437 454000 455369 456398
59642 456398 457043 457116 456325 454655 452464 450147 447872 445558 442979 439994 436873 434222 432318 430699 428759
59627 428759 426626 425009 424217 423807 423270 422597 421893 420858 419014 416335 413329 410477 407750 404605 400491
59612D00491n025n044l915k226p92R6N82P64P14P93J287J851J879J443J203J273
59596C95374R56k7q11m84N88J331J425J408J488J188L29m51n18m7L77M72K09m95
59578D02312j548k412k596k309k159k324k425k221j962j950k094k063j664r79
59564C73606l47j55m77q75q57m78j36J41O71J368J588J091N53O58J158J327J085
59547C79921J011J464K313L441M896O456P692Q553R486J0869J2731J4980J7268
59534D81081J8481J7103J2585O045o87o313j0206j1968j1557r646p218m871k763
59521D70066j035J72R93J684K221K352K012J363M51p68k144l310m063m524m900
59506D60570n313n745o028n909n379m800m532m524m488m301l979l476k786k126
$$ plain form
59612 400491 395466 390422 386507 384281 383489 383585 384167 384931 385645 386438 387725 389576 391455 392898 394101 395374
59596 395374 396330 396303 395492 395008 395596 396927 398352 399760 401248 402436 402765 402314 401796 401749 402126 402598 402807 402312
59578 402312 400764 398352 395756 393447 391288 388964 386539 384318 382356 380406 378312 376249 374585 373606
59564 373606 373259 373104 372627 371752 370895 370417 370281 370422 371093 372461 374049 375140 375693 376351 377509 378836 379921
59547 379921 380932 382396 384709 388150 393046 399502 407194 415747 425233 436102 448833 463813 481081
59534 481081 499562 516665 529250 535295 534608 528295 518089 506121 494564 484918 477700 472829 470066
59521 470066 469031 469203 470196 471880 474101 476453 478465 479828 480279 479511 477367 474057 469994 465470 460570
59506 460570 455257 449512 443484 437575 432196 427396 422864 418340 413852 409551 405572 402096 399310 397184
59492C97184j650j135l92K62M01K20K97O62O89J22m36k27Q41K341L857N125N944
59475D14105O278O256O025N675N344N013M289K822J014k24n34m26l78k87n2Lj91
59458D54732J0J091K514L423L868M567N723O872P810Q749R590R815R340Q717Q155
59443E44976P009M682J589j294l473n115o429p394q001q316q227p475o115m726
59429D91691l975l995m272m128l358k253j083K97K174M425O565Q308R862J1589
59415E11847J3624J5954J8626K1626K4595K6771K7082K4355J7859Q154k530j1184
59403F96779j5733j6067j3548r578m735P98O141R385Q650L545m430j2804j9426
59390F28977k3177k4066k2957k0937j8611j5942j2881r910p738o527n680m484
$$ plain form
59492 397184 395534 394399 394007 394269 394670 394890 395187 395849 396538 396660 396224 395997 396838 399179 403036 408161 414105
59475 414105 420383 426639 432664 438339 443683 448696 452985 455807 456821 456597 456063 455637 455259 454972 454920 454923 454732
59458 454732 454742 455833 458347 461770 465638 470205 475928 482800 490610 499359 508949 518764 528104 536821 544976
59443 544976 551985 556667 558256 556962 553489 548374 541945 534551 526550 518234 510007 502532 496417 491691
59429 491691 487716 483721 479449 475321 471963 469710 468627 468924 471098 475523 482088 490396 500258 511847
59415 511847 525471 541425 560051 581677 606272 633043 660125 684480 702339 710493 707963 696779
59403 696779 681046 664979 651431 641853 637118 637916 644057 653442 662092 665637 661207 648403 628977
59390 628977 605800 581734 558777 537840 519229 503287 490406 480496 472758 466231 460551 456067
59378D56067k756r11N36J456K194L107M059M536M382M173M529N219N374M552L263
59363D99780K393K477L526N093O335O484N632M758M647N069N356N458N919P028
59349E69955Q498R915J1011J1586J1645J1556J1607J1465J0652R522Q986R130
59337F95528Q884P477N466L797K401N38j909m293o174p678q914r698r982r984
59323F65459r840r526r192r088r065q673p835p033o642o508o335o068n687m997
59309E58970l794k070N3K323M205N248N737O642Q633J1449J4331J6619J7770J7239
59295F63355J4721J0318M267l018j0407j6134j9077j9728j9420j8797j7541j5374
59283E53165j2728j0291q356o753n163l480j973j039n99M1J413L151M454N108
$$ plain form
59378 456067 453311 452400 452936 454392 456586 459693 463752 468288 472670 476843 481372 486591 491965 496517 499780
59363 499780 502173 504650 508176 513269 519604 526088 531720 536478 541125 546194 551550 557008 562927 569955
59349 569955 578453 588368 599379 610965 622610 634166 645773 657238 667890 677412 686398 695528
59337 695528 704412 711889 717355 721152 723553 724091 722182 717889 711715 704037 695123 685425 675443 665459
59323 665459 655619 646093 636901 627813 618748 610075 602240 595207 588565 582057 575722 569654 563967 558970
59309 558970 555176 553106 553159 555482 559687 564935 570672 577314 585947 597396 611727 628346 646116 663355
59295 663355 678076 688394 692661 689643 679236 663102 644025 624297 604877 586080 568539 553165
59283 553165 540437 530146 521790 515037 509874 506394 504421 503382 502783 502824 504237 507388 511842 516950
59269E16950N671O600P660Q271Q131P380O366N398M541L586K348R18m67j787l233
59254E78333m894o513p562p578o628n527n237n834o397o151n329m464l388j681
59240E01150K38J306J193O56M50O37J113K032L245M037L951L367K835K270J366
59225E29846M06j5J07J74k31j012j950k954l813m193l997l465k845k133j269l37
59209E02319M40R03J031R46P43L57k74q43p93MQ81J079O28K50M45J022J549J772
59191E12459J580R29Q4l24J37J135J786J572Q62M56O70J041R89O14N32J008J534
59174E27064J484R44N49O47R55J113J284J921L083M212M724M718M901N736O799
59159E70134P150O331M764L188J944R41M8p29j371j970k719l797n112o157o398
$$ plain form
59269 516950 522621 529221 536881 545152 553283 560663 567029 572427 576968 580554 582902 583820 583353 581566 578333
59254 578333 573439 566926 559364 551786 545158 539631 534394 528560 522163 516012 510683 506219 502831 501150
59240 501150 501388 502694 503887 504543 504993 505630 506743 508775 512020 516057 520008 523375 526210 528480 529846
59225 529846 530252 530237 530344 530518 530287 529275 527325 524371 520558 516365 512368 508903 506058 503925 502656 502319
59209 502319 502759 503662 504693 505639 506382 506739 506465 505622 504829 504833 505714 506793 507421 507671 508116 509138 510687 512459
59191 512459 514039 514968 515052 514728 514865 516000 517786 519358 520220 520676 521346 522387 523376 523990 524522 525530 527064
59174 527064 528548 529492 530041 530688 531643 532756 534040 535961 539044 543256 547980 552698 557599 563335 570134
59159 570134 577284 583615 588379 591567 593511 594452 594500 593771 592400 590430 587711 583914 578802 572645 566247
59144E66247n888n214m752m344l935l960m612n208n007m422m525n458o210o151
59130D96561n831n819n611m451k627j152l96K01J160K385L595M701N687O491P173
59115E02067P803Q203Q169P967Q103Q572Q791Q433P875P566P351O747N607M213
59101F07467K913J982J576J595J647J394P69j84j409k610l292l382l407l726l863
59086E97470l163j857q50n54o57j030k088l885n558o293o420o947q095q963q722
59071E32388p659o747o487o486o148n463m911m731m575m008l218k816k959k942
59057D63238j954j35J373J540M79p09j147j011j054j441j493o95M22Q50L56k89
59041D58330l21K25Q15J051Q48L04l08o39n73l06j4L12O51Q90J191K034L600N383
$$ plain form
59144 566247 560359 555145 550393 546049 542114 538154 533542 528334 523327 518905 514380 508922 502712 496561
59130 496561 490730 484911 479300 474849 472222 471070 470674 470875 472035 474420 478015 482716 488403 494894 502067
59115 502067 509870 518073 526242 534209 542312 550884 559675 568108 575983 583549 590900 597647 603254 607467
59101 607467 610380 612362 613938 615533 617180 618574 619343 619159 617750 615140 611848 608466 605059 601333 597470
59086 597470 594307 592450 591600 591046 590389 589359 587271 583386 577828 571535 565115 558168 550073 541110 532388
59071 532388 524729 517982 511495 505009 498861 493398 488487 483756 479181 475173 471955 469139 466180 463238
59057 463238 461284 461149 462522 464062 464541 463832 462685 461674 460620 459179 457686 456991 457413 458263 458619 458330
59041 458330 458009 458234 459049 460100 460948 461252 460944 460305 459732 459426 459412 459724 460375 461265 462456 464490 468090 473473
59023D73473O748P633Q382R102R611R901J0179J0476J0490R901Q588O626M295
59010E85405K093M20p48j685k471k897k806k267j444n02M32J341K264L023L202
58995E83360K736K254K441L086L254K409R75k84j036j460j930k754l914m955n380
58980E78802n216m918m648m072k999j714m86Q18K297L639M596N546O973Q579R467
58965E96664R266Q545Q030P861P795P709P545O998N802M228K895J988R26r36l508
58950F71808o101q198r794j0991j1608j1471j0844j0279j0053r859r157p702n851
58937E49900m311l535l334l201l012l156l864m698m961m470l594k716j870r76
58923E02202j08N55Q84R26Q00N01j94j360k426k511j451j33N00M87M76P63J197
$$ plain form
59023 473473 480221 487854 496236 505338 514949 524850 535029 545505 555995 565896 574484 581110 585405
59010 585405 587498 587918 587170 585485 583014 580117 577311 575044 573600 573098 573530 574871 577135 580158 583360
58995 583360 586096 588350 590791 593877 597131 599540 600515 600231 599195 597735 595805 593051 589137 584182 578802
58980 578802 573586 568668 564020 559948 556949 555235 554749 555567 557864 561503 566099 571645 578618 587197 596664
58965 596664 605930 614475 622505 630366 638161 645870 653415 660413 666215 670443 673338 675326 676252 675316 671808
58950 671808 665707 657509 647715 636724 625116 613645 602801 592522 582469 572610 563453 555751 549900
58937 549900 545589 542054 538720 535519 532507 529351 525487 520789 515828 511358 507764 505048 503178 502202
58923 502202 502094 502649 503533 504459 505259 505760 505566 504206 501780 499269 497818 497685 498185 498672 499148 499911 501108
58906E01108J839K969M568O270P817R058R707R702R605R935J0212R539Q193P611
58892F08133Q467R754J0291J0293J0679J1563J2341J2871J3575J4448J4805J4153
58880G51373J2769J1205R607P700N227K290o69l250n465p563r497j0818j1221
58867G51688j0944j0451j0034r777r556q933p548n823m839n184o361p559q527
58854F46152r276r627r600r687j0100j0206r483q517q185q223p653o443n613n647
58840E27892n870n667n323n230n171m876m599m538m328l683l057k998l259l197
58826D66096k732k229j694p84L96J250J539J716K199K778L019K890K680K513K317
58811D81954K120K052K077J979J658J208O66qn91o54k12n0q41k137k752k248j458
$$ plain form
58906 501108 502947 505916 510484 516754 524571 533629 543336 553038 562643 572578 582790 592329 600522 608133
58892 608133 616600 626354 636645 646938 657617 669180 681521 694392 707967 722415 737220 751373
58880 751373 764142 775347 784954 792654 797881 800171 799502 796252 790787 783224 773727 762909 751688
58867 751688 740744 730293 720259 710482 700926 691993 684445 678622 673783 668599 662238 654679 646152
58854 646152 636876 627249 617649 607962 597862 587656 578173 569656 561471 553248 545595 539152 533539 527892
58840 527892 522022 516355 511032 505802 500631 495755 491156 486618 482290 478607 475550 472552 469293 466096
58826 466096 463364 461135 459441 458657 459053 460303 461842 463558 465757 468535 471554 474444 477124 479637 481954
58811 481954 484074 486126 488203 490182 491840 493048 493714 493706 493115 492461 492249 492199 491358 489221 486469 484221 482763
58794D82763j388k043k736l060l122l061k901k697k431j787m83J201K576L258
58780D64089L499L822M537N503O114N739M470L258K840K717J710n15l024m708
58766E00051n283n101m560m043l906m190m502m410l844l054k375k055j977j592
58752D49159n26Q03J647K018K643L641M043L190J963J799K856M009M464M540M759
58737D91008M976M862M613M700N204N880O646P504Q117P977P138O302N934N680
58723E76541N034M209L782L659L172K310K053K988M276M770M706N397P206Q861
58709F38964Q993P619N650L639J587m54k309m075o011q060r907j1508j3132j4793
58695E96203j6061j6582j6528j6240j5657j4376j2378j0346r039q414p714o497
$$ plain form
58794 482763 481375 479332 476596 473536 470414 467353 464452 461755 459324 457537 457054 458255 460831 464089
58780 464089 467588 471410 475947 481450 487564 493303 497773 501031 503871 506588 508298 507783 504759 500051
58766 500051 494768 489667 485107 481064 477158 472968 468466 464056 460212 457158 454783 452728 450751 449159
58752 449159 448633 449436 451083 453101 455744 459385 463428 466618 468581 470380 473236 477245 481709 486249 491008
58737 491008 495984 500846 505459 510159 515363 521243 527889 535393 543510 551487 558625 564927 570861 576541
58723 576541 581575 585784 589566 593225 596397 598707 600760 603748 608024 612794 617500 622897 630103 638964
58709 638964 647957 655576 661226 664865 666452 665998 663689 659614 653603 645543 635636 624128 610996 596203
58695 596203 580142 563560 547032 530792 515135 500759 488381 478035 468996 460582 452868 446371
58683D46371n235m610m552m401l840l149k528j802r49l46j56O8P60J671K268K520
58667D22090K852L500M349N270O257P250Q119Q681Q544P224M827K282M07j025
58653D90627k674m356n196m993m520m299l917l011k150k107k804l619m288m848
58639D37845n065m680m023l591l166k056k56J432K497L232L922M301M187M041
58625D38620M363N021N632O221P001P783Q179Q136P790O965N363L209J213q3o08
58610E14805n44k23j52o01j170j207p32n02j019j888k359k235j973k097k607k996
58594D92500k820k270j906j782j262j7J282J885K131K926M295N386N879O385P250
58579E19862P913P892P534P333P133O648O132N990O095O066N885N896O419P651
$$ plain form
58683 446371 441136 436526 431974 427573 423733 420584 418056 416254 415305 414959 414803 414871 415631 417302 419570 422090
58667 422090 424942 428442 432791 438061 444318 451568 459687 468368 476912 484136 488963 491245 491652 490627
58653 490627 487953 483597 478401 473408 468888 464589 460672 457661 455511 453404 450600 446981 442693 437845
58639 437845 432780 428100 424077 420486 417320 415264 415008 416440 418937 422169 426091 430392 434579 438620
58625 438620 442983 448004 453636 459857 466858 474641 482820 490956 498746 505711 511074 514283 515496 515413 514805
58610 514805 514261 514038 513886 513285 512115 510908 510176 509674 508655 506767 504408 502173 500200 498103 495496 492500
58594 492500 489680 487410 485504 483722 482460 482443 483725 485610 487741 490667 494962 500348 506227 512612 519862
58579 519862 527775 535667 543201 550534 557667 564315 570447 576437 582532 588598 594483 600379 606798 614449
58565F14449R530J1508J2941J3950J5225J6840J8021J8411J8616J8876J8285J6189
58553H02841J3482J1357R429O370K067k067m846o281o932p255p637q243q760q975
58539G84550r418j0701j2405j3520j3817j3938j4223j4384j4248j3854j2901j1087
58527F30054q965p489o634n512l873k414j453n27M27O69l2p33o34j28K6j80l42
58510E92260m43o98j126j700k409k830k353j206n64j144k332l118l231k876k113
58495E64117j105l97k85l64j84J16L04O04J243J950K431K853L448M111M851O019
58479E89712P641R028R641R772R941J0173J0284J0266R845Q421O056L819K386
58466F96985R55j485m433o401o771o224n476m595l508k424j558r19k94P86K696
$$ plain form
58565 614449 623979 635487 648428 662378 677603 694443 712464 730875 749491 768367 786652 802841
58553 802841 816323 827680 837109 843479 845546 843479 838633 832352 825420 818165 810528 802285 793525 784550
58539 784550 775132 764431 752026 738506 724689 710751 696528 682144 667896 654042 641141 630054
58527 630054 621089 613600 606966 601454 597581 595167 593714 593187 593614 594283 594251 593518 592884 592756 592782 592602 592260
58510 592260 591817 591119 589993 588293 585884 583054 580701 579495 578931 577787 575455 572337 569106 566230 564117
58495 564117 563012 562615 562330 561966 561782 561898 562202 562806 564049 565999 568430 571283 574731 578842 583693 589712
58479 589712 597353 606381 616022 625794 635735 645908 656192 666458 676303 684724 690780 694599 696985
58466 696985 697940 696455 692022 685621 678850 672626 667150 662555 659047 656623 655065 654146 653852 654638 657334
58451F57334M969O388O358N731N579N651M829K779K88j817l319m279m797n062
58437F80632n097m523l127j352J61J275K085K380K091J859K363L349M119M725
58423F90940N803P396Q840R696R967R424P699N153K790J086m20k149l848n122
58409G47255n999o523o378n380m027l154l128l521l595l003k070j350r33l96N26
58394F98324J593K459L078L469L588L590L748L861L306J983N86m34j367k211k014
58379G23559j49K490M504N632O418O847O529N846N716O351P208P978Q585Q533
58365H06047P465O258O258P408Q324Q383Q415R071R794R918R647R316Q654P530
58351I22488O628O545O744O276N192M503M813N656O297O715P469Q689R667R762
$$ plain form
58451 657334 662303 668691 675049 680780 686359 692010 696839 699618 699906 698089 694770 690491 685694 680632
58437 680632 675535 671012 667885 666533 666694 667969 670054 672434 674525 676384 678747 682096 686215 690940
58423 690940 696743 704139 712979 722675 732642 742066 749765 754918 757708 758794 758374 756225 752377 747255
58409 747255 741256 734733 728355 722975 718948 715794 712666 709145 705550 702547 700477 699127 698194 697798 698324
58394 698324 699917 702376 705454 708923 712511 716101 719849 723710 727016 728999 729585 729151 727784 725573 723559
58379 723559 723410 725900 730404 736036 742454 749301 755830 761676 767392 773743 780951 788929 797514 806047
58365 806047 813512 819770 826028 833436 841760 850143 858558 867629 877423 887341 896988 906304 914958 922488
58351 922488 929116 935661 942405 948681 953873 958376 963189 968845 975142 981857 989326 998015 1007682 1017444
58337A017444R463R856J1019J1778J1495J1149J1896J3314J4105J4023J3868J3894
58325A163304J3486J2368J0986R607Q051O530N731N860O376O842P259P446P052
58312A270898O386O366P344Q738J0065J1497J3059J4164J4431J4331J4530J5128
58300A406937J5934J6913J7919J8454J8266J7907J8193J9220K0234K0508K0113
58289A610598J9763J9980K0641K1387K2267K3494K4848K5973K7148K8960L1053
58278A876112L2306L2500L2745L3752L4826L5325L5917L7440L9467M1171M2713
58267B274274M4665M6930M9239N1867N4741N6906N8084N9621O2456O5314O6554
58256B890651O6722O7442O8801O9862P0849P2633P4779P6352P8123Q1660Q6689
$$ plain form
58337 1017444 1026907 1036763 1047782 1059560 1071055 1082204 1094100 1107414 1121519 1135542 1149410 1163304
58325 1163304 1176790 1189158 1200144 1209751 1217802 1224332 1230063 1235923 1242299 1249141 1256400 1263846 1270898
58312 1270898 1277284 1283650 1290994 1299732 1309797 1321294 1334353 1348517 1362948 1377279 1391809 1406937
58300 1406937 1422871 1439784 1457703 1476157 1494423 1512330 1530523 1549743 1569977 1590485 1610598
58289 1610598 1630361 1650341 1670982 1692369 1714636 1738130 1762978 1788951 1816099 1845059 1876112
58278 1876112 1908418 1940918 1973663 2007415 2042241 2077566 2113483 2150923 2190390 2231561 2274274
58267 2274274 2318939 2365869 2415108 2466975 2521716 2578622 2636706 2696327 2758783 2824097 2890651
58256 2890651 2957373 3024815 3093616 3163478 3234327 3306960 3381739 3458091 3536214 3617874 3704563
58245C704563R1590R6209J01809J08507J15110J21376J28138J35434J42663J50429
58235D895828J59839J70262J80140J89825K01140K14389K28392K43229K60197
58226F743241K79201K98977L19903L43793L70974M00369M32277M68206N08237
58217A0165178N51612N99594O54524P16650P85408Q63146R53755J058470J177546
58208A7525883J315371J479205J673749J902545K174258K502087K898516L378684
58200C4850298L970104M712592N648013O814452Q244879R958426J1953367J4222116
58192A00374247J6774770J9633999K2799233K6204630K9649213L2659337L4368638
58185B82464067L3637111K9515343K1819958J1396466j45225j1041568j9955794
$$ plain form
58245 3704563 3796153 3892362 3994171 4102678 4217788 4339164 4467302 4602736 4745399 4895828
58235 4895828 5055667 5225929 5406069 5595894 5797034 6011423 6239815 6483044 6743241
58226 6743241 7022442 7321419 7641322 7985115 8356089 8756458 9188735 9656941 10165178
58217 10165178 10716790 11316384 11970908 12687558 13472966 14336112 15289867 16348337 17525883
58208 17525883 18841254 20320459 21994208 23896753 26071011 28573098 31471614 34850298
58200 34850298 38820402 43532994 49181007 55995459 64240338 74198764 86152131 100374247
58192 100374247 117149017 136783016 159582249 185786879 215436092 248095429 282464067
58185 282464067 316101178 345616521 367436479 378832945 378687720 367646152 347690358
58178C47690358k6259340k9970419l1478040l1255116k9720670k7257301k4255768
58171A47493704k1085159j8021317j5221246j2756536j0650122q888716p432914
58164E3437694o237135n261163m466524l815077l276636k831425k462891k154473
58156B2932370j894612j677651j497130j343586j210408j096074r98423r11729
58148A2302757q31484p57494o90164o27757n69286n16229m69296m26651l87074
58139G027322l51966l22732k98827k79523k64834k53462k42512k30467k18227
58130D564772k06316j93695j80192j67503j56604j46478j36472j27622j20497
58121C129393j13949j07093j00668r5350r0584q6033q2330p9454p6137p1851o7733
$$ plain form
58178 347690358 321431018 291460599 259982559 228727443 199006773 171749472 147493704
58171 147493704 126408545 108387228 93165982 80409446 69759324 60870608 53437694
58164 53437694 47200559 41939396 37472872 33657795 30381159 27549734 25086843 22932370
58156 22932370 21037758 19360107 17862977 16519391 15308983 14212909 13214486 12302757
58148 12302757 11471273 10713779 10023615 9395858 8826572 8310343 7841047 7414396 7027322
58139 7027322 6675356 6352624 6053797 5774274 5509440 5255978 5013466 4782999 4564772
58130 4564772 4358456 4164761 3984569 3817066 3660462 3513984 3377512 3249890 3129393
58121 3129393 3015444 2908351 2807683 2712333 2621749 2535716 2453386 2373932 2297795 2225944 2158211
58110B158211o4659o1970n8939n5927n3275n0572m7840m5948m5102m4274m2817
58099A586888m1227l9761l7847l5512l3860l3248l2465l0557k8206k6458k5290
58088A222457k4226k3203k2122k0590j8791j7645j7482j7582j7452j7468j7831
58077A008065j8122j8313j8957j9884j9974j8822j7410j6496j5646j4474j3575
58066H16392j3338j3042j2038j0901j0466j0525j0299r553q620p878p736q433
58054F93563r535j0247j0483j0797j1156j0843r786q803q211p403o227n498n569
58041E79005n645n224n021n635o421o561o291o212o218n981n735n794n938o028
58027D96301o502p594q664q980q556p758o787o007n999o651o951o275n148m309
$$ plain form
58110 2158211 2093552 2031582 1972643 1916716 1863441 1812869 1765029 1719081 1673979 1629705 1586888
58099 1586888 1545661 1505900 1468053 1432541 1398681 1365433 1332968 1302411 1274205 1247747 1222457
58088 1222457 1198231 1175028 1152906 1132316 1113525 1095880 1078398 1060816 1043364 1025896 1008065
58077 1008065 989943 971630 952673 932789 912815 893993 876583 860087 844441 829967 816392
58066 816392 803054 790012 777974 767073 756607 746082 735783 726230 717610 709732 701996 693563
58054 693563 684028 673781 663298 652501 641345 630502 620716 611913 603702 596299 590072 584574 579005
58041 579005 573360 568136 563115 557480 551059 544498 538207 531995 525777 519796 514061 508267 502329 496301
58027 496301 489799 482205 473541 464561 456005 448247 441460 435453 429454 422803 415852 409577 404429 400120
58013D00120l777l347l152l166k979k570k473k653k267j103j88k76p94j105j654
57998C68616k828l747l440k451k056k425k735k603k317k011j612j336j327j146
57984C36582m15L69M92J1n84j212j910k266k052j937k538l298l303k816k822l289
57968C09012l145j926l84O83J201J312J011N58N12R41J255J042O02L74J95m80
57952C12763j774l002l210k198q62k42l38k72M28J431K472L717M968N454N011
57937C24346M666N339O633P661Q342R042R592R605R278Q918Q105O308L946J851
57923D23632rk165m295n405n397n353o013o915p292p137o967p091p312p208o580
57908C38493n821n495n435m821l545k796l497m801n166m475l950m228m640m426
$$ plain form
58013 400120 396343 392996 389844 386678 383699 381129 378656 376003 373736 372633 372445 372169 371375 370270 368616
57998 368616 365788 362041 358601 356150 354094 351669 348934 346331 344014 342003 340391 339055 337728 336582
57984 336582 336167 336536 337028 337039 336455 335243 333333 331067 329015 327078 324540 321242 317939 315123 312301 309012
57968 309012 305867 303941 303557 304240 305441 306753 307764 308322 308834 309775 311030 312072 312674 313048 313243 312763
57952 312763 310989 307987 304777 302579 301717 301475 301137 300865 301293 302724 305196 308913 313881 319335 324346
57937 324346 329012 334351 340984 348645 356987 366029 375621 385226 394504 403422 411527 417835 421781 423632
57923 423632 423623 421458 417163 411758 406361 401008 394995 388080 380788 373651 366684 359593 352281 345073 338493
57908 338493 332672 327177 321742 316921 313376 310580 307083 302282 297116 292641 288691 284463 279823 275397
57894B75397l551k242o47Q20J708K166K676L146L151K945L226L835L831L004K235
57879C01700K029J844J286Q38P82M72n55j642k040k165k872l992m609m434m064
57864B82578l957l928l625k949k001j125q49j303j742j171M94K275L189L126K653
57849B71665K307K247K374K500K429K050J434Q35M63J33o94k317m230n436n438
57834B70322m737m241m308m493m159l231k268j758j429n60R49K263K584K168J880
57819B48982K106K569L014L405L477K858J750Q95N75J89q67k414l820m748n146
57804B52825m967m319l673l429l414l124k338j277k86M02O83O79P27J008J257
57789B30754J053L88k80n56m73l31k71j27L10R44J414J508J447J650K253L013
$$ plain form
57894 275397 271846 269604 268957 269777 271485 273651 276327 279473 282624 285569 288795 292630 296461 299465 301700
57879 301700 303729 305573 306859 307697 308479 308951 308396 306754 304714 302549 299677 295685 291076 286642 282578
57864 282578 278621 274693 271068 268119 266118 264993 264144 262841 261099 259928 260422 262697 265886 269012 271665
57849 271665 273972 276219 278593 281093 283522 285572 287006 287841 288304 288437 287743 285426 281196 275760 270322
57834 270322 265585 261344 257036 252543 248384 245153 242885 241127 239698 239138 240087 242350 244934 247102 248982
57819 248982 251088 253657 256671 260076 263553 266411 268161 269056 269631 269820 268953 266539 262719 257971 252825
57804 252825 247858 243539 239866 236437 233023 229899 227561 226284 225998 226400 227083 227762 228489 229497 230754
57789 230754 231807 232195 231915 231359 230886 230555 230284 230157 230467 231411 232825 234333 235780 237430 239683 242696
57773B42696L622L930L906L592L067K310J194j97j362j883k047k495l245l583
57759B49505l100k349k118k456k851k942k636j748j61J741L283M264M979N500
57745B48911N487M951M559M719M771L753J795N8p88j230j839k271j996j464j704
57730B67712k820l755l711l051k545k315j999j485r63n88m57p16j244j557j414
57715B39092j264j608k153k222j842j700j990k011j210p4M10q2r75j538j576j355
57699B17902j101p18k8Q22J398J451J147O87j8r89j842k143k043k128k603l007
57683B06787k742j679k00J220K420L726N609Q132J0941J3923J7489K1929K6872
57670C14427L1918L7395M3801N0598N6163N8696N6534M7959L2103J0690j1950
$$ plain form
57773 242696 246318 250248 254154 257746 260813 263123 264317 264120 262758 260875 258828 256333 253088 249505
57759 249505 246405 244056 241938 239482 236631 233689 231053 229305 229144 230885 234168 238432 243411 248911
57745 248911 254398 259349 263908 268627 273398 277151 278946 279004 278216 276986 275147 272876 270880 269416 267712
57730 267712 264892 261137 257426 254375 251830 249515 247516 246031 245068 244480 244023 243307 242063 240506 239092
57715 239092 237828 236220 234067 231845 230003 228303 226313 224302 223092 223018 223428 223346 222371 220833 219257 217902
57699 217902 216801 216083 216055 216877 218275 219726 220873 221560 221542 220553 218711 216568 214525 212397 209794 206787
57683 206787 204045 202366 202166 203386 205806 209532 215141 223273 234214 248137 265626 287555 314427
57670 314427 346345 383740 427541 478139 534302 592998 649532 697491 729594 740284 728334
57659G28334l1334m5181n3350n6414n5047n0374m3930l7053l0516k4686j9737
57648B80712j5797j2966j1110r627p778n517l627k783k691k464j682p62l89p95
57634B02724j531j848j365m17L44O92Q40P87J89r22j810j876j464j332j611j798
57618A89602j660j555j758j935j586q06k86n28j166j317o73N2J6n64o96m8N52
57601A75644L16m44r47j137j509k039k142j764j677k375l220l218k372j700j972
57586A49444k842l378l173k574k014j453o97P7M22J68m31j138j903k541k625k024
57570A23318j289j100j436j591j049p4O22O41K30j43l42n78r39j133q97m40j37
57553A13663N0M07Q11P82L16Q6N18J154J353J173J053J025Q76Q65J491K547L157
$$ plain form
57659 728334 697000 651819 598469 542055 487008 436634 392704 355651 325135 300449 280712
57648 280712 264915 251949 240839 231212 223434 217917 214290 211507 208816 206352 204670 203908 203519 202724
57634 202724 201193 199345 197980 197563 197907 198599 199439 200226 200415 199493 197683 195807 194343 193011 191400 189602
57618 189602 187942 186387 184629 182694 181108 180302 180016 179488 178322 177005 176332 176384 176400 175836 175140 175092 175644
57601 175644 175960 175516 174569 173432 171923 169884 167742 165978 164301 161926 158706 155488 153116 151416 149444
57586 149444 146602 143224 140051 137477 135463 134010 133313 133390 133812 133980 133549 132411 130508 127967 125342 123318
57570 123318 122029 120929 119493 117902 116853 116779 117401 118042 118272 118129 117787 117209 116270 115137 114240 113800 113663
57553 113663 113713 114120 114931 115713 116029 116115 116633 117787 119140 120313 121366 122391 123267 124132 125623 128170 131327
57536A31327K939K534K683L303L825M058M171M147L825L441L552M304N156N567
57522A84832N636N794O084O134N717N011M254L452K556J598M95r76k731m125m572
57507B19159m312m155m495m968n143n064m957m761m309l697l182k848k681k748
57493A61839l064l351l281k855k334j872j500j370j641k062k043j310l03K49J0
57478A35112p55j445j532q91j8K75l26j202j418q51l20m88r38o94M62J633J797
57461A28401Q73m03j298j607j476j086n32J12O99R78P25Rq08j350j492j305r11
57444A19529m32L6M64Q04Q56N06P7P5M89P55N98M02M35K98l21q75o88m5J88j60
57424A22991n43p23r39j055n89K45N54J55m7M82R36M37n58r29m39J94M74N12N05
$$ plain form
57536 131327 134266 136800 139483 142786 146611 150669 154840 158987 162812 166253 169805 174109 179265 184832
57522 184832 190468 196262 202346 208480 214197 219208 223462 226914 229470 231068 231563 230587 227856 223731 219159
57507 219159 214847 210692 206197 201229 196086 191022 186065 181304 176995 173298 170116 167268 164587 161839
57493 161839 158775 155424 152143 149288 146954 145082 143582 142212 140571 138509 136466 135156 134853 135102 135112
57478 135112 134357 132912 131380 130489 130471 130746 130420 129218 127800 126949 126629 126141 125203 124509 124971 126604 128401
57461 128401 129274 128871 127573 125966 124490 123404 122872 122984 123683 124661 125386 125395 124587 123237 121745 120440 119529
57444 119529 119097 119133 119597 120401 121257 121763 121840 121915 122404 123159 123757 124159 124594 124892 124571 123696 123008 122963 123151 122991
57424 122991 122448 121725 120786 119731 119142 119387 119941 120096 120049 120531 121467 121904 121346 120417 119978 120172 120646 121158 121663
57405A21663N18O86J012J054M18n84j272j484j525j394p77J84P53M56k99p52n29
57388A18128J56Q37J156J134J161J497J874J792J181N01K29M25P95R25N75j06
57372A32260o76q89q69o93j77O24J081P35Q0J8O44J179J033L60l30n58P4J472
57354A35368K662K624J639J037J419J924J667R96O93O81M56K06N53J323J590R80
57338A55818J75p5K10N77P50O99M99L86N62P84N55q3m50k23Km16j134j317r06
57319A56413o29q17r24m81J91N43O20Q05J075J041N73l7m84o20l22M31J305J823
57301A60506J857J649J375J020P62R46J496J763J268L87q8Q7L94K75j90m35n7
57284A73015P45J398J560J409J282J149P28L4m59l57J85O21N74J50j75RN86R36
$$ plain form
57405 121663 122181 122867 123879 124933 125351 124767 123495 122011 120486 119092 118315 118499 119252 119708 119409 118657 118128
57388 118128 118284 119121 120277 121411 122572 124069 125943 127735 128916 129417 129646 130071 130866 131791 132366 132260
57372 132260 131584 130695 129826 129133 128956 129580 130661 131396 131476 131494 132138 133317 134350 134710 134380 133822 133896 135368
57354 135368 138030 140654 142293 143330 144749 146673 148340 149336 150029 150710 151166 151372 151925 153248 154838 155818
57338 155818 155993 155918 156128 156705 157455 158154 158653 159039 159601 160385 160940 160857 160407 160184 160186 159770 158636 157319 156413
57319 156413 155784 154967 154043 153562 153753 154296 154916 155721 156796 157837 158410 158373 157889 157269 156947 157378 158683 160506
57301 160506 162363 164012 165387 166407 167169 168115 169611 171374 172642 173029 172941 173028 173422 173697 173507 173072 173015
57284 173015 173760 175158 176718 178127 179409 180558 181286 181320 180861 180504 180689 181310 181884 182034 181859 181868 182454 183390
57266A83390O29J1j84K51P92R31P08M66M68R01J762K594K711K033J357J421K066
57249B02307K582K587K255J943J939K362K935L071K523J781J486J653J827J779
57235B33030J625J394R22K32l67n97m17P2P65J528K203K582K445J792J070Q56
57219B49135J238J842K468L206L800L592K554J728J979K847L259L033K863L089
57205B86633L380L533L738L971L836L268K805K940L601M434N188N734O103O613
57191C45777P591Q885R961J0438J0327R869R487R717J0648J1583J1780J1417J1263
57178D78743J1560J1895J2075J2399J2977J3576J4229J5221J6334J6917J6975
57167F32901J7312J8169J8636J8067J7351J7875J9659K1403K2173K2299K2614
$$ plain form
57266 183390 184019 184030 183846 184097 184889 185820 186528 186994 187462 188363 190125 192719 195430 197463 198820 200241 202307
57249 202307 204889 207476 209731 211674 213613 215975 218910 221981 224504 226285 227771 229424 231251 233030
57235 233030 234655 236049 236971 237203 236836 236239 235822 235894 236659 238187 240390 242972 245417 247209 248279 249135
57219 249135 250373 252215 254683 257889 261689 265281 267835 269563 271542 274389 277648 280681 283544 286633
57205 286633 290013 293546 297284 301255 305091 308359 311164 314104 317705 322139 327327 333061 339164 345777
57191 345777 353368 362253 372214 382652 392979 402848 412335 422052 432700 444283 456063 467480 478743
57178 478743 490303 502198 514273 526672 539649 553225 567454 582675 599009 615926 632901
57167 632901 650213 668382 687018 705085 722436 740311 759970 781373 803546 825845 848459
57156H48459K3470K4575K5393K5557K5173K4710K4487K4350K4109K3976K4275
57145A118534K4872K5337K5572K5802K6018K5922K5563K5510K6158K7126K7766
57134A404180K8024K8428K9316L0508L1839L3486L5511L7467L8967M0452M2858
57123A781036M6474N0701N4955N9231O3642O8040P2505P7688Q4116R1632R9895
57112B549915J09020J19245J30430J42489J55897J71202J88568K08554K32875
57103D008195K63549L01740L48543M06643M80121N72675O87074Q26028R92000
57094H886568J185437J403747J641583J890806K140263K377494K591345K771941
57086B4889184K908893K993036L021454K997150K918969K772038K532704K186486
$$ plain form
57156 848459 871929 896504 921897 947454 972627 997337 1021824 1046174 1070283 1094259 1118534
57145 1118534 1143406 1168743 1194315 1220117 1246135 1272057 1297620 1323130 1349288 1376414 1404180
57134 1404180 1432204 1460632 1489948 1520456 1552295 1585781 1621292 1658759 1697726 1738178 1781036
57123 1781036 1827510 1878211 1933166 1992397 2056039 2124079 2196584 2274272 2358388 2450020 2549915
57112 2549915 2658935 2778180 2908610 3051099 3206996 3378198 3566766 3775320 4008195
57103 4008195 4271744 4573484 4922027 5328670 5808791 6381466 7068540 7894568 8886568
57094 8886568 10072005 11475752 13117335 15008141 17148404 19525898 22117243 24889184
57086 24889184 27798077 30791113 33812567 36809717 39728686 42500724 45033428 47219914
57078D7219914J741798J226382O71681J00546m73011j036200j571335k056221
57070D5823554k469050k792952l017648l139427l161281l093062k950470k752722
57062B2446942k519820k270064k018249j775135j548136j342054j159194r99702
57054H814588q62671p46885o50356n69920n02190m44863l96572l55848l20917
57045C964366k90412k63465k39146k16447j94878j74554j55645j38202j22419
57036B169198j08299r5076q1693o8044n4984m2739l0000j5201J718J9323L5985
57025A730188N0234N9666O0306M8154K2055j4484n4157q8943j13380j26078j28928
57014A444633j24979j16732j05794r3493q1194o9893n9888n1202m4066l8635l4492
$$ plain form
57078 47219914 48961712 50188094 50859775 50960321 50487310 49451110 47879775 45823554
57070 45823554 43354504 40561552 37543904 34404477 31243196 28150134 25199664 22446942
57062 22446942 19927122 17657058 15638809 13863674 12315538 10973484 9814290 8814588
57054 8814588 7951917 7205032 6554676 5984756 5482566 5037703 4641131 4285283 3964366
57045 3964366 3673954 3410489 3171343 2954896 2760018 2585464 2429819 2291617 2169198
57036 2169198 2060899 1965823 1884130 1816086 1761102 1718363 1688363 1673162 1674880 1694203 1730188
57025 1730188 1780422 1840088 1900394 1948548 1970603 1956119 1901962 1813019 1699639 1573561 1444633
57014 1444633 1319654 1202922 1097128 1003635 922441 852548 792660 741458 697392 658757 624265
57003F24265l0938k7762k5139k2889k0482j7919j5928j4973j4603j4079j3178
56992D06375j2065j0849r587q326o861m899k657p18Q92K715M566N087L284j27
56978C66830l750p141j0542j3565j5303j5579j5017j3941j2113r584o942m581
56966B38772k433m86J161K774M859P397R841J1933J3930J5913J7344J7423J5489
56953C53917J1243N160j419p263j2199j6463j9436k0008j8229j5478j2771r919
56941B37135o667l607j252R23L737P095J0323J3279J6394J9782K2870K4750K4497
56928C69259K1282J4808N784m184j3239j9951k3759k5096k4950k4095k2741k0852
56916B32266j8477j5706j2720r945p946o909o489o229n924n468m733l741k743
$$ plain form
57003 624265 593327 565565 540426 517537 497055 479136 463208 448235 433632 419553 406375
56992 406375 394310 383461 373874 365548 358687 353788 351131 350413 351305 354020 358586 363673 366957 366830
56978 366830 363080 355939 345397 331832 316529 300950 285933 271992 259879 250295 243353 238772
56966 238772 236339 235853 237014 239788 244647 252044 261885 273818 287748 303661 321005 338428 353917
56953 353917 365160 370320 368901 361638 349439 332976 313540 293532 275303 259825 247054 237135
56941 237135 230468 226861 225609 226532 230269 237364 247687 260966 277360 297142 320012 344762 369259
56928 369259 390541 405349 411133 406949 393710 373759 350000 324904 299954 275859 253118 232266
56916 232266 213789 198083 185363 175418 167472 160563 154074 147845 141921 136453 131720 127979 125236
56903A25236j995j561j341j072n16Q8L8q94j746j313L00J878K917M277O801J0127
56887A41224J3319J5916J7691J8094J6640J3543R323M268j191n951q868r747r175
56874B15086p585n102k065J012L997P129J0444J3754J7185K1219K6061L1407L6914
56861C69456M2405M7352N0525N0440M6097L7209K4183Q275q253k2610l2626l7716
56849E74737l8769l7055l3260k7588k0474j2733m959K866J0975J9316K7629L5858
56837D96543M4240N3077O2443P1719P9156Q2004P7510O4181M2519J5201j3412
56826A075181l8668n7471o9111p4425p4427o9951o2112n2361m1998l1830k2277
56815D80550j3363m608M614J4338K3870L2472L9983M6529N1741N4424N2937M5825
$$ plain form
56903 125236 123241 121680 120339 119267 118751 118839 118877 117983 116237 114924 115224 117102 120019 124296 131097 141224
56887 141224 154543 170459 188150 206244 222884 236427 245750 250018 248827 242876 234008 224261 215086
56874 215086 207501 202399 200334 201346 205343 212472 222916 236670 253855 275074 301135 332542 369456
56861 369456 411861 459213 509738 560178 606275 643484 667667 675942 667689 645079 612453 574737
56849 574737 535968 498913 465653 438065 417591 404858 399899 402765 413740 433056 460685 496543
56837 496543 540783 593860 656303 728022 807178 889182 966692 1030873 1073392 1088593 1075181
56826 1075181 1036513 979042 909931 835506 761079 691128 629016 576655 534657 502827 480550
56815 480550 467187 462579 467193 481531 505401 537873 577856 624385 676126 730550 783487 829312
56803H29312L2496J3866p421k7791m4251n5388o1119o1947n8766n3022m6271l9341
56791D20357l2237k4942j7856j1253m884J448P371J2411J6688K0639K4282K7041
56779D39065K7978K5862J9582R312k974j4809k4834l2615l7477l8763l7119l4272
56767B98936l1209k7629k3410j9516j6812j4903j2939j0886r269q150p127o069
56755A11017n235m798m679m641m357l607k688k194k225k234j928j644j586j422
56741F7779j042r91j514j849j285l78j90p52j209j209j164j151o37N16J549J682
56725E8155J039L38Q1K26M62N24L59O5k25k91J82J173J898J507L55j35O56J620
56707F7989J518P67O64J388J934J789J433J186O83k12r23j029p74m43O0O23O73
$$ plain form
56803 829312 861808 875674 868253 840462 796211 740823 679704 617757 558991 505969 459698 420357
56791 420357 388120 363178 345322 334069 329185 330633 338004 350415 367103 387742 412024 439065
56779 439065 467043 492905 512487 521799 518825 504016 479182 446567 409090 370327 333208 298936
56767 298936 267727 240098 216688 197172 180360 165457 152518 141632 132363 124213 117086 111017
56755 111017 105782 100984 96305 91664 87307 83700 81012 78818 76593 74359 72431 70787 69201 67779
56741 67779 66737 65746 64232 62383 61098 60720 60530 59778 58569 57360 56196 55045 54408 54924 56473 58155
56725 58155 59194 59532 59613 59839 60301 60825 61184 61249 61024 60733 60915 62088 63986 65493 65848 65713 66369 67989
56707 67989 69507 70274 70938 72326 74260 76049 77482 78668 79351 79139 78216 77187 76413 75970 76030 76653 77326
56690G7326M2m40J15J449K432K408J791J375J366J283P36J21K99J410K390K124
56674I6227Q43j88k48K56P55J318K179L038L394L193K882K970L672M747N576N709
56658A36323N323M858M265L278K308K199K763K504M92k182l661l520k855k571
56644A49524k599k723l109l732m109m010l778l644l319k698k316k519k748k333
56630A05887j608j416j713j619q37j13j1j40k3M0l62q82r06n52l13j52K19M08
56612I5907k51j409j827j046M6N49O25P16O69K70JL83J028J145O75K53K69O07
56594I8610J134J768K169K033J637J554J816J874J447Q45M40K17nk27k71P8Q19
56577A15938J532J558P96J4J6O90J351J776K310L010L381L076K408J956K033K624
$$ plain form
56690 77326 77368 76928 77043 78492 80924 83332 85123 86498 87864 89147 89883 90004 90303 91713 94103 96227
56674 96227 97070 96882 96634 96890 97645 98963 101142 104180 107574 110767 113649 116619 120291 125038 130614 136323
56658 136323 141646 146504 150769 154047 156355 158554 161317 163821 164313 162131 158470 154950 152095 149524
56644 149524 146925 144202 141093 137361 133252 129242 125464 121820 118501 115803 113487 110968 108220 105887
56630 105887 104279 102863 101150 99531 98694 98581 98570 98430 98407 98447 98085 97203 96297 95745 95432 95280 95499 95907
56612 95907 95656 94247 92420 91374 91420 91969 92594 93310 93979 94249 94250 94633 95661 96806 97481 97734 98003 98610
56594 98610 99744 101512 103681 105714 107351 108905 110721 112595 114042 114887 115327 115544 115539 115312 115041 115119 115938
56577 115938 117470 119028 119824 119838 119854 120544 121895 123671 125981 128991 132372 135448 137856 139812 141845 144469
56561A44469L500M300M787N083N443N801N818N358M525L323J709L2r61q09J94
56546A92572J302J903J833J321O95P9o27j418k062k388k463k377k139j954k126
56531A82151k502k468j902j507j765k145j999j648j683j765j161k37j45j069j922
56516A58233k011j832j945k051j717j209j062j371j995k828l467l195j886l93
56502A31271L79M74N03O87P40M63N0j57j5K64K88K8rN33J130R56Q8n58n06j82
56482A36427k1J31M34O97Q49J076J195P17j18k64O47J582J536Q88N44M67R8l56
56464A46529j69N92J077R78Q69J146J370J052L81j35l30l82l66q5O17J429J539
56447A56112L61j568k771k237m48J263K065J990J372N13j65k89P1N12Q89J302
$$ plain form
56561 144469 147969 152269 157056 162139 167582 173383 179201 184559 189084 192407 194116 194148 193187 192378 192572
56546 192572 193874 195777 197610 198931 199626 199705 199078 197660 195598 193210 190747 188370 186231 184277 182151
56531 182151 179649 177181 175279 173772 172007 169862 167863 166215 164532 162767 161606 161369 161224 160155 158233
56516 158233 156222 154390 152445 150394 148677 147468 146406 145035 143040 140212 136745 133550 131664 131271
56502 131271 131650 132124 132627 133314 134054 134517 134567 134410 134395 134659 134947 134975 134966 135499 136629 137585 137673 137115 136609 136427
56482 136427 136406 136537 136971 137668 138517 139593 140788 141505 141387 141123 141770 143352 144888 145776 146320 146787 146885 146529
56464 146529 146360 146952 148029 149007 149876 151022 152392 153444 153825 153690 153360 152978 152612 152527 153144 154573 156112
56447 156112 156473 154905 152134 149897 149449 150712 152777 154767 156139 156652 156487 156198 156269 156781 157670 158972
56431A58972J670J684J360J170J433J840J847J338P07L71M15O30O98L74l36j087
56415A73086j401j114n46j07J18J67j91j104j913j565q9R95M42j057j820j354
56399A62547p00p00j047j156r82o27L1Q50J298J277J432K127K788K765K329K162
56383A74394K354K525K626K933L416L669L417K701J714P62K06J37K66L31M06N49
56367B02406N15J33l28n12m26k38J10P08J340J624J391P29q6n78l74K74O14K83
56349B07585k43l02K02Q61J231J027L24k69n8Q98J838K250K224J805Q68p0M4J326
56331B21541K430K292J610J724K678L401L363K955K514J986J506J419J610J511
56317B52540Q95J10l82k98N03J741K583K416J650J253J552K060K336K394K364
$$ plain form
56431 158972 160642 162326 163686 164856 166289 168129 169976 171314 172021 172392 172807 173437 174135 174509 174173 173086
56415 173086 171685 170571 170025 169918 170036 170203 170012 168908 166995 165430 165341 166336 166778 165721 163901 162547
56399 162547 161847 161147 160100 158944 157962 157335 157366 158216 159514 160791 162223 164350 167138 169903 172232 174394
56383 174394 176748 179273 181899 184832 188248 191917 195334 198035 199749 200511 200717 200854 201120 201451 201857 202406
56367 202406 202921 203054 202726 202214 201788 201550 201660 202368 203708 205332 206723 207452 207366 206788 206414 206688 207302 207585
56349 207585 207342 207040 207242 208103 209334 210361 210685 210416 210358 211256 213094 215344 217568 219373 220241 220171 220215 221541
56331 221541 223971 226263 227873 229597 232275 235676 239039 241994 244508 246494 248000 249419 251029 252540
56317 252540 253435 253545 253163 252865 253368 255109 257692 260108 261758 263011 264563 266623 268959 271353 273717
56302B73717K266K189K183K081J794J659K017K591K826K749K860L248L349K763
56288C08292J802J063Q29J051J634K541L641M575M928M675M392M613N090N196
56274C54322M979N138N784O184O047O201P324Q828R794J0343J1214J2479J3632
56261D62269J4588J5720J7120J8620K0342K2556K5179K8086L1591L6007M0986
56250G33064M5962N0924N6119O1415O6561P1680P6676Q0668Q2848Q3511Q3339
56239A492767Q2146P9290P4803O9001O1321N0908L8164K4457J0393m232j8754
56228A960264l1452m1513m9917n7773o4738o9717p2407p3422p3408p2524p0654
56217A282739o7783o4317o0855n7428n3328m8252m3205l9507l7169l5094l2614
$$ plain form
56302 273717 275983 278172 280355 282436 284230 285889 287906 290497 293323 296072 298932 302180 305529 308292
56288 308292 310094 311157 311986 313037 314671 317212 320853 325428 330356 335031 339423 344036 349126 354322
56274 354322 359301 364439 370223 376407 382454 388655 395979 404807 414601 424944 436158 448637 462269
56261 462269 476857 492577 509697 528317 548659 571215 596394 624480 656071 692078 733064
56250 733064 779026 829950 886069 947484 1014045 1085725 1162401 1243069 1325917 1409428 1492767
56239 1492767 1574913 1654203 1729006 1798007 1859328 1910236 1948400 1972857 1983250 1979018 1960264
56228 1960264 1928812 1887299 1837382 1779609 1714871 1645154 1572747 1499325 1425917 1353393 1282739
56217 1282739 1214956 1150639 1089784 1032356 979028 930776 887571 848064 810895 775801 743187
56206G43187k9897k7031k3850k0704j8371j6917j5560j3831j2083j0691r559q605
56194E36088p936p407o636n643m817m271l803l394l011k149m96J137J545P78M3
56179D90028K6L32N94R29J216J057P31J067K110K895K861K508K410K560K968L878
56163E18170N014N642N627N657O048O385O498O803P437Q081Q917J0596J2907J4730
56149F28512J5762J7167J9905K3569K7521L2100L7877M4669N2161O0637P0280
56138A030160Q0281Q9522R7570J04221J08425J08419J03022R2683P9500O6230
56128A960033N4890M6197M0286L7151L5620L2758K5949J5522M177n985j4532k1289
56116B210777k5987k9711l4908m3158n4081o6624p9677r1082r7978r9292r6474
$$ plain form
56206 743187 713290 686259 662409 641705 623334 606417 590857 577026 564943 554252 544693 536088
56194 536088 528152 520745 514109 508466 503649 499378 495575 492181 489170 487021 486525 487662 489207 489985 490028
56179 490028 490054 490386 490980 491909 493125 494182 494913 495980 498090 500985 503846 506354 508764 511324 514292 518170
56163 518170 523184 528826 534453 540110 546158 552543 559041 565844 573281 581362 590279 600875 613782 628512
56149 628512 644274 661441 681346 704915 732436 764536 802413 847082 899243 959880 1030160
56138 1030160 1110441 1199963 1297533 1401754 1510179 1618598 1721620 1814303 1893803 1960033
56128 1960033 2014923 2061120 2101406 2138557 2174177 2206935 2232884 2248406 2252583 2246598 2232066 2210777
56116 2210777 2184790 2155079 2120171 2077013 2022932 1956308 1876631 1785549 1687571 1588279 1491805
56105A491805r1050q3028p2617o1762n2487m4833l7735l0921k4832j9578j5101
56094I57861j1626r037o585l983j882o08N03J814K625K605K801M151O082P560
56080I52281Q502R186R319Q815Q529R086R799R787R369R400J0011J0829J1734
56067A076647J2581J3024J3288J4112J5364J5887J5465J5575J7277J9575K0924
56056A249719K1205K1189K1152K1043K1068K1106K0588J9593J9015J9061J8988
56045A473727J8899J9985K2216K3726K3621K3496K4862K6913K8359K9582L1287
56034A746673L2727L3168L3574L5040L6850L7843L8408L9519M1077M2741M4974
56023B162594M7780M9930N0911N2020N4101N6077N7220N8743O1423O3920O5447
$$ plain form
56105 1491805 1400755 1317727 1245110 1183348 1130861 1086028 1048293 1017372 992540 972962 957861
56094 957861 946235 937198 930613 926630 924748 924140 924643 926457 929082 931687 934488 938639 944721 952281
56080 952281 960783 969969 979288 988103 996632 1005718 1015517 1025304 1034673 1044073 1054084 1064913 1076647
56067 1076647 1089228 1102252 1115540 1129652 1145016 1160903 1176368 1191943 1209220 1228795 1249719
56056 1249719 1270924 1292113 1313265 1334308 1355376 1376482 1397070 1416663 1435678 1454739 1473727
56045 1473727 1492626 1512611 1534827 1558553 1582174 1605670 1630532 1657445 1685804 1715386 1746673
56034 1746673 1779400 1812568 1846142 1881182 1918032 1955875 1994283 2033802 2074879 2117620 2162594
56023 2162594 2210374 2260304 2311215 2363235 2417336 2473413 2530633 2589376 2650799 2714719 2780166
56012B780166O7757P2136P6826Q0029Q3195Q8366R4406R8964J02411J06733J12145
56001C763134J17882J24695J33398J42383J49681J56130J63640J71916J79841
55992E102700J88339J98798K10356K21913K34905K50906K68658K86746L06914
55983G270235L31130L57971L85784M16694M53119M93227N34693N80191O33850
55974A1456894O95052P61519Q35896R23211J024353J138692J270874J428402J615080
55965B1149973J834159K095773K414379K802546L276530L865904M609273N543303
55957D7591840O703393Q126571R837732J1835919J4109368J6660729J9500614
55950A34366166K2617393K5954549K9356650L2418121L4317414L3881305L0018409
$$ plain form
56012 2780166 2847923 2920059 2996885 3076914 3160109 3248475 3342881 3441845 3544256 3650989 3763134
56001 3763134 3881016 4005711 4139109 4281492 4431173 4587303 4750943 4922859 5102700
55992 5102700 5291039 5489837 5700193 5922106 6157011 6407917 6676575 6963321 7270235
55983 7270235 7601365 7959336 8345120 8761814 9214933 9708160 10242853 10823044 11456894
55974 11456894 12151946 12913465 13749361 14672572 15696925 16835617 18106491 19534893 21149973
55965 21149973 22984132 25079905 27494284 30296830 33573360 37439264 42048537 47591840
55957 47591840 54295233 62421804 72259536 84095455 98204823 114865552 134366166
55950 134366166 156983559 182938108 212294758 244712879 279030293 312911598 342930007
55943C42930007K2323933J1452455r97228j3015605k2849195k9494972l2830071
55936B77519324l3381727l1940159k9261728k5957100k2485168j9157325j6145729
55929I9190388j3520163j1293544r443988p922866o672580n645521m804579m114323
55921C5772824l542674l067708k674112k345271k065421j826097j623228j449957
55913A7178356j298107j164161j047675r45650q53696p70885o98292o34337n76153
55904I189400n23932m79389m41280m06614l74992l47795l24307l02382k81801
55895E706908k63368k45931k27631k09094j92138j76439j60529j44900j30913
55886C955965j17765j03616q8728p4577o0941m7009l4485k6472k3762k4967k9654
$$ plain form
55943 342930007 365253940 376706395 375709167 362693562 339844367 310349395 277519324
55936 277519324 244137597 212197438 182935710 156978610 134493442 115336117 99190388
55929 99190388 85670225 74376681 64932693 57009827 50337247 44691726 39887147 35772824
55921 35772824 32230150 29162442 26488330 24143059 22077638 20251541 18628313 17178356
55913 17178356 15880249 14716088 13668413 12722763 11869067 11098182 10399890 9765553 9189400
55904 9189400 8665468 8186079 7744799 7338185 6963193 6615398 6291091 5988709 5706908
55895 5706908 5443540 5197609 4969978 4760884 4568746 4392307 4231778 4086878 3955965
55886 3955965 3838200 3734584 3645856 3571279 3510338 3463329 3428844 3402372 3378610 3353643 3323989
55875C323989l8535n0947o4808p8820r2518j04623j13588j19343j22451j22180
55865B416176j17528j09579j00693r1859q2815p4157o7147o1845n7370n3563n0623
55854A548997m7774m4169m0575l8231l6705l4714l2430l0984l0271k9236k7892
55843A156016k7091k6706k5841k4537k3580k2999k2244k1327k0299j8497j5921
55832I06974j4316j4843j5770j4698j2225j0889j1170j1289j0632j0479j1198
55821G69465j1503j1054j1312j2928j4394j4248j2982j1866j1276j0919j0571
55810F36412r951q823p591o868o358n107k978q39O36J447J698J670K154L505M626
55795F03633M201K668J599J383J049J97m87p24j004j390j375j113j537l032n165
$$ plain form
55875 3323989 3285454 3234507 3169699 3090879 2998361 2893738 2780150 2660807 2538356 2416176
55865 2416176 2298648 2189069 2088376 1996517 1913702 1839545 1772398 1710553 1653183 1599620 1548997
55854 1548997 1501223 1457054 1416479 1378248 1341543 1306829 1274399 1243415 1213144 1183908 1156016
55843 1156016 1128925 1102219 1076378 1051841 1028261 1005262 983018 961691 941392 922895 906974
55832 906974 892658 877815 862045 847347 835122 824233 813063 801774 791142 780663 769465
55821 769465 757962 746908 735596 722668 708274 694026 681044 669178 657902 646983 636412
55810 636412 626461 617638 610047 603179 596821 591714 588736 587897 588533 589980 591678 593348 595502 599007 603633
55795 603633 607834 610502 612101 613484 614533 614730 614243 613519 612515 611125 609750 608637 607100 604068 598903
55780E98903p656j0441j2807j3839j3590j2573j0421o509j599K805O474R981J2346
55767E41074J1357O560j1o447j2342j7159j9531j9175j7689j6291j4367j1303
55755D24676q211o531o143o119o319p068q063q744r163r496r356q329o723n126
55741C19285l806k911k607k509j864p44k71j087k488l542m180m565m426l725l224
55726B77336l501m076m230m084m153m372m266l647k658j557q01p26p87J39K310
55711B40927M707O373P299P569O731M725K482P43r23l029m956n819n928o278o993
55696B47630p387p265p192p460p651p290o297m801l034j455n59m32o98p94k80
55681A85035P68J639J673J240J426K437L086K308N72q59j572k087k696l008k684
$$ plain form
55780 598903 591247 580806 567999 554160 540570 527997 517576 511067 509468 512273 518747 528728 541074
55767 541074 552431 558991 558980 552533 540191 523032 503501 484326 466637 450346 435979 424676
55755 424676 416465 409934 403791 397672 391353 384285 376222 367478 358315 348819 339463 331134 324411 319285
55741 319285 315479 312568 309961 307452 305588 304844 304573 303486 300998 297456 293276 288711 284285 280560 277336
55726 277336 273835 269759 265529 261445 257292 252920 248654 245007 242349 240792 239991 239265 238478 238617 240927
55711 240927 245634 252007 259306 266875 273606 278331 280813 281556 280633 277604 272648 266829 260901 254623 247630
55696 247630 240243 232978 225786 218326 210675 203385 197088 192287 189253 187798 187239 186807 186109 185315 185035
55681 185035 185803 187442 189115 190355 191781 194218 197304 199612 200184 199325 197753 195666 192970 189962 187278
55666A87278j994j453j231j034m86L28P61L89k57k07O21J232R27J89p6L87J229
55649A86603K077K625K635K240J914J781J478Q87M34K60k26j454k978m207n170
55634A88899o015o338n857n161m971n023m549l610l017l057l109k625j762r65
55620A32840n27o04j121j548j334o25j83m34j070j621j970k146j988j360n58j71
55604A15580n04j279j882j972j693j303q37l26o8k82o09m95r1q2n66p93l90p0
55586A02338n44j280j188j73P75R57P02O38Q89J242J653K283L183M196N088N668
55570A26427N823N544M951M261L628K925J801J33j648k863l256l178l200l710
55556A37638m729n822o291n805m789l903l303k787k389k232k024j384o86o96j308
$$ plain form
55666 187278 185284 183831 182600 181566 181080 181408 182169 182558 182301 182094 182715 183947 184874 185063 184987 185374 186603
55649 186603 188680 191305 193940 196180 198094 199875 201353 202240 202674 202934 202708 201254 198276 194069 188899
55634 188899 182884 176546 170689 165528 160557 155534 150985 147375 144358 141301 138192 135567 133805 132840
55620 132840 132313 131709 130588 129040 127706 127081 126898 126464 125394 123773 121803 119657 117669 116309 115751 115580
55604 115580 115076 113797 111915 109943 108250 106947 106110 105784 105716 105434 104825 104330 104239 104157 103591 102798 102408 102338
55586 102338 101794 100514 99326 99153 99928 100885 101587 102225 103114 104356 106009 108292 111475 115671 120759 126427
55570 126427 132250 137794 142745 147006 150634 153559 155360 155493 153845 150982 147726 144548 141348 137638
55556 137638 132909 127087 120796 114991 110202 106299 102996 100209 97820 95588 93564 92180 91494 90798 89490
55541H9490j479p09J98K75l90j005j123q81o16o66j216j992k449k439k277k095
55525G0626j678j156j104j721k549l277m065m808m898m221l556l411l219k308
55511B8655q73P53K879N619P985Q921Q766Q609Q638Q136O849N312L932K747J908
55496A08836J548J196K48j070k031k540l066l505l220k239j413j162r54l39M12
55481I0701R41J266J226L90j020j841j349l15jn45j062j068r37r91r59n65j35
55464H3736j55n21o31j51O73J394J727J450M06j039j894j458k32O08O07L46L33
55447H5199K69k93j151j723j753j345o63O8N62P62Q93J016Q94N42M48R37J684
55430H6346K129J997J249J10p10m78N09J059O58J52L24P68Q48Q84J393J932J863
$$ plain form
55541 89490 88011 87302 87500 87775 87385 86380 85257 84376 83760 83094 81878 79886 77437 74998 72721 70626
55525 70626 68948 67792 66688 64967 62418 59141 55076 50268 45370 41149 37593 34182 30963 28655
55511 28655 27782 28535 31414 37033 45018 53939 62705 71314 79952 88088 94937 100249 104181 106928 108836
55496 108836 110384 111580 111828 110758 108727 106187 103121 99616 96396 94157 92744 91582 90628 90289 90701
55481 90701 91642 92908 94134 94524 93504 91663 90314 89999 89998 89453 88391 87323 86386 85395 84436 83871 83736
55464 83736 83581 83060 82429 82278 82951 84345 86072 87522 87928 86889 84995 83537 83305 83913 84520 84866 85199
55447 85199 85468 85175 84024 82301 80548 79203 78540 78608 79170 79932 80825 81841 82735 83277 83725 84662 86346
55430 86346 88475 90472 91721 91831 91121 90643 91152 92211 92869 93021 93345 94113 94961 95845 97238 99170 101033
55413A01033J627K031K644K195M35j532k697k910k408j586j160j488j859j409
55399I2916o00o08j401j783j329q70q48p13l56o16j691k334j604l53N3l85p25
55382G6753o80p03q97q96o63n45n80l98J76R03J446J587J203M08m31r68j082q04
55364G3829k83J23J12r7l8K57K97Pp3K55M33M1m50l71K13P13P71L58m07j073r28
55343G3689J40J184J125k9j296j818j449n72J70K15l74q27n27J96N12J24m91p56
55325F9216m85J62Q09R84M91k62n71j79M54O39J62n44r44j071j411k004k047r14
55307F2485O96J386Q49K64O09J355J328L48o49q66m19L5P8o8J30P66J193Q37J93
55288G0550L36J414K313K162J315N61N4l42m41j48J9l56p95n90Q4M73L00j49o71
$$ plain form
55413 101033 102660 104691 107335 109530 109965 108433 105736 102826 100418 98832 97672 96184 94325 92916
55399 92916 92316 91708 90307 88524 87195 86325 85477 84764 84408 83792 82101 79767 78163 77810 77863 77478 76753
55382 76753 76073 75370 74473 73577 72914 72369 71789 71391 71567 72470 73916 75503 76706 77114 76683 75715 74633 73829
55364 73829 73546 73669 73781 73684 73646 73903 74200 74207 74134 74389 74822 74863 74413 74042 74255 74968 75739 76097 75690 74617 73689
55343 73689 73829 75013 76138 76109 74813 72995 71546 70974 71144 71359 70985 70158 69631 69827 70339 70463 69972 69216
55325 69216 68731 68893 69702 70686 71177 70915 70344 70165 70619 71258 71420 70876 69932 68861 67450 65446 63399 62485
55307 62485 63181 64567 65416 65680 66289 67644 68972 69320 68671 67805 67386 67421 67499 67431 67561 68327 69520 70357 70550
55288 70550 70886 72300 74613 76775 78090 78651 78705 78363 77922 77774 77793 77437 76642 76052 76136 76609 76909 76760 76089
55269G6089j102r36M4J031J006K44rO05J076O43j86o39p65r14q54k34N66Q42N56
55250G7063K19pm09r52j068m73L59P37N18M8l96p50r22p50k78J70L01J54j0nJ57
55229G3706L06K46o2l33j44N50J238J368R22L05j63m12m76m45m61m90k99J17L49
55210G5822J94O7K68K98l30r88p02J09oj263k054j271L8K58m66p37n2P28Q06K48
55190G0967m90r16m40J085K730L181K162N64p90j685j905j065N50J762J651N72
55174G7933m11p18n63l62k34q4J48L75M88N30N82N55K96QJ61P59J096O12l21r09
55154G9941r11o04j68L21M89l0r71j635j724j370o04N16J404J351N48j6J72O43
55136G7352Q19P38O82P03P64Q19O54R5m83n39k35k23m70k25N88R52K77o21p74
$$ plain form
55269 76089 74987 74051 74095 75126 76132 76376 76367 76972 78048 78691 78505 77866 77101 76187 75333 75099 75665 76507 77063
55250 77063 77282 77275 76866 75914 74846 74373 74732 75469 75987 76035 75639 74889 73967 73217 72939 73109 73410 73564 73554 73549 73706
55229 73706 74012 74258 74196 73863 73719 74269 75507 76875 77797 78102 77939 77527 77051 76606 76145 75655 75356 75473 75822
55210 75822 76016 76083 76351 76649 76319 75331 74629 74738 74732 73469 71415 70144 70182 70440 69974 69237 69185 69913 70719 70967
55190 70967 70477 69561 69121 70206 72936 76117 78279 78843 78053 76368 74463 73398 73948 75710 77361 77933
55174 77933 77522 76804 76241 75879 75645 75561 75709 76084 76572 77102 77684 78239 78535 78543 78704 79463 80559 81171 80850 79941
55154 79941 79030 78426 78258 78579 79068 79038 78067 76432 74708 73338 72734 73250 74654 76005 76553 76537 76709 77352
55136 77352 78171 78909 79591 80294 81058 81877 82531 82626 82143 81604 81369 81146 80676 80451 81039 81991 82268 81647 80873
55117H0873m62n04p76n04L62J068J178R43N66Jn36o23l77m37r71j256n93P95J957
55098H0704K101J197j6n71j67M71M28k86q61q39n88n02l71J19P46J045R37O86
55080H4233M23J35q7j57k32m98q18q82o59l52l6L05M64K12j31J50J136J883J497
55061H6586K99n45m46N6J41l78j108j615j656j230o78m95p22p84j91P23J203J070
55043H0230Q58R29R68O00O8j20j3j79p94j268r64n1P08Q62O93O94R40J134J049
55024H6344O88J64l59o66o39m43l62m84p15r54j052p17J24R50J118P57O63J180
55006H5597J725J736J433J227R34K42m84o46m19m98r41j066n62P3L49L05Q9l07
54988H8787n78j44Q87J503J052J70j98j72n12j193j304m10P82J336J073M68rk07
$$ plain form
55117 80873 80411 79907 79131 78627 78989 80057 81235 82178 82744 82745 82209 81586 81209 80772 79801 78545 77952 78747 80704
55098 80704 82805 84002 83986 83415 83248 83719 84147 83861 83000 82161 81573 81071 80700 80819 81565 82610 83547 84233
55080 84233 84656 84791 84704 84547 84315 83817 82999 82117 81458 81106 81070 81375 81839 82051 81920 82070 83206 85089 86586
55061 86586 86885 86340 85894 85950 86091 85713 84605 82990 81334 80104 79426 78931 78209 77425 77234 77957 79160 80230
55043 80230 81088 82017 82985 83585 83653 83533 83520 83341 82547 81279 80315 80264 80972 81834 82527 83221 84161 85295 86344
55024 86344 87032 87196 86837 86171 85532 85089 84727 84243 83528 82574 81522 80805 80929 81879 82997 83754 84417 85597
55006 85597 87322 89058 90491 91718 92652 92894 92410 91764 91345 90847 89906 88840 88278 88351 88700 89005 89094 88787
54988 88787 88209 88065 88952 90455 91507 91677 91479 91307 90795 89602 88298 87888 88670 90006 91079 91547 91538 91331
54970I1331k06j54p0K60R42J649J888J617J234R60O51K51m4k22n43r68r89m19
54952I7168J32R4k04q4L28L22j71m21j23P2l81j033j188r72r68j192j145p15k59
54933H9260J68R13J920K457K054J227Q67J173J574J546J179R85J387K400L691
54918A12801M804N385N296M756M381M749N596N816M691K831J337K68j222l304
54904A58185n061n903o335o822o829n844m531l849l542k665j327o56j042j506
54890A02273j172m11o9k67n17m74j01N40J247J699J835J975K331K703K897L113
54874A17602L617M346N086N809O481O801O467N507M026J906p94l336m795n115
54860A53608n127n416n633n287m721m674n023m712l162j218j94l77r62j278j385
$$ plain form
54970 91331 91125 90971 90901 91161 92103 93752 95640 97257 98491 99451 100102 100353 100309 100087 99544 98576 97587 97168
54952 97168 97300 97394 97190 97106 97434 97756 97585 97164 97041 97113 96732 95699 94511 93539 92571 91379 90234 89519 89260
54933 89260 89428 90341 92261 94718 96772 97999 98866 100039 101613 103159 104338 105323 106710 109110 112801
54918 112801 117605 122990 128286 133042 137423 142172 147768 153584 158275 161106 162443 162711 161489 158185
54904 158185 153124 147221 140886 134064 127235 121391 116860 113011 109469 106804 105477 104821 103779 102273
54890 102273 101101 100690 100621 100354 99837 99363 99262 99802 101049 102748 104583 106558 108889 111592 114489 117602
54874 117602 121219 125565 130651 136460 142941 149742 156209 161716 165742 167648 166854 163518 158723 153608
54860 153608 148481 143065 137432 132145 127424 122750 117727 113015 109853 108635 108441 108064 107102 105824 104439
54845A04439j495j509j384j363j517j556j380j320j449j229l83M27M87J41K30
54830I1139P42R12N15J00n0k55n53m35J83N72K45k70k52J50K67l6k93k08jJ1j35
54809I2348o5N16J345J694J212N38N41J060J060J73p34q61n26m23n03l36o0j46
54791I6833m79n03j34J55J45J10J58j4n15q41m06P44J919K397K003J226P55P74
54773A04327Q43N11l1j24O81K293M205N734O352O138N812O003O523O733O475O251
54757A68726O304N995M472J754j159l330m745n993p260p986p544o026m199k838
54743A36171k272k344k605k665k622k816l050k494r11N19M62p40j481j053l51
54728A11748j81p8O61J730K386K540K561K618K913L882N303N994N267M172M080
$$ plain form
54845 104439 102944 101435 100051 98688 97171 95615 94235 92915 91466 90237 89854 90281 90768 90909 91139
54830 91139 91881 92793 93308 93408 93358 93103 92550 92115 92298 92870 93115 92845 92593 92743 93010 92974 92681 92473 92472 92483 92348
54809 92348 92283 92799 94144 95838 97050 97588 98129 99189 100249 100422 99688 98827 98301 97878 97375 97039 96979 96833
54791 96833 96354 95851 95717 95872 96017 96127 96285 96271 95756 94915 94509 95253 97172 99569 101572 102798 103553 104327
54773 104327 105170 105681 105650 105526 106207 108500 112705 118439 124791 130929 136741 142744 149267 156000 162475 168726
54757 168726 175030 181025 185497 187251 186092 182762 178017 172024 164764 156778 149234 143208 139009 136171
54743 136171 133899 131555 128950 126285 123663 120847 117797 115303 114392 114911 115373 114633 113152 112099 111748
54728 111748 111567 111489 112150 113880 116266 118806 121367 123985 126898 130780 136083 142077 147344 151516 155596
54713A55596M584M133K463Q74m0j307l613n767o222n267m578m959n573n282l982
54698A21060k431j367j109j614k588l516l853l333k235j213p72q27q86o19j05
54683I4592L75O38O29M16J45l2r3q0J6J83L26L57L29L35L35J77k16p79j307j524
54663I4822j295q43n63n70n73k57M26J328K102K163J192j98q58m86Mj62n76n00
54645I5156j20q3k69j3O70J044Q28N49N67N54J29n78j186j412j072k94L13K50
54627I5033r3R9Q27J226Q54K46r3l78q54j158q95l13J20M26P88R55N15m01j137
54608I5767j190o13J74O76O41K45q3p9K41Q65J705K325K181J307L18l54p79r82
54590A02365p38j97m2n59j073q64j36M42P24J014J232R39J65l85j45O02J035O99
$$ plain form
54713 155596 160180 164313 166776 167650 167610 166303 162690 156923 150701 145434 140856 135897 130324 125042 121060
54698 121060 118629 117262 116153 114539 111951 108435 104582 101249 99014 97801 97029 96202 95316 94697 94592
54683 94592 94967 95605 96234 96650 96795 96763 96670 96590 96606 96789 97115 97472 97801 98136 98471 98648 98432 97653 96346 94822
54663 94822 93527 92684 92121 91551 90978 90721 91147 92475 94577 96740 97932 97734 96876 96390 96394 96232 95656 95156
54645 95156 95036 94953 94684 94671 95341 96385 97213 97762 98329 98883 99012 98434 97248 95836 94764 94470 94783 95033
54627 95033 94940 95039 95866 97092 97946 98192 98099 97721 96867 95709 94814 94501 94621 95047 95835 96790 97305 96904 95767
54608 95767 94577 93964 94138 94814 95455 95700 95617 95538 95779 96644 98349 100674 102855 104162 104480 104126 103347 102365
54590 102365 101627 101430 101388 100829 99756 98892 98756 99198 99922 100936 102168 103107 103272 102887 102742 103344 104379 105078
54572A05078J2j35N82J416J352L13q29j480j890k320k364j584k93P66J265J333
54556A01222J104P06M08L33K93K22M66J150J706J559R23L34k02q75j261p46M15
54539A07757J319J679K004K437K383J577O69L40M19L76J55%j22m45r30j268j180
54522A17170n28N97J585J504K9j920k913k404j131j97Nj05NL70O73P88R27J150
54504A15605R86mj447k357k269j681j242r25l41M87J098J222J010P38N31L96K90
54487A12097J31l4l7J65L49L77N10J004J565J612J088O08O55R72R62M20l45q33
54469A21266o16M30J824K612K226J164M85O52J158J225N57n95j669k043j464m31
54453A26781K02J69J4J55K37j85p88r04n76m82q57j147r12m15j08L9K71M65K56
$$ plain form
54572 105078 105090 104955 105537 106953 108305 108618 107789 106309 104419 102099 99735 98151 97858 98624 99889 101222
54556 101222 102326 103032 103440 103773 104066 104288 104754 105904 107610 109169 110092 110426 110224 109349 108088 107342 107757
54539 107757 109076 110755 112759 115196 117579 119156 119825 120165 120584 120960 121115 121115 120993 120548 119618 118350 117170
54522 117170 116642 117239 118824 120328 120357 118437 115524 113120 111989 111792 111797 111692 111697 112067 112740 113528 114455 115605
54504 115605 116591 116587 115140 112783 110514 108833 107591 106666 106325 106812 107910 109132 110142 110880 111411 111807 112097
54487 112097 112228 112194 112157 112322 112671 113048 113558 114562 116127 117739 118827 119435 120090 121062 122024 122444 122099 121266
54469 121266 120650 121080 122904 125516 127742 128906 129391 130043 131201 132426 132983 132388 130719 128676 127212 126781
54453 126781 126983 127152 127166 127321 127558 127373 126585 125681 125105 124623 123766 122619 121707 121292 121184 121223 121494 121959 122215
54434A22215l95j091j369j035k28O50J164J159Q48N72N34O89P53L62m75j128r02
54417A22323J18J119J508J384R93L14m97q44m33J56J56m05r27j133j032l60J077
54400A23517K552K852J882R54J036J510J272M43M8L41M60j67r49j026m39J01J63
54383A34550j83q08j578k029j666o74Q8J34J9N92J824K750K512J211k96j136r84
54366A34326j56O71R34N97R1j07J24M57L80k87j071j215m49P12J604K009J976
54349A40596J438M68l30l07L87R60J001Q25P74O43L9j036k154k837k875k551k399
54332A32642k470k090q95K31M2j212j917j214k0M99L93J87k47j063j474o27Q20
54315A21585J304L62r00j427j284r50n36n7K24J86P9R7O4j31k35l1L21N88Q45
$$ plain form
54434 122215 121820 120729 119360 118325 118097 118747 119911 121070 121918 122490 123024 123713 124466 124828 124353 123225 122323
54417 122323 122441 123560 125068 126452 127445 127759 127262 126418 125985 126141 126297 125892 124965 123832 122800 122440 123517
54400 123517 126069 128921 130803 131757 132793 134303 135575 136018 136066 136407 136867 136700 135751 134725 134286 134387 134550
54383 134550 134367 133559 131981 129952 128286 127612 127700 127834 127853 128445 130269 133019 135531 136742 136446 135310 134326
54366 134326 134170 134841 135775 136372 136463 136356 136480 136937 137317 137030 135959 134744 134295 135007 136611 138620 140596
54349 140596 142034 142502 142172 141865 142252 143212 144213 145038 145812 146455 146494 145458 143304 140467 137592 135041 132642
54332 132642 130172 128082 127187 127418 127460 126248 124331 123117 123097 123596 123989 124176 123929 122866 121392 120765 121585
54315 121585 122889 123251 122351 120924 119640 118690 118154 118097 118321 118507 118586 118683 118747 118616 118381 118350 118671 119259 120104
54296A20104J224J481J192L55m44o13k20O9k06p54r94r05r28j073q06m5M91L67
54278A18295J53M53Q41O08Rj87m4k28o33m21N00J179J096Q31R22J043Q40O74Q74
54259A26805R74M32l85o47j50N85J022R52M09l42r06j136j152r14k42N17N55k92
54241A26085j058p90K54J107J288R74L96k26m83j32M07M51j78j086j791j874j103
54224A22241N5N34q1p97m41P21J449J309R70Q02L61m76r22l94N37R05N78J62M0
54205A27553J06J77K40K86K32lm87j198j886k172j957j541j275j220j151p16L01
54188A15289J572K194J576L74o6O47J425J158O4q33j056q99o79m84m84p80r82
54171A18036n70K79Q13P59O22P45O75o1j039j365q07K5N31O69O58N42K75n4k96
$$ plain form
54296 120104 121328 122809 124001 124356 123912 123299 123079 123148 122942 122188 121194 120289 119361 118288 117482 117437 117928 118295
54278 118295 118448 118901 119742 120350 120359 120172 120128 119900 119267 118846 119346 120525 121621 122452 123374 124417 125257 125931 126805
54259 126805 127779 128211 127826 127179 127029 127614 128636 129588 129997 129655 128749 127613 126461 125547 125305 125822 126377 126085
54241 126085 125027 124237 124491 125598 126886 127860 128256 128030 127547 127415 127822 128273 128095 127009 125218 123344 122241
54224 122241 122296 122830 122749 121952 121511 122232 123681 124990 125960 126762 127123 126647 125725 125331 125868 126773 127351 127513 127553
54205 127553 127659 127836 128076 128362 128594 128591 128104 126906 125020 122848 120891 119350 118075 116855 115704 114988 115289
54188 115289 116861 119055 120631 121005 120939 121586 123011 124169 124233 123400 122344 121445 120766 120282 119798 119018 118036
54171 118036 117466 117745 118558 119317 119939 120684 121359 121298 120259 118894 118087 118112 118643 119312 119970 120512 120787 120733 120437
54152A20437m07m16l44k72l45n66o65m22MJ83Pj41J46P17R95P11K50J45M04N73
54132A20994M25K37K66L27J73N6M35J216J745J615J060L96l90j147j183l5J605
54115A27795K383J798O49j06l77n12m56J15J014J498J120K71l04k64P4J76j34
54098A34740n20m89J6M75L30l61r38q22j02O20Q30N34J12q7j1J81L37M16M99O60
54078A36420Q74R07N06j95n82j00J044J991K134J707J348J225R87M64L7J27O13
54061A49507J053J378J996L113M312N016N231N505O160O841O932O180M763K939
54047B10926Q67j257l065m061l896k689j125L2N47P53R82J262J603K147K791L136
54031B08953L089L183L751M272M058L326K872K821K605K146K132K815L435L265
$$ plain form
54152 120437 120030 119614 119270 118998 118653 118087 117422 117000 117004 117187 117194 117053 117199 117916 118911 119622 119872 120017 120421 120994
54132 120994 121419 121656 121922 122249 122422 122478 122913 124129 125874 127489 128549 128945 128555 127408 126225 126190 127795
54115 127795 130178 131976 132625 132519 132142 131630 131174 131289 132303 133801 134921 135192 134888 134624 134698 134874 134740
54098 134740 134220 133731 133747 134222 134552 134191 133253 132431 132329 132949 133779 134313 134425 134338 134327 134508 134845 135261 135760 136420
54078 136420 137294 138201 138707 138512 137930 137830 138874 140865 142999 144706 146054 147279 148266 148730 148767 148894 149507
54061 149507 150560 151938 153934 157047 161359 166375 171606 177111 183271 190112 197044 203224 207987 210926
54047 210926 211793 210536 207471 203410 199514 196825 195700 195732 196279 197032 198014 199276 200879 203026 205817 208953
54031 208953 212042 215225 218976 223248 227306 230632 233504 236325 238930 241076 243208 246023 249458 252723
54017B52723K529J681M96j330l152l939l662l337l617m102m227m143m320m693
54003B16907m703m049l104k562k830l685m453m503l662k267q68J11N42N61L27
53988A81762j10o89j171j362j476j922k617k913k475j872j861k309k351j577n48
53973A56509QJ03K32N76Q09O90M99P24J423K147K475K410K227K074J956J954K148
53956A78964K397K510K627L007L427L270K398J452J051J063J015Q42Q21J006J214
53941B07064J417J721K138K618L148L494L170K184J444J843K980L545K988K136
53927B41890K058K842L793M316M288L948L715L924M469M888M940M909N248O114
53913C01342P294Q416R144R472R832J0615J1550J1860J1120R592P652N304K494
$$ plain form
54017 252723 255252 256933 257429 256099 252947 249008 245346 242009 238392 234290 230063 225920 221600 216907
54003 216907 212204 208155 205051 202489 199659 195974 191521 187018 183356 181089 180221 180332 180874 181435 181762
53988 181762 181652 180963 179792 178430 176954 175032 172415 169502 167027 165155 163294 160985 158634 157057 156509
53973 156509 156517 156620 156852 157428 158237 158927 159426 160150 161573 163720 166195 168605 170832 172906 174862 176816 178964
53956 178964 181361 183871 186498 189505 192932 196202 198600 200052 201103 202166 203181 204023 204844 205850 207064
53941 207064 208481 210202 212340 214958 218106 221600 224770 226954 228398 230241 233221 236766 239754 241890
53927 241890 243948 246790 250583 254899 259187 263135 266850 270774 275243 280131 285071 289980 295228 301342
53913 301342 308636 317052 326196 335668 345500 356115 367665 379525 390645 400237 407889 413193 415687
53900D15687n36l405n815p476q221q458r006j0037j0674j0124q924q372q857r443
53886C06339r156q100p032o371n976n635n357n216n140m900m257l191k074j543
53872B32391j995l133m105m243l716l337l621m135l992l000j951j638j881j865
53858A89779j283p08p28j128j194o19J65N09J82n07j027r96l92M73J136J262Q23
53841A85747J01m50m60M9N60M71k87j150j538j441j264j250j307j347j467j733
53825A73234j974j903j296j34J158J796J379O11O44J569K139J458K84K9Q43J594
53809A81431J543J172J268J979L027M179N120N434N091M620M510M720N005N233
53795B34332N172M441L168K222K252K760K766K109J451J123O86j59r12r50m62
$$ plain form
53900 415687 415151 411746 405931 398455 390234 381776 372770 362733 352059 341935 333011 324639 315782 306339
53886 306339 297183 289083 282051 275680 269704 264069 258712 253496 248356 243456 239199 236008 233934 232391
53872 232391 230396 227263 223158 218915 215199 211862 208241 204106 200114 197114 195163 193525 191644 189779
53858 189779 188496 187788 187060 185932 184738 184119 184284 184793 184975 184468 183441 182445 182053 182526 183662 184924 185747
53841 185747 185848 185398 184938 184987 185547 186018 185731 184581 183043 181602 180338 179088 177781 176434 174967 173234
53825 173234 171260 169357 168061 167927 169085 170881 172260 172871 173515 175084 177223 178681 178965 178994 179837 181431
53809 181431 182974 184146 185414 187393 190420 194599 199719 205153 210244 214864 219374 224094 229099 234332
53795 234332 239504 243945 247113 249335 251587 254347 257113 259222 260673 261796 262482 262323 261411 260461 259999
53780B59999k99r58k086k938l207l294l787m693n338n202m599m252m246l943l049
53765B08108k214k171k631k654j985j369j440j843j844j408j169j507k115k490
53751A81268k435k023j454j038r72j020p05LN35M69P9r1P9L34N17O65Q07R88J235
53732A77241J323Q55o4o04k07O07R94R93J202J562J467J041J137J827J962Q21
53716A92157p22j391j108o19j77N03J340J848J924J926K060K209K277K238J967
53701B06432J548J484K051K706K820K786L465M602M801L370J392M55Q57J541J464
53686B41774N21o57j431j670j727j880j924j482o19K51R15J361J326N33o25j256
53670B33410j095p92q48r09n36k8J25L7P2O5k88o48m28J54K11n52j441j752j520
$$ plain form
53780 259999 259700 258742 256656 253718 250511 247217 243430 238737 233399 228197 223598 219346 215100 211157 208108
53765 208108 205894 203723 201092 198438 196453 195084 193644 191801 189957 188549 187380 185873 183758 181268
53751 181268 178833 176810 175356 174318 173346 172326 171621 171624 172159 172628 172707 172616 172695 173029 173546 174211 175018 176006 177241
53732 177241 178564 179419 179355 178751 178544 179151 180145 181138 182340 183902 185369 186410 187547 189374 191336 192157
53716 192157 191435 190044 188936 188317 188140 188643 189983 191831 193755 195681 197741 199950 202227 204465 206432
53701 206432 207980 209464 211515 214221 217041 219827 223292 227894 232695 236065 237457 237912 238769 240310 241774
53686 241774 242295 241638 240207 238537 236810 234930 233006 231524 230905 231156 232071 233432 234758 235291 234666 233410
53670 233410 232315 231523 230675 229766 229230 229202 229327 229364 229436 229501 229213 228565 228137 228291 228502 227950 226509 224757 223237
53651B23237j107o31j62J0k83o92o13J90J390K370K560J840P47J18K48O16O36
53634B30474M49O66J418K094K095J562J119J077J181J119J017J163J488J618J520
53619B50060J618K142K674K755K644K974L777M440M634M667M714M381L443K580
53605B97503K680L657M512M517L774K679J484N04J80O01J272J746K143K696L047
53590C32995K480Q52j085k383k714k428k074k006k276k729l201l635l994m072
53576C03730l633k773j989j654j571j261o51j79j08r1K92P57O07k04q39o51n4
53559B89728J18j20N2R80J919J974J219M95M10R27J758K670L454L924M096M127
53543C17731M080L827L272K499J810J697K578M267N865O554O534O768P779R124
$$ plain form
53651 223237 222130 221499 221337 221347 221064 220372 219759 219949 221339 223709 226269 228109 228856 228974 229222 229838 230474
53634 230474 230923 231589 233007 235101 237196 238758 239877 240954 242135 243254 244271 245434 246922 248540 250060
53619 250060 251678 253820 256494 259249 261893 264867 268644 273084 277718 282385 287099 291480 294923 297503
53605 297503 300183 303840 308352 312869 316643 319322 320806 321310 321490 322091 323363 325109 327252 329948 332995
53590 332995 335475 336327 335242 332859 330145 327717 325643 323637 321361 318632 315431 311796 307802 303730
53576 303730 300097 297324 295335 293681 292110 290849 290198 290019 289911 289820 290112 290869 291476 291272 290433 289782 289728
53559 289728 289846 289726 289778 290758 292677 294651 295870 296365 296775 297702 299460 302130 305584 309508 313604 317731
53543 317731 321811 325638 328910 331409 333219 334916 337494 341761 347626 354180 360714 367482 375261 384385
53529C84385J0112J0600J0822J0942J1096J1513J2092J2239J1606J0859J1064
53518E07330J2344J3843J5010J6218J7829J9398K0348K0931K1731K2605K2933
53507G10520K2824K3102K3852K3906K2407K0216J8988J9125J9545J9356J8905
53496I42746J8830J8944J8556J7563J6566J6085J6107J6370J6650J6749J6536
53485A131702J6180J6013J6103J6097J5626J4669J3467J2222J0974R621Q012O105
53473A286791M117K343P07j265l852o689r160j1171j3176j5375j7215j7962j7621
53460A180472j6992j6792j7080j7571j8203j9066k0040k0799k1214k1388k1323
53449I70004k0905k0203j9524j8912j7972j6431j4601j3040j1847j0663r166p401
$$ plain form
53529 384385 394497 405097 415919 426861 437957 449470 461562 473801 485407 496266 507330
53518 507330 519674 533517 548527 564745 582574 601972 622320 643251 664982 687587 710520
53507 710520 733344 756446 780298 804204 826611 846827 865815 884940 904485 923841 942746
53496 942746 961576 980520 999076 1016639 1033205 1049290 1065397 1081767 1098417 1115166 1131702
53485 1131702 1147882 1163895 1179998 1196095 1211721 1226390 1239857 1252079 1263053 1272674 1280686 1286791
53473 1286791 1290908 1293251 1293958 1292693 1288841 1282152 1272992 1261821 1248645 1233270 1216055 1198093 1180472
53460 1180472 1163480 1146688 1129608 1112037 1093834 1074768 1054728 1033929 1012715 991327 970004
53449 970004 949099 928896 909372 890460 872488 856057 841456 828416 816569 805906 796740 789339
53437G89339n638m195l244k541j486K09J992L069L495M182N737P704R234J0172
53423H18029J1043J2247J3685J5153J6672J8253J9615K0422K0802K1371K2644
53412A009936K4484K6355K8004K9729L1900L4362L6543L7979L8749L9416M0652
53401A378109M2719M5194M7313M8672M9475N0050N0497N0872N1392N2104N2660
53390A919057N2751N2464N1831N0397M7828M4704M2018L9969L7879L5294L2444
53379B406636K9501K6145K2188J7999J3969R998N825J437l189q317j4051k0087
53367B488054k6157l2402l8859m4938m9817n3148n5102n5987n6162n6011n5635
53356A963836n4720n3079n1082m9297m7936m6890m6004m4966m3374m1387l9964
$$ plain form
53437 789339 783701 779506 776262 773721 772235 772444 774436 777505 781000 785182 790919 798623 807857 818029
53423 818029 829072 841319 855004 870157 886829 905082 924697 945119 965921 987292 1009936
53412 1009936 1034420 1060775 1088779 1118508 1150408 1184770 1221313 1259292 1298041 1337457 1378109
53401 1378109 1420828 1466022 1513335 1562007 1611482 1661532 1712029 1762901 1814293 1866397 1919057
53390 1919057 1971808 2024272 2076103 2126500 2174328 2219032 2261050 2301019 2338898 2374192 2406636
53379 2406636 2436137 2462282 2484470 2502469 2516438 2526436 2532261 2533698 2530509 2522192 2508141 2488054
53367 2488054 2461897 2429495 2390636 2345698 2295881 2242733 2187631 2131644 2075482 2019471 1963836
53356 1963836 1909116 1856037 1804955 1755658 1707722 1660832 1614828 1569862 1526488 1485101 1445137
53345A445137l9865m0518m0511l9109l6823l4523l2469l0382k8054k5641k3527
53334A073715k1918k0530j8871j6845j4910j3412j2174j0989j0145r925r923r404
53322I04669q261p095o406o169o059n630m362k078O12K729L830M217M438M994
53308H79429O306Q356J0342J1397J1695J2303J3826J5825J7654J9264K0821K2183
53296A049401K3195K4081K5139K6190K6767K6726K6461K6461K6710K6480K4897
53285A332508K2046J9227J7615J6794J5210J2153Q486N304K618j65l141n892q229
53272A434534j0367j2485j4608j6710j8661k0284k1623k2975k4381k5500k6224
53261A220716k6982k8036k8924k9156k9130k9628l0579l1046l0430k9065k7565
$$ plain form
53345 1445137 1405272 1364754 1324243 1285134 1248311 1213788 1181319 1150937 1122883 1097242 1073715
53334 1073715 1051797 1031267 1012396 995551 980641 967229 955055 944066 933921 923996 914073 904669
53322 904669 896408 889313 882907 876738 870679 865049 860687 858609 859221 861950 865780 869997 874435 879429
53308 879429 885735 894091 904433 915830 927525 939828 953654 969479 987133 1006397 1027218 1049401
53296 1049401 1072596 1096677 1121816 1148006 1174773 1201499 1227960 1254421 1281131 1307611 1332508
53285 1332508 1354554 1373781 1391396 1408190 1423400 1435553 1444039 1449343 1451961 1451796 1448655 1442763 1434534
53272 1434534 1424167 1411682 1397074 1380364 1361703 1341419 1319796 1296821 1272440 1246940 1220716
53261 1220716 1193734 1165698 1136774 1107618 1078488 1048860 1018281 987235 956805 927740 900175
53250I00175k6181k4975k4044k3336k2654k2134k2278k3164k3947k3622k2177
53239F41663k0502j9249j8198j6840j5212j3839j2988j2377j1553j0348q935p734
53227D73888p259p721q565q747p873o793o664p563q536q943r065r269r231q510
53213C59149p443o849p048p526p562o863n682m676m476n021n428m899l742l094
53199B78840l554m515n026m932m835n143n508n323m413l143j947j000l88l01q15
53184B27997j563j987j961j891k074k237j976j348p54l71p6J14k0m81r32j188
53168B09252j455j903k232k026j410r35q68r44q68p15o48n84m26l81o18q06m86
53151A91947J46L50j00n35l37K23M83L27J32M5r2k67l23m13q50j447j543p87N04
$$ plain form
53250 900175 873994 849019 824975 801639 778985 756851 734573 711409 687462 663840 641663
53239 641663 621161 601912 583714 566874 551662 537823 524835 512458 500905 490557 481622 473888
53227 473888 466629 458908 450343 441596 433723 426930 420266 412703 404167 395224 386159 376890 367659 359149
53213 359149 351706 344857 337809 330283 322721 315858 310176 305500 301024 296003 290575 285676 281934 278840
53199 278840 275286 270771 265745 260813 255978 250835 245327 240004 235591 232448 230501 229501 229113 228812 227997
53184 227997 226434 224447 222486 220595 218521 216284 214308 212960 212206 211835 211759 211873 211853 211372 210440 209252
53168 209252 207797 205894 203662 201636 200226 199291 198423 197479 196611 195896 195248 194664 194238 193857 193239 192433 191947
53151 191947 192093 192443 192343 191808 191471 191694 192177 192504 192636 192681 192589 192322 191999 191586 190736 189289 187746 186959 187463
53132A87463J794K668K700J689J93o96n29NR5k12l84k89j16K02Q65J625J935J677
53114B00685J253R70P05K76k67p87j244j577j585j090k07O13Q49L38n03j041j089
53097A96299j010j119j312j376j388j507j610j461j044n52j70q7m31r35r84l37
53081A80976M35O63M60L95N44N12K79L04P26J045R13O35N90O14L07l57j064j614
53063A86363j938j909j454q42m94n51p76q45o27j83K87M72K01l54p46o56j64M15
53045A76199Q89J245J411J194N50j98p08j080j634k227k148j047M06J121P46j27
53029A74592q10j155j348j411j210o72Q0Q52J483J933K183K054J270j27j550k326
53013A73838k352k059j771j392p33J53R66J351J073L51o7M42J525K078J540N95
$$ plain form
53132 187463 189257 191925 194625 196314 196507 195811 195282 195287 195382 195170 194786 194497 194381 194583 195448 197073 199008 200685
53114 200685 201938 202908 203613 203889 203622 202835 201591 200014 198429 197339 197132 197745 198594 198932 198429 197388 196299
53097 196299 195289 194170 192858 191482 190094 188587 186977 185516 184472 183920 183750 183663 183232 182297 181313 180976
53081 180976 181411 182074 182534 182929 183473 183985 184264 184568 185294 186339 187252 187887 188477 189091 189398 189041 187977 186363
53063 186363 184425 182516 181062 180220 179726 179175 178399 177554 176927 176744 177031 177503 177704 177350 176604 175948 175784 176199
53045 176199 177088 178333 179744 180938 181488 181290 180582 179502 177868 175641 173493 172446 172852 173973 174719 174592
53029 174592 173782 172627 171279 169868 168658 167986 168066 168918 170401 172334 174517 176571 177841 177714 176164 173838
53013 173838 171486 169427 167656 166264 165531 165684 166650 168001 169074 169425 169358 169800 171325 173403 174943 175538
52997A75538K57N73P04J26p57j224j001k55P23J558J766J164K78r7K00N45M63
52980A80561K51L44L66m13j724k193j000R35K044J980J669J715J702J248Q70J202
52964A89557J898K024J349N54K23K58L90P09J227J405O28q93k210k676k530k317
52948A89596k125j686j028n36m26m89m48l11k18k55m75r28j476j766j580j112
52932A74737p24n73o37q69j120j037m46K58M54Q2k28K8N98Q78O99L95K35Q0k51
52913A72559o23p09m03L6J78k50j088j654j249M4J172J140J60o62p36n08m63l09
52895A66635L08R04P56O7k91j02ll31n90k80M60J296K083K491K003O87n84j160
52877A74349j286j360j173m35M67R94J187J291J120N77L50J101K205K338J256
$$ plain form
52997 175538 175795 176368 177072 177198 176441 175217 174216 173961 174684 176242 178008 179172 179450 179353 179553 180098 180561
52980 180561 180812 181156 181522 181109 179385 177192 176192 177127 179171 181151 182820 184535 186237 187485 188355 189557
52964 189557 191455 193479 194828 195382 195605 195863 196253 196962 198189 199594 200222 199329 197119 194443 191913 189596
52948 189596 187471 185785 184757 184221 183795 183306 182858 182547 182329 182074 181599 180671 179195 177429 175849 174737
52932 174737 174013 173440 172803 171934 170814 169777 169331 169589 170043 170125 169897 169925 170523 171401 172100 172495 172730 172810 172559
52913 172559 171936 171227 170824 170860 171038 170788 169700 168046 166797 166841 168013 169153 169313 168651 167915 167407 166944 166635
52895 166635 166943 167847 168603 168670 168379 168277 168274 167943 167353 167073 167533 168829 170912 173403 175406 176093 175509 174349
52877 174349 173063 171703 170530 170095 170562 171556 172743 174034 175154 175731 176081 177182 179387 181725 182981
52862A82981Q0l25l12n34r07q91l42L88Q24O31j67j048j376j135r08j088j445
52845A74426j611j551j413j306j324j492j535j092l29J22L1l4M78J225J327M93
52829A66415n57r02m05K68N42N69P91J024O06n31j488j520r69o04n15l20j8J99
52811A62585O18J629K735K962K266J672J820K217K107J279j74k007l487l773k997
52796A69452k232k022j784j044l35k25l73k69k03o26j135j002k65M42Q13Q35L53
52779A60380m77p35K27J569J837R20J10J57M10J87l6M47J227J175n6j548k155
52762A63639j613n79J42K79Q5r7j30o2j4j32l96m25J57J069J510J148O28O64J024
52743A66897Q93M2q52j032l75O86J618K156K406K567K504J887Q54J60K76P81J034
$$ plain form
52862 182981 183061 182736 182424 181890 180983 180092 179750 180138 180962 181593 181426 180378 179002 177867 176959 175871 174426
52845 174426 172815 171264 169851 168545 167221 165729 164194 163102 162773 162895 162926 162892 163370 164595 165922 166415
52829 166415 165858 164956 164551 164819 165361 165930 166721 167745 168351 167820 166332 164812 163843 163239 162724 162404 162386 162585
52811 162585 163203 164832 167567 170529 172795 174467 176287 178504 180611 181890 181716 179709 176222 172449 169452
52796 169452 167220 165198 163414 162370 162035 161810 161437 161168 160965 160339 159204 158202 157937 158379 159192 160027 160380
52779 160380 159903 159168 159395 160964 162801 163721 163831 163988 164398 164585 164549 164996 166223 167398 167342 165794 163639
52762 163639 162026 161447 161589 161868 161953 161856 161726 161664 161650 161518 161122 160697 160854 161923 163433 164581 165209 165873 166897
52743 166897 167790 167832 166980 165948 165573 166259 167877 170033 172439 175006 177510 179397 180251 180411 180687 181468 182502
52726A82502J065J243J393R88P9o23o55k70R1K11l6p74j844k778l141k794j902
52709A72755r25m12m59n42k14J92M9o34j300j653j752j398k54J373K513K519J586
52692A71444K36j057j740j410m32L02N07P77J462J963J620O75j15m19l25J22P78
52675A74388J149Q58J94k81m54n17m55j86jk33o20o33k98m5J92R31K041K533J847
52656A80410O86Q0J68N25J168K357L590L801K684J075k76j517k781l352k599j290
52640A84729q33j365j618q86k3Mm06k58M39Q88R59J377K405L278L240K524J904
52623A96358J658J374N70p40j999k567k292j664j233j040q20n45l93l27k31l43
52607A85766r90j803j811n76J207K420K489J522Q1r68r44m1P49P80L90J73J08
$$ plain form
52726 182502 183567 184810 186203 187191 187270 186647 185992 185722 185813 186024 185988 185214 183370 180592 177451 174657 172755
52709 172755 171830 171418 170959 170417 170203 170395 170444 169810 168510 166857 165105 163707 163453 164826 167339 169858 171444
52692 171444 171680 170623 168883 167473 167041 167343 167850 168627 170089 172052 173672 174347 174232 173813 173488 173610 174388
52675 174388 175537 176395 176589 176308 175854 175337 174882 174696 174695 174462 173842 173209 172911 172866 173058 173989 176030 178563 180410
52656 180410 181096 181176 181344 181869 183037 185394 188984 192785 195469 196544 196268 194751 191970 188618 186019 184729
52640 184729 183896 182531 180913 180027 180004 180008 179602 179344 179783 180671 181630 183007 185412 188690 191930 194454 196358
52623 196358 198016 199390 199960 199220 197221 194654 192362 190698 189465 188425 187605 187060 186667 186340 186109 185766
52607 185766 184776 182973 181162 180586 181793 184213 186702 188224 188305 187337 186393 186352 187101 187881 188271 188444 188552
52590A88552q9k43J9N37Q05P19N80M72K75J96N79J133J027N2r13r67k97K32J83
52571A92852j92n73q48q46l27N87J303J321P40J0n50r02j084j113j104j164j168
52554A86942q54k24K97K66k28o41n72j52K27L99M79N43M67K30J27M50R62J040
52536A89758M48k83n10l02k32m57m77O1P79J074R13P34P69Q39P41M78J27k35l79
52517A93846p9N27R06O69%n02l66M21J423K072K094J737J520J634J723J320M62
52500B09407k92m65k26j88o78j310j500j214j016j261j597j429o86Q3L48R3k36
52483A97833j52M35J114J383J216J064J242J491J329O74p7m24j24O66J439J639
52467B10748J197N93K65J55Pj96k90j86K23J091K136K471J509j09j087j022p82
$$ plain form
52590 188552 188463 188220 188239 188776 189581 190300 190880 191352 191627 191823 192402 193535 194562 194614 193701 192734 192437 192669 192852
52571 192852 192660 192087 191239 190393 190066 190653 191956 193277 194017 194027 193477 192575 191491 190378 189274 188110 186942
52554 186942 186088 185864 186161 186427 186199 185558 184986 184834 185061 185460 185939 186482 186949 187179 187306 187756 188718 189758
52536 189758 190206 189923 189413 189111 188879 188422 187945 188006 188785 189859 190772 191506 192275 193114 193855 194333 194460 194225 193846
52517 193846 193767 194294 195200 195869 195869 195367 195001 195422 196845 198917 201011 202748 204268 205902 207625 208945 209407
52500 209407 209115 208650 208424 208236 207558 206248 204748 203534 202518 201257 199660 198231 197545 197628 197976 198069 197833
52483 197833 197681 198116 199230 200613 201829 202893 204135 205626 206955 207629 207552 207128 207004 207670 209109 210748
52467 210748 211945 212538 212803 212958 212965 212769 212479 212293 212516 213607 215743 218214 219723 219614 218527 217505 216723
52450B16723j277k291k833k318j203n12q66j861k479k175j329n23K27J024J350
52435A99657N35j089k248k160j303n74k59q8J36M30P95J195J465J462J151N78
52419A99683m7k66J77Q18Q77L27P1Q35K256L422L957M240M699N347N937O345O704
52402B45382P115P232O332M091J122j570l523m883n730n971n837n797n788n191
52388B26984l802k281j274o13K03J114J554J196L49k89j55O48J339J243O59N43
52372B27418J288K328K998L157K875K161J368J175J755K379K306J573O82Jj77
52357B53287L59J210J457Q11Q6P0M99P55Q74J132J227Q21M02O61J347J650J557
52340B68205J815K643L411L595L341K990K822L202M276N538O372O983P959R030
$$ plain form
52450 216723 215446 213155 210322 208004 206801 206289 205423 203562 201083 198908 197579 197056 197283 198307 199657
52435 199657 200192 199103 196855 194695 193392 192818 192559 192471 192607 193037 193832 195027 196492 197954 199105 199683
52419 199683 199636 199370 199547 200365 201242 201569 201640 202475 204731 208153 212110 216350 221049 226396 232333 238678 245382
52402 245382 252497 259729 266061 270152 271274 269704 266181 261298 255568 249597 243760 237963 232175 226984
52388 226984 223182 220901 219627 219014 219217 220331 221885 223081 223430 223141 222986 223634 224973 226216 226875 227418
52372 227418 228706 231034 234032 237189 240064 242225 243593 244768 246523 248902 251208 252781 253463 253464 253287
52357 253287 253646 254856 256313 257124 257210 257280 257779 258534 259408 260540 261767 262588 262990 263651 264998 266648 268205
52340 268205 270020 272663 276074 279669 283010 286000 288822 292024 296300 301838 308210 315193 323152 332182
52326C32182R275Q661Q357R117J0318J1078J1436J1861J2260J2277J2068J2011
52314D60901J1926J1268J0059Q999Q667Q983R510R845R709R001Q003P325P395
52301E81591P920Q118P547O621O048N870N443M407L134J992P04j026k748l777
52287F31844m185m512m689m122k859j823j666k048k326k255j770o94Q58K293L211
52272F05257L858M550N099N284N493O293P583Q671R107Q980Q522P895P312P029
52258G00933P054P222P507Q028Q618Q706P872O455N372N190N499N324M174K430
52244G90384P30o30j558j879j702j748k650l992m758m693m601n004n314m751l568
52229G44266k700k523k538k164j375n43o0r6m45o34l49K54Q75J600K764M302N543
$$ plain form
52326 332182 341457 350118 358475 367592 377910 388988 400424 412285 424545 436822 448890 460901
52314 460901 472827 484095 494154 503153 511820 520803 530313 540158 549867 558868 566871 574196 581591
52301 581591 589511 597629 605176 611797 617845 623715 629158 633565 636699 638691 639395 638369 635621 631844
52287 631844 627659 623147 618458 614336 611477 609654 607988 605940 603614 601359 599589 598895 599753 602046 605257
52272 605257 609115 613665 618764 624048 629541 635834 643417 652088 661195 670175 678697 686592 693904 700933
52258 700933 707987 715209 722716 730744 739362 748068 755940 762395 767767 772957 778456 783780 787954 790384
52244 790384 791114 790484 788926 787047 785345 783597 780947 776955 772197 767504 762903 757899 752585 747834 744266
52229 744266 741566 739043 736505 734341 732966 732423 732363 732267 731822 731188 730839 731093 731968 733568 736332 740634 746177
52212G46177N844N354M917N134N675N687M903M078M018M504M570L781K669J866
52198H09177J394J070J069J589K308K718K794K885K987K651J706O39J12K75O73
52183H34047P04P5j041k226l114l592l775l948m451n347o185o306n590m644m094
52168G80513l877l490k761j995j457j030m65K88R93J303J103P59R08J680K317
52153G74789J912N40p23r84l79M25J094J652J972J763J043J74n85j230j640j548
52137G78275j074q46j192j525j001L69J782K752L559M550N608O635Q004J0058
52123H15954J2442J4455J5873J7054J8315J9552K0455K0796K0501J9684J8507
52112A013588J7002J5212J3572J2658J2255J1161Q522N068K384J147P00K22m35
$$ plain form
52212 746177 752021 757375 762292 767426 773101 778788 783691 787769 791787 796291 800861 804642 807311 809177
52198 809177 810571 811641 812710 814299 816607 819325 822119 825004 827991 830642 832348 832987 833099 833374 834047
52183 834047 834751 834826 833785 831559 828445 824853 821078 817130 812679 807332 801147 794841 789251 784607 780513
52168 780513 776636 773146 770385 768390 766933 765903 765438 765726 766719 768022 769125 769884 770792 772472 774789
52153 774789 776701 777241 776518 775534 775155 775580 776674 778326 780298 782061 783104 783278 782693 781463 779823 778275
52137 778275 777201 776355 775163 773638 772637 773006 774788 777540 781099 785649 791257 797892 805896 815954
52123 815954 828396 842851 858724 875778 894093 913645 934100 954896 975397 995081 1013588
52112 1013588 1030590 1045802 1059374 1072032 1084287 1095448 1103970 1109038 1111422 1112569 1113269 1113491 1113056
52099A113056j054j503j582j115m15j85p31j694k723l874n239o685q149r676j0901
52084A057530j1142j0290r064q060p069n737m296l069j805k00J374K322K798L463
52070A006755M508N545O408P362Q396R011Q848Q128P278O530N925N415M802L873
52056A098784K690J564P01J07k51m84r18j815k961l853m379m947n890p129q490
52041A062729j0006j1620j2958j3662j3783j3588j3087j2013j0252q065n980m560
52029I33155m124m524n093n131m496l701l408l854m750n581n939n732n247m992
52015H66583n332o117o727o529n477m360m318n868q260j0108j0865j1376j2568
52002G68678j3979j4395j3841j3875j5406j7274j7772j6881j5898j5349j4542
$$ plain form
52099 1113056 1112002 1110499 1108917 1107802 1107387 1107202 1106471 1104777 1102054 1098180 1092941 1086256 1078107 1068431 1057530
52084 1057530 1046388 1036098 1027034 1018974 1011905 1006168 1001872 998803 996998 996798 998172 1000494 1003292 1006755
52070 1006755 1011263 1016808 1023216 1030578 1038974 1047985 1056833 1064961 1072239 1078769 1084694 1090109 1094911 1098784
52056 1098784 1101474 1103038 1103739 1103846 1103595 1103111 1102193 1100378 1097417 1093564 1089185 1084238 1078348 1071219 1062729
52041 1062729 1052723 1041103 1028145 1014483 1000700 987112 974025 962012 951760 943695 937715 933155
52029 933155 929031 924507 919414 914283 909787 906086 902678 898824 894074 888493 882554 876822 871575 866583
52015 866583 861251 855134 848407 841878 836401 832041 827723 821855 813595 803487 792622 781246 768678
52002 768678 754699 740304 726463 712588 697182 679908 662136 645255 629357 614008 599466
51991E99466j3066j1412r903q287o779o345p187p943p331n929n338o056p221q040
51977D88629q523q846q991r116r453r646q851o835m447k753k000j629j000R7J429
$$ plain form
51991 599466 586400 574988 565085 556798 550019 543674 536487 528544 521213 515284 509946 503890 496669 488629
51977 488629 480106 471260 462269 453153 443700 434054 425203 418368 413921 411168 409168 407539 406539 406636 408065
$$ [...]
##END NTUPLES=NMR SPECTRUM
##END=
