
##TITLE=UV1105_M1_1161-1249_7180398_DhJc3Gqx7S
##JCAMPDX= 6.0         $$ Bruker NMR JCAMP-DX V2.0
##DATA TYPE= NMR SPECTRUM
##DATA CLASS= NTUPLES
##ORIGIN= BRUKER
##OWNER= Administrator
$$ 1.72 TOPSPIN		Version 2.1
$$ 2012-12-04 22:13:51.939 -0500  Administrator@X
$$ Compression mode = diff/dup
##.OBSERVE FREQUENCY= 400.02188249412
##.OBSERVE NUCLEUS= ^1H
##.ACQUISITION MODE= SIMULTANEOUS (DQD)
##.ACQUISITION SCHEME= undefined
##.AVERAGES= 8
##.DIGITISER RES= 22
##SPECTROMETER/DATA SYSTEM= spect
##.PULSE SEQUENCE= zg30
##.SOLVENT NAME= COFFEE_meoh
##.SHIFT REFERENCE= INTERNAL, COFFEE_meoh, 1, 14.98509
##AUDIT TRAIL= $$ (NUMBER, WHEN, WHO, WHERE, PROCESS, VERSION, WHAT)
$$ ##TITLE= Audit trail, TOPSPIN		Version 2.1
$$ ##JCAMPDX= 5.01
$$ ##ORIGIN= Bruker BioSpin GmbH
$$ ##OWNER= Administrator
$$ $$ E:\/data/COFFEE/nmr/UV1105_M1_1161-1249_7180398_DhJc3Gqx7S/10/pdata/1/auditp.txt
$$ ##AUDIT TRAIL=  $$ (NUMBER, WHEN, WHO, WHERE, PROCESS, VERSION, WHAT)
(   1,<2012-12-04 22:13:43.674 -0500>,<Administrator>,<X>,<go>,<TOPSPIN 2.1>,
      <created by zg
	started at 2012-12-04 22:12:37.674 -0500,
	POWCHK enabled, PULCHK disabled,
       configuration hash MD5:
       86 BA 57 50 F2 9D 5C 9B 26 00 A9 28 5F 66 2E 89
       data hash MD5: 64K
       81 DF B3 54 2A BA 07 7D 46 1B 50 8E 2A 3F 19 32>)
(   2,<2012-12-04 22:13:46.783 -0500>,<Administrator>,<X>,<proc1d>,<TOPSPIN 2.1>,
      <Start of raw data processing
       efp LB = 0 FT_mod = 6 PKNL = 1 PHC0 = 0 PHC1 = 0 SI = 32K 
       data hash MD5: 32K
       DF 09 46 A5 F8 F2 41 2D 7F 1B E1 72 AA 45 06 93>)
(   3,<2012-12-04 22:13:47.252 -0500>,<Administrator>,<X>,<proc1d>,<TOPSPIN 2.1>,
      <pk PHC0 = 98.66821 PHC1 = 0 
       data hash MD5: 32K
       E7 54 03 73 D1 0F C7 3A 86 48 2B 2D 1A AC 4D F9>)
(   4,<2012-12-04 22:13:47.486 -0500>,<Administrator>,<X>,<proc1d>,<TOPSPIN 2.1>,
      <abs ABSG = 1 
       data hash MD5: 32K
       A5 54 71 04 75 E2 76 9C 70 92 E9 44 3F 6A D4 3C>)
(   5,<2012-12-04 22:13:47.627 -0500>,<Administrator>,<X>,<proc1d>,<TOPSPIN 2.1>,
      <abs ABSG = 2 
       data hash MD5: 32K
       FE 1F 3D A1 2C AD 34 E1 7A A8 F5 8C 02 EA 1C 28>)
(   6,<2012-12-04 22:13:47.767 -0500>,<Administrator>,<X>,<proc1d>,<TOPSPIN 2.1>,
      <abs ABSG = 3 
       data hash MD5: 32K
       7F 57 89 64 54 03 E1 CB D1 85 F3 F6 AD 11 E3 8E>)
(   7,<2012-12-04 22:13:47.908 -0500>,<Administrator>,<X>,<proc1d>,<TOPSPIN 2.1>,
      <abs ABSG = 4 
       data hash MD5: 32K
       46 C8 42 29 C4 E6 2E 5C 05 78 FC 14 71 E3 B1 9F>)
(   8,<2012-12-04 22:13:48.064 -0500>,<Administrator>,<X>,<proc1d>,<TOPSPIN 2.1>,
      <abs ABSG = 5 
       data hash MD5: 32K
       A2 F2 C5 D3 B5 EE 4B A5 43 63 69 61 75 68 E1 5C>)
$$ ##END=
$$ 
$$ $$ hash MD5
$$ $$ 43 72 D0 D2 22 29 A8 8D 30 2C C8 A4 48 DA 6C 7F
##$RELAX= 
##$RELAX= 
##$RELAX= 
##$RELAX= 
##$RELAX= 
##$RELAX= 
##$RELAX= 
$$ Bruker specific parameters
$$ --------------------------
##$DU= <E:\>
##$EXPNO= 10
$$ [...]
150 150 150 150 150 150 150 150
##$TP07= 0
##$TPNAME0= <>
##$TPNAME1= <>
##$TPNAME2= <>
##$TPNAME3= <>
##$TPNAME4= <>
##$TPNAME5= <>
##$TPNAME6= <>
##$TPNAME7= <>
##$TPOAL= (0..7)
0.5 0.5 0.5 0.5 0.5 0.5 0.5 0.5
##$TPOFFS= (0..7)
0 0 0 0 0 0 0 0
##$TUNHIN= 0
##$TUNHOUT= 0
##$TUNXOUT= 0
##$USERA1= <user>
##$USERA2= <user>
##$USERA3= <user>
##$USERA4= <user>
##$USERA5= <user>
##$V9= 5
##$VALIST= <valist>
##$VCLIST= <CCCCCCCCCCCCCCC>
##$VD= 0
##$VDLIST= <DDDDDDDDDDDDDDD>
##$VPLIST= <PPPPPPPPPPPPPPP>
##$VTLIST= <TTTTTTTTTTTTTTT>
##$WBST= 2048
##$WBSW= 25
##$XGAIN= (0..3)
0 0 0 0
##$XL= 0
##$YL= 0
##$YMAX_a= 674844
##$YMIN_a= -575562
##$ZGOPTNS= <>
##$ZL1= 120
##$ZL2= 120
##$ZL3= 120
##$ZL4= 120
##$ABSF1= 14.98509
##$ABSF2= -5.573092
##$ABSG= 5
##$ABSL= 3
##$ALPHA= 0
##$AQORDER= 0
##$ASSFAC= 0
##$ASSFACI= 0
##$ASSFACX= 0
##$ASSWID= 0
##$AUNMP= <proc_prof1d_extract_pilot.lims>
##$AXLEFT= 0
##$AXNAME= <>
##$AXNUC= <1H>
##$AXRIGHT= 0
##$AXTYPE= 0
##$AXUNIT= <>
##$AZFE= 0.1
##$AZFW= 0.1
##$BCFW= 0
##$BC_mod= 0
##$BYTORDP= 0
##$COROFFS= 0
##$CY= 15
##$DATMOD= 1
##$DC= 0
##$DFILT= <>
##$DTYPP= 0
##$F1P= 0
##$F2P= 0
##$FCOR= 0.5
##$FTSIZE= 32768
##$FT_mod= 6
##$GAMMA= 0
##$GB= 0
##$INTBC= 1
##$INTSCL= 1
##$ISEN= 128
##$LB= 0
##$LEV0= 0
##$LPBIN= 0
##$MAXI= 10000
##$MC2= 0
##$MEAN= 0
##$ME_mod= 0
##$MI= 0
##$NCOEF= 0
##$NC_proc= -8
##$NLEV= 6
##$NOISF1= 0
##$NOISF2= 0
##$NSP= 0
##$NTH_PI= 0
##$NZP= 0
##$OFFSET= 14.98509
##$PC= 1
##$PHC0= 98.66821
##$PHC1= 0
##$PH_mod= 1
##$PKNL= yes
##$PPARMOD= 0
##$PPDIAG= 0
##$PPIPTYP= 0
##$PPMPNUM= 2147483647
##$PPRESOL= 1
##$PSCAL= 4
##$PSIGN= 0
##$PYNMP= <proc.py>
##$REVERSE= no
##$SF= 400.02
##$SI= 32768
##$SIGF1= 0
##$SIGF2= 0
##$SINO= 400
##$SIOLD= 32768
##$SPECTYP= <>
##$SREGLST= <1H.CDCl3>
##$SSB= 0
##$STSI= 32768
##$STSR= 0
##$SW_p= 8223.68421052631
##$SYMM= 0
##$S_DEV= 0
##$TDeff= 65536
##$TDoff= 0
##$TI= <>
##$TILT= no
##$TM1= 0
##$TM2= 0
##$TOPLEV= 0
##$USERP1= <user>
##$USERP2= <user>
##$USERP3= <user>
##$USERP4= <user>
##$USERP5= <user>
##$WDW= 1
##$XDIM= 32768
##$YMAX_p= 478499275
##$YMIN_p= -660049
##$CURPLOT= <Network HP LaserJet P1505>
##$CURPRIN= <$Network HP LaserJet P1505>
##$DFORMAT= <normdp>
##$LAYOUT= <+/1D_H.xwp>
##$LFORMAT= <normlp>
##$PFORMAT= <normpl>
##$SURQMSG= 1
$$ End of Bruker specific parameters
$$ ---------------------------------
##NTUPLES= NMR SPECTRUM
##VAR_NAME=  FREQUENCY,     SPECTRUM/REAL,   SPECTRUM/IMAG
##SYMBOL=    X,             R,               I
##VAR_TYPE=  INDEPENDENT,   DEPENDENT,       DEPENDENT
##VAR_FORM=  AFFN,          ASDF,            ASDF
##VAR_DIM=   32768,         32768,           32768
##UNITS=     HZ,            ARBITRARY UNITS, ARBITRARY UNITS
##FACTOR=    0.250966925370066, 1,           1
##FIRST=     8223.43324360094, -34727,       166708
##LAST=      0,             -30315,          -46057
##MIN=       0,             -660049,         0
##MAX=       8223.43324360094, 478499275,    0
$$ Real data points
##PAGE= N=1
##DATA TABLE= (X++(R..R)), XYDATA
$$ [...]
$$ plain form
19542 -39512 -35404 100158 14726 -305155 -122156 -12462 48941 138869 -226388 -139691 28514
19530 -202773 -370583 -267176 -107177 -90125 -262599 -273764 14882 99254 -93120 150019
19519 -243928 128632 -22460 245461 81358 52757 -134114 -32787 -27680 -157798 62062 -130345
19507 188606 19495 297156 -162231 -148773 -265301 194034 -204744 -38744 305168 -44183
19496 -299474 116068 78105 218525 -239474 -111115 -56939 -107257 -16608 -149146 -193177
19486 -193177 -36611 112650 36169 -135852 -12913 -424888 44668 64696 -246832 -132589
19476 -132589 -116411 -226460 -265535 -248256 230985 -163839 261250 -102289 1488 -63358 144362
19464 -141273 -44239 -200343 224777 147845 -319603 -90489 157673 -266956 308780 2538
$$ packed form
19542c9512M108A00158A4726c05155a22156a2462D8941Q9928b26388Q6697B8514
19530b02773j67810J03407a07177J7052j72474j1165A4882Q4372i3120A50019
19519b43928A28632b2460B45461H1358k8601a34114c2787N107j30118F2062a30345
19507A88606A9495K77661a62231J3458j16528A94034b04744c8744C05168d4183
19496b99474A16068l7963J40420b39474a11115N4176n0318a6608j32538m4031
19486a93177c6611A12650C6169a35852a2913m11975D4668K0028b46832J14243
19476a32589J6178j10049l9075J7279B30985a63839B61250a02289A488f3358A44362
19464a41273d4239j56104B24777p6932c19603i0489A57673b66956C08780B538
$$ plain form
19453 -17908 -36127 50066 -54153 134381 158175 280959 -352824 50294 15893 -75239 -260994
19442 -260994 736 -15359 -196663 100702 -204144 -89058 118384 -601106 -403028 -34971 112996
19430 -307521 80585 -125451 -99149 -76707 -139824 -183746 102982 -50248 -448450 260965 -62531
19418 5388 206197 52112 -108359 -104244 25166 4459 76681 111481 158384 -84549 -18498 -413207
19406 -413207 28977 -145379 -90592 -111537 110380 -135103 4779 9367 -337816 -146006 -79513
19395 -79513 -36876 226870 80663 300402 -368370 -42790 50950 -205489 -186898 -54786 -133795
19384 -133795 197328 -28732 -186198 32329 -111353 -217752 53338 -20529 -153792 -152472 -70349
19372 -91744 -22526 -236143 -173081 -72183 -90875 -43850 -17437 121107 125116 -307998 89012
$$ packed form
19453a7908j8219E0066e4153A34381K3794J22784c52824E0294A5893g5239j85755
19442b60994G36a5359j81304A00702b04144h9058A18384f01106J98078c4971A12996
19430c07521H0585a25451K6302K2442o3117m3922A02982e0248l98202B60965f2531
19418E388K00809E2112a08359M115B5166D459P2222L4800M6903h4549a8498l94709
19406d13207B8977a45379N4787k0945A10380a35103D779M588c37816a46006O6493
19395g9513c6876B26870H0663K19739c68370d2790E0950b05489J8591e4786p9009
19384a33795A97328b8732j57466C2329a11353j06399E3338b0529j33263J320g0349
19372i1744b2526k13617O3062g2183j8692d3850a7437A21107M009c07998H9012
$$ plain form
19360 -61364 90963 -194997 -237535 -296582 2382 -348107 101567 -121065 -214830 27432 -233756
19348 -5720 -50429 122071 -82932 -175388 -281723 -149346 22466 -97510 69191 242955 -301161
19336 168930 -18189 264493 -102773 152215 -45521 -473630 123509 -243879 -178985 -173687
19326 -173687 -12346 -108587 362009 -153647 59742 62534 -50340 5178 -250601 -85114 176850
19314 -67948 41669 -5066 127692 -428498 23797 186616 -138537 99515 179270 -119004 -187252
19303 -187252 13063 -234516 66437 -125804 20273 -205911 74311 218292 -222209 340478
19292 -36064 223571 180051 -22614 87237 -51158 80250 306664 94461 458431 -91183 131345
19280 20475 -356390 -104405 119872 174877 88413 226098 -104208 -140603 99376 43686 -579692
$$ packed form
19360f1364I0963a94997m2538n9047B382c48107A01567a21065r3765B7432b33756
19348e720m4709A22071h2932r2456j06335J32377B2466i7510F9191J73764c01161
19336A68930a8189B64493a02773A52215d5521m28109A23509b43879O4894N298
19326a73687a2346r6241C62009a53647E9742K792e0340E178b50601h5114A76850
19314f7948D1669e066A27692d28498B3797J62819a38537I9515P9755a19004o8248
19303a87252A3063b34516F6437a25804B0273b05911G4311J43981b22209C40478
19292c6064B23571m3520b2614H7237e1158H0250K26414I4461L63970i1183A31345
19280B0475c56390a04405A19872N5005q6464J37685a04208l6395I9376D3686e79692
$$ plain form
19268 -209971 12206 -78982 26689 115440 174552 -13567 -425 -248241 66503 -35282 43621 -56737
19255 -122542 60039 -97359 -485758 182441 -234252 -303384 72065 -28241 -107436 -94212 -111831
19244 -111831 -59132 -151427 34587 15660 -171729 -142409 260442 74641 263710 98278 -302873
19232 215442 62936 57392 113360 200546 174653 -343413 65580 -449765 305640 356519 -179327
19220 -269612 11701 -299773 -138267 76890 -385674 -134255 -174655 -6225 51299 -173802 33771
19208 60119 -236735 -194334 258801 227496 -107147 -145528 -241639 -142694 -186638 351122 143770
19196 -133232 -83369 -198939 131070 -173028 120761 235177 1906 -272725 203970 -248843
19185 21039 55237 -287335 34486 65005 98075 236198 -26002 -138821 -157355 -414020 -55083
$$ packed form
19268b09971A2206g8982B6689Q8751N9112a3567d25k47816F6503c5282D3621e6737
19255a22542F0039i7359l88399A82441b34252o9132G2065b8241p9195J3224j7619
19244a11831N2699r2295C4587A5660a71729K9320B60442G4641J89069I8278c02873
19232B15442F2936n544N5968Q7186k5893c43413F5580d49765C05640N0879a79327
19220b69612A1701b99773a38267G6890c85674a34255m0400f225E1299a73802C3771
19208F0119b36735M2401B58801l1305a07147l8381r6111R8945m3944C51122A43770
19196a33232M9863j15570A31070a73028A20761J14416A906b72725B03970b48843
19185B1039L4198b87335C4486L0519L3070J38123b6002j12819j8534k56665e5083
$$ plain form
19173 -36017 -35306 -129655 -147492 -202508 181420 -99418 -271029 -185689 -56342 -82641 -463778
19162 -463778 -1081 -322703 -47416 254042 6422 -71726 132918 156310 -152227 -70588 -128877
19151 -128877 939 124776 -199503 -127115 19709 -116455 -183154 -87167 172997 1400 6473
19140 6473 -279385 -62773 -189999 -215178 -281093 133621 -29683 54027 368901 171583 199865
19129 199865 -34409 52734 -133017 -68850 -73755 -289363 -107220 -326402 41982 139038 -347752
19117 44138 35089 -88407 34444 104729 27869 -365531 -61512 -19767 -299646 -3541 -341621
19106 -341621 -20878 348509 -304307 184039 119238 -266280 -98068 -175692 75930 -184221
19095 -41833 -54238 -288893 -224481 65352 114833 112050 49031 -253044 20960 -96911 -55835
$$ packed form
19173c6017P11r4349j7837n5016A81420i9418j71611Q5340e6342k6299l81137
19162d63778a081l21622d7416B54042F422g1726A32918K3392a52227g0588n8289
19151a28877I39J23837a99503P2388A9709a16455o6699h7167A72997A400N073
19140F473b79385f2773j27226k5179o5915A33621b9683E4027L14874A71583K8282
19129A99865c4409E2734a33017O4167m905k15608a07220k19182D1982R7056c47752
19117D4138r049h8407C4444P0285B7869c65531f1512a9767k79879c541l38080
19106c41621b0878C48509c04307A84039o4801b66280i8068p7624G5930a84221
19095d1833j2405k34655O4412F5352M9481k783D9031b53044B0960i6911M1076
$$ plain form
19084 -55835 -399485 -103350 -151068 -264846 3949 -78113 -39787 144656 -26158 -168957 15951
19072 181412 334976 -54927 207997 177740 231533 7623 57190 69916 11423 -44194 50173
19060 257219 -325581 -209749 -2085 89053 177155 24057 -128598 44953 120521 324572 -390831
19048 -29941 -280251 -217897 134353 -470850 124780 -250906 191075 -238964 -577663 -21043
19037 42891 -173150 -5224 208582 -150653 173136 108077 69843 409836 13244 -8826 56379
19025 116364 251377 497131 -68848 -120641 -71819 -69485 -151807 51063 -78014 81861 -239466
19013 -133110 -297193 -89121 53536 -174301 -69568 74154 -9867 3195 165370 -189055 -197901
19002 -197901 -347 -147192 43167 -69791 -376671 -142924 -148874 -59105 106955 -106897 158826
$$ packed form
19084e5835l43650a03350m7718j13778C949g8113L8326A44656b6158j42799A5951
19072A81412J53564e4927B07997l0257N3793G623M9567J2726A1423d4194E0173
19060B57219c25581J15832b085H9053Q8102B4057a28598D4953P5568K04051c90831
19048b9941k50310O2354A34353d70850A24780b50906A91075b38964l38699b1043
19037D2891a73150e224B08582a50653A73136o5059l8234L39993A3244h826E6379
19025A16364J35013K45754f8848n1793M8822K334q2322E1063g8014H1861b39466
19013a33110j64083h9121E3536a74301f9568G4154i867C195J62175a89055q846
19002a97901c47j46845D3167f9791l06880a42924n950e9105A06955a06897A58826
$$ plain form
18990 -383539 -26532 354492 -28002 -201387 -211577 -210237 -132905 12049 109120 -130096 -277554
18979 -277554 -216181 -158912 -39136 -280904 174369 71774 -7330 -230443 104988 174678 -554524
18967 -427459 -280782 -249294 -111686 -150015 -273893 -89634 43944 -144537 150238 -106393
18956 -320269 -163868 136772 -102610 -36234 -28209 121465 12424 -68847 -199809 -400597
18946 -400597 -415098 -8412 -61231 394377 215478 -62690 226050 -89978 111763 280321 -290619
18934 -129536 -189756 154869 -129235 17636 11026 -239 -251951 287477 -46234 -248886 36281
18922 62220 40183 -23648 -310374 -169974 -160886 -134758 238735 -67365 -264366 -89020 204763
18910 219124 -54885 -185162 -99567 10605 -54003 -89595 94689 -104710 149096 -146296 37081
$$ packed form
18990c83539b6532C54492b8002j73385j0190J340P7332A2049R7071a30096j47458
18979b77554O1373N7269c9136k41768A74369G1774g330k23113A04988O9690e54524
18967d27459J46677L1488a11686l8329j23878h9634D3944a44537A50238a06393
18956c20269J56401A36772a02610c6234Q025A21465A2424f8847j30962k00788
18946d00597j4501h412n2819C94377j78899f2690B26050h9978A11763J68558b90619
18934a29536o0220A54869a29235A7636o610b39k51712B87477d6234k02652C6281
18922F2220k2037b3648k86726J40400R088K6128B38735f7365j97001h9020B04763
18910B19124e4885j30277Q5595A0605e4003l5592I4689a04710A49096a46296C7081
$$ plain form
18898 184602 186103 20388 42724 -59404 -20844 62265 115812 -309698 -232547 -10113 4114 -245154
18885 -14069 32161 98188 32788 2934 56027 -236168 -308487 -109044 -205235 -87779 -131210
18874 -131210 -373570 -65564 -66255 -29323 33818 -355844 -188178 -194205 24460 80027 -19942
18862 -42761 -297658 81524 56155 -175329 -162424 267668 -87083 -245156 -14206 -188087 28109
18850 -203215 109849 -160223 -241688 3348 -172407 100519 80343 -85998 -14569 116803 -80838
18838 -159217 -4115 132912 -179241 335299 -27319 3868 -121673 -48297 -167933 -13444 -18268
18827 -18268 -106087 -352189 29061 -112735 20034 -23301 -16001 226819 -198893 -16395 -346129
18816 -346129 26814 -13403 -205933 -13060 76993 -91772 206148 414892 67044 -7619 -45545
$$ packed form
18898A84602J501B0388K2336e9404b0844F2265N3547c09698P7151a0113D114b45154
18885a4069C2161O6027C2788B934N3093b36168p2319a09044r6191h7779m3431
18874a31210k42360f5564o91b9323C3818c55844J67666o027B4460N5567a9942
18862d2761k54897H1524k5369a75329J2905B67668h7083j58073a4206j73881B8109
18850b03215A09849a60223q1465C348a72407A00519k0176h5998a4569A16803h0838
18838a59217d115A32912a79241C35299b7319C868a21673d8297j19636a3444m824
18827a8268q7819k46102B9061a12735B0034b3301P300B26819a98893a6395l29734
18816c46129B6814a3403j92530a3060G6993i1772B06148K08744F7044g619l7926
$$ plain form
18805 -45545 -142059 -8889 67957 -308277 -163366 -203935 58867 78681 -186808 31762 133693
18794 133693 -91759 -160466 -342722 404025 -85955 -48257 -302159 180402 -182491 -122884
18784 -122884 64725 -77155 1145 -175632 95397 139600 -57798 -40096 213540 -344086 -130656
18772 -30278 169539 -80454 -66251 -422111 -28209 169505 181440 -86932 60182 -37843 -309872
18761 -309872 172714 -114242 270381 43800 -215271 91 76307 177569 3263 13841 -173602
18749 -298745 -150468 211305 67550 75490 -9776 155942 96863 123865 -333316 -295873 -217445
18738 -217445 -30037 -145851 -227840 153845 -52521 -184520 -13638 -21624 -169169 -340233 -355012
18727 -355012 -61901 -408945 -178044 38875 -41410 -120986 312873 -42119 -125072 -379438 -58695
$$ packed form
18805d5545r6514h889F7957c08277J44911m0569E8867J9814a86808C1762J01931
18794A33693i1759o8707j82256D04025h5955L7698k53902A80402a82491N9607
18784a22884F4725g7155A145a75632I5397M4203e7798J7702B13540c44086a30656
18772c0278A69539h0454J4203l55860b8209A69505J1935h6932F0182c7843k72029
18761c09872A72714a14242B70381D3800b15271I1P6216J01262C263J0578a73602
18749b98745J48277B11305F7550P940i776A55942n9079K7002c33316L7443P8428
18738b17445c0037j15814q1989A53845e2521j31999a3638p986j47545j71064j4779
18727c55012f1901l47044a78044C8875d1410p9576C12873d2119q2953k54366e8695
$$ plain form
18715 -63978 2739 -8118 444 -104017 -71170 72202 -158308 63652 -34409 -190477 110193 33937
18702 33268 27995 27668 273217 39156 -268817 -286987 -245495 -272378 10240 115702 -341153
18690 26076 -14213 194241 50847 129527 -68127 -142522 10416 -205038 -145944 166420 -401682
18678 -397379 -75558 -78676 -149786 -267006 207267 10550 -336101 -99512 -98039 -138416 74371
18666 -116372 -264813 -78282 -137165 -1425 -192854 -6025 -9218 33658 -311318 178779 10815
18654 99602 -356216 99413 -134437 -350302 145045 -2342 -71328 -184047 30794 -166457 -250681
18643 -250681 108968 -451803 156371 -43222 -86273 -61435 -44442 163518 -151696 -116851
18633 -116851 -104561 7299 -64182 -290079 -6852 -105511 -168225 -24080 50811 -116576 -325299
$$ packed form
18715f3978B739h118D44a04017L2847G2202a58308F3652c4409j56068A10193C3937
18702C3268n273l27K45549C9156b68817j8170M1492k6883A0240J05462c41153
18690B6076a4213A94241E0847P8680f8127p4395A0416b05038N9094A66420d01682
18678c97379g5558l118p1110j17220B07267A0550c36101i9512J473m0377G4371
18666a16372j48441g8282n8883a425j91429f025l193C3658c11318A78779A0815
18654I9602c56216I9413a34437k15865A45045b342o8986j12719C0794a66457q4224
18643b50681A08968d51803A56371d3222m3051K4838J6993A63518a51696L4845
18633a16851J2290G299f4182k25897f852r8659o2714b4080E0811a16576k08723
$$ plain form
18622 -325299 -194448 60488 227468 168311 -480669 -23593 83731 -186285 -355849 -329275
18612 -329275 -82944 -240250 303091 144968 -228121 78072 97243 35865 -48165 -217866
18602 -217866 -150170 -95844 -128547 -170719 -257956 110377 -109768 -55877 24488 -276943 -63806
18590 57049 -116277 51325 -214884 14043 -245664 214244 -115460 -113298 -31434 -69184 279802
18578 498689 -60665 -98176 -467153 63849 92591 -111350 -191733 -28784 112172 216380 116481
18567 116481 -114447 38451 -74876 -249609 -149916 -17713 4176 -204945 -190458 -292659 -39227
18555 -77707 -297555 207315 51459 25510 212530 -77891 -67885 -75630 -295865 -45580 149803
18543 260881 219968 -83103 366897 152867 33259 -134490 313171 -297845 116167 -36357
$$ packed form
18622c25299J30851F0488J66980n9157d80669b3593H3731a86285j69564K6574
18612c29275h2944j57306C03091A44968b28121G8072J9171C5865d8165j69701
18602b17866O7696N4326l2703m2172q7237A10377a09768N3891B4488b76943f3806
18590E7049a16277E1325b14884A4043b45664B14244a15460K162c1434l7750B79802
18578D98689f0665l7511l68977F3849K8742a11350q0383b8784A12172J04208r9899
18567A16481a14447C8451g4876j74733R9693a7713D176b04945J4487j02201c9227
18555g7707k19848B07315E1459B5510J87020g7891J0006p745k20235d5580A49803
18543B60881m0913h3103C66897A52867C3259a34490C13171b97845A16167c6357
$$ plain form
18532 -127773 -115489 75052 -83193 52287 -27512 -156251 -199335 89724 7542 -144837 -117326
18521 -117326 256361 178798 87151 -70266 -124618 335306 11253 106452 -130046 166187 33706
18509 144662 -124836 -231474 -356554 -27186 50332 52707 -228442 197641 145766 42940 -269551
18497 22582 -89607 -217964 -211867 -157883 89098 -19215 59983 32097 -176484 -214600 252572
18485 -415948 133766 58625 -23333 -90654 -90034 47938 -152069 82064 -100501 -40366 -417019
18474 -417019 -208738 84512 -36595 -207221 63300 54158 54959 -16512 -350441 -305242 199289
18462 -364014 -8859 416908 -68554 119924 102054 65170 -346110 -146649 -8518 218801 -26642
18450 385979 42259 143897 -207476 134849 53212 16528 200203 33055 222319 -156192
$$ packed form
18532a27773J2284G5052h3193E2287b7512j28739m3084H9724G542a44837K7511
18521a17326B56361p7563H7151g0266n4352C35306A1253R5199a30046A66187C3706
18509A44662a24836j06638j25080b7186E0332K375b28442A97641n1875D2940b69551
18497B2582h9607j28357O097N3984H9098a9215E9983k7886a76484l8116B52572
18485d15948A33766E8625b3333o7321O20D7938a52069H2064a00501d0366l76653
18474d17019K08281H4512c6595j70626F3300r142Q01a6512l33929M5199A99289
18462c64014h859D16908f8554A19924j7870l6884c46110a46649h518B18801b6642
18450C85979D2259J01638b07476A34849E3212A6528J83675C3055J89264a56192
$$ plain form
18439 -9118 -201714 83941 -69843 -427402 -151047 67074 248695 -209099 18028 -54813 8386
18427 -31860 4721 -139060 -291953 161472 179218 -277096 240990 -124617 -362724 -144707
18416 -55958 -134100 -242186 -130297 -168750 -305979 89396 225950 -122871 66766 279218
18406 279218 158858 -142638 298072 212148 -14026 104381 -162839 -303430 42168 166522
18396 166522 -97316 -36362 -214981 -60859 -212963 -219527 -208130 6305 95567 17962 149918
18385 149918 -330644 -18891 85966 -10697 33779 -80651 -215667 -50387 -183584 -330301 120973
18373 -87709 -25230 91488 -3241 299384 -254310 -194499 26849 -61320 184751 227960 -507770
18361 19536 239836 -46895 169573 -7449 -271349 -50279 -363803 -199846 85893 -248389 -159094
$$ packed form
18439i118j92596H3941f9843l57559a51047F7074J81621b09099A8028e4813H386
18427c1860D721a39060j52893A61472J7746b77096B40990a24617k38107a44707
18416e5958p8142j08086J11889l8453j37229H9396J36554a22871F6766K12452
18406B79218j20360a42638B98072q5924a4026A04381a62839j40591D2168J24354
18396A66522i7316c6362j78619f0859j52104o564J1397F305Q9262A7962J31956
18385A49918c30644a8891H5966a0697C3779h0651j35016e0387j33197j46717A20973
18373h7709b5230I1488c241B99384b54310N9811B6849f1320A84751M3209e07770
18361A9536K20300d6895A69573g449k63900e0279l13524J63957H5893b48389Q9295
$$ plain form
18350 -159094 -104125 149053 -467682 55972 124072 194940 173222 337917 -59413 69176 144646
18339 144646 195050 -142763 52152 -8293 219221 98390 109426 162899 277185 -150917 -107967
18328 -107967 59406 321240 -263767 -90787 -278581 129700 39822 -294744 -124694 143637
18317 -178053 -188824 -231566 148229 -156817 -21615 228195 19819 -92605 34645 -167828 -144928
18306 -144928 -3530 29252 213739 -15089 -3698 -60579 30706 205041 -97602 -265802 -249420
18295 -249420 290269 -171901 -200830 104346 278474 -147933 -177181 69242 -117741 16202
18284 177166 36895 -103737 -86232 -344397 -57967 148569 -144632 -119670 266779 -46643
18273 141066 -178315 -268078 18168 -147318 -144294 247189 -91726 233128 271617 -126812 61805
$$ packed form
18350a59094N4969A49053d67682E5972O8100P0868k1718J64695e9413F9176P5470
18339A44646N0404a42763E2152h293B19221I8390J1036N3473J14286a50917M2950
18328a07967E9406K61834b63767i0787j87794A29700C9822b94744a24694A43637
18317a78053j0771m2742A48229a56817b1615B28195A9819i2605C4645a67828K2900
18306a44928c530B9252J84487a5089c698n6881C0706J74335i7602j68200J6382
18295b49420B90269a71901k8929A04346J74128a47933k9248F9242a17741A6202
18284A77166C6895a03737J7505k58165e7967A48569a44632K4962B66779d6643
18273A41066a78315q9763A8168a47318L024B47189i1726B33128L8489a26812F1805
$$ plain form
18261 299746 -44366 90131 102848 164233 4731 2818 -211413 -270372 -272383 -490160 128866
18249 12755 -63398 42096 -154051 -146608 -37049 104600 71190 -101202 294334 -59371 -156372
18238 -156372 23643 -389833 3248 32335 -93332 -107447 -212039 61408 -60417 48258 92055
18227 92055 100232 38628 -476973 150864 -108211 -104097 -5381 -131469 -149993 -242062 471920
18215 -329550 -119707 142627 329699 79691 -22480 41115 -190686 -173055 -56519 -91936 -157905
18204 -157905 96932 286210 70717 -196900 81471 -5756 278222 131669 74226 -243683 -132103
18193 -132103 -124012 -25232 -538586 150233 -238974 -72364 230316 -105316 174317 100568
18183 100568 42729 223594 22653 53334 -84553 -23240 -162236 -152371 -38387 -248381 75584
$$ packed form
18261B99746d4366I0131J2717O1385D731j913b11413n8959k011k17777A28866
18249A2755f3398D2096a54051P443c7049A04600l3410a01202B94334e9371r7001
18238a56372B3643c89833C248K9087i3332j4115j04592F1408f0417D8258M3797
18227I2055Q177C8628d76973A50864a08211M114e381j26088j8524r2069D71920
18215c29550a19707A42627J87072G9691b2480D1115a90686J7631e6519l5417o5969
18204a57905I6932J89278G0717a96900H1471e756B78222A31669n7443b43683J11580
18193a32103Q091b5232n13354A50233b38974g2364B30316a05316A74317p3749
18183A00568D2729J80865B2653L0681h4553b3240j38996R865c8387k09994G5584
$$ plain form
18171 144057 -34544 -31420 171481 147885 198252 57581 -309550 216253 39813 94201 -167253
18159 125318 -159317 7795 96534 -163399 -69791 63273 -232945 -34250 -52996 168452 -39713
18147 -168460 -225738 -346798 77242 344616 -59898 -437942 -328699 -96593 -147266 60896 -42234
18135 348262 -141727 -3741 -10445 -80130 -132500 -20447 -481132 -248248 -253143 -144128 106996
18123 -171531 -110437 -69981 123603 -254538 -24494 178594 -148857 12673 77779 -393996
18112 8403 78004 -32031 -173264 112495 118900 213018 -97460 -97793 -52962 -90963 38035 188692
18100 188692 -59135 37403 16001 119496 -16641 -279608 -127499 249048 6259 46805 21390
18088 3734 -6593 -256718 135386 -53860 -123881 -80972 186981 42106 -87839 171928 383883
$$ packed form
18171A44057c4544L124A71481k3596N0367E7581c09550B16253C9813N4388a67253
18159A25318a59317G795Q8739a63399f9791F3273b32945c4250j8746A68452c9713
18147a68460n7278j21060G7242K67374e9898l78044J09243i6593n0673F0896d2234
18135C48262a41727c741o704o9685n2370b0447m60685K32884m895J09015A06996
18123a71531O1094M0456A23603b54538b4494A78594a48857A2673O5106c93996
18112H403O9601c2031j41233A12495O405R4118i7460l33M4831l8001C8035J50657
18100A88692e9135C7403A6001J03495a6641k62967a27499B49048F259M0546B1390
18088C734f593k50125A35386e3860p0021M2909A86981D2106h7839A71928K11955
$$ plain form
18077 383883 -62116 -81764 -124926 43237 -190368 -271302 155816 151267 -1735 76635 30039
18065 51377 -107672 444734 -161783 -187514 -44386 157107 -170829 -176906 80528 108027 -60989
18053 -31678 110244 183646 233624 -21660 115139 -31750 297344 -228927 -195510 -177605 -207951
18042 -207951 43837 -59173 51235 4629 197521 277198 -151381 2672 -147749 369841 -186904
18030 -7918 142542 279527 53112 -319091 -316389 -232042 35426 -115374 59424 57745 -252232
18018 69853 -180332 -299478 118240 11483 110111 -107931 -110565 46193 -62714 -54174 -48736
18007 -48736 -47202 25648 148792 -196805 -172277 144491 -74899 -219851 249789 224780 -184842
17995 133386 89881 -105226 -67368 -14652 167775 -69203 7895 203804 -491918 -189782 -9509
$$ packed form
18077C83883f2116j9648m3162D3237a90368q0934A55816m549a735G6635C0039
18065E1377a07672D44734a61783k5731d4386A57107a70829o077H0528K7499f0989
18053c1678A10244P3402M9978b1660A15139c1750B97344b28927L3417J7905l0346
18042b07951D3837e9173E1235D629J92892P9677a51381B672a47749C69841a86904
18030g918A42542J36985E3112c19091K702Q4347C5426a15374E9424j679b52232
18018F9853a80332j19146A18240A1483R8628a07931k634D6193f2714Q540N438
18007d8736J534B5648J23144a96805K4528A44491g4899j44952B49789k5009a84842
17995A33386m3505a05226L7858a4652A67775f9203G895J95909d91918a89782i509
$$ plain form
17983 196868 -270550 -435529 -96163 -66241 274468 42073 -20589 58454 -172686 101133
17972 -102048 -128340 -130442 177883 -224477 -186043 -153701 -353006 -78877 -93913 127066 -177298
17960 -166816 13002 -207314 -94623 15644 66472 89864 -57829 382136 124396 -121514 -82534
17949 -82534 -235255 179468 -553 118646 -36992 -214866 10406 124001 38417 16029 17547
17938 17547 -39437 -126454 399951 -29694 44127 -195075 55228 -112504 -297616 175730 -42146
17926 -99955 101468 29816 122163 39097 -6465 169313 180370 -53936 -102761 49578 19317
17914 237831 131233 41513 -1539 -170957 -81403 -204671 -143823 25359 161687 -158222 -357945
17903 -357945 -51003 106041 89663 293769 -96935 34876 47347 368429 -24888 413703 501209
$$ packed form
17983A96868b70550j64979i6163K9922B74468D2073b0589E8454a72686A01133
17972a02048k6292k102A77883b24477L8434L2342j99305g8877j5036A27066a77298
17960a66816A3002b07314i4623A5644N0828K3392e7829C82136A24396a21514L8980
17949h2534j52721A79468e53A18646c6992j77874A0406J13595C8417A6029J518
17938A7547c9437q7017C99951b9694D4127a95075E5228a12504j85112A75730d2146
17926i9955A01468B9816R2347C9097f465A69313J1057e3936m8825D9578A9317
17914B37831j06598D1513a539j69418h1403j23268O0848B5359J36328a58222j99723
17903c57945e1003A06041j6378K04106i6935C4876J2471L21082b4888D13703Q7506
$$ plain form
17892 501209 -12238 217702 -55184 102775 169146 103519 170296 221204 -23452 -12702 -260481
17881 -260481 14159 -50009 54107 62207 135039 296540 -406699 -58580 6564 47105 118227
17870 118227 -249724 -287709 -221388 108813 -2194 19980 -2633 118929 15236 246380 -196633
17858 -247959 70378 120266 56599 -156077 128068 -50280 228795 189918 -97527 208099 -159974
17846 32296 -486460 -118260 71926 -30001 -221206 -42819 63831 -113623 44952 -71953 -204240
17835 -204240 -236061 162811 -316930 -222963 60511 109838 201358 -233685 11787 61368 -108688
17823 -23526 -190761 151128 132984 -222175 166937 -584823 -13472 34992 -33791 95134 73055
17812 73055 246595 108009 81335 -173310 242545 -141296 -63288 -99728 -58237 -30905 -218552
$$ packed form
17892E01209a2238B17702e5184A02775O6371o5627O6777N0908b3452J0750k47779
17881b60481A4159e0009E4107Q100P2832J61501d06699e8580F564M0541P1122
17870A18227b49724l7985O6321A08813b194A9980b633A18929A5236K31144a96633
17858b47959G0378M9888E6599a56077A28068e0280B28795l8877i7527B08099a59974
17846C2296d86460a18260G1926c0001j91205d2819F3831a13623D4952g1953j32287
17835b04240l1821A62811c16930R3967F0511M9327R1520b33685A1787M9581a08688
17823b3526j67235A51128j8144b22175A66937e84823a3472C4992c3791I5134k2079
17812G3055J73540A08009k6674a73310B42545a41296f3288l6440M1491K7332j87647
$$ plain form
17801 -218552 179727 -30080 25729 140276 -131300 54319 -71691 90413 -74417 -4195 -89688
17790 -89688 -22673 129643 -200384 -165444 24237 29605 36376 -69399 181948 -38398 -71886
17779 -71886 61626 222878 -292573 114206 -167576 121864 -19696 35957 -192849 -30749
17768 -203154 11146 -110269 -291036 -166211 -136602 205260 141340 184497 141871 -253403
17757 27854 49924 -280802 199355 38761 -181401 -126033 144559 -9404 29885 68897 43966
17746 43966 -324136 -214733 -247799 33600 -112668 -138132 -50616 -402585 -170539 -147853 91905
17734 -4063 -9879 146507 15613 -143279 171449 -306624 -46150 -65033 -104826 251124 -216394
17722 -313687 137720 -51388 7522 65250 -55169 45411 156442 -138814 -112331 -55860 245418
$$ packed form
17801b18552A79727c0080B5729J14547a31300E4319g1691I0413g4417d195q5493
17790h9688b2673A29643b00384L4940B4237N368O771f9399A81948c8398l3488
17779g1886F1626J61252b92573A14206a67576A21864a9696C5957a92849c0749
17768b03154A1146a10269j80767J24825K9609B05260o3920M3157m2626b53403
17757B7854K2070b80802A99355C8761a81401N5368A44559i404B9885L9012k4931
17746D3966c24136J09403l3066C3600a12668k5464e0616l51969a70539K2686I1905
17734d063n816A46507A5613a43279A71449c06624d6150j8883l9793B51124b16394
17722c13687A37720e1388G522N7728e5169D5411J11031a38814K6483e5860B45418
$$ plain form
17710 33779 148635 61101 -431269 -87764 -320470 397547 -12337 -283786 222376 101133
17699 29552 129653 180411 -97267 98806 -109735 154159 9781 305614 63363 -111908 189006
17687 -36745 -48679 102319 -122612 153936 279206 130822 84274 -73025 146048 -249912
17676 44354 -286369 40005 358253 144856 18122 43203 -311683 -42474 467577 284631
17666 284631 -29132 -44928 -27954 73275 48108 -102095 215710 -228939 291771 238320 -160632
17654 48738 -39059 -101956 -302706 -28168 5611 97604 -65128 266679 362246 -42947 -150403
17643 -150403 -127747 -75494 47116 136889 -321256 178168 27810 -63131 54984 -95898 324214
17631 -90325 166223 -266340 -212168 44234 3543 215898 96459 -36245 72096 53207 -95939
$$ packed form
17710C3779J14856F1101d31269h7764k32706C97547a2337k71449B22376A01133
17699B9552J00101N0758i7267I8806a09735A54159I781K95833F3363a11908A89006
17687c6745j1934A02319a22612A53936J25270A30822m6548g3025A46048b49912
17676D4354b86369D0005L18248A44856A8122K5081c11683d2474D67577j82946
17666B84631b9132j5796J6974G3275k5167a02095B15710b28939B91771n3451a60632
17654D8738c9059o2897k00750b8168E611R1993f5128B66679R5567d2947j07456
17643a50403K2656N2253D7116Q9773c21256A78168B7810f3131E4984i5898C24214
17631i0325A66223b66340N4172D4234C543K12355I6459c6245G2096j8889i5939
$$ plain form
17619 -32749 346274 -129289 -52535 510000 53704 -274246 -143127 34301 -226854 -181431
17609 -181431 -97157 -136120 22483 -40103 157903 185040 -193423 -22467 -27886 -148081 -25278
17597 27563 -309079 -34443 -394197 -70613 35237 46722 82014 -104540 35291 125574 75254
17586 75254 48715 -69646 362021 18243 -257775 297741 70631 126105 93762 -149936 -299426
17575 -299426 -91037 207500 107635 -3219 298169 -62467 -82756 -103083 -8274 -189948 43855
17563 -161475 174053 -16504 -8434 296913 -210827 -230489 137568 52978 385243 11909 -13182
17551 -12018 -218596 95643 150083 -323274 -211344 -55332 -121012 68271 72805 110626 321434
17540 321434 142693 -126727 124548 3961 316129 284481 384480 -163130 184005 -56902
$$ packed form
17619c2749C46274a29289e2535E10000E3704b74246J31119C4301b26854M5423
17609a81431Q4274l8963B2483d0103A57903K7137a93423b2467n419j20195b5278
17597B7563c09079c4443l59754g0613C5237J1485L5292a04540C5291R0283n0320
17586G5254k6539f9646C62021A8243b57775B97741G0631N5474l2343a49936j49490
17575b99426i1037B07500r9865c219B98169f2467k0289k0327h274j81674D3855
17563a61475A74053a6504Q070B96913b10827j9662A37568E2978L32265A1909a3182
17551a2018k06578I5643N4440c23274J11930e5332o5680F8271M534L7821K10808
17540C21434A42693a26727A24548C961L12168l1648R9999a63130A84005e6902
$$ plain form
17529 76568 102346 197330 -30317 -121710 -23349 147092 269193 188781 397257 -342771 11015
17517 -191826 152266 187078 376217 -113354 -25755 -45530 123425 219372 -26377 157028
17506 161624 -78496 36229 300125 80792 60079 -80939 125480 -72649 67563 64446 226288
17495 226288 266061 79299 68255 72504 99340 406235 318155 294024 32348 274668 265279
17484 265279 238891 188267 307762 -5007 215734 -192853 322366 362690 -215652 240169
17473 -150791 136201 -229649 522243 13414 144564 246898 -296173 429628 -40191 -74418
17463 -74418 3695 163055 278707 242136 128925 -38131 -14823 292766 460066 67377 222001
17452 222001 -18844 375624 111887 58005 -26436 323680 -6406 269279 326405 435629 296383
$$ packed form
17529G6568K5778R4984c0317r1393b3349A47092J22101q0412K08476c42771A1015
17517a91826A52266L4812J89139a13354b5755j9775A23425R5947b6377A57028
17506A61624g8496C6229K63896H0792k0713h0939A25480g2649F7563l117J61842
17495B26288L9773G9299j1044M249K6836L06895q8080k4131C2348K42320r389
17484B65279k6388n0624J19495e007B15734a92853C22366M0324b15652B40169
17473a50791A36201b29649E22243A3414J31150J02334b96173D29628d0191l4227
17463g4418C695J59360J15652l6571j13211c8131a4823B92766J67300F7377J54624
17452B22001a8844C75624A11887n3882b6436C23680f406B69279N7126J09224j39246
$$ plain form
17441 296383 101020 19804 318408 342998 188739 510302 177253 361853 -110449 244851
17430 191180 30118 -61879 285094 -182323 290543 227305 272229 480110 87199 360667
17420 360667 -41080 449794 156513 254864 382758 404070 351096 98153 124695 266600 -159337
17408 46848 -57120 120223 177749 -130551 206392 -55862 334788 148308 309270 -37449
17397 258234 -84487 215074 -153672 25714 250482 59898 -240212 -50513 697 -64535 183748
17385 227744 -25944 -123353 3494 -5396 -56244 152004 375901 117231 134734 132394 106551
17374 106551 103682 282470 141128 312787 210641 47607 162513 133674 336133 199715
17364 199715 122233 -174998 100306 473216 -253676 397450 -164637 145426 -108871 232477
$$ packed form
17441B96383A01020A9804K98604K4590j54259L21563A77253J84600a10449B44851
17430A91180C0118f1879B85094a82323B90543o3238M4924K07881H7199K73468
17420C60667d1080D49794A56513R8351J27894K1312n2974I8153K6542J41905a59337
17408D6848e7120A20223N7526a30551B06392e5862C34788A48308J60962c7449
17397B58234h4487B15074a53672B5714K24768E9898b40212e0513F97f4535A83748
17385B27744b5944r7409C494e396n0848A52004K23897A17231J7503k340k5843
17374A06551k869J78788A41128J71659j02146D7607J14906k8839K02459j36418
17364A99715p7482a74998A00306L72910b53676C97450a64637A45426a08871B32477
$$ plain form
17353 403889 12931 142404 179750 133508 -82006 301420 153978 94405 276211 -113266
17342 123358 -63481 -26747 -133532 17871 31597 354375 -251902 134566 54629 -243674
17331 334175 -19146 -143563 163113 327893 -50917 -96638 -15725 38573 172717 83218 155340
17320 155340 88159 7710 55860 260215 50785 68027 170374 -20330 162081 -47169 234236
17308 -238078 249624 -186596 56849 134919 32516 516841 169951 103622 11679 340239
17298 340239 289479 81042 252619 212823 492292 -186919 463417 20562 345511 37915
17287 468508 114845 46847 182816 -125893 107422 -117747 406288 153253 -20208 238400
17276 303742 158755 -33353 546077 -276859 -134090 -6079 236488 113163 -7440 -109281
$$ packed form
17353D03889A2931J29473L7346m6242h2006C01420j47442n9573J81806a13266
17342A23358f3481b6747j06785A7871J3726L22778b51902A34566E4629b43674
17331C34175a9146j24417A63113J64780e0917m5721a5725C8573J34144H3218P2122
17320A55340o7181G710M8150K04355E0785J7242J02347b0330A62081d7169B34236
17308b38078B49624a86596E6849P8070C2516M84325A69951o6329A1679L28560
17298C40239n0760H1042J71577l9796K79469a86919D63417B0562L24949C7915
17287D68508A14845D6847J35969a25893A07422a17747D06288A53253b0208B38400
17276C03742j44987c3353E46077b76859a34090f079B36488A13163g440j01841
$$ plain form
17266 -109281 -40102 265715 161834 121958 389546 -27215 261993 84281 264369 284208
17256 284208 419487 154960 -203167 105323 224385 158596 457593 -202144 199025 64467
17245 169281 504907 299705 60624 42866 269183 173607 29104 276829 64878 196587
17235 196587 121122 382906 -71814 -95602 85210 171248 119957 630170 203932 340693 335736
17224 335736 -67213 34611 220501 -221298 18252 327405 240206 -17508 -99335 387522 90270
17212 430707 70392 329649 254211 174603 145158 246390 -379807 118607 389934 124597
17201 134825 406506 395140 407359 126332 191846 144928 83912 138571 82868 93786 297063
17190 297063 320311 35382 162520 314578 151654 233525 341541 169883 559123 -72421
$$ packed form
17266a09281d0102B65715j03881l9876K67588b7215B61993H4281J80088J9839
17256B84208J35279A54960b03167A05323J19062o5789K98997b02144A99025F4467
17245A69281L35626k05202F0624j7758K26317r5576B9104K47725F4878J31709
17235A96587p5465K61784g1814k3788H5210Q6038n1291N10213B03932J36761m957
17224C35736f7213C4611J85890b21298A8252L09153q7199a7508q1827C87522I0270
17212D30707G0392K59257p5438p9608k9445J01232c79807A18607K71327A24597
17201A34825K71681j1366J2219A26332O5514m6918o1016N4659n5703J0918K03277
17190B97063K3248C5382J27138J52058A51654Q1871J08016A69883L89240g2421
$$ plain form
17179 391632 100995 326945 350728 207128 401095 362112 745802 238875 153881 209941
17169 209941 144094 -10084 353269 142895 38418 310989 432129 261308 187154 271765
17159 271765 396255 279358 301818 356459 253821 514555 164934 -2154 324700 383401
17149 383401 93032 196908 277491 302024 61316 177728 -156871 467122 232759 369105
17139 369105 258348 132185 284244 -70999 236660 358809 347747 647859 490861 262467
17129 262467 536082 518867 431879 543563 322173 432928 430203 483140 245816 124647
17119 124647 8570 296924 53989 414253 363325 237876 273158 574864 262178 275944 218839
17108 218839 208017 687354 267045 540620 324222 414274 145119 662826 240074 96740
$$ packed form
17179C91632A00995K25950K3783j43600J93967l8983L83690B38875q4994N6060
17169B09941o5847a0084C53269A42895C8418K72571J21140j70821p4154Q4611
17159B71765J24490j16897K2460N4641j02638K60734A64934b154C24700N8701
17149C83401I3032J03876Q0583K4533F1316J16412a56871D67122B32759J36346
17139C69105j10757j26163J52059g0999B36660J22149j1062L00112j56998k28394
17129B62467K73615j7215q6988J11684k21390J10755k725N2937k37324j21169
17119A24647H570K88354E3989L60264n0928j25449L5282L01706B62178J3766n7105
17108B18839j0822M79337B67045K73575k16398R0052A45119N17707B40074I6740
$$ plain form
17097 214245 302923 382373 233236 493554 524239 360854 156444 678790 433185 549128
17087 549128 319205 227139 449696 238492 324875 553407 359004 384006 579504 482835
17077 482835 321891 423425 452502 529512 405058 590196 576786 477971 123739 414089
17067 414089 703649 459163 196784 200768 575387 377598 555256 376065 516794 504875
17057 504875 486954 280570 399826 329398 671426 450811 349737 520981 252854 412086
17047 412086 236873 522995 440988 240735 654340 479149 432004 670118 337756 595060
17037 595060 594221 711710 609587 492876 886857 584096 486252 228440 251136 506121
17027 506121 807837 775642 704119 747479 793077 512231 531250 534619 490078 432709 914558
$$ packed form
17097B14245Q8678P9450j49137K60318L0685j63385A56444N22346k45605J15943
17087E49128k29923r2066K22557k11204Q6383K28532j94403K5002J95498r6669
17077D82835j60944J01534K9077P7010j24454J85138j3410r8815A23739K90350
17067D14089K89560k44486A96784L984L74619j97789J77658j79191J40729j1919
17057E04875j7921k06384J19256p0428L42028k20615j01074J71244B52854J59232
17047D12086j75213K86122q2007k00253M13605j75191m7145K38114l32362K57304
17037E95060q39J17489j02123j16711L93981l02761r7844B28440K2696K54985
17027E06121L01716l2195p1523M3360M5598k80846J9019L369m4541n7369M81849
$$ plain form
17016 914558 658655 829264 562449 466668 726206 450886 454690 827673 599581 470673
17006 470673 458716 381772 867154 816827 491034 573433 467516 639922 632368 649569 600501
16995 600501 593676 517452 550199 816678 801742 627903 694679 740842 825105 483268 891674
16984 891674 728047 806020 802685 690282 950898 797990 704894 719146 684429 981674 607251
16973 607251 724071 913058 873058 972643 586786 841599 786565 719683 642447 766315
16963 766315 1116630 978209 1002858 891829 1126137 946421 951841 763025 780139 1202103
16953 1202103 948417 838331 819358 1033905 1150406 1015825 918050 1079018 1419363 932601
16943 932601 1092129 1016662 1063105 1276676 1092020 1242007 1105035 975317 1322811 1142627
$$ packed form
17016I14558k55903J70609k66815r5781K59538k75320L804L72983k28092j28908
17006D70673j1957p6944M85382n0327l25793Q2399j05917J72406p554J7201m9068
16995F00501o825p6224L2747K66479j4936j73839O6776M6163Q4263l41837M08406
16984H91674j63627P7973l335j12403K60616j52908r3096J4252l4717K97245l74423
16973F07251J16820J88987m0000R9585l85857K54813n5034o6882p7236J23868
16963G66315L50315j38421K4649j11029K34308j79716N420j88816J7114M21964
16953A202103k53686j10086j8973K14547J16501j34581r7775J60968L40345m86762
16943I32601J59528p5467M6443K13571j84656J49987j36972j29718L47494j80184
$$ plain form
16933 1142627 1295075 1336205 1460435 1262684 1232982 1580012 1140794 920133 1161292 1487359
16923 1487359 1263680 1180055 1312711 970993 1177834 1319478 1510585 1118476 1236597 1291661
16913 1291661 1505892 1038157 1722675 1453943 1334977 1431033 1514491 1960813 1562048 1533079
16903 1533079 1568195 1362003 1668895 1606549 1810305 1544535 1719526 1520719 1823039 1779518
16893 1779518 1705422 2070531 1562049 2058757 1880483 1780505 1930261 2130828 1838941 1918245
16883 1918245 1930682 1906786 1729623 2194874 2178158 2009876 1864635 2390806 2588792 2629794
16873 2629794 2059734 2413904 2407639 2147256 2486926 2399897 2362222 2330392 2556006 2534242
16863 2534242 2318165 2507483 2792457 2463089 2590432 2661927 3255793 3197539 2733096 3128477
$$ packed form
16933A142627J52448M1130J24230j97751k9702L47030m39218k20661K41159L26067
16923A487359k23679q3625J32656l41718K06841J41644J91107l92109J18121N5064
16913A291661K14231m67735O84518k68732j18966R6056Q3458M46322l98765k8969
16903A533079L5116k06192L06892o2346K03756k65770J74991j98807L02320m3521
16893A779518p4096L65109n08482M96708j78274r9978J49756K00567k91887P9304
16883A918245J2437k3896j77163M65251j6716j68282j45241N26171J97986M1002
16873B629794n70060L54170o265k60383L39670q7029l7675l1830K25614k1764
16863B534242k16077J89318K84974l29368J27343P1495N93866n8254m64443L95381
$$ plain form
16853 3128477 2866220 3036766 3060697 2745046 3128978 3176540 3525569 3074071 3550172 3357934
16843 3357934 3344786 3351237 3280423 3567382 3604064 3589738 3776723 3892546 3880034 3636948 4111161
16832 4111161 3786319 4218589 4095919 3969964 4550494 4782696 4380160 4882130 4640401
16823 4640401 5029577 4631510 5100537 4835805 5383104 5199938 5058925 5227963 5862362
16814 5862362 5719424 5775957 5646346 5887914 6240536 5827195 6187440 6335000 6657152 6722536
16804 6722536 7064822 7098502 7281185 7479095 7526656 7966420 7881286 8206960 8359485 8550349
16794 8550349 8827851 8691205 9011462 9551950 9738582 10011041 10203749 10504010 10744982
16785 10744982 10846401 11040786 11917027 12013742 12553438 12719780 13080438 13202453 13766546
$$ packed form
16853C128477k62257J70546K3931l15651L83932M7562L49029m51498M76101j92238
16843C357934j3148O451p0814K86959L6682j4326J86985J15823j2512k43086M74213
16832D111161l24842M32270j22670j25955N80530K32202m02536N01970k41729
16823D640401L89176l98067M69027k64732N47299j83166j41013J69038O34399
16814E862362j42938N6533j29611K41568L52622m13341L60245J47560L22152O5384
16804F722536L42286L3680J82683J97910M7561M39764q5134L25674J52525J90864
16794H550349K77502j36646L20257N40488J86632K72459J92708L00261K40972
16785A0744982J01419J94385Q76241R6715N39696J66342L60658J22015N64093
$$ plain form
16776 13766546 14287915 14575581 15418394 15849919 16247570 16519196 17226463 17888713 18488181
16767 18488181 19204766 19851750 20636394 21487737 22064504 23149343 23847072 24783155 25851156
16758 25851156 26594112 28285877 28973991 30419056 31709197 33023210 34995321 36353005
16750 36353005 38474156 39976489 41924793 44104976 46015121 49046384 51628469 54023991
16742 54023991 56997136 60345029 63779389 67526232 71201290 75516815 80115188 85335781
16734 85335781 90193436 95801599 101765451 108151120 114870528 121994154 129070451 136914630
16726 136914630 144563979 152725823 160487936 168557598 176440522 183338967 189698824 195050903
16718 195050903 200157204 203096931 205014420 205659124 204735874 202884200 198884596 194538223
$$ packed form
16776A3766546N21369K87666Q42813M31525L97651K71626P07267O62250N99468
16767A8488181P16585O46984P84644Q51343N76767J084839O97729R36083J068001
16758B5851156P42956J691765O88114J445065J290141J314013J972111J357684
16750C6353005K121151J502333J948304K180183J910145L031263K582085K395522
16742E4023991K973145L347893L434360L746843L675058M315525M598373N220593
16734H5335781M857655N608163N963852O385669O719408P123626P076297P844179
16726A36914630P649349Q161844P762113Q069662P882924O898445O359857N352079
16718A95050903N106301K939727J917489O44704r23250j851674l999604m346373
$$ plain form
16710 194538223 188653273 182160028 174719737 167052993 159034535 150858257 143016200 135027233
16702 135027233 127322238 119617599 112655964 105892954 99657811 93611747 87986162 82858831
16694 82858831 77887355 73406920 69120430 65097323 61613249 58093729 55027894 52336172
16686 52336172 49266729 46797966 44162654 41856074 40223810 38371364 36787266 35062333
16678 35062333 33146824 31425894 30484338 29092429 27523188 26473692 25654066 24778463
16670 24778463 23567586 22620699 21963915 20823006 19936045 19430830 18751443 17769793 17329903
16661 17329903 16725848 16257482 15814965 15667276 14620308 14369251 13763025 13180626 12896212
16652 12896212 12649730 12230849 11645763 11330493 11176111 10715379 10567162 9994801 9750784
$$ packed form
16710A94538223n884950o493245p440291p666744q018458q176278p842057p988967
16702A35027233p704995p704639o961635o763010o235143o046064n625585n127331
16694H2858831m971476m480435m286490m023107l484074l519520l065835k691722
16686E2336172l069443k468763k635312k306580j632264j852446j584098j724933
16678C5062333j915509j720930r41556j391909j569241j049496q19626q75603
16670B4778463j210877r46887o56784j140909q86961n05215o79387r81650m39890
16661A7329903o04055m68366m42517j47689j046968k51057o06226n82399k84414
16652A2896212k46482m18881n85086l15270j54382m60732j48217n72361k44017
$$ plain form
16643 9750784 9485315 9222790 9174091 9096397 8626658 8098222 8139466 7889846 7778765 7597226
16633 7597226 6944739 7585072 7292169 6869220 6720932 6727855 6583084 6656345 6352213 5881722
16623 5881722 5781434 5684748 5664476 5409058 5082939 5372193 5089737 5084713 4900019 4912906
16613 4912906 4999684 4526689 4508655 4166649 3860681 3916607 4148705 4169896 4447798 3867263
16603 3867263 4033550 3845455 3927573 3698781 3659178 3659555 3680228 3214274 3252712 3475219 3197309
16592 3197309 3311335 3117170 3174248 3076057 2829541 2964998 3007179 3092104 3132521 2521631
16582 2521631 2719593 2537344 2605262 2481575 2672961 2545857 2583630 2556931 2166437 2356305
16572 2356305 2285826 2278248 2221743 2088098 2290268 2024270 2065593 1835481 2053730 2051269 2068394
$$ packed form
16643I750784k65469k62525m8699p7694m69739n28436M1244k49620j11081j81539
16633G597226o52487O40333k92903m22949j48288O923j44771P3261l04132m70491
16623E881722j00288r6686k0272k55418l26119K89254k82456n024j84694J2887
16613D912906Q6778m72995j8034l42006l05968N5926K32098K1191K77902n80535
16603C867263J66287j88095Q2118k28792l9603L77K0673m65954L8438K22507k77910
16592C197309J14026j94165N7078r8191k46516J35457M2181Q4925M0417o10890
16582B521631J97962j82249O7918j23687J91386j27104L7773k6699l90494J89868
16572B356305p0479p578n6505j33645K02170k65998M1323k30112K18249k461J7125
$$ plain form
16561 2068394 2170012 2144667 1738908 2063969 1853592 1710622 1807819 1776614 2186291 2044059
16551 2044059 1838557 1714014 2111253 1559351 1800002 1500975 1487387 1836237 1837418 1245494
16541 1245494 1384134 1317092 1346423 1690576 1781822 1614677 1599687 1317119 1264856 1204678
16531 1204678 1543448 1289195 1285816 1488110 1240881 1159412 859107 1132990 1347932 1325804
16521 1325804 1187029 900911 1009359 1148216 1217398 1404394 1101895 1211441 689461 816429
16511 816429 981642 1225807 645926 1167471 930107 1383774 1251543 1287489 1014615 861681
16501 861681 980214 1033413 943414 1119062 1092407 1331869 965449 1071121 706005 1025175
16491 1025175 794262 731075 961464 966869 793032 1066901 831576 1036801 711750 945189
$$ packed form
16561B068394J01618k5345m05759L25061k10377j42970R7197l1205M09677j42232
16551B044059k05502j24543L97239n51902K40651k99027j3588L48850J181n91924
16541A245494J38640o7042K9331L44153R1246j67145j4990k82568n2263o0178
16531A204678L38770k54253l379K02294k47229q1469l00305K73883K14942k2128
16521A325804j38775k86118J08448J38857O9182J86996l02499J09546n21980J26968
16511H16429J65213K44165n79881N21545k37364M53667j32231L5946k72874j52934
16501H61681J18533N3199q9999J75648k6655K39462l66420J05672l65116L19170
16491A025175k30913o3187K30389N405j73837K73869k35325K05225l25051K33439
$$ plain form
16481 945189 512576 634321 897490 815096 707092 1219796 757522 688177 927530 543269
16471 543269 989818 896466 956855 1285833 531391 1170968 730447 560152 581075 289569
16460 678093 824395 568416 855069 562319 848828 700453 800599 533718 756089 872550
16450 872550 449280 737894 592950 521957 557077 564351 530015 582859 801372 305305 563200
16439 563200 199999 666074 498294 996496 487017 690131 859834 255254 427970 314494
16429 314494 547705 615717 514487 1024508 556711 217445 539637 675532 526712 525732
16419 525732 440400 368596 198553 577266 660994 356024 817730 386941 293214 175276
16409 175276 501405 423365 560702 400804 273362 236639 391951 543355 51265 466991
$$ packed form
16481I45189m32613J21745K63169q2394j08004N12704m62274o9345K39353l84261
16471E43269M46549r3352O0389L28978E31391O39577m40521j70295K0923B89569
16460F78093J46302k55979K86653k92750K86509j48375J00146k66881K22371J16461
16450H72550m23270K88614j44944p0993L5120P274l4336N2844K18513C05305K57895
16439E63200A99999M66075j67780M98202D87017K03114J69703B55254J72716j13476
16429C14494K33211O8012j01230N10021m67797B17445L22192J35895j48820r80
16419E25732q5332p1804j70043L78713Q3728l04970M61706C86941r3727j17938
16409A75276L26129p8040J37337j59898j27442l6723J55312J51404E1265M15726
$$ plain form
16399 466991 182333 270505 328835 508396 301222 638444 290691 480563 366243 686029
16389 686029 642918 362633 401666 422613 362530 547904 565978 363844 336304 470394 342305
16378 342305 144274 210964 421433 342443 425216 623358 513689 356120 479386 350838
16368 350838 272016 370518 343619 385138 331044 402227 22364 364482 159964 122624 337876
16357 337876 220715 1151 -115771 233674 587885 220476 145729 273695 -109536 385619
16346 383737 415099 207116 338929 181075 30909 317953 366799 457546 634572 505608
16336 505608 420493 30563 381830 -105323 631232 271574 235308 224433 235827 268814 195516
16325 195516 545872 200514 255317 203710 290400 710753 120398 167463 217496 112996
$$ packed form
16399D66991A82333Q8172N8330J79561k07174L37222B90691J89872j14320L19786
16389F86029m3111k80285L9033K0947o0083J85374J8074k02134k7540J34090j28089
16378C42305A44274O6690K10469p8990Q2773J98142j09669j57569J23266j28548
16368C50838p8822R8502k6899M1519n4094P1183B2364L42118A59964l7340K15252
16357C37876j17161A151a15771B33674L54211B20476p4747J27966a09536C85619
16346C83737L1362B07116J31813j57854C0909K87044M8846R0747J77026j28964
16336E05608q5115C0563L51267a05323F31232B71574l6266j0875J1394L2987p3298
16325A95516L50356B00514N4803n1607Q6690M20353A20398M7065N0033j04500
$$ plain form
16315 112996 80875 182253 319643 479299 417377 207321 205464 324274 148581 277521
16305 277521 408086 225422 81867 251513 232090 343724 128152 -162659 -5191 494039
16294 160407 314766 -81534 234563 424593 197575 363608 406046 75131 240855 151387
16284 151387 203323 181137 331995 212001 566689 166907 501353 330609 157072 138159
16274 138159 319021 107877 225857 312214 338587 324021 14486 107978 -131585 -38181 100296
16262 133773 -27576 -12668 74355 297711 355862 181201 213837 -151139 53498 311092 107280
16250 304557 12082 286881 -30095 72786 -46485 12613 430605 202755 129309 189653 326935
16239 326935 93074 88756 52808 267710 -44038 205894 -402760 404743 548810 455747 -163133
$$ packed form
16315A12996l2121J01378J37390J59656o1922B07321j857J18810A48581J28940
16305B77521J30565j82664H1867J69646j9423J11634A28152a62659e191D94039
16294A60407J54359h1534B34563J90030A97575J66033M2438G5131J65724q9468
16284A51387N1936k2186J50858j19994L54688A66907L34446j70744A57072j8913
16274A38159J80862A07877J17980Q6357K6373j4566A4486R3492a31585c8181A00296
16262A33773b7576a2668G4355K23356N8151j74661L2636a51139E3498K57594A07280
16250C04557A2082K74799c0095G2786d6485A2613M17992B02755p3446O0344J37282
16239C26935I3074m318l5948K14902d4038B05894d02760D04743J44067r3063a63133
$$ plain form
16227 751867 159074 -27256 152637 18613 201162 181187 254832 204728 -44899 60438 398757
16216 398757 -46869 -67197 90849 192985 252240 20291 -86057 39811 93141 268672 121008
16204 154863 122698 15691 33793 144192 201601 -62162 175584 75470 184130 155462 34200
16192 153022 17736 -49896 149407 -231499 115118 68604 36409 99598 339365 45030 219329
16181 219329 415125 159801 225892 290238 17052 303686 -153071 -33802 79129 -9900 201476
16169 -44096 146480 154344 -108366 -44630 71974 -67273 24969 -116089 40242 429852 181982
16157 86303 245959 123496 -62769 230028 74016 239247 87338 65925 225103 -188846
16146 -364073 169150 -177382 -138764 -39043 -62660 -32547 382405 -88612 11089 -42136 25683
$$ packed form
16227G51867A59074b7256A52637A8613J82549j9975P3645n0104d4899F0438L38319
16216C98757d6869k0328I0849J02136N9255B0291h6057C9811N3330J75531A21008
16204A54863l2165A5691J8102J10399N7409f2162A75584G5470J08660k8668C4200
16192A53022A7736d9896A49407b31499A15118m6514l2195O3189K39767D5030J74299
16181B19329J95796A59801O6091O4346A7052K86634a53071c3802G9129i900B01476
16169d4096A46480P864a08366d4630G1974f7273B4969a16089D0242L89610A81982
16157H6303J59656j22463f2769B30028G4016J65231H7338k1413J59178a88846
16146c64073A69150a77382L8618c9043k3617L0113C82405h8612A1089d2136B5683
$$ plain form
16134 239034 23423 150526 -384944 19160 -33953 -35556 -10263 147677 -23655 -41237 -266839
16123 -266839 197198 -112146 -261464 262425 293466 127677 -18769 -70994 -121160 146807
16112 46504 -12324 -46433 -177695 -39415 -13319 -115007 -291197 20374 58124 377718 -96295
16100 70296 -2624 -242195 392969 -36809 274510 110761 -60566 226415 193194 16699 -1849
16088 -196464 204180 -86451 58687 33309 -53799 251702 40775 -101012 -45414 -380484 70873
16076 77941 100564 179458 -176858 112867 -159832 210035 -73348 68198 336554 29589 -123179
16064 -86802 -95523 17081 -127797 18689 -429792 -358864 -43482 29553 53440 -199123 29956
16052 -168609 22391 185582 3476 100893 449614 9111 71297 214369 -179197 -256125 237023
$$ packed form
16134B39034B3423J27103c84944A9160c3953j603a0263A47677b3655j7582k25602
16123b66839A97198a12146j49318B62425L1041A27677a8769n2225n0166A46807
16112D6504a2324l4109j31262c9415a3319j01688j76190B0374L7750L19594i6295
16100G0296b624k39571C92969c6809B74510A10761f0566B26415l3221A6699a849
16088a96464B04180h6451E8687k5378e3799B51702D0775a01012d5414l35070G0873
16076G7941K2623P8894a76858A12867a59832B10035g3348F8198K68356B9589a23179
16064h6802q721A7081a27797A8689d29792P0928d3482B9553K3887a99123B9956
16052a68609B2391J63191C476R7417L48721I111O2186J43072a79197p6928B37023
$$ plain form
16040 12820 219589 -79566 2377 -79840 -121050 307921 220880 -313038 119219 -11764 -229769
16029 -229769 80367 18444 -230180 -145006 216577 80477 -31079 168087 -48930 49275 -240926
16017 -122477 -248439 -5416 -247179 41680 -270986 -144917 16092 -185494 -95650 277480
16006 -43034 144207 30466 -181358 -163992 141321 -111098 149148 21569 -12894 -4703 -97179
15995 -97179 -10074 62384 -50587 3570 166220 455098 -126152 123017 332652 270494 287228
15984 287228 404898 211092 341125 290977 570825 275480 -82772 -119552 -134994 -53327
15973 -8644 235214 327779 -71496 -84882 -249794 79673 -278757 -383896 301489 43495 81741
15962 81741 121808 -99951 -78897 -301149 -151618 -79465 -283107 -4740 22387 288704 -375555
$$ packed form
16040A2820K06769g9566B377g9840m1210C07921q7041c13038A19219a1764k18005
16029b29769H0367A8444b30180Q5174B16577H0477c1079A68087d8930D9275b40926
16017a22477j25962e416k41763D1680b70986J26069A6092a85494Q9844B77480
16006d3034A44207C0466a81358J7366A41321a11098A49148B1569a2894d703r2476
15995i7179a0074F2384e0587C570J62650K88878a26152A23017K09635o2158J6734
15984B87228J17670j93806J30033n0148K79848B75480h2772l6780j5442e3327
15973h644B35214R2565g1496j3386j64912G9673b78757j05139C01489D3495L8246
15962H1741M0067i9951K1054k22252J49531P2153k03642d740B2387K66317c75555
$$ plain form
15950 135514 -55047 -136646 46079 -64885 94729 17282 30813 -266861 182061 -139811 165025
15938 158963 -75392 -609 50553 83172 -187142 -38486 -47149 -185486 -108900 64108 -275877
15926 -160332 -121059 446480 -20582 -141679 -96812 33228 -89252 -32731 -27571 283359 -254726
15914 -321999 333967 -178659 27689 -105322 29274 -274355 119405 -356363 99176 3473
15903 -54441 290169 65692 330339 -241338 77170 -60694 71582 229628 411188 51124 -314426
15891 -100183 -26186 53095 35554 -63037 140428 -137599 239377 109280 -93506 267625
15880 -173522 -139998 120336 -225362 39750 -131633 12295 -197531 80126 -335473 2566 132412
15869 132412 -155973 -71972 -9092 -100975 -51256 74723 3601 156794 -101757 -374033 6445
$$ packed form
15950A35514e5047q1599D6079f4885I4729A7282J3531b66861A82061a39811A65025
15938A58963g5392f09E0553L2619a87142c8486q663j38337P6586F4108b75877
15926a60332L9273D46480b0582j21097M4867C3228h9252c2731N160B83359b54726
15914c21999C33967a78659B7689a05322B9274b74355A19405c56363I9176C473
15903e4441B90169F5692K64647b41338G7170f0694G1582J58046J81560E1124c14426
15891a00183b6186E3095j7541f3037A40428a37599B39377A09280i3506B67625
15880a73522L3524A20336b25362C9750a31633A2295a97531H0126c35473B566J29846
15869A32412a55973g1972i092r1883M9719G4723C601J53193a01757k72276F445
$$ plain form
15857 10345 -70734 102277 -224944 88123 -86604 12462 227959 51188 -131747 239701 -84403
15845 -270750 67053 113270 -182630 72523 37672 46282 -335346 -125347 11143 -185530 -20562
15833 393657 3716 15054 -544328 -274328 -36856 -110477 -70893 -18422 330149 -6088 -9080
15822 -9080 -394951 -357821 169177 -68303 33541 83272 -111762 -357114 28411 -56010 -79196
15811 -79196 -167186 79912 -117991 164973 -225738 -212411 -23448 -207959 310561 -26980 -189990
15800 -189990 -176302 -360487 -45365 154821 -133113 70412 -156887 -77347 -154175 -77624 -296756
15789 -296756 66356 189310 -162598 -13730 -80984 -241534 25418 -25229 -170236 143205
15778 -244531 161232 -112020 -47370 248842 239915 -48965 -489693 -3955 -38496 122547 -166420
$$ packed form
15857A0345g0734A02277b24944H8123h6604A2462K15497E1188a31747B39701h4403
15845b70750F7053M6217a82630G2523l4851Q610c35346a25347A1143a85530b0562
15833C93657C716J1338e44328K70000c6856p3621L9584a8422C30149f088k992
15822i080l85871L7130A69177f8303C3541M9731a11762k45352B8411e6010k3186
15811g9196q7990G9912a17991A64973b25738J3327b3448j84511C10561b6980j63010
15800a89990J3688j84185d5365A54821a33113G0412a56887g7347p6828P6551k19132
15789b96756F6356J22954a62598a3730o7254j60550B5418b5229j45007A43205
15778b44531A61232a12020d7370B48842q927d8965m40728c955l4541A22547a66420
$$ plain form
15766 -30094 219495 -91160 -166569 54250 101306 -90942 29059 -6035 17650 178610 -100485
15754 -282803 -345063 -387712 -178266 -275905 54851 309020 24914 -187962 -15938 132070 255633
15743 255633 152697 -11194 147489 34730 630122 118499 87083 -201858 284836 236166
15733 236166 48051 -216031 -78870 -135363 -149712 32974 -110359 -106099 151890 77280 -156724
15721 207840 121675 -187004 -8051 -76609 -109577 280199 78788 -478150 175848 26520 -261750
15709 126336 14084 25895 -162807 444711 -60393 123612 -122600 189368 -36648 18995
15698 -195316 -329700 -140114 -133115 -139417 270168 -136445 -213546 -24475 -64658 -112182 67494
15686 8890 -213915 -519752 -85005 -203383 -72443 -28522 -55446 -48054 -136591 -24823 220437
$$ packed form
15766c0094B19495i1160p5409E4250M7056i0942B9059f035A7650J60960a00485
15754b82803o2260m2649a78266r7639E4851K54169B4914a87962a5938A32070J23563
15743B55633j02936a1194A47489C4730N95392A18499l1416b01858B84836m8670
15733B36166D8051b16031g8870n6493j4349C2974a10359M260A51890p4610a56724
15721B07840q6165a87004h051o8558l2968B80199G8788d78150A75848B6520b61750
15709A26336A4084J1811a62807D44711f0393A23612a22600A89368c6648A8995
15698a95316j34384a40114O999o302B70168a36445p7101b4475m0183m7524F7494
15686H890b13915l05837h5005j18378g2443b8522k6924P392q8537b4823B20437
$$ plain form
15674 318706 -116758 -342511 181742 134606 82943 -136675 -180452 -108305 -433772 -319785
15664 -319785 448693 117045 -245611 43089 -71721 69619 -245349 -194756 116563 106494
15654 106494 -284363 -155081 340666 53541 44931 -10902 175644 -58479 -5777 208126 -113801
15642 3495 260797 -224584 -127092 117765 -97479 88168 -172390 -197610 231177 -31093 148230
15630 274478 34607 -26206 82547 -296465 -56778 -57714 68301 -131797 212822 118683 29463
15618 7785 130641 44677 -116453 -75508 57669 -170463 -334385 650 99843 -325682 -259842
15607 -259842 -291294 89974 -121827 54950 -45915 -25317 -109231 32045 -11057 121204 14988
15595 -343365 -272953 42839 -267643 189797 46668 -7934 215926 -219411 -7590 -311851 112510
$$ packed form
15674C18706a16758k25753A81742m7136n1663a36675m3777P2147l25467J13987
15664c19785D48693A17045b45611D3089g1721F9619b45349N0593A16563j0069
15654A06494b84363J29282C40666E3541q610a0902A75644e8479e777B08126a13801
15642C495K57302b24584R7492A17765i7479H8168a72390k5220B31177c1093A48230
15630B74478C4607b6206H2547b96465e6778r36F8301a31797B12822r4139B9463
15618G785J22856D4677a16453M0945E7669a70463j63922F50R9193c25682O5840
15607b59842l1452H9974a21827E4950d5915K0598q3914C2045a1057A21204A4988
15595c43365P0412D2839b67643A89797D6668g934B15926b19411g590l04261A12510
$$ plain form
15583 -298597 -215188 -119334 -103870 175253 310017 -64315 -26134 -195794 -127605 175681 -321154
15571 130008 151658 31346 20232 445525 -71828 -163463 56803 106090 276616 200130 651
15559 426708 268667 158623 -228633 -44614 -41210 -65850 -96895 -120035 81638 165595 -27863
15547 -161866 28838 -189968 94842 109246 -139244 58856 -408466 198470 503130 77150
15536 36906 122465 217396 329833 -102719 -275243 -47201 -67326 -41991 91668 -188276 93218
15524 -269960 252252 13208 -3249 122372 25913 -135896 -89987 -44343 -202247 -6287 -248760
15513 -248760 -196940 301132 -24706 -204870 -276217 215714 -34595 85265 391178 -5439 46366
15501 384106 -17911 -349295 -190334 671500 -174220 -296159 -4199 -130459 -9468 61076 -88759
$$ packed form
15583b98597Q3409R5854J5464A75253J34764f4315b6134j69660O8189A75681c21154
15571A30008K1650C1346j1114M25293g1828r1635E6803M9287J70526p6486F51
15559D26708j58041j10044b28633d4614L404k4640l1045k3140H1638Q3957b7863
15547a61866B8838a89968I4842J4404a39244E8856d08466A98470L04660G7150
15536C6906Q5559R4931J12437a02719j72524d7201k0125K5335I1668a88276I3218
15524b69960B52252A3208c249A22372B5913a35896M5909d4343j57904f287k42473
15513b48760N1820C01132b4706j80164p1347B15714c4595H5265L05913e439D6366
15501C84106a7911l31384J58961F71500a74220j21939d199j26260i468F1076h8759
$$ plain form
15489 106099 114779 112045 -52868 -93223 -53689 -172700 -118257 -118482 -324660 199352 23954 -92296
15476 24527 -30020 37338 -141255 -56899 -114309 101137 52443 -264466 -112338 -118465 366524
15464 -56328 56568 43794 64841 -125758 202401 -105797 225 287190 143677 231989 119748
15453 119748 -140355 4885 -94936 -128158 89148 -110841 152863 95952 406494 395884 -64405
15441 140261 166502 -340667 290868 230056 38402 394699 -223983 -203709 185896 -34704
15430 -2512 -175903 -119116 -64487 61050 -60742 -178055 98756 -122733 -68608 -133626 35467
15418 -213197 -498934 394795 26640 -373387 -13884 197684 349170 -121408 -63304 -66062
15408 -66062 335769 163491 104643 -389640 -64994 179398 57231 -184121 -189648 -32296 120006
$$ packed form
15489A06099Q680k734e2868m0355L9534j19011N4443k25k06178A99352B3954i2296
15476B4527c0020C7338a41255e6899n7410A01137m8694b64466a12338o127C66524
15464e6328E6568j2774K1047a25758B02401a05797B25K86965j43513Q8312j12241
15453A19748a40355D885i4936l3222H9148a10841A52863n6911L10542j0610f4405
15441A40261K6241c40667B90868o0812C8402L56297b23983K0274A85896c4704
15430b512j73391N6787N4629F1050f0742j17313I8756a22733N4125o5018C5467
15418b13197k85737C94795B6640c73387a3884A97684J51486a21408N8104k758
15408f6062C35769A63491n8848c89640f4994A79398E7231a84121n527c2296A20006
$$ plain form
15396 -45473 -235774 98462 163823 -253817 93937 -506647 -124883 54333 -120235 71054 -366090
15384 -123645 -28801 140461 -226445 -102582 -102994 7594 -23925 116037 44698 -182626 -393505
15373 -393505 -150145 -204482 -135284 -56566 173497 9345 8693 264869 173885 -124742 148353
15361 -37253 -242090 -193222 140260 -94728 116524 -39601 259842 -77026 3980 142273 182715
15350 182715 -97353 -134850 -149893 -706 -145511 -239989 58256 149271 18912 32999 -161150
15338 -13354 127252 154927 -369369 -167012 20070 -24893 879 124460 456991 -2045 214819
15326 -5767 459428 -204377 91983 -42742 25282 -81460 43713 134985 30596 70444 9008 -235255
15313 -29215 10608 245260 -225008 186158 129928 169234 227306 122291 276154 -251136
$$ packed form
15396d5473j90301I8462O5361b53817I3937e06647a24883E4333a20235G1054c66090
15384a23645b8801A40461b26445a02582m12G594b3925A16037D4698a82626k10879
15373c93505a50145n4337O9198e6566A73497I345o52K56176r0984a24742A48353
15361c7253k04837M8868A40260i4728A16524c9601B59842g7026C980J38293M0442
15350A82715i7353l7497j5043g06j44805r4478E8256R1015A8912J4087a61150
15338a3354A27252K7675c69369a67012B0070b4893H79J23581L32531b045B14819
15326e767D59428b04377I1983d2742B5282h1460D3713R1272C0596L9848I008b35255
15313b9215A0608K34652b25008A86158n6230L9306N8072j05015J53863b51136
$$ plain form
15302 210526 -80561 -63309 62652 -85364 -51524 107269 68659 -17723 67095 -255469 -199103
15291 -199103 -211730 151911 121077 283504 -89327 -12857 162450 231067 44271 377136 -261872
15279 -302358 -203310 203294 -124539 19425 -283112 176539 -93824 119178 61516 52114 227596
15268 227596 212058 -10098 43585 31198 -11384 -179036 7536 -227906 183433 43496 82488
15257 82488 65965 59189 229787 172700 149148 264751 187171 177743 729928 1706613 2048812
15246 2048812 1756416 1668818 1204100 826284 440484 108933 203174 -54566 64833 312662
15236 312662 96023 245086 -23978 127218 -36668 24367 153143 -67723 108459 46092 215966
15225 215966 -25009 41734 61842 266591 103592 41735 125460 554690 -549599 265751
$$ packed form
15302B10526h0561J7252F2652h5364L3840A07269l8610a7723F7095b55469N6366
15291a99103j2627A51911l0834J62427h9327a2857A62450O8617D4271L32865b61872
15279c02358R9048B03294a24539A9425b83112A76539i3824A19178n7662r402J75482
15268B27596j5538a0098D3585j2387a1384j67652G536b27906A83433D3496L8992
15257H2488j6523o776J70598n7087k3552J15603p7580r428N52185R76685L42199
15246B048812k92396q7598m64718l77816l85800A08933R4241e4566F4833K47829
15236C12662I6023J49063b3978A27218c6668B4367J28776f7723A08459D6092J69874
15225B15966b5009D1734K0108K04749A03592D1735Q3725M29230e49599B65751
$$ plain form
15214 211080 265182 -113240 446321 299770 92047 -106271 48317 320895 224431 -236008
15203 -36201 387720 323493 262487 69684 18090 -88070 56488 132118 227554 -159100 154914
15191 496478 261091 28205 368099 134323 229229 215672 342991 -293012 263358 -199790
15180 277376 358718 -76482 -217366 -53624 126297 -252 129457 83059 -254385 175547 33843
15168 -213307 -32273 138395 -46956 -143351 -293479 -74823 -26982 440202 314745 379502 296454
15157 296454 173318 63679 20699 393452 -77323 -85053 378517 -348342 312372 239530 61233
15145 -87445 133499 166581 180559 46183 -269756 93192 409491 33098 -174152 -111207 40906
15133 4168 252740 31595 22856 175254 109138 -371056 48906 17101 149593 162799 202270
$$ packed form
15214B11080N4102a13240D46321j46551I2047a06271D8317K72578r6464b36008
15203c6201C87720o4227o1006F9684A8090h8070E6488P5630R5436a59100A54914
15191D96478k35387B8205L39894A34323R4906j3557J27319b93012B63358a99790
15180B77376Q1342g6482j40884e3624A26297b52A29457m6398b54385A75547C3843
15168b13307c2273A38395d6956r6395j50128g4823b6982D40202j25457O4757q3048
15157B96454j23136F3679B0699L72753g7323p730C78517c48342C12372p2842F1233
15145h7445A33499L3082J3978D6183b69756I3192L16299C3098a74152O2945D0906
15133D168K48572C1595q739J52398o6116c71056D8906A7101J32492J3206L9471
$$ plain form
15122 202270 1362 2310 233744 527433 188 -32196 -21761 115726 382172 386191 -25295 236429
15109 275833 131786 264958 163478 479829 42179 -97854 319319 -345502 -138330 431542
15098 104453 265603 -178066 195120 81081 331676 -91114 1217 500310 78575 168741 -21457
15086 20333 -58044 156993 188541 166775 122795 -347682 -62219 67343 264388 -39263 30614
15074 121964 373201 239108 -58310 -233999 -110916 -145265 335670 488883 54207 151327
15064 151327 -295656 216388 -123481 220213 167325 -53841 298252 198542 267629 297001
15054 297001 198660 160688 105421 308707 -155991 121087 66852 65618 -91997 424434 10105
15042 140514 573808 22297 342094 268913 149911 238116 89597 388160 2084 23074 265831
$$ packed form
15122B02270A362R48K31434K93689A88c2196J0435A15726K66446M019b5295B36429
15109B75833A31786J33172j01480L16351D2179i7854C19319c45502a38330D31542
15098A04453J61150a78066A95120H1081K50595i1114A217M99093G8575R0166b1457
15086B0333e8044A56993L1548k1766m3980c47682f2219F7343J97045c9263C0614
15074A21964K51237j34093e8310j75689a10916l4349C35670J53213E4207R7120
15064A51327b95656B16388a23481B20213n2888e3841B98252r9710O9087K9372
15054B97001r8341l7972n5267K03286a55991A21087n4235j234i1997D24434A0105
15042A40514M33294B2297L19797p3181j19002Q8205H9597K98563B084K0990K42757
$$ plain form
15031 265831 161242 14438 403465 305344 161424 -47741 165770 11344 155717 -10245
15020 166989 180830 91457 -17098 430268 476607 -155448 185791 132106 326632 371068 367342
15009 367342 87571 266347 137661 35136 140734 315736 254567 185034 281557 359210 248190
14998 248190 413816 172769 462186 285012 145957 345628 123387 169929 223534 387089
14988 387089 116949 55693 513815 466231 254188 313149 -35544 -18757 248995 145778
14978 145778 283137 346056 100704 381143 65485 355069 562002 530990 -34996 177696
14967 26558 -969 113066 273171 25815 -100494 234362 438229 102966 358244 160387
14956 371110 254652 183768 351394 67870 274330 195260 225611 183430 177981 432626 410347
$$ packed form
15031B65831j04589A4438L89027r8121j43920d7741A65770A1344J44373a0245
15020A66989J3841q9373a7098D30268M6339a55448A85791n3685J94526M4436l726
15009C67342H7571J78776j28686C5136J05598J75002o1169o9533R6523P7653j11020
14998B48190J65626A72769K89417j77174j39055J99671A23387M6542N3605J63555
14988C87089A16949E5693M58122m7584k12043N8961c5544J6787B48995j03217
14978A45778J37359O2919A00704K80439F5485K89584K06933l1012c4996A77696
14967B6558i69A13066J60105B5815a00494B34362K03867A02966K55278A60387
14956C71110j16458p0884J67626F7870K06460p9070L0351m2181n449K54645k2279
$$ plain form
14945 410347 212659 213225 329237 190918 371579 -30108 259788 367849 323004 -229900
14934 295574 496200 348946 593170 225519 370564 374777 90407 263678 684602 340196
14923 487852 558816 237458 181569 371121 172278 116362 258079 352811 214056 4860 342280
14912 342280 421122 424818 227670 621351 341266 201296 311678 1222 191583 256341 103700
14900 132409 498261 -26715 173299 442131 130506 564429 528835 90690 276896 438315
14890 438315 192260 289204 333847 158362 257180 215813 312115 498400 268249 432175
14880 432175 340921 374045 434165 353073 124111 29677 329541 259969 303991 476875 92540
14868 729055 435348 73819 335141 354294 314476 188348 446427 390282 416594 589546
$$ packed form
14945D10347j97688N66J16012j38319J80661c0108B59788J08061m4845b29900
14934B95574K00626j47254K44224B25519J45045M213I0407J73271M20924C40196
14923D87852P0964B37458n5889J89552A72278n5916J41717R4732j38755D860L37420
14912C42280P8842L696j97148L93681k80085j39970J10382A222J90361O4758A03700
14900A32409L65852b6715A73299K68832A30506M33923l5594I0690J86206J61419
14890D38315A92260R6944M4643A58362R8818m1367R6302J86285k30151J63926
14880D32175r1254L3124O0120q1092A24111B9677K99864o9572M4022J72884I2540
14868G29055k93707G3819K61322J9153l9818j26128K58079n6145K6312J72952
$$ plain form
14858 589546 271236 311062 213464 534774 358982 270858 580102 416171 295140 518190
14848 518190 575101 684902 218344 459674 559269 350283 527653 457769 537686 502130
14838 502130 558746 531005 300028 572269 494380 173849 581739 494576 298850 482282
14828 482282 343754 855821 681129 185315 235242 569151 631318 587738 467217 535000
14818 535000 423041 499764 699215 562548 296654 551085 974139 614755 580219 202605
14807 662758 529844 717927 831850 401308 99980 596321 510855 813014 641614 533404
14797 533404 645324 362789 739016 619875 548326 736532 548268 213661 449502 563096
14787 563096 532996 570794 941072 650973 480140 447284 1016869 347081 641615 510963
$$ packed form
14858E89546B71236L9826r7598L21310j75792q8124L09244j63931j21031K23050
14848E18190N6911J09801B18344K41330R9595k08986J77370o9884P9917l5556
14838E02130N6616k7741k30977K72241p7889A73849M07890q7163j95726J83432
14828D82282j38528N12067j74692A85315M9927L33909O2167m3580j20521O7783
14818E35000j11959P6723J99451j36667k65894K54431M23054l59384l4536B02605
14807F62758j32914J88083J13923D01308I9980M96341q5466L02159j71400j08210
14797E33404J11920k82535L76227j19141p1549J88206j88264B13661K35841J13594
14787E63096l0100L7798L70278k90099j70833l2856N69585C47081K94534j30652
$$ plain form
14777 510963 547774 571855 471572 401861 558164 584883 727621 558549 591844 751315
14767 751315 602827 447949 897302 696496 855490 594389 670643 449186 846098 774482
14757 774482 642543 859923 606781 390719 974899 276416 590969 444819 772755 375154
14746 651004 983717 697877 595519 258069 696429 775561 753727 661135 828207 534778
14736 534778 937091 496527 666052 641346 836246 888710 804197 826923 730989 899734
14726 899734 707644 835736 960457 608694 1039906 914317 650630 740971 687640 791246
14716 791246 848111 753172 763407 913157 911263 772560 1043151 881734 841974 918684 793322
14705 793322 1080012 894551 803720 797994 854245 1015407 803305 930438 900630 1089684
$$ packed form
14777E10963L6811K4081j00283o9711J56303K6719J42738j69072L3295J59471
14767G51315j48488j54878M49353k00806J58994k61101P6254k21457L96912p1616
14757G74482j31939K17380k53142k16062N84180B76416L14553j46150L27936C75154
14746F51004L32713k85840j02358B58069M38360P9132k1834r2592J67072k93429
14736E34778M02313m40564J69525k4706J94900N2464q4513K2726r5934J68745
14726H99734j92090J28092J24721l51763M31212j25589k63687R0341n3331J03606
14716G91246N6865r4939J0235J49750j894j38703K70591j61417l9760P6710j25362
14705G93322K86690j85461r0831n726N6251J61162k12102J27133k9808J89054
$$ plain form
14695 1089684 1496050 1106520 1025591 982900 1584351 1196237 943399 985643 978849 779865
14685 779865 988818 924343 990746 704855 1107687 1212069 917195 1098567 982521 916179
14675 916179 1261031 942936 906162 891239 819006 891774 836725 815706 1045486 1155136 1033428
14664 1033428 989058 950403 1252162 1119364 859643 1298139 1246380 1281528 921635 1260750
14654 1260750 1276235 1196588 1481671 1193453 865101 1287277 1279295 1427453 1064892 1222976
14644 1222976 1162801 1268875 1265387 1180027 1542168 1332087 1312062 907524 1227449 1553707
14634 1553707 1205687 1335345 1302660 1459602 1237045 1313692 1448288 1257752 1510799 1462337
14624 1462337 1708820 1212796 1308697 1396263 1279898 1544433 1443404 1450146 1484883 1354797
$$ packed form
14695A089684M06366l89530q0929m2691O01451l88114k52838M2244o794j98984
14685G79865K08953o4475O6403k85891M02832J04382k94874J81372j16046o6342
14675I16179L44852l18095l6774j4923p2233P2768n5049k1019K29780J09650j21708
14664A033428m4370l8655L01759j32798k59721M38496n1759L5148l59893L39115
14654A260750J5485p9647K85083k88218l28352M22176p982J48158l62561J58084
14644A222976o0175J06074l488q5360L62141k10081k0025m04538L19925L26258
14634A553707l48020J29658l2685J56942k22557P6647J34596j90536K53047m8462
14624A462337K46483m96024R5901Q7566j16365K64535j01029O742L4737j30086
$$ plain form
14614 1354797 1550815 1276886 1485002 1644812 1553888 1500636 1362748 1510632 1690897 1694779
14604 1694779 1729136 1722379 1634985 1609053 1927702 1836381 1627478 1766916 1665163 1478966
14594 1478966 1749734 1586626 1948610 1672674 2035073 1618825 1735644 1788662 1911394 2177658
14584 2177658 1987933 1833864 2044729 2163017 1943707 2079216 1961935 2155582 1989940
14575 1989940 2483999 2165344 2262245 2524756 2063130 2166639 2458837 2495657 2403992 2619535
14565 2619535 2345405 2481632 2972585 2572475 2509786 2968860 2929728 2827428 3066623 3291076
14555 3291076 3645606 3733700 3543334 4391463 4971742 5974901 8066194 11815009 21287585
14546 21287585 35893082 41253566 26443766 14812305 7210329 4101140 3135330 2683655
$$ packed form
14614A354797J96018k73929K08116J59810r0924n3252j37888J47884J80265L882
14604A694779L4357o757q7394k5932L18649r1321k08903J39438j01753j86197
14594A478966K70768j63108L61984k75936L62399m16248J16819N3018J22732K66264
14584B177658j89725j54069K10865J18288k19310J35509j17281J93647j65642
14575A989940M94059l18655R6901K62511m61626J03509K92198L6820r1665K15543
14565B619535k74130J36227M90953m00110o2689M59074l9132j02300K39195K24453
14555C291076L54530Q8094j90366Q48129N80279J003159K091293L748815R472576
14546B1287585J4605497N360484j4809800j1631461G210329l109189r65810m51675
$$ plain form
14538 2683655 2549091 2465615 2254679 2199456 2200958 1966150 2202602 2345297 2171793 2220120
14528 2220120 2268798 2190075 2134987 2396158 2586602 2615387 2893057 2398388 2592638 2406912
14518 2406912 2491523 2843749 2738523 2744517 2500399 2829491 2909259 3034530 2995310 3135450
14508 3135450 2737457 3067465 3099119 2835742 3206801 3151308 2879365 3355013 3310048 3442071
14498 3442071 3207233 3544468 3735938 3449918 3888479 3730484 3262686 3543818 3671261
14489 3671261 3889882 3612158 3954755 3736329 3677833 4161158 3784128 3880781 4048547 3964191
14479 3964191 4328777 4086710 4300205 3997570 4220373 4198849 4097024 4347263 4437564 4568916
14469 4568916 4309992 4651808 4482056 5006557 4831093 4604502 5075917 4499512 4823595
$$ packed form
14538B683655j34564q3476k10936n5223J502k34808K36452J42695j73504M8327
14528B220120M8678p8723n5088K61171J90444K8785K77670m94669J94250j85726
14518B406912Q4611L52226j05226N994k44118L29092P9768J25271l9220J40140
14508C135450l97993L30008L1654k63377L71059n5493k71943M75648m4965J32023
14498C442071k34838L37235J91470k86020M38561j57995m67798K81132J27443
14489C671261K18621k77724L42597k18426n8496M83325l77030R6653J67766q4356
14479C964191L64586k42067K13495l02635K22803k1524j01825K50239R0301J31352
14469D568916k58924L41816j69752N24501j75464k26591M71415n76405L24083
$$ plain form
14460 4823595 4881166 5222597 5016947 5184221 5258200 5291777 5096441 5422396 5269508 5626445
14450 5626445 5569180 5698463 5618828 5606412 6209672 6078646 6106537 6026623 6296164 5957941
14440 5957941 6441962 6360165 6675624 6394861 6489493 6642542 6857684 6913126 7211015 7298357
14430 7298357 7099770 7727775 7672582 7503309 7541526 7707928 7833727 7919373 8246274 8352717
14420 8352717 8246710 8177132 8693047 8719654 8951881 9264091 8837243 9192149 9373799 9688141
14410 9688141 9496396 9817643 9668434 9848747 9962078 10370450 10810746 10406805 10479723 10910402
14400 10910402 11199762 11698802 11595448 11620198 11880436 12189078 12143075 12436307 12351897 12786308
14390 12786308 12804278 13029809 13579342 13680856 14220313 14341375 14328365 14763053 14992520 15338852
$$ packed form
14460D823595N7571L41431k05650J67274P3979L3577j95336L25955j52888L56937
14450E626445n7265J29283p9635j2416O03260j31026K7891p9914K69541l38223
14440E957941M84021q1797L15459k80763R4632J53049K15142N5442K97889Q7342
14430G298357j98587O28005n5193j69273L8217J66402J25799Q5646L26901J06443
14420H352717j06007o9578N15915K6607K32227L12210m26848L54906J81650L14342
14410I688141j91745L21247j49209J80313J13331M08372M40296m03941P2918M30679
14400A0910402K89360M99040j03354K4750K60238L08642m6003K93232q4410M34411
14390A2786308J7970K25531N49533J01514N39457J21062j3010M34688K29467L46332
$$ plain form
14380 15338852 15798896 15990333 15977050 16322075 16908059 16671408 17369643 17692325 18026066
14371 18026066 18340781 18650136 19336336 19644314 19932456 20275465 20702655 21193478 21761320
14362 21761320 21972399 22508688 23066609 23610077 24088023 24591136 25339488 25636118 26567951
14353 26567951 26661886 27699732 28462521 29450352 29556119 30378889 31157844 31567541 32871920
14344 32871920 33690965 34330236 35204592 36769448 37440645 38071180 39440152 40055322 41269002
14335 41269002 42750913 43965912 45455370 46897707 48027119 49510974 51218126 52851524
14327 52851524 54738365 56149439 58112625 60540809 62233825 64429968 66361224 68910680
14319 68910680 71556563 74092721 76514690 79669140 82580517 85566028 89159832 93018094
$$ packed form
14380A5338852M60044J91437j3283L45025N85984k36651O98235L22682L33741
14371A8026066L14715L09355O86200L07978K88142L43009M27190M90823N67842
14362B1761320K11079N36289N57921N43468M77946N03113P48352K96630R31833
14353B6567951R3935J037846P62789R87831J05767Q22770P78955M09697J304379
14344C2871920Q19045O39271Q74356J564856O71197O30535J368972O15170J213680
14335D1269002J481911J214999J489458J442337J129412J483855J707152J633398
14327E2851524J886841J411074J963186K428184J693016K196143J931256K549456
14319F8910680K645883K536158K421969L154450K911377K985511L593804L858262
$$ plain form
14311 93018094 96533156 100329086 104534432 109195840 113926172 118650658 124256454 129742905
14303 129742905 135332726 142019368 148103668 155267859 162841831 170705199 178883233 187947047
14295 187947047 197159288 206939748 217237126 228074588 239533850 251623338 264106856
14288 264106856 277536657 291150957 305099852 320120629 334846760 349887592 365404021
14281 365404021 380863536 395908293 410546440 424748943 438026463 450026505 460851054
14274 460851054 469596506 476063825 478499275 476329348 474128713 473635231 470522268 465877787
14266 465877787 460304777 452079367 441913113 429541310 415841397 401174188 386049082
14259 386049082 370240902 354253672 338355804 322122794 306966195 292982295 279271728
$$ packed form
14311I3018094L515062L795930M205346M661408M730332M724486N605796N486451
14303A29742905N589821O686642O084300P164191P573972P863368Q178034R063814
14295A87947047R212241R780460J0297378J0837462J1459262J2089488J2483518
14288B64106856J3429801J3614300J3948895J5020777J4726131J5040832J5516429
14281C65404021J5459515J5044757J4638147J4202503J3277520J2000042J0824549
14274D60851054Q745452O467319K435450k169927k200635m93482l112963m644481
14266D65877787n573010q225410j0166254j2371803j3699913j4667209j5125106
14259C86049082j5808180j5987230j5897868j6233010j5156599j3983900j3710567
$$ plain form
14252 279271728 265552802 252387646 239790051 227996905 216615111 206111634 196388189
14245 196388189 186903474 178283637 169811136 161730559 154083673 147221892 140600612 134531552
14237 134531552 128856260 123234009 118154872 112871096 108552770 104514228 100146828 96039498
14229 96039498 92679810 88776332 84988862 81992250 78840893 76294161 73272204 71101436
14221 71101436 68388397 65907044 64027124 61770693 59790030 57798019 55978093 54349686
14213 54349686 53049949 51346550 49799041 48002028 46357597 45436031 44765291 43545363
14205 43545363 42034196 40392957 39319100 38430382 37495497 36894587 36061106 34773252 33757130
14196 33757130 32972149 31704039 31064366 30574920 29814472 28857808 28242739 27722870 27000701
$$ packed form
14252B79271728j3718926j3165156j2597595j1793146j1381794j0503477r723445
14245A96388189r484715q619837q472501q080577p646886o861781o621280o069060
14237A34531552n675292n622251n079137n283776m318326m038542m367400m107330
14229I6039498l359688l903478l787470k996612l151357k546732l021957k170768
14221G1101436k713039k481353j879920k256431j980663j992011j819926j628407
14213E4349686j299737j703399j547509j797013j644431r21566o70740j219928
14205D3545363j511167j641239j073857q88718r34885o00910q33481j287854j016122
14196C3757130p84981j268110o39673m89446p60448r56664o15069n19869p22169
$$ plain form
14187 27000701 25949827 25705993 24968974 24444003 24026232 23661481 23078743 22557394 22000852
14178 22000852 21465177 21366016 20314750 20436871 19937585 19440329 19065095 18522198 18662809
14169 18662809 18061151 17655549 17452530 17157480 16689667 16403956 15995759 15670418 15293134
14160 15293134 15187668 14570078 14440543 14267505 14275312 14043917 13585849 13471572 13396601 13060002
14150 13060002 12751505 12228662 12586375 11961103 12180259 11938738 11766452 11524305 11006012
14141 11006012 11408657 11050897 11071630 10653723 10582219 10292519 10113322 10198512 9641860 9741125
14131 9741125 9542158 9063617 9409523 8798935 9121566 8802918 8590389 8625319 8695714 8292465
14121 8292465 8534678 8102053 8249213 7765329 7889130 7992040 7897849 7643074 7472056 7314948
$$ packed form
14187B7000701j050874k43834p37019n24971m17771l64751n82738n21349n56542
14178B2000852n35675r9161j051266J22121m99286m97256l75234n42897J40611
14169A8662809o01658m05602k03019k95050m67813k85711m08197l25341l77284
14160A5293134j05466o17590j29535j73038P807k31395m58068j14277p4971l36599
14150A3060002l08497n22843L57713o25272K19156k41521j72286k42147n18293
14141A1006012M02645l57760K0733m17907p1504k89700j79197Q5190n56652R9265
14131I741125j98967m78541L45906o10588L22631l18648k12529L4930P0395m03249
14121H292465K42213m32625J47160m83884J23801J02910r4191k54775j71018j57108
$$ plain form
14111 7314948 7372257 7426697 7041798 6904561 7326979 7016793 7093762 6980904 6625402 6685948
14101 6685948 6601513 6708392 6502263 6382487 6344911 6192810 6037957 5880855 6080406 5743430
14091 5743430 5605338 5806621 5762634 5749140 5600785 5446916 5234851 5241847 5204673 4866882
14081 4866882 5477355 5242963 5037810 5074873 5131786 5133597 5084339 4682324 4912523 4871472
14071 4871472 4735449 4439556 4494800 4386634 4521993 4379077 4557523 4232953 4287216 4352602
14061 4352602 4219120 4426378 4174289 4512525 4258551 3890172 4235961 4203943 3908113 3831490
14051 3831490 4017584 3638552 3884733 3744894 3855082 3380342 3647329 3629612 3593331 3483966
14041 3483966 3312966 3578622 3418108 3482739 3359487 3244605 3010472 3236740 3102135 3595478
$$ packed form
14111G314948N7309N4440l84899j37237M22418l10186P6969j12858l55502O0546
14101F685948q4435J06879k06129j19776l7576j52101j54853j57102J99551l36976
14091E743430j38092K01283m3987j3494j48355j53869k12065O996l7174l37791
14081D866882O10473k34392k05153L7063N6913J811m9258m02015K30199m1051
14071D871472j36023k95893N5244j08166J35359j42916J78446l24570N4263O5386
14061D352602j33482K07258k52089L38236k53974l68379L45789l2018k95830p6623
14051C831490J86094l79032K46181j39839J10188m74740K66987j7717l6281j09365
14041C483966j71000K65656j60514O4631j23252j14882k34133K26268j34605M93343
$$ plain form
14031 3595478 3056746 3310481 3214207 3222847 2887688 3014746 2878237 2967410 2933647 2872273
14021 2872273 2976680 2967659 3087663 2999549 2747688 2530506 2811443 2413294 2797569 2499730
14011 2499730 2606711 2617110 2556723 2721987 2127993 2257234 2435815 2271132 2543768 2214998
14001 2214998 2526767 2691513 2260203 2196415 2345625 2478586 2537943 2527412 2233272 2533211
13991 2533211 2695456 2771296 4027732 7073130 15002452 30080163 40872938 29097014
13983 29097014 16398286 10220608 7269527 5562953 4958279 4029649 3728145 3437106
13975 3437106 3553694 3321402 2639149 2890981 2817174 2759827 2503286 2722272 2662699 2485490
13965 2485490 2599730 2341588 2324271 2383900 2367743 2584860 2304670 2195002 2072034 2239034
$$ packed form
14031C595478n38732K53735r6274Q640l35159J27058j36509Q9173l3763o1374
14021B872273J04407r021J20004q8114k51861k17182K80937l98149L84275k97839
14011B499730J06981J0399o0387J65264n93994J29241J78581j64683K72636l28770
14001B214998L11769J64746m31310o3788J49210J32961N9357j0531k94140K99939
13991B533211J62245P5840J256436L045398P929322J5077711J0792775j1775924
13983B9097014j2698728o177678k951081j706574o04674r28630l01504k91039
13975C437106J16588k32292o82253K51832p3807n7347k56541K18986n9573j77209
13965B485490J14240k58142j7317N9629j6157K17117k80190j09668j22968J67000
$$ plain form
13955 2239034 2146752 2395294 2132343 1864344 2337257 2374354 1774603 2053101 2435067 1951889
13945 1951889 2193351 1625011 1575954 1866739 1742455 1931561 1759042 2034792 1846385 1693642
13935 1693642 1984475 1798682 1896803 2047412 1854028 1974636 1803878 1826827 1631594 1702862
13925 1702862 1999594 1826936 1752822 1441143 1555270 1441259 1708605 1894567 1403675 980671
13915 980671 1424562 1431471 1645389 1596894 1516955 1584772 1543534 1578987 1492707 1340398 1185032
13904 1185032 1672083 1787309 1864186 1475016 1770898 1601835 1780056 1476157 1350661 1370902
13894 1370902 1200255 1518904 1254299 1295034 1360237 1558290 1165828 1602321 1074464 1184593
13884 1184593 1515763 1395151 1268664 1210676 1081610 1429247 1515876 1199342 770764 1084938
$$ packed form
13955B239034r2282K48542k62951k67999M72913L7097n99751K78498L81966m83178
13945A951889K41462n68340m9057K90785j24284J89106j72519K75750j88407j52743
13935A693642K90833j85793R8121J50609j93384J20608j70758K2949j95233P1268
13925A702862K96732j72658p4114l11679J14127j14011K67346J85962m90892m23004
13915I80671M43891O909K13918m8495p9939O7817m1238L5453q6280j52309j55366
13904A185032M87051J15226P6877l89170K95882j69063J78221l03899j25496K0241
13894A370902j70647L18649k64605M0735O5203J98053l92462M36493n27857J10129
13884A184593L31170j20612j26487n7988j29066L47637Q6629l16534m28578L14174
$$ plain form
13874 1084938 1207837 1422743 953363 1238633 1425884 1018705 1090016 1016826 1158499 1328236
13864 1328236 1236556 777864 1240260 1171829 1099838 1290605 1150370 936962 1052945 1100409
13854 1100409 1014899 1057691 1041385 781215 854076 1216309 1100904 1216217 1247120 1078082
13844 1078082 919816 905662 1237021 891254 831184 1020062 1040410 877882 765141 970627
13834 970627 802339 1004259 787104 872468 881161 958467 1174027 1141679 1112595 1296663 1021710
13823 1021710 1195003 1086453 1152993 956150 1108531 615246 958277 963476 1034806 947895
13813 947895 1052595 1022691 752654 865333 1017372 832524 803638 926478 806971 838127
13803 838127 800042 999962 792287 659785 1056693 893964 814871 781493 587683 857304
$$ packed form
13874A084938J22899K14906m69380K85270J87251m07179P1311p3190J41673J69737
13864A328236r1680m58692M62396o8431p1991J90767j40235k13408J15983M7464
13854A100409q5510M2792j6306k60170P2861L62233j15405J15313L0903j69038
13844A078082j58266j4154L31359l45767o0070J88878K0348j62528j12741K05486
13834I70627j68288K01920k17155Q5364Q693P7306K15560l2348k9084J84068k74953
13823A021710J73293j08550O6540j96843J52381m93285L43031N199P1330q6911
13813I47895J04700k9904k70037J12679J52039j84848k8886J22840j19507L1156
13803H38127l8085J99920k07675j32502L96908j62729p9093l3378j93810K69621
$$ plain form
13793 857304 970116 1004088 801777 1159238 939614 834728 391802 466003 674485 1027326
13783 1027326 815246 1039755 842407 904955 412004 780065 872062 700420 961508 686697
13773 686697 444284 496808 818146 819940 1062346 339594 980448 506503 962702 797811
13763 797811 536199 867915 799491 777863 564971 1055267 616715 779615 468395 624490
13753 624490 525610 705391 537728 782542 599738 992493 501242 770048 572461 496470
13743 496470 980374 578644 679953 683716 795692 767229 747045 504356 231921 689634
13733 689634 821589 777470 231751 561389 809303 698622 836472 285230 344887 598966
13723 598966 481856 826200 492357 423764 525845 511951 510781 751323 576875 361340
$$ packed form
13793H57304J12812L3972k02311L57461k19624j04886C91802P4201K08482L52841
13783A027326k12080K24509j97348O2548D12004L68061R1997j71642K61088k74811
13773F86697k42413N2524L21338J794K42406C39594O40854m73945M56199j64891
13763G97811k61612L31716o8424k1628k12892M90296m38552J62900l11220J56095
13753F24490r8880J79781j67663K44814j82804L92755m91251K68806j97587p5991
13743D96470M83904m01730J01309L763J11976k8463k0184k42689B31921M57713
13733F89634J31955m4119B31751L29638K47914j10681J37850B85230N9657K54079
13723E98966j17110L44344l33843o8593J02081j3894j170K40542j74448k15535
$$ plain form
13713 361340 423392 793619 803957 629109 590412 483967 607091 629946 529236 502272
13703 502272 475471 465509 776825 665215 820545 647310 851252 449625 679586 606263
13693 606263 633549 558781 733818 703404 268674 453457 800855 339163 686764 598847
13683 598847 520709 436797 730316 577804 724491 492239 645650 417853 522564 603595
13673 603595 658100 645257 446728 491584 474299 203135 316816 559195 527422 412061
13663 412061 673865 409038 539986 610045 553468 677104 661808 478600 537944 435320
13653 435320 593273 559682 194177 479974 479452 441240 190151 725346 388155 174737
13642 487094 406399 711104 665638 345086 327828 343005 391676 162934 402945 650067
$$ packed form
13713C61340O2052L70227J0338j74848l8697j06445J23124K2855j00710k6964
13703E02272k6801r962L11316j11610J55330j73235K03942m01627K29961p3323
13693F06263K7286p4768J75037l0414B68674J84783L47398C39163L47601q7917
13683E98847p8138q3912K93519j52512J46687k32252J53411k27797J04711Q1031
13673F03595N4505j2843j98529M4856j7285B03135J13681K42379l1773j15361
13663D12061K61804k64827J30948P0059n6577J23636j5296j83208N9344j02624
13653D35320J57953l3591A94177K85797n22l8212A90151N35195l37191A74737
13642D87094q0695L04705m5466l20552j7258J5177M8671A62934K40011K47122
$$ plain form
13632 650067 643154 220199 750130 565447 853035 597267 364451 500720 469087 891255
13622 891255 341785 465437 410508 90201 555786 655261 35513 308598 620885 330849
13612 330849 342265 271219 341625 533482 276915 614295 534286 174098 423566 580588
13602 580588 656014 27106 620780 388927 433511 290593 297065 541513 196085 422311
13592 422311 405951 161502 439301 378449 512603 534255 282683 175199 233148 413136
13582 413136 316893 316914 275132 459838 333626 353998 646873 265656 121800 226562 584480
13571 584480 493610 637163 103779 264576 613322 450179 193647 300520 728997 386747
13561 386747 128044 303939 447624 283623 701698 104241 357815 522306 356142 220522
$$ packed form
13632F50067o913B20199N29931j84683K87588k55768k32816J36269l1633M22168
13622H91255C41785J23652n4929I0201M65585R9475C5513K73085L12287k90036
13612C30849J1416p1046P0406J91857k56567L37380q0009A74098K49468J57022
13602E80588P5426B7106N93674k31853M4584j42918O472K44448A96085K26226
13592D22311j6360A61502K77799o0852J34154K1652k51572j07484N7949J79988
13582D13136r6243K1m1782J84706j26212K0372K92875B65656A21800J04762L57918
13571E84480r0870J43553A03779J60797L48746j63143A93647J06873M28477l42250
13561C86747A28044J75895J43685j64001M18075A04241K53574J64491j66164j35620
$$ plain form
13551 220522 350852 271356 229761 387157 136326 50424 347796 539894 485712 442428
13541 442428 362644 31198 170023 277474 269908 403558 271009 165920 54781 408229
13531 408229 231977 568275 488190 147570 325090 114898 428719 45840 438302 389350
13521 389350 245687 219969 204597 551437 485122 -99120 405661 530301 488963 -19812 332523
13509 259134 96600 302829 401213 274449 491068 324519 234550 55614 577717 62788
13498 453224 172447 151115 238994 389640 409670 676662 222685 604080 297674 -136350
13487 129894 478114 11371 208187 380918 264369 92314 448348 474036 267382 150099
13477 150099 248142 368660 736359 271759 321751 219138 228159 -1529 281250 167148 219904
$$ packed form
13551B20522J30330p9496m1595J57396A36326E0424K97372J92098n4182m3284
13541D42428p9784C1198J38825J07451p566J33650j32549j05089E4781L53448
13531D08229j76252L36298q0085A47570J77520A14898L13821D5840L92462m8952
13521C89350j43663k5718j5372L46840o6315i9120D05661J24640m1338a9812C32523
13509B59134I6600K06229R8384j26764K16619j66549q9969E5614N22103F2788
13498D53224A72447k1332Q7879J50646K0030K66992B22685L81395B97674a36350
13487A29894L48220A1371J96816J72731j16549I2314L56034K5688k06654j17283
13477A50099R8043J20518L67699B71759M9992j02613R021a529B81250j14102N2756
$$ plain form
13466 219904 -172335 -112446 -73971 565093 337641 -65429 -32752 477113 293834 293236 102365
13454 541 471648 717808 483721 199391 222194 253195 33526 380096 331879 99630 153740
13443 153740 346782 199896 273337 214677 322287 -102603 267784 27023 12484 240116
13433 240116 235192 337984 310145 515746 402731 274344 115707 215502 106637 349811
13423 349811 53674 433976 218872 368886 68209 16972 178762 -157046 166000 50146
13412 -17891 30184 31747 192982 327848 413651 111627 463874 -91653 50735 18584 361906
13401 361906 211742 -56728 198192 -20663 84907 257961 136190 137646 232959 202420 -19792
13389 205849 190740 351770 49777 53162 113157 26596 533128 330935 178333 169511 134474
$$ packed form
13466B19904a72335N9889L8475E65093k27452f5429L2677D77113j83279n98A02365
13454E41M71107K46160k34087A99391K2803L1001C3526L46570m8217I9630N4110
13443A53740J93042j46886P3441n8660J07610a02603B67784B7023A2484K27632
13433B40116m924J02792k7839K05601j13015j28387A15707R9795A06637K43174
13423C49811E3674L80302k15104J50014F8209A6972J61790a57046A66000E0146
13412a7891C0184J563J61235J34866Q5803A11627L52247i1653E0735A8584L43322
13401C61906j50164e6728A98192b0663H4907J73054j21771J456R5313l0539a9792
13389B05849j5109J61030D9777L385N9995B6596N06532k02193j52602q822l5037
$$ plain form
13378 134474 29212 484652 231655 448300 341928 482814 -135848 280913 146390 179016
13368 179016 250012 395418 115222 616484 144920 345498 214625 109275 381173 295838
13358 295838 142414 612208 324753 255024 165833 3770 63404 528651 454688 335109 162923
13346 -169162 550788 182207 438751 330915 327118 302385 364511 -68085 353126 12264 277847
13335 277847 317950 279083 369455 455037 290232 188914 79912 193481 316522 111992
13324 182510 203155 53176 203955 360444 316787 281776 276203 159231 153542 118434 176108
13313 176108 -118079 492687 169583 211646 338288 112742 313468 327990 365485 154051
13302 98330 294468 82263 174293 494426 62696 162204 1465 89064 170084 344856 240727
$$ packed form
13378A34474B9212M55440B31655K16645j06372J40886a35848B80913j34523L2626
13368A79016P0996J45406A15222N01262A44920K00578j30873j05350K71898q5335
13358B95838A42414M69794k87455o9729q9191C770N9634M65247p3963j19579A62923
13346a69162E50788A82207K56544j07836l797k4733O2126f8085C53126A2264K65583
13335B77847M0103l8867R0372Q5582j64805j01318G9912J13569J23041A11992
13324A82510K0645E3176J50779J56489m3657l5011n573j16972n689l5108N7674
13313A76108a18079D92687A69583M2063J26642A12742K00726J4522L7495A54051
13302I8330J96138H2263R2030L20133F2696R9508A465Q7599Q1020J74772j04129
$$ plain form
13291 240727 43782 -275548 -30792 101410 128882 -111797 344922 57936 432409 -240537
13280 -148310 490527 245418 92920 524789 3306 -55227 59441 -5722 105768 32279 168373
13269 168373 290941 172888 461582 517011 248743 57054 402345 70764 222468 30370
13258 179310 -38712 -109938 91634 109284 282307 164763 -103243 219707 69317 303354
13248 303354 151490 289668 -30712 261597 122025 -196130 -6599 36502 31762 -4515 -61795
13237 -61795 369594 342833 41023 124359 19774 66075 121224 140536 90218 -211963 45132
13225 146814 305130 315095 168804 91068 284345 114149 419230 126570 69938 72518 66537
13214 66537 -56710 191885 -217595 -6497 124458 40352 110464 130007 113785 44331 173637
$$ packed form
13291B40727D3782b75548c0792A01410K7472a11797C44922E7936L74473b40537
13280a48310D90527k45109I2920M31869C306e5227E9441e722A05768C2279J36094
13269A68373J22568j18053K88694N5429B48743E7054L45291G0764J51704C0370
13258A79310c8712p1226I1634J7650J73023j17544a03243B19707F9317K34037
13248C03354A51490J38178c0712B61597A22025a96130f599C6502m740d515n7280
13237f1795C69594k6761D1023Q3336A9774M6301N5149J9312n0318b11963D5132
13225A46814J58316R965j46291p7736J93277A14149L05081A26570n6632K580n981
13214F6537e6710A91885b17595f497A24458D0352P0112J9543j6222D4331J29306
$$ plain form
13203 173637 107486 -24579 162468 263897 -31023 12222 59645 281685 -160447 73793 118369
13192 118369 189646 -13734 -54401 -8465 138503 313038 378677 277766 117216 164400 -172919
13180 271985 23158 298098 -261541 104867 -43846 -76680 226073 453766 384638 434160
13170 434160 193768 19026 221902 53919 85758 -3323 917 -144372 184236 237877 -223426
13158 31737 182612 291460 137056 -195185 275607 210241 195798 300685 238142 148119
13148 148119 172963 -14223 14438 136075 316481 48513 -111801 -130119 19762 210016 80690
13136 -123474 27491 344321 -115598 176590 -21643 -90524 22444 55991 454682 -206192
13125 -44616 173470 325072 222075 -132623 -226061 129659 83001 142858 343370 -147726
$$ packed form
13203A73637o6151b4579A62468J01429c1023A2222M7423K22040a60447G3793M4576
13192A18369P1277a3734m0667h465A38503J74535O5639j00911A17216M7184a72919
13180B71985B3158K74940b61541A04867d3846l2834B26073K27693o9128M9522
13170D34160A93768A9026K02876E3919L1839c323I17a44372A84236N3641b23426
13158C1737J50875J08848A37056a95185B75607o5366j4443J04887o2543r0023
13148A48119K4844a4223A4438J21637J80406D8513a11801j8318A9762J90254H0690
13136a23474B7491L16830a15598A76590b1643o8881B2444L3547L98691b06192
13125d4616A73470J51602j02997a32623r3438A29659m6658N9857K00512a47726
$$ plain form
13114 198002 -181139 -23084 257821 -27364 166997 -64296 -37573 257794 25359 -320182
13103 315475 368340 -395708 -89512 -346873 153821 53523 62726 198136 -104128 14670 58556
13092 58556 313213 -107374 323188 -100669 17153 24415 192405 93144 34857 212778 88926
13080 120587 136718 270523 351986 -32358 -88017 255296 57287 -13623 358113 83648 44249
13069 44249 -323344 229172 19980 82712 642115 82607 -35193 150548 244481 78006 -131953
13057 312018 167796 -230824 130227 516727 -116408 102208 -231501 161226 -271925 -147305
13047 -147305 2749 -9483 -59487 271221 90541 -206360 35517 184271 -29451 226395 279296
13036 279296 110453 139548 328261 -155325 -22340 40993 108489 230665 144327 169491 203839
$$ packed form
13114A98002a81139b3084B57821b7364A66997f4296K6723B57794B5359c20182
13103C15475N2865c95708h9512k57361A53821E3523R203J35410a04128A4670M3886
13092E8556K54657a07374C23188a00669A7153P262J67990I3144C4857J77921H8926
13080A20587J6131J33805Q1463c2358n5659B55296E7287a3623C58113H3648l9399
13069D4249c23344B29172A9980O2732N59403H2607c5193A50548R3933G8006a31953
13057C12018j44222b30824A30227L86500a16408A02208b31501A61226b71925J24620
13047a47305B749i483n0004B71221I0541b06360C5517J48754b9451B26395N2901
13036B79296A10453K9095J88713a55325b2340D0993O7496J22176q6338K5164L4348
$$ plain form
13025 203839 205813 213960 262464 143200 -152591 -78873 22349 373443 -109332 -169140 -276612
13014 -276612 165297 403149 172861 402062 140858 196846 -12903 -127896 100605 -101403
13003 -30001 272544 397209 516845 -57556 172154 -52864 332384 187329 -97118 122197
12992 -280532 3218 -218043 187440 386876 44587 213212 70527 132140 90536 -204256 -7035
12980 -269039 228073 130798 -46288 -292517 216294 -231003 -31964 277861 -46679 138169
12969 177375 279438 9300 -99333 -108851 46485 639174 235686 136454 257924 206636 -103571
12957 96675 160663 257049 -53061 -210593 -115196 74217 335673 -36751 -114131 -95843 -139985
12946 -139985 41736 25004 6106 -12413 330261 -183541 -49910 -40787 90726 79240 116992
$$ packed form
13025B03839J974Q147M8504j19264a52591P3718B2349L51094a09332n9808j07472
13014b76612A65297K37852A72861K29201A40858N5988a2903j14993A00605a01403
13003c0001B72544J24665J19636e7556A72154e2864C32384j45055i7118A22197
12992b80532C218b18043A87440J99436D4587J68625G0527O1613m1604b04256g035
12980b69039B28073r7275d6288k46229B16294b31003c1964B77861d6679A38169
12969A77375J02063I300i9333r518D6485N92689B35686r9232J21470n1288a03571
12957I6675O3988R6386e3061j57532R5397G4217K61456c6751p7380J8288m4142
12946a39985D1736j6732F106a2413C30261a83541d9910R123I0726j1486L7752
$$ plain form
12935 116992 -42422 83248 336730 221050 257320 117457 -26468 1241 109632 81992 152565
12924 152565 259385 199280 320265 -609 -83063 229824 220880 -190454 65616 -61512 -174330
12913 -174330 -122362 376832 -52027 -308590 -358697 232020 -196030 -20499 188670 -17423
12902 -36756 -193298 290434 204797 357987 -92494 133413 31756 -113946 327140 -264694
12891 174192 201374 27356 133469 313360 -285944 54987 96950 -83479 353178 273132 203266
12880 203266 -173938 442854 145338 -74071 146500 289193 25606 223314 -420126 192835
12869 229611 -77185 21408 -81297 196033 -153300 -175133 32308 68922 232227 -83619 190677
12857 -149428 -276150 178399 306079 -128805 183844 262675 -325556 109692 27215 -82277
$$ packed form
12935A16992d2422H3248K53482j15680L6270A17457b6468A241J08391k7640P0573
12924A52565J06820o0105J20985f09q2454B29824q944a90454F5616f1512j12818
12913a74330N1968C76832e2027k56563n0107B32020a96030b0499A88670a7423
12902c6756j56542B90434q5637J53190i2494A33413C1756a13946C27140b64694
12891A74192K7182B7356J06113J79891b85944E4987M1963h3479C53178q0046o9866
12880B03266a73938D42854A45338g4071A46500J42693B5606J97708d20126A92835
12869B29611g7185B1408h1297A96033a53300k1833C2308L6614J63305h3619A90677
12857a49428j26722A78399J27680a28805A83844P8831c25556A09692B7215h2277
$$ plain form
12846 104436 26294 56839 -271506 210212 -396868 25750 49296 200867 489017 268167
12836 268167 -137004 -369448 23097 77685 -133166 407359 41653 -140132 -168906 19824
12825 108938 327083 69277 -159574 90613 36240 384025 45968 -183783 130009 144251
12815 144251 347494 153830 -297572 31837 -122056 165747 -133733 17558 193600 185071
12805 185071 51483 181955 203610 -201811 -162490 -63293 -165686 -43969 344904 433282 -165415
12793 -264783 281044 18891 -59578 -13144 -49210 244034 278315 -209684 21965 228466 328557
12782 328557 -234775 -181903 -44660 277420 167352 218657 136574 22739 -95667 393301 163408
12770 -67453 80414 254564 -134406 246874 -121442 -147337 -5518 323985 321640 -55109 142929
$$ packed form
12846A04436B6294L0545b71506B10212c96868B5750K3546J51571K88150k20850
12836B68167a37004k32444B3097N4588a33166D07359D1653a40132k8774A9824
12825A08938K18145F9277a59574I0613C6240L47785D5968a83783A30009J4242
12815A44251K03243A53830b97572C1837a22056A65747a33733A7558J76042q529
12805A85071E1483J30472K1655b01811L9321f3293j02393d3969C44904Q8378a65415
12793b64783B81044A8891e9578a3144l6066B44034L4281b09684B1965K06501J00091
12782C28557b34775N2872d4660B77420j10068N1305q2083B2739i5667C93301A63408
12770f7453H0414J74150a34406B46874a21442k5895e518C23985k345e5109A42929
$$ plain form
12758 10361 15640 -28887 245836 -251376 -327509 69652 161311 60969 -60353 -14719 74044
12746 24987 107817 151376 64911 338054 -135860 -142630 195364 154527 193423 -68035 76156
12734 77563 68156 289081 -21725 116702 256932 180789 -55218 107116 205344 -48997 -20939
12722 -256101 102686 124483 58422 23543 -50097 -56873 109778 -25998 -146141 131927 108626
12711 108626 104739 -118457 372447 -69327 236486 37381 -91656 42631 50569 473043 -286880
12699 265778 167184 141644 79090 27254 190172 -135663 -272670 83662 -336145 134090
12688 47624 61104 -19086 25239 140634 -36089 216334 14243 59814 311867 140363 145812
12677 145812 162540 -180299 230458 -255877 36677 215794 93645 192671 226397 228612 231907
$$ packed form
12758A0361N279b8887B45836b51376p6133F9652R1659F0969f0353a4719G4044
12746B4987Q2830M3559F4911K73143a35860o770A95364m0837L8896f8035G6156
12734G7563r407K20925b1725A16702J40230p6143e5218A07116R8228d8997b0939
12722b56101A02686K1797E8422B3543e0097o776A09778b5998j20143A31927k3301
12711A08626l887a18457C72447f9327B36486C7381i1656D2631P938M22474b86880
12699B65778r8594k5540o2554B7254J62918a35663j37007H3662c36145A34090
12688D7624J3480a9086B5239J15395c6089B16334A4243M5571K52053A40363N449
12677A45812J6728a80299B30458b55877C6677J79117I3645R9026L3726K215L295
$$ plain form
12666 231907 -86159 288136 4898 152558 273625 24383 319504 -129247 -17351 -55302 396110
12654 -78105 -13354 414168 227840 73781 79921 147422 81730 110938 200397 42423 193130
12643 193130 264343 -186589 151062 147206 -82485 -19905 42681 54172 108899 320663 -36289
12631 -72655 447501 6617 -29501 281729 145804 566922 206877 157989 102550 77602 258329
12620 258329 415460 -11364 287672 -88898 -215440 200866 179764 87574 -89871 82404 145245
12609 145245 73693 309589 209598 32128 74620 -134365 170489 64224 67541 8284 -102446
12597 233001 -163745 25989 21006 -25008 146275 71294 574702 -105878 -247539 46902 166212
12586 166212 152586 179963 37689 64234 160724 388836 -140184 122353 -74987 83394 239064
$$ packed form
12666B31907h6159B88136D898J47660J21067B4383K95121a29247a7351l7951C96110
12654g8105a3354D14168j86328G3781O140O7501o5692K9208Q9459D2423J50707
12643A93130P1213a86589A51062l856h2485a9905D2681J1491N4727K11764c6289
12631g2655D47501F617b9501B81729j35925M21118B06877m8888n5439k4948J80727
12620B58329J57131a1364B87672h8898j26542B00866k1102H7574h9871H2404O2841
12609A45245p1552K35896r9991C2128M2492a34365A70489F4224L317H284a02446
12597B33001a63745B5989m983b5008A46275G1294N03408a05878j41661D6902J19310
12586A66212j3626K7377C7689K6545R6490K28112a40184A22353g4987H3394J55670
$$ plain form
12575 239064 240103 -146344 51891 -85061 -43990 -60513 -255297 325172 180406 109567 161144
12564 161144 -55690 -55818 13409 2818 56856 14645 108237 -224717 83006 117768 193284 -342580
12551 378430 30304 -108434 -266440 -25358 238976 -63224 76086 -35365 154173 46063 60139
12540 60139 142564 -23464 -130865 -140757 -93590 -15492 113041 -262012 251179 144359 31175
12528 28510 414500 -117546 417088 342080 -48586 -27926 52394 -155188 201786 -71637 -74520
12517 -74520 -145634 27357 -25669 267603 -147194 -68038 -51585 -201057 24413 69274 -187669
12505 -133333 132040 24020 -83422 -175994 -23857 -311655 9880 133190 111256 92373 -101941
12493 67846 -86035 131125 -35443 153598 100599 -265565 226991 -7359 62693 181569 329421
$$ packed form
12575B39064J039a46344E1891h5061M1071j6523j94784C25172j44766p0839N1577
12564A61144e5690j28A3409B818N4038A4645R3592b24717H3006L4762P5516c42580
12551C78430C0304a08434j58006b5358B38976f3224G6086c5365A54173D6063J4076
12540F0139Q2425b3464j07401r892M7167a5492A13041b62012B51179j06820C1175
12528B8510L85990a17546D17088p5008d8586K0660E2394a55188B01786g1637k883
12517g4520p1114B7357b5669B67603a47194f8038J6453j49472B4413M4861a87669
12505a33333A32040B4020h3422r2572b3857k87798I880J23310k1934j8883a01941
12493F7846h6035A31125c5443A53598n2999b65565B26991g359F2693J18876J47852
$$ plain form
12482 329421 -56436 -159571 -249603 46223 178762 54438 -232382 367683 -215326 -251091
12472 -251091 513835 -40466 3664 42231 108886 43633 91488 -275292 387321 -65762 -21260
12460 -48149 333897 -239123 98004 -87917 -127511 -1289 299063 11219 -158240 -364728 141137
12448 -140210 -73500 -84016 -274247 68306 2986 34266 61570 106487 149867 -8187 160548
12436 -104114 18760 82686 206104 203661 -110049 32507 100659 -440762 -106429 -47215 198146
12424 38036 179922 86291 -2762 -54326 -301322 169664 299060 -30678 -93707 45212 -221202
12412 205404 -268085 -225322 214584 44277 -14353 153914 -17573 -4707 90088 75150 268686
12401 268686 -120254 -96179 -331766 -39360 -234401 -40611 -355391 22298 -136253 10851
$$ packed form
12482C29421e6436j03135r0032D6223J32539E4438b32382C67683b15326l5765
12472b51091E13835d0466C664L8567O6655D3633M7855b75292C87321f5762b1260
12460d8149C33897b39123I8004h7917l9594a289B99063A1219a58240k06488A41137
12448a40210O6710j0516j90231F8306B986L1280K7304M4917M3380h187A60548
12436a04114A8760O3926J23418k443a10049C2507O8152d40762a06429d7215A98146
12424C8036J41886H6291b762n1564k46996A69664J29396c0678o3029D5212b21202
12412B05404b68085M2763B14584D4277a4353A53914a7573d707I0088j4938J93536
12401B68686a20254K4075k35587c9360j95041d0611l14780B2298a36253A0851
$$ plain form
12390 143934 30538 79974 5076 326222 123804 60964 165944 205067 -16957 185950 -353862
12378 -74532 17019 100766 2068 61683 -23217 316676 -163162 109427 -2804 -69103 1362 377859
12366 377859 -165301 -73981 262637 -331963 -186463 -237291 -178711 -66017 254614 -330455
12355 -300993 204897 201545 134149 -65434 171894 169707 -180751 145539 239639 -187810 326133
12343 -158874 -341152 221389 240892 66661 102176 -90445 -29855 -14481 1105 -112807 -97918
12332 -97918 32364 4122 4088 -107882 239762 185900 -15839 -8773 196147 -214060 73966 -65657
12319 -263053 151175 70016 -31023 254208 -116477 -226422 -54046 -231501 -31881 -228574
12309 -228574 206789 -117525 159591 389308 -73334 245533 298896 -19157 23169 66433
$$ packed form
12390A43934C0538M9436E076L21146A23804F0964J04980L9123a6957A85950c53862
12378g4532A7019Q3747B068N9615b3217C16676a63162A09427b804o6299A362L76497
12366C77859a65301g3981B62637c31963J45500n0828N8580f6017B54614c30455
12355c00993B04897l352o7396f5434A71894k187a80751A45539R4100a87810C26133
12343a58874j82278B21389J9503F6661L5515i0445b9855a4481A105a12807J4889
12332i7918C2364D122l4a07882B39762n3862a5839P066A96147b14060G3966f5657
12319b63053A51175G0016c1023B54208a16477j09945e4046j77455c1881j96693
12309b28574B06789a17525A59591K29717g3334B45533N3363a9157B3169M3264
$$ plain form
12299 66433 -56372 -206690 53989 -67119 -99679 48972 -62545 -136588 -8310 -201664 -66330
12287 134252 -12980 134345 -3134 160735 45325 -157477 -128884 60871 209538 -78380 184483
12275 -102106 -38153 184847 104747 21399 202802 330100 -71649 249425 -159446 342424
12264 328233 328065 395527 76415 -41488 322762 -21338 155744 166665 38250 -120659 -101191
12253 -101191 7180 -102062 -28484 -95667 165919 157028 572051 141712 -66197 209806 10612
12241 117996 71229 -63810 177842 170800 120150 282620 58858 198624 -52307 209549 272347
12230 272347 389258 -4327 173157 326552 407392 41279 -184254 -89142 89745 188345 466631
12219 466631 169082 246635 138345 154261 250032 517375 -1922 336064 -141801 -46861 106956
$$ packed form
12299F6433e6372j50318E3989f7119l2560D8972f2545p4043h310j93354f6330
12287A34252a2980A34345c134A60735D5325a57477K8593F0871J48667g8380A84483
12275a02106c8153A84847q0100B1399J81403J27298g1649B49425a59446C42424
12264C28233j68O7462G6415d1488C22762b1338A55744J0921C8250a20659J9468
12253a01191G180a02062b8484o7183A65919q891M15023A41712f6197B09806A0612
12241A17996m6767f3810A77842p042n0650J62470E8858J39766e2307B09549O2798
12230B72347J16911d327A73157J53395Q0840D1279a84254h9142H9745R8600K78286
12219D66631A69082P7553j08290J5916R5771K67343a922C36064a41801d6861A06956
$$ plain form
12207 187444 142031 -275579 96746 171814 119454 -24877 280054 531514 169364 153336 -160657
12195 135202 169933 59498 -256272 239251 373540 281348 182633 -3932 167065 21399 100696
12184 100696 91578 13023 108023 192627 368867 10879 -142912 12505 18222 -100739 225419
12172 -154333 141591 393758 -83737 116806 130770 214685 85413 -42177 274131 178211 213493
12161 213493 -9680 -55168 139880 -104217 145338 -9477 -78510 -74889 -109432 168050 78532
12149 -131231 252754 82918 -207121 234883 67734 -74565 -67234 -56257 -127366 -291813 -209345
12138 -209345 -213401 144438 67045 51129 80971 7754 45277 91256 -3011 231839 -92486 -21475
12125 -122698 67124 157481 -316676 18888 -202818 92465 -96362 146785 154781 -157224 143110
$$ packed form
12207A87444m5413b75579I6746P5068n2360b4877B80054K51460A69364j6028a60657
12195A35202L4731E9498b56272B39251J34289r2192r8715c932A67065B1399P9297
12184A00696r118A3023R5000Q4604J76240A0879a42912A2505N717a00739B25419
12172a54333A41591K52167h3737A16806J3964Q3915H5413d2177B74131r5920L5282
12161B13493i680m5488A39880a04217A45338i477o9033L621l4543A68050G8532
12149a31231B52754H2918b07121B34883F7734g4565P331J0977p1109j64447Q2468
12138b09345m056A44438F7045j5916K9842G754L7523M5979c011B31839i2486b1475
12125a22698F7124R0357c16676A8888b02818I2465i6362A46785P996a57224A43110
$$ plain form
12113 34163 -140849 145657 -155152 -67948 14699 167418 132265 57742 -302618 -344257 -53400
12101 -34128 -181876 168044 -107813 -166896 -152296 32172 323995 234289 164843 -130701 -83603
12090 -83603 7216 -169829 -249704 -290077 183541 225829 282431 -90655 -68375 -34363 185008
12078 -304829 -219024 125046 183625 16003 23806 293701 51106 -73737 -96975 263716 481258
12067 481258 355357 450624 1334953 695792 19955 -61635 296195 453439 -17826 195461
12056 107087 169538 29034 30213 -120285 226612 -162954 345269 192339 124137 61084 -36581
12044 -262719 281061 -103213 75781 125365 -336 -51053 -6064 4469 65287 -204513 19097 215798
12032 215798 193570 130595 -393214 -101597 -22360 139775 -319369 270838 -109488 -196137
$$ packed form
12113C4163a40849A45657a55152f7948A4699J52719l5153E7742c02618m1639e3400
12101c4128j47748A68044a07813n9083J4600C2172K91823q9706o9446a30701M7098
12090h3603G216a69829p9875m0373A83541M2288N6602i0655K2280L4012A85008
12078c04829Q5805A25046N8579A6003P803K69895E1106g3737k3238B63716K17542
12067D81258j25901R5267Q84329o39161A9955f1635B96195J57244a7826A95461
12056A07087O2451B9034J179a20285B26612a62954C45269j52930o8202F1084c6581
12044b62719B81061a03213G5781M9584c36n0717f064D469O0818b04513A9097J96701
12032B15798k2228o2975c93214a01597b2360A39775c19369B70838a09488q6649
$$ plain form
12022 -196137 -23428 302405 -63017 319233 8940 -218 460214 81312 -41390 -148863 5928
12010 125481 -96758 -216428 -58149 -28416 82375 78806 14812 -19858 -32256 -321974 57619
11998 -91074 353276 136926 -17792 -292637 -125044 -256217 -57927 234391 53092 -249832
11987 -56287 -166460 -287285 23410 -93867 -67192 274860 -71794 295670 -57548 2659 -35360
11975 -143203 66020 -244088 53175 -119593 -127630 45907 -94538 -253942 302814 147945 -40186
11963 109637 -193590 39320 732 52658 107868 -101965 -185525 148453 187588 -161058 13644
11951 96344 -163592 199289 -104656 -14619 -241897 303977 73979 184341 143316 83984
11941 83984 5953 -120872 240761 173135 -126558 -48653 -280436 -39764 -271675 -213354 257046
$$ packed form
12022a96137b3428C02405f3017C19233H940b18D60214H1312d1390j07473E928
12010A25481i6758j19670e8149b8416H2375l569A4812a9858j2398k89718E7619
11998i1074C53276A36926a7792k74845a25044j31173e7927B34391E3092b49832
11987e6287j10173j20825B3410i3867K6675B74860g1794B95670e7548B659c5360
11975a43203F6020b44088E3175a19593q037D5907i4538j59404C02814A47945d0186
11963A09637a93590C9320G32N1926N5210a01965q3560A48453L9135a61058A3644
11951I6344a63592A99289a04656a4619k27278C03977G3979J10362m1025n9332
11941H3984E953a20872B40761o7626a26558d8653k31783c9764k31911N8321B57046
$$ plain form
11929 -39271 132394 -99863 -282370 220949 304394 -306370 -143906 -96841 -27344 68030 255808
11918 255808 -17938 -277881 -41232 -392800 -173861 -262367 -129367 -70176 -190522 -14787
11907 162036 63203 -187968 -238611 115158 47178 -12332 -51274 -3190 -129727 26145 -182227
11895 -214512 197269 -219913 -36375 238927 -104963 -191713 144749 376707 -222688 -101765
11884 59824 -189158 115496 -89658 -139431 -362197 487482 -307240 -238612 -86790 -244021
11874 -244021 96621 16247 -332733 -239225 55153 -177244 164423 -174192 -385728 -68686
11863 -97750 -86128 -304605 106971 -115130 141252 164767 2628 -31115 -68906 -96474 -101210
11852 -101210 -61796 19747 88957 -76564 -181493 -6032 -92024 -141275 -133606 80060 58316 -187094
$$ packed form
11929c9271A32394i9863j82507B20949Q3445c06370a43906M7065b7344F8030J87778
11918B55808a7938k59943d1232l51568a73861q8506a29367N9191j20346a4787
11907A62036F3203a87968n0643A15158D7178a2332l8942c190j26537B6145a82227
11895b14512A97269b19913c6375B38927a04963q6750A44749K31958b22688a01765
11884E9824a89158A15496h9658m9773k22766D87482c07240O8628h6790j57231
11874b44021I6621A6247c32733R3508E5153a77244A64423a74192k11536f8686
11863i7750J1622k18477A06971a15130A41252K3515B628c1115l7791k7568m736
11852a01210L9414A9747O9210g6564j04929f032q5992m9251P669H0060k1744a87094
$$ plain form
11839 -256716 -186851 132392 19412 -8934 -384968 256939 21995 18243 -81522 111704 -192216
11827 202842 276958 312421 -11009 -176918 -368274 -134725 28140 -186905 423894 186679
11816 -46424 -3143 8711 4980 51128 107929 74719 92634 -129154 60638 44351 145231 49602
11803 39846 -324470 -394888 -132786 -96310 -40057 247256 -879 -140975 -320538 -116534 157267
11791 25749 11294 86079 -52826 409021 -123965 238958 -232083 23665 -372214 48900 -95255
11779 -77969 307770 191987 -149474 -18335 -11105 81576 -277488 281667 -283952 -98937 29660
11767 -89146 52473 376757 -33892 -17605 -370721 -211667 242384 -44418 92722 -226235 32261
11755 -188032 68751 25680 56230 56461 -339243 100688 183972 -157066 -128069 -105898 -159793
$$ packed form
11839b56716O9865A32392A9412h934l76034B56939B1995l752h1522A11704a92216
11827B02842P4116L5463a1009j65909j91356a34725B8140a86905D23894A86679
11816d6424c143H711l731M6148N6801l3210J7915a29154F0638j6287J00880D9602
11803C9846c24470p0418a32786L6476d0057B47256h79j40096j79563a16534A57267
11791B5749A1294P4785e2826D09021a23965B38958b32083B3665c72214D8900i5255
11779g7969C07770j15783a49474a8335P230H1576b77488B81667b83952i8937B9660
11767h9146E2473L24284c3892J6287l53116J59054B42384d4418I2722b26235C2261
11755a88032F8751B5680L0550K31c39243A00688Q3284a57066K8997K2171n3895
$$ plain form
11744 -159793 73368 -30164 -89601 8896 236852 -96984 -20991 -170995 -149435 -271324 -239806
11733 -239806 -256544 -74324 -88423 58536 93622 -437048 -259067 -316858 145216 -130906 210778
11721 -189293 150335 277069 -41023 -22824 -154443 -104440 180593 53357 -66636 -19486 -1824
11709 75296 -346414 64871 -214172 120189 33710 52355 -45622 -197783 219934 93761 -12715
11697 -158974 98932 62277 94896 -33398 105513 487762 149812 -103952 169878 -116763
11686 25197 -30718 62843 35394 36904 -97698 26223 -78292 -203152 27204 184642 -17800
11674 -218948 -109432 302494 408019 100569 242725 -88603 92919 -29628 -189008 -18737
11663 297908 43588 149038 -165310 75860 30039 -398058 -70450 -105561 53401 150658 35793
$$ packed form
11744a59793G3368c0164n9437H896K27956i6984b0991j50004K1560j21889L1518
11733b39806j6738g4324j4099E8536L5086d37048J77981n7791A45216a30906B10778
11721a89293A50335J26734d1023J8199j31619N0003A80593E3357f6636a9486a824
11709G5296c46414F4871b14172A20189C3710J8645d5622j52161B19934I3761a2715
11697a58974I8932l6655L2619c3398A05513L82249A49812a03952A69878a16763
11686B5197c0718F2843k7449J510i7698B6223g8292j24860B7204J57438a7800
11674b18948a09432C02494J05525A00569J42156h8603I2919b9628j59380a8737
11663B97908D3588J05450a65310G5860C0039c98058g0450l5111E3401R7257C5793
$$ plain form
11651 65455 190631 -11033 -59961 -102879 -47548 279887 -290836 -129554 -63597 -56586 60333
11639 -211584 397037 33705 -220723 -90342 325041 62475 21178 -6727 -10206 -92834 77818
11627 70122 -207929 79980 171334 32174 265059 269087 64158 -28076 87576 169363 7425 -250757
11614 112685 -198848 -162271 197729 226288 81518 -174777 153902 -657 -54053 -7775 22069
11602 83562 -127219 -425166 93283 -188738 -27527 344801 -44460 108292 -148852 134723
11591 252432 -25541 35702 -48144 272723 227630 -199634 86079 -67704 -27244 96 207128
11580 207128 -91513 203301 -24453 20053 27915 166656 -69414 -3477 64328 -7397 277326
11568 -147274 -233389 132875 168251 7898 -245364 -175934 44770 -172823 -213072 -555902 -130320
$$ packed form
11651F5455J25176a1033m8928m2918d7548B79887b90836a29554f3597P011F0333
11639b11584C97037C3705b20723i0342C25041F2475B1178f727l479q2628G7818
11627G0122b07929G9980R1354C2174K32885M028F4158b8076H7576Q1787G425b50757
11614A12685a98848L6577A97729K8559H1518a74777A53902f57n3396g775B2069
11602H3562a27219k97947I3283a88738b7527C44801d4460A08292a48852A34723
11591B52432b5541C5702d8144B72723m5093a99634H6079f7704b7244I6K07032
11580B07128i1513B03301b4453B0053P862J38741f9414c477F4328g397B77326
11568a47274q6115A32875L5376G898b45364O9430D4770a72823m0249l42830a30320
$$ plain form
11556 -298974 -26729 23827 107386 16417 -24400 25989 250428 -41226 14836 -121883 -356525
11545 -356525 -16918 386318 -236940 -140270 -68907 57721 59689 140531 21117 127019 -483965
11533 -11298 57548 -288909 332887 258528 -10178 61185 164551 -41352 -199544 7428 -154075
11521 132538 11279 27643 126270 1007 -293451 46217 -65567 -74327 159896 160644 298276 48396
11508 212256 68819 88034 -26782 107990 47855 -86593 211223 -119859 -101995 -215352 231017
11496 289457 108196 -16423 -95465 21108 118391 280634 407642 338410 -88601 278311 50121
11484 203152 41503 -68584 207785 237103 79702 -267832 97933 -111907 -19964 -77884 76185
11472 133575 -149028 271461 23989 135035 69993 -37868 -143683 -59517 378870 191496
$$ packed form
11556b98974b6729B3827Q3559A6417b4400B5989K24439d1226A4836a21883k34642
11545c56525a6918C86318b36940R6670f8907E7721J968Q0842B1117J05902d83965
11533a1298E7548b88909C32887p4359a0178F1185J03366d1352j58192G428a54075
11521A32538A1279J6364R8627A007b93451D6217f5567q760A59896P48J37632D8396
11508B12256F8819J9215b6782A07990D7855h6593B11223a19859J7864j13357B31017
11496B89457A08196a6423p9042B1108R7283J62243J27008o9232h8601B78311E0121
11484B03152D1503f8584B07785K9318G9702b67832I7933a11907a9964n7920G6185
11472A33575a49028B71461B3989J11046o5042c7868j05815e9517C78870j87374
$$ plain form
11462 191496 -215813 384067 191467 271831 -93930 81268 -6349 72020 227275 -12146 118123
11450 43067 -224083 173633 -9461 229842 -51285 -10502 -4009 103600 -121174 196704 19663
11438 202490 -37260 7990 -240639 -114006 -78114 -265249 83653 509238 -134604 207591
11427 -85198 -72464 -38106 27752 15811 359994 -18115 140358 280991 107132 115675 -74921
11415 90232 -9481 -200487 1962 -54494 -100653 164796 206176 -62257 -19918 -129178 -135598 -109297
11403 -109297 -383104 53681 48689 7234 -158013 69653 57626 -6061 314026 53130 7146 -127232
11390 -292884 69846 -124080 173113 -34883 194207 2024 343339 -274630 207083 -45985
11379 -295090 114265 -112298 258517 34668 337871 116853 121794 -49967 -112869 -40313 21251
$$ packed form
11462A91496b15813C84067A91467Q0364i3930H1268f349G2020J55255a2146A18123
11450D3067b24083A73633i461B29842e1285a0502d009A03600a21174A96704A9663
11438B02490c7260G990b40639a14006L5892j87135H3653M25585a34604B07591
11427h5198J2734L4358B7752j1941L44183a8115A40358J40633A07132Q543g4921
11415I0232i481j91006A962e4494m6159A64796M1380f2257a9918j09260o420K6301
11403a09297k73807E3681m992G234a58013F9653j2027f061C14026E3130G146a27232
11390b92884F9846a24080A73113c4883A94207B024L41315b74630B07083d5985
11379b95090A14265a12298B58517C4668L03203A16853M941d9967o2902d0313B1251
$$ plain form
11367 -366332 95454 -62035 342988 21800 -104167 -2048 -228013 92473 -37248 60135 125436
11356 125436 -106798 74415 143493 -29104 -399587 -57792 39219 -47457 25501 -42513 -163028
11345 -163028 -30609 -203996 115416 -2267 -571078 -254939 96100 -116733 152339 -88691
11334 -151694 92622 112229 19684 -43866 -168130 161425 -222491 -101311 -20555 -200989
11324 -200989 12219 -283002 26457 -160237 121387 47970 92026 -228350 220012 122990
11314 122990 101172 301991 -154717 -232547 17006 -445839 168639 -98531 94319 -31722 41
11302 175821 34638 126233 87894 27285 84562 81191 96028 92194 -182164 -5923 86511 153375
11290 153375 -195810 -11748 18631 -4312 196598 -288912 -136972 12642 -256852 28790 -39573
$$ packed form
11367c66332I5454f2035C42988B1800a04167b048k25965I2473c7248F0135O5301
11356A25436a06798G4415O9078b9104l70483e7792C9219d7457B5501d2513j20515
11345a63028c0609j73387A15416b267n68811b54939I6100a16733A52339h8691
11334a51694I2622J9607A9684d3866j24264A61425b22491a01311b0555j80434
11324b00989A2219b83002B6457a60237A21387D7970M4056b28350B20012r7022
11314A22990k1818K00819a54717p7830A7006d45839A68639i8531I4319c1722D1
11302A75821C4638R1595l8339B7285N7277l371J4837l834a82164e923H6511O6864
11290A53375a95810a1748A8631d312A96598b88912a36972A2642b56852B8790c9573
$$ plain form
11278 -314560 -301215 -42112 117050 -276943 74066 -188080 -232831 -1582 -75026 365440 321563
11267 321563 -18001 -153449 -119994 -162027 -11010 3477 -79097 -104883 224648 -70767 -166730
11256 -166730 68731 -28582 -175146 -103858 120755 182056 -199664 -246873 -61589 -15546 224216
11244 -286654 -311575 -30146 261769 160563 -279882 30625 -145119 224109 116199 -13125
11233 129309 27187 -204698 -47580 191140 46822 -406837 -28485 100550 -111762 -153548
11223 -153548 35460 -25596 -448697 89711 17349 231684 -92202 71830 -41654 -185778 -287139
11212 -287139 -254501 -142465 212722 -204596 -235758 -248980 -127033 29010 -236080 -77007
11201 179260 346666 -164783 199821 -203370 13040 169634 36866 -140618 39006 -157235
$$ packed form
11278c14560J3345d2112A17050b76943G4066a88080m4751a582p3444C65440m3877
11267C21563a8001j35448L3455m2033a1010C477g9097k5786B24648g0767r5963
11256a66730F8731b8582j46564P1288A20755O1301a99664m7209f1589a5546B24216
11244b86654k4921c0146B61769j01206b79882C0625a45119B24109j07910a3125
11233A29309B7187b04698d7580A91140D6822d06837b8485A00550a11762m1786
11223a53548C5460b5596m23101H9711A7349K14335i2202G1830d1654j44124j01361
11212b87139L2638J12036B12722b04596l1162j3222J21947B9010b36080g7007
11201A79260J67406a64783A99821b03370A3040J56594C6866a40618C9006a57235
$$ plain form
11190 -76791 35568 -19390 203045 -103284 291617 51950 128576 -28765 -265954 -44127 -233987
11179 -233987 -71998 -139346 15635 -26741 87801 -176133 -156125 325177 -272086 -253630 -149298
11168 -149298 -219476 -203476 -11388 176475 -25666 -181628 -153004 -320264 157830 192450 -80962
11156 -124684 334605 -72633 13095 330142 249925 157545 -475575 -126664 222503 106042
11145 -74092 -105185 -68580 -192509 -132764 63262 105039 -244537 111830 118842 405698 96829
11133 33944 314162 -66571 -92404 -48763 154787 -164209 190971 99186 124923 32672 380124
11122 380124 213597 -203088 223322 -41876 -176386 -190103 68738 262173 -183221 248540
11111 -3215 138826 39203 -11583 79786 94564 371899 -32343 -198633 101871 397908 78357
$$ packed form
11190g6791C5568a9390B03045a03284B91617E1950P6626b8765k37189d4127j89860
11179b33987g1998o7348A5635b6741H7801a76133K0008C25177b72086J8456J04332
11168a49298p0178J6000a1388A76475b5666j55962K8624j67260A57830L4620h0962
11156a24684C34605g2633A3095L17047q0217r2380d75575a26664B22503A06042
11145g4092l1093L6605j23929N9745F3262M1777b44537A11830P012K86856I6829
11133C3944K80218f6571k5833M3641A54787a64209A90971r1785K5737C2672L47452
11122C80124j66527b03088B23322d1876j34510j3717F8738J93435a83221B48540
11111c215A38826C9203a1583G9786J4778K77335c2343j66290A01871K96037G8357
$$ plain form
11099 129446 147701 368753 181672 48837 300846 193714 226867 90951 111215 43262 48523
11088 48523 106045 27769 311059 98472 280558 35182 267246 8804 90257 -121147 -260968
11077 -260968 147602 197617 122168 154851 466910 425522 115628 117332 90016 207834 112106
11066 112106 312052 239467 196900 353032 428736 664288 509233 347964 445750 447769 460982
11055 460982 572433 613783 845938 469271 -8078 804970 699992 801793 712544 460470
11045 460470 702747 478322 422983 705412 988232 533905 870462 544516 625837 689655
11035 689655 612264 727643 449637 541302 779475 451946 418388 366914 307970 535128
11025 535128 535330 394212 430368 396763 493986 248443 797620 464189 528555 592293 954945
$$ packed form
11099A29446J8255K21052A81672D8837K52009j07132L3153I0951K0264D3262N261
11088D8523N7522B7769K83290I8472J82086C5182K32064H804Q1453a21147j39821
11077b60968A47602N0015p5449L2683L12059m1388A15628J704k7316J17818r5728
11066A12106J99946p2585m2567J56132P5704K35552j55055j61269R7786K019J3213
11055D60982J11451M1350K32155l76667h078H04970j04978J01801q9249k52074
11045D60470K42277k24425n5339K82429K82820m54327L36557l25946Q1321O3818
11035F89655p7391J15379k78006R1665K38173l27529l3558n1474n8944K27158
11025E35128K02j41118L6156l3605R7223k45543N49177l33431O4366O3738L62652
$$ plain form
11014 954945 322191 611788 531535 751966 407339 429314 -13611 500402 297183 516735
11004 516735 849936 448937 528710 951020 643824 760736 696142 653963 661647 710417 275227
10992 755185 623705 1003086 307939 669042 939144 782336 900299 916767 757032 870262
10982 870262 1270654 1457287 983275 1336609 1180827 1702130 1992909 2274534 2516047 2353358
10972 2353358 2918857 2319409 2475917 2549615 2107145 1870502 1619185 1428263 1481514 1140452
10962 1140452 1150036 1094053 1344924 1271351 1020799 1279411 1235318 742774 868328 816012
10952 816012 885809 971379 377461 871183 209197 307613 261404 366408 224395 419118
10942 419118 69690 382864 249012 -59803 196038 -10377 231761 -17470 -107753 -63077 152436
$$ packed form
11014I54945C22191K89597q0253K20431l44627K1975a3611E00402k03219K19552
11004E16735L33201m00999P9773M22310l07196J16912o4594m2179P684M8770B75227
10992G55185j31480L79381C07939L61103K70102j56808J17963J6468j59735J13230
10982H70262M00392J86633m74012L53334j55782N21303K90779K81625K41513j62689
10972B353358N65499n99448J56508P3698m42470k36643k51317j90922N3251l41062
10962A140452R584n5983K50871p3573k50552K58612m4093m92544J25554n2316
10952H16012O9797Q5570C77461M93722B09197R8416m6209J05004j42013J94723
10942D19118F9690L13174j33852e9803A96038a0377B31761a7470r0283M4676A52436
$$ plain form
10930 23081 -82108 -162248 -330395 218409 237162 252966 224553 -110400 256617 65394 -44175
10918 -70902 228540 36948 135008 302274 301494 -129223 36013 -163073 274416 73819 229553
10907 229553 -49211 -439386 348811 -129526 81965 -68292 205117 13560 -172821 184721
10896 10003 -68656 20731 284149 -39280 -203095 -79077 -250551 -109715 -41923 -39351 224637
10884 -178924 282078 207486 -101202 -330383 103443 -230057 37040 31208 188147 -426638
10873 -20826 -48487 139104 -99644 -205407 184037 27803 57538 280118 -232990 -100906
10862 -93820 -296770 -271590 39662 -56489 -123349 -175426 -131272 -157743 -54026 -174042 50294
10850 -410324 -68465 -84882 -219141 -180736 -336809 -51449 -167297 72013 47545 -157583 240154
$$ packed form
10930B3081h2108q0140j68147B18409J8753J5804k8413a10400B56617F5394d4175
10918g0902B28540C6948R8060J67266p80a29223C6013a63073B74416G3819J55734
10907B29553d9211l90175C48811a29526H1965f8292B05117A3560a72821A84721
10896A0003f8656B0731K63418c9280j63815g9077j71474a09715d1923K572B24637
10884a78924B82078p4592a01202k29181A03443b30057C7040n832J56939d26638
10873b0826k7661A39104i9644j05763A84037B7803K9735K22580b32990a00906
10862i3820k02950K5180C9662e6489o6860n2077M4154k6471e4026j20016E0294
10850d10324f8465j6417j34259L8405j56073e1449j15848G2013k4468a57583B40154
$$ plain form
10838 -133827 -107017 -187046 39810 -64131 -154483 -87811 -17774 78311 -2973 -116164 -322531
10827 -322531 40742 153454 6678 -216505 -22798 -401589 205500 -19581 -342554 -199868
10817 -199868 -57358 -47596 -53604 -251463 2468 34708 -96995 -398681 178163 82933 -87187
10805 90831 -173379 81 -288306 -99611 -129306 6620 16433 -362590 10189 -168403 23623 -386421
10792 276265 -251104 -34144 77198 232211 21362 115826 -36507 92569 52594 -161920 173933
10780 -424206 43457 -182899 -178706 -486741 -19116 -71028 -225240 73487 -130161 57466 -136603
10768 117424 -70614 -908 -27854 38662 62238 -5252 -6140 -128356 -55718 -216096 -29854 -29057
10756 -29057 362984 104265 201397 69039 -564379 -68028 -52423 229988 -25892 -403870 -128660
$$ packed form
10838a33827K6810q0029C9810f4131r0352O6672a7774G8311b973j13191k06367
10827c22531D0742J12712F678b16505b2798l78791B05500a9581l22973J42686
10817a99868e7358R762o008j97859B468L2240i6995l01686A78163H2933h7187
10805I0831a73379H1b88306i9611k9695F620R813c62590A0189a68403B3623c86421
10792B76265b51104c4144G7198J55013B1362R4464c6507I2569l9975a61920A73933
10780d24206D3457a82899M193l08035a9116n1912j54212G3487a30161E7466a36603
10768A17424g0614i08k6946C8662K3576e252q88j22216e5718j60378b9854P97
10756b9057C62984A04265R7132F9039e64379f8028J5605B29988b5892l77978a28660
$$ plain form
10744 160668 89930 -161717 -147060 165502 -3877 102943 150482 55338 -261929 29766 39982
10733 39982 -44039 220428 20259 -190740 19317 -242519 77999 -269400 -177666 -60205 -395838
10722 -395838 -234150 -208656 -81587 -245815 -222095 -20534 194664 -52980 -18235 20438 -51996
10710 -118321 -71525 -158842 -56039 -77234 105754 -259642 -409987 -31582 293708 44794 -200501
10698 -62148 74642 -208992 -53965 178495 -42359 -141056 -96521 28678 168932 34300 -62110
10686 -10234 226542 181311 -119119 -77717 121461 -309200 -18950 118395 61145 28731 -322722
10674 150954 -19948 182168 -63122 139551 -98850 -37221 29236 -175168 241052 254029 -77891
10662 84864 -195259 -60405 -260355 -40704 -184396 40367 -76389 -319586 181684 -168938
$$ packed form
10744A60668p0738a61717J4657A65502c877A02943M7539E5338b61929B9766J0216
10733C9982d4039B20428B0259a90740A9317b42519G7999b69400R1734f0205l35633
10722c95838J61688K5494h1587j64228K3720b0534A94664e2980a8235B0438e1996
10710a18321M6796q7317e6039k1195A05754b59642j50345c1582B93708D4794b00501
10698f2148G4642b08992e3965A78495d2359r8697M4535B8678J40254C4300f2110
10686a0234B26542m5231a19119M1402A21461c09200a8950A18395n7250B8731c22722
10674A50954a9948A82168f3122A39551i8850c7221B9236a75168B41052J2977g7891
10662H4864a95259f0405j99950d0704j43692D0367g6389k43197A81684a68938
$$ plain form
10651 -104843 4188 276683 -56108 -108851 -18726 -183464 -58322 42931 -39042 -288969 169438
10639 235191 62131 -233034 11430 -125429 -341454 -136287 67531 100954 -180286 -532512
10629 -532512 -295112 44922 -75344 377005 -283476 -220713 -143192 -6892 -397440 17612 154260
10618 154260 398061 -38415 284722 -112858 -125981 -85865 -28211 -449998 -155658 -250144
10608 -250144 -17676 -2297 -166040 -255233 147015 70371 -293404 24102 -179190 -119050 33627
10596 -61508 -374886 -80443 -470865 -200534 -104728 -110681 235649 -141573 99748 181077 -52394
10584 -190846 38051 -12945 -3136 -176259 78062 -193228 -2443 -51074 -222813 -185689 -128837
10573 -128837 -171278 6148 -51173 -256491 24990 -51581 -126734 243241 -245462 101332 7745
$$ packed form
10651a04843D188K72495e6108n2743a8726j64738e8322D2931c9042k49927A69438
10639B35191F2131b33034A1430a25429k16025a36287F7531L3423a80286l52226
10629e32512K37400D4922g5344C77005b83476O2763P7521f892l90548A7612J36648
10618A54260K43801c8415B84722a12858j3123M0116b8211m21787a55658r4486
10608b50144a7676b297j63743q9193A47015G0371b93404B4102a79190O0140C3627
10596f1508l13378h0443l90422b00534R5806n953B35649a41573I9748Q1329e2394
10584a90846C8051a2945c136j73123G8062a93228b443m8631j71739L7124N6852
10573a28837m2441F148e1173k05318B4990e1581p5153B43241b45462A01332G745
$$ plain form
10561 -110408 -31866 -94467 124208 13102 -161290 12057 45263 -323488 -155530 -71214 398422
10549 -212878 -7976 203222 18968 76068 -255957 -49350 -138192 -190135 148038 -278811 -145253
10538 -145253 -139913 -268325 136087 -63915 68014 -304672 91650 227678 -99169 -26138 -92072
10527 -92072 -462684 132440 -137077 -113056 108093 -125103 27925 -23965 52094 294826
10517 294826 207962 143246 103071 -29883 -77752 254055 -305899 160837 47981 48319 -179700
10505 137328 204561 -104491 -66152 -280504 -152501 23673 -92130 53635 -432736 -118048
10494 -136664 93363 -46417 -268454 -98773 147240 -321291 16416 -103060 115064 -121862
10483 159600 27448 6916 261206 7310 477577 40276 -197824 221704 60588 -8023 -1743
$$ packed form
10561a10408c1866o2601A24208A3102a61290A2057L3206c23488a55530g1214C98422
10549b12878g976B03222A8968N7100b55957d9350q8842n1943A48038b78811J33558
10538a45253N340j28412A36087f3915F8014c04672I1650J36028i9169b6138o5934
10527i2072l70612A32440a37077K4021A08093a25103B7925b3965E2094K42732
10517B94826q6864o4716m0175b9883m7869B54055c05899A60837D7981L38a79700
10505A37328O7233a04491L8339k14352J28003B3673i2130E3635d32736a18048
10494a36664I3363d6417k22037i8773A47240c21291A6416a03060A15064a21862
10483A59600B7448F916K54290G310M70267D0276a97824B21704F0588h023a743
$$ plain form
10471 -442318 130776 -129489 -125419 -45817 148364 -51176 490689 190676 18604 190587
10461 190587 -26629 -218753 -371189 204500 22580 92841 -57135 -175404 6541 171932 -114790
10449 -142318 -224085 32464 -52091 102712 -100989 128137 -497425 -113339 -41126 309292
10438 -115821 159546 -157302 -166552 -20526 265970 -124627 -30485 46747 -263741 46103 417908
10427 417908 471945 -377094 -81695 -91716 103071 -263222 -70682 -150920 16709 87104 -205189
10415 -75678 -537933 -82296 32653 -116211 -16806 -178920 -83907 -286751 39444 169895 -149739
10403 325953 83856 74374 -143155 -182479 16632 116976 1213 143939 -76350 359463 75509
10391 309784 439349 34846 -271136 197015 387836 -75650 259270 -32806 -218778 -104754
$$ packed form
10471d42318A30776a29489M070d5817A48364e1176D90689A90676A8604J71983
10461A90587b6629j92124j52436B04500B2580P0261e7135j18269F541J65391a14790
10449a42318q1767C2464e2091A02712a00989A28137d97425a13339d1126C09292
10438a15821A59546a57302r250b0526B65970a24627c0485D6747b63741D6103L71805
10427D17908N4037c77094h1695j0021A03071b63222g0682q0238A6709P0395b05189
10415g5678m62255h2296C2653a16211a6806j62114h3907k02844C9444J30451a49739
10403C25953H3856r482a43155l9324A6632J00344A213J42726g6350C59463G5509
10391C09784J29565C4846b71136A97015J90821g5650B59270c2806j85972a04754
$$ plain form
10380 204883 74204 147376 127451 177625 67006 9240 172269 498329 314662 312527 97478
10368 571219 306000 272443 562188 341805 314933 -21118 237032 243586 139485 360622
10358 360622 -99583 228122 338250 341116 76164 -30612 310858 468720 462880 301502 336876
10347 336876 282565 -114317 173844 82039 94776 -9948 -734 549823 270163 431522 55483
10335 345844 62829 13897 346865 141940 -152836 -112985 94593 9854 55807 -90114 52866
10323 -118090 309382 -56899 -45121 -50193 -82985 351206 148233 398635 69329 133019 -145910
10311 270984 188584 82542 211929 -108885 74265 -15524 112864 249274 -26914 -246529
10301 -246529 -18281 -191210 281836 240056 304642 364661 -45074 66264 -59352 -162664 71140
$$ packed form
10380B04883G4204P3172j9925N0174F7006I240J63029L26060j83667k135I7478
10368E71219k65219l3557K89745k20383k6872b1118B37032O554j04101K21137
10358C60622i9583B28122J10128K866G6164c0612C10858J57862n840j61378L5374
10347C36876n4311a14317A73844H2039J2737i948g34E49823B70163J61359E5483
10335C45844F2829A3897L32968A41940a52836L9851I4593I854M5953i0114E2866
10323a18090C09382e6899J1778n072l2792C51206A48233K50402F9329O3690a45910
10311B70984q2400H2542J29387a08885G4265a5524A12864J36410b6914k19615
10301b46529a8281j72929B81836m1780O4586O0019d5074F6264e9352j03312G1140
$$ plain form
10289 -346423 -221672 -347099 -253406 -301128 239264 69443 59055 -118221 -97067 232027
10278 -37806 -85045 123744 -309492 1225 64075 -189228 -66606 -68511 239740 -46624 -137044
10267 -137044 -230998 180072 -149943 110181 164589 228159 41083 289510 405138 192527
10256 345517 84112 120684 -191598 10837 27832 246036 -99050 -334809 264243 -30155 -16661
10245 -16661 -127178 -191960 -189943 -193258 17519 -59777 -55293 29349 -200159 170853 149458 -147473
10232 -86754 442356 -9181 -6616 -168996 -149098 158162 -144232 116533 -416803 247298 32948
10220 30324 157708 146676 282703 -208435 -157693 -114168 13770 194860 -67453 116863 -133214
10208 -89125 254323 265315 -272754 -110916 -11446 -19637 -278799 72849 -154946 -396967 160710
$$ packed form
10289c46423J24751j25427R3693m7722B39264F9443j0388a18221K1154B32027
10278c7806m7239A23744c09492A225O2850a89228f6606j905B39740d6624r0420
10267a37044r3954A80072a49943A10181N4408O3570D1083K48427J15628A92527
10256C45517H4112L6572a91598A0837J6995K18204i9050k35759B64243c0155J3494
10245a6661j10517o4782K017l315A7519e9777M484B9349b00159A70853k1395a47473
10232h6754D42356i181K565j62380J9898A58162a44232A16533d16803B47298C2948
10220C0324J27384j1032J36027b08435N0742M3525A3770J81090f7453A16863a33214
10208h9125B54323J0992b72754a10916a1446q191k59162G2849a54946k42021A60710
$$ plain form
10196 158086 96356 241080 108424 60796 -83244 143256 -303529 -314448 127999 59032
10185 43617 -4705 222100 -134837 -243095 -213577 -115838 93280 -105235 -43606 -90365 -51742
10174 -51742 109456 118185 2890 31816 12849 -201163 183436 -174123 -85949 22085 88168
10163 88168 -187605 -8565 -611162 -531988 119700 59105 -657105 -79043 55113 -148279 -277065
10152 -277065 -36552 438403 -360927 -121124 -94033 -216406 198392 -151087 -145444 149011
10141 -18683 25187 20706 -112351 -47923 -127195 200832 -53943 1027 -293696 -239447 -90027
10129 -178456 -41221 75037 -98294 -74347 -73392 179415 -60737 32246 103737 -286877 -235201
10118 -235201 -152414 272925 142016 -398335 218665 -57115 -86227 -173251 296190 16353
$$ packed form
10196A58086o1730J44724A08424m7628h3244A43256c03529j0919A27999E9032
10185D3617d705B22100a34837j08258K9518R7739I3280a05235d3606m6759L8623
10174e1742A09456Q729B890K8926A2849b01163A83436a74123h5949B2085O6083
10163H8168a87605h565o02597P9174A19700E9105f57105g9043E5113a48279j28786
10152b77065c6552D38403c60927a21124K7091j22373A98392a51087N643A49011
10141a8683B5187m481a12351d7923p9272B00832e3943A027b93696N4249i0027
10129a78456d1221G5037i8294K3947R55A79415f0737C2246P1491b86877N1676
10118b35201Q2787B72925j30909c98335B18665e7115k9112q7024B96190A6353
$$ plain form
10107 163595 28303 -260527 71407 -414494 -203768 -454654 -478828 183375 172930 -296013
10096 274107 147187 -246143 -27217 177966 16550 43431 189839 -218818 -333459 -14966
10085 -81222 45157 47927 -205793 186813 -151290 -25698 160387 -20292 183718 -330661 -205943
10074 -205943 42482 21190 91186 156062 8872 264621 -44737 -288384 224049 6174 117880
10063 117880 215490 -168282 67286 -94584 -184325 -132531 115195 17909 -122534 101866 -4010
10051 41293 91650 186992 -31750 35281 131856 23325 187122 173224 -161549 -188853 -221085
10040 -221085 -38672 -3634 -10496 -284589 275291 53645 -224130 -346213 144480 -168117 -149064
10029 -149064 64669 -10990 -184175 -95338 217042 -333955 -76232 186803 -200013 -64636
$$ packed form
10107A63595B8303b60527G1407d14494b03768k50886k4174A83375j0445b96013
10096B74107j26920b46143b7217A77966A6550K6881J46408b18818j14641a4966
10085h1222D5157K770b05793A86813a51290b5698A60387b0292A83718c30661J24718
10074b05943D2482B1190O9996O4876H872K55749d4737k43647B24049F174J11706
10063A17880R7610a68282F7286i4584q9741N1794A15195A7909a22534A01866d010
10051D1293N0357R5342c1750C5281R6575B3325J63797j3898a61549k7304l2232
10040b21085c8672c634o862k74093B75291E3645b24130j22083A44480a68117J9053
10029a49064F4669a0990j73185Q8837B17042c33955g6232A86803b00013f4636
$$ plain form
10018 -97966 -41230 4704 -251590 -64092 -173839 -231345 -90398 211793 -66202 159613 -60161
10006 -245311 -84526 -1809 55432 395968 111809 28643 -47439 -214643 -248636 -262394 -461908
9995 -461908 -125727 -228813 -149531 39699 -128929 -113854 -91016 -155484 -309774 -244068 -155393
9984 -155393 75647 -168947 8977 -86244 -454651 -48894 84267 -178599 -74657 -248547 -269010
9973 -269010 -19080 -65656 -116419 119710 -167116 -108531 201574 -50544 279413 18795 297766
9962 297766 -65435 -213350 -73837 -157533 76983 61043 -195399 34440 -117243 127758 -220376
9950 208433 -50329 100900 -94834 -108682 -591733 73363 -193851 49537 13532 179165 -72294
9938 140728 -125367 -104016 148764 -93605 -61631 278717 -268998 -208993 235604 -298071
$$ packed form
10018i7966d1230D704b51590f4092j09747n7506i0398B11793f6202A59613f0161
10006b45311h4526a809E5432L40536A11809B8643d7439j67204l3993j3758j99514
9995d61908a25727j03086P9282C9699a28929J5075K2838o4468j54290O5706Q8675
9984a55393G5647a68947H977h6244l68407d8894H4267a78599g4657j73890k0463
9973b69010a9080m6576n0763A19710a67116N8585B01574e0544B79413A8795K78971
9962B97766f5435j47915g3837q3696G6983j5940a95399C4440a17243A27758b20376
9950B08433e0329A00900i4834j3848m83051G3363a93851D9537A3532J65633g2294
9938A40728a25367K1351A48764i3605L1974B78717b68998O0005B35604b98071
$$ plain form
9927 -316633 -337346 -301309 -32616 46557 -28329 -110087 -257505 60966 -111235 156635 27098
9915 -90427 24369 351335 -70437 -22685 -80929 5534 -203164 -48298 -366643 -178422 32758
9903 118071 -26106 104874 -290144 21779 -48102 -131572 65802 -325976 184870 84023 -61201
9891 20013 76758 -283851 -190342 152118 87063 -30647 98048 57913 -122815 -310754 -169907
9880 -169907 -20238 -50752 -220858 188098 -133310 172253 -125978 2732 322276 283454 -56193
9868 -108310 -8875 66649 -181212 -169694 40891 -378132 69775 161553 -65494 63860 26736
9856 -109904 332055 -209487 201808 -87781 131683 -155198 -145778 68485 321516 -265644
9845 68548 -209650 -6729 266060 194943 -47725 -133956 5265 -154285 -608503 -158042 -92167
$$ packed form
9927c16633k0713L6037c2616D6557b8329q1758j47418F0966a11235A56635B7098
9915i0427B4369L26966g0437b2685n8244E534b03164d8298l18345a78422C2758
9903A18071b6106A04874b90144B1779d8102q3470F5802c25976A84870H4023f1201
9891B0013N6745b83851R3509A52118o5055c0647I8048m0135a22815j87939J40847
9880a69907b0238l0514j70106A88098a33310A72253a25978B732L19544l8822e6193
9868a08310h875F6649a81212J1518D0891c78132F9775R1778f5494F3860B6736
9856a09904C32055b09487B01808h7781A31683a55198R420F8485K53031b65644
9845F8548b09650f729B66060p1117d7725q6231E265a54285m54218a58042O5875
$$ plain form
9834 -92167 243613 27418 -108561 233349 83348 -51725 -166029 -146202 263521 41738 -171341
9822 -249412 -40279 -243364 -120373 -17891 -106090 147862 -141647 87721 227608 22773 99077
9811 99077 -43398 -26847 -325733 -34274 -188694 29381 -255199 192799 199529 34375 119630
9800 119630 323403 4697 -101960 90066 -4039 -16495 -83272 -295428 42886 139111 -160043
9788 -179486 -104014 31706 15443 -225633 -313672 258210 -400481 -20041 -237253 18804 -55272
9776 -227920 -87319 -349985 -47038 78193 -565282 -23525 -162936 -289469 -105040 149836
9765 -208239 -142543 -9058 276113 194551 -124585 -119963 -45125 -579058 -31310 -152119 -99828
9754 -99828 148699 4149 349605 108962 -134208 24098 -293168 -182177 -71414 -27895 -28693
$$ packed form
9834i2167B43613B7418a08561B33349H3348e1725j14304J9827B63521D1738a71341
9822b49412d0279k03085a20373a7891q8199A47862a41647H7721J39887B2773P6304
9811I9077d3398J6551k98886c4274j54420B9381b55199A92799O730C4375Q5255
9800A19630K03773D697a01960I0066d039j2456o6777k12156D2886R6225a60043
9788a79486P5472C1706A5443b25633q8039B58210d00481b0041k17212A8804e5272
9776b27920h7319k62666d7038G8193e65282b3525j39411j26533a05040A49836
9765b08239O5696i058B76113q1562a24585M622d5125n33933c1310j20809N2291
9754i9828A48699D149L45456A08962a34208B4098b93168J10991g1414b7895p98
$$ plain form
9743 -28693 53146 195713 300757 -95402 -184203 -262800 -296229 -171098 -45258 -13473 121 113202
9731 113202 -306078 83418 -98117 82000 -99293 -39290 14095 -92311 -132899 -23097 -73959
9720 -73959 -116507 -29562 -167808 -218608 162992 -119038 -178677 192462 -4643 133930 100385
9709 100385 38099 47233 -86800 225379 -179771 -4109 -155432 -96997 172248 -273568 167009
9697 180995 70392 -131006 11499 9698 189893 -248105 -211406 -253503 -93561 59320 -114050
9685 -169272 -149443 164954 -117718 77003 288183 -386501 -204523 121735 -177325 -176746 227564
9673 -55694 -35331 94765 278583 32183 23673 120765 -309 54810 -313535 70222 3179 -346273
9660 171505 22001 35833 -145170 -331218 -88084 -18792 -47266 -334773 -180435 58141 101195
$$ packed form
9743b8693E3146J42567J05044i5402q8801p8597l3429J25131d5258a3473A21J13081
9731A13202c06078H3418i8117H2000i9293c9290A4095i2311m0588b3097n0862
9720g3959m2548b9562j38246n0800A62992a19038n9639A92462d643A33930l3545
9709A00385C8099R134h6800B25379a79771d109j51323N8435A72248b73568A67009
9697A80995G0392a31006A1499j801J80195b48105L6699m2097i3561E9320a14050
9685a69272J9829A64954a17718G7003K11180c86501J81978A21735a77325N79B27564
9673e5694K0363I4765J83818C2183q510R7092c09E4810c13535G0222C179c46273
9660A71505B2001J3832a45170j86048h8084a8792k8474k87507J54338E8141M3054
$$ plain form
9649 101195 111714 -487805 -289068 150260 -6783 -463278 -92303 -176454 -107674 214155 -30882
9637 43193 -33511 -58567 -11069 -153096 -143339 -321493 -159473 50071 -508931 -81249 -54988
9626 -54988 -265489 -141225 -124329 -162619 -175630 161461 -59218 -153208 -9702 -479435 -11210
9614 138948 -156816 -21472 85814 58347 -327650 86761 67091 -42955 95695 -190204 -2292
9602 -330159 -135124 158432 -56000 -213139 -41963 -167785 -44572 -49973 -334197 -126489 216577
9590 127829 41851 -226320 -143600 -180070 -236467 230796 21249 145824 85578 -319077 -292444
9579 -292444 -192597 309979 -169320 54092 -22969 183930 290150 -101129 -54031 -58906 114898
9567 -17948 44106 -180464 -101232 289209 -19698 -173437 -52944 -173445 15017 -559191 5451
$$ packed form
9649A01195J0519d87805J98737A50260f783m56495i2303q4151O8780B14155c0882
9637D3193c3511k5056a1069j42027R757j78154a59473E0071e08931h1249K6261
9626e4988k10501J24264J6896l8290j3011A61461e9218r3990i702m69733a1210
9614A38948a56816b1472H5814k7467c27650H6761j9670d2955I5695a90204b292
9602c30159a35124A58432e6000j57139d1963j25822d4572n401k84224a26489B16577
9590A27829D1851b26320Q2720l6470n6397B30796B1249J24575o0246c19077K6633
9579b92444R9847C09979a69320E4092b2969A83930J06220a01129M7098m875A14898
9567a7948D4106a80464P9232B89209a9698j53739e2944j20501A5017e59191E451
$$ plain form
9555 -57602 200688 7130 -240149 -19717 132718 -54614 -44367 -93355 -198379 88283 -111956
9543 -36151 -15114 -116819 217991 -196659 -66690 -15536 -214676 -319453 -9757 -172543 14493
9531 -196763 -20346 -241503 -221160 -122629 -46868 157740 -434920 93508 34199 -122902 186440
9519 -191021 -132207 125242 87015 -163460 -243186 29360 -74264 -293624 15211 -484259 40057
9507 -141318 232978 -53125 25271 -250938 -37958 -47613 -298039 -190116 280386 -49412 24284
9495 -345425 76821 94973 -41414 139390 128943 -203209 -266454 -112771 13682 -312903 -137711
9483 -82142 119160 -321727 -164713 163059 197126 27773 73971 -96584 67146 -52528 -82045
9472 -82045 -36306 185110 46530 -168136 -241566 -73921 44738 -47009 -86948 180795 -127260
$$ packed form
9555e7602B00688G130b40149a9717A32718e4614J0247m8988j05024H8283a11956
9543c6151a5114j01705B17991a96659f6690a5536j99140j04777i757j62786A4493
9531a96763b0346k21157K0343R8531d6868A57740d34920I3508C4199a22902A86440
9519a91021N8814A25242l8227a63460p9726B9360g4264k19360A5211d84259D0057
9507a41318B32978e3125B5271b50938c7958r655k50426J07923B80386d9412B4284
9495c45425G6821J8152d1414A39390j0447b03209o3245a12771A3682c12903a37711
9483h2142A19160c21727J57014A63059L4067B7773M6198i6584F7146e2528k9517
9472h2045c6306A85110D6530a68136p3430g3921D4738d7009l9939A80795a27260
$$ plain form
9460 -361073 35568 -115789 -165776 2537 253975 37775 323528 -139684 -22015 102390 486266
9449 486266 147366 -186033 -455324 -402336 -79915 -179514 -37053 114580 159446 -41389 69886
9437 -216895 31940 -81830 -4009 -195988 -470477 -186181 -85282 -251144 -429817 -53198 67324
9425 245195 -154571 117220 -30140 -122865 -488216 -164510 -166103 -166474 -138858 86425 -200902
9413 -126327 -143094 -85564 -240514 -8311 156822 -55400 -135595 -14701 95678 -92638 95713
9401 -96316 -156121 -467775 -69323 27602 -262226 -223298 -102040 68381 128748 -34930 -39556
9390 -39556 -35611 -270324 120766 -46416 382768 -28653 -55360 -208963 -143009 -121269 -282648
9379 -282648 -18208 -285145 32526 41255 170522 -1928 -234218 -353218 -3712 -92923 71286
$$ packed form
9460c61073C5568a15789m9987B537K51438C7775K85753a39684b2015A02390L83876
9449D86266A47366a86033k69291N2988g9915r9599c7053A14580M4866d1389F9886
9437b16895C1940h1830d009j91979k74489a86181h5282j65862j78673e3198F7324
9425B45195a54571A17220c0140r2725l65351a64510j593l71K7616H6425b00902
9413a26327j6767N7530j54950h311A56822e5400q0195a4701I5678i2638I5713
9401i6316n9805l11654f9323B7602b62226L8928a02040F8381O0367c4930m626
9390c9556L945k34713A20766d6416C82768b8653k6707j53603O5954K1740j61379
9379b82648a8208k66937C2526Q729J29267a928k32290j19000c712q9211G1286
$$ plain form
9367 221937 87631 123435 180229 -99625 -316107 -217235 -189899 -312477 -73326 -502178 131739
9355 -71756 -36523 -30157 314123 -61278 -189790 198578 -133515 74110 194346 -61762 -58309
9344 -58309 -159015 -45283 -167595 5057 129015 211653 -149996 -59655 373418 222048 -228191
9332 -181954 -60007 -63820 89501 -130438 -204813 29559 -354173 -138487 -135626 32241 -68872
9320 100866 -330518 -147800 -99091 -193712 -267304 33189 -37646 190724 -132369 -53954 -187657
9309 -187657 -193720 61678 -89242 -167985 55636 -330119 -147700 -3333 3014 -144676 143045
9297 -1456 56871 -23282 235236 130180 -153498 289894 -33128 93640 -193373 -119894 14286
9285 14953 -287442 -256832 -284462 83364 271654 -153919 17334 -45565 110852 -227124 38451
$$ packed form
9367B21937H7631L5804N6794i9625k16482R8872K7336j22578g3326m28852A31739
9355g1756L5233O366C14123f1278j28512A98578a33515G4110J20236f1762L453
9344e8309j00706d5283j22312E057J23958Q2638a49996e9655C73418j51370b28191
9332a81954f0007l813H9501a30438p4375B9559c54173a38487K861C2241f8872
9320A00866c30518a47800M8709r4621p3592C3189c7646A90724a32369e3954j33703
9309a87657o063F1678h9242p8743E5636c30119a47700c333C014a44676A43045
9297a456E6871b3282B35236j05056a53498B89894c3128I3640a93373P3479A4286
9285A4953b87442L0610k7630H3364J88290a53919A7334d5565A10852b27124C8451
$$ plain form
9273 -332505 -113008 -370097 107640 -18244 139529 -187077 -365026 -156153 53424 74951
9263 74951 -94995 -128190 163553 -125805 -191786 198499 -228528 -255528 -71251 -51963 42127
9251 48926 177102 -148746 84611 -330533 -229215 232218 21397 91358 -159890 33587 121902
9240 121902 -43681 -58218 148852 -193377 -157277 -147590 -83760 21059 122092 -6922 -163815
9229 -163815 31887 -424392 -50796 -348614 -189270 61274 223816 -278333 104136 -52454
9218 206995 -145278 -332777 -17574 225677 -113218 -127337 6771 -141002 196649 167218 8538
9206 177963 -88088 -33784 -299558 -54656 273820 -452328 -495111 -181339 -51457 -161254 -252179
9195 -252179 33650 276303 -349304 -227717 -84292 -50064 -8885 -391168 -28711 63056 -232351
$$ packed form
9273c32505a13008k57089A07640a8244A39529a87077j77949a56153E3424K1527
9263G4951i4995l3195A63553a25805o5981A98499b28528k7000g1251J9288D2127
9251D8926J28176a48746H4611c30533J01318B32218B1397O9961a59890C3587Q8315
9240A21902d3681j4537A48852a93377L6100R687O3830B1059J01033f922j56893
9229a63815C1887d24392e0796k97818J59344F1274J62542b78333A04136e2454
9218B06995a45278j87499a7574B25677a13218j4119F771a41002A96649k9431H538
9206A77963h8088c3784k65774e4656B73820d52328m2783a81339e1457j09797r0925
9195b52179C3650K42653c49304J21587h4292L4228h885l82283b8711F3056b32351
$$ plain form
9183 -300808 -195060 -65396 332112 -8761 63234 -367107 110469 -162937 182544 -289105
9172 -133360 -209581 -51892 192783 355714 200222 130253 -256062 -37248 36059 47853 -43658
9160 -414455 -123136 -140276 132772 14076 22799 -182028 18597 -146683 -69386 -339390 -190755
9149 -190755 -347146 -69921 -25698 -469191 18826 -306943 -50419 -2382 -257417 -89205 10387
9137 -104784 -145864 -100357 -257488 18619 21441 302348 51577 104789 5367 -55171 -2088 -355444
9125 -355444 -202641 1871 -118268 -83739 -410344 -282002 -52098 -8441 -192456 145910 160052
9114 160052 126571 16074 150654 109600 -341119 204102 -75378 -171416 -43680 79244 -46354
9102 87078 38772 -139850 -211361 94644 -298851 29495 -127112 -71481 85965 -1848 238494
$$ packed form
9183c00808J05748f5396C32112h761F3234c67107A10469a62937A82544b89105
9172a33360p6221e1892A92783J62931j55492o9969b56062c7248C6059J1794d3658
9160d14455a23136j7140A32772A4076Q723a82028A8597a46683f9386k70004J48635
9149a90755j56391f9921b5698m43493A8826c06943e0419b382k55035h9205A0387
9137a04784m1080M5507j57131A8619K822K80907E1577N3212E367e5171b088l53356
9125c55444J52803A871a18268L4529l26605J28342e2098h441j84015A45910J4142
9114A60052l3481A6074J34580m1054c41119B04102g5378r6038d3680G9244d6354
9102H7078C8772a39850p1511I4644b98851B9495a27112N5631H5965a848B38494
$$ plain form
9090 -264744 130876 150200 -134543 202051 -162009 -16209 -85549 447730 -397623 -182875
9079 5983 -112120 22833 60899 297232 65823 38516 -86809 243814 -62072 59011 167780
9068 167780 -146185 -520310 -30258 110417 26558 282944 186900 174657 102849 78866 -144807
9056 -193133 -2121 -141421 317078 156789 -153058 -218622 311800 8183 140526 -136969 46544
9044 189705 -200223 -414143 32286 -63776 44166 67287 -107936 -134555 -255365 -421953 -262214
9033 -262214 97988 -415609 -45674 -292179 -162388 236704 -68709 -204442 -199078 -202010 -196434
9022 -196434 -76026 -13792 -172311 -5069 84484 -50800 -183274 115592 115188 56144 -348766
9010 31346 -68260 -11613 143359 154608 -18120 -232202 -242222 114666 -27246 -325548 -327347
$$ packed form
9090b64744A30876J9324a34543B02051a62009a6209o9340D47730c97623a82875
9079E983a12120B2833L8066K36333F5823k7307h6809B43814f2072E9011J08769
9068A67780a46185l74125c0258A10417B6558K56386r6044j2243p1808k3983a44807
9056a93133b121j39300C17078A56789a53058o5564C11800H183J32343a36969D6544
9044A89705b00223k13920C2286f3776D4166K3121a07936k6619j20810j66588J59739
9033b62214I7988d15609d5674k46505J29791B36704f8709j35733N364k932N576
9022a96434g6026a3792j58519e069H4484e0800j32474A15592m04E6144c48766
9010C1346f8260a1613A43359J1249a8120k14082j0020A14666b7246k98302j799
$$ plain form
8999 -327347 -376158 -273914 -74433 -133979 -159097 -11678 -98340 -236074 32083 -188201 -177506
8988 -177506 -53348 -75373 -190123 118878 -181273 -68039 43416 311782 -153708 -309129
8978 -309129 -143347 33162 -259359 -153544 268280 28351 13433 -184395 -519138 33073
8967 -240080 55393 -126338 182725 -17950 -535025 -246633 -160402 133756 21957 -269091
8956 -121440 -167253 -110416 -125053 -303562 13507 -337181 -360708 304469 115614 -37352 -241104
8945 -241104 70912 155584 232631 -9936 -198565 88055 142422 -139872 -89285 262095 259771
8934 259771 483464 3775 -328992 -68522 -205610 -135552 -361189 -242962 302143 372332 1439162
8923 1439162 4248253 10469814 7420042 2494124 1102951 508341 402518 337588 289652
$$ packed form
8999c27347m8811J02244g4433n9546k5118a1678q6662j37734C2083a88201J0695
8988a77506e3348k2025j14750A18878a81273f8039D3416K68366a53708j55421
8978c09129a43347C3162b59359J05815B68280B8351A3433a84395l34743C3073
8967b40080E5393a26338A82725a7950n17075b46633Q6231A33756B1957b69091
8956a21440m5813N6837j4637j78509A3507c37181k3527C04469A15614c7352k03752
8945b41104G0912Q4672P7047i936j88629H8055N4367a39872N0587B62095k324
8934B59771K23693C775c28992f8522j37088P0058k25637J18227C02143P0189J066830
8923A439162K809091O221561l049772B494124A102951E08341j05823o4930m7936
$$ plain form
8914 289652 -322387 -134285 -63308 -121437 28386 167570 -1330 199664 -52858 -235106 59103
8902 162875 205117 63795 -217116 -215001 -108962 -145316 -228319 -90544 -108561 -133073 -168563
8891 -168563 -14299 28486 -107330 -363202 -64208 -454789 -245596 87839 -324540 -153493
8880 9446 -232106 -256427 -22000 4970 -241195 -170134 -114361 231111 78326 80495 82327 -244026
8867 136052 -124574 -340416 -2920 -213838 57770 -315341 44322 -18527 -287563 -396954 -150847
$$ packed form
8914B89652c22387a34285f3308n8129B8386J39184a330A99664e2858j82248E9103
8902A62875M2242F3795b17116K115J06039l6354q3003i0544j8017k4512l5490
8891a68563a4299B8486a07330k55872f4208l90581K09193H7839c24540a53493
8880I446b32106k4321b2000D970b41195P1061N5773B31111G8326K169J832b44026
8867A36052a24574k15842b920k10918E7770c15341D4322a8527k69036j09391a50847
$$ [...]
##END NTUPLES=NMR SPECTRUM
##END=
