
##TITLE=UV1105_M1_1161-1249_7180398_DhJc3Gqx7S
##JCAMPDX= 6.0         $$ Bruker NMR JCAMP-DX V2.0
##DATA TYPE= NMR SPECTRUM
##DATA CLASS= NTUPLES
##ORIGIN= BRUKER
##OWNER= Administrator
$$ 1.72 TOPSPIN		Version 2.1
$$ 2012-12-04 22:26:53.799 -0500  Administrator@X
$$ Compression mode = diff/dup
##.OBSERVE FREQUENCY= 400.02188249412
##.OBSERVE NUCLEUS= ^1H
##.ACQUISITION MODE= SIMULTANEOUS (DQD)
##.ACQUISITION SCHEME= undefined
##.AVERAGES= 64
##.DIGITISER RES= 22
##SPECTROMETER/DATA SYSTEM= spect
##.PULSE SEQUENCE= noesygpps1d.comp
##.SOLVENT NAME= COFFEE_meoh
##.SHIFT REFERENCE= INTERNAL, COFFEE_meoh, 1, 14.96074
##AUDIT TRAIL= $$ (NUMBER, WHEN, WHO, WHERE, PROCESS, VERSION, WHAT)
$$ ##TITLE= Audit trail, TOPSPIN		Version 2.1
$$ ##JCAMPDX= 5.01
$$ ##ORIGIN= Bruker BioSpin GmbH
$$ ##OWNER= Administrator
$$ $$ E:\/data/COFFEE/nmr/UV1105_M1_1161-1249_7180398_DhJc3Gqx7S/12/pdata/1/auditp.txt
$$ ##AUDIT TRAIL=  $$ (NUMBER, WHEN, WHO, WHERE, PROCESS, VERSION, WHAT)
(   1,<2012-12-04 22:26:47.986 -0500>,<Administrator>,<X>,<go>,<TOPSPIN 2.1>,
      <created by zg
	started at 2012-12-04 22:15:18.549 -0500,
	POWCHK enabled, PULCHK disabled,
       configuration hash MD5:
       86 BA 57 50 F2 9D 5C 9B 26 00 A9 28 5F 66 2E 89
       data hash MD5: 64K
       BC 3E 0D A0 7A 20 BB 94 1F F3 96 1E EF C8 ED 01>)
(   2,<2012-12-04 22:26:51.049 -0500>,<Administrator>,<X>,<proc1d>,<TOPSPIN 2.1>,
      <Start of raw data processing
       efp LB = 0.3 FT_mod = 6 PKNL = 1 PHC0 = 0 PHC1 = 0 SI = 128K 
       data hash MD5: 128K
       7A D7 37 C1 AC 5C 68 9B A9 F5 51 77 3B 70 D7 B8>)
(   3,<2012-12-04 22:26:52.111 -0500>,<Administrator>,<X>,<proc1d>,<TOPSPIN 2.1>,
      <pk PHC0 = -79.2334 PHC1 = 0 
       data hash MD5: 128K
       A4 A8 DA 45 3C 13 1C 3A 44 F7 E0 51 62 14 3A B1>)
(   4,<2012-12-04 22:26:52.799 -0500>,<Administrator>,<X>,<proc1d>,<TOPSPIN 2.1>,
      <abs ABSG = 1 
       data hash MD5: 128K
       8F F0 66 07 F4 54 0B 31 E8 89 77 B4 33 B8 BE E8>)
(   5,<2012-12-04 22:26:52.970 -0500>,<Administrator>,<X>,<proc1d>,<TOPSPIN 2.1>,
      <abs ABSG = 2 
       data hash MD5: 128K
       EC 55 CC 10 09 F2 7B D0 47 1E 34 E4 5A 1D 92 3B>)
(   6,<2012-12-04 22:26:53.142 -0500>,<Administrator>,<X>,<proc1d>,<TOPSPIN 2.1>,
      <abs ABSG = 3 
       data hash MD5: 128K
       3D 98 94 21 38 F3 7C 49 6C 9B FC 08 60 A8 39 DE>)
(   7,<2012-12-04 22:26:53.314 -0500>,<Administrator>,<X>,<proc1d>,<TOPSPIN 2.1>,
      <abs ABSG = 4 
       data hash MD5: 128K
       20 08 A9 5F 91 67 72 6A 42 A6 E3 1F 27 EF A6 75>)
(   8,<2012-12-04 22:26:53.486 -0500>,<Administrator>,<X>,<proc1d>,<TOPSPIN 2.1>,
      <abs ABSG = 5 
       data hash MD5: 128K
       BF 3B 76 92 DB 95 AF 29 0E DE 42 EB 83 DE 90 2A>)
$$ ##END=
$$ 
$$ $$ hash MD5
$$ $$ 1E 0C 44 FD 56 25 39 D4 22 77 CC BF 9A 30 B4 B0
##$RELAX= 
##$RELAX= 
##$RELAX= 
##$RELAX= 
##$RELAX= 
##$RELAX= 
##$RELAX= 
##$RELAX= 
$$ Bruker specific parameters
$$ --------------------------
##$DU= <E:\>
##$EXPNO= 12
$$ [...]
150 150 150 150 150 150 150 150
##$TP07= 0
##$TPNAME0= <>
##$TPNAME1= <>
##$TPNAME2= <>
##$TPNAME3= <>
##$TPNAME4= <>
##$TPNAME5= <>
##$TPNAME6= <>
##$TPNAME7= <>
##$TPOAL= (0..7)
0.5 0.5 0.5 0.5 0.5 0.5 0.5 0.5
##$TPOFFS= (0..7)
0 0 0 0 0 0 0 0
##$TUNHIN= 0
##$TUNHOUT= 0
##$TUNXOUT= 0
##$USERA1= <user>
##$USERA2= <user>
##$USERA3= <user>
##$USERA4= <user>
##$USERA5= <user>
##$V9= 5
##$VALIST= <valist>
##$VCLIST= <CCCCCCCCCCCCCCC>
##$VD= 0
##$VDLIST= <DDDDDDDDDDDDDDD>
##$VPLIST= <PPPPPPPPPPPPPPP>
##$VTLIST= <TTTTTTTTTTTTTTT>
##$WBST= 2048
##$WBSW= 25
##$XGAIN= (0..3)
0 0 0 0
##$XL= 0
##$YL= 0
##$YMAX_a= 5861246
##$YMIN_a= -11658649
##$ZGOPTNS= <>
##$ZL1= 120
##$ZL2= 120
##$ZL3= 120
##$ZL4= 120
##$ABSF1= 14.96074
##$ABSF2= -5.597442
##$ABSG= 5
##$ABSL= 3
##$ALPHA= 0
##$AQORDER= 0
##$ASSFAC= 0
##$ASSFACI= 0
##$ASSFACX= 0
##$ASSWID= 0
##$AUNMP= <proc_prof1d_extract.lims>
##$AXLEFT= 0
##$AXNAME= <>
##$AXNUC= <1H>
##$AXRIGHT= 0
##$AXTYPE= 0
##$AXUNIT= <>
##$AZFE= 0.1
##$AZFW= 0.1
##$BCFW= 0
##$BC_mod= 0
##$BYTORDP= 0
##$COROFFS= 0
##$CY= 15
##$DATMOD= 1
##$DC= 0
##$DFILT= <>
##$DTYPP= 0
##$F1P= 0
##$F2P= 0
##$FCOR= 0.5
##$FTSIZE= 131072
##$FT_mod= 6
##$GAMMA= 0
##$GB= 0
##$INTBC= 1
##$INTSCL= 1
##$ISEN= 128
##$LB= 0.3
##$LEV0= 0
##$LPBIN= 0
##$MAXI= 10000
##$MC2= 0
##$MEAN= 0
##$ME_mod= 0
##$MI= 0
##$NCOEF= 0
##$NC_proc= -2
##$NLEV= 6
##$NOISF1= 0
##$NOISF2= 0
##$NSP= 0
##$NTH_PI= 0
##$NZP= 0
##$OFFSET= 14.96074
##$PC= 1
##$PHC0= -79.2334
##$PHC1= 0
##$PH_mod= 1
##$PKNL= yes
##$PPARMOD= 0
##$PPDIAG= 0
##$PPIPTYP= 0
##$PPMPNUM= 2147483647
##$PPRESOL= 1
##$PSCAL= 4
##$PSIGN= 0
##$PYNMP= <proc.py>
##$REVERSE= no
##$SF= 400.02000974212
##$SI= 131072
##$SIGF1= 0
##$SIGF2= 0
##$SINO= 400
##$SIOLD= 131072
##$SPECTYP= <>
##$SREGLST= <1H.CDCl3>
##$SSB= 0
##$STSI= 131072
##$STSR= 0
##$SW_p= 8223.68421052631
##$SYMM= 0
##$S_DEV= 0
##$TDeff= 65536
##$TDoff= 0
##$TI= <>
##$TILT= no
##$TM1= 0
##$TM2= 0
##$TOPLEV= 0
##$USERP1= <user>
##$USERP2= <user>
##$USERP3= <user>
##$USERP4= <user>
##$USERP5= <user>
##$WDW= 1
##$XDIM= 131072
##$YMAX_p= 378980476
##$YMIN_p= -11617
##$CURPLOT= <Network HP LaserJet P1505>
##$CURPRIN= <$Network HP LaserJet P1505>
##$DFORMAT= <normdp>
##$LAYOUT= <+/1D_H.xwp>
##$LFORMAT= <normlp>
##$PFORMAT= <normpl>
##$SURQMSG= 1
$$ End of Bruker specific parameters
$$ ---------------------------------
##NTUPLES= NMR SPECTRUM
##VAR_NAME=  FREQUENCY,     SPECTRUM/REAL,   SPECTRUM/IMAG
##SYMBOL=    X,             R,               I
##VAR_TYPE=  INDEPENDENT,   DEPENDENT,       DEPENDENT
##VAR_FORM=  AFFN,          ASDF,            ASDF
##VAR_DIM=   131072,        131072,          131072
##UNITS=     HZ,            ARBITRARY UNITS, ARBITRARY UNITS
##FACTOR=    0.0627417313425164, 1,          1
##FIRST=     8223.62146879497, 2292,         -55028
##LAST=      0,             4067,            -54327
##MIN=       0,             -11617,          0
##MAX=       8223.62146879497, 378980476,    0
$$ Real data points
##PAGE= N=1
##DATA TABLE= (X++(R..R)), XYDATA
$$ [...]
63944I55127Q7974J00763J15040J29965J44207J56917J68036J77677J85762J92332
63934B413800J97380K00023J98549J91859J80366J65086J46358J24027R8437P0598
63924C986483M1516J1900j7731m7013p5663j03019j27849j49010j66113j79158
63914C174343j87928j92243j92622j90056j85192j78157j69118j58451j46506
63905A574070j33691j20743j08410r6815q5616p4825o4956n6330m8758m2063l6372
63894G05491l1717k7785k4369k1589j9458j7653j5993j4741j4020j3359j2288
63883D92519j1058j0175r442q120o090m157k944k010m61J829M087N682O826Q203
63869D64689J0150J2463J4774J6918J8837K0419K1570K2445K3385K4544K5581
$$ plain form
63944 955127 1043101 1143864 1258904 1388869 1533076 1689993 1858029 2035706 2221468 2413800
63934 2413800 2611180 2811203 3009752 3201611 3381977 3547063 3693421 3817448 3915885 3986483
63924 3986483 4027999 4039899 4022168 3975155 3899492 3796473 3668624 3519614 3353501 3174343
63914 3174343 2986415 2794172 2601550 2411494 2226302 2048145 1879027 1720576 1574070
63905 1574070 1440379 1319636 1211226 1114411 1028795 953970 889014 832684 783926 741863 705491
63894 705491 673774 645989 621620 600031 580573 562920 546927 532186 518166 504807 492519
63883 492519 481461 471286 461844 453724 447634 443477 440533 438523 438062 439891 443978 449660 456486 464689
63869 464689 474839 487302 502076 518994 537831 558250 579820 602265 625650 650194 675775
63858F75775K5899K5209K3813K2225K0531J8354J5499J2401R630P147M420J288
63846H62191j782m501p341j0785j4397j7202j9019k0705k2861k4931k6031k6271
63834F66365k6587k7361k7830k7134k5465k3809k2728k1862k0645j9128j7879
63823D05937j7222j6860j6207j4903j3034j1004r329q364q046p960p718p288o837
63810B61165o334n535m360l154k380k153k192k235k322k560k790k658k061j316
63796B19115q25o76p46j034j638k468l197l571l604l351k693j576l37M28L67k91
63780A93903r72j284j288j279j333j236q58m66m08o22p14n50m26n60p29o65n09
63763A80004n43o01j47R56K035K164J152j50o59k34J82k40j047j013J50J254J121
$$ plain form
63858 675775 701674 726883 750696 772921 793452 811806 827305 839706 849336 856483 860903 862191
63846 862191 860409 855908 848567 837782 823385 806183 787164 766459 743598 718667 692636 666365
63834 666365 639778 612417 584587 557453 531988 508179 485451 463589 442944 423816 405937
63823 405937 388715 371855 355648 340745 327711 316707 307378 299014 290968 283008 275290 268002 261165
63810 261165 254831 249296 244936 241782 239402 237249 235057 232822 230500 227940 225150 222492 220431 219115
63796 219115 218290 217614 216868 215834 214196 211728 208531 204960 201356 198005 195312 193736 193399 193827 194194 193903
63780 193903 192931 191647 190359 189080 187747 186511 185653 185187 184779 184157 183443 182893 182467 181907 181178 180513 180004
63763 180004 179461 178860 178713 179669 181704 183868 185020 184870 184211 183977 184159 183919 182872 181859 182009 183263 184384
63746A84384O6o92o66m35m13k22N11J350J563J063M43K50N29R96J373J618J941
63729A93659K525L184L509L461L496L953M557M829M734M547M339M037L939M513
63715B49282N482N631L981J012j696k971k951k468k035j641j284j217j580k105
63701B45440k402k408k343k243j817r10J43P79Q43P08Q11J184J623K139K961M110
63685B48618N120N398M802L728K669J823J144O18L78N83J166J732J761J122M12
63670B81074M93J594K950L568L222K505J976J589J000J93m63p62r87j593k611
63655B93748l560m005m099m360n016n734n982n457m218k717j717j699k182k011
63641B40991p06Q58J538J293R48Q79P62N90R82K213L601M388M680N035N520N833
$$ plain form
63746 184384 184450 183758 183092 182657 182244 182022 182533 183883 185446 186509 186952 187202 187731 188727 190100 191718 193659
63729 193659 196184 199368 202877 206338 209834 213787 218344 223173 227907 232454 236793 240830 244769 249282
63715 249282 254764 260395 264376 265388 263692 260721 257770 255302 253267 251626 250342 249125 247545 245440
63701 245440 243038 240630 238287 236044 234227 233317 233460 234239 235082 235790 236601 237785 239408 241547 244508 248618
63685 248618 253738 259136 263938 267666 270335 272158 273302 273920 274298 274881 276047 277779 279540 280662 281074
63670 281074 281567 283161 286111 289679 292901 295406 297382 298971 299971 300164 299701 298939 297952 296359 293748
63655 293748 290188 286183 282084 277724 272708 266974 260992 255535 251317 248600 246883 245184 243002 240991
63641 240991 240285 241143 242681 243974 244922 245801 246563 247153 248135 250348 253949 258337 263017 268052 273572 279405
63625B79405O048O614P657Q748R442R668R645R758J0481J2042J4106J6140J8042
63612D17796K0039K2054K3680K4854K6048K7570K9155L0549L1940L3308L3752
63601G20745L2098K8125K2674J6584J0127L590k158o180q319r258r763j0139j0431
63588G77695j0899j2094j4334j7195j9715k1227k1888k2261k2547k2501k1933
63577E71101k0874j9277j6982j4149j1383r166p414n793m127k350l96J569L105
63564D63864M112N155O721Q366R217R205R126R499R992J0203J0389J1090J2448
63551E79387J4306J6645J9438K2391K5250K8295L2053L6446M0399M2411M1394
63540H98415L7144L0281K1858J2924M304l355r480j3632j5627j5691j4503j2951
$$ plain form
63625 279405 285453 292067 299724 308472 317914 327582 337227 346985 357466 369508 383614 399754 417796
63612 417796 437835 459889 483569 508423 534471 562041 591196 621745 653685 686993 720745
63601 720745 752843 780968 803642 820226 830353 833943 831785 825605 817286 808028 798265 788126 777695
63588 777695 766796 754702 740368 723173 703458 682231 660343 638082 615535 593034 571101
63577 571101 550227 530950 513968 499819 488436 479270 471856 466063 461936 459586 459190 460759 463864
63564 463864 467976 473131 479852 488218 497435 506640 515766 525265 535257 545460 555849 566939 579387
63551 579387 593693 610338 629776 652167 677417 705712 737765 774211 814610 857021 898415
63540 898415 935559 965840 987698 1000622 1004926 1001571 992091 978459 962832 947141 932638 919687
63528I19687j1717j1114j1466j3230j6385j9996k3056k5627k8388l1057l2251
63517F95400l1310k9389k8038k7294k6060k3886k1454j9387j7468j5254j2845
63506D43015j0783r508r030q921q659q106p512o991o309n486n041n152n054m000
63492C42463k478j576j398j109m60j90o90j243j098m62P9N38J259K227L118L754
63476C42734M045L840L226K658K373K031J261L17k99n76j015j976l299m460m912
63461C45948m537l921l863m389m602l787k345j308j202j670j949j373K37K270
63447C13509L635L758L162K862L407M733O561Q492J0073J1219J2442J4282J6686
63434D14821J9310K2090K5053K7744K9395K9569K8274K5555K1530J6790J2338
$$ plain form
63528 919687 907970 896856 885390 872160 855775 835779 812723 787096 758708 727651 695400
63517 695400 664090 634701 606663 579369 553309 529423 507969 488582 471114 455860 443015
63506 443015 432232 422724 413694 404773 396114 388008 380496 373505 367196 361710 356669 351517 346463 342463
63492 342463 339985 338409 337011 335902 335442 335252 334562 333319 332221 331759 331838 332376 333635 335862 338980 342734
63476 342734 346779 350619 353845 356503 358876 360907 362168 362485 362186 361610 360595 358619 355320 350860 345948
63461 345948 341411 337490 333627 329238 324636 320849 318504 317196 315994 314324 312375 311002 311239 313509
63447 313509 317144 320902 324064 326926 330333 335066 341627 350119 360192 371411 383853 398135 414821
63434 414821 434131 456221 481274 509018 538413 567982 596256 621811 643341 660131 672469
63423F72469R056P445P649R445J2258J5598J9386K3625K7972L1967L5354L7733
63411I09957L8230L6139L1769K6014J9319J1813M340j673n701q708j1786j4753
63399A034960j6637j7136j7084j7695j9709k3099k7090l0522l2571l3266l3173
63388G66978l2626l1410k9264k6464k3747k1572j9667j7452j4820j2210r965p957
63376E19824o012m216k611r68Q63K712M532O616Q960J0909J1995J2746J3966J5576
63362E94892J6940J8035J9441K1317K3378K5761K8866L2238L4736L6044L6907
63351H88555L7499L6757L3977K9917K5380J9706J2036L460l567p869j0479j2762
63339A052610j4731j5704j5824j6218j7875k0782k4078k6852k8831l0309l1492
$$ plain form
63423 672469 681525 688970 696619 706064 718322 733920 753306 776931 804903 836870 872224 909957
63411 909957 948187 984326 1016095 1042109 1061428 1073241 1077581 1075908 1070207 1061499 1049713 1034960
63399 1034960 1018323 1001187 984103 966408 946699 923600 896510 865988 833417 800151 766978
63388 766978 734352 702942 673678 647214 623467 601895 582228 564776 549956 537746 527781 519824
63376 519824 513812 509596 506985 506017 506880 509592 514124 520740 529700 540609 552604 565350 579316 594892
63362 594892 611832 629867 649308 670625 694003 719764 748630 780868 815604 851648 888555
63351 888555 926054 962811 996788 1026705 1052085 1071791 1083827 1087287 1083720 1075851 1065372 1052610
63339 1052610 1037879 1022175 1006351 990133 972258 951476 927398 900546 871715 841406 809914
63328H09914l2067l1628l0284k8561k6713k4444k1371j7568j3579r963o898m242
63316E62596k098j180k313n470r574j3319j5906j7051j6823j5774j4733j4069
63304D34286j3374j2137j0423q655p146o185o081o581o761o074n113m729m756
63291C36271m437l770l491l749l860l489l183l349l565l323k849k617k548k255
63277B89786j732j310j043p01k25J02J7m69j095j540j631j459j244j102j059j161
63261B74134j332j188m84L29M99O5%R01K078K377J643Q08O91J195J712J881J851
63244B87160J975K409K984L534M153M902N392N119M360M116M849N855O316O481
63230C49605P093Q005Q317P741O983O678O676O702O923P488Q053Q304Q437Q692
$$ plain form
63328 809914 777847 746219 715935 687374 660661 636217 614846 597278 583699 573736 566838 562596
63316 562596 560498 559318 557005 551535 541961 528642 512736 495685 478862 463088 448355 434286
63304 434286 420912 408775 398352 389697 382551 376366 370285 363704 356943 350869 345756 341027 336271
63291 336271 331834 328064 324573 320824 316964 313475 310292 306943 303378 300055 297206 294589 292041 289786
63277 289786 288054 286744 285701 285000 284775 284877 284894 284425 283330 281790 280159 278700 277456 276354 275295 274134
63261 274134 272802 271614 271130 271459 271958 272023 272023 272924 275002 277379 279022 279830 280521 281716 283428 285309 287160
63244 287160 289135 291544 294528 298062 302215 307117 312509 317628 321988 326104 330953 336808 343124 349605
63230 349605 356698 364703 373020 380761 387744 394422 401098 407800 414723 422211 430264 438568 447005 455697
63216D55697Q775Q322P618P208O984O229M650K791J343L43p20k262m195o017p264
63201D89502p960q520r043q978p806n897m188l077k159j032K42J619L362N507
63187D41572P516Q937R979J1077J2242J3286J4335J5468J6226J6084J5281J4557
63175E96560J4237J4145J4318J4966J5715J5705J4676J3204J1686R794P303M736
63163G47045K598N25k213n751r695j3699j7437k0363k2114k2905k3005k2264k0756
63150E69966j9369j8905j8783j7711j5582j3653j2719j2139j1072r689q544p520
63138D04280o242n034m580m781m718l757k235r38k65jL38R88J697K051K071K266
63122C81140K928L706M140M274M434M630M671M665M883N196N145M730M528M883
$$ plain form
63216 455697 464472 472794 480412 487620 494604 500833 505483 508274 509617 509960 509240 506978 502783 496766 489502
63201 489502 481542 473022 463979 455001 447195 441298 437110 434033 431874 430842 431084 432703 436065 441572
63187 441572 449088 458025 468004 479081 491323 504609 518944 534412 550638 566722 582003 596560
63175 596560 610797 624942 639260 654226 669941 685646 700322 713526 725212 735006 742309 747045
63163 747045 749643 750168 747955 742204 732509 718810 701373 681010 658896 635991 612986 590722 569966
63150 569966 550597 531692 512909 495198 479616 465963 453244 441105 430033 420344 411800 404280
63138 404280 398038 393004 388424 383643 378925 375168 372933 371995 371730 371729 372067 373055 374752 376803 378874 381140
63122 381140 384068 387774 391914 396188 400622 405252 409923 414588 419471 424667 429812 434542 439070 443953
63108D43953N384N472N268N401O116O938P253P044O864P221Q041Q786R034Q866
63094E41641Q603Q340P865O983N766M470L323K355J339j6j642l006l728m190n129
63079E72974o556p616p710p325p298p613p541o799n876n205m599l741k660j397
63065D91038J82J843K773K563K080K625M372O278P572Q524R657J0966J2258J3639
63051E76370J5139J6391J7255J8312K0108K2130K3204K2911K2012K1496K1657
63040G96985K2142K2496K2532K2468K2690K3218K3461K2814K1343J9538J7635
63029A037322J5616J3659J1886R773O515K113k574o988j1343j5749j9605k2262
63017A018363k3754k4341k3986k2719k1050j9436j7705j5518j2947j0062o470
$$ plain form
63108 443953 449337 454809 460077 465478 471594 478532 485785 492829 499693 506914 514955 523741 532775 541641
63094 541641 550244 558584 566449 573432 579198 583668 586991 589346 590685 590669 589027 586021 582293 578103 572974
63079 572974 566418 558802 551092 543767 536469 528856 521315 514516 508640 503435 498836 495095 492435 491038
63065 491038 491220 493063 495836 498399 500479 503104 507476 513754 521326 529850 539507 550473 562731 576370
63051 576370 591509 607900 625155 643467 663575 685705 708909 731820 753832 775328 796985
63040 796985 819127 841623 864155 886623 909313 932531 955992 978806 1000149 1019687 1037322
63029 1037322 1052938 1066597 1078483 1088256 1094771 1096884 1094310 1087322 1075979 1060230 1040625 1018363
63017 1018363 994609 970268 946282 923563 902513 883077 865372 849854 836907 826845 820375
63006H20375k023K394N625P738R931J2973J6440J9520K1901K3663K4873K5593
62994I89003K5876K5643K4906K4095K3749K3833K3812K3385K2650K1503J9527
62983A247982J6630J3162R198M280j732q134j4097j9524k4723k9625l3806l7011
62971A122600l9247m0523m0885m0588l9873l8682l6883l4581l2020k9337k6685
62960G23296k4315k2253k0194j8048j6257j5164j4384j3354j2220j1548j1321
62949E44238j0973j0473j0528j1434j2388j2437j1611j0666r973r258q262p205
62937D19030o470o184o152o074n754n257m816m544m253l733l118k807k965l262
62923C53641l202k639j915j438j207q34r3O83Q80L52k93k94M57J280J423P86q
$$ plain form
63006 820375 818352 820746 826371 834109 844040 857013 873453 892973 914874 938537 963410 989003
62994 989003 1014879 1040522 1065428 1089523 1113272 1137105 1160917 1184302 1206952 1228455 1247982
62983 1247982 1264612 1277774 1286972 1291252 1289520 1281386 1267289 1247765 1223042 1193417 1159611 1122600
62971 1122600 1083353 1042830 1001945 961357 921484 882802 845919 811338 779318 749981 723296
62960 723296 698981 676728 656534 638486 622229 607065 592681 579327 567107 555559 544238
62949 544238 533265 522792 512264 500830 488442 476005 464394 453728 443755 434497 426235 419030
62937 419030 412560 406376 400224 394150 388396 383139 378323 373779 369526 365793 362675 359868 356903 353641
62923 353641 350439 347800 345885 344447 343240 342406 342313 342996 343876 344228 343935 343641 344098 345378 346801 347587 347579
62906C47579k36K80J097J640J693J465J281J391J971L102M562N735O021N405M585
62891C87571M380M919N541N511M746L715K709J552J09j196j762j582j337j678
62877D13198k728m210n746o836p003o261n332m995n273n549n309m557l533k496
62863C43370j820j815k242k368j778r40n72p31q94q05o60n70l29N3J71j70n76
62846C27324o25m35k86o3M25Q25O15Kk28J70O00O42O48R52J133O44k16o84o27
62827C30816o15r20j151r49m97j24J33L74O21R46J545K363K894K666J783Q20K16
62810C40921LK1J45L31N13N59L77J24K14R08J951K811L314L732M216M504M359
62793C69003M031L980M322M784N114N302N589O381Q010J0369J2910J5209J7328
$$ plain form
62906 347579 347343 347623 348720 350360 352053 353518 354799 356190 358161 361263 365825 371560 377581 382986 387571
62891 387571 391951 396870 402411 407922 412668 416383 419092 420644 420753 419557 417795 416213 414876 413198
62877 413198 410470 406260 400514 393678 386675 380414 375082 370087 364814 359265 353956 349399 345866 343370
62863 343370 341550 339735 337493 335125 333347 332407 331835 331104 330210 329405 328745 328175 327846 327899 328070 327900 327324
62846 327324 326699 326264 325978 325915 326340 327165 327780 327782 327554 327724 328324 328966 329614 330566 331699 332343 332127 331443 330816
62827 330816 330201 329281 328130 327181 326684 326560 326693 327067 327688 328634 330179 332542 335436 338102 339885 340705 340921
62810 340921 340924 340945 341090 341421 341934 342493 342870 342994 343208 344116 346067 348878 352192 355924 360140 364644 369003
62793 369003 373034 377014 381336 386120 391234 396536 402125 408506 416516 426885 439795 455004 472332
62780D72332J9454K1471K3245K5035K7156K9355L1006L1934L2512L2863L2452
62769G78815L0700K7633K3690J9228J4406R307L988j427o557j0946j4645j8205
62757H55987k1842k4920k6758k7573k8177k8781k8793k7859k6515k5430k4501
62746E64838k3150k1352j9755j8761j7903j6453j4412j2532j1353j0624r760q597
62734C80186p430o426n426m339l385k748k258j618q54k34J49M92R78J584K154
62719C50825K570K828L081L560M343N241O068O904P955R164J0287J1338J2669
62706D36833J4549J6866J9404K2078K4762K7136K9095L1093L3742L7033M0337
62695G32928M3184M5683M7993M9795N0602N0414M9558M7916M4758L9600L2860
$$ plain form
62780 472332 491786 513257 536502 561537 588693 618048 649054 680988 713500 746363 778815
62769 778815 809515 837148 860838 880066 894472 903779 907767 906340 899783 888837 874192 855987
62757 855987 834145 809225 782467 754894 726717 697936 669143 641284 614769 589339 564838
62746 564838 541688 520336 500581 481820 463917 447464 433052 420520 409167 398543 388783 380186
62734 380186 372756 366330 360904 356565 353180 350432 348174 346556 345702 345468 345617 346109 347087 348671 350825
62719 350825 353395 356223 359304 362864 367207 372448 378516 385420 393375 402539 412826 424164 436833
62706 436833 451382 468248 487652 509730 534492 561628 590723 621816 655558 692591 732928
62695 732928 776112 821795 869788 919583 970185 1020599 1070157 1118073 1162831 1202431 1235291
62684A235291K5375J7480Q940k95r691j8550k6481l3311l8902m3311m6785m9340
62672A020420n0505m9962m8258m6456m5014m3406m0989l7883l4746l1962k9362
62661E61877k6654k3813k1043j8516j6279j4371j2916j1963j1203j0077q455o997
62649C79590o477o699o629n743m765m645n212n410m674l510k698k428k325j904
62635C16471q76O62K129K803K434J376J11j079j924k082j578j033j120j843k565
62620C11886k669k035j041k70n0n4L88J391K241K346K139K446L208L523L057K628
62604C29134L045L997M585M552M390M510M906N597O739Q233R648J0759J1795J3040
62590D24930J4407J5626J6472J6689J5980J4401J2528J0857R151O749L485K2k868
$$ plain form
62684 1235291 1260666 1278146 1287086 1286791 1277100 1258550 1232069 1198758 1159856 1116545 1069760 1020420
62672 1020420 969915 919953 871695 825239 780225 736819 695830 657947 623201 591239 561877
62661 561877 535223 511410 490367 471851 455572 441201 428285 416322 405119 395042 386587 379590
62649 379590 373113 366414 359785 354042 349277 344632 339420 334010 329336 325826 323128 320700 318375 316471
62635 316471 315595 316257 318386 321189 323623 324999 325110 324031 322107 320025 318447 317414 316294 314451 311886
62620 311886 309217 307182 306141 305871 305821 305767 306155 307546 309787 312133 314272 316718 319926 323449 326506 329134
62604 329134 332179 336176 340761 345313 349703 354213 359119 364716 371455 379688 389336 400095 411890 424930
62590 424930 439337 454963 471435 488124 504104 518505 531033 541890 551041 557790 561275 561297 558429
62577E58429n088p136r403j1678j3333j3937j3688j3259j3161j3295j3206j2693
62565D18552j1944j1148j0220r118q134p600p366o888n851m496l270k358j723
62552C28436j390j472j872k236k267k007j719j491j140n08K35P24Q17P57Q20R45
62536C16632Q74O01M77P48J178J360J319J530K264L151L640L715L966M940O588
62521C52983Q411R935J1033J1901J2852J4107J5663J7461J9587K2209K5163K7835
62509E49140K9616L0389L0429K9946K8964K7535K5717K3319J9944J5456J0275
62498H20730N072L13l841p400j0497j3259j5561j6977j7163j6208j4482j2231
62486F98496r411o006k316J033L560N531P994J1774J6265J9779K1372K1878K2613
$$ plain form
62577 558429 553341 546205 536802 525124 511791 497854 484166 470907 457746 444451 431245 418552
62565 418552 406608 395460 385240 376122 367988 360388 353022 346134 340283 335787 332517 330159 328436
62552 328436 327046 325574 323702 321466 319199 317192 315473 313982 312842 312334 312569 313293 314110 314867 315687 316632
62536 316632 317506 318107 318584 319332 320510 321870 323189 324719 326983 330134 333774 337489 341455 346395 352983
62521 352983 361394 371329 382362 394263 407115 421222 436885 454346 473933 496142 521305 549140
62509 549140 578756 609145 639574 669520 698484 726019 751736 775055 794999 810455 820730
62498 820730 825802 826115 822274 814874 804377 791118 775557 758580 741417 725209 710727 698496
62486 698496 689085 683079 680763 681796 685356 690887 698881 710655 726920 746699 768071 789949 812562
62473H12562K3464K3047K0563J6691J2504Q407M414N91l370q308j4574k1110k6295
62460H48586k9455l1094l1946l2456l2953l3454l3291l1694k8958k6289k4318
62449E12678k2441j9939j7037j4397j2128r950p953o502n486m317k693r79K68
62436C89124Q07P33K68l58r67j426j622j548j458j645j975k015j866k331l778
62421C69943n241n430m427l576l684m109l896l055k241j755j447j239j195j226
62407C27422j175j093j063r13m66lJm54p98n54J87R89J521J667J480J156J020
62390C28924J400K426L847N015N246M441L256K570K782L696M833N729O156O388
62376C86709P064Q444R890J0486J0152R749J0108J1313J3003J4890J6743J8281
$$ plain form
62473 812562 836026 859073 879636 896327 908831 917238 921652 922243 918873 910565 895991 874881 848586
62460 848586 819131 788037 756091 723635 690682 657228 623937 592243 563285 536996 512678
62449 512678 490237 470298 453261 438864 426736 416786 408833 402331 396845 392528 389835 388856 389124
62436 389124 389931 390664 390932 390574 389607 388181 386559 385011 383553 381908 379933 377918 376052 373721 369943
62421 369943 364702 359272 354845 351269 347585 343476 339580 336525 334284 332529 331082 329843 328648 327422
62407 327422 326247 325154 324091 323178 322712 322709 322710 322256 321458 320904 321091 322080 323601 325268 326748 327904 328924
62390 328924 330324 332750 336597 341612 346858 351299 354555 357125 359907 363603 368436 374165 380321 386709
62376 386709 393773 402217 412107 422593 432745 442494 452602 463915 476918 491808 508551 526832
62364E26832J9476K0791K2805K5645K9031L2748L6852M1361M6050N0599N4790
62353I06980N8439O1121O2207O1250N8294N3631M7267L8998K9224J9255J0290
62342A406956K172o262j5477k4405l1575l6596m0193m3104m5472m7106m7803m7284
62330A023851m5331m2182l8607l5381l2672l0071k7159k4008k1164j9102j7887
62319F90287j7268j7037j7039j6999j6692j6300j6193j6257j5878j4810j3667
62308E12147j3119j2969j2493j1439j0157q893p588o338n423m773l958k870j940
62295D10187j455j114n72L4M46Q03J414K232K987L616M151M411M193L739L576
62280D38648L912M543N262N989O475O390N855N537N928O797P604Q197Q878R886
$$ plain form
62364 526832 546308 567099 589904 615549 644580 677328 714180 755541 801591 852190 906980
62353 906980 965419 1026540 1088747 1149997 1208291 1261922 1309189 1348187 1377411 1396666 1406956
62342 1406956 1409128 1402866 1387389 1362984 1331409 1294813 1254620 1211516 1166044 1118938 1071135 1023851
62330 1023851 978520 936338 897731 862350 829678 799607 772448 748440 727276 708174 690287
62319 690287 673019 655982 638943 621944 605252 588952 572759 556502 540624 525814 512147
62308 512147 499028 486059 473566 462127 451970 443077 435489 429151 423728 418955 414997 412127 410187
62295 410187 408732 407618 407046 407080 407526 408329 409743 411975 414962 418578 422729 427140 431333 435072 438648
62280 438648 442560 447103 452365 458354 464829 471219 477074 482611 488539 495336 502940 511137 520015 529901
62266E29901J1193J2766J4738J7249K0182K3269K6373K9675L3550L8246M3644
62255H00786M9274N4589N9185O2804O5161O5816O4250O0177N3797M5693L6419
62244A417951K6203J5218M064o276j5082k2464k9155l5786m2416m8573n3599n7018
62232A153067n8713n8886n7751n5365n1807m7476m3024l8906l5178l1687k8396
62221F45878k5335k2477j9816j7498j5682j4270j2978j1678j0523r655q972q322
62209D68672p761p394p047o415n525m774m317l726k534j006Q0M39P00J594L042
62194D24028M341N123N709O585P833R169J0232J0763J0799J0773J1185J2032J2832
62181E41404J3335J3835J4511J4866J4320J3143J2189J1865J1933J2362J3626
$$ plain form
62266 529901 541094 553860 568598 585847 606029 629298 655671 685346 718896 757142 800786
62255 800786 850060 904649 963834 1026638 1091799 1157615 1221865 1282042 1335839 1381532 1417951
62244 1417951 1444154 1459372 1463436 1457160 1442078 1419614 1390459 1354673 1312257 1263684 1210085 1153067
62232 1153067 1094354 1035468 977717 922352 870545 823069 780045 741139 705961 674274 645878
62221 645878 620543 598066 578250 560752 545070 530800 517822 506144 495621 485966 476994 468672
62209 468672 460911 453517 446470 440055 434530 429756 425439 421713 419179 418173 418253 418692 419392 420986 424028
62194 424028 428369 433492 439201 445786 453619 462788 473020 483783 494582 505355 516540 528572 541404
62181 541404 554739 568574 583085 597951 612271 625414 637603 649468 661401 673763 687389
62170F87389J5922J8705K1452K4484K8457L3367L8514M3316M7551N0857N2565
62159A062579N2314N0404M7246M2600L5789K6705J6379O321k600j0471j7589k3826
62147A285851k9046l3671l8182m2162m4537m4965m4316m3432m2147l9961l7055
62136H46377l3866l0245k5911k1484j8051j5794j3937j2078j0574r510q257o482
62124F40188m716l454k395j092L59J851L756O255Q718J0413J1324J1550J0571
62111F93328Q085N085K999J930Q88l05o07M21J501J012j283m426p555j0281j2221
62096F78571j2921j2295j0709q650o477m367k322l39J389K637L616M848O449P924
62082F47354Q901R765J1212J3354J5599J7227J8010J8449J9484K1590K4085K5773
$$ plain form
62170 687389 703311 722016 743468 767952 796409 829776 868290 911606 959157 1010014 1062579
62159 1062579 1114893 1165297 1212543 1255143 1290932 1317637 1334016 1340337 1337737 1327266 1309677 1285851
62147 1285851 1256805 1223134 1184952 1142790 1098253 1053288 1008972 965540 923393 883432 846377
62136 846377 812511 782266 756355 734871 716820 701026 687089 675011 664437 654927 646670 640188
62124 640188 635472 632018 629623 628531 628890 630741 634497 640752 649470 659883 671207 682757 693328
62111 693328 701413 706498 709497 711427 712315 712010 711403 711824 713325 714337 713054 708628 701073 690792 678571
62096 678571 665650 653355 642646 633996 627519 623152 620830 620491 621880 624517 628133 632981 639430 647354
62082 647354 656255 666020 677232 690586 706185 723412 741422 759871 779355 800945 825030 850803
62070H50803K6434K7051K8325K9686L0354L0689L1655L3293L4722L5465L5805
62059A194282L5866L5118L3048K9485K4246J7254R342K058l829r046j4510j9917
62047A333397k4299k7513l0474l3971l7846m1218m3146m3226m2033m0806m0245
62036I28620l9641l7681l4112l0103k6931k4720k2735k0451j8072j6108j4739
62025F43327j3614j2267j0672r252q328p771p372p287p737q370q447p710o721
62012E27779o231o411o814o830o129m880l603k669j891q54M75J731K709L596M554
61997D94532N422N860N564M304K207J01r46o95o3j93j446l438n548p175p973q291
61981D82222q908r964j0533r818q406p575p663p809p304o390n587m914m125l292
$$ plain form
62070 850803 877237 904288 932613 962299 992653 1023342 1054997 1088290 1123012 1158477 1194282
62059 1194282 1230148 1265266 1298314 1327799 1352045 1369299 1378641 1380699 1376870 1367824 1353314 1333397
62047 1333397 1309098 1281585 1251111 1217140 1179294 1138076 1094930 1051704 1009671 968865 928620
62036 928620 888979 851298 817186 787083 760152 735432 712697 692246 674174 658066 643327
62025 643327 629713 617446 606774 597522 589194 581423 574051 566764 559027 550657 542210 534500 527779
62012 527779 521548 515137 508323 501493 495364 490484 486881 484212 482321 481467 481942 483673 486382 489978 494532
61997 494532 499954 505814 511378 515682 517889 517990 517044 516349 516286 516093 514647 511209 505661 498486 490513 482222
61981 482222 473314 463350 452817 442999 434593 427018 419355 411546 404242 397852 392265 387351 383226 379934
61967C79934k795k848l267l532l181k296j530j283j075j97J115J826J434N51O
61952C62862J5M92J492K908M198M994N624O606P926R295J0802J2729J4892J6681
61938D61516J7822J8654J9640K0841K1922K2417K2103K1328K0798K0789K0732
61927F88562J9906J8283J6367J4363J2092R558P000M347J181k556o237r154j1006
61914G62706j1628j0773q557n765l215r26J653M734P880J0667J3128J5352J6935
61901G92191J7157J5732J3083R859O365K572j485n504r139j2226j4739j6634j7831
61888G79401j8313j8212j7782j7240j6561j5568j4354j3477j3384j3676j3391
61877F07443j2176j0809j0287j0665j1151j1062j0249q815o926m994l531k639
$$ plain form
61967 379934 377139 374291 371024 367492 364311 362015 360485 359202 358127 357930 359045 360871 362305 362856 362862
61952 362862 362877 363369 364861 367769 371967 376961 382585 389191 397117 406412 417214 429943 444835 461516
61938 461516 479338 497992 517632 538473 560395 582812 604915 626243 647041 667830 688562
61927 688562 708468 726751 743118 757481 769573 779131 786131 790478 791659 789103 782866 773712 762706
61914 762706 751078 740305 731748 725983 722768 721842 723495 728229 736109 746776 759904 775256 792191
61901 792191 809348 825080 838163 848022 854387 856959 855474 849970 840831 828605 813866 797232 779401
61888 779401 761088 742876 725094 707854 691293 675725 661371 647894 634510 620834 607443
61877 607443 595267 584458 574171 563506 552355 541293 531044 522229 515303 510309 506778 504139
61865E04139j855p17O96J920K693L300M280N927Q024J0131J2064J3992J6158J8673
61851E99425K1582K4760K7751L0024L1609L3082L4691L5888L6007L5002L3046
61840I42867K9904K5358J9962J4591R364L742k252p730j1923j4785j6365j6336
61828I76397j4627j1846q604m832k67M712R222J2683J4985J6015J5499J3346R812
61815A032495N222k76o584j3314j9674k4859k8696l1721l4349l6163l6492l5540
61803G70049l4279l3120l1412k8627k5374k2647k0561j8474j6097j3831j2054
61792E13573j0688r472q292p116n948m883l984l179k437j916j688j506j139q17
61778D50508q89j157j021l37K90L10k5j6N17R67O51l97j498k013j831j141j43
$$ plain form
61865 504139 502284 501567 502263 504183 506876 510176 514456 520383 528407 538538 550602 564594 580752 599425
61851 599425 621007 645767 673518 703542 735151 768233 802924 838812 874819 909821 942867
61840 942867 972771 998129 1018091 1032682 1042046 1045788 1043536 1035806 1023883 1009098 992733 976397
61828 976397 961770 949924 941320 936488 936221 940933 950155 962838 977823 993838 1009337 1022683 1032495
61815 1032495 1037717 1037441 1030857 1017543 997869 973010 944314 912593 878244 842081 805589 770049
61803 770049 735770 702650 671238 642611 617237 594590 574029 555555 539458 525627 513573
61792 513573 502885 493413 485121 478005 472057 467174 463190 460011 457574 455658 453970 452464 451325 450508
61778 450508 449619 448462 447441 447104 447394 447704 447679 447663 448180 449147 449798 449401 447903 445890 444059 442918 442775
61761D42775R35J775K332K969L925M763M837M217L578L196K747K087J567J338
61747D83041J087P31O20O92K18j081k398k969l100l350l479l107k768l121l609
61732D57407l126j764o67k97j02J40L1j76N14K129L201K693J449Q77J092J284
61716D64685J255J481K030K363K146J550Q23R6m86q49j191j741k484l390m510
61701D61778n599o018n531m812m611m680m229l196k402k431k921l105k640j805
61687D07798j183j170j577j822j688j659k180k833k764j779n06M87J129J411J124
61672C92788L02n17q07o00l01j88k69m36n84o34o58q44j224j504j238k46J121
61655C84161K136K235J587R73J004J552K053K293K535K993L445L544L289L057
$$ plain form
61761 442775 443710 445485 447817 450786 454711 459474 464311 468528 472106 475302 478049 480136 481703 483041
61747 483041 484128 484859 485479 486171 486389 485308 482910 479941 476841 473491 470012 466905 464137 461016 457407
61732 457407 454281 452517 451850 451553 451451 451591 451622 451446 451960 454089 457290 459983 461432 462309 463401 464685
61716 464685 465940 467421 469451 471814 473960 475510 476333 476429 475943 475094 473903 472162 469678 466288 461778
61701 461778 456179 450161 444630 439818 435207 430527 426298 423102 420700 418269 415348 412243 409603 407798
61687 407798 406615 405445 403868 402046 400358 398699 396519 393686 390922 389143 388637 389124 390253 391664 392788
61672 392788 393090 392573 391766 391166 390865 390677 390408 389972 389388 388754 388096 387252 386028 384524 383286 383040 384161
61655 384161 386297 388532 390119 391092 392096 393648 395701 397994 400529 403522 406967 410511 413800 416857
61641D16857L218L784M358M445L891L010K230J648J002K7j266k578l454l583l121
61626D30468k695k926l824m765n027m365l138j980j312j059q88o65n69p54j064
61611C95437j224j152j010j049j529k569l977n323o269o753o825o536o017n407
61597C39797m675l774l057l077l814m513m534m035l501l077k699k454k377k226
61583B91984j897j718j856j891j537j330j824k510k413j558q98q59r83j023j276
61568B68411j643j410m61K42N4l71k17J39k14j171j748j514j001o65k69M83J304
61551B59949J651J448J155J178J375J254O78J34M7P8l94j085r24M37J936K406
61535B71323J999J729K048K526K639K206J266J40n30l64K25N62N76N79M58j59
$$ plain form
61641 416857 420075 423859 428217 432662 436553 439563 441793 443441 444443 444470 443204 440626 437172 433589 430468
61626 430468 427773 424847 421023 416258 411231 406866 403728 401748 400436 399377 398489 397824 397255 396501 395437
61611 395437 394213 393061 392051 391002 389473 386904 382927 377604 371335 364582 357757 351221 345204 339797
61597 339797 335122 331348 328291 325214 321400 316887 312353 308318 304817 301740 299041 296587 294210 291984
61583 291984 290087 288369 286513 284622 283085 281755 279931 277421 275008 273450 272552 271693 270710 269687 268411
61568 268411 266768 265358 264897 265139 265193 264822 264605 264744 264530 263359 261611 260097 259096 258431 258162 258645 259949
61551 259949 261600 263048 264203 265381 266756 268010 268688 268822 268869 268947 268553 267468 266544 266981 268917 271323
61535 271323 273322 275051 277099 279625 282264 284470 285736 285876 285346 284982 285207 285769 286345 286924 287382 287223
61519B87223j076j613j597j583j932k356k511k460k345k125j828j565j106r6J152
61504B64182J707J247N72M61N80J80n77p89j69N23M88j40n70l39J87K52l86j090
61486B66319j104n37k58p16j311j198l24O77J258J317J044P88Q73J208J292Q68
61470B70196K50k25o47j011p92K43J244J173K82k48jK64jm32p26j268k144k452
61452B63705j376N22J921K240J885J334P95N07O44R42J045J149J694K502K892
61437B82401K698K461K490K480K329K550L408M188M034L125K386K145J803R45
61423C19443J70L80J520K476K296J249N00Q58K057L233L759L501K589J359L89
61408C45779R2K20J52k37m47k47k22j076k639m070m821n026m922m421l354j875
$$ plain form
61519 287223 286147 284534 282937 281354 279422 277066 274555 272095 269750 267625 265797 264232 263126 263030 264182
61504 264182 265889 267136 267708 268169 268749 268929 268352 267563 267394 267917 268405 268265 267695 267356 267543 267795 267409 266319
61486 266319 265215 264678 264420 263704 262393 261195 260871 261548 262806 264123 265167 265955 266828 268036 269328 270196
61470 270196 270446 270221 269574 268563 267771 268014 269258 270431 270713 270465 270464 270728 270727 270295 269569 268301 266157 263705
61452 263705 262329 262851 264772 267012 268897 270231 271026 271533 272177 273119 274164 275313 277007 279509 282401
61437 282401 285099 287560 290050 292530 294859 297409 300817 305005 309039 312164 314550 316695 318498 319443
61423 319443 319613 319993 321513 323989 326285 327534 328034 328892 330949 334182 337941 341442 344031 345390 345779
61408 345779 345871 346091 346243 346006 345559 345312 345090 344014 341375 337305 332484 327458 322536 318115 314761 312886
61392C12886l92O88J126R04L25j19j61jj2k29k85J03P40J190J333J439J689J869
61374C23093J726J420J370J717K179K409K284J876J428J291J615K077K257K237
61360C48979K432K836K974K660K338K370K520K482K481K903L701M593N553O585
61346C95407P405P794Q014Q313Q340P663O605N834N290M398L269K741L047L315
61332D77435K815J908J302R74M49l47j116j789k545l403m203m878n300n083l983
61317D52236k429j240q09p94o31o8P42J504K031K395K800L376M185N348O869Q318
61301D83833R072R060Q821Q690Q264P027N118L117J266o26k677m682o285p165
61287E22833p159o473n691n280n188n047m586l739k595j471p27k71M25J599K790
$$ plain form
61392 312886 312494 313182 314308 315212 315537 315418 315257 315256 315244 315015 314730 314833 315573 316763 318096 319535 321224 323093
61374 323093 324819 326239 327609 329326 331505 333914 336198 338074 339502 340793 342408 344485 346742 348979
61360 348979 351411 354247 357221 359881 362219 364589 367109 369591 372072 374975 378676 383269 388822 395407
61346 395407 402812 410606 418620 426933 435273 442936 449541 455375 460665 465063 468332 471073 474120 477435
61332 477435 480250 482158 483460 484434 484883 484536 483420 481631 479086 475683 471480 466602 461302 456219 452236
61317 452236 449807 448567 447758 446964 446333 446265 447007 448511 450542 452937 455737 459113 463298 468646 475515 483833
61301 483833 492905 501965 510786 519476 527740 534767 539885 543002 544268 543642 540965 536283 529998 522833
61287 522833 515674 509201 503510 498230 493042 487995 483409 479670 477075 475604 474877 474606 475031 476630 479420
61272D79420L562M183N204O601P856Q596Q707Q184P319O761O751O617N700M507
61258E69968M214N103O396P479Q441R245R339Q428O979N602M424L359K409J442
61244F52828J38j476k907l831m476n136n812o504p352q186q444p834o719n639
61230E78650m839m435m463m561m144l166k153j305k32J099J955J904J597J788
61216E57695K223K105J251J94m82l15Q87K498L234K619J735J689K025J633O94
61201E79685M27J207K233L032L998N287O358O936P503Q465R722J1277J3274J5137
61187F74541J5681J4527J2609J0761Q831O604M705L715L196K477J774J624J729
61174G62774J323L79m72j058j815k817l540l698l638l753l988m189m536n423p053
$$ plain form
61272 479420 482982 487165 492369 498970 506826 515422 524129 532313 539632 546393 553144 559761 565461 569968
61258 569968 574182 579285 585681 593160 601601 610846 620185 628613 635592 641194 645618 648977 651386 652828
61244 652828 652966 651490 648583 644752 640276 635140 629328 622824 615472 607286 598842 591008 584289 578650
61230 578650 573811 569376 564913 560352 556208 553042 550889 549584 549352 550451 552406 554310 555907 557695
61216 557695 559918 562023 563274 563468 562986 562671 563558 566056 569290 571909 573644 575333 577358 578991 579685
61201 579685 580112 581319 583552 586584 590582 595869 602227 609163 616666 625131 634853 646130 659404 674541
61187 674541 690222 704749 717358 728119 736950 743554 748259 751974 755170 757647 759421 761045 762774
61174 762774 764097 764476 764004 762946 761131 758314 754774 751076 747438 743685 739697 735508 730972 725549 718496
61159G18496r137j0888j1484j0972j0456j0917j1948j2154j0824q651o681n164
61147E99220l761k430j548j296j364j476j815k744m210n706o825p625q244q560
61133E41616q450q145p830p043n151k495m32J46j53o9R09K335L741N121O635Q304
61117E29039R981J1407J2343J2933J3721J5087J6784J8310J9506K0456K1055K1136
61105G21758K0903K0736K0538J9683J7813J5435J3515J2555J2108J1209R239O282
61093I01774K639j543n808q992j0202j0225j0986j3219j5583j6557j6370j6264
61081G78664j6635j6802j6237j5026j3480j2059j1347j1260j0661q721o331n166
61069F34939n581o418o646o063m646k547p26k60p23n50P42J960K267K485L630
$$ plain form
61159 718496 709359 698471 686987 676015 665559 654642 642694 630540 619716 611065 604384 599220
61147 599220 595459 593029 591481 590185 588821 587345 585530 582786 578576 572870 566045 558420 550176 541616
61133 541616 533166 525021 517191 510148 504997 502502 502070 502216 502063 501994 502903 505238 508979 514100 520735 529039
61117 529039 539020 550427 562770 575703 589424 604511 621295 639605 659111 679567 700622 721758
61105 721758 742661 763397 783935 803618 821431 836866 850381 862936 875044 886253 895492 901774
61093 901774 904413 902870 897062 888070 877868 867643 856657 843438 827855 811298 794928 778664
61081 778664 762029 745227 728990 713964 700484 688425 677078 665818 655157 646436 640105 634939
61069 634939 629358 622940 616294 610231 605585 603038 602312 602052 601329 600779 601521 603481 605748 608233 611863
61054F11863N350O668P416Q090Q979J0130J1582J2986J3629J3496J3627J4878
61042G38694J6894J8868K0648K2465K4267K5937K7644K9436L1134L2999L5687
61031A024673L9077M2108M4401M6989N0636N4479N7332N9316O1107O2593O3621
61020A606332O5205O8545P3534P9624Q7320R7210J08308J19233J30730J45066
61010B581107J63245J84942K11325K46091K93417L56637M39245N45421O78982
61001E700412Q42766J038490J265345J519606J797587K094228K386769K613539
60993A9258742K679700K505554K085386J503672Q93935L80154M5399p2991Q337
60984B9287888K02356L61176L34590M6685m68828j097804j706172k186057k474676
$$ plain form
61054 611863 617213 623881 631297 639387 648366 658496 670078 683064 696693 710189 723816 738694
61042 738694 755588 774456 795104 817569 841836 867773 895417 924853 955987 988986 1024673
61031 1024673 1063750 1105858 1150259 1197248 1247884 1302363 1359695 1419011 1480118 1542711 1606332
61020 1606332 1671537 1740082 1813616 1893240 1980560 2077770 2186078 2305311 2436041 2581107
61010 2581107 2744352 2929294 3140619 3386710 3680127 4036764 4476009 5021430 5700412
61001 5700412 6543178 7581668 8847013 10366619 12164206 14258434 16645203 19258742
60993 19258742 21938442 24443996 26529382 28033054 28926989 29307143 29352542 29279551 29287888
60984 29287888 29490244 29851420 30186010 30232695 29763867 28666063 26959891 24773834 22299158
60975B2299158k558895k471259k271866k020776j759302j509862j284079j086667
60967G336452r16192p68776o42437n36729m49886l79049l22304k78069k43142
60958B799868k13780j88378j67061j48986j32305j16566j02871r1363q0621p0064
60948A487873o1069n4984n1435m9220m7643m6298m4647m2468l9981l7206l4004
60937I78918l0893k8817k7799k6847k5426k4025k2992k1924k0603j9430j8490
60926G11672j7189j5409j3969j3323j2795j1809j0914j0714j0617r697q194p117
60914E69925o765o562o181n943o051o134n748m897m024l578l578l520k960k137
60900E01847j677j594j233k99N62O42L4o61j088j219j144j114j422j941k299k602
$$ plain form
60975 22299158 19740263 17269004 14997138 12976362 11217060 9707198 8423119 7336452
60967 7336452 6420260 5651484 5009047 4472318 4022432 3643383 3321079 3043010 2799868
60958 2799868 2586088 2397710 2230649 2081663 1949358 1832792 1729921 1638558 1557937 1487873
60948 1487873 1426804 1371820 1320385 1271165 1223522 1177224 1132577 1090109 1050128 1012922 978918
60937 978918 948025 919208 891409 864562 839136 815111 792119 770195 749592 730162 711672
60926 711672 694483 679074 665105 651782 638987 627178 616264 605550 594933 585236 577042 569925
60914 569925 563160 556598 550417 544474 538423 532289 526541 521644 517620 514042 510464 506944 503984 501847
60900 501847 500170 498576 497343 497044 497606 498248 498282 497621 496533 495314 494170 493056 491634 489693 487394 484792
60884D84792l425m763n753n896n734n775n495m271k599j476j051p72m82l06J74
60869D37168J513L228M131L913L444L429L654L877M383N226N714N369M781M819
60855D94649N362N569N170M802N038N635N948N686N004M154L377L009L256L770
60841E60429L751K805J450M59j41q98j806k030j041N22J635K202L005M520O299
60826E81161P581Q093Q214Q574R545J0914J2083J2673J2831J2812J2610J2228
60814G09319J1946J1899J1537J0143P715M995K586M98j453l315n079o777q373
60801G45641r821j1215j2540j3342j3163j2309j1715j1844j2173j1967j1164j0176
60789F04212r201q185p263o831p107p873q616q821q207o872n317m209m016m739
$$ plain form
60884 484792 481367 476604 470851 464955 459221 453446 447951 443680 441081 439605 438554 437782 437300 436994 437168
60869 437168 438681 441909 446040 449953 453397 456826 460480 464357 468740 473966 479680 485049 489830 494649
60855 494649 500011 505580 510750 515552 520590 526225 532173 537859 542863 547017 550394 553403 556659 560429
60841 560429 564180 566985 568435 568894 568753 567855 566049 564019 562978 563500 565135 567337 570342 574862 581161
60826 581161 588742 596835 605049 613623 623168 634082 646165 658838 671669 684481 697091 709319
60814 709319 721265 733164 744701 754844 762559 767554 770140 770638 769185 765870 760791 754014 745641
60801 745641 735820 724605 712065 698723 685560 673251 661536 649692 637519 625552 614388 604212
60789 604212 595011 586826 579563 572732 565625 557752 549136 540315 532108 525236 519919 515710 511694 506955
60775E06955n922o915p278o938o093n025m042l389l077k964l058l563m443n208
60761D39040n459n436n645o073o202n778n139m682m439m282m226m279m249l870
60747C69281l068k036j132o73n83m04J25O24N74J46n4j4m36j572k615k623j663
60730C53877n41J82M41K88j49m72l08K26P29J094J465J731J514P11m21j673k970
60713C55724l978m176l563k810k476k412k271k177k445k886l026k933l202l940
60699C13429m311l550k081j105j102j293p60K65O80j5j026j280p55l87p04j110
60683B94895p45L56J384J879K173K733L486M019M041L440K316J227J013J892K979
60668C27088L207K539J806J524J540J699K064K315J841P89K61R09J979K419K353
$$ plain form
60775 506955 501033 494118 486840 479902 473809 468784 464742 461353 458276 455312 452254 448691 444248 439040
60761 439040 433581 428145 422500 416427 410225 404447 399308 394626 390187 385905 381679 377400 373151 369281
60747 369281 366213 364177 363045 362372 361789 361385 361510 362134 362708 362854 362800 362786 362350 360778 358163 355540 353877
60730 353877 353336 353518 353959 354247 354098 353626 353318 353544 354273 355367 356832 358563 360077 360788 360367 358694 355724
60713 355724 351746 347570 344007 341197 338721 336309 334038 331861 329416 326530 323504 320571 317369 313429
60699 313429 309118 305568 303487 302382 301280 299987 299227 299492 300172 300157 299131 297851 297096 296709 296005 294895
60683 294895 294150 294506 295890 297769 299942 302675 306161 310180 314221 317661 319977 321204 322217 324109 327088
60668 327088 330295 332834 334640 336164 337704 339403 341467 343782 345623 346412 346673 347582 349561 351980 354333
60653C54333K628L273L479K989K507K575K883L045L224L604L810L430K673J939
60639C96392J095l24k286m086m960m634l483k413k301l180m131m325l981l846
60625C53537m021l896l194k346j692j008j90K21k12r71j121n67m1J10M14J241
60609C36264J942J617L91o33o62Q3R08J384J400R20J52l52j33O27J264J394J288
60592C47854J415J765J787J048j44r23p29M0M79K33j37J44J170K390L302L847
60576C63541M205M476M749N217O067P314Q813J0536J2627J5114J7625J9617K0891
60563E00792K1645K1863K1033J8735J5326J1508P380K461l226q527j1969j2907
60551E84114j1861j0002q373p190n738l279n8L080O017R605J4254J9184K3619
$$ plain form
60653 354333 356961 360234 363713 366702 369209 371784 374667 377712 380936 384540 388350 391780 394453 396392
60639 396392 397487 397163 394877 390791 385831 381197 377714 375301 373000 369820 365689 361364 357383 353537
60625 353537 349516 345620 342426 340080 338388 337380 337190 337411 337199 336228 335107 334540 334499 334609 335023 336264
60609 336264 338206 339823 340214 339581 338919 339002 339910 341294 342694 343614 343766 343414 343281 343908 345172 346566 347854
60592 347854 349269 351034 352821 353869 353725 352802 352073 352113 352592 352825 352688 352832 354002 356392 359694 363541
60576 363541 367746 372222 376971 382188 388255 395569 404382 414918 427545 442659 460284 479901 500792
60563 500792 522437 544300 565333 584068 599394 610902 618282 620743 617517 608990 597021 584114
60551 584114 572253 562251 553878 546688 540950 537671 537613 540693 546710 556315 570569 589753 613372
60538F13372K7883L2477L6621L8752L8291L6002L2616K7997K1746J3942N242l223
60526I21718j0047j4396j6777j8443j9954k0856k0690j9579j7787j5447j2987
60515G34755j1076r848q720p203n322l126m70K423M911O821Q823J1590J5205J9696
60501G58459K5406L2350L9862M7420N5173O3063P0157P5611P9741Q3155Q5341
60490A415738Q5059Q1967P6836P0214O1740N0914L7840K3028P145r010k4839m0415
60478A836217n5943p0670q2884r1263r5739r6828r4846r0205q3963p7378p1028
60467I25470o4701n8040n1000m3849l7122l1513k7422k4562k2182j9819j7534
60456E27726j5436j3303j0955q833p695p667p972p786p082o331n702n007m236
$$ plain form
60538 613372 641255 673732 710353 749105 787396 823398 856014 884011 905757 919699 924941 921718
60526 921718 911671 897275 880498 862055 842101 821245 800555 780976 763189 747742 734755
60515 734755 723679 713831 705111 697908 692586 689460 688990 691413 696324 703145 711968 723558 738763 758459
60501 758459 783865 816215 856077 903497 958670 1021733 1091890 1167501 1247242 1330397 1415738
60490 1415738 1500797 1582764 1659600 1729814 1791554 1842468 1880308 1903336 1910481 1901471 1876632 1836217
60478 1836217 1780274 1709604 1626720 1535457 1439718 1342890 1248044 1157839 1073876 996498 925470
60467 925470 860769 802729 751729 707880 670758 639245 611823 587261 565079 545260 527726
60456 527726 512290 498987 488032 479199 471504 463837 455865 448079 440997 434666 428964 423957 419721
60443D19721l623l190k743k328k151k010j410m36J24j21o32q99j284k286l469
60428C93263l890l372k607k172k086k275k795l477l862l667k983k013r74j49K90
60413C57231M94O46O47M82O10J386K249K200J179K32J62N82N96p3r59j429j134
60396C65101j89Q44J347J206P99M97M46P60J414J948J840J265R35J046J007N62
60380C80828M35J276K469K751J849P95O24J292K003K175J853J386R75O34M04M72
60364D02221Q67J204J059O24N54J082J636J624J272J271J852K585L023L183L362
60349D27419L762M353M964N443N846O344O853O876N961M247K371Q10n50k109l897
60334D78693n329n698m969l954l519l700l792l333k606k098j780j266m42L27N87
$$ plain form
60443 419721 416098 412908 410165 407837 405686 403676 402266 401830 401954 401833 401201 400302 399018 396732 393263
60428 393263 389373 386001 383394 381222 379136 376861 374066 370589 366727 363060 360077 358064 357090 356941 357231
60413 357231 357725 358371 359018 359500 360110 361496 363745 365945 367124 367356 367518 368100 368696 368623 367664 366235 365101
60396 365101 364912 365756 367103 368309 369108 369605 370051 370811 372225 374173 376013 377278 378213 379259 380266 380828
60380 380828 381263 382539 385008 387759 389608 390403 391027 392319 394322 396497 398350 399736 400711 401345 401749 402221
60364 402221 403088 404292 405351 405975 406529 407611 409247 410871 412143 413414 415266 417851 420874 424057 427419
60349 427419 431181 435534 440498 445941 451787 458131 464984 471860 477821 482068 484439 485249 484699 482590 478693
60334 478693 473364 467666 462697 458743 455224 451524 447732 444399 441793 439695 437915 436649 436207 436534 437121
60319D37121J84o37j351j412n92Q33K359L650M671N576O619Q066J0070J2645J5824
60304E03626J9786K4534K9470L3396L5139L4329L1533K7467K2132J4912N710m302
60292G77732j3382k0502k5614k8878l0312l0174k9022k7133k4387k1020j7893
60281E09415j5548j3546j1287r061p583o740n685m145k854k454k592k471j856
60268D23593j147p96j011j789k856l653l748l263k716k428k243j862j262o78k71
60253C93870K5K98M54L81K14K23L82K96k30p51n78M48J757K560K424J455K12o22
60235D02818p20l41J27O99J637K763L421L232K596K209K263K397K203J577O78
60220D27559j91o69n94j64K37M63P09J180J806K334K642K811K935K908K592K136
$$ plain form
60319 437121 437305 436668 435317 433905 433313 434146 436505 440155 444826 450402 457021 465087 475157 487802 503626
60304 503626 523412 547946 577416 610812 645951 680280 711813 739280 761412 776324 782034 777732
60292 777732 764350 743848 718234 689356 659044 628870 599848 572715 548328 527308 509415
60281 509415 493867 480321 469034 459973 452390 445650 439965 435820 432966 430512 427920 425449 423593
60268 423593 422446 421650 420639 418850 415994 412341 408593 405330 402614 400186 397943 396081 394819 394141 393870
60253 393870 393895 394193 394647 395028 395242 395465 395847 396143 395913 395162 394584 395032 396789 399349 401773 403228 403440 402818
60235 402818 402098 401757 401884 402583 404220 406983 410404 413636 416232 418441 420704 423101 425304 426881 427559
60220 427559 427368 426699 426105 425941 426178 426641 427350 428530 430336 432670 435312 438123 441058 443966 446558 448694
60204D48694K022K623L744M728N058M706L969L170K606K484K705K807K411J672
60190D93399J091R15R00P14L58J02J48M02N49L05l21j046j611j994k214k089j485
60173D88123p72n66r64j362j256r18r57j458j948k087j967j750j402q84l66p8
60157D69388j24m31o94m69M52J707K630K850K495J946J711K382M141O232P402
60142E01618P120O025N013M330L797L390L189L076K972L078L491L809L569K844
60128E57321J927P30r71k733l634l351k536j959j693j311n69L71J167J581J708
60113E46048J904K409L094L767M481N306N907N846N194M393L540K329P35p93j951
60098E92209k903l843m669n286n716n736m937l458k161j679j679j424o99K16J094
$$ plain form
60204 448694 450716 453339 457083 461811 466869 471575 475544 478714 481320 483804 486509 489316 491727 493399
60190 493399 494490 495405 496305 497019 497377 497479 497627 498029 498578 498883 498562 497516 495905 493911 491697 489608 488123
60173 488123 487351 486785 485821 484459 483203 482285 481328 479870 477922 475835 473868 472118 470716 469832 469466 469388
60157 469388 469264 468833 468139 467670 468122 469829 472459 475309 477804 479750 481461 483843 487984 494216 501618
60142 501618 508738 514763 519776 524106 527903 531293 534482 537558 540530 543608 547099 550908 554477 557321
60128 557321 559248 559978 559007 556274 552640 549289 546753 544794 543101 541790 541221 541592 542759 544340 546048
60113 546048 547952 550361 553455 557222 561703 567009 572916 578762 583956 588349 591889 594218 594953 594160 592209
60098 592209 589306 585463 580794 575508 569792 564056 559119 555661 553500 551821 550142 548718 548019 548235 549329
60083E49329J800K098J982J945K328K600J919L42j130j817k077k565l338m022
60069E49394m454m779n074n306n521n801o057o150o193o432o795o864o417n764
60055D67787n306m951m349l600l243l491l837l715l188k705k329j661m38J077
60041D26051K296K707K235J458J282K072L187L690L369K712K156J757J512J346
60027D57830Q86k07j618k654l110l312l346k993k541k822m068n412n951n719n189
60012D09774m458l480k586k160k103k045j802j214q3J311K059J624O24J7n7j21
59996C95300m08p75j175j485j167L7J274J387M79j21M00J506K371K943L486L860
59980D07912L776L436L307L403L180K204P64k78l31L00P95Q98J175J937K469J957
$$ plain form
60083 549329 551129 553227 555209 557154 559482 562082 564001 564343 563213 561396 559319 556754 553416 549394
60069 549394 544940 540161 535087 529781 524260 518459 512402 506252 500059 493627 486832 479968 473551 467787
60055 467787 462481 457530 453181 449581 446338 442847 439010 435295 432107 429402 427073 425412 424974 426051
60041 426051 428347 431054 433289 434747 436029 438101 441288 444978 448347 451059 453215 454972 456484 457830
60027 457830 458716 458509 456891 454237 451127 447815 444469 441476 438935 436113 432045 426633 420682 414963 409774
60012 409774 405316 401836 399250 397090 394987 392942 391140 389926 389843 391154 393213 394837 395461 395478 395421 395300
59996 395300 394892 394117 392942 391457 390290 390327 391601 392988 393467 393346 393746 395252 397623 400566 404052 407912
59980 407912 411688 415124 418431 421834 425014 427218 427982 427704 427373 427673 428468 429366 430541 432478 434947 436904
59964D36904Q45M96J508L086M133M321L931L320K799K585K507K175J557J065R03
59949D72135P50L07k87p81j240j830k451k801k701k186j526j128j267j767k203
59934D51024k424k584k724k670k352j901j389p69j47K80N57Q89J288J632K034
59919D40744K658L238L290K832K325J952J637J718K741M368N336N000M162L918
59905D85919M303M661M706M551M185L577K924K202Q65j297l365m150l635k857
59891E02589k540k532k442k054j157K84J710K373K353K506L258M008M038L430
59877E15824K769K410K398K719L139L116K284R44k11p49p05l61j83o84j873k908
59861E27929k831j762q97j073j712j625n53O39J188J288J589K349L506N127P256
$$ plain form
59964 436904 437749 438245 439753 442839 446972 451293 455224 458544 461343 463928 466435 468610 470167 471232 472135
59949 472135 472885 473192 472905 472124 470884 469054 466603 463802 461101 458915 457389 456261 454994 453227 451024
59934 451024 448600 446016 443292 440622 438270 436369 434980 434211 434064 434344 434901 435790 437078 438710 440744
59919 440744 443402 446640 449930 452762 455087 457039 458676 460394 463135 467503 472839 477839 482001 485919
59905 485919 490222 494883 499589 504140 508325 511902 514826 517028 517893 516596 513231 509081 505446 502589
59891 502589 500049 497517 495075 493021 491864 492148 493858 496231 498584 501090 504348 508356 512394 515824
59877 515824 518593 521003 523401 526120 529259 532375 534659 535603 535392 534643 533938 533577 533394 532710 530837 527929
59861 527929 525098 523336 522439 521366 519654 518029 517476 518115 519303 520591 522180 524529 528035 533162 540418
59846E40418R447J0946J1406J1031R974Q061N264K150m13j842k030j240k4Q58
59832F04006P30o94l151n919q119r302r681r702r408q624p657p253p671q236q087
59817E01232p056n535l877k360j424j399j979k368k032j127k28K32K51J36R2j24
59801D72434q99k126l030k981k223j639j904l015m494n730o279o105n556m948
59787D21505m270l362k246j184n61p73j893l302m002l602k673j917j333o28J1
59772C89770J43j57l74l20j77Q8O61J198R71j2o95k60Q04J403J216Q25P18Q25
59754C96627J008J451K302L280L963M228M233M074L676L105K688K733L156L554
59740D40078L627L384K966K408J707R91M55J26j52m79p27o72k52L23P11P11M17
$$ plain form
59846 540418 549865 560811 572217 583248 593222 601283 606547 608697 608284 606442 604412 603172 603148 604006
59832 604006 604736 604042 600891 594972 586853 577551 567870 558168 548760 540136 532479 525226 517555 509319 501232
59817 501232 494176 488641 484764 482404 480980 479581 477602 475234 473202 472075 471847 472079 472330 472466 472558 472434
59801 472434 471535 469409 466379 463398 461175 459536 457632 454617 450123 444393 438114 432009 426453 421505
59787 421505 417235 413873 411627 410443 409882 409109 407216 403914 399912 396310 393637 391720 390387 389759 389770
59772 389770 389913 389756 389382 389062 388885 388973 389634 390832 391803 391791 391096 390836 391640 393043 394259 395084 395802 396627
59754 396627 397635 399086 401388 404668 408631 412859 417092 421166 424842 427947 430635 433368 436524 440078
59740 440078 443705 447089 450055 452463 454170 455161 455616 455742 455590 455111 454384 453712 453460 453783 454494 455205 455622
59723D55622N3k99p30j225j545j492j220j117j327j552j309m71N24J025Q60N65
59707D46362Q11J618K354K505K169J742J419J245J361J819K337K622K834L388
59693D74586M198M565M022K969K189J891J515N74p03j604j671r96M1J013J553
59678D94142J508J175R84Q90L10r76k273k751k557k536k968l234k845k148j754
59663D74967j808k139k633l036k796j713m18L51P59J532K741L548L314K442J841
59648D76952J942K454K831K707K024J034J56l21n08q39j618k670l461l728l792
59633D73163m080m434m282l517k741k378k007j038K35Q36L26o31j066p08r7L3
59617D47614o54j913l175m018m497m934n385n414m507k724q74R2p7p21r85n74
$$ plain form
59723 455622 455675 455376 454646 453421 451876 450384 449164 448047 446720 445168 443859 443388 443912 444937 445797 446362
59707 446362 447173 448791 451145 453650 455819 457561 458980 460225 461586 463405 465742 468364 471198 474586
59693 474586 478784 483349 487371 490340 492529 494420 495935 496509 495806 494202 492531 491535 491576 492589 494142
59678 494142 495650 496825 497809 498699 499009 498033 495760 493009 490452 487916 484948 481714 478869 476721 474967
59663 474967 473159 471020 468387 465351 462555 460842 460424 460775 461534 463066 465807 469355 472669 475111 476952
59648 476952 478894 481348 484179 486886 488910 489944 490100 489779 489271 488432 486814 484144 480683 476955 473163
59633 473163 469083 464649 460367 456850 454109 451731 449724 448686 448921 449757 450083 449452 448386 447678 447581 447614
59617 447614 446960 445047 441872 437854 433357 428423 423038 417624 413117 410393 409519 409611 409534 408813 407828 407254
59601D07254K49J142J755J636O12o29j022l51N43R52J103J413J583J125K92k27
59585D17430l36n46j107j714k097k313k383k176j758j446j393j491j678k027k417
59570C92548k498k044j168k08L60Q3r52j863j720o77J61J28k06J15J114J822J453
59553C86448L05n60m26M66J402K104K849L698M137L828L307L493M632O166P603
59538D29452R053J0973J3560J6369J8249J7838J4550R089K866k855p147r351r517
59525E13129q576p417n944l761j440j89k18l68L34J506K176K026J421P47J53l59
59509D93220r65j882k977l826m356m990n906o622o652o219n934n981n973n464
59495D25473m368k998j861j223q64m48q4j73o57r42p07l00j26q5J08M99J087K024
$$ plain form
59601 407254 407503 408645 410400 412036 412648 412019 410997 410646 411189 412141 413244 414657 416240 417365 417657 417430
59585 417430 417094 416548 415441 413727 411630 409317 406934 404758 403000 401554 400161 398670 396992 394965 392548
59570 392548 390050 388006 386838 386630 386990 387073 386121 384258 382538 381861 382022 382150 381944 382059 383173 384995 386448
59553 386448 386753 386193 385767 386233 387635 389739 392588 396286 400423 404251 407558 411051 415683 421849 429452
59538 429452 438505 449478 463038 479407 497656 515494 530044 539133 541999 539144 531997 522646 513129
59525 513129 504553 497136 491192 487431 485991 485802 485584 485216 485550 487056 489232 491258 492679 493426 493579 493220
59509 493220 492255 490373 487396 483570 479214 474224 468318 461696 455044 448825 442891 436910 430937 425473
59495 425473 421105 418107 416246 415023 414159 413711 413627 413454 412797 411855 411148 410848 410722 410637 410745 411244 412331 414355
59477D14355L265M338M844M860M617M129L464K960K756K445J715R84Q37J024O91
59462D57284l65j297j281n15J63M62R74K301M106N361N548N301N594O538P404
59447D97578P762P999Q550R062Q728P159M612J583j425l862n293n815o034o423
59433E24181o753o372n162l955l630l976l953l172k372k105j799p69N42J351K040
59418D84096L712O430R221J1780J4838J8503K1661K3575K4798K5652K4862K0846
59406F89974J3739N252k833r179j2682j2895j0599p016k713J954N659O422L262
59393F68345l003j0475j7178k1683k3598k3614k2659k1074j8855j6303j3807j1335
59381D64761q737o290m376k929j788j156r57l37J291L026L480K770K345K882L571
$$ plain form
59477 414355 417620 421958 426802 431662 436279 440408 443872 446832 449588 452033 453748 454732 455569 456593 457284
59462 457284 456919 455622 454341 453826 453989 454451 455425 457726 461832 467193 472741 478042 483636 490174 497578
59447 497578 505340 513339 521889 530951 539679 546838 551450 553033 551608 547746 542453 536638 530604 524181
59433 524181 517428 511056 505894 501939 498309 494333 490380 487208 484836 482731 480932 480163 480705 482056 484096
59418 484096 487808 494238 503459 515239 530077 548580 570241 593816 618614 644266 669128 689974
59406 689974 703713 708965 706132 696953 684271 671376 660777 653761 651048 653002 658661 665083 668345
59393 668345 665342 654867 637689 616006 592408 568794 546135 525061 506206 489903 476096 464761
59381 464761 456024 449734 445358 442429 440641 439485 438528 438191 439482 442508 445988 448758 451103 453985 457556
59366D57556L666L509L579L726L806M190M933N312M860M221M242M780N112N119
59352E18611N368O238P586R087J0426J1282J1529J1400J1268J1383J1959J3106
59340F39243J4434J5181J5043J4506J4023J3335J2082J0566R227P750N469K524
59328G73383j95k335m461o916r051j0106j0377j0825j1727j2304j1855j0690r725
59315F62816r389r284q790p738o442n355m745m570m491m120l328k240q58J057
59301E92523L581O372R043J1688J4687J7987K0756K1790K0145J5542Q566N42o976
59288G36246j2763j6195j7278j6644j5306j3982j2634j0917q839o752m826l084
59276E97026j804j324j396j237m31P17J875L149M578N665N962N806N929O490O936
$$ plain form
59366 457556 461222 464731 468310 472036 475842 480032 484965 490277 495137 499358 503600 508380 513492 518611
59352 518611 523979 530217 537803 546890 557316 568598 580127 591527 602795 614178 626137 639243
59340 639243 653677 668858 683901 698407 712430 725765 737847 748413 757640 765390 770859 773383
59328 773383 773188 770853 766392 759476 750425 740319 729942 719117 707390 695086 683231 672541 662816
59315 662816 653427 644143 635353 627615 621173 615818 611073 606503 602012 597892 594564 592324 591466 592523
59301 592523 596104 602476 611519 623207 637894 655881 676637 698427 718572 734114 742680 743222 736246
59288 736246 723483 707288 690010 673366 658060 644078 631444 620527 611688 604936 600110 597026
59276 597026 595222 593898 592502 591265 590834 591551 593426 596575 601153 606818 612780 618586 624515 631005 637941
59261F37941O705N663L903J629o38k274l216m176n850q034r787j0454j0289r979
59247E91144r802r464q688p666o756n980n074l962k901k113j505q96l29L1K29
59232E26268N62J240K114K801L004K694J995J022o2r26j261j122r78j236j856
59217E34259k611l518m713n897o299n427l716k197j527j512j572j458j335j238
59203D91239q13K18J511K313K312K019K167K838L374L189K504K162K631L388L532
59188E24584K935K451K819L803M704N288N691N789N422N086N477O292O318N056
59174E91715L428K462K003J352N07J8N1L04O47J129J627J984K359K896L299L294
59158F19075L207L456L729L337K216R24k21j303k252k814l108l516m019m241m104
$$ plain form
59261 637941 644646 650309 654212 655841 655203 652929 649713 645537 639687 631653 621866 611412 601123 591144
59247 591144 581342 571878 563190 555524 548768 542788 537714 533752 530851 528738 527233 526337 526008 526039 526268
59232 526268 526830 528070 530184 532985 535989 538683 540678 541700 541638 540712 539451 538329 537351 536115 534259
59217 534259 531648 528130 523417 517520 511221 505794 502078 499881 498354 496842 495270 493812 492477 491239
59203 491239 490426 490644 492155 494468 496780 498799 500966 503804 507178 510367 512871 515033 517664 521052 524584
59188 524584 527519 529970 532789 536592 541296 546584 552275 558064 563486 568572 574049 580341 586659 591715
59174 591715 595143 597605 599608 600960 601467 601485 601536 601840 602487 603616 605243 607227 609586 612482 615781 619075
59158 619075 622282 625738 629467 632804 635020 635944 635723 634420 632168 629354 626246 622730 618711 614470 610366
59143F10366l858l564l188l064l539m207m354m059l949l933l277k105j517j838
59129E63914j919q99M35R39Q53J190K065K804L263L920M780N267N201N067N210
59114F02090N550O089O984P886Q020P239O398O269O540O329N351M089L020K126
59100F83980J237M02j98n46q44j307k025k921l737m107l851l161k434j888j522
59085F57078j441j886k817l724m183m413m971o066p381q427q785q264p273o761
59071E80686p291q225q467p854p129o611n777m404l214k850k956k878k711k906
59057E07413l253l075k284j505j118q44m14n6j10n13r39j227j344j208p62k59
59041D88502j53n75j031r03k57J96R5K9P05J821K329J857J170J093J559K046K445
$$ plain form
59143 610366 606508 602944 599756 596692 593153 588946 584592 580533 576584 572651 569374 567269 565752 563914
59129 563914 561995 561096 561531 562470 563323 564513 566578 569382 572645 576565 581345 586612 591813 596880 602090
59114 602090 607640 613729 620713 628599 636619 643858 650256 656525 663065 669394 674745 678834 681854 683980
59100 683980 685217 685619 685421 684875 684031 682724 680699 677778 674041 669934 666083 662922 660488 658600 657078
59085 657078 655637 653751 650934 647210 643027 638614 633643 627577 620196 611769 602984 594720 587447 580686
59071 580686 573395 565170 556703 548849 541720 535109 529332 524928 521714 518864 515908 513030 510319 507413
59057 507413 504160 501085 498801 497296 496178 495334 494920 494864 494754 494241 493302 492075 490731 489523 488761 488502
59041 488502 488349 487774 486743 485840 485583 485779 485874 485903 486608 488429 490758 492615 493785 494878 496437 498483 500928
59024E00928L011L839M831N988P265Q332Q897R177R676J0516J1216J1166J0050
59011F04892P980N467L208J609M54p58k199l477l979l332j721R3J255J579J736
58996F12807K440L518M077L601K544J765J503J204K75j096k072k103j606j586
58982F25271k679m588o406p282o907n588l963k535j464p11j83M37J597L321M921
58967E93241N730N927O205O763P215P382P573P875P907P463O908O558O128N102
58953F87977L334J025j536l906n568o454p145q254r697j0841j1137j0498r284
58940F08016q159p615p495p125o145m967m300m391m882n178m839l911k974k603
58926E33432k738k849k662k377k162j982j907k083k267k001j368j009j161j370
$$ plain form
59024 500928 503939 507778 512609 518597 525862 534194 543091 552268 561944 572460 583676 594842 604892
59011 604892 612872 618339 621547 623156 623610 622852 620653 617176 613197 609865 608144 608237 609492 611071 612807
58996 612807 615247 618765 622842 626443 628987 630752 632255 633459 633734 632638 630566 628463 626857 625271
58982 625271 622592 618004 611598 604316 597409 591821 587858 585323 583859 583148 582965 583402 584999 588320 593241
58967 593241 598971 604898 611103 617866 625081 632463 640036 647911 655818 663281 670189 676747 682875 687977
58953 687977 691311 692336 690800 686894 681326 674872 667727 659473 649776 638935 627798 617300 608016
58940 608016 599857 592242 584747 577622 571477 566510 562210 557819 552937 547759 542920 539009 536035 533432
58926 533432 530694 527845 525183 522806 520644 518662 516755 514672 512405 510404 509036 508027 506866 505496
58912E05496j277j100r38l56R10K403L571M366M902N151N467O615Q660J0461J1053
58897E65384J0890J0892J0866R925Q176O840O688P277P873Q383R216J0744J2961
58884F86115J5260J6626J6544J5659J5007J4722J4013J2324R864P062M158J398
58872H28752r85l144n445p787r574j0510j0966j1300j1253j0365q771p257o527
58859G24868o578o898p198p729q749r838j0316j0249j0471j1302j1944j1602j0615
58846F01379r814r249q348p189o568o746o916o307n281m874n464o294o346n416
58832E06567m242l618l634l853l966l888l468k678j982j893k058j550j81J179
58818D70735J835J968J819J234M97O28J923L173L275K863L163L899L791K687J756
$$ plain form
58912 505496 504219 503119 502181 501825 502735 505138 508709 513075 517977 523128 528595 535210 543870 554331 565384
58897 565384 576274 587166 598032 607957 616133 622973 629661 636938 644811 653194 662410 673154 686115
58884 686115 701375 718001 734545 750204 765211 779933 793946 806270 816134 823196 827354 828752
58872 828752 827767 824623 819178 811391 801817 791307 780341 769041 757788 747423 738652 731395 724868
58859 724868 718290 711392 704194 696465 687716 677878 667562 657313 646842 635540 623596 611994 601379
58846 601379 591565 582316 573968 566779 560211 553465 546549 540242 534961 530087 524623 518329 511983 506567
58832 506567 502325 498707 495073 491220 487254 483366 479898 477220 475238 473345 471287 469737 469556 470735
58818 470735 472570 474538 476357 477591 478088 478716 480639 483812 487087 489950 493113 497012 500803 503490 505246
58803E05246J555J296L33q50j521j728j907k190k417k445k195j781j610j899k213
58788D85674j986j376r46o50J32J498K716L182L096L035L401M333N663O803P151
58773E21726O678N759M572L060J335m16k164l719m533m433m231m709n417n336
58759E08172m500l822l479k742j506p43r96j542j502r19j92O55J591K165K108
58744D92748J891K111K715L212L318L165L142L728N087O646P560P676P616P875
58730E58490Q292Q548Q582Q394P920P277O670O020N123M140L458L138L038L310
58716F42400M124N070N592N897O625P625P975P261O052M941L980L083K158P55
58702G13538j496m084o124p702r715j2287j4478j5718j6430j6967j7093j6786
$$ plain form
58803 505246 506801 508097 508430 507580 506059 504331 502424 500234 497817 495372 493177 491396 489786 487887 485674
58788 485674 483688 482312 481366 480716 480848 482346 485062 488244 491340 494375 497776 502109 507772 514575 521726
58773 521726 528404 534163 538735 541795 543130 542714 540550 536831 532298 527865 523634 518925 513508 508172
58759 508172 503672 499850 496371 493629 492123 491380 490384 488842 487340 486421 486229 486884 488475 490640 492748
58744 492748 494639 496750 499465 502677 505995 509160 512302 516030 521117 527763 535323 542999 550615 558490
58730 558490 566782 575330 583912 592306 600226 607503 614173 620193 625316 629456 632914 636052 639090 642400
58716 642400 646524 651594 657186 663083 669708 677333 685308 692569 698621 703562 707542 710625 712783 713538
58702 713538 712042 707958 701834 694132 684417 672130 657652 641934 625504 608537 591444 574658
58690E74658j6431j5783j4057j1473r507q927q786q040o988o261n542m348l138
58677D55377k599k566k488k355k270j811p02N00J242J872K928M181N122N785O301
58662D68517O413O185O397P222P434N955L528J615L56j082k727l810m200m442
58648D97361m495l851k866k608l234l685l257k438j905j702j754k194k830l005
58634D57537k496j808j254m20R69K265K613K081J523J525J934K319K468K350K008
58619D73614J620J543K012K781L258L147K804K748K992L130L018K968L277L827
58605E12739M214L989K950J526O29O41P64Mj395k337k527k731l362l793l470k669
58589E05172j794p95L42J410K639M599O952Q429Q569Q437Q923R441R159Q401P796
$$ plain form
58690 574658 558227 542444 528387 516914 507407 498480 489694 481654 474666 468405 462863 458515 455377
58677 455377 452778 450212 447724 445369 443099 441288 440586 441086 442328 444200 447128 451309 456431 462216 468517
58662 468517 474930 481115 487512 494734 502168 508123 511651 513266 513622 512540 509813 506003 501803 497361
58648 497361 492866 489015 486149 483541 480307 476622 473365 470927 469022 467320 465566 463372 460542 457537
58634 457537 455041 453233 451979 451559 452528 454793 457406 459487 461010 462535 464469 466788 469256 471606 473614
58619 473614 475234 476777 478789 481570 484828 487975 490779 493527 496519 499649 502667 505635 508912 512739
58605 512739 516953 520942 523892 525418 526047 526688 527452 527456 526061 523724 521197 518466 515104 511311 507841 505172
58589 505172 503378 502583 502925 504335 506974 511573 518525 526954 535523 543960 552883 562324 571483 579884 587680
58574E87680O988N484L949L348L419L323L261M099N755P377Q904J1038J3662J5644
58560F83931J6462J6903J7775J8802J9114J8244J6366J4158J2407J1266R897P369
58548H62694L818K06k852n287o884p308o966o944p833r159j0167j0690j1062j1601
58534G69965j2412j3382j4214j4581j4344j3581j2546j1612j0968j0250q884o858
58522F26333m777l021j454r2O07M86O1k29m61n92k33N23Q93O04L85O61O61k30
58504F20125j300j654j703k272l010k987k348j986j999j715r98l66JK42J39m42
58488E97727p55m3J056J298Q28J029K444M176N491O604P695Q326Q365Q453R052
58473F61746R796J0155J0038R435Q099O017L619J382m94j962l100m134n087n570
$$ plain form
58574 587680 594668 600152 604101 607449 610868 614191 617452 621551 627306 634683 643587 654625 668287 683931
58560 683931 700393 717296 735071 753873 772987 791231 807597 821755 834162 845428 855325 862694
58548 862694 866512 866718 863866 858579 851695 844387 837421 830477 822644 813485 803318 792628 781566 769965
58534 769965 757553 744171 729957 715376 701032 687451 674905 663293 652325 642075 633191 626333
58522 626333 621556 618535 617081 616989 617596 618082 618143 617914 617453 616861 616628 617151 618044 618648 619033 619694 620355 620125
58504 620125 618825 617171 615468 613196 610186 607199 604851 602865 600866 599151 598153 597787 597788 598030 598169 597727
58488 597727 596972 596929 597985 599283 600111 601140 603584 607760 613251 619855 627550 635876 644241 652694 661746
58473 661746 671542 681697 691735 701170 709269 715286 718905 720287 719793 717831 714731 710597 705510 699940
58459F99940n346m743m018k787p50J462K933L606L992M231M323M757N860O773
58445G20233O243M238J809l50k192l433l675l351l414l987m304l954l203k161
58431F98499o70J016K391L474M548N329N447N525O564Q346R695J0239J0596J0791
58417G81790R982Q017N968M529L070Q74j634l533m540n026n375n733n933n589
58403G76867m665l847l776m093l923l117k229j429l95P77J495J663J929K780L924
58388G61961M659M458L400K356K320L181L744L508L468M413N414N209M148L434
58374H15673L257L147L477M909O833P889P811P316O701O029O129P630R433R834
58360I06068Q904Q127Q149Q541R288J0525J1279J0579R417R454J0107R337P146
$$ plain form
58459 699940 694594 689851 685833 683046 682296 683758 686691 690297 694289 698520 702843 707600 713460 720233
58445 720233 726476 730714 732523 732173 729981 726548 722873 719522 716108 712121 707817 703863 700660 698499
58431 698499 697829 698845 701236 704710 709258 714587 720034 725559 732123 740469 750164 760403 770999 781790
58417 781790 791772 799789 805757 810286 813356 814230 812596 809063 804523 799497 794122 788389 782456 776867
58403 776867 772202 768355 764579 760486 756563 753446 751217 749788 749393 750170 751665 753328 755257 758037 761961
58388 761961 766620 771078 774478 776834 779154 782335 786079 789587 793055 797468 802882 808091 812239 815673
58374 815673 818930 822077 825554 830463 837296 845185 852996 860312 867013 873042 879171 886801 896234 906068
58360 906068 914972 923099 931248 939789 949077 959602 970881 981460 990877 1000331 1010438 1019775 1026921
58347A026921N679N761N992N613N662O573P148O872O979Q216R548J0103J0612
58334A121679J1805J3065J3643J3782J3845J3723J3720J4549J5887J6440J5861
58323A277999J5131J4679J3814J2385J1188J0311Q898P089O246O729P249P118
58311A398836P276Q466J0083J1482J2766J3837J4306J4720J6135J8214J9508J9756
58299A565385J9992K0365K0115J9667K0295K1561K1714K0883K1027K2450K3321
58288A796775K3168K3675K5293K6297K6199K6872K9017L0746L1106L1860L4110
58277B105118L6190L6729L6961L8184L9519M0128M1091M3320M5856M7904N0252
58266B561252N3294N6035N8304O1289O4799O6896O7515O9230P3028P6587P8340
$$ plain form
58347 1026921 1032600 1038361 1044353 1049966 1055628 1062201 1069349 1076221 1083200 1091416 1100964 1111067 1121679
58334 1121679 1133484 1146549 1160192 1173974 1187819 1201542 1215262 1229811 1245698 1262138 1277999
58323 1277999 1293130 1307809 1321623 1334008 1345196 1355507 1364405 1371494 1377740 1384469 1391718 1398836
58311 1398836 1406112 1414578 1424661 1436143 1448909 1462746 1477052 1491772 1507907 1526121 1545629 1565385
58299 1565385 1585377 1605742 1625857 1645524 1665819 1687380 1709094 1729977 1751004 1773454 1796775
58288 1796775 1819943 1843618 1868911 1895208 1921407 1948279 1977296 2008042 2039148 2071008 2105118
58277 2105118 2141308 2178037 2214998 2253182 2292701 2332829 2373920 2417240 2463096 2511000 2561252
58266 2561252 2614546 2670581 2728885 2790174 2854973 2921869 2989384 3058614 3131642 3208229 3286569
58255C286569P9871Q2572Q5285Q7139Q9305R2061R3673R4110R6271J01368J06856
58244D295080J11078J16052J23316J31025J37856J45758J55941J66087J74518
58235E556711J83244J93969K05134K15907K28903K45635K63366K79771K96677
58226G669317L16102L37018L59127L85092M15673M47758M80511N17958N61934
58217A1490490O08801O57242P12678P79075Q53304R33149J023858J130810J253142
58208A9442549J391293J553420J747097J972613K232824K541929K916256L365249
58200C7163230L902016M555036N360228O351710P572337R081693J0935472J3158527
58192I8080249J5742083J8647023K1787236K5012535K8100673L0706048L2258857
$$ plain form
58255 3286569 3366440 3449012 3534297 3621436 3710741 3802802 3896475 3990585 4086856 4188224 4295080
58244 4295080 4406158 4522210 4645526 4776551 4914407 5060165 5216106 5382193 5556711
58235 5556711 5739955 5933924 6139058 6354965 6583868 6829503 7092869 7372640 7669317
58226 7669317 7985419 8322437 8681564 9066656 9482329 9930087 10410598 10928556 11490490
58217 11490490 12099291 12756533 13469211 14248286 15101590 16034739 17058597 18189407 19442549
58208 19442549 20833842 22387262 24134359 26106972 28339796 30881725 33797981 37163230
58200 37163230 41065246 45620282 50980510 57332220 64904557 73986250 84921722 98080249
58192 98080249 113822332 132469355 154256591 179269126 207369799 238075847 270334704
58185B70334704L1965106K9067215K3271299J5021490N409854m188475j2530697
58178C58350496j8827926k2896720k5070344k5900924k5854278k5196428k4059547
58171A90544329k2530468k0684860j8609469j6430053j4297364j2328149j0571773
58164G5092193r035332p716069o600331n657208m855111m176709l608591l129229
58156C0313613k718570k369429k078887j836479j629872j454587j309188j186949
58148A5729652j079917r85753r03755q29349p58484o92626o33789n79366n26774
58139H739839m78216m36048l98290l63412l34537l13904k97835k82066k67676
58130E567855k56730k46311k32323k15877k00836j87852j75331j63549j53492
$$ plain form
58185 270334704 302299810 331367025 354638324 369659814 375069668 370881193 358350496
58178 358350496 339522570 316625850 291555506 265654582 239800304 214603876 190544329
58171 190544329 168013861 147329001 128719532 112289479 97992115 85663966 75092193
58164 75092193 66056861 58340792 51740461 46083253 41228142 37051433 33442842 30313613
58156 30313613 27595043 25225614 23146727 21310248 19680376 18225789 16916601 15729652
58148 15729652 14649735 13663982 12760227 11930878 11172394 10479768 9845979 9266613 8739839
58139 8739839 8261623 7825575 7427285 7063873 6729336 6415432 6117597 5835531 5567855
58130 5567855 5311125 5064814 4832491 4616614 4415778 4227926 4052595 3889046 3735554
58121C735554j43981j33845j24705j18084j12271j05319r8559r3749q9457q3778
58111B631806p8119p4653p2319o8875o4873o2185o0383n7881n5110n3381n2142
58100A931885n0173m8102m6988m5895m3384m0220l8115l7077l6049l4850l3530
58089A477502l1357k8346k6130k5606k5365k4201k3163k3365k3803k3336k2764
58078A200066k2872k2553k1018j9797k0242k0990k0239j8670j7758j7139j6073
58067I82715j5622j6694j7624j6424j4063j2872j2943j2667j1794j1363j1516
58056H29133j1624j1826j2501j3065j3059j3312j4277j4602j3190j1298j0567
58045F89812j0400r432q131p674p530o600n610n984p236p736p292o874o653o363
$$ plain form
58121 3735554 3591573 3457728 3333023 3214939 3102668 2997349 2898790 2805041 2715584 2631806
58111 2631806 2553687 2479034 2406715 2337840 2272967 2210782 2150399 2092518 2037408 1984027 1931885
58100 1931885 1881712 1833610 1786622 1740727 1697343 1657123 1619008 1581931 1545882 1511032 1477502
58089 1477502 1446145 1417799 1391669 1366063 1340698 1316497 1293334 1269969 1246166 1222830 1200066
58078 1200066 1177194 1154641 1133623 1113826 1093584 1072594 1052355 1033685 1015927 998788 982715
58067 982715 967093 950399 932775 916351 902288 889416 876473 863806 852012 840649 829133
58056 829133 817509 805683 793182 780117 767058 753746 739469 724867 711677 700379 689812
58045 689812 679412 669980 661849 654175 646645 640045 634435 628451 621215 613479 606187 599313 592660 586297
58031E86297o637p911q945q570p857q418r564r499q332p552p275o511n556n614
58017D78056o437o634o060n739n765n389m851n059n643n307l955k727k203k246
58003D10041l004m301m747l405j797k037l524l839k540j556j845k179j546n11
57989C73210L70J472K813L511L163K414J796J185O16L78J80n67j585k045j975
57974C84936k105k513k660k585k766k923k408j547j299j678j888j764j737j586
57960C55477o87O64J556J895K166K205J606R65J057J218K96j123j363l80K36o5
57944C65723j11O86J479J848K626M170N404N473M980M929N481O222O783O894O684
57929D29271O891P767Q044O350L329Q73n26j889l474m409m724n623p251q227q053
$$ plain form
58031 586297 579660 571749 562804 554234 546377 537959 528395 518896 510564 503012 495737 489226 483670 478056
58017 478056 471619 464985 458925 453186 447421 442032 437181 432122 426479 421172 417217 414490 412287 410041
58003 410041 407037 402736 397989 394584 392787 390750 387226 383387 380847 379291 377446 375267 373721 373210
57989 373210 373580 375052 377865 381376 384539 386953 388749 389934 390550 390928 391108 390541 388956 386911 384936
57974 384936 382831 380318 377658 375073 372307 369384 366976 365429 364130 362452 360564 358800 357063 355477
57960 355477 354790 355454 357010 358905 361071 363276 364882 365847 366904 368122 368418 367295 365932 365552 365788 365723
57944 365723 365612 366298 367777 369625 372251 376421 381825 387298 392278 397207 402688 408910 415693 422587 429271
57929 429271 436162 443929 451973 458323 461652 462525 461999 460110 456636 452227 447503 441880 434629 426402 418349
57914D18349q050r054r985r712q747p968p102n616l962k867k298j959j929k110
57900C36990k027j736j901k448k359j379o73r84j460j143l83J26N47J099J209
57885C23478N77O7M42J066R69L77M9j13n95j152j351j628k605l848m517m806n459
57868C00951o205o027m936m165m392m884m698l809k700j605o60j60j18Q8J090
57853B57770K699M090M789N080N343N351M639L430K659K873L506L585K864J858
57839C10536R72J02r46k081k963l236k911k588k883l418k954j074R18J432N30
57824B89436l61k29Q97K600M310N164M756L934L846M347M349L580K753K056Q00
57809C32238j204l160m531n655o784p542p776p916q088p796o914o090n667n115
$$ plain form
57914 418349 410299 401245 391260 381548 372801 364833 357731 352115 348153 345286 342988 341029 339100 336990
57900 336990 334963 333227 331326 328878 326519 325140 324467 323483 322023 320880 320497 320623 321170 322269 323478
57885 323478 324055 324122 324564 325630 326599 326976 327025 326912 326317 325165 323814 322186 319581 315733 311216 306410 300951
57868 300951 294746 288719 283783 279618 275226 270342 265644 261835 259135 257530 256870 256710 256592 256680 257770
57853 257770 260469 264559 269348 274428 279771 285122 289761 293191 295850 298723 302229 305814 308678 310536
57839 310536 311508 311610 310664 308583 305620 302384 299473 296885 294002 290584 287630 286556 287474 288906 289436
57824 289436 289075 288846 289743 292343 296653 301817 306573 310507 314353 318700 323049 326629 329382 331438 332238
57809 332238 331034 327874 323343 317688 310904 303362 295586 287670 279582 271786 264872 258782 253115 248000
57795B48000m046k967k510k558k622k447j952j191n96n93q32n83Q8M68O20J426
57779B27705K995M250M600M798N553O449O940P297P764P788O982N935N206M394
57765C08656L038J584N34n31k124l801m945n873p127q276q564q277q303q697q692
57750B38602p970o912n797m574l334k234j138L6Q58Q96M88L35M86M14j8k94J41
57733B09985J325K674L181K228N25l67J12Q43P23J98K43O61O03K03L88J182J543
57716B26250R69J70o2K46O86R85Q88J92p81j402j547j704k087k240j742p88J89
57699B18222J059J935K849L712M331M443L951L159K464J815P64q58k595l745l924
57684B37582l237k122j046k02M93J209K142L635N954Q871J1903J5163J9480K5292
$$ plain form
57795 248000 243954 240987 238477 235919 233297 230850 228898 227707 227111 226518 225686 225103 225191 225659 226279 227705
57779 227705 230700 234950 239550 244348 249901 256350 263290 270587 278351 286139 293121 299056 304262 308656
57765 308656 311694 313278 313812 313281 311157 307356 302411 296538 289411 281135 272571 264294 255991 247294 238602
57750 238602 230632 223720 217923 213349 210015 207781 206643 206679 207537 208433 208921 209256 209742 210156 210138 209844 209985
57733 209985 211310 213984 217165 219393 219918 219551 219663 220506 221229 221427 221670 222331 222934 223137 223525 224707 226250
57716 226250 227219 227389 227327 227573 228259 229244 230132 230324 229543 228141 226594 224890 222803 220563 218821 218033 218222
57699 218222 219281 221216 224065 227777 232108 236551 240502 243661 246125 247940 248704 247846 245251 241506 237582
57684 237582 234345 232223 231177 230975 231468 232677 234819 238454 244408 253279 265182 280345 299825 325117
57670C25117L1942L8542M5093N1987N8574O2840O2425N5562M1521K1268k012k3842
57658G69017m0611n1000n5525n5353n1761m6238m0249l4691k9687k5045k0880
57647C17977j7638j5499j3939j2153r887p600n852m755m049l333k301j086m05
57634B19480q49j896k212j207K09Q08M62o9l10m19n82p39r05j223j658j948j963
57617B04979j847j786j792j746j526j124o85l93l02l86o24q91q71m45j8j12n94
57600A89837q46o52m72o81j105j425j616j793j999k283k532k357j609r84j316
57585A68167k269k617j935j115q97r36q02p82j069j086n08q1m75j085j029p34
57569A50747j310k697l612l242k011p19J60L82j6m76m25k3J87K15N07R74Q97j2
$$ plain form
57670 325117 357059 395601 440694 492681 551255 614095 676520 732082 773603 794871 792859 769017
57658 769017 728406 677406 621881 566528 514767 468529 428280 393589 363902 338857 317977
57647 317977 300339 284840 270901 258748 248861 241261 235409 230654 226605 223272 220971 219885 219480
57634 219480 218631 216735 214523 213316 213525 214333 214795 214726 214416 213997 213415 212676 211771 210548 208890 206942 204979
57617 204979 203132 201346 199554 197808 196282 195158 194473 194080 193778 193392 192768 191877 191006 190561 190543 190431 189837
57600 189837 188991 188339 187867 187186 186081 184656 183040 181247 179248 176965 174433 172076 170467 169483 168167
57585 168167 165898 163281 161346 160231 159334 158398 157596 156814 155745 154659 154151 154070 153595 152510 151481 150747
57569 150747 149437 146740 143128 139886 137875 137156 137316 137698 137682 137206 136781 136758 136945 137160 137667 138641 139538 139526
57551A39526j136j672j395o22J47N15M93M80O86P79M86K76Q19J962K851L041K886
57534A50122K786K603J977Q81k57p90l74O11J338J483J513J784J876J376P53O76
57518A68358P97J44j391k818l367l281l114k941k558k031j654j591j757j914j856
57503A39026j568j201q29m17o3L8l4J8J49q5o93j027p41m28o92j165j061l28M37
57484A29336Q13O90Mr67j391p48L34P72L79j81m75o23p67r18j210j657j884j665
57466A19842j426j607j885j660r45j07P86J640J858J153L35K98O61M87j08l11
57450A19011j46k64m91l1Q79J140O73O06J261J530Q23J52M58J121J066M24R8L87
57432A28697Q55J091R23L69j08J52J103J786J535P91L61L92N43P05J007J395J610
$$ plain form
57551 139526 138390 136718 135323 134701 134848 135363 135856 136336 137022 137801 138287 138563 139382 141344 144195 147236 150122
57534 150122 152908 155511 157488 158369 158112 157322 156948 157559 158897 160380 161893 163677 165553 166929 167682 168358
57518 168358 169155 169299 167908 165090 161723 158442 155328 152387 149829 147798 146144 144553 142796 140882 139026
57503 139026 137458 136257 135428 135011 134948 134986 134952 134970 135119 135034 134341 133314 132573 132145 131453 130288 129227 128899 129336
57484 129336 130149 130839 130843 129876 128485 127737 128071 128843 129222 129041 128566 127943 127176 126258 125048 123391 121507 119842
57466 119842 118416 116809 114924 113264 112319 112212 112998 114638 116496 117649 117984 118282 118943 119430 119322 119011
57450 119011 118865 118601 118110 118079 118958 120098 120771 121377 122638 124168 124991 125143 125601 126722 127788 128212 128310 128697
57432 128697 129552 130643 131566 131935 131827 131979 133082 134868 136403 137194 137555 137947 138490 139195 140202 141597 143207
57415A43207J383N76n83j382j230l63N54J404K460L351L159J770K75l58k72j32
57399A53819k81p53j355j502o55P98J836K111K194K376K169J351M84M0j21QQ30
57382A63349K172L051K969K562K471K471K273K137K080J507M06j20N44J425J425
57367A90722R74J043J404J174M87K71O77J018J014J024J177J317J565K074K373
57352B08314J972J345J347J792J742J089P74J264J863J871J524J427J713K116
57338B30153K379K336J981J666J791K192K242J673R12N28O49J038J432J760K207
57323B54939L028M068M639M161K896J732J329J631K105K204J834J536J909K744
57309B90755L154K808K443K732L303L448L250L211L209K838K405K599L267L587
$$ plain form
57415 143207 144590 145166 144583 143201 141971 141608 142162 143566 146026 149377 152536 154306 154581 154223 153951 153819
57399 153819 153538 152785 151430 149928 149273 150071 151907 154018 156212 158588 160757 162108 162592 162632 162511 162519 163349
57382 163349 165521 168572 171541 174103 176574 179045 181318 183455 185535 187042 187448 187328 187872 189297 190722
57367 190722 191696 192739 194143 195317 195804 196075 196752 197770 198784 199808 200985 202302 203867 205941 208314
57352 208314 210286 211631 212978 214770 216512 217601 218375 219639 221502 223373 224897 226324 228037 230153
57338 230153 232532 234868 236849 238515 240306 242498 244740 246413 247325 247853 248502 249540 250972 252732 254939
57323 254939 257967 262035 266674 270835 273731 275463 276792 278423 280528 282732 284566 286102 288011 290755
57309 290755 293909 296717 299160 301892 305195 308643 311893 315104 318313 321151 323556 326155 329422 333009
57295C33009L472L768M721N322M736L583L049L257L323K886K731L670N327O465
57281C89319O336N333M364L949M152M944O158P230P603P458P525Q104Q752R091
57267D80318R303R634J0007J0417J1100J1827J1692J0229Q341P459Q037R325J0316
57254F08005J0480R924R318R439J0236J0756J0371R650R476R854J0229J0507J0952
57241G39197J1423J1619J1783J2332J2961J3044J2762J2893J3530J3969J4014
57230H79527J4365J5400J6500J7023J7232J7708J8379J8718J8575J8280J8061
57219A069768J7874J7791J8186J9308K0788K1822K1951K1571K1431K1779K2306
57208A294575K2929K3931K5236K6140K6267K6206K6684K7530K8065K8172K8308
$$ plain form
57295 333009 336481 340249 344970 350292 355028 358611 361660 364917 368240 371126 373857 377527 382854 389319
57281 389319 395655 400988 405352 409301 413453 418397 424555 431785 439388 446846 454371 462475 471227 480318
57267 480318 489621 499255 509262 519679 530779 542606 554298 564527 572868 580327 588364 597689 608005
57254 608005 618485 628409 637727 647166 657402 668158 678529 688179 697655 707509 717738 728245 739197
57241 739197 750620 762239 774022 786354 799315 812359 825121 838014 851544 865513 879527
57230 879527 893892 909292 925792 942815 960047 977755 996134 1014852 1033427 1051707 1069768
57219 1069768 1087642 1105433 1123619 1142927 1163715 1185537 1207488 1229059 1250490 1272269 1294575
57208 1294575 1317504 1341435 1366671 1392811 1419078 1445284 1471968 1499498 1527563 1555735 1584043
57197A584043K8691K9063K9124K8705K7784K6837K6813K8145K9914L0671K9981
57186A899771K8662K7714K7530K7993K8738K9319K9550K9502K9061K7888K6282
57175B212010K5369K5737K6526K6597K6022K5449K4696K3198K1406K0354K0032
57164B477396J9551J8853J8842J9667K0332K0282K0107K0227K0168J9685J9473
57153B694583K0064K0945K1447K1631K1674K1260K0303J9521J9539J9914J9698
57142B920579J8568J6884J5166J3881J3233J2715J1513R713Q454Q392Q802Q794
57130C066694Q679R425J1315J3958J7133K0764K4398K7568L0411L3226L5746L7499
57118C336816L8813M0596M3190M6123M9062N2475N7187O3769P2561Q3789R7374
$$ plain form
57197 1584043 1612734 1641797 1670921 1699626 1727410 1754247 1781060 1809205 1839119 1869790 1899771
57186 1899771 1928433 1956147 1983677 2011670 2040408 2069727 2099277 2128779 2157840 2185728 2212010
57175 2212010 2237379 2263116 2289642 2316239 2342261 2367710 2392406 2415604 2437010 2457364 2477396
57164 2477396 2496947 2515800 2534642 2554309 2574641 2594923 2615030 2635257 2655425 2675110 2694583
57153 2694583 2714647 2735592 2757039 2778670 2800344 2821604 2841907 2861428 2880967 2900881 2920579
57142 2920579 2939147 2956031 2971197 2985078 2998311 3011026 3022539 3032252 3040706 3049098 3057900 3066694
57130 3066694 3075373 3084798 3096113 3110071 3127204 3147968 3172366 3199934 3230345 3263571 3299317 3336816
57118 3336816 3375629 3416225 3459415 3505538 3554600 3607075 3664262 3728031 3800592 3884381 3981755
57107C981755J12853J29868J48865J71172J98323K31463K71633L20579L80813
57098E947324M54758N44304O51528P79105R29184J101938J295466J506039J727179
57089A4936825J948712K157991K342009K488012K584517K625556K614020K556003
57081C4253645K448586K276069K023399J694240J313028R08141M94524P2592l59264
57072D5124960p93459j212465j595446j924910k189655k384633k509532k567256
57064B9947604k562817k502959k396409k253879k086910j906029j719798j535361
57056A2983442j358976j195477j047461r15561p99493o98531o11398n36383m71885
57047E348277m16665l69625l29708k95999k67734k44079k24000k06414j90447
$$ plain form
57107 3981755 4094608 4224476 4373341 4544513 4742836 4974299 5245932 5566511 5947324
57098 5947324 6402082 6946386 7597914 8377019 9306203 10408141 11703607 13209646 14936825
57089 14936825 16885537 19043528 21385537 23873549 26458066 29083622 31697642 34253645
57081 34253645 36702231 38978300 41001699 42695939 44008967 44917108 45411632 45484224 45124960
57072 45124960 44331501 43119036 41523590 39598680 37409025 35024392 32514860 29947604
57064 29947604 27384787 24881828 22485419 20231540 18144630 16238601 14518803 12983442
57056 12983442 11624466 10428989 9381528 8465967 7666474 6967943 6356545 5820162 5348277
57047 5348277 4931612 4561987 4232279 3936280 3668546 3424467 3200467 2994053 2803606
57038B803606j75618j61743j48519j35413j22138j08966r6183q3392o9901n5492
57028A646241m0136k3244m303J5770L5052N2383O7046P6084P3853N6088K4100
57017A978934j5877n6448r1266j15394j26534j26526j19928j10426r9326q7251
57007A029958p5565o5500n7140n0065m4106l8982l4040k9115k4959k2206k0386
56996E67894j8627j6769j5213j4086j3126j2129j0934r180o596l530p66J198K497
56983D50633L518M350M599L778J810r55m227p951j1624j3963j4003j2392j0805
56970C92768r957r014p145m807k878j357L31K200L771N129P063J0008J3380J6117
56956D15609J7469J7125J5000J1234O237N75n207j0540j4772j7309j7930j7018
$$ plain form
57038 2803606 2627988 2466245 2317726 2182313 2060175 1951209 1855026 1771634 1701733 1646241
57028 1646241 1606105 1582861 1578558 1594328 1629380 1681763 1748809 1824893 1898746 1954834 1978934
57017 1978934 1963057 1906609 1815343 1699949 1573415 1446889 1326961 1216535 1117209 1029958
57007 1029958 954393 888893 831753 781688 737582 698600 664560 635445 610486 588280 567894
56996 567894 549267 532498 517285 503199 490073 477944 467010 457830 451234 447704 446938 448136 450633
56983 450633 454151 458501 463100 466878 468688 467733 463506 455555 443931 429968 415965 403573 392768
56970 392768 382811 373797 366652 361845 358967 357610 357941 360141 363912 369041 376104 386112 399492 415609
56956 415609 433078 450203 465203 476437 482674 483249 478042 467502 452730 435421 417491 400473
56944D00473j5345j3516j1529q990n858k734k92J519L448O130R540J3236J6847
56931C92929K0014K2050K2012J9363J4371P807M36p104j4115j9861k3790k5580
56919D08532k5184k3146k0609j8635j7315j5995j4284j2493j0966r557q058o683
56907B25607n811n458n355n225m777l703k091n68L54Q17J280J915K775M171O327
56892B10258Q819J0932J2544J4153J6094J8152J9969K1295K1792K0976J8500J4327
56880D07811Q717K410l384p586r989j1011j0890r518p064m174j361J456M627Q314
56866C68358J2484J7060K1936K7043L2394L7816M2622M5769M6375M3862L7754
56855G33473K7918J5177J394j1323k1501k8512l2316l3163l1389k7429k1999j5925
$$ plain form
56944 400473 385128 371612 360083 351093 345235 342501 342209 343728 347176 353306 362846 376082 392929
56931 392929 412943 434993 457005 476368 490739 498546 498982 491878 477763 457902 434112 408532
56919 408532 383348 360202 339593 320958 303643 287648 273364 260871 249905 240348 232290 225607
56907 225607 219796 214338 208983 203758 198981 195278 193187 192619 192973 193790 195070 196985 199760 203931 210258
56892 210258 219077 230009 242553 256706 272800 290952 310921 332216 354008 374984 393484 407811
56880 407811 416528 418938 415554 407968 397979 386968 376078 366560 359496 355322 353961 355417 360044 368358
56866 368358 380842 397902 419838 446881 479275 517091 559713 605482 651857 695719 733473
56855 733473 761391 776568 777962 766639 745138 716626 684310 651147 619758 592329 570330 554405
56843E54405r580k673N091J3413K1842L0467L9537M8654N7087O4620P1090P4861
56831I68814P2899O3100M6123K4637J455k1063m0617n5180o3823o6818o5061n9759
56819H04707n2462m4683l7100k9416k1053j1849k166P416J6417K4689L2406L9646
56807G26552M5898M9961N0297M5516L4908J9140N43j7626l2780m4023n1588n5553
56795G71245n5609n2131m6801m1385l6133l0058k2862j5675r559m126J625P668
56783D66199J3126J7758K2050K5713K7057K4499J8149R490j20j0061j9800k8260
56771E65800l4055l6428l5893l3856l1415k8683k5481k2284j9916j8368j6678
56760B62743j4194j1452r509q789q838q846q160o635m835l660l522m026m516m724
$$ plain form
56843 554405 544825 542152 547243 560656 582498 612965 652502 701156 758243 822863 893953 968814
56831 968814 1041713 1104813 1150936 1175573 1177028 1155965 1115348 1060168 996345 929527 864466 804707
56819 804707 752245 707562 670462 641046 619993 608144 605978 613394 629811 654500 686906 726552
56807 726552 772450 822411 872708 918224 953132 972272 972815 955189 922409 878386 826798 771245
56795 771245 715636 663505 616704 575319 539186 509128 486266 470591 461032 456906 458531 466199
56783 466199 479325 497083 519133 544846 571903 596402 614551 624041 623921 613860 594060 565800
56771 565800 531745 495317 459424 425568 394153 365470 339989 317705 297789 279421 262743
56760 262743 248549 237097 227588 218799 209961 201115 192955 186320 181485 177825 174303 170277 165761 161037
56746A61037m734m614m317l729k712j330q9L41j86j103j747j931j814j537j154
56731A30381p07k26J63K36j2j56J21L93Lq35j165o67j43k24l80J65J142J600J278
56712A30967P81O00N86M88L73L74L92K48l3k36j48K28O45Q48Q71R18R75P84L07
56693A39968j16j98n7M0%j89n59r56j048p33k56K29Q47J545J869J516P52l3p97
56674A41824j478j646j069k63J02J06L01O95P14J65l84m29j89j86m70n95k48K79
56656A37229L62k36r89j241j139j485k537l464l478k966k910l473l954m045m149
56641A01525m339l909k526j137r26j715k163j504k89P39J678K916M105M489M066
56626A01010L621L572L474K914K173J660J312J017J073J543J701R68m5l39mJ48
$$ plain form
56746 161037 156303 151689 147372 143643 140931 139601 139512 139853 139667 138564 136817 134886 133072 131535 130381
56731 130381 129674 129448 129611 129847 129835 129679 129800 130193 130196 129361 128196 127529 127386 127162 126782 126947 128089 129689 130967
56712 130967 131748 132348 132934 133422 133795 134169 134561 134809 134776 134540 134392 134620 135265 136113 136984 137902 138877 139661 139968
56693 139968 139852 139654 139597 139637 139637 139448 138889 137933 136885 136152 135896 136125 136972 138517 140386 141902 142654 142621 141824
56674 141824 140346 138700 137631 137368 137470 137576 137877 138572 139286 139451 139067 138638 138449 138263 137793 137198 136950 137229
56656 137229 137591 137355 136366 135125 133986 132501 129964 126500 123022 120056 117146 113673 109719 105674 101525
56641 101525 97186 93277 90751 89614 88688 86973 84810 83306 83017 83756 85434 88350 92455 96944 101010
56626 101010 104631 108203 111677 114591 116764 118424 119736 120753 121826 123369 125070 126038 125993 125654 125650 125798
56610A25798J06N55J253R90m27j559j324m18L5J52N68R91P75K60L30Q95J050N70
56592A30600J98M23R13J206J248J089P52M62M44M71J30m87q76q19m74Q9Q74J539
56574A37782J610J166P88Q56J310K013K787L229L046K595K554L129M020N060O261
56559A78206P333P836P810P693P525O867N589M140K945K016J311R52R24R62Q80
56544B42989P04M32Kn48j158j934k874l662m021m078l919l220j924q73q60j395
56528B13661j363p44n93j296k001k040j796j777j830j815k140k947l508l138k231
56513A84442j691j747j879j703j385j309j625k020j832p41O60J405J335J151J258
56498A74319J273R16O14P46R41O55j3o10r69j097q50j81N60R98J108R01J55j110
$$ plain form
56610 125798 125904 126459 127712 128702 128275 126716 125392 124974 125009 125161 125729 126720 127495 127755 128085 128980 130030 130600
56592 130600 130798 131221 132134 133340 134588 135677 136429 136891 137335 137806 137936 137449 136573 135754 135280 135369 136243 137782
56574 137782 139392 140558 141346 142202 143512 145525 148312 151541 154587 157182 159736 162865 166885 171945 178206
56559 178206 185539 193375 201185 208878 216403 223270 228859 232999 235944 237960 239271 240223 241147 242109 242989
56544 242989 243693 244125 244127 243579 242421 240487 237613 233951 229930 225852 221933 218713 216789 215916 215056 213661
56528 213661 212298 211554 210961 209665 207664 205624 203828 202051 200221 198406 196266 193319 189811 186673 184442
56513 184442 182751 181004 179125 177422 176037 174728 173103 171083 169251 168510 169170 170575 171910 173061 174319
56498 174319 175592 176508 177122 177868 178809 179464 179451 178841 177872 176775 175925 175744 176304 177302 178410 179311 179466 178356
56480A78356k229k368j329L71J910K571K198J485J315J630J450K99j034j533j108
56465A81984k84O19J412J696J294O64L04J27n3P0P06J245R13q5q07p46q6R05J977
56446A91855K517K046J070P08J262J865J734J126P79R69J459J931K139J854J085
56431B14399J81m49o95p12o05k86L54J216J941K193J945J467J034P94P96Q94O63
56414B25130j81j238j697j340q35q38j191j283q00J43J284K203K381J708P89L78
56398B24613O72J308J800J802J224M68K16P56J669K456L053L510L636L361L064
56383B53608L097L303L332L107K583J506q3j472k018j964j999k265k357k083j638
56368B54657j249j096j401k077k449j902o67M10P32K49o89j421j303n15m0l64
$$ plain form
56480 178356 176127 173759 172430 172801 174711 177282 179480 180965 182280 183910 185360 185659 184625 183092 181984
56465 181984 181700 182319 183731 185427 186721 187385 187689 187816 187763 187833 188539 189784 190697 190612 189805 189059 188973 189878 191855
56446 191855 194372 196418 197488 198196 199458 201323 203057 204183 204962 205931 207390 209321 211460 213314 214399
56431 214399 214580 214131 213436 212724 212119 211833 212187 213403 215344 217537 219482 220949 221983 222777 223573 224467 225130
56414 225130 224949 223711 222014 220674 219839 219001 217810 216527 215727 215870 217154 219357 221738 223446 224235 224613
56398 224613 225285 226593 228393 230195 231419 231887 232103 232859 234528 236984 240037 243547 247183 250544 253608
56383 253608 256705 260008 263340 266447 269030 270536 270453 268981 266963 264999 263000 260735 258378 256295 254657
56368 254657 253408 252312 250911 248834 246385 244483 243816 244226 244958 245207 244518 243097 241794 241279 241239 240875
56352B40875o63l6J068J545J327J248J545J671J542J720K193K160J348N22K76
56337B58341K61L5j39R2M96Q14J292K142K884K893K260J644J536K003K784L354
56321B82692L256K710K491K841K987K179P95j45k56kJ66K90N21P63R15J098J465
56304C04766J907K153K102J949J945K100K283K571L212L996M076K881J106K07
56290C37254Q23K138K927K770K061J316R19J179K101L119L450K913K181K130K966
56275C70247M133N027N628O272O963P226O767N999N694O255P498Q931J0046J0534
56261D67220J0541J0574J1013J1814J2891J4453J6671J9288K1905K4527K7426
56250F48323L0684L4183L7904M1898M6029N0104N4078N7820O0902O2966O4094
$$ plain form
56352 240875 240212 240176 241244 242789 244116 245364 246909 248580 250122 251842 254035 256195 257543 258065 258341
56337 258341 258602 258637 258498 258590 259086 259900 261192 263334 266218 269111 271371 273015 274551 276554 279338 282692
56321 282692 285948 288658 291149 293990 296977 299156 299951 299806 299550 299548 299714 300004 300525 301288 302203 303301 304766
56304 304766 306673 308826 310928 312877 314822 316922 319205 321776 324988 328984 333060 335941 337047 337254
56290 337254 338077 340215 343142 345912 347973 349289 350208 351387 353488 356607 360057 362970 365151 367281 370247
56275 370247 374380 379407 385035 391307 398270 405496 412263 418262 423956 430211 437709 446640 456686 467220
56261 467220 477761 488335 499348 511162 524053 538506 555177 574465 596370 620897 648323
56250 648323 679007 713190 751094 792992 839021 889125 943203 1001023 1061925 1124891 1188985
56239A188985O4452O3797O1696N8057N2975M6374L8178K8718J8521P967k503j2226
56227A614991k0866k8723l5980m2076m6480m9576n1991n3442n3253n1674m9691
56216A131239m7717m5516m3199m1147l8989l5882l2017k8687k6562k4986k3264
56205G43273k1548k0044j8404j6489j4796j3516j2032r992q056o902o242n496
56193E89756m777m413m110l452k767k637k813k425j201J92R75R93O52M61O11Q31
56177E65876P39M62N59J233K003K367K343K229K185K343K905L810M616N011N114
56162F03795N161N185N240N524O130O952P898Q928R851J0548J1303J2426J3630
56149G12571J4465J5296J7060K0050K3697K7700L2444L8160M4563N1684O0046
$$ plain form
56239 1188985 1253437 1317234 1378930 1436987 1489962 1536336 1574514 1603232 1621753 1629720 1627217 1614991
56227 1614991 1594125 1565402 1529422 1487346 1440866 1391290 1339299 1285857 1232604 1180930 1131239
56216 1131239 1083522 1038006 994807 953660 914671 878789 846772 818085 791523 766537 743273
56205 743273 721725 701681 683277 666788 651992 638476 626444 616452 608396 601494 595252 589756
56193 589756 584979 580566 576456 573004 570237 567600 564787 562362 561161 561353 562328 563321 563973 564434 565045 565876
56177 565876 566615 567077 567636 568869 570872 573239 575582 577811 579996 582339 585244 589054 593670 598681 603795
56162 603795 608956 614141 619381 624905 631035 637987 645885 654813 664664 675212 686515 698941 712571
56149 712571 727036 742332 759392 779442 803139 830839 863283 901443 946006 997690 1057736
56138A057736O9680P9810Q9919J00085J09674J16644J19042J16549J09995J00218
56128B069352Q8275P6109O5829N8380N3325M9453M5093L8484K8883J7251N418
56117B595852n259j4194k1285k7119l3111m0795n0943o3428p7322r0689j00957
56106B070750j06374j06994j03925r7977q9495p9102o7946n7220m7669l9351l1859
56095A242838k4995j9243j5062j1993r154o536m816l849k562n92J128J956K521
56082A149641L516M577N124N447O138P188Q293R349J0045R850R050Q937J0239
56069A247394J2138J3513J4313J5012J5613J6002J6504J7322J8145J8884J9995
56058A424835K1467K2468K2672K2952K4012K5345K6271K6971K7704K7986K7403
$$ plain form
56138 1057736 1127416 1207226 1297145 1397230 1506904 1623548 1742590 1859139 1969134 2069352
56128 2069352 2157627 2233736 2299565 2357945 2411270 2460723 2505816 2544300 2573183 2590434 2595852
56117 2595852 2590593 2576399 2555114 2527995 2494884 2454089 2403146 2339718 2262396 2171707 2070750
56106 2070750 1964376 1857382 1753457 1655480 1565985 1486883 1418937 1361717 1314048 1274697 1242838
56095 1242838 1217843 1198600 1183538 1171545 1162391 1155855 1151039 1147190 1144628 1144036 1145164 1147120 1149641
56082 1149641 1153157 1157734 1162858 1168305 1174443 1181631 1189924 1199273 1209318 1219168 1228218 1237155 1247394
56069 1247394 1259532 1273045 1287358 1302370 1317983 1333985 1350489 1367811 1385956 1404840 1424835
56058 1424835 1446302 1468770 1491442 1514394 1538406 1563751 1590022 1616993 1644697 1672683 1700086
56047A700086K6322K5157K3929K3095K3504K4868K5770K5918K6735K8892L1065
56036A985341L2256L3403L5350L7137L8010L9245M2018M5201M7295M8963N1474
56025B435693N4168N5831N7168N9446O1928O3199O4044O6301O9737P2632P4817
56014C134964P7542Q0958Q4191Q7429R1493R5808R9202J02310J06846J12845J18909
56003D192497J24772J31425J39046J46913J54911J63185J71088J78470J87020
55994E589327J98157K10586K22354K34103K47717K62986K78519K94834L13535
55985G852118L34521L56898L81652M10260M41975M75628N12725N55333O02490
55976A1923600O52531P07357P70427Q42187R21893J012246J117445J238442J375375
$$ plain form
56047 1700086 1726408 1751565 1775494 1798589 1822093 1846961 1872731 1898649 1925384 1954276 1985341
56036 1985341 2017597 2051000 2086350 2123487 2161497 2200742 2242760 2287961 2335256 2384219 2435693
56025 2435693 2489861 2545692 2602860 2662306 2724234 2787433 2851477 2917778 2987515 3060147 3134964
56014 3134964 3212506 3293464 3377655 3465084 3556577 3652385 3751587 3853897 3960743 4073588 4192497
56003 4192497 4317269 4448694 4587740 4734653 4889564 5052749 5223837 5402307 5589327
55994 5589327 5787484 5998070 6220424 6454527 6702244 6965230 7243749 7538583 7852118
55985 7852118 8186639 8543537 8925189 9335449 9777424 10253052 10765777 11321110 11923600
55976 11923600 12576131 13283488 14053915 14896102 15817995 16830241 17947686 19186128 20561503
55967B0561503J533141J719230J938016K193554K496574K862720L306334L843719
55959D0454791M501299N313802O317710P555781R084153J0960126J3216789J5849884
55951A13254335J8816530K2026581K5330312K8508078L1223038L2919344L2786371
55944C04864589K9972527K4030683J5287175M825502n895806j5499269k2987465
55937C34597936k7869640l0172340l0332430k8983111k6735183k4061641k1287097
55930A45156494j8612883j6142664j3916377j1946099j0231368q757336p498504
55923E8051263o429834n529235m772087m132543l590721l132614k744016k410760
55915B5309453k123935j878875j669367j487855j330156j194708j077714r73959
$$ plain form
55967 20561503 22094644 23813874 25751890 27945444 30442018 33304738 36611072 40454791
55959 40454791 44956090 50269892 56587602 64143383 73227536 84187662 97404451 113254335
55951 113254335 132070865 154097446 179427758 207935836 239158874 272078218 304864589
55944 304864589 334837116 358867799 374154974 378980476 373084670 357585401 334597936
55937 334597936 306728296 276555956 246223526 217240415 190505232 166443591 145156494
55930 145156494 126543611 110400947 96484570 84538471 74307103 65549767 58051263
55923 58051263 51621429 46092194 41320107 37187564 33596843 30464229 27720213 25309453
55915 25309453 23185518 21306643 19637276 18149421 16819265 15624557 14546843 13572884
55907A3572884q81595q01339p31539o68536o11403n61689n18637m78949m41357
55898G877840m07467l77803l50634l24946l01292k79485k58404k38224k19946
55889E119639k02683j84210j64251j44586j25895j07104q7840o8977n0621l2165
55879C951307j4795j727M497L256n493k1675m3826o8998r4228j17066j35242j47439
55867C308571j54106j56167j53493j46123j36084j26006j16508j06736r6872q8065
55857B028411q0525p3649o7698o3285n9595n5145n0099m5896m2789l9775l6774
55846A413181l4914l4463l4335l3762l2937l1946l0506k8819k7350k5890k3960
55835A074299k1886k0272j8956j7662j6983j7292j7524j6643j5459j5250j5420
$$ plain form
55907 13572884 12691289 11889950 11158411 10489875 9878472 9316783 8798146 8319197 7877840
55898 7877840 7470373 7092570 6741936 6416990 6115698 5836213 5577809 5339585 5119639
55889 5119639 4916956 4732746 4568495 4423909 4298014 4190910 4103070 4034093 3983472 3951307
55879 3951307 3936512 3934785 3939282 3942538 3937045 3915370 3871544 3802546 3708318 3591252 3456010 3308571
55867 3308571 3154465 2998298 2844805 2698682 2562598 2436592 2320084 2213348 2116476 2028411
55857 2028411 1947886 1874237 1806539 1743254 1683659 1628514 1578415 1532519 1489730 1449955 1413181
55846 1413181 1378267 1343804 1309469 1275707 1242770 1210824 1180318 1151499 1124149 1098259 1074299
55835 1074299 1052413 1032141 1013185 995523 978540 961248 943724 927081 911622 896372 880952
55824H80952j4534j2926j2107j2208j2271j2518j3884j5599j5745j4270j3055
55813G31835j2884j2660j1821j1169j0902j0018q319o993o622o364n562m524l350
55800F20647j709j03L86m8m6P82J552K009K766L464K971J728J623K835L194J553
55784F43604m51j230j769l820p256j0739j3669j6062j7558j7859j7350j6351j4542
55771E04948j1788q626n441k331k23o17l442o548q156q573q785q758q183p474
55757D16003o993o317n225m422m391m663m948n725o904p289o398n436n322n128
55743C36842l857k443k374l271l544k838k164k084k170k152k259k494k550k475
55729C00167k625l086l653m182m517m489m339m595n164n215m405l412k785k187
$$ plain form
55824 880952 866418 853492 841385 829177 816906 804388 790504 774905 759160 744890 731835
55813 731835 718951 706291 694470 683301 672399 662381 654062 647069 640447 634083 628521 623997 620647
55800 620647 618938 618835 619221 619173 619127 619909 621461 623470 626236 629700 632671 634399 636022 638857 642051 643604
55784 643604 643153 641923 640154 636334 629078 618339 604670 588608 571050 553191 535841 519490 504948
55771 504948 493160 484534 479093 476762 476539 475922 472480 465932 457776 449203 440418 431660 423477 416003
55757 416003 409010 402693 397468 393046 388655 383992 379044 373319 366415 359126 352728 347292 341970 336842
55743 336842 332985 330542 328168 324897 321353 318515 316351 314267 312097 309945 307686 305192 302642 300167
55729 300167 297542 294456 290803 286621 282104 277615 273276 268681 263517 258302 253897 250485 247700 245513
55715B45513j358q25q59o90K79J408J874K008K572L334L484K908K078J096k42
55700B62580j782l150m193m795m803m597n017o139o941o709n885m964l684k094
55686A97827j182j378j613j045m94q15j060L0J655K013J066K54j7o59j777k338
55670A90467k112k108k700k943k319j646j688k040k061j776j334m95P03J552J577
55655A71077J224J176J522J993K455K865L105L131L003K696K289K147K475K797
55641B03955K520J840J365J016J29j416l039m419n763o976p496p179o503n719
55627A62315m598l358k856l371l900l331j790k97N29P76N79j41j255k185k343
55612A34774j783j215j284j822k124j861j409j154j010r28j274k110k641k190
$$ plain form
55715 245513 244155 243330 242471 241781 242060 243468 245342 247350 249922 253256 256740 259648 261726 262822 262580
55700 262580 260798 257648 253455 248660 243857 239260 234243 228104 221163 214454 208569 203605 199921 197827
55686 197827 196645 195267 193654 192609 192115 191300 190240 190270 191925 193938 195004 195258 195241 194582 192805 190467
55670 190467 188355 186247 183547 180604 178285 176639 174951 172911 170850 169074 167740 167245 167948 169500 171077
55655 171077 172301 173477 174999 176992 179447 182312 185417 188548 191551 194247 196536 198683 201158 203955
55641 203955 206475 208315 209680 210696 210825 209409 206370 201951 196188 189212 181716 174537 168034 162315
55627 162315 157717 154359 151503 148132 144232 140901 139111 138814 139343 140119 140698 140557 139302 137117 134774
55612 134774 132991 131776 130492 128670 126546 124685 123276 122122 121112 120184 118910 116800 114159 111969
55598A11969j305j100j662k023j626q98k88L24J061J600J633J219M80m28r70m50
55582A07536J049K558L266L243K932K513K128K161K842L884M931O040P406Q746
55568A61235R384Q898P488N632L590J307j136l241m541n306o271p512q201p792
55554A53534o884o351o148n783n421n594o018n764m611l295k336j454m26L09L41
55539I4099o9m37o95j042j457j711j606j126n17j46q3J8K72J84n53j270j141m90
55521H2230l68r38j360j309j395j841j899j132l32l97j118j686j815j649j114
55506F3877p3J177K147K637K656K198J486R90Q75P87M58Q7j67m44o91n97l31n27
55488G6545j093r71J70R70J97j291j647o50K06J6n49p01o39p12n95M9Q21J138
$$ plain form
55598 111969 110664 109564 107902 105879 104253 103355 103067 103391 104452 106052 107685 108904 109384 108956 107986 107536
55582 107536 108585 111143 114409 117652 120584 123097 125225 127386 130228 134112 139043 145083 152489 161235
55568 161235 170619 179517 187005 192637 196227 197534 196398 193157 188616 183310 177039 169527 161326 153534
55554 153534 146650 140299 134151 128368 122947 117353 111335 105571 100960 97665 95329 93875 93449 93758 94099
55539 94099 94030 93593 92898 91856 90399 88688 87082 85956 85439 85293 85210 85228 85500 85684 85131 83861 82720 82230
55521 82230 81862 80924 79564 78255 76860 75019 73120 71988 71656 71259 70141 68455 66640 64991 63877
55506 63877 63804 64981 67128 69765 72421 74619 76105 77095 77970 78757 79215 79302 79135 78691 78000 77403 77072 76545
55488 76545 75452 74481 74651 75621 75818 74527 72880 72230 72436 72452 71903 71202 70563 69851 69256 69305 70126 71264
55470G1264J008P31L34j98n86n94m63n09n99m49j76j41l70n84o72p44p62m66K25
55451F6249J072J735J980J732J134O12N39Q09R03M43m55j352j827j682j056l88
55435G0448m0J05M08Q53R79N75Q5OK19K78J03j1L5L2k9J47P12J409J878J984J799
55414H1975J512J422J622J707J154Q0p63r35q09r22j217j290j096r84j149j335
55398G8972j187p50n21r47j738j993j214J3P39Q46Q88J021Q60M33K79M56L66j10
55380G6413k60J96M93J15k57M1L65k47j393j797j107j47L98N36L62j31o94j061
55362G1825j440k059k447k023j088l94RN37R69P06J3j69L12O66N54M90O68N90
55344F7719J47K0N18R81P91K01k62m42k83L08R93J094N22j21m88q41j208j141
$$ plain form
55470 71264 72272 73003 73337 73139 72553 71959 71496 70987 70388 69939 69763 69622 69252 68668 67996 67252 66490 66024 66249
55451 66249 67321 69056 71036 72768 73902 74514 75053 75862 76765 77208 76753 75401 73574 71892 70836 70448
55435 70448 70408 70513 70921 71774 72753 73328 73413 73419 73638 73916 74019 74008 74043 74075 74046 74193 74905 76314 78192 80176 81975
55414 81975 83487 84909 86531 88238 89392 89472 88709 87774 86965 86043 84826 83536 82440 81456 80307 78972
55398 78972 77785 77035 76514 75567 73829 71836 70622 70635 71374 72220 73108 74129 74989 75422 75701 76157 76523 76413
55380 76413 76153 76349 76842 76957 76700 76741 77106 76859 75466 73669 72562 72415 72813 73349 73711 73580 72886 71825
55362 71825 70385 68326 65879 63856 62768 62374 62383 62920 63889 64595 64608 64439 64751 65417 65971 66461 67129 67719
55344 67719 67866 67886 68404 69385 70176 70377 70115 69673 69390 69698 70691 71785 72307 72186 71698 70857 69649 68508
55326F8508o17l09n94j084j431j714j806j305m45pnM07J281J493O51J2N28J262
55308F4825R24r7n47l31k75m95l88J24N85R51J400J478O18o86j252p59P2O29Q66
55289F7642P44K52r0L01J085J344R08M88M71M70J67j93l02j51J83N82O90L10n1
55270G4850K99J141J449P18m16j000p36k6N04M23k00q54j152j159r83m73K57N59
55252G3201P4n89o79m09m11n38k12L72M33n2k86M9L91L19O8j47m03n67l34N0p
55231G0323l52j35Q19J537J234L08m11o84p07n42j55M12J112J758J798R38qJ51
55213G7396J224J571L08j409j906j031P8N86N68L99K93K27q7q82j764j915j128
55196G2528j28M86Q84J210R67p1j044r50k3O57O01J50l73q89j172r92o22n05n47
$$ plain form
55326 68508 67891 67582 66988 65904 64473 62759 60953 59648 59203 59196 59191 59598 60879 62372 63023 63035 63563 64825
55308 64825 65749 65652 65105 64774 64499 64004 63616 63740 64325 65276 66676 68154 68772 68086 66834 66075 66147 66776 67642
55289 67642 68386 68638 68548 68849 69934 71278 72186 72674 73145 73615 73782 73589 73287 73136 73319 73901 74591 74901 74850
55270 74850 75149 76290 77739 78457 78041 77041 76305 76279 76783 77206 77006 76152 75000 73841 72858 72385 72642 73201
55252 73201 73275 72686 72007 71598 71187 70649 70437 70809 71242 71190 70904 70953 71344 71663 71731 71584 71181 70614 70280 70330 70323
55231 70323 69971 69836 70655 72192 73426 73734 73323 72639 71932 71390 71235 71647 72759 74517 76315 77253 77245 77396
55213 77396 78620 80191 80499 79090 77184 76153 76231 76817 77385 77784 78077 78304 78217 77335 75571 73656 72528
55196 72528 72400 72886 73770 74980 75947 75876 74832 73882 73859 74516 75117 75267 74894 74005 72833 71841 71219 70714 70167
55177G0167l47J7J33P6L23Q71J167R58N52J05n08j042q34J89J089J045M01Q7L64
55158G4813P15P27N59M87M57K88J8j48j64k16m32o52o01k75M6J88K91M73N48L07
55138G7429p7k62k31k24j94J92R20J383J036J12o42p25k29M42R06R46N74J2m99
55119H0869q57r74o67M8O12L44o84j502j298l87K01j5n22n92j10N24J000J305
55101G7295J510J588J450J084O42L85L87L49o0o57q39l06N98J393J900K002J472
55084I0193L98n05o07k07j59p03j187r54j03O91Q26J85q00j411j286p42l10j08
55066H3211j9j84p60j284r84J64J216J359P46O1k38m5M26N63k37j654k397j617
55048G8327M5J241J415R84L37n36j491j989j674p56K73J019J196P21k0l72j45
$$ plain form
55177 70167 69820 69837 69970 70046 70369 71240 72407 73365 73917 74022 73514 72472 71638 71827 72916 73961 74362 74449 74813
55158 74813 75528 76255 76814 77301 77758 78046 78064 77916 77752 77536 77104 76452 75851 75576 75622 75810 76101 76574 77122 77429
55138 77429 77352 77090 76859 76635 76441 76633 77553 78936 79972 80084 79442 78717 78488 78930 79836 80782 81356 81368 80869
55119 80869 80012 79038 78371 78419 79031 79375 78691 77189 75891 75504 75705 75690 75168 74576 74466 74990 75990 77295
55101 77295 78805 80393 81843 82927 83569 83954 84341 84690 84630 83973 83134 82828 83426 84819 86719 88721 90193
55084 90193 90591 90086 89479 89272 89113 88410 87223 86269 86166 86857 87683 87868 87068 85657 84371 83629 83319 83211
55066 83211 83192 83008 82248 80964 79980 80144 81360 82719 83465 83526 83288 83243 83669 84232 83995 82341 79944 78327
55048 78327 78372 79613 81028 82012 82349 81813 80322 78333 76659 75903 76176 77195 78391 79112 79092 78720 78575
55031G8575J54O6j35P7N72P01L53K45Q47J505J218L5r30q67p3P09J139J168P21
55012H6080o2o24n64k07j24l25m29l72l76l69n1M47O66N47N05O52N90J40l14m10
54992H5400k41M7N57J237J690J710J620J671J512O92n11j202p81M68J570J579
54976I7018L72j081j512o32O00J050N18l33p57m73K11O66N57K49K48L02k66j268
54958I5469j558o25N01N70k95r95r62m75J43P50J051P96L22K49O42J067J299J423
54940I9372J258N13n12j041q26m44l45k49K08P31P33J47m75o00k02L10O10Q46
54922A00034J446K480L446L974M384N156O056O417O225O199O669O995O467N209
54908A71157L779K305N35j442l118m171m761n235n808o542p298p601o873n062
$$ plain form
55031 78575 78729 78795 78660 78737 79309 80010 80363 80608 81455 82960 84178 84213 83283 82416 82343 83052 84191 85359 86080
55012 86080 86018 85394 84830 84623 84499 84174 83745 83373 82997 82628 82577 83024 83690 84237 84742 85394 85984 86124 85810 85400
54992 85400 85159 85206 85763 87000 88690 90400 92020 93691 95203 95895 95384 94182 93401 93869 95439 97018
54976 97018 97390 96309 94797 94165 94765 95815 96333 96000 95243 94770 94981 95647 96204 96453 96701 97003 96737 95469
54958 95469 93911 93286 93787 94357 94062 93067 92105 91630 91773 92523 93574 94370 94692 94941 95583 96650 97949 99372
54940 99372 100630 101143 100631 99590 98764 98320 97975 97726 97934 98665 99398 99545 99070 98470 98268 98578 99188 100034
54922 100034 101480 103960 107406 111380 115764 120920 126976 133393 139618 145817 152486 159481 165948 171157
54908 171157 174936 177241 177776 176334 173216 169045 164284 159049 153241 146699 139401 131800 124927 119865
54894A19865k934j521j169j320j242q75o93r04j075o97J38Q47J016P94O43Q85
54878A11758J484K141K614K968L445M172N067O015O836P186O767N802M849M054
54864A75158K946J253n78k023l209m452n495n873n839o122o774p013o392n441
54850A20146m810m359l577k517j774j681j976k198k124j774j224o27k27j80l52
54835I0746l97j70J02J70K17N92J162J304P19j85r36j482j748j306q3J033J111
54818I0849M56J36M37O91O37Q64J617K069J448J64p21p75l79n5p7m80r74j101
54800I4806p64l69j42K39R74J592J608J296J184J108N42l39p35l69J83M44N80
54783A01838P96Q23M50M8J34O91J306J679J716J383Q66O33R13J227R52K84J59
$$ plain form
54894 119865 116931 115410 114241 112921 111679 110804 110111 109207 108132 107435 107573 108420 109436 110230 110873 111758
54878 111758 113242 115383 117997 120965 124410 128582 133649 139664 146500 153686 160453 166255 171104 175158
54864 175158 178104 179357 178779 176756 173547 169095 163600 157727 151888 145766 138992 131979 125587 120146
54850 120146 115336 110977 107400 104883 103109 101428 99452 97254 95130 93356 92132 91505 91278 91098 90746
54835 90746 90349 90179 90281 90451 90668 91260 92422 93726 94445 94260 93324 91842 90094 88788 88705 89738 90849
54818 90849 91305 91441 91878 92569 93206 94070 95687 97756 99204 99368 98647 97872 97493 97438 97361 96881 95907 94806
54800 94806 94042 93673 93531 93770 94744 96336 97944 99240 100424 101532 102074 101735 101000 100631 100814 101258 101838
54783 101838 102634 103457 103907 103955 104089 104780 106086 107765 109481 110864 111730 112363 113276 114503 115455 115739 115898
54766A15898J109K616L842M586N257O120P028P780Q319Q478P865O295M133K001
54752A91327J81j473l111m605n771o622p209p349o742n426l905k747k062j584
54738A32902j171j007j231j553j498r97m76l35m68m52n2N24Q74Q07N57N50R41
54721A27915J446J790K174L014M259N367O021O420O681O390N126L191J311k14
54707A80891j627l106m458n436n980o108n854n374m822m190l504l083l171l359
54693A20819k918j777o98k76k82k67k87o16j065j151q01m17k79l26m73p57j041
54676A07388r74m82n2k20r02j471j499j183q96o58k42K70M61J80j41J6N57Q72
54658A01024M86m99j490j809j136J52J195J400R38L36j77o38q86o78j52L21P24
$$ plain form
54766 115898 117007 119623 123465 128051 133308 139428 146456 154236 162555 171033 178898 185193 189326 191327
54752 191327 191508 190035 186924 182319 176548 169926 162717 155368 148626 143200 139295 136548 134486 132902
54738 132902 131731 130724 129493 127940 126442 125445 124969 124634 124166 123714 123662 124186 125060 125867 126424 126974 127915
54721 127915 129361 131151 133325 136339 140598 145965 151986 158406 165087 171477 176603 179794 181105 180891
54707 180891 179264 176158 171700 166264 160284 154176 148322 142948 138126 133936 130432 127349 124178 120819
54693 120819 117901 116124 115426 115150 114868 114601 114314 113698 112633 111482 110681 110264 109985 109659 109186 108429 107388
54676 107388 106414 105932 105880 105660 104758 103287 101788 100605 99709 99051 98809 99079 99540 99720 99579 99595 100152 101024
54658 101024 101510 101011 99521 97712 96576 96728 97923 99323 100261 100597 100420 99782 98896 98218 98066 98387 99111
54641I9111J344K071K292J723Q68L43J89R8k6j09j70k32k08j51l29p31q39k89
54623A04955M80O88J35p34j480j949j969j332j73R72J611J559R24Q5l42K2Q19
54606A04271J255R68K63m34r86j318j238p26n8N43J123J644J766J313O49K37J0
54589A09282m09r65j116n96J91O85P96P58O99O16O55J000J430J387O67j51k89
54572A14640L45J047J108M83l22p86p09k23L06M98K32l07q61j175r57j5J276K023
54554A16603J665O76m4l58r18j876k284j253P01K119K274J755J399J267R72M63
54538A23161M6q6J08P50J769K550K375J359M17J82L42L08R3Q0K48J87k16n47n01
54519A32625l56o06j330k092k373k008j253m95N1L75M53J77m03r62j236j274j226
$$ plain form
54641 99111 100455 102526 104818 106541 107409 107752 107941 108039 108013 107904 107734 107502 107294 107143 106814 106083 105244 104955
54623 104955 105435 106123 106258 105524 104044 102095 100126 98794 98621 99593 101204 102763 103687 103772 103430 103452 104271
54606 104271 105526 106494 106757 106323 105337 104019 102781 102055 101997 102540 103663 105307 107073 108386 109035 109272 109282
54589 109282 108873 107908 106792 106196 106387 107072 107868 108626 109325 109941 110596 111596 113026 114413 115080 114929 114640
54572 114640 114985 116032 117140 117623 117301 116515 115806 115583 115889 116387 116619 116312 115451 114276 113319 113304 114580 116603
54554 116603 118268 118944 118900 118542 117624 115748 113464 112211 112912 115031 117305 119060 120459 121726 122698 123161
54538 123161 123207 123121 123229 123979 125748 128298 130673 132032 132449 132631 132973 133281 133374 133454 133702 133889 133673 133126 132625
54519 132625 132269 131663 130333 128241 125868 123860 122607 122112 122163 122538 122991 123168 122765 121803 120567 119293 118067
54502A18067r77l41M83R77Q60L32k49o57p60m92NM25O18O83P23O96N72M05K46
54483A21616J80M23J071J709J698J008M11N82J313J866J916J752J701J662J296
54468A40204N17k96n71j49N22R63J287J840K308J859L65j126j575j149p26o28
54452A43645n41l15j62r0J40M53M82K02j5j14m56j042j216n40M69R55P07J96j07
54433A42651n5K48M43Q5p90j485j469j133j171j427j067P0J090J216P47M11L43
54416A38707K66K74O84J286J377O70l73j124j344j074m99m9j74p53j102p70l7
54399A35965O03J026J319J414J288J191J266J183O37l3j86K73Q53J183J273J163
54383A50418P55Q4o21j196j577j690j619j695j982j933j066J99J049J454J975
$$ plain form
54502 118067 117090 116749 117232 118209 119069 119401 119152 118495 117735 117243 117248 117673 118291 118974 119697 120393 120965 121370 121616
54483 121616 121796 122219 123290 124999 126697 127705 128116 128698 130011 131877 133793 135545 137246 138908 140204
54468 140204 140721 140425 139854 139705 140227 141190 142477 144317 146625 148484 148849 147723 146148 144999 144273 143645
54452 143645 143104 142789 142627 142537 142677 143130 143612 143814 143799 143685 143229 142187 140971 140431 140900 141855 142562 142758 142651
54433 142651 142596 142844 143287 143372 142582 141097 139628 138495 137324 135897 134830 134900 135990 137206 137953 138364 138707
54416 138707 138973 139247 139931 141217 142594 143264 142891 141767 140423 139349 138850 138801 138627 137874 136772 136002 135965
54399 135965 136568 137594 138913 140327 141615 142806 144072 145255 145892 145859 145673 145946 146799 147982 149255 150418
54383 150418 151173 151257 150636 149440 147863 146173 144554 142859 140877 138944 137878 138077 139126 140580 142555
54368A42555K483K071N80q51j224q28m28j22K32K26n31j442j480n26N88J160J075
54351A43538M00o15j273j022l48l30j153j814j483n11J94K65Pj58o9J48K30J45
54333A36151L35J149K104K225J320L41J38L39o6j262k305k259j239k35n0n65j018
54316A35103r19n42m44o89q40o32k67l9J0LN7K77O36Q08M55k85q47j007j130j535
54296A28173j941j874j305o00n3K03Q4k54l04K49R21Q98J30m31J0J064J658J307
54278A27935N62K13M18P20O66K43k08l58k15j10k29k42L16J165J268J26j353j861
54260A29056j352q93r11o54L37J207R80M2n00l75r1K73J063J915J882R48K89N86
54242A33802J052P37r7o35q80j327j779j545p28l02p03j200r95l15K0k62o96p75
$$ plain form
54368 142555 145038 147109 147689 146838 145614 144786 144358 144236 144468 144694 144163 142721 141241 140715 141303 142463 143538
54351 143538 143938 143323 142050 141028 140680 140350 139197 137383 135900 135389 135583 135848 135855 135697 135628 135776 136006 136151
54333 136151 136486 137635 139739 141964 143284 143625 143763 144102 144036 142774 140469 138210 136971 136736 136686 136121 135103
54316 135103 134184 133642 133198 132509 131669 131037 130770 130731 130741 130744 130801 131078 131714 132522 132977 132692 131845 130838 129708 128173
54296 128173 126232 124358 123053 122453 122400 122603 122687 122433 122129 122378 123299 124197 124327 123896 123906 124970 126628 127935
54278 127935 128497 128710 129128 129848 130514 130757 130549 130191 129976 129866 129637 129395 129711 130876 132144 132270 130917 129056
54260 129056 127704 126811 125900 125246 125583 126790 127770 127812 127312 126937 126846 127119 128182 130097 131979 132927 133216 133802
54242 133802 134854 135591 135494 134859 133979 132652 130873 129328 128600 128298 127595 126395 125400 125085 125105 124843 124147 123372
54224A23372m10K44R85J500J424O37n03j399j683j448j029o64m14l12m17o67q11
54207A18405o63l83l89p80j055n77N79J536J579R83O43R13J284J221Q41N80N25
54190A25242M36J80j61m25l70J57Q08Q32P8n74k75N55P77J23o11q88j032j301
54172A23551j267n94K28N03J88l25p98j039o68L36J205J118K44n44p98p42n47
54155A20051q0N29P51L69j55l41l45n66r05q48k43M28O68N58N01N52L82r8m37
54136A20771k50J67K30n7j25K30N18L86K42O45J440J950J872J459R82M74J8j73
54118A30779r9l9j49k22o2K03L34L37L31K07k20o87n21M94J551J612P25j0K0J24
54098A34708m98j333j178O5J178J285Q20N23L93J28j04k0J64O9k39m99o79o34
$$ plain form
54224 123372 122962 123206 124191 125691 127115 127752 127249 125850 124167 122719 121690 121026 120612 120300 119883 119216 118405
54207 118405 117742 117359 116970 116190 115135 114558 115137 116673 118252 119235 119878 120791 122075 123296 124137 124717 125242
54190 125242 125678 125858 125697 125272 124902 125059 125867 126699 126777 126203 125928 126483 127260 127383 126772 125884 124852 123551
54172 123551 122284 121690 121918 122421 122609 122284 121486 120447 119779 120115 121320 122438 122682 122138 121340 120598 120051
54155 120051 119971 120500 121251 121620 121465 121124 120779 120213 119308 118460 118217 118645 119313 119871 120372 120924 121306 121208 120771
54136 120771 120521 120688 120918 120861 120736 120966 121484 121870 122112 122757 124197 126147 128019 129478 130460 130934 130952 130779
54118 130779 130680 130641 130492 130270 130208 130411 130745 131082 131413 131620 131400 130713 130192 130686 132237 133849 134574 134564 134584 134708
54098 134708 134210 132877 131699 131764 132942 134227 135047 135570 135963 136091 135987 135967 136131 136200 135961 135462 134783 134149
54080A34149Q1J383K157J544L25L1P83J245P25J16L47R78J110Q16Q46J312J595
54063A49543J329Q11M38K48J41J65M53R63J382J318P24P1j17N9P2j42M7J058K393
54044A60956L212L238K797K275J992K301L290M472N268N664O077O607O993P231
54030B22373P701Q527R305R632R573R391R129Q645P803O406M274J588r94k883
54016C10470m094n009n766o139n940n322m745m780n769p328q322p780n938m019
54002B29519k961k678k673k865l408m045m212l732l023k535k321k248k283k396
53988A88139k449k337k132j919j666j372j193j237j317j065l44N43R92N24p18
53973A72449j893k104j269j87L80M31L68K92K2l43m03p3K99M61O64J184J769J896
$$ plain form
54080 134149 134230 135613 137770 139314 139639 139670 140453 141698 142423 142539 142886 143864 144974 145790 146636 147948 149543
54063 149543 150872 151683 152121 152369 152510 152675 153128 154091 155473 156791 157515 157586 157469 157528 157600 157458 157505 158563 160956
54044 160956 164168 167406 170203 172478 174470 176771 180061 184533 189801 195465 201542 208149 215142 222373
54030 222373 230074 238601 247906 257538 267111 276502 285631 294276 302079 308485 312759 314347 313353 310470
54016 310470 306376 301367 295601 289462 283522 278200 273455 268675 262906 255578 247256 239476 233538 229519
54002 229519 226558 223880 221207 218342 214934 210889 206677 202945 199922 197387 195066 192818 190535 188139
53988 188139 185690 183353 181221 179302 177636 176264 175071 173834 172517 171452 171108 171651 172643 173167 172449
53973 172449 170556 168452 167183 166996 167376 167807 168175 168467 168489 168146 167743 167670 167969 168430 169094 170278 172047 173943
53955A73943J534J284J661K439K913K706K130J699J547J471J384J395J553J824
53941A99483K324L170M063M421M175L967M250M539M086L044K331K454L019L406
53927B48732L324K685J614P33P94J644K175J785J389K311M452O295O761O343O253
53912B97290O995Q015Q515Q167P242O269N609N183M631L734K612J487L58q56j971
53897C63280k543k361j816j603k066k944l750m289m686n060n372n453n133m386
53883C11818l500k960k898k796k101j014l07k98m98l54J55R01K002L342M129L527
53867C09148J608q60l281n415o905p460p510p906q788r386r218q702q239p407
53853B19679n768l902k775k361j846j064p75j270j642j082j60o5q98j582j392
$$ plain form
53955 173943 175477 176761 178422 180861 183774 186480 188610 190309 191856 193327 194711 196106 197659 199483
53941 199483 201807 204977 209040 213461 217636 221603 225853 230392 234478 237522 239853 242307 245326 248732
53927 248732 252056 254741 256355 257088 257882 259526 261701 263486 264875 267186 271638 277933 284694 291037 297290
53912 297290 304285 312300 320815 328982 336224 342493 348102 353285 357916 361650 364262 365749 366107 365251 363280
53897 363280 360737 358376 356560 354957 352891 349947 346197 341908 337222 332162 326790 321337 316204 311818
53883 311818 308318 305358 302460 299664 297563 296549 296242 295944 295446 295092 295247 296148 298150 301492 305621 309148
53867 309148 310756 309896 306615 301200 294295 286835 279325 271419 262631 253245 244027 235325 227086 219679
53853 219679 213911 210009 207234 204873 203027 201963 201188 199918 198276 197194 197034 196969 196071 194489 193097
53838A93097q10n97p33p59o89r45j482j683j239o35m27n25n38n73j064j935k444
53821A76019k006p84O02J607J920J576J061R32J153J222J094J347K043K254J394
53806A91434M05O31J840K551K326K385L638N258N928N608N192N070M988M897M944
53791B47095M772L802K302J327J401J907K039J754J434J088M39m66j138j184p15
53776B65857k68m17j373k792l951m242l628k653k030k137k849l814m724n293n224
53761B20462m539l811l584l564k972j769q58p87j009r43r90j640k236j781o42
53746A89337k25q94j471j065k75l4k02j65j2k38o75o17P0O99O86K09j64j38J31
53727A84957L90O40J101J789K296K226J750J322R85M34j96l14K34Q41J024J040
$$ plain form
53838 193097 192287 191690 190957 190198 189509 188564 187082 185399 184160 183525 183098 182573 182035 181462 180398 178463 176019
53821 176019 174013 173229 173831 175438 177358 178934 179995 180927 182080 183302 184396 185743 187786 190040 191434
53806 191434 191839 192470 194310 196861 199187 201572 205210 210468 216396 222004 227196 232266 237254 242151 247095
53791 247095 251867 255669 257971 259298 260699 262606 264645 266399 267833 268921 269360 268894 267756 266572 265857
53776 265857 265589 265172 263799 261007 257056 252814 249186 246533 244503 242366 239517 235703 230979 225686 220462
53761 220462 215923 212112 208528 204964 201992 200223 199365 198578 197569 196626 195636 193996 191760 189979 189337
53746 189337 189112 188218 186747 185682 185407 185373 185171 185006 184994 184756 184081 183464 183534 184233 184919 185128 184964 184826 184957
53727 184957 185347 185987 187088 188877 191173 193399 195149 196471 197456 197890 197694 197380 197614 198455 199479 200519
53711B00519J221J357J224J179J597K111K084J528R10L12m82j220j225k74J115
53696B11956K326L109L424L367L305L614M082L961K855J277R2l90n66q72j222
53681B40318j235q97o59p69q11l34L05L77r7l78k41k59n83m03O64J600J229j16
53663B37711j149j355j201r83o32m72j037j916j846l80J351J889J018k89j013
53648B29696r24n44m98p68p58j90M05N38N73J034J549J331N30J5lj38n30n17K20
53629B31021J151J845K415K773K392J387P91J216K008K338K347K543K807K781
53615B59815K663K848L218L423L483L498L255K708K381K639L026K977K700K654
53601C01288K645K272J810J744J723J091J65j15J66j98j655k981k812j408k03
$$ plain form
53711 200519 201740 203097 204321 205500 207097 209208 211292 212820 213730 214042 213560 212340 211115 210841 211956
53696 211956 214282 217391 220815 224182 227487 231101 235183 239144 241999 243276 243368 242978 242412 241540 240318
53681 240318 239083 238186 237527 236758 235947 235613 235918 236295 236198 235820 235579 235320 234737 234334 234998 236598 237827 237711
53663 237711 236562 235207 234006 233023 232391 231919 230882 228966 227120 226740 228091 229980 230998 230709 229696
53648 229696 228772 228228 227730 226962 226204 226014 226419 226957 227530 228564 230113 231444 231974 231989 231986 231848 231318 230801 231021
53629 231021 232172 234017 236432 239205 241597 242984 243775 244991 246999 249337 251684 254227 257034 259815
53615 259815 262478 265326 268544 271967 275450 278948 282203 284911 287292 289931 292957 295934 298634 301288
53601 301288 303933 306205 308015 309759 311482 312573 312738 312623 312789 312591 310936 307955 305143 303735 303532
53586C03532k3m18n97l92k24l75o50p02n45m62m93l60mK16Q3p4J04M45N76N47
53566C00184N59L62m34j550k136j785r55l29j78l91p40r34p94l63K97J310K612
53549B94735L543L412K464J679J563J736J856K280L355M640N413N614N715N853
53535C43858N751N441N510O342P559Q516R062R574J0320J1154J1783J2116J2231
53522D59217J2304J2621J3408J4457J5199J5453J5909J7366J9586K1374K1961
53511F38855K1834K2012K2878K3996K4774K4897K4364K3499K2804K2530K2451
53500H94894K2275K2094K2086K1986K1249J9834J8470J7937J8271J8725J8560
53489A116381J7743J6911J6643J6884J7151J7099J6685J5997J5237J4776J4703
$$ plain form
53586 303532 303509 303091 302494 302102 301878 301503 300853 300151 299606 299144 298651 298291 298287 298503 298586 298512 298616 299061 299637 300184
53566 300184 300743 301105 300671 299121 296985 295200 294245 293916 293738 293347 292607 291673 290879 290516 290813 292123 294735
53549 294735 298278 301690 304154 305833 307396 309132 310988 313268 316623 321263 326676 332290 338005 343858
53535 343858 349609 355050 360560 366902 374461 382977 392039 401613 411933 423087 434870 446986 459217
53522 459217 471521 484142 497550 512007 527206 542659 558568 575934 595520 616894 638855
53511 638855 660689 682701 705579 729575 754349 779246 803610 827109 849913 872443 894894
53500 894894 917169 939263 961349 983335 1004584 1024418 1042888 1060825 1079096 1097821 1116381
53489 1116381 1134124 1151035 1167678 1184562 1201713 1218812 1235497 1251494 1266731 1281507 1296210
53478A296210J4334J2752R925O795M108J802k49j705k518l586n873r164j2376
53465A310455j4761j6271j7065j7376j7693j8383j9224j9873k0486k1322k2001
53454A106000k2038k1925k2623k3956k4466k3278k1217j9656j8922j8362j7412
53443H72145j5987j4126j1964r879q252p076o041m952l875k921k068j168J5J620
53429G85471L521N400O995Q266R344J0473J1873J3481J4981J6230J7479J8940
53417I22454K0378K1549K2756K4429K6294K7687K8618K9869L1838L4028L5928
53406A225828L7777L9952M2196M4002M5456M7067M8917N0517N1581N2388N3249
53395A738930N3963N4160N4015N4214N5009N5649N5107N3368N1461N0051M8435
$$ plain form
53478 1296210 1310544 1323296 1333221 1340016 1344124 1345926 1345677 1343972 1341454 1337868 1331995 1322831 1310455
53465 1310455 1295694 1279423 1262358 1244982 1227289 1208906 1189682 1169809 1149323 1128001 1106000
53454 1106000 1083962 1062037 1039414 1015458 990992 967714 946497 926841 907919 889557 872145
53443 872145 856158 842032 830068 820189 811937 804861 798820 793868 789993 787072 785004 783836 783851 785471
53429 785471 788992 794392 801387 809653 818997 829470 841343 854824 869805 886035 903514 922454
53417 922454 942832 964381 987137 1011566 1037860 1065547 1094165 1124034 1155872 1189900 1225828
53406 1225828 1263605 1303557 1345753 1389755 1435211 1482278 1531195 1581712 1633293 1685681 1738930
53395 1738930 1792893 1847053 1901068 1955282 2010291 2065940 2121047 2174415 2225876 2275927 2324362
53384B324362M5421M0953L6333L2847L0533K8375K5380K1358J6851J2415Q048
53373B622876L524r10m784q521j3554k0644k8666l5792m1488m6411n0775n3942
53361B320913n5682n6723n7758n8725n9318n9379n8631n6789n4303n2176n0759
53350A700670m9431m7880m6707m6367m6231m5464m4125m2802m1594m0158l8330
53339A211581l6168l3718l1194k9017k7188k5089k2364j9575j7459j5995j4682
53328I39132j3317j1951j0533r186q386q297q280p675o629n547m256k452n94N98
53314H42627J228K014L163M311N471P126R345J1500J3070J4107J4930J5837J7128
53301I61857J8820K0430K1553K2509K3885K5600K7132K8432K9760L0712L0423
$$ plain form
53384 2324362 2369783 2410736 2447069 2479916 2510449 2538824 2564204 2585562 2602413 2614828 2622876
53373 2622876 2626400 2625490 2620706 2612185 2598631 2577987 2549321 2513529 2472041 2425630 2374855 2320913
53361 2320913 2265231 2208508 2150750 2092025 2032707 1973328 1914697 1857908 1803605 1751429 1700670
53350 1700670 1651239 1603359 1556652 1510285 1464054 1418590 1374465 1331663 1290069 1249911 1211581
53339 1211581 1175413 1141695 1110501 1081484 1054296 1029207 1006843 987268 969809 953814 939132
53328 939132 925815 913864 903331 894145 885759 877462 869182 861507 854878 849331 845075 842623 842029 842627
53314 842627 843855 845869 849032 853343 858814 865940 875285 886785 899855 913962 928892 944729 961857
53301 961857 980677 1001107 1022660 1045169 1069054 1094654 1121786 1150218 1179978 1210690 1241113
53290A241113K8864K7029K5614K4349K2891K1462K0144J8380J5834J3074J0792
53279A469546Q785O351L294J9l143o110q757j0952j2783j4457j6006j7454j9129
53266A379204k1408k4206k6846k8545k9025k8755k8632k9209l0224l1035l1456
53255A069863l1791l2132l2093l1353l0046k8482k6929k5776k5402k5567k5507
53244G54785k4949k4507k4633k4664k3548k1274j8936j7494j6954j6673j6015
53233E25138j4720j3044j1589j0663r910q814p472o525o393o898p600q126q230
53220D05154p877p369p091p162p427p717p853p623p051o567o447o298n569m472
53206C08631l723l477l261l043l507m769n690n202l819k946l011l197k959k828
$$ plain form
53290 1241113 1269977 1297006 1322620 1346969 1369860 1391322 1411466 1429846 1445680 1458754 1469546
53279 1469546 1478331 1484682 1487976 1487995 1484852 1478742 1469985 1459033 1446250 1431793 1415787 1398333 1379204
53266 1379204 1357796 1333590 1306744 1278199 1249174 1220419 1191787 1162578 1132354 1101319 1069863
53255 1069863 1038072 1005940 973847 942494 912448 883966 857037 831261 805859 780292 754785
53244 754785 729836 705329 680696 656032 632484 611210 592274 574780 557826 541153 525138
53233 525138 510418 497374 485785 475122 465212 456398 448926 442401 436008 429110 421510 413384 405154
53220 405154 397277 389908 382817 375655 368228 360511 352658 345035 337984 331417 324970 318672 313103 308631
53206 308631 304908 301431 298170 295127 291620 286851 281161 275959 272140 269194 266183 262986 260027 257199
53192B57199l369m161m304l556k439j511r21o05m88n25p46j152j500j384p64k27
53176B29547l57j037j619j740j597j468j352j158q91o04l68l64p16j198j410j302
53160B12366j179j160j010p19p16j171j485r74J43R62R32K75n85j423k024k085
53144B00147j594r66n38j74M45J248J777J661J016L46P8J11j31r70j864j871q78
53127A97843O7j0p51r11m8Q81Q18j4m65L3R15J418J483J439J263P53K10K98J020
53108B06242J428O78q96k171k496k196j832j559j274j075j179j506j676j479j145
53093A87864j016j018p18Q9R78J287Q59J84j48n0J35J13j7P3N15J001J028M80
53075A91639k01n35n43n11m51j77J88K64L8q1N9J03k12o42r49j227j439j155k70
$$ plain form
53192 257199 253830 249669 245365 241809 239370 237859 236938 236333 235845 235320 234574 233422 231922 230538 229774 229547
53176 229547 229190 228153 226534 224794 223197 221729 220377 219219 218328 217724 217356 216992 216276 215078 213668 212366
53160 212366 211187 210027 209017 208298 207582 206411 204926 203952 204095 205057 205989 206264 205679 204256 202232 200147
53144 200147 198553 197587 197049 196875 197320 198568 200345 202006 203022 203368 203446 203557 203426 202456 200592 198721 197843
53127 197843 197910 197900 197149 196238 196190 197071 197889 197875 197410 197443 198358 199776 201259 202698 203961 204714 204924 205222 206242
53108 206242 207670 208348 207452 205281 202785 200589 198757 197198 195924 194849 193670 192164 190488 189009 187864
53093 187864 186848 185830 185112 185201 186179 187466 188325 188509 188361 188311 188446 188559 188542 188615 189130 190131 191159 191639
53075 191639 191438 190903 190360 189849 189398 189221 189409 189673 189711 189630 189689 189792 189580 188938 187989 186762 185323 184168 183898
53056A83898N26N81J84J5O1j43m82l69J92M79J23m36p14p13n49j92J64N6o16j395
53036A80670j871k014j780j010L7O24L76l21r47j322j271n67M02P02J08m36k58
53019A71122m4o81j687j859j050j55L97R38J370R71k70j204r10J83J061J344J287
53002A70813J078P02K51r8j84J35P77J192Q56R8j61K51L93l60j307j417p19L9
52984A72339N70J015J143O07j26j61M41O65P9n40m56K6L22N86J225J995K317K174
52966A84221K007J896J535R20M39K54J76J27K29L95L50Q4j81n10j209k036k211
52949A86486j503p49q19j485j897j826j751j891j809j182l25K12K22j16m75m96
52933A70596QP84J281J214Q29N01L22K30K43L51L82K21mj44k85n35p46p21n84
$$ plain form
53056 183898 184424 185005 185189 185204 185265 185122 184640 184271 184463 184942 185065 184629 183915 183202 182653 182461 182625 182681 182065 180670
53036 180670 178799 176785 175005 173995 174032 174656 175032 174711 173764 172442 171171 170604 171006 171708 171816 171380 171122
53019 171122 171078 170397 168710 166851 165801 165646 166043 166981 168351 169322 169052 167848 166938 167121 168182 169526 170813
53002 170813 171891 172593 172844 172746 172562 172697 173474 174666 175522 175620 175459 175710 176103 175743 174436 173019 172300 172339
52984 172339 172909 173924 175067 175674 175548 175387 175828 176493 176572 176032 175576 175602 175924 176510 177735 179730 182047 184221
52966 184221 186228 188124 189659 190579 191018 191272 191448 191575 191804 192199 192549 192633 192452 191942 190733 188697 186486
52949 186486 184983 184234 183415 181930 180033 178207 176456 174565 172756 171574 171249 171461 171683 171567 171092 170596
52933 170596 170604 171388 172669 173883 174712 175213 175535 175765 176008 176359 176741 176962 176958 176814 176529 175994 175248 174527 173943
52914A73943o14p82p73m77j31N5Q3p9n56j165j372r07j87J96K20L30O66Q62O37
52895A69949J96r1j59j94k82l60l62k43R3P08J420J825J620R57L81L58P76J023
52877A77615P05J08j99j23n3j74j75J99P42J098J221J206J028P76Q39J424K089
52860A88326K210J763J240Q55L91k11o79r36j292j873k298k175j632j050o39m55
52844A81545o01j093j709k185k511k789k929k636j675k26J065J472R48K85K23
52829A67184N46N03j9m03l18r3O5L53N98J10j177k211k132j419r13m77M50J443
52811A62090J518P41K51O52J409J961K392K662K245J059o3m22l84o53j155j330
52795A72973j157j173j589j988j945j518j056p70o10l99o7K42L14J53l4j15j37
$$ plain form
52914 173943 173329 172547 171774 171297 171166 171221 171304 171225 170669 169504 168132 167225 167038 167234 167454 167784 168450 169312 169949
52895 169949 170145 170054 169895 169701 169419 169059 168697 168454 168547 169255 170675 172500 174120 175077 175458 175816 176592 177615
52877 177615 178320 178428 178229 178106 178053 177879 177704 177903 178645 179743 180964 182170 183198 183974 184813 186237 188326
52860 188326 190536 192299 193539 194394 194785 194574 193895 192959 191667 189794 187496 185321 183689 182639 182000 181545
52844 181545 180944 179851 178142 175957 173446 170657 167728 165092 163417 163191 164256 165728 166676 166961 167184
52829 167184 167730 168233 168214 167811 167493 167400 167465 167818 168416 168526 167349 165138 163006 161587 160674 160197 160647 162090
52811 162090 163608 164349 164600 165252 166661 168622 171014 173676 175921 176980 176917 176495 176111 175458 174303 172973
52795 172973 171816 170643 169054 167066 165121 163603 162547 161777 161167 160768 160701 160943 161257 161410 161376 161261 161124
52778A61124p9J76O12R50R71P66N94N88O66O46L40l13j115j764k064j952j388
52761A58758m70M45R84J142J155J104R16P00O99Q70Q70N88L23L40M94M54Q0m90
52743A68962r15p70N5J074J562J309P72M76N60R19J397J731J627J108N86M37O35
52726A81525Q61Q22N02K47M34Q72P86k14j439j871j412p86m35k10j07l60q04q47
52708A77564l83Op2m22r05j636k277k071r67K5J74j02j77k49o60r45m92L80P88
52689A67579N69L32M79Q07R37O99J74k50j56L05N27M27O06J107R36m15j786j773
52671A71104p10n2j98k45K70P33O86M87M90N57O41R95J477J474R08N06P36J186
52653A81045J452J888K911M049M334L408J788K14r65j868k725l432l534k809j747
$$ plain form
52778 161124 161045 161221 161833 162783 163754 164520 165114 165702 166368 167014 167354 167041 165926 164162 162098 160146 158758
52761 158758 158288 158733 159717 160859 162014 163118 164034 164734 165433 166303 167173 167761 168084 168424 168918 169372 169452 168962
52743 168962 168047 167277 167332 168406 169968 171277 172049 172525 173085 174004 175401 177132 178759 179867 180453 180890 181525
52726 181525 182386 183208 183710 183957 184391 185263 186049 185835 184396 182525 181113 180327 179892 179682 179575 179215 178411 177564
52708 177564 177181 177187 177115 176693 175788 174152 171875 169804 168837 168862 169036 168934 168757 168508 167848 166903 166411 166791 167579
52689 167579 168148 168480 168959 169766 170703 171402 171576 171326 171170 171475 172002 172429 173035 174142 175078 174663 172877 171104
52671 171104 170394 170342 170144 169899 170169 170902 171588 172075 172565 173122 173763 174758 176235 177709 178617 179123 179859 181045
52653 181045 182497 184385 187296 191345 195679 199087 200875 201089 200124 198256 195531 192099 188565 185756 184009
52638A84009j063q58p09m71m13n48m50J09P92J162J117Q20N76P86J525K150J872
52621A90406P38m58j201j604j699j206k28M96M82O0k83n47q64r83n95J28O85P71
52603A84098M47M2n4K34M06Lo05n62J94P77O22K66M33J035J540J732J607J110
52585A93325M48K56P59J233Q93J9m30r6M25M02l21j338j962j692p06J90L96J07
52567A91908j09OM14R84J356R64k24j356j579j046n52m46m39k86n1J86L46K15
52549A90291k79p52p94n78n54p21p15m95l40k30J54P52J071Q96O04N85Q07J072
52531A90774J289J350J076N42O3k28n24r06j082q11l54k26n90j036r62j89P98
52514A88984J257R75N08N00Q97J126R03N66N63R27J338J558J608J598J425P37
$$ plain form
52638 184009 182946 182088 181379 180908 180495 179947 179497 179606 180398 181560 182677 183497 184073 184859 186384 188534 190406
52621 190406 191144 190686 189485 187881 186182 184976 184748 185244 185726 185786 185503 184956 184092 183109 182514 182642 183327 184098
52603 184098 184545 184587 184533 184767 185173 185176 184571 184009 184203 184980 185602 185868 186301 187336 188876 190608 192215 193325
52585 193325 193773 194029 194788 196021 196914 196933 196503 196407 196832 197234 196913 195575 193613 191921 191215 191405 191801 191908
52567 191908 191799 191805 192219 193203 194559 195523 195299 193943 192364 191318 190766 190320 189881 189595 189544 189730 190076 190291
52549 190291 190012 189260 188466 187888 187334 186613 185898 185403 185063 184833 184987 185739 186810 187706 188310 188895 189702 190774
52531 190774 192063 193413 194489 195031 195094 194866 194342 193436 192354 191543 191189 190963 190373 189337 188375 188186 188984
52514 188984 190241 191216 191724 192224 193121 194247 195150 195716 196279 197206 198544 200102 201710 203308 204733 205470
52498B05470n49j814k166j519q06q24j292j392r13k69K45N87N76J11l63k77J38
52481A94943J48k89l89K08Q92J130J259J762K372K515K153J626J062N54N05J137
52465B11588J846J775R52K21J20L99O47Q37J033J096Q83M53o2n77r75j200j440
52448B17596j869k265k281k098k201k444k042q31J71O8n88n86J90P31M77qj60
52431B01860k85q04j366j320o53J52Q69J539J926J602O12m31r61q51k53N56J165
52414B03357J268J033R62J387K244L265M081M329M081L982M596N686O619P206
52400B54096P459O751M287N81k583m122m737n480o129n860m845m033l703l251
52386B28431k368j487r26l62M83J259J429R74M07K41N15P04K49o15q27K87K030
$$ plain form
52498 205470 204921 203107 200941 199422 198616 197792 196500 195108 194195 193926 194171 194758 195334 195445 195082 194805 194943
52481 194943 195091 194802 194413 194621 195513 196643 197902 199664 202036 204551 206704 208330 209392 209946 210451 211588
52465 211588 213434 215209 216161 216382 216502 216901 217548 218385 219418 220514 221397 221850 221788 221211 220236 219036 217596
52448 217596 215727 213462 211181 209083 206882 204438 202396 201565 201736 201804 201216 200630 200820 201551 202028 202020 201860
52431 201860 201575 200771 199405 198085 197432 197584 198453 199992 201918 203520 204132 203701 202740 201889 201636 202192 203357
52414 203357 204625 205658 206620 208007 210251 213516 217597 221926 226007 229989 234585 240271 246890 254096
52400 254096 261555 268306 272593 273174 270591 266469 261732 256252 250123 244263 239418 235385 231682 228431
52386 228431 226063 224576 223650 223288 223771 225030 226459 227433 227840 228081 228596 229300 229549 228934 228107 228394 230424
52369B30424L105L192L062L184L134K599K066J964J794Q36o03j435j184m79r4
52354B51565r3j35j44k26j95L32J276J951J799J034L84L13P24J265J638J701J589
52337B64778J709K241K764K818K747L343M610N603N769N669O004O685P443Q543
52323C30726J0075J1158J0906R799R133R272R470R269R007Q885Q571P957P448
52310D51676P224O937O432O038N903N773N593N664N980O114N941N735N470M861
52296E35341M253M394N060N039L985L018K795K276M03k033l532m006m354m626
52282E48013m119k969k055j444l72J111J894J514R19J094J934K959M102N276O028
52267E63885O234O409O793O846O256N732N991O583O556N936N649O077O575O492
$$ plain form
52369 230424 233529 236721 239783 242967 246101 248700 250766 252730 254524 255360 254757 253322 252138 251659 251565
52354 251565 251472 251337 251193 250967 250772 251104 252380 254331 256130 257164 257548 257861 258585 259850 261488 263189 264778
52337 264778 266487 268728 271492 274310 277057 280400 285010 290613 296382 302051 308055 314740 322183 330726
52323 330726 340801 351959 362865 372664 381797 391069 400539 409808 418815 427700 436271 444228 451676
52310 451676 458900 465837 472269 478307 484210 489983 495576 501240 507220 513334 519275 525010 530480 535341
52296 535341 539594 543988 549048 554087 558072 561090 563885 566161 566564 564531 560999 556993 552639 548013
52282 548013 543894 540925 538870 537426 537054 538165 540059 541573 542492 543586 545520 548479 552581 557857 563885
52267 563885 570119 576528 583321 590167 596423 602155 608146 614729 621285 627221 632870 638947 645522 652014
52253F52014O012N667N523N280M966N076N838O594O260M545K392R64M41J68k56
52238G11484o37q79j309k032k490k091r82O7M14k1p61j137q14j68J81J50J81M68
52220F99624P73J057J601K209K125J237O69J436L037M208M621M930N411N625N458
52205G44021N449N826O020N549M736M117L683L137K558K235K123J880J410J060
52191G93804J257J999K731K750J898Q62N23J017J656J796J399P44j1q38j757k916
52175H06914m467o200p502p879p320o138m776l778l525l768l834l447k943k456
52161G38881j462M45K750M424M942M489L499K447J704J230N06o86j788k160j945
52146G57276j620j091L1J421K176K033J636J509J467J225Q71M81j49r79j550j599
$$ plain form
52253 652014 658026 663693 669216 674496 679462 684538 690376 696970 703230 707775 710167 711131 711572 711740 711484
52238 711484 710847 709968 708659 706627 704137 702046 701064 701131 701545 701524 700763 699626 698812 698644 698825 698975 699156 699624
52220 699624 700397 701454 703055 705264 707389 708626 709295 710731 713768 717976 722597 727527 732938 738563 744021
52205 744021 749470 755296 761316 766865 771601 775718 779401 782538 785096 787331 789454 791334 792744 793804
52191 793804 795061 797060 799791 802541 804439 805301 805824 806841 808497 810293 811692 812436 812425 811587 809830 806914
52175 806914 802447 796247 788745 780866 773546 767408 762632 758854 755329 751561 747727 744280 741337 738881
52161 738881 737419 737864 740614 745038 749980 754469 757968 760415 762119 763349 763855 763169 761381 759221 757276
52146 757276 755656 754565 754596 756017 758193 760226 761862 763371 764838 766063 766934 767415 767266 766287 764737 763138
52130G63138j356r61q3J529L597N750P873R762J0988J1635J2540J4216J6039J7132
52116H71799J7599J8055J8359J7750J6148J4396J3049J1720R894P703N613L831
52104A025916K323J044j49j373k335k439j605o54m60r78j403j225p18m18m91p66
52088A014269j259k300l994n739o687o731o574o634o373n233l757l003k963k484
52074I50538r95N43R60M82L83J314K738L800M209M172M017M043M412M964N297
52059I90877N098M342L160J749L30r44k062k945l283k875k114j738j955k206k062
52044I83372k040l001m910o702p538p712q045q796r539r859r637q768p166n169
52030H84490l443k278j348l81L10K92l27j072j689k157k344k178j982k213k817
$$ plain form
52130 763138 761782 760821 760738 762267 765864 771614 779487 789249 800237 811872 824412 838628 854667 871799
52116 871799 889398 907453 925812 943562 959710 974106 987155 998875 1008769 1016472 1022085 1025916
52104 1025916 1028239 1029283 1029134 1027761 1025426 1022987 1021382 1020728 1020268 1019290 1017887 1016662 1015944 1015526 1015035 1014269
52088 1014269 1013010 1010710 1006716 1000977 994290 987559 980985 974351 967978 962745 958988 955985 953022 950538
52074 950538 949543 950086 951046 951528 951911 953225 955963 959763 963972 968144 972161 976204 980616 985580 990877
52059 990877 995975 1000317 1003477 1005226 1005556 1004612 1002550 999605 996322 993447 991333 989595 987640 985434 983372
52044 983372 981332 978331 973421 966719 959181 951469 943424 934628 925089 915230 905593 896825 889659 884490
52030 884490 881047 878769 877421 877040 877350 877642 877315 876243 874554 872397 870053 867875 865893 863680 860863
52015H60863l314l474l497l523l453l441m032n544p584r413j0627j1314j1782
52002G79865j2324j3067j3890j4581j5156j5753j6301j6520j6379j6145j5822
51991F13927j4968j3374j1611j0493j0091r668q613p157o043n664n673n509n231
$$ plain form
52015 860863 857549 854075 850578 847055 843602 840161 836129 830585 823001 813588 802961 791647 779865
52002 779865 767541 754474 740584 726003 710847 695094 678793 662273 645894 629749 613927
51991 613927 598959 585585 573974 563481 553390 543722 535109 527952 521909 516245 510572 505063 499832
$$ [...]
##END NTUPLES=NMR SPECTRUM
##END=
