
##TITLE=UV1106_M1_1161-1249_7180486_CHvc93Ckny
##JCAMPDX= 6.0         $$ Bruker NMR JCAMP-DX V2.0
##DATA TYPE= NMR SPECTRUM
##DATA CLASS= NTUPLES
##ORIGIN= BRUKER
##OWNER= Administrator
$$ 1.72 TOPSPIN		Version 2.1
$$ 2012-12-05 03:41:15.542 -0500  Administrator@X
$$ Compression mode = diff/dup
##.OBSERVE FREQUENCY= 400.02188249412
##.OBSERVE NUCLEUS= ^1H
##.ACQUISITION MODE= SIMULTANEOUS (DQD)
##.ACQUISITION SCHEME= undefined
##.AVERAGES= 8
##.DIGITISER RES= 22
##SPECTROMETER/DATA SYSTEM= spect
##.PULSE SEQUENCE= zg30
##.SOLVENT NAME= COFFEE_meoh
##.SHIFT REFERENCE= INTERNAL, COFFEE_meoh, 1, 14.98509
##AUDIT TRAIL= $$ (NUMBER, WHEN, WHO, WHERE, PROCESS, VERSION, WHAT)
$$ ##TITLE= Audit trail, TOPSPIN		Version 2.1
$$ ##JCAMPDX= 5.01
$$ ##ORIGIN= Bruker BioSpin GmbH
$$ ##OWNER= Administrator
$$ $$ E:\/data/COFFEE/nmr/UV1106_M1_1161-1249_7180486_CHvc93Ckny/10/pdata/1/auditp.txt
$$ ##AUDIT TRAIL=  $$ (NUMBER, WHEN, WHO, WHERE, PROCESS, VERSION, WHAT)
(   1,<2012-12-05 03:41:07.307 -0500>,<Administrator>,<X>,<go>,<TOPSPIN 2.1>,
      <created by zg
	started at 2012-12-05 03:40:00.760 -0500,
	POWCHK enabled, PULCHK disabled,
       configuration hash MD5:
       86 BA 57 50 F2 9D 5C 9B 26 00 A9 28 5F 66 2E 89
       data hash MD5: 64K
       12 06 13 85 3E 19 A5 95 3C F1 92 AC D2 C4 01 A6>)
(   2,<2012-12-05 03:41:10.479 -0500>,<Administrator>,<X>,<proc1d>,<TOPSPIN 2.1>,
      <Start of raw data processing
       efp LB = 0 FT_mod = 6 PKNL = 1 PHC0 = 0 PHC1 = 0 SI = 32K 
       data hash MD5: 32K
       10 4E 4E B0 C9 8F AC A6 47 B5 70 B9 56 5C CA 7F>)
(   3,<2012-12-05 03:41:10.964 -0500>,<Administrator>,<X>,<proc1d>,<TOPSPIN 2.1>,
      <pk PHC0 = 96.72913 PHC1 = 0 
       data hash MD5: 32K
       AC 8E 5D DE 0D 43 CD FC 8F 6C 49 F3 44 FB 78 BC>)
(   4,<2012-12-05 03:41:11.182 -0500>,<Administrator>,<X>,<proc1d>,<TOPSPIN 2.1>,
      <abs ABSG = 1 
       data hash MD5: 32K
       5C 9F F7 81 AF 86 9C 4C 1B 6E 2F F1 8F FD C3 4A>)
(   5,<2012-12-05 03:41:11.323 -0500>,<Administrator>,<X>,<proc1d>,<TOPSPIN 2.1>,
      <abs ABSG = 2 
       data hash MD5: 32K
       41 4E F7 81 D1 EA 4F 75 9F 95 90 5C 9B A1 5D 81>)
(   6,<2012-12-05 03:41:11.464 -0500>,<Administrator>,<X>,<proc1d>,<TOPSPIN 2.1>,
      <abs ABSG = 3 
       data hash MD5: 32K
       A7 26 BC 25 BF AF 2E 0A 02 8F CF 24 44 2E 71 78>)
(   7,<2012-12-05 03:41:11.620 -0500>,<Administrator>,<X>,<proc1d>,<TOPSPIN 2.1>,
      <abs ABSG = 4 
       data hash MD5: 32K
       D7 03 70 96 F1 83 A8 DB A3 A6 26 90 8E 9D E2 28>)
(   8,<2012-12-05 03:41:11.776 -0500>,<Administrator>,<X>,<proc1d>,<TOPSPIN 2.1>,
      <abs ABSG = 5 
       data hash MD5: 32K
       47 C9 1A F0 EB AD 08 04 82 81 2D 90 36 CE 88 31>)
$$ ##END=
$$ 
$$ $$ hash MD5
$$ $$ 35 15 1E 2E E0 10 EE 34 D5 88 6B DF BD 18 54 6E
##$RELAX= 
##$RELAX= 
##$RELAX= 
##$RELAX= 
##$RELAX= 
##$RELAX= 
##$RELAX= 
$$ Bruker specific parameters
$$ --------------------------
##$DU= <E:\>
##$EXPNO= 10
$$ [...]
150 150 150 150 150 150 150 150
##$TP07= 0
##$TPNAME0= <>
##$TPNAME1= <>
##$TPNAME2= <>
##$TPNAME3= <>
##$TPNAME4= <>
##$TPNAME5= <>
##$TPNAME6= <>
##$TPNAME7= <>
##$TPOAL= (0..7)
0.5 0.5 0.5 0.5 0.5 0.5 0.5 0.5
##$TPOFFS= (0..7)
0 0 0 0 0 0 0 0
##$TUNHIN= 0
##$TUNHOUT= 0
##$TUNXOUT= 0
##$USERA1= <user>
##$USERA2= <user>
##$USERA3= <user>
##$USERA4= <user>
##$USERA5= <user>
##$V9= 5
##$VALIST= <valist>
##$VCLIST= <CCCCCCCCCCCCCCC>
##$VD= 0
##$VDLIST= <DDDDDDDDDDDDDDD>
##$VPLIST= <PPPPPPPPPPPPPPP>
##$VTLIST= <TTTTTTTTTTTTTTT>
##$WBST= 2048
##$WBSW= 25
##$XGAIN= (0..3)
0 0 0 0
##$XL= 0
##$YL= 0
##$YMAX_a= 679226
##$YMIN_a= -578645
##$ZGOPTNS= <>
##$ZL1= 120
##$ZL2= 120
##$ZL3= 120
##$ZL4= 120
##$ABSF1= 14.98509
##$ABSF2= -5.573092
##$ABSG= 5
##$ABSL= 3
##$ALPHA= 0
##$AQORDER= 0
##$ASSFAC= 0
##$ASSFACI= 0
##$ASSFACX= 0
##$ASSWID= 0
##$AUNMP= <proc_prof1d_extract_pilot.lims>
##$AXLEFT= 0
##$AXNAME= <>
##$AXNUC= <1H>
##$AXRIGHT= 0
##$AXTYPE= 0
##$AXUNIT= <>
##$AZFE= 0.1
##$AZFW= 0.1
##$BCFW= 0
##$BC_mod= 0
##$BYTORDP= 0
##$COROFFS= 0
##$CY= 15
##$DATMOD= 1
##$DC= 0
##$DFILT= <>
##$DTYPP= 0
##$F1P= 0
##$F2P= 0
##$FCOR= 0.5
##$FTSIZE= 32768
##$FT_mod= 6
##$GAMMA= 0
##$GB= 0
##$INTBC= 1
##$INTSCL= 1
##$ISEN= 128
##$LB= 0
##$LEV0= 0
##$LPBIN= 0
##$MAXI= 10000
##$MC2= 0
##$MEAN= 0
##$ME_mod= 0
##$MI= 0
##$NCOEF= 0
##$NC_proc= -8
##$NLEV= 6
##$NOISF1= 0
##$NOISF2= 0
##$NSP= 0
##$NTH_PI= 0
##$NZP= 0
##$OFFSET= 14.98509
##$PC= 1
##$PHC0= 96.72913
##$PHC1= 0
##$PH_mod= 1
##$PKNL= yes
##$PPARMOD= 0
##$PPDIAG= 0
##$PPIPTYP= 0
##$PPMPNUM= 2147483647
##$PPRESOL= 1
##$PSCAL= 4
##$PSIGN= 0
##$PYNMP= <proc.py>
##$REVERSE= no
##$SF= 400.02
##$SI= 32768
##$SIGF1= 0
##$SIGF2= 0
##$SINO= 400
##$SIOLD= 32768
##$SPECTYP= <>
##$SREGLST= <1H.CDCl3>
##$SSB= 0
##$STSI= 32768
##$STSR= 0
##$SW_p= 8223.68421052631
##$SYMM= 0
##$S_DEV= 0
##$TDeff= 65536
##$TDoff= 0
##$TI= <>
##$TILT= no
##$TM1= 0
##$TM2= 0
##$TOPLEV= 0
##$USERP1= <user>
##$USERP2= <user>
##$USERP3= <user>
##$USERP4= <user>
##$USERP5= <user>
##$WDW= 1
##$XDIM= 32768
##$YMAX_p= 477888099
##$YMIN_p= -692734
##$CURPLOT= <Network HP LaserJet P1505>
##$CURPRIN= <$Network HP LaserJet P1505>
##$DFORMAT= <normdp>
##$LAYOUT= <+/1D_H.xwp>
##$LFORMAT= <normlp>
##$PFORMAT= <normpl>
##$SURQMSG= 1
$$ End of Bruker specific parameters
$$ ---------------------------------
##NTUPLES= NMR SPECTRUM
##VAR_NAME=  FREQUENCY,     SPECTRUM/REAL,   SPECTRUM/IMAG
##SYMBOL=    X,             R,               I
##VAR_TYPE=  INDEPENDENT,   DEPENDENT,       DEPENDENT
##VAR_FORM=  AFFN,          ASDF,            ASDF
##VAR_DIM=   32768,         32768,           32768
##UNITS=     HZ,            ARBITRARY UNITS, ARBITRARY UNITS
##FACTOR=    0.250966925370066, 1,           1
##FIRST=     8223.43324360094, 31256,        -18599
##LAST=      0,             49843,           181102
##MIN=       0,             -692734,         0
##MAX=       8223.43324360094, 477888099,    0
$$ Real data points
##PAGE= N=1
##DATA TABLE= (X++(R..R)), XYDATA
$$ [...]
19558a35861H2252K41750r2655a53333N5590j51486c2909k29847p5222E8688L10492
19547C69180b81172n7844L4708D9519b12141A65057L3921d6687k93910j0635E4200
19535A02742a45329k58248A46589a66257j36823a15811B28352H8024D1291a21575
19524a36761P315N269M3679K1068j61230Q5114I6651C4730L41563A12100a1241
19512A14943c72845a04431R742n417D41016e7881A70995b1478k5229l76254C96834
19500b23090k9865Q9358m7453Q3853j15230O0506l3705c6664j38904K6713o8545
19489b17400D1021b2875j00631j29480R0875l2320R3227m5769C20054j35751a49789
19477c0852C9789b30009G2662a15345B31516D9732a37423N6654A39983a66290
$$ y = [-135861, 82252, 324002, 231347, -153333, -97743, -249229, -32909, -262756, -337978, 58688, 369180, -281172, -339016, -304308, 49519, -212141, 165057, 198978, -46687, -340597, -351232, 54200, 102742, -145329, -403577, 146589, -166257, -303080, -115811, 228352, 88024, 41291, -121575, -136761, -129446, -124177, -80498, -59430, -220660, -135546, 96651, 34730, 376293, 112100, -11241, 114943, -372845, -104431, -94689, -100106, 441016, -57881, 170995, -21478, -46707, -422961, 396834, -223090, -252955, -163597, -211050, -127197, -242427, -181921, -215626, -36664, -175568, -148855, -217400, 41021, -22875, -123506, -252986, -162111, -194431, -101204, -146973, 320054, 184303, -149789, -30852, 39789, -230009, 72662, -115345, 231516, 49732, -137423, -80769, 139983, -166290]
19466a67355B21786c0974C63696c00638A1975n167L6366b29678P4051j94629m6688
19455c96944J00280e2463b729j16726n930A35925p319i4675B23606a26482G5919
19443c07140a38453j2360B29421a79992D5395f9367j64651B69426c6239I9772
19432B14068a40315l0322N9547a6093B5838Q8162E6144a9990p4703k95140h3213
19420E2859R5162D9239G881K87377j7286a94807k04200a5983j89649C9351h8339
19408A80452o6763b56143a15972A76760f2995A05185c8334B59407r5198e5950
19397c2002p3220L4433L3146j16070c7196p4350L4077m417o2171m1349A11939
19385c08125J18698B8832b8692l58367d6598D141c0525F7922f5204I9775a61954
$$ y = [-167355, 221786, -30974, 363696, -300638, 11975, 6808, 43174, -229678, -155627, -350256, -396944, -296664, -52463, -2729, -119455, -125385, 135925, 128606, -94675, 223606, -126482, 75919, -307140, -138453, -150813, 229421, -179992, 45395, -69367, -234018, 269426, -36239, 99772, 214068, -140315, -170637, -111090, -16093, 25838, 114000, 56144, -19990, -94693, -389833, -83213, 52859, 148021, 49239, 7881, 295258, 277972, -194807, -399007, -15983, -205632, 39351, -88339, 180452, 113689, -256143, -115972, 176760, -62995, 105185, -38334, 259407, 164209, -55950, -32002, -105222, -70789, -37643, -153713, -37196, -111546, -77469, -81886, -144057, -185406, 111939, -308125, -189427, 28832, -28692, -387059, -46598, 4141, -30525, 67922, -65204, 99775, -161954]
19373a15481A29816c82929a01390c3080D3556O5989I050a04795a794j95367B2356
19361i6609n7549l74687a77850A48896a4065o1326j17741L7975D0128a60618C3991
19349F3121B4660A1894M174e0282K1441j36515d9760m990l17628J00902g4166
19337c85500a53430A92790g4143F6668E571a37895D87143a75932e5390q5359N7120
19326h3629A77201d06719d4735j75482J09078B06844H7434a09240A73236h8790
19315G8219a78607F400a79354J7903P4039C41642a95341k0453C15234i2961B03134
19303b43660K7177c9171D0124H374a62695A86403b12182C055d12541J82093J11010
19292a19438e9185D47744a19581B56805A2404O3592a94294B9058M1971D114J35511
$$ y = [-115481, 129816, -382929, -101390, -33080, 43556, 109545, 9050, -104795, -1794, -197161, 22356, -96609, -154158, -528845, -177850, 148896, -14065, -75391, -193132, -155157, 40128, -160618, 33991, 63121, 24660, 11894, 16068, -50282, -28841, -165356, -49760, -54750, -372378, -271476, -74166, -385500, -153430, 192790, -74143, 66668, 5571, -137895, 487143, -175932, -55390, -140749, -83629, 177201, -406719, -44735, -220217, -111139, 206844, 87434, -109240, 173236, -88790, 78219, -178607, 6400, -179354, -161451, -87412, 341642, -195341, -215794, 315234, -92961, 203134, -243660, -216483, -39171, 40124, 8374, -162695, 186403, -212182, 3055, -412541, -230448, -119438, -59185, 447744, -119581, 256805, 12404, 75996, -194294, 29058, 71029, 4114, 139625]
19281A39625A5012J9234b3977G8259J1437c32209J14545I8231J05078F9021A2885
19269I6786d1570k79156C8929L5651c13923J01510j83747A20713a19552A9388
19258A82582b90828c460j84264q3299P3243Q1662G3433a2868l34477H4450g4337
19246b61623A18248N8603a93030A37646d7795k09594h3720A06309i3685b0249
19235e53851K37033a8697j81254j46532a18205k84679A41598b57300L8798n6417
19225b74919G9613b00335q1058A30617c88872f0007A79973E9951M4699a198A28925
19213C39983b58603O9381G1579b2266D6909N6886a70085j06029a16044E4598J30364
19202A84962a20563m4207l4247O9041J3017A5271J3824l334Q5986J88095j43634
$$ y = [139625, 15012, 34246, -23977, 78259, 89696, -332209, -217664, 98231, 203309, 69021, 12885, 96786, -41570, -320726, 38929, 74580, -313923, -212413, -396160, 120713, -119552, 19388, 182582, -290828, -3460, -187724, -271023, -197780, -116118, 73433, -12868, -347345, 84450, -74337, -261623, 118248, 176851, -193030, 137646, -47795, -257389, -83720, 106309, -93685, -20249, -553851, -316818, -18697, -199951, -346483, -118205, -402884, 141598, -257300, -218502, -274919, 79613, -200335, -281393, 130617, -388872, -60007, 179973, 59951, 104650, -1198, 128925, 339983, -258603, -189222, 71579, -22266, 46909, 103795, -170085, -276114, -116044, 54598, 184962, -120563, -164770, -199017, -129976, -116959, 15271, 29095, 25761, 111747, 299842, 156208]
19191A56208a03272B7501c70585J23516a3180D4657k1664K33491i9473F4123M6776
19180A10899D2727a94170a9174A08684B358J2053d93364A12402l5772c18430f6861
19168i5695A55611l5798l8730A1156c18383E9117d9641k99818a38785C52644i0627
19156d2527q1298M9934b0724j17198B8256d5687D0759g3138i117B75724a04038
19144B7778L2142J36331c01699J49591A68557a69540G3969K81706g425A97900
19133a83377A0379J0781d1396J7170k66118a41612C90000d1604j08154j8419K3935
19122a44242L1220A47154b13570A47353d08766D4645a14532j8862M3443C471K00
19111C671a24650A23675i6322B1821i5700n313o3421H4428J00693p6748M1805
$$ y = [156208, -103272, 27501, -370585, -247069, -13180, 44657, 22993, 256484, -99473, 64123, 110899, 42727, -194170, -19174, 108684, 2358, 14411, -493364, 112402, 76630, -318430, -66861, -95695, 155611, 119813, 81083, 11156, -318383, 59117, -49641, -349459, -138785, 352644, -90627, -42527, -123825, -73891, -20724, -137922, 28256, -45687, 40759, -73138, -9117, 275724, -104038, 27778, 59920, 196251, -301699, -152108, 168557, -169540, 73969, 355675, -7425, 197900, -183377, 10379, 21160, -41396, -24226, -290344, -141612, 390000, -41604, -149758, -168177, -144242, -113022, 147154, -213570, 147353, -408766, 44645, -114532, -133394, -89951, 3471, 3671, -124650, 123675, -96322, 21821, -95700, -101013, -164434, 84428, 185121, 108373, 150178]
19100A50178r053a46400o1848A88096a19247n0500k8705A05439J43373a14007
19089i7157o3184C1816h1648I7247L7060a48134B79256a19933A42382C250J82203
19078A85453F0355K1020J39562r9965E2352a32819c2873D2502L91809B06802B9983
19066b3317E0782i1517j70369a433n0074I9949a00163J7922o9749g0510j05449
19055a75959J5155A04777b93301a32040m9070d9046l15875e8416m6935o3781k2825
19044a91957Q1498A75494A1186J50531b9017k90622i9316j09448A4085a54370
19033A4844b47764A16799d9514A37987C4145b08908b3590j24195A44733a45995
19022c1063j26583j81449d9274k23502L2839J19439N9237o3008B1144b64629D2669
$$ y = [150178, 141125, -146400, -208248, 188096, -119247, -169747, -198452, 105439, 248812, -114007, -97157, -160341, 31816, -81648, 97247, 134307, -148134, 279256, -119933, 142382, 3250, 185453, 60355, 81375, 220937, 120972, 52352, -132819, -32873, 42502, 434311, 206802, 29983, -23317, 50782, -91517, -261886, -1433, -51507, 99949, -100163, -82241, -151990, -70510, -175959, -160804, 104777, -293301, -132040, -181110, -49046, -364921, -58416, -105351, -169132, -191957, -110459, 175494, 11186, 161717, -29017, -319639, -99316, -208764, 14085, -154370, 14844, -247764, 116799, -49514, 137987, 34145, -208908, -23590, -147785, 144733, -145995, -31063, -157646, -339095, -49274, -272776, -239937, -120498, -61261, -124269, 21144, -264629, 42669]
19010b30567B01870b67065A76727b68188E9930B3110b04507F4955g321B28515
18999c68225A57072a44735r8569h6368B68334H4304a79616K7504A55315A879c83716
18987C2587p102L26684a7198k7650A84864B8335L6295a9580A34862b23117N917
18976b17200f008A53420F531r84e2387A86906C010b7698F5149c13443P9046P1366
18964a63031B63376I1648E233J66637a84719B64708B9102J26518P436k8402b16479
18952b00136c3961k31281B08702p1443d5616j84226A09221A9530a20204L327B5826
18940e1896A06959B7751d21817a05069B32149n0196b17792A25538d08016H0094
18929d0511j49069B41268C7195a65597G7920J15751b5323j84368A47296K00920
$$ y = [-230567, 201870, -267065, 176727, -268188, 59930, 23110, -204507, 64955, -7321, 228515, -368225, 157072, -144735, -243304, -86368, 268334, 84304, -179616, -152112, 155315, 1879, -383716, 32587, 25485, 352169, -17198, -44848, 184864, 28335, 64630, -19580, 134862, -223117, -217200, -6008, 153420, 6531, 5547, -52387, 186906, 3010, -27698, 65149, -313443, -234397, -163031, 263376, 91648, 5233, 171870, -184719, 264708, 29102, 155620, 163056, 134654, -216479, -200136, -33961, -265242, 208702, 137259, -45616, -229842, 109221, 19530, -120204, -116877, 25826, -51896, 106959, 27751, -421817, -105069, 232149, 181953, -217792, 125538, -408016, 80094, -40511, -189580, 241268, 37195, -165597, 77920, 193671, -25323, -209691, 147296, 348216]
18919C48216a27843H9482h3436j75096k34571a42818B20490b59932A1577O1209
18909G2786l3355a64757A37224O3138b12860A12539a9530B6253R3028a5960j32986
18898a48946d5291A17983e5886k73666a49435m8581N8570f4671l0033l31519a61092
18886B56889L5844B4052b19895H6764a9226D0479P9595K0198B7475M7320a7001
18874A26059o1257b18059B0025a41526B07359K09819A0889a11439k41727b8902
18863a26878h699r4829j9196K8207B66502H806e6431j19780q428A30073c37570
18851a22239k52204A19140d75556b06721J4862C2328K52794b22172J00608A53299
18840c97241J54880A95950f7855H1963h0545p3980H9013b1626k51532A23797A6731
$$ y = [348216, -127843, 89482, -83436, -258532, -493103, -142818, 220490, -259932, 11577, 72786, 39431, -164757, 137224, 200362, -212860, 112539, -19530, 26253, 119281, -15960, -148946, -45291, 117983, -55886, -329552, -149435, -198016, -139446, -64671, -94704, -426223, -161092, 256889, 292733, 24052, -219895, 86764, -19226, 40479, 120074, 140272, 27475, 74795, -17001, 126059, 64802, -218059, 20025, -141526, 207359, 417178, 10889, -111439, -353166, -28902, -126878, -8699, -103528, -122724, -94517, 266502, 8806, -56431, -176211, -184639, 130073, -337570, -122239, -374443, 119140, -475556, -206721, -191859, 32328, 285122, -222172, -121564, 153299, -397241, -242361, 195950, -67855, 81963, -80545, -154525, 89013, -21626, -273158, 123797, 16731]
18828a34394A47390g454j06058a5545C5853P9010b40358i3112A1607K038a48961
18816b51914O9324b0602C37953e0191k01042h1709d0705A84893G0932K44541B4105
18804D0595K8680C1097g2100E3731d0657H2948i8992q7432m5916h2457B47622
18792a9869A86991D2529i6694a603B1468a2189O46j2173l16998j61260a81492
18780A18897Q6740H5584a54043f5725A72674a49605o322p8051J6997A02312a63356
18768g4106K4795r927o4743L2017n9849d9160B21483c24131r7205h7598I5223
18756b0164l95568D9326O3505a43442A29841b2736B6406L0555J80135A00317J7643
18745A17960J67549E3613c14002A7942a84696m034H3583g6558K8638k52640B96930
$$ y = [-134394, 147390, -7454, -113512, -15545, 35853, 114863, -240358, -93112, 11607, 13645, -148961, -251914, -182590, -20602, 337953, -50191, -251233, -81709, -40705, 184893, 70932, 315473, 24105, 40595, 69275, 31097, -72100, 53731, -40657, 82948, -98992, -186424, -232340, -82457, 247622, -19869, 186991, 42529, -96694, -1603, 21468, -12189, -11543, -23716, -340714, -501974, -181492, 118897, 205637, 85584, -154043, -65725, 172674, -149605, -155927, -233978, -216981, 102312, -163356, -74106, -49311, -59238, -123981, -91964, -151813, -49160, 221483, -324131, -421336, -87598, 95223, -20164, -415732, 49326, 112831, -143442, 129841, -22736, 26406, 56961, 237096, 100317, 117960, 285509, 53613, -314002, 17942, -184696, -188730, 83583, -76558, -47920, -300560, 296930]
18733g5224B15031b40502j57016e9338k0685j77866d1887r4613C77442a51968
18722d300l51282A69721a38885L9208d1622j51619p3908a33404n53710D3305b42530
18710b60054F8338k3313a47583j48392B69791d1458o2110A03761a11546A71838
18699a41076p0392P9970j85431H6217n831c85565A93055O6822B5708J97472a38125
18687E2210D829b94922B06171a9213B0339K23285f4957k4555H4691b0331j84998
18676b05329C56582b97844F928J98232B6509f2506K0765F669a88083f8664K6352
18665d2312a6767A00745c77764d4118j88608A9723O1525b43878A9788c28693a38724
18653c6677h860A39474k537c7460q890k10118A69785i5830G5452K1492a95186
$$ y = [-75224, 215031, -240502, -397518, -59338, -80023, -257889, -41887, -136500, 377442, -151968, -4300, -355582, 169721, -138885, -99677, -41622, -193241, -267149, -133404, -687114, 43305, -242530, -260054, 68338, 45025, -147583, -295975, 269791, -41458, -103568, 103761, -111546, 171838, -141076, -211468, -131498, -316929, 86217, 80386, -385565, 193055, 259877, 25708, 223180, -138125, 52210, 4829, -294922, 206171, -19213, 20339, 243624, -64957, -89512, 84691, -20331, -205329, 356582, -297844, 6928, 205160, 26509, -62506, -41741, 6669, -188083, -68664, -42312, -16767, 100745, -377764, -44118, -232726, 19723, 81248, -243878, 19788, -328693, -138724, -36677, -8860, 139474, 136937, -37460, -46350, -256468, 169785, -95830, 75452, 96944, -195186]
18641a60496A89383a00406G9073N3658B355d8188o2724c4790D1559Q9489d8582
18629a34026B13422I52c708k55003L2841a06290M3911J3274k07131J26239A89645
18617a82968d4796E9862c47l3152A85016e9062I5348k4343a20079b8807G4568
18605A31183b60830B5601J32245F8712a11305A09866b76949a30051C9184C727
18594b53743R8336C46086a35933C09335b64964J0594A5829J95937a08021d249
18583e0422I5823b65078Q1725F2873b04462k28645J80166a10139o2484B02817
18572a59404P5743L716G0474O4898L6846h8971G2100g1443q3036E0086i4994m06361
18560e01355J52845a2270r98j3842J363A27049l1527M8624a79329D50837a32713
$$ y = [-160496, 189383, -100406, 79073, 132731, 2355, -48188, -110912, -34790, 41559, 131048, -48582, -134026, 213422, 952, -3708, -258711, -225870, -106290, -62379, -49105, -256236, -129997, 189645, -182968, -44796, 59862, -347, -33499, 185016, -59062, 95348, 71005, -120079, -28807, 74568, 131183, -260830, 25601, 157846, 68712, -111305, 109866, -276949, -130051, 39184, 3727, -253743, -155407, 346086, -135933, 309335, -264964, -254370, 15829, 211766, -108021, -4249, -50422, 95823, -265078, -183353, 62873, -204462, -433107, -252941, -110139, -172623, 202817, -159404, -83661, -79945, 70474, 135372, 172218, -88971, 72100, -71443, -154479, 50086, -94994, -501355, -348510, -12270, -13268, -27110, -25747, 127049, 95522, 144146, -179329, 450837, -132713]
18548E8143h5837B67509j21834a81375D6636b56042j54106b8328k71116J10715
18538a88729k0777e1779j14431J0598n923B99959a20986A39900b8581k61884a3693
18526i0820A37110A2463g3621H0368K96490a10796A1339a05347A75833b81256
18515b5780j4524A9008g7151p7550B8641K3407B5618K7819a21207O767l0274A01991
18502b0151j01700A32252j5532n8324m160a10492G5105b3592r930B5818c26135
18490C3466R387b91948B21455b69115J04894J1270D7349b055A16687b87306a25233
18478f8985I03c263m0378R103D2970a14632j17792e529D3970b60709M9930Q7082
18466a23697A1772c2727o6511M8753A92735a37874B28295Q03a09531B9257e0481
$$ y = [58143, -85837, 267509, 145675, -181375, 46636, -256042, -410148, -28328, -299444, -188729, -209506, -51779, -166210, -155612, -161535, 299959, -120986, 139900, -28581, -290465, -13693, -90820, 137110, 12463, -73621, 80368, 376858, -110796, 11339, -105347, 175833, -281256, -25780, -40304, 19008, -77151, -154701, 28641, 52048, 25618, 53437, -121207, -114440, -144714, 101991, -20151, -121851, 132252, 116720, 58396, 54236, -110492, 75105, -23592, -33522, 25818, -326135, 33466, 42853, -291948, 221455, -269115, -164221, -152951, 47349, -2055, 116687, -287306, -125233, -68985, 903, -3263, -43641, -34538, 42970, -114632, -232424, -5529, 43970, -260709, -210779, -123697, 11772, -32727, -99238, -50485, 192735, -137874, 228295, 229098, -109531, 29257, -50481]
18454A35693k1320j7064b15712d6663k37630C35944f643A10381j5353J36341j02836
18443A28533D7516a66978g5002J602K6052j44851B772a58201j8644j22384a39767
18431H2164J5776b23049C38243c2627p4077M677B79296J47619d30408B9596b24142
18419A76998a67313m8211a7198k35349d9344n4599I9755d8599B95452A17996E2217
18407C29850a29219D0602J04986g1961j87649A75269D7260L4620g3373B73982
18396b51958J09871o5436B8964c24568M7995J3934a16467k88807A52133b12159
18385b47456J01376A97747c7229A00166B1450a15339F8755c41812d6752D69260
18374D7023c07198a02818B4190c51703i0386K4486j04410j87767I7023J67323
$$ y = [135693, 114373, 97309, -215712, -46663, -284293, 335944, -6643, 110381, 95028, 231369, 128533, 47516, -166978, -75002, -73400, -47348, -192199, 2772, -158201, -176845, -299229, -139767, 82164, 97940, -223049, 338243, -32627, -106704, -102027, 279296, 426915, -430408, 29596, -224142, 176998, -167313, -215524, -17198, -252547, -49344, -103943, 99755, -48599, 295452, 117996, 52217, 329850, -129219, 40602, 145588, -71961, -259610, 175269, 47260, 81880, -73373, 273982, -251958, -142087, -207523, 28964, -324568, -276573, -262639, -116467, -405274, 152133, -212159, -247456, -146080, 197747, -37229, 100166, 21450, -115339, 68755, -341812, -46752, 469260, 47023, -307198, -102818, 24190, -351703, -90386, -65900, -170310, -358077, 97023, 264346]
18364B64346b68710a10883A12015f6617k75254J33418c0483B60625c03798H9022
18353A5232e5479A55923a94282B33733m7973b75692O4621c986j30089b1842l01917
18342c23759G2556J39244G0745L638O3236J54814l3430A10983b49659I730a28210
18330h8997r1616G4265i3934H1627b64984k36921d0172j45358D15851c3082j89333
18319b22415g2647I6245b53299B57662a00576p0962B09333d0620j9714A97898
18308a73103e4304B86695A02333h2754l98378A17758k3285b3550q1320A02017
18297a78072j17238Q7834R6794A11339c1246r5632j67395J32644D2295a25824
18286b22574A30288c33116n2118J77853H1632l9660H918L7063j7336K3369J37783
$$ y = [264346, -268710, -110883, 112015, -66617, -341871, -208453, -30483, 260625, -303798, 89022, 15232, -55479, 155923, -194282, 233733, 185760, -275692, -211071, -3986, -134075, -21842, -323759, 72556, 211800, 70745, 74383, 137619, 292433, 259003, 110983, -249659, 9730, -128210, -88997, -180613, 74265, -93934, 81627, -264984, -501905, -40172, -185530, 415851, -33082, -222415, -72647, 96245, -253299, 257662, -100576, -171538, 209333, -40620, -60334, 197898, -173103, -54304, 286695, 102333, -82754, -481132, 117758, 94473, -23550, -104870, 102017, -178072, -295310, -207476, -110682, 111339, -31246, -126878, -294273, -161629, 42295, -125824, -222574, 130288, -333116, -385234, -207381, 81632, 41972, 8918, 45981, 28645, 52014, 189797]
18275A89797o9012J09059D4563b05357c516F7801R8913d12524d9672H3497b22624
18263A3604b90096a04493B8089c80533c414j73605I3642c07226A34949a13882
18252A41806a223q7170K2987L0929j89294H2914j1279Q6110c79539a85642A40380
18240a2624B33993J18024b51101D3806L1434a07820p7131f3532F3468a76285A94451
18228a46839l5080Q2251A38186J68904p5853I783e2183m3053p5787B23660a73856
18216e3065A80992l0904c28124a41211A42736n6127J9113a01507B3811J39957
18206A63768a49118n741c9116k18187G9428i3172O386F0253a35726G4641a38809
18194i7218A22718j7208c4765j37332H8257a20320b7926C8885b79081C06969d846
$$ y = [189797, 120785, 229844, 44563, -205357, -3516, 67801, 166714, -412524, -49672, 83497, -222624, 13604, -290096, -104493, 28089, -380533, -3414, -177019, 93642, -307226, 134949, -113882, 141806, -1223, -88393, -65406, -34477, -223771, 82914, 71635, 157745, -379539, -185642, 140380, -12624, 233993, 352017, -251101, 43806, 75240, -107820, -184951, -63532, 63468, -176285, 194451, -146839, -181919, -99668, 138186, 307090, 231237, 9783, -52183, -95236, -171023, 223660, -173856, -53065, 180992, 150088, -328124, -141211, 142736, 86609, 105722, -101507, 23811, 163768, -149118, -154859, -39116, -257303, 79428, -93172, -86786, 60253, -135726, 74641, -138809, -97218, 122718, 105510, -34765, -172097, 88257, -120320, -27926, 38885, -279081, 306969, -4846]
18182E7343K9680k3373b09915J0085P7035B80004c91943D2246J22711B2161Q8060
18171A10221Q065a51117D198P6293a65518B34130B7061n522d190B3682M4591K4725
18159I2998a76596o93B86312b04022O3072E1190a75260C00306C4138M73546B4779
18147B0425J96203c45746A00101a18853C45283A51970m2459B6477g4983j32576
18137b07559A96419o5918m1004c17497B55945a47292C94291c22587i9746L4575
18127f5171B73353A03433b20912D8540a69211D3316L39914G9896P486a0777A04952
18115A14460L9549c6201o6947B1311G797a60194j13493f3513j64264A90501D5130
18103C6991b00772I0172a10512j79268J30555j8240h1904B76933a21267A80793
$$ y = [57343, 87023, 63650, -209915, -199830, -122795, 280004, -391943, 42246, 164957, 22161, 110221, 118286, -151117, 4198, 80491, -165518, 234130, 27061, 21539, -4190, 23682, 68273, 92998, -176596, -177289, 286312, -204022, -140950, 51190, -175260, 300306, 34138, 507684, 24779, 20425, 216628, -345746, 100101, -118853, 345283, 151970, 109511, 26477, -74983, -207559, 196419, 130501, 89497, -317497, 255945, -147292, 394291, -322587, -99746, -65171, 273353, 103433, -220912, 48540, -169211, 43316, 383230, 79896, 87382, -10777, 104952, 114460, 154009, -36201, -103148, 21311, 7797, -160194, -273687, -63513, -227777, 190501, 45130, 36991, -200772, 90172, -110512, -289780, -159225, -177465, -81904, 276933, -121267, 180793]
18092b0663l73093r2809a86818O1121B3663a16619H9907R7529n2445b0584o4030
18081h4614A47400k9504L5407d04490e9678k05688a02183g094G9586b8824a0453
18069A90010i332c699j19997J23B23168a96814k0991A14710E3208e6826E3752
18057A05386a82910P424D46007a49591e1719j40667J920M5097C2385J49615M448
18046A86448a33559A18840K4466b320l83403i6251j9048H5921b10800A48927L904
18035A52831d8292j36647B07795c48566A45500D7979J540K35515j18283J3613
18025A80364B0198K4480A8953a23555L3050k7471j11539Q5816A66952d0620a7717
18013D57324A26894i8283C67493a33652g83j68717A91547D6478i0739A341a3718
$$ y = [-20663, -393756, -486565, -186818, -125697, 23663, -116619, 89907, 187436, 134991, -20584, -84614, 147400, 117896, 153303, -404490, -59678, -265366, -102183, -7094, 79586, -28824, -10453, 190010, -9332, -3699, -123696, -123573, 223168, -196814, -217805, 114710, 53208, -56826, 53752, 105386, -182910, -175486, 446007, -149591, -51719, -192386, -190466, -145369, 32385, 182000, 186448, -133559, 118840, 143306, -2320, -385723, -96251, -115299, 85921, -210800, 148927, 152831, -48292, -184939, 207795, -348566, 145500, 47979, 49519, 285034, 166751, 180364, 20198, 44678, 18953, -123555, -90505, -117976, -229515, -143699, 166952, -40620, -17717, 457324, 126894, -98283, 367493, -133652, -783, -169500, 191547, 46478, -90739, 1341, -13718]
18001e4199j56533B76593b56246d7173I4431J151N0501m3460a3415F9414B5523
17989b68291J26699A13707P2894F9170L4031C9751R0347a51342a2927C1705a00394
17977b31281B59697A0124b01337A13831E6566K4585M9325a5680o9285I2599a24715
17965B4613r239L10656d45196a05141M8366P141A98155a27732C7041A7385M5340
17954F2725A8410c21856H0583b65895D2523a60652M4544B1234d4965j15151A82126
17942a97261l6772A41137c5261r9944D0381g752o1216G1155J7014a84340j86504
17931c70844D59503a62724E6626A5216b28136A81230C8332J26949C1911K7073
17921E8984b45151N8241Q4607L3029b4620I2368h889B03438K10512b31448a09459
$$ y = [-54199, -210732, 276593, -256246, -47173, 94431, 95582, 146083, 102623, -13415, 69414, 25523, -268291, -141592, 113707, 186601, 69170, 103201, 39751, 130098, -151342, -12927, 31705, -100394, -231281, 259697, 10124, -201337, 113831, 56566, 81151, 130476, -15680, -84965, 92599, -124715, 24613, 15374, 326030, -445196, -105141, -56775, -49634, 198155, -127732, 37041, 17385, 62725, 18410, -321856, 80583, -265895, 42523, -160652, -116108, 21234, -44965, -160116, 182126, -197261, -234033, 141137, -35261, -135205, 40381, -7752, -68968, 71155, 88169, -184340, -370844, 459503, -162724, 56626, 15216, -228136, 181230, 38332, 165281, 31911, 58984, -245151, -186910, -102303, -69274, -24620, 92368, -8889, 203438, 413950, -231448, -109459]
17909A58517c36014B2408i591j15930A29158B1187a75276N1591H6369f437n6425
17898f2862G0158N4493d1763G4334k2149e346H7202a80730D0779P0466a00693
17886b60033A02971b32572j42251H2903R4298G8332J26487a44251C01738n9225
17876B42513m5797C5079a6468l133j18601b2062j3182n6789k6005m770H4419b84851
17863F4431K00912a49357O023K7368A69946J64133j01486a75014Q1503p8866e5620
17851A75707b90181R0165q5762a23838A84465c7534C9168P8546k5495L26293a98398
17839f6482B06057f5133A27496N8884b79652a2547B53261j25751b32328A51984
17828g0258q8190A64677f073k10029f6721B94344e9200k00455G4142h240j29246
$$ y = [158517, -336014, 22408, -9591, -125521, 129158, 21187, -175276, -123685, 86369, -6437, -62862, 70158, 124651, -41763, 74334, 52185, -5346, 87202, -180730, 40779, 111245, -100693, -260033, 102971, -232572, -374823, 82903, 177201, 78332, 204819, -144251, 301738, 242513, 196716, 35079, -16468, -19601, -138202, -22062, -35244, -92033, -118038, -122808, 84419, -284851, 64431, 265343, -149357, -143334, -115966, 169946, 334079, 232593, -175014, -93511, -172377, -55620, 175707, -290181, -200016, -285778, -123838, 184465, -37534, 39168, 117714, 92219, 418512, -198398, -66482, 206057, -65133, 127496, 186380, -279652, -12547, 253261, 127510, -232328, 151984, -70258, -158448, 164677, -6073, -216102, -66721, 294344, -59200, -259655, 74142, -8240, -137486]
17817a37486E6365J5195J46704M3969B205J1645L42638a20183A21589d47k4529
17806b4976n01869b2180l61224e1869J6895B5212R1876a9945j09789a2478B24417
17794c41445A29237c7481A0504h4176c8170o4745a1225A36173I168J93705q8110
17783A14763K20159R3878i9758j50260g4517C7390K78029c991D780J287c6857
17771b17064e0752A49067m9670a33438B70579o1359n4159l7929c0567B9211a09860
17759B06428a39279A08180c21840g7327k337F1383J23918a66375F4359c6169H7961
17747B66345C6219b5331A00292d3526k32704c3267A68261L22192b03116O041c0445
17735b52691a8850H8512R5090f4971C06742f6469A71254a76702F2666R5300F4696
$$ y = [-137486, 56365, 71560, 218264, 262233, 2205, 13850, 356488, -120183, 121589, -447, -24976, -526845, -22180, -383404, -51869, -34974, 25212, 117088, -19945, -129734, -12478, 224417, -341445, 129237, -37481, 10504, -84176, -38170, -102915, -11225, 136173, 9168, 202873, 114763, 334922, 428800, -99758, -250018, -74517, 37390, 315419, -3991, 4780, 6067, -36857, -217064, -50752, 149067, 99397, -133438, 270579, 209220, 155061, 117132, -30567, 29211, -109860, 206428, -139279, 108180, -321840, -77327, -79664, 61383, 185301, -166375, 64359, -36169, 87961, 266345, 36219, -25331, 100292, -43526, -276230, -33267, 168261, 490453, -203116, -197075, -30445, -252691, -18850, 88512, 183602, -64971, 306742, -66469, 171254, -176702, 62666, 157966, 64696]
17723g8842j86450d3553m4589B42619j08664l6543e2940A66266a08040C6409b20161
17711C67833C7208a41784G5406J0830i5789B01223I1402b60510A02681j7029g4436
17699f9936A99810p0794B1149K00372k3102a40394M5188b061C9681j4967c9229
17687c0095D0683a02976A46772b71015g4920A66802h1289l30147i5912E0998K01670
17676B52668a1821j23317B69512b06868Q8933B01000F3182b41684A703M6166J32656
17665A80525e415l16318J43416A4751L004A548f3517C8825a83595M5557D2617
17653a80926b1G7701J53848A1964a73644a79A94979b64368g9116A36796a09934
17641I4179Q9788C5224Q4699m5706K05651B8624D975K3269b05044D6791J52331
$$ y = [-78842, -265292, -43553, -88142, 242619, 133955, 97412, -52940, 166266, -108040, 36409, -220161, 367833, 37208, -141784, 75406, 86236, -95789, 201223, 91402, -260510, 102681, 85652, -74436, -69936, 199810, 129016, 21149, 221521, 198419, -140394, -95206, -2061, 39681, 24714, -39229, -30095, 40683, -102976, 146772, -271015, -74920, 166802, -81289, -411436, -95912, 50998, 252668, -11821, -135138, 269512, -206868, -117935, 201000, 63182, -241684, 1703, 47869, 180525, -5415, -321733, -178317, 14751, 17755, 1548, -63517, 38825, -183595, -138038, 42617, -180926, -21, 77701, 231549, 11964, -173644, -179, 194979, -264368, -79116, 136796, -109934, 94179, 183967, 35224, 119923, 74217, 279868, 28624, 4975, 28244, -205044, 46791, 199122]
17630A99122c95771B36475a11107F4011J18503b40523A39578m8691a45989A80784
17619G031O445K14222b1198j03727H247K42655H7402b93676E7597R4909J6683
17608A69189L721i4884A03502J5585h1611q2074E9565N8741c75876B5718L3243
17597E8961a02355D5394a46326p178C99259A71829C3424a54687A81733p8748d6926
17585B81588C7444e5301j78305R9708p555r1963r0122a58831n3560B60163D5068
17573a27735B40616j02107Q1883A05899f6194A24034K03136a56622K7211c8760
17562d5716j3756C03686A35950E6069J3770K24317C6123K32844l9898e9137J2237
17551d6900j24401F5722b90465A43062R5648l0036e6714C08361A44126O5368h2020
$$ y = [199122, -395771, 236475, -111107, 64011, 182514, -240523, 139578, 90887, -145989, 180784, 7031, 13476, 227698, -21198, -124925, 8247, 250902, 87402, -293676, 57597, 152506, 169189, 172910, -94884, 103502, 119087, -81611, -163685, 59565, 118306, -375876, 25718, 58961, -102355, 45394, -146326, -153504, 399259, 171829, 33424, -154687, 181733, 102985, -46926, 281588, 37444, -55301, -233606, -133898, -141453, -233416, -323538, -158831, -212391, 260163, 45068, -127735, 240616, 138509, 220392, 105899, -66194, 124034, 327170, -156622, -129411, -38760, -45716, -59472, 303686, 135950, 56069, 69839, 294156, 36123, 268967, 229069, -59137, -46900, -171301, 65722, -290465, 143062, 238710, 208674, -56714, 308361, 144126, 209494, -82020]
17539I2054J45259b6418l6091B378J30801M1124f7531G8372K02488A39624a92030
17527A93818a20010F9127N9313c8892A22193n8482J71442g8846B84045G0123J9208
17516H9331B747K29899I9581a61198D9788K78883A4464b4972H2996a14475H0633
17504I3657m3251k0261P3425J13710E5447c9957A69821H2789a73087L3685F6598
17492A29509a85543A15747A1796K94600J18678O5037b20317f2340A12752A6262
17481c3627H3384c02583A19239B6116P4879A8398N18174B6301L33462j58541J57699
17470C58921I1661b18188B9463b7008C69020j81728J19996C2294J66347f8707
17459e2095b1448k2856A53944J58302A50895K2018k5196i426C7977J54024O6348
$$ y = [92054, 237313, -26418, -62509, 2378, 133179, 174303, -67531, 78372, 280860, 139624, -192030, 193818, -120010, 69127, 128440, -38892, 122193, 63711, 235153, -78846, 284045, 70123, 89331, 2747, 232646, 99581, -161198, 49788, 328671, 14464, -24972, 82996, -114475, 80633, 93657, 50406, 30145, 103570, 217280, 55447, -39957, 169821, 82789, -173087, -139402, 66598, 129509, -185543, 115747, 11796, 306396, 425074, 490111, -220317, -62340, 112752, 16262, -33627, 83384, -302583, 119239, 26116, 100995, 18398, 536572, 26301, 359763, 201222, 358921, 91661, -218188, 29463, -27008, 369020, 187292, 307288, 32294, 198641, -68707, -52095, -21448, -44304, 153944, 312246, 150895, 172913, 147717, -9426, 37977, 192001, 258349]
17448B58349F3050L85327C3752K28796g501C07965G4866K21081J31069o7111o1173
17437B98732j27425J53532A53626O6150k7234J41261p6836D8543f9208b90A37530
17425A84821K35177B08556M21991B10231r4154d2237A43648c5530j10302C33385
17414A90617J43501A30511M3796a41230l9459A21223J8867j8135j0091J29236
17404B41100J5144N5807J33796H2509K4732K13955H4336J64232J24587m8658G8642
17392C19809C3344f2975C6628K64832a1934D66013b05661M6684A88086D9949J20865
17381A70814b58714B0491J96445a27036A24539K81541j50832a55896A45836L6176
17371A82012G1598L53420F5726J29032b1830B19888C9724b01860D22242A65219
$$ y = [258349, 63050, 448377, 33752, 262548, -7501, 307965, 74866, 295947, 427016, 359905, 298732, 171307, 324839, 153626, 219776, 192542, 333803, 256967, 48543, -69208, -290, 137530, 184821, 419998, 208556, 630547, 210231, 116077, -42237, 143648, -35530, -145832, 333385, 190617, 334118, 130511, 174307, -141230, -180689, 121223, 140090, 121955, 111864, 241100, 256244, 312051, 445847, 82509, 107241, 321196, 84336, 248568, 373155, 324497, 78642, 319809, 33344, -62975, 36628, 301460, -11934, 466013, -205661, -158977, 188086, 49949, 170814, -258714, 20491, 216936, -127036, 124539, 406080, 255248, -155896, 145836, 182012, 71598, 425018, 65726, 194758, -21830, 219888, 39724, -201860, 422242, 165219]
17360C61034A38195l477M5759a28532C1803K25552J42639A96160L21037Q2090
17350E99287B80128A22156J21988l8058l3760p8025J41275O8453a56321o6514
17340b22835C22954h660D5210g000I6760J03270j9576b4428B18337p66a58502
17328h3395E7030b33068E0774J78771I3999L64245k06653d8097A2379Q0272J87289
17317B79940J07367j25393e3975C81285L7770a38927f0751I0205D1353J12439
17307A53792n8846l2476a59048H3665b23375C39800H046L87137f7377C6989M9913
17296H6902K1768l9001l2503a88264L3090e4823A48565b68487H4368K79658A34047
17284G1596J11584K45205d8496H8575J90794G8804A6451J64602J97965A69087
$$ y = [361034, 138195, 134718, 180477, -128532, 31803, 257355, 399994, 196160, 517197, 599287, 280128, 122156, 244144, 206086, 172326, 94301, 235576, 304029, -156321, -222835, 322954, -8660, 45210, -7000, 96760, 200030, 180454, -24428, 218337, 217571, -158502, -83395, 57030, -233068, 50774, 229545, 93999, 458244, 251591, -48097, 12379, 92651, 279940, 387307, 261914, -53975, 381285, 419055, -138927, -60751, 90205, 41353, 153792, 94946, 62470, -159048, 83665, -223375, 339800, 8046, 395183, -67377, 36989, 86902, 108670, 69669, 37166, -188264, -155174, -54823, 148565, -268487, 84368, 364026, 134047, 71596, 183180, 428385, -48496, 88575, 279369, 78804, 16451, 181053, 379018, 169087]
17273A48839M427G5600L2416F584P0149M21746A83097E9346J9479J72974k3335
17262B28464p3975K7414r0810f0242D20194J62572A52525R0167l1080p9225J31593
17251B63980p0794J68645b01224C36475j63263f0386G8860L55160H2701k9551
17241E3150O4270K6906N495L01766A40397K32279J67212B40475A18066J55291
17231B73357p1817L2727K6230J11823a26682I9542J17378A6981K98058E6958J88363
17220B45321R2134q9190J91874I1940J17743j8679K53585A81613J57831j55509
17210A83935n4677N0947K27790f0210B64741L19210H5575J03108C6819a90425
17199B66225J60060J39200k19564A25958M45461P9665C14069Q6193A88575K45725
$$ y = [148839, 153266, 75600, 108016, 6584, 76733, 498479, 183097, 59346, 78825, 251799, 228464, 154489, 181903, 91093, -60242, 420194, 582766, 152525, 242692, 211612, 132387, 263980, 193186, 361831, -201224, 336475, 173212, -60386, 78860, 434020, 82701, 53150, 117420, 144326, 149821, 451587, 140397, 372676, 539888, 240475, 118066, 273357, 201540, 234267, 260497, 372320, -126682, 99542, 216920, 16981, 315039, 56958, 245321, 337455, 248265, 440139, 91940, 209683, 191004, 444589, 181613, 339444, 183935, 129258, 180205, 407995, -60210, 264741, 583951, 85575, 188683, 36819, -190425, 266225, 426285, 565485, 345921, 125958, 571419, 651084, 314069, 400262, 188575, 434300]
17189D34300A67757L32560a17812E6736L79313A06925J56872b7228C49145j06804
17179B42341M5257r5959E1342K27575Q985r4880E604Q21K21350j274K9189k078
17167B53612J86192J21326B62979N5j09382J34513o2702o8522O3042G2370J6556
17156H8926L20560A83680J71267e4831A47870J35019M7492q5182a81407G6870
17145B20072N3860j16792D0208N46531k70026A22578L01738A58301J63290j28547
17135A93044F1513J98297L09366B25569A02491M23185K0663B56749L2199j21420
17125A67528e0330C79570Q099J59179A50736Q6635A18034L07280q4899B3239L23648
17114C46887R5123J11154p0334p7194J6761K4655j2887J38474j26972n8475j66436
$$ y = [434300, 167757, 500317, -117812, 56736, 436049, 106925, 263797, -27228, 349145, 242341, 287598, 191639, 51342, 278917, 287902, 193022, 5604, 6425, 227775, 226501, 255690, 253612, 439804, 561130, 262979, 263034, 153652, 288165, 225463, 156941, 219983, 72370, 88926, 409486, 183680, 354947, -54831, 147870, 282889, 330381, 245199, -181407, 76870, 220072, 273932, 157140, 40208, 586739, 316713, 122578, 424316, 158301, 321591, 193044, 61513, 259810, 569176, 225569, 102491, 525676, 546339, 256749, 288948, 167528, -50330, 379570, 387669, 546848, 150736, 237371, 118034, 425314, 340415, 23239, 346887, 442010, 553164, 482830, 405636, 422397, 447052, 434165, 572639, 445667, 387192, 220756]
17103B20756J95929A85333J07146L7056M52469B07639L3183m8953J79189N2420
17093D23478L21820k54204K522n9544B05322K11674K02665k04924k2033J36958
17083E29662A99381L5074L40717l708N3346E7313L27717L39798A25195J12219
17073B37414L96077l3764j46047j22101J94067k54306k3143k5295K19453p3710
17063C68645K44462k51108L37174l2683j87329r8936j56743m0289K30831J10011
17053E24035k50053G6725N09296J3285J1309r9056k06387O9984M231J16318n3742
17042D41963K41997m2627k68418M4789J48803j11049M1252M24381k48460k61119
17032D11512M4349Q9320o7114q9123P8485Q6774p8441J25568j08792L23429C66795
$$ y = [220756, 416685, 185333, 292479, 329535, 782004, 207639, 240822, 191869, 371058, 423478, 745298, 491094, 493616, 434072, 205322, 416996, 619661, 414737, 392704, 529662, 199381, 234455, 575172, 571464, 624810, 57313, 385030, 724828, 125195, 237414, 633491, 599727, 453680, 331579, 525646, 271340, 248197, 222902, 442355, 368645, 613107, 361999, 699173, 666490, 479161, 380225, 223482, 183193, 414024, 524035, 273982, 76725, 586021, 599306, 610615, 511559, 305172, 375156, 379387, 495705, 441963, 683960, 641333, 372915, 417704, 566507, 455458, 496710, 921091, 672631, 411512, 455861, 545181, 478067, 388944, 467429, 554203, 475762, 601330, 492538, 815967, 366795]
17020H60558l64229L77187j70982B92591M81589k99847J28182o7878j02165J51209
17010E83681J0850j44133L29279q0150J89302C12614N87102k52133l15222J94819
17000E27180K26166J3339R3045j17139j65263k6178K61318m01049L15377K5333
16990G52129r5927q050K42948j40652l10666N84574k54779M26752m83948J82651
16980H95032J84651P3889m11704K54230m75427k5922K16608Q9185J4225r4806
16970G19961M22655m78591J47083j26627o4516K87340P9955J45666k27511K1259
16960I26674j92235j93172O27662l99910N8657K25446m9149K90068k5186j51127
16950A117728k66235O09507k70098k63065K53118j67417N8097j67476K09789r215
$$ y = [860558, 496329, 873516, 702534, 292591, 774180, 474333, 602515, 534637, 432472, 583681, 594531, 450398, 779677, 699527, 888829, 312614, 899716, 647583, 332361, 527180, 753346, 766685, 859730, 742591, 577328, 551150, 812468, 411419, 726796, 752129, 656202, 648152, 891100, 750448, 439782, 1024356, 769577, 1196329, 712381, 895032, 1079683, 1153572, 741868, 996098, 520671, 494749, 711357, 800542, 814767, 719961, 1142616, 664025, 811108, 684481, 619965, 907305, 987260, 1132926, 905415, 926674, 734439, 541267, 1168929, 769019, 827676, 1053122, 1003973, 1294041, 1268855, 1117728, 851493, 1461000, 1190902, 927837, 1180955, 1013538, 1071635, 904159, 1113948, 1104733]
16940A104733j76511J83172l1669J44327K31711l63049O6844J14512N4374J90106
16930A518550m12785j81588O02394p30646M99930l87322R8665K73476J79245m55703
16920A004216M68131k99057K76626M3368j63937L84519j19400j87875n6396J96974
16910A547169K04470l15698N1572K06772k79156K27728j95548p3452M14745j02263
16900A686339m18166J95456K83630k04328L02493n7464j07043K80564l12976q2485
16890A566020L5156P22065n26442l60024L50531r404J78193r7946j54287K65620
16880A969482J52028P1487l18783M05634J96530l99534J89994n1012j98761l7801
16870A979264L82540j2024m8539N4648p0652L44485k33458O617K79941k55334
$$ y = [1104733, 928222, 1111394, 1079725, 1224052, 1455763, 1092714, 1159558, 1274070, 1328444, 1518550, 1105765, 924177, 1526571, 795925, 1295855, 908533, 1007198, 1280674, 1459919, 1004216, 1472347, 1173290, 1449916, 1493284, 1329347, 1713866, 1594466, 1406591, 1350195, 1547169, 1751639, 1435941, 1487513, 1694285, 1415129, 1642857, 1447309, 1373857, 1788602, 1686339, 1268173, 1463629, 1747259, 1542931, 1845424, 1787960, 1680917, 1961481, 1648505, 1566020, 1601176, 2323241, 1796799, 1436775, 1787306, 1777902, 1956095, 1858149, 1703862, 1969482, 2121510, 2192997, 1874214, 2279848, 2476378, 2076844, 2266838, 2215826, 2017065, 1979264, 2361804, 2349780, 2301241, 2355889, 2285237, 2629722, 2396264, 2402881, 2682822, 2427488]
16860B427488K67656J10175r3931J72047m3399L7228K21419J6280j26612n7112
16850B931239L6869j7767k75402K46487K66676J27182Q5173K15526o00550K39633
16840C255066K84944L29450k9129p4777O9785L8410n06631O07378K14034k02011
16830C986519J74739J64466k0779K03631k00686n7308Q30876k84097P7680N6961
16820D932002K69020j54230L06079J17259P9419P6510L74225q7732L44139k31149
16810F025542N26916j7581J61025J20768r1338L60833J86146q50j0987L39167
16800G599641M61023j61942K98800M45460Q2005J02178M4996L65543O58600M9837
16790I946141l01549N20865N16536M98103J0449M9776O84254M06521J90123K04750
$$ y = [2427488, 2695144, 2805319, 2711388, 2883435, 2840036, 2877264, 3098683, 3114963, 2988351, 2931239, 2968108, 2950341, 2674939, 2921426, 3188102, 3315284, 3400457, 3615983, 3015433, 3255066, 3540010, 3869460, 3840331, 3765554, 3835339, 3873749, 3367118, 3974496, 4188530, 3986519, 4161258, 4325724, 4304945, 4508576, 4307890, 4250582, 5081458, 4797361, 4875041, 4932002, 5201022, 5046792, 5352871, 5470130, 5549549, 5626059, 6000284, 5912552, 6256691, 6025542, 6552458, 6534877, 6695902, 6816670, 6725332, 7086165, 7272311, 7271461, 7260474, 7599641, 8060664, 7898722, 8197522, 8642982, 8724987, 8827165, 8872161, 9237704, 9896304, 9946141, 9644592, 10165457, 10681993, 11180096, 11190545, 11240321, 11924575, 12331096, 12521219, 12725969]
16780A2725969N81906L70531L66871K58607P78688M84575L23645O58376L30820
16771A6879988N29787P38284P73989O86144O40946R54821P45401L02286J124869
16762B3376515P76467R70678P48626J751590Q11329R03998J293068J359865J516901
16753C3509037J309820J700307J742308K109449J617365K402958K132481K185476
16745D8709201K632289L219637L079093K865166L313371L884601L560236M635333
16737G5898927M514967M755676N052723N744227O146642O137278O913603O889976
16729A22054019P505205P579819Q036799Q615154Q048451Q008476Q225112P598382
16721A85671417O787560N775759M709735L922220K421746M52083m16873j997486
$$ y = [12725969, 13307875, 13678406, 14045277, 14303884, 15082572, 15567147, 15890792, 16549168, 16879988, 17409775, 18148059, 18922048, 19608192, 20249138, 21203959, 21949360, 22251646, 23376515, 24152982, 25123660, 25872286, 27623876, 28435205, 29339203, 30632271, 31992136, 33509037, 34818857, 36519164, 38261472, 40370921, 41988286, 44391244, 46523725, 48709201, 51341490, 54561127, 57640220, 60505386, 63818757, 67703358, 71263594, 75898927, 80413894, 85169570, 90222293, 95966520, 102113162, 108250440, 115164043, 122054019, 129559224, 137139043, 145175842, 153790996, 161839447, 169847923, 178073035, 185671417, 192458977, 198234736, 202944471, 206866691, 209288437, 209740520, 209323647, 207326161]
16713B07326161l735526m652669n721231o871985p601888q205581q134483q612316
16705A53790482q219110q005963q456725p353022p268839o690015p116970n598122
16697I5081716o101204n069362n165376m285728m442258m194349l835779l128624
16689E8859036l341560l016315k729771k808712k239513j857545k244104k357862
16681C8263654k025673j207940j693753j620967j320926j306582j244258j288880
16673B6554675p93097j141604j276346o48444j098943n92525r62821r14301n87141
16664A8539453q30340n20203n71404l14276n54903q89649k38862n34355m26307
16655A3659154j76496n49729o14177k53168n71299l37909k04974k11016m47239
$$ y = [207326161, 203590635, 198937966, 193216735, 186344750, 178742862, 170537281, 162402798, 153790482, 145571372, 137565409, 129108684, 121755662, 114486823, 107796808, 100679838, 95081716, 88980512, 83911150, 78745774, 74460046, 70017788, 65823439, 61987660, 58859036, 55517476, 52501161, 49771390, 46962678, 44723165, 42865620, 40621516, 38263654, 36237981, 35030041, 33336288, 31715321, 30394395, 29087813, 27843555, 26554675, 25761578, 24619974, 23343628, 22695184, 21596241, 21003716, 20040895, 19126594, 18539453, 17709113, 17188910, 16617506, 16303230, 15748327, 14858678, 14619816, 14085461, 13659154, 13482658, 12932929, 12318752, 12065584, 11494285, 11156376, 10951402, 10740386, 10293147]
16646A0293147l56980j67107l52202j93192o6752p06320J48728k55693l10972
16637H032657p7451m13081m50430m4837R9641j03057k66306l54370L8206j54826
16627F306146j4142j05470k19050k43752j36930K02478l77435k2735l25118l651
16617E060341r4278l0802j10307j36858j00589J55200l15844j20201k6392l91966
16607C888304j7133J93124R697j77608j73542K36466j21093k44553J58760k06845
16597C545577j06963J24948l74793J59450o6597O3015J5091q0960l80757L62072
16587C260083o03102J43269J43631n6049N30j32517j43913k0684N5128Q2588k01207
16576B527757N6035J97443l60772k38519L98552j48010k73014K6075J07411n75368
$$ y = [10293147, 9936167, 9769060, 9416858, 9223666, 9156914, 8450594, 8599322, 8343629, 8032657, 7955206, 7542125, 7091695, 7046858, 7146499, 7043442, 6777136, 6422766, 6460972, 6306146, 6292004, 6186534, 5967484, 5723732, 5586802, 5789280, 5411845, 5389110, 5063992, 5060341, 4966063, 4935261, 4824954, 4688096, 4587507, 4742707, 4426863, 4306662, 4280270, 3888304, 3871171, 4064295, 4073992, 3896384, 3722842, 3959308, 3838215, 3593662, 3752422, 3545577, 3438614, 3563562, 3188769, 3348219, 3281622, 3344637, 3359728, 3278768, 2898011, 3260083, 2656981, 2800250, 2943881, 2887832, 2888362, 2755845, 2611932, 2591248, 2646376, 2728964, 2527757, 2583792, 2781235, 2420463, 2181944, 2580496, 2432486, 2159472, 2185547, 2292958, 1717590]
16566A717590O90063l34301K22022j63784l27662J15337P1855l12008J7486L41734
16556B038332l17891N8235L3344j09614K92416l15195j80768K53102l6605J93152
16546A908508k87774Q452j47226J71155l71502r2910M00889k56151P32419m81390
16536A584470k48711J77997J24436j93924r0831K28980j78769k30579K64269O2121
16526A499459j04980k41405k0300l042J3064j49793j01490L97376L6953j9911
16516A305931M4313J09314m86851J03118J46137L10119m95550p6924J56310q8553
16506A027364n3635j32258j1674J26183k14815L50160k93097K75632q784Q094
16496A073170j76872J64061L7257m24680P9530j6182K71568l42367L65401k95297
$$ y = [1717590, 2407653, 2073352, 2295374, 2131590, 1803928, 1919265, 1991120, 1679112, 1696598, 2038332, 1720441, 1778676, 1812020, 1702406, 1994822, 1679627, 1498859, 1751961, 1715356, 1908508, 1620734, 1629186, 1481960, 1653115, 1281613, 1188703, 1589592, 1333441, 2065860, 1584470, 1335759, 1513756, 1638192, 1444268, 1353437, 1582417, 1403648, 1173069, 1437338, 1499459, 1394479, 1153074, 1132774, 1129732, 1142796, 993003, 891513, 1288889, 1325842, 1305931, 1350244, 1459558, 972707, 1075825, 1221962, 1532081, 1036531, 959607, 1115917, 1027364, 973729, 841471, 829797, 955980, 741165, 1091325, 798228, 1073860, 1065076, 1073170, 896298, 1060359, 1097616, 672936, 752466, 736284, 1007852, 665485, 1030886, 735589]
16486G35589N3825K8010k66184M06189k89198M91944m77467M2838K87386l72519
16476F40413r696K21534j52841n7851K3784N8780L07266k33500q2693J1859O5988
16465G93043J82014k78565J24820C25793M73268O0295j91358K5659j36821K58750
16455H15586C48103L96750p3019J00195l2706l9898C08241L90858Q2340j68815
16445F12624j21568J00267J70379l51583K62358K3755j54079K00007J43278B98719
16434E92381j04222M3198n5966K14931P1325l04632K87843l13456K49144j9445
16424F61101O2952K27233B84930K58540J94285j96896k15555P3463K05284K2836
16414F26887j27839L68346C93507K4058j44603J63335A83793K49446j16938J47204
$$ y = [735589, 789414, 817424, 551240, 957429, 668231, 1160175, 682708, 725546, 1012932, 640413, 630717, 852251, 699410, 641559, 665343, 724123, 1031389, 797889, 715196, 727055, 793043, 975057, 696492, 821312, 325793, 799061, 859356, 667998, 693657, 556836, 815586, 348103, 744853, 671834, 772029, 739323, 699425, 308241, 699099, 781439, 612624, 491056, 591323, 761702, 410119, 672477, 696232, 542153, 742160, 885438, 298719, 592381, 488159, 531357, 475391, 690322, 761647, 457015, 744858, 431402, 680546, 661101, 724053, 951286, 284930, 543470, 737755, 540859, 325304, 398767, 604051, 626887, 499048, 867394, 393507, 417565, 272962, 436297, 183793, 433239, 316301, 463505]
16404D63505L7769A53950O2405I9450N48430B79577L92231C00100K81523k80822
16394C00801r0189K73067r5018P3971J58603C08313J22803A62117J45820K98781
16384F06718B86922K96123B38570K17963j15158M4523j14848h1641E34614j06246
16374D28368J10025R4956k16759a405C40396H0087J98663L81155j31182B17714
16363C12359H1163K15920J55924j44400K72061A50062K24690n3943J16091J31053
16353E67953j73270K75778D1991a1911D09587j95249J76008L7580E9099J40548
16343A99647O0186A27306L03822k04782M2420Q5895A53115L84678o9660l6877
16333D31256r4122A58435m2894h2120A63920L67079A40917Q0330K16488I0969
$$ y = [463505, 501274, 153950, 216355, 99450, 647880, 279577, 671808, 300100, 581623, 300801, 210612, 483679, 388661, 462632, 621235, 308313, 431116, 162117, 307937, 606718, 286922, 583045, 238570, 456533, 341375, 385898, 271050, -81641, 534614, 428368, 538393, 633349, 416590, -1405, 340396, 80087, 278750, 659905, 528723, 217714, 312359, 81163, 297083, 453007, 308607, 580668, 150062, 374752, 320809, 436900, 567953, 394683, 670461, 41991, -11911, 409587, 214338, 390346, 427926, 59099, 199647, 259833, 127306, 431128, 226346, 268766, 354661, 153115, 537793, 468133, 431256, 337134, 158435, 115541, -82120, 163920, 530999, 140917, 221247, 437735, 90969]
16322A85877K55931L8312R204n9842N8828p472r7619o5684E7838d141C31853n7646
16310B74207B3J84115O3299N8010j2151L8005J374K6986K21806j87526E0260K90682
16298C40942L28845A84852J60766J05116B03794o5735K9937c0848j6172C68017
16287A87222K02452j08G6974K62774A68629L16509A08787j1928N8335e8881B72236
16275C76188a5510G4211Q1122J71765A61288n7096L29453A18284K58819A70219
16264D06132o3807k3315j25547K3556P9264N7105A04683N230k6412K49826J13517
16253D46844k21956G5894J14705G029J75063k9665A9895L95176j96880M6216H8499
16241C08118G797K06113H2581b2745q8228B17650p7295r258o4800C2690J45046
$$ y = [185877, 441808, 480120, 489324, 429482, 488310, 480838, 383219, 317535, 57838, -4141, 331853, 274207, 23, 184138, 247437, 305447, 293296, 331301, 332675, 359661, 581467, 393941, 50260, 340942, 669787, 184852, 345618, 450734, 203794, 138059, 167996, -30848, -47020, 368017, 187222, 389674, 389566, 76974, 339748, 168629, 485138, 108787, 96859, 155194, -58881, 272236, 376188, -15510, 74211, 155333, 327098, 161288, 104192, 433645, 118284, 377103, 170219, 406132, 342325, 319010, 193463, 217019, 296283, 353388, 104683, 109913, 83501, 333327, 446844, 224888, 75894, 190599, 7029, 182092, 152427, 19895, 415071, 218191, 264407, 88499, 308118, 7797, 213910, 82581, -22745, -110973, 217650, 140355, 131097, 66297, 32690, 177736]
16230A77736e5664B11427A00721K87091a56874C11711A8135L26578e1860A12189
16219A60694Q160J50935D0772L82091A9848K20407b8270e384A72602e860D8672
16207B77051p9099f4774q4617A17446b68647D4063J98476b16019C69500G8707
16196g3047A01477j1432J62283G3465L38192j08981a17451B88746a7024B11930
16185B74424k6462F6915L08858A32991a49659B99760b18735c2257A55170d9633
16174C76603A23483K60264A47710a41968A767L05563Q943a14842C9702K64445
16164C04147J60764G5885b6393C51230h0301k5899d5951D06011I4097a51966B35432
16152A38834L12603A41373a39447G1905a44970J9677C38181b28045e4704C60684
$$ y = [177736, -55664, 211427, 100721, 387812, -156874, 311711, 18135, 344713, -51860, 112189, 160694, 168854, 319789, 40772, 422863, 19848, 240255, -28270, -5384, 172602, -5860, 48672, 277051, 197952, -64774, -149391, 117446, -268647, 44063, 242539, -216019, 369500, 78707, -73047, 101477, 90045, 252328, 73465, 411657, 302676, -117451, 288746, -17024, 211930, 274424, 247962, 66915, 375773, 132991, -149659, 299760, -218735, -32257, 155170, -49633, 376603, 123483, 383747, 147710, -141968, 1767, 307330, 316273, -114842, 39702, 304147, 464911, 75885, -26393, 351230, -80301, -106200, -45951, 406011, 94097, -151966, 235432, 138834, 451437, 141373, -139447, 71905, -144970, -125293, 338181, -228045, -54704, 360684]
16141F5946J59234C1130R8705d3049A29349b03461B71740h3960H922a16701A10491
16129f9150A18543k8560J65774B1951K68850c5820B91026A03859a8825A71378
16118B40769a49744A90474K9345a61957B4552h3337B2244M4290l2176d43251J87341
16107b55910a590A65764M4247B6656L2234J07875q0831g5172A56132K27604c17560
16095f0543G8326a39739G1267R3473B8514O2757C7376a85478K7176A13757Q3959
16084A97716a91910P9139F2484c15809A66319d2589k2129B12857G8924K10317
16074B89241a15488E1001a51992O9618B22296l5383b21566A72111B0009d8208
16063b00148A98592q3635a04199d0360C33708A18666O657Q639b70577e2357A80146
$$ y = [65946, 225180, 31130, 129835, -43049, 129349, -203461, 271740, -83960, 8922, -116701, 110491, -69150, 118543, 89983, 255757, 21951, 290801, -35820, 291026, 103859, -18825, 171378, 240769, -149744, 190474, 219819, -161957, 24552, -83337, 22244, 66534, 34358, -443251, -255910, -1590, 165764, 210011, 26656, 58890, 166765, 85934, -75172, 156132, 383736, -317560, -60543, 78326, -139739, 71267, 164740, 28514, 91271, 37376, -185478, -158302, 113757, 197716, -191910, -112771, 62484, -315809, 166319, -42589, -64718, 212857, 78924, 289241, -115488, 51001, -151992, -82374, 222296, 186913, -221566, 172111, 20009, -48208, -200148, 198592, 114957, -104199, -40360, 333708, 118666, 125323, 133962, -270577, -52357, 180146]
16051B26286m3961c65386e4199b0445j25663j7826f5289J3742A71039p7039K4510
16040A18510O3125e7543l04084b5823m3761C60839A56067b49646f8933D42898
16029D8925J81993m8301h2331C7131b86887G4221g0611k2542l5012q6196A47115
16017A44024b18284L7552c0839l18476A22778C1666L17821a73991H1489N6804
16007A38293R8890C8988d41734a43790D10779A85991c01194C66772A12365J61208
15997B73573A4335a51446c3044l48106B41052j01649a37674A68182m1304b06656
15986B44756A13816J94625m3954j13350K855a04382G0706O7368L71672B43880
15975b06598G676b6704B89542c2275m6772j32793j00355B92887A08301d14427
$$ y = [226286, 182325, -365386, -54199, -20445, -146108, -163934, -65289, -51547, 171039, 94000, 118510, 181635, -57543, -361627, -25823, -69584, 360839, 156067, -249646, -68933, 442898, 48925, 230918, 182617, -82331, 37131, -286887, 74221, -70611, -93153, -128165, -214361, 147115, 144024, -218284, -180732, -30839, -349315, 122778, 31666, 349487, -173991, 81489, 138293, 237183, 38988, -441734, -143790, 410779, 185991, -301194, 366772, 112365, 273573, 14335, -151446, -33044, -381150, 241052, 139403, -137674, 168182, 126878, -206656, 244756, 113816, 308441, 264487, 151137, 153992, -104382, 70706, 138074, 509746, 243880, -206598, 7676, -26704, 289542, -32275, -79047, -211840, -312195, 292887, 108301, -414427]
15964a63472N0862K3471c6258m87183k0387a26420I0889b55779d768n9844j00456
15953a65068k94844C63597H8485N0946n2972L04260a26143H6361b41425g7297
15942I1264P097b41708H4814O733J03293D6176b78866C2630a31820k55644A31960
15930f4419r3598A07300a94962P2378j82231o4147i4352l7175j07644C8432b21415
15918A08236c69268a63430a2168M63k62011h0538K3700k11872B9719K96436j28783
15907A97372a54513c9507l0065l61650g8104n7034j12538g5109n6509B96506b4456
15895a4043A08491d4044A19406E3084e4676k1790l1606l43779a78136A95891J14539
15884C10430j9539D3645K58863a77226f5544l8187A61067C6000g2068B04701F4995
$$ y = [-163472, -112610, -89139, -36258, -523441, -543828, -126420, 90889, -255779, -4768, -64612, -165068, -459912, 363597, 88485, 139431, 86459, 390719, -126143, 86361, -241425, -77297, 91264, 98361, -241708, 84814, 91547, 194840, 46176, -278866, 32630, -131820, -387464, 131960, -64419, -158017, 107300, -194962, -122584, -304815, -368962, -94352, -131527, -239171, 38432, -221415, 108236, -369268, -163430, -12168, -11705, -273716, -80538, -56838, -268710, 29719, 326155, 197372, -154513, -39507, -69572, -431222, -78104, -135138, -247676, -75109, -131618, 296506, -24456, -14043, 108491, -44044, 119406, 53084, -54676, -76466, -108072, -451851, -178136, 195891, 310430, 290891, 43645, 302508, -177226, -65544, -103731, 161067, 36000, -72068, 204701, 64995]
15872E2401c90049q4521A10438b06930a6160B7083b86605a0172k36977f3032F9371
15860F9686j9920a9610n8588A54630a5105a793l5464o3936H1886a79065A96541
15848H9101a01117A6555Q2823J28658A8454c5257H6609C7611J32094j6500E7070
15836A62521b11198j39189e6559D0458L73937b61807c574l39284J04560d4566
15825A63294F5563A8888Q1906e9264r1343j47999J23774m3288C3658M02904b96742
15813c17946I780b18478K2525B31997c24759B2084g6148l02038d3220l09742a57999
15801c33111i9645A95475A2180J27248Q7174d22263A57812a41212m6553C7962
15790b24307c2105k59798h3925C2176a1560o3111n2525N9488C49244j71432a92226
$$ y = [52401, -390049, -474570, 110438, -206930, -16160, 27083, -286605, -10172, -247149, -63032, 69371, 69686, 49766, -19610, -78198, 154630, -15105, -1793, -37257, -101193, 81886, -179065, 196541, 89101, -101117, 16555, 99378, 228036, 18454, -35257, 86609, 37611, 169705, 153205, 57070, 162521, -211198, -350387, -56559, 40458, 414395, -261807, -3574, -342858, -238298, -44566, 163294, 65563, 18888, 100794, -59264, -150607, -298606, -174832, -218120, 33658, 436562, -296742, -317946, 9780, -218478, -195953, 231997, -324759, 22084, -76148, -378186, -43220, -352962, -157999, -333111, -99645, 195475, 12180, 139428, 226602, -422263, 157812, -141212, -187765, 37962, -224307, -32105, -291903, -83925, 32176, -11560, -74671, -127196, -67708, 349244, 177812, -192226]
15778b77991d6506J5223k97543R3460c6612A4100g4731G1020d825F3976M8525
15767A12501d03878A0491b96495B03034q5928d6383C15785i0272A06391a12497
15756c77625A35036M2003n8404a83530H193J70759A7868i0542p6508M8958A05716
15744B46371b3223b163B09977a34460B55189a2507A42953i8986I2282d5154C9297
15732b09010A72936C7002n795b76475d5495A74191n99a94231p0778L2491l5174
15721b67692G0486b85448J24101C36960c30583a03086H4886b18888D7167O3215
15711A10382h3817k9754j04569D1474i7513H0380a43272C7433Q7282a3724k61391
15700b75115a4249A50565b6197K082A89678m5064c49252A23251c06779A09047
$$ y = [-277991, -46506, -31283, -328826, -235366, -36612, 14100, -74731, 71020, -4825, 63976, 112501, -403878, 10491, -296495, 203034, 117106, -46383, 315785, -90272, 106391, -112497, -377625, 135036, 177039, 118635, -183530, 8193, 178952, 17868, -90542, -167050, -118092, 105716, 246371, -23223, -2163, 209977, -134460, 255189, -12507, 142953, -98986, 92282, -45154, 39297, -209010, 172936, 37002, 31207, -276475, -45495, 174191, 173592, -194231, -265009, -232518, -267692, 70486, -285448, -161347, 336960, -330583, -103086, 84886, -218888, 47167, 110382, -83817, -113571, -218140, 41474, -97513, 80380, -143272, 37433, 124715, -13724, -275115, -14249, 150565, -26197, -24115, 189678, 144614, -349252, 123251, -306779, 109047]
15689E5953f0476n8623n1072D6845A579a45146k5548M2069a29B859i4963d412
15676b1339j3103o5317m8183N7843D830L2811O2272K5413c6064j14246A16445
15664a11811j1580F4738b38262B03371F9587a83212d889E4746c22042J37922P8736
15653a05384j14996B1195e9049j25976b2473D6876b46869h4690C4534K04018b97820
15641b58867I0666O128j0366a81890G1792a65423a8216m6961n3524r049I8419
15629b70551g8058C48983b65569a00659G7098a70966j78692a4115j28143A61315
15618f2961A00845a31218A16659p711e0863j45313l07299A95447L538O3128b86524
15606B8109c34549A21761J8433n9117c86689A31650i7268k58909A02597m6960
$$ y = [55953, -60476, -119099, -170171, 46845, 1579, -145146, -170694, -128625, -129, 2859, -94963, -4412, -21339, -34442, -99759, -147942, -90099, 4830, 37641, 99913, 125326, -36064, -150310, 116445, -111811, -123391, 64738, -238262, 203371, 69587, -183212, -4889, 54746, -322042, -184120, -105384, -220380, 21195, -59049, -185025, -22473, 46876, -246869, -84690, 34534, 238552, -297820, -258867, 90666, 96794, 86428, -181890, 71792, -165423, -18216, -65177, -118701, -127750, 98419, -270551, -78058, 348983, -265569, -100659, 77098, -170966, -349658, -14115, -142258, 161315, -62961, 100845, -131218, 116659, 108948, -50863, -196176, -503475, 195447, 198985, 262113, -286524, 28109, -334549, 121761, 140194, 81077, -386689, 131650, -97268, -356177, 102597, 55637]
15596E5637J19851E5754d04488i3749M0094B29043c48153i8130k795A53560C8885
15584f2351B95541P258E7605i3812j42424A66591a44134P1861k44060R3295C8808
15572b66832a2730B8541a18176M2293A29152J7654b26468i3345q3762j82197G4472
15560e0452r0780D9605K18314H2776d4450B4806O8189R7544e6666j06132A36674
15548A98290c79293E9008h6320P162j46030P4117A45986A7123K1174J35907Q2087
15537B56291g8184j10233H4144c6287a7696k3479C42348f6717j43093E6867K2597
15526G9464A8620a89510F3243b6407N924D6872J38386a15626a6287j43968D5605
15514A75485l4226F7708b04085A8226J26538N9415k2017d3413A88128c15182D0036
$$ y = [55637, 175488, 55754, -404488, -93749, -53655, 229043, -348153, -98130, -100925, 153560, 38885, -62351, 295541, 302799, 57605, -93812, -236236, 166591, -144134, -72273, -316333, -223038, 38808, -266832, -12730, 28541, -118176, -75883, 129152, 146806, -226468, -93345, -177107, -359304, 74472, -50452, -141232, 49605, 267919, 82776, -44450, 24806, 92995, 190539, -56666, -162798, 136674, 198290, -379293, 59008, -86320, -79158, -225188, -151071, 145986, 17123, 38297, 174204, 256291, -78184, -188417, 84144, -36287, -17696, -41175, 342348, -66717, -209810, 56867, 79464, 18620, -189510, 63243, -26407, -20483, 46872, 185258, -115626, -16287, -160255, 45605, 175485, 141259, 67708, -204085, 18226, 144764, 204179, 182162, -43413, 188128, -315182, 40036]
15502G1707a31067E4973i6561L4966b7752j41505i591A27841F0922b7342j16164
15491a43506B54409j23478F4414R2154L2823a01611q7625B0531R8910a15642A16310
15479C28979B8639a1288D3552a30826A08105K77206a4760D8148J03743b8504A02382
15467B10358p9577d9317j99866F5946b46593B93297j21133C6455b0826r3203C60096
15455a85983f1758B0312c5053A91360a33168h559d186H5943b66193c5571A88822
15443e026l24494E0506d1580k52539F0499e636G1106a02346J118j3878L3265L7708
15431d4133A71269J4648B3053b80631g8603E4408N2610i860k0379B75523h652
15419E7131a99577B09133b70825H2181a5083A1355a2629B69890I1907O5996g2959
$$ y = [71707, -131067, 54973, -96561, -61595, -27752, -169257, -9591, 127841, 60922, -27342, -143506, 254409, 130931, 64414, 156568, 189391, -101611, -189236, 20531, 119441, -115642, 116310, 328979, 28639, -11288, 43552, -130826, 108105, 385311, -14760, 48148, 151891, -28504, 102382, 210358, 130781, -49317, -249183, 65946, -246593, 293297, 172164, 36455, -20826, -114029, 360096, -185983, -61758, 20312, -35053, 191360, -133168, -8559, -4186, 85943, -266193, -35571, 188822, -5026, -329520, 50506, -41580, -294119, 60499, -5636, 71106, -102346, -101228, -115106, -81841, -44133, 171269, 185917, 23053, -280631, -78603, 54408, 107018, -9860, -30239, 275523, -8652, 57131, -199577, 209133, -270825, 82181, -15083, 11355, -12629, 269890, 91907, 157903, -72959]
15407a74889A27208b41451d1965B45395a95607A41061a10851B64241m5599b46761
15396h2288H2429l0119g5322K2437E1043d17079a36390r106B79181D5643K3385
15385F9028h4200A90838J12178c32226D808c09391A57743a50911A24268a52164
15374C34088A06168A2667P9981i5006C73025A8250J32755C570m12J36578k8037
15363A11699J32419f1295F8356J74768n9017b33206i5549q4492A14901M8312c97089
15351B71481G9994k3253a23445A40817b57448o1195C37069o1525a56093j57489
15341c13582F2400i3446N091C21836G8523M6996d0001A32347b22898Q0693A49588
15329a14166m0127A54405o2554a20692A77908a02770D4041K1080M87a05887A23572
$$ y = [-174889, 127208, -241451, -41965, 245395, -195607, 141061, -110851, 264241, 218642, -246761, -82288, 82429, 52310, -75322, -52885, 51043, -417079, -136390, -145496, 279181, 45643, 69028, -84200, 190838, 303016, -332226, 4808, -309391, 157743, -150911, 124268, -152164, 334088, 106168, 12667, 92648, -95006, 373025, 18250, 151005, 3570, 3158, 139736, 111699, 244118, -61295, 68356, 243124, 184107, -233206, -95549, -180041, 114901, 163213, -397089, 271481, 79994, 56741, -123445, 140817, -257448, -318643, 337069, 275544, -156093, -313582, 62400, -93446, -88355, 321836, 78523, 125519, -40001, 132347, -222898, -142205, 149588, -114166, -154293, 154405, 91851, -120692, 177908, -102770, 44041, 65121, 65608, -105887, 123572]
15317a38907G4423J15521K4042R2522J6311G6575B3059c27497D4601N5691A4556
15305d8655G9662b31471B22121a06995F3111a88515E8408J70426C9871j293i5783
15293C96447A91450O3280j22435b3019E2438J34390b887B81570G0321k6100d1859
15281f421j91264E23118e5490A21212J28837n1235g1612A31488f2373J2590A06508
15269D17951g753C7605L93434a8232A66339K42934a39377n5154A44333b73296
15258a18745H8264h5712l0500B32800q7530n4981A0520N4444K76061J0956Q68692
15247A220673O97103J53967l97584K92093q38670l72355B23899K13158A67350
15237a5677E02897A67368b2554j8134A28507o654i0801B70040F4258f8007j13375
$$ y = [-138907, 74423, 189944, 213986, 306508, 322819, 76575, 23059, -327497, 44601, 100292, 14556, -48655, 79662, -231471, 222121, -106995, 63111, -188515, 58408, 228834, 39871, 38578, -95783, 396447, 191450, 254730, 132295, -23019, 52438, 186828, -2887, 281570, 70321, 44221, -41859, -6421, -197685, 523118, -55490, 121212, 250049, 198814, -71612, 131488, -62373, -49783, 106508, 417951, -7753, 37605, 431039, -18232, 166339, 409273, -139377, -194531, 144333, -273296, -118745, 88264, -85712, -116212, 232800, 145270, 90289, 10520, 64964, 341025, 351981, 1220673, 1917776, 2071743, 1674159, 1966252, 1127582, 755227, 223899, 437057, 167350, -15677, 502897, 167368, -22554, -40688, 128507, 121853, -90801, 270040, 64258, -68007, -181382]
15226a81382I1243L1468k542d0184C19664J31338A10356f867k31672l12520C09218
15214A02108a01957E2182F384J04921L03320A00362M9851D9912a86795A2592a4418
15202b7228B21061C2714N7089d6736D6324b64649B77187a34882J084A16255J82129
15191B98384A47173e5453A49359O4662R0885E2489a26532B33916f1661D8763a69542
15179C05956j32839H4216i2168a9231C24058f2793A18494J35281Q0658a91240
15168h0611B2367d6657A16334h185D12952e2263p4389A67588Q1338a72100F1847
15156H3656L47052a74383h2211A34514L3177b14282P6376j5017D4364J40197Q8361
15145B72922j8219A14460E3277J975k0930a56015e8244A2806K84191B8895K86323
$$ y = [-181382, 91243, 122711, 120169, -40184, 319664, 451002, 110356, -6867, -238539, -551059, 309218, 102108, -101957, 52182, 6384, 111305, 414625, 100362, 150213, 49912, -186795, 12592, -14418, -27228, 221061, 32714, 89803, -46736, 46324, -264649, 277187, -134882, -133798, 116255, 298384, 147173, -55453, 149359, 214021, 304906, 52489, -126532, 233916, -61661, 48763, -169542, 305956, 173117, 84216, -92168, -19231, 324058, -62793, 118494, 253775, 334433, -191240, -80611, 22367, -46657, 116334, -8185, 412952, -52263, -126652, 167588, 248926, -172100, 61847, 83656, 430708, -174383, -82211, 134514, 167691, -214282, -137906, -152923, 44364, 184561, 272922, 254703, 114460, 53277, 55252, 34322, -156015, -58244, 12806, 296997, 28895, 315218]
15134C15218b12093E57130B15693L1888M123H8921R1991q0285j114O4875p8521
15123H5867B0106K40383k7486L8778H4560L88962E4864L9331M5250k6207O6011
15112A79249K77767k24448o9408m7169A2185d6230D8413J51294C4678J62728J97852
15101C95258B1727h7022E7784J14358p251K08909J27662A32928d23100A62885
15090B96966F199c0075F2279a28372F585L77405A13402J69807A23499D5733M20514
15079D66247A67655a17731M7074C15111A49849b05946n6661B86434H5872K56395
15069C42267h4931C49778e5197I4905j5219J4334K52786q1200k106K30530B20394
15057b02885b0265H211L07918J16811j58638J71042j98312P6615A43546j408b32227
$$ y = [315218, -212093, 557130, 215693, 247581, 251704, 88921, 180912, 100627, 99513, 164388, 85867, 20106, 260489, 233003, 271781, 84560, 473522, 54864, 94195, 139445, 113238, 179249, 457016, 232568, 163160, 115991, 12185, -46230, 48413, 199707, 34678, 197406, 395258, 21727, -87022, 57784, 172142, 164891, 373800, 501462, 132928, -423100, 162885, 296966, 6199, -30075, 62279, -128372, 6585, 383990, 113402, 283209, 123499, 45733, 466247, 167655, -117731, -70657, 315111, 149849, -205946, -262607, 286434, 85872, 342267, -84931, 349778, -55197, 94905, 79686, 94020, 346806, 265606, 263500, 494030, 220394, -202885, -20265, 8211, 316129, 432940, 274302, 445344, 247032, 323647, 143546, 142138, -232227]
15045F1692J57599l2708k7811J56188M1608A35328L98125j81969n4686N9892e4959
15033B13123g4517D47683F871J80449K16296b07507D4M00067A43009M62534j94250
15022D11293r6793o8461F3350a06547B86814f345B19110A7989M39893m4384f9
15010C9656f5345H1624K3918H726J02655O63683C28674j28677P9976L2481D5724
14998A89651l3091K02763c804A58511g3017A78951K5845K4664K53910j35606A60089
14986B05033k1559J55343j50592p7810m1772J07932a73688C2279b3062G895M44436
14975D52331k1985o1291a38101B18786L6028j4120J69908M4596j25866j35162
14965A94170K32387B04035N4651H5742B4201N7957J84755r4989K07807A15861
$$ y = [61692, 219291, 186583, 158772, 314960, 356568, 135328, 533453, 351484, 296798, 356690, -54959, 213123, -74517, 447683, 6871, 187320, 403616, -207507, 44, 400111, 143009, 605543, 411293, 314500, 246039, 63350, -106547, 286814, -6345, 219110, 17989, 457882, 413498, -69, 39656, -65345, 81624, 105542, 8726, 111381, 775064, 328674, 199997, 279973, 312454, 45724, 189651, 156560, 359323, -3804, 158511, -73017, 178951, 204796, 229460, 483370, 347764, 160089, 205033, 183474, 338817, 188225, 110415, 68643, 176575, -173688, 32279, -23062, 7895, 452331, 430346, 369055, -138101, 218786, 254814, 240694, 410602, 455198, 329332, 194170, 426557, 204035, 258686, 85742, 24201, 82158, 266913, 171924, 379731, 115861]
14954A78890J45577J52945j89750I2690K37842f548C75141m1734E7157K17091
14944B74248K04048d4197D77658B18051L6907M5581K34039A96962K12545C8851
14933D22143n5321A35211N00437k52476a04769C13618J78110n3750D3419J71481
14923B14900N7417M8892J38335j80713j30716N08296k09783j80392L61169B97900
14912C88925j33197o3395G8292L43561I2726J41178J87211j02554l4370p3400
14902B10791J77779J09725j45999N3657l0043j25505K65830B51726K62141A47610
14891C30700O6262b2657C48652N04264B17537L27669a39610A63450J50861H6989
14880A42456L84453a25568D03732A37098J05386L70986A72205J96680K6330K92123
$$ y = [178890, 324467, 477412, 287662, 92690, 330532, -6548, 375141, 333407, 57157, 274248, 478296, -44197, 477658, 218051, 254958, 300539, 534578, 196962, 409507, 38851, 422143, 366822, 135211, 635648, 383172, -104769, 313618, 491728, 437978, 43419, 214900, 272317, 321209, 459544, 278831, 148115, 656411, 446628, 266236, 627405, 297900, 388925, 255728, 192333, 78292, 421853, 92726, 233904, 421115, 318561, 284191, 210791, 388570, 498295, 352296, 405953, 375910, 250405, 516235, 251726, 513867, 147610, 330700, 396962, -22657, 348652, 852916, 217537, 545206, -139610, 163450, 314311, 86989, 142456, 526909, -125568, 403732, 137098, 242484, 613470, 172205, 368885, 395215, 687338]
14870F87338A17456M28755k04892n8695n7450J57171j28382P7132J46748K5778
14860E03621o4066l963K64569o423k57034r6439J66782j90359k2252L61206K9133
14849F84775k65390K17553D5863J46747M24935B79138A8009M14997j12818j24990
14839A95198J50650L68582C24697N5935K64185j69419J0348Q5783R0818j67534
14829D94813m9096k9246Q0323J05222q1250j20641J08923J08448J89096C02064
14818H73276l61503m4959J71728j95445L46129l51989j17928L28062l817K8160
14808F71714k55120J51837P7220j69987K22394B35553M00851J7251q8130P5487
14798F41012j15589j44723J65846j20239n9248K66343l7865B13239L25554Q9272
$$ y = [687338, 117456, 546211, 341319, 282624, 225174, 382345, 253963, 331095, 477843, 503621, 439555, 435592, 700161, 693738, 436704, 340265, 507047, 316688, 294436, 655642, 684775, 419385, 636938, 45863, 192610, 617545, 279138, 18009, 433006, 320188, 195198, 345848, 714430, 324697, 380632, 644817, 475398, 485746, 571529, 662347, 494813, 445717, 416471, 496794, 602016, 520766, 400125, 509048, 617496, 806592, 302064, 873276, 511773, 466814, 638542, 443097, 789226, 437237, 319309, 647371, 643554, 671714, 416594, 568431, 645651, 475664, 698058, 235553, 636404, 653655, 565525, 641012, 525423, 380700, 546546, 426307, 367059, 633402, 595537, 213239, 538793, 628065]
14788F28065K90855l19503r7945K00325n2814r860J24458L590k60135r6185M09627
14777H20478P5815m16375L11329j20648r4553M22700J0007l39417j84256l9303
14767D45777k6132K15536Q100k79772N28235j7341j124l34664L57994j35547n5569
14756G05493P2764p2830B47746L88561k73019O6514J98486K88613k84340N5986
14746F88547B46449L77693M01868k41147j4295R1337R3508P368k07797J01701
14736H56685R1270r3254m6826k42840L12578k6976K2313l18828K54999n6431r2947
14725F59743M57545l18433j50986J12515n2819j29407K44084r9199K69375N5110
14715A047528m7306k0860m69321M70137j88164K57870l79000J14811J10828r4194
$$ y = [628065, 918920, 599417, 501472, 701797, 648983, 639123, 763581, 767171, 507036, 410851, 820478, 896293, 479918, 791247, 670599, 576046, 998746, 1008753, 669336, 485080, 445777, 419645, 635181, 643281, 363509, 891744, 874403, 873279, 538615, 896609, 761062, 705493, 778257, 705427, 247746, 636307, 363288, 429802, 628288, 916901, 632561, 688547, 246449, 624142, 1026010, 784863, 770568, 861905, 955413, 962781, 754984, 856685, 947955, 854701, 807875, 565035, 877613, 850637, 872950, 554122, 809121, 752690, 659743, 1117288, 798855, 647869, 760384, 707565, 578158, 822242, 723043, 992418, 1047528, 1000222, 979362, 510041, 980178, 792014, 1049884, 670884, 785695, 896523, 802329]
14705H02329K63267q8919j26614Q8868J33490k72509l35991O21832k15293J06396
14695I76856j84726K08114J44531l34342J40590m0196q1014n1797J83618K27109
14685A188743k15998J68201j18545j38888J66799J24983l8646O7439j97295l5084
14675I71709K25426l99391N62665j50790j30757L60691k13821j55327k6791J5548
14665A059162j76448L07018r4400J02572o8020J94104j90714J40998k97704P7876
14655A054444L25582m34904M84615k50687Q2781j08806j7169R8438N0707O0779
14645A345780l28376L09292p7198J410j27143M04940l3760n0915j87422K39924
14635A496532L6000L2355m56097K48317L4433J3549K46753l27600r9382K21550
$$ y = [802329, 1065596, 976677, 850063, 938931, 1072421, 799912, 463921, 1085753, 870460, 976856, 792130, 1000244, 1144775, 810433, 951023, 910827, 829813, 778016, 961634, 1188743, 972745, 1140946, 1022401, 883513, 1050312, 1175295, 1136649, 1204088, 1006793, 971709, 1197135, 797744, 1360409, 1209619, 1078862, 1439553, 1225732, 1070405, 1043614, 1059162, 882714, 1189732, 1095332, 1197904, 1129884, 1323988, 1133274, 1274272, 976568, 1054444, 1380026, 945122, 1429737, 1179050, 1261831, 1153025, 1135856, 1234294, 1285001, 1345780, 1017404, 1326696, 1249498, 1250908, 1123765, 1528705, 1494945, 1444030, 1256608, 1496532, 1532532, 1564887, 1108790, 1357107, 1391540, 1405089, 1651842, 1324242, 1224860, 1446410]
14625A446410J15538j41658k03536K35487K72665j52864m43733K68879J28117
14616A525305n2864L18379l41187K86954J3408N008k17043j04298J17503J27857
14606A679022J67040l68105L93121k72128O9329K7547J90383M27798p03667N9788
14596A670128J43752q4111j46862M16630j17791J34261j37871J40007j16292J14623
14586B016474k09425K09555j26058O8857j04459J91148J40513J98423l15975O3700
14576B132753J54852l84046L07145K35507N8237K84367o63330J54243J72952L8320
14566B491000L95457k90516o3770K46293m0894L62675k08289L7417M43929k05601
14556C167701K53173K71095L14796R6168Q66371O12267J098827K307154L988628
$$ y = [1446410, 1561948, 1420290, 1216754, 1452241, 1724906, 1572042, 1128309, 1397188, 1525305, 1472441, 1790820, 1449633, 1736587, 1749995, 1755003, 1537960, 1433662, 1551165, 1679022, 1846062, 1477957, 1871078, 1598950, 1668279, 1695826, 1886209, 2314007, 1610340, 1670128, 1813880, 1729769, 1582907, 1999537, 1881746, 2016007, 1878136, 2018143, 1901851, 2016474, 1807049, 2016604, 1890546, 1959403, 1854944, 2046092, 2186605, 2385028, 2069053, 2132753, 2287605, 1903559, 2210704, 2446211, 2504448, 2788815, 2125485, 2279728, 2452680, 2491000, 2886457, 2595941, 2532171, 2778464, 2737570, 3100245, 2891956, 2929373, 3373302, 3167701, 3420874, 3691969, 4006765, 4102933, 4969304, 5581571, 6680398, 8987552, 12976180]
14547A2976180Q605654J2788654N387438j4407309j1296892m544392m671598j505175
14539C332560m61026k61431j57278j10506j72739k0583K36230j56719L1072P3693
14529B333273j9227L3301Q3125n0100J62731n8793J58055K01847j11333j10983
14519B621896o2157R9746M58334n08229O23441k56597r1671L4234J1830P5357
14509C006184N7449J41424m06035J86862K38896J00364n0474n509N8524j33439
14499C194246K76598l16004n7542M16449k43467M32596j52711K79274m5472j69718
14489C614249K07565J98849k17385k50868l1708M83976J74923m9039j22550J61590
14479D169602k63505K30905K25859o957j00515R4926L51481j29449n520J86700
$$ y = [12976180, 21581834, 34370488, 39757926, 25350617, 14053725, 9509333, 4837735, 3332560, 2871534, 2610103, 2452825, 2342319, 2169580, 2148997, 2385227, 2228508, 2259580, 2333273, 2314046, 2347347, 2430472, 2380372, 2543103, 2484310, 2642365, 2844212, 2732879, 2621896, 2559739, 2659485, 3117819, 2609590, 3233031, 2976434, 2884763, 2918997, 2930827, 3006184, 3063633, 3205057, 2799022, 2985884, 3224780, 3325144, 3274670, 3269161, 3327685, 3194246, 3470844, 3154840, 3097298, 3513747, 3270280, 3702876, 3550165, 3829439, 3783967, 3614249, 3821814, 4020663, 3803278, 3552410, 3520702, 4004678, 4179601, 4130562, 4008012, 4169602, 3906097, 4137002, 4362861, 4355904, 4255389, 4350315, 4701796, 4572347, 4566827, 4753527]
14469D753527P4293j22146j52644P87884m15556J57112J03219m17946O35761j85999
14459E217505l46174K97376J9622N88114o5031k77141j09058O01835J04949k39165
14449E792832O0463J28282K8957L55645n58659M41636K35821J94341J458k46255
14439F434521L62342K27381j06604r0870J81576o1822K59729N73852l73080J31904
14429G538929j32217M41795j688j15761J19910K39580m35554N57337K3281J02679
14419H338291P28613j36144K3349j14956L33433L7748q6268M61358K5080K08721
14409I819225p1743K04036K94438j32448L32604J22029J52347J62467L10194N5760
14399A1248909J05128K34146L08938J16014L96124j3322K32570L18441L75985
$$ y = [4753527, 4827820, 4705674, 4553030, 5340914, 4925358, 5082470, 5185689, 4767743, 5403504, 5217505, 4871331, 5168707, 5188329, 5776443, 5711412, 5434271, 5325213, 5927048, 6031997, 5792832, 5853295, 5981577, 6010534, 6366179, 5807520, 6249156, 6484977, 6679318, 6680776, 6434521, 6796863, 7024244, 6917640, 6826770, 7008346, 6946524, 7206253, 7780105, 7407025, 7538929, 7406712, 7848507, 7846819, 7731058, 7850968, 8090548, 7654994, 8212331, 8235612, 8338291, 9066904, 8930760, 8954109, 8839153, 9172586, 9210334, 9124066, 9585424, 9610504, 9819225, 9747482, 9951518, 10245956, 10113508, 10446112, 10568141, 10720488, 10882955, 11193149, 11248909, 11354037, 11588183, 11897121, 12013135, 12409259, 12395937, 12628507, 12946948, 13322933]
14390A3322933l7498K34473M42799j52837N06427M06416L29818K35052N4755M19445
14380A5761783K60187P05514k41309L60541M54000K34301P43966J63453P74139
14371A9216575j92099P22302L10689L30715P46245j51728Q92928M09247M97203
14362B2782077M38695N97478M83668K9844Q42908Q23588Q22197M79083M80627
14353B7780165M82323R39620M62870R59470N27343O43660J222052P72948O80888
14344C4471339Q16792J095226J085909Q70768O97866J561640P98063J418261R77965
14335D3793829J352349J600510J072588J128922J824713J689817J087320K491354
14327E6041402J333521K164069K031547J632746K394106K263672J772470L069534
$$ y = [13322933, 13285435, 13519908, 13962707, 13809870, 14316297, 14722713, 15052531, 15287583, 15342338, 15761783, 16021970, 16727484, 16486175, 16846716, 17300716, 17535017, 18278983, 18442436, 19216575, 19024476, 19746778, 20057467, 20388182, 21134427, 20982699, 21875627, 22284874, 22782077, 23220772, 23818250, 24301918, 24331762, 25174670, 25998258, 26820455, 27299538, 27780165, 28262488, 29202108, 29664978, 30624448, 31151791, 31795451, 33017503, 33790451, 34471339, 35288131, 36383357, 37469266, 38340034, 39037900, 40599540, 41397603, 42815864, 43793829, 45146178, 46746688, 47819276, 48948198, 50772911, 52462728, 53550048, 56041402, 57374923, 59538992, 61570539, 63203285, 65597391, 67861063, 69633533, 72703067]
14319G2703067K825611K410908K936037K819034L208795L304008L510222L754549
14311I7472231M066977M105769L999027M966864N025208N146486N336751N642127
14303A35761440O059076O161497P025861P312832P723826P452493Q880979R013415
14295A95391419R512344R673431J1084475J0758229J1720455J1904895J2916442
14288B72961690J3164292J3719361J4429246J4554542J5009106J5119629J5145687
14281C74103553J4776541J4867502J4189589J3857463J2416286J1265950R563216
14274D65040100P502328M486661Q59010j698551l008028m07482k811220n679304
14266D64283514p391843r486032j1612507j2347912j4578750j4671254j5325488
$$ y = [72703067, 75528678, 77939586, 80875623, 83694657, 86903452, 90207460, 93717682, 97472231, 101539208, 105644977, 109644004, 114610868, 119636076, 124782562, 130119313, 135761440, 141820516, 147982013, 155007874, 162320706, 170044532, 177497025, 186378004, 195391419, 204903763, 214577194, 225661669, 236419898, 248140353, 260045248, 272961690, 286125982, 299845343, 314274589, 328829131, 343838237, 358957866, 374103553, 388880094, 403747596, 417937185, 431794648, 444210934, 455476884, 465040100, 472542428, 477029089, 477888099, 476189548, 473181520, 472774038, 469962818, 464283514, 456891671, 447405639, 435793132, 423445220, 408866470, 394195216, 378869728]
14259C78869728j5844810j5807884j5685557j5511924j4798740j4660245j2410251
14252B74150317j3198346j2750424j1935778j1900046j0868846j0309234r555662
14245A93631981r088405q557826p890305q071880p182537o905150o432379o075564
14237A33427935n624256n407070n302063m853762m635507m113822m110918l810772
14229I5569765l437390l794200l382805l474710k739334k930014k546902k454362
14221G0810048k652978j976215k296226k261563j935915j709610j942525j739857
14213E4295159j256462j665563j787928j265538j851620j084073r79591r19388
14205D3484996j368209j309482j371230r22843r17034o56642j262733j064544
$$ y = [378869728, 363024918, 347217034, 331531477, 316019553, 301220813, 286560568, 274150317, 260951971, 248201547, 236265769, 224365723, 213496877, 203187643, 193631981, 184543576, 175985750, 168095445, 160023565, 152841028, 145935878, 139503499, 133427935, 127803679, 122396609, 117094546, 112240784, 107605277, 103491455, 99380537, 95569765, 92132375, 88338175, 84955370, 81480660, 78741326, 75811312, 73264410, 70810048, 68157070, 66180855, 63884629, 61623066, 59687151, 57977541, 56035016, 54295159, 53038697, 51373134, 49585206, 48319668, 46468048, 45383975, 44404384, 43484996, 42116787, 40807305, 39436075, 38513232, 37596198, 36939556, 35676823, 34612279]
14197C4612279j070419p52607q25080l47419r75215p18055j012212n92265q65053
14188B7453954q50001k6360o91483o63812n81493o41993l80859q43624l89325
14179B2385004J1375r98672q4590l04956m85611k97577n35607p06881j80844j13354
14169A8688287n23648n94567k70806n5603k03270k72428l79089m11961j25667
14160A5851248m67868n47187R9757j68177j42209k31722o25652N53581n31395
14151A3790376l64953l32032M6852j2657l47238j53370j82855r5670m93710j08320
14141A1746423k40380n3674l42782q8404n30358K25657k7627j54863l36995k70764
14131I926233k8642o3367J05495k99478k32821j12508k61734l3836q5793r9028
$$ y = [34612279, 33541860, 32789253, 31964173, 31616754, 30641539, 29923484, 28911272, 28319007, 27453954, 26603953, 26577593, 25886110, 25222298, 24640805, 23998812, 23617953, 22774329, 22385004, 22396379, 21397707, 21313117, 21008161, 20522550, 20224973, 19689366, 18982485, 18801641, 18688287, 18164639, 17570072, 17299266, 17243663, 17040393, 16767965, 16388876, 15976915, 15851248, 15383380, 14836193, 14935950, 14767773, 14625564, 14393842, 13768190, 14321771, 13790376, 13425423, 13093391, 13140243, 13127586, 12780348, 12626978, 12444123, 12348453, 11854743, 11746423, 11506043, 11452369, 11109587, 11021183, 10490825, 10716482, 10688855, 10533992, 10196997, 9926233, 9897591, 9834224, 9939719, 9640241, 9407420, 9294912, 9033178, 8999342, 8913549, 8814521]
14121H814521j46474j52897l62663j36017L47065m44463J08257j38849k50267
14112G638213J2938k29187p3955K73459n73694J37418k32006J21993q1705o8779
14102F924695j26192P3641k45581p6330l79436M11628m78592J45622j37212n41817
14092E570426K09231K91347j43474p0161m42334J46217L60446q4255j73037k51740
14082E412666j55903j89801L6269p0589P1135m6573j19952j62551P0514n0947
14072D794268k02326L43943k10113k54712L05361l43062O03N2044l94151K94228
14062D386083k11053J67369j36071K7134k75696l23J98301r5082J8049Q4947r7076
14051D066582n553j57087Q199k26499k06647J05079l6815M6902j05864r7519L05364
$$ y = [8814521, 8668047, 8515150, 8152487, 8016470, 8363535, 7919072, 8027329, 7888480, 7638213, 7651151, 7421964, 7348009, 7621468, 7047774, 7185192, 6953186, 7075179, 6993474, 6924695, 6798503, 6872144, 6626563, 6550233, 6170797, 6582425, 6103833, 6249455, 6112243, 5570426, 5779657, 6071004, 5927530, 5857369, 5415035, 5561252, 5921698, 5837443, 5664406, 5412666, 5256763, 5066962, 5103231, 5032642, 5103777, 5057204, 4937252, 4774701, 4845215, 4794268, 4591942, 4935885, 4725772, 4471060, 4776421, 4433359, 4433962, 4486006, 4091855, 4386083, 4175030, 4342399, 4206328, 4233462, 3957766, 3957443, 4155744, 4060662, 4078711, 4163658, 4066582, 4061029, 3903942, 3912141, 3685642, 3478995, 3584074, 3547259, 3594161, 3488297, 3390778, 3696142]
14040C696142J26119n11243M54115k86475m23458O20829m60879K87799J96291
14031C699240l79155j00017M91410q3623l29018K08646m8719l70387j09370K5180
14021C004187R5536j5209l00973L09733R3696j52156k57841p668j80287K10038
14011B799056K05198o46943K95656j47607M6160M7898l53921K0890L35939L6849
14001B639175N6959l49603O3733p4005K6298J54461j41493K5562L3593J89698
13991B624378M97375M70481J150253L322296P662195J3485810J0227805j0949904
13983B8490689j2682725o093553k587356j268992j234932k64962n81823q7357
13975C688989n72486J1413J2351k55450p7939k03729K73681m35064J33544j8311
$$ y = [3696142, 3822261, 3311018, 3765133, 3478658, 3055200, 3676029, 3215150, 3502949, 3699240, 3320085, 3220068, 3711478, 3627855, 3298837, 3507483, 3458764, 3088377, 2979007, 3004187, 3099723, 3084514, 2783541, 3093274, 3186970, 3034814, 2776973, 2769305, 2589018, 2799056, 3004254, 2357311, 2652967, 2505360, 2551520, 2599418, 2245497, 2266387, 2602326, 2639175, 2696134, 2346531, 2410264, 2336259, 2362557, 2517018, 2375525, 2401087, 2434680, 2624378, 3121753, 3592234, 4742487, 8064783, 15726978, 29212788, 39440593, 28490689, 15807964, 9714411, 7127055, 5858063, 4623131, 4358169, 3776346, 3688989, 3116503, 3127916, 3140267, 2884817, 2806878, 2603149, 2876830, 2441766, 2575310, 2556999]
13965B556999K62829m79653J79066p4923Q122K00019m55876n6866K98638J83218
13955B621573j44428j63192k66992K01643m24371K15327J49605m9500j79168K26116
13945B186613l30652J46244J13108n01178K27947j53181L48599l95113K13040
13936A855427J90329J58923l41928R7574j79229L3507R4985N9169k52622l64352
13926A351783Q15833n75666J19518K82869r5095k10021K86420l73949J36343j84692
13916A553343J73021K8044k30648M3402k47159L54885q5125J60190k06539Q4006
13906A627420j7576j19572L824k2709L54089m25336J39787M01813n02514R5278
13896A534504R3392p3292M06654n98038o8060J10971n318l3729J5863J53172l32474
$$ y = [2556999, 2819828, 2340175, 2519241, 2444318, 2452440, 2652459, 2196583, 2139717, 2438355, 2621573, 2477145, 2313953, 2046961, 2248604, 1824233, 2039560, 2189165, 2139665, 1960497, 2186613, 1855961, 2002205, 2115313, 1614135, 1842082, 1688901, 2037500, 1642387, 1855427, 2045756, 2204679, 1862751, 1960325, 1781096, 1814603, 1909588, 1968757, 1716135, 1351783, 2167616, 1591950, 1711468, 1994337, 1899242, 1689221, 1975641, 1601692, 1738035, 1553343, 1726364, 1754408, 1523760, 1567162, 1320003, 1674888, 1589763, 1749953, 1543414, 1627420, 1609844, 1490272, 1494096, 1471387, 1825476, 1400140, 1539927, 1941740, 1439226, 1534504, 1627896, 1554604, 1961258, 1363220, 1295160, 1406131, 1400813, 1367084, 1382947, 1536119, 1203645]
13885A203645M77770o18842l1575R0568n681n7521J11098j77155M50249m4316
13875A398240k81921K56524k20300j87570J13370k64360K43598m8905M4658J86399
13865A239733L34032n44140J29848k27371M16298j51197q3103K7357K4940j73931
13855I92466J29920m397K10682k91735R6238k86885J40893M7149M9755J7262j9798
13844A081550K25749k82639N8591l07811J95668J85076o1459k30171P5890L07285
13834A247729j00400n52405K09841K29525L45941F27922N53764j09300j63935
13825I08451L4155N8176k17184L23403l57810N2814r9638K91792R3535j87433
13815I00261Q7362j84068j15746K59424k12745N1789C52974M82053K1772j13988
$$ y = [1203645, 1681415, 1062573, 1030998, 1121566, 1115885, 1058364, 1169462, 992307, 1442556, 1398240, 1116319, 1372843, 1152543, 964973, 1078343, 813983, 1057581, 1008676, 1053334, 1239733, 1573765, 1029625, 1159473, 932102, 1348400, 1197203, 1114100, 1141457, 1166397, 992466, 1122386, 1117989, 1328671, 1036936, 1133174, 846289, 987182, 1034331, 1084086, 1101348, 1081550, 1307299, 1024660, 1083251, 775440, 971108, 1156184, 1094725, 864554, 940444, 1247729, 1147329, 594924, 804765, 1034290, 1380231, 627922, 1181686, 1072386, 908451, 942606, 1000782, 783598, 1107001, 749191, 802005, 702367, 994159, 1087694, 900261, 987623, 803555, 687809, 947233, 734488, 786277, 352974, 835027, 856799, 742811]
13805G42811l246M2070K13672J17351l48463k9445k3603K37164M3599j76509k4313
13794G91088L04180j29021j2026j68065K91378J31280l86744D08799N61662k12493
13784G57968o2013k83112R1423M57250j87290J21020j19231K43029l35128j4181
13774F69735K11499L4354m8869J48261j67417j97905j08859j01534N31096l15397
13764F54964p7690M53686k91503L2310J19743J7807J34590k88697j00342J76939
13754H31807L9634l72538J94736k17111N87960l08331j68375L11643M8352k64220
13744F83557Q2369k73782R4290K21422k10933q6910M13547l27746j10901K42530
13734G27443n8482j66707r522K81627K76775l61216m4266J75428k78893J71797
$$ y = [742811, 739565, 781635, 995307, 1112658, 764195, 734750, 711147, 948311, 991910, 815401, 791088, 1095268, 966247, 954221, 786156, 1077534, 1208814, 822070, 408799, 970461, 757968, 695955, 412843, 504266, 961516, 774226, 895246, 776015, 1019044, 683916, 669735, 881234, 915588, 866719, 1014980, 847563, 649658, 540799, 439265, 970361, 654964, 577274, 1030960, 739457, 771767, 891510, 909317, 1043907, 755210, 654868, 831807, 871441, 498903, 693639, 476528, 1064488, 756157, 587782, 899425, 947777, 683557, 765926, 492144, 586434, 807856, 596923, 510013, 923560, 595814, 484913, 727443, 668961, 502254, 492732, 774359, 1051134, 689918, 645652, 821080, 542187, 713984]
13724G13984j29289j69315J46455k2768m0680n9103J56297l7320K2254J21545
13714G02060k33740L37364l20922J14637j54896Q3877k9632Q3508B45303K22881
13704D68184J17033N3728j01072o849L33567C23347M06969C61730K32382r8765
13694D95347A96903L10877J69065J44058l01110j41341K02696I3496N62076C19355
13683E74711J94610k45483J52650O2636o1750j73602J82675M8953l27082J49753
13673E58071o1208k21092L39741B68388L72521C03434L03782k3049N8447l02299
13663C40315L27245B37871N11619L8576l22473J22348j50870B18066K528M48013
13653F68607j79505j56939M5664J15966K84140N5644j71734J19233j87833j58424
$$ y = [713984, 584695, 415380, 561835, 539067, 498387, 439284, 595581, 558261, 580515, 702060, 468320, 805684, 484762, 599399, 444503, 528380, 498748, 582256, 245303, 468184, 585217, 638945, 537873, 531024, 864591, 323347, 730316, 361730, 594112, 495347, 196903, 507780, 676845, 820903, 519793, 378452, 581148, 93496, 655572, 319355, 574711, 769321, 523838, 676488, 739124, 677374, 503772, 686447, 735400, 408318, 558071, 496863, 275771, 615512, 268388, 640909, 303434, 607216, 584167, 642614, 340315, 667560, 237871, 749490, 788066, 465593, 587941, 437071, 218066, 220594, 668607, 489102, 332163, 377827, 493793, 777933, 833577, 661843, 781076, 593243, 434819]
13643D34819j33733m8539J73849J6625N8635J54521B62104L70880k18592k2167
13633C92225q7934L16728k79992J57925J31265J90970A98078J92537q513R692
13623C91794R6675j59702b9688E26866J38834C14361J59829j63646J04939j92183
13613B23300A00795J98385J93247J85650B72595J08961H3951N741Q3903N07362
13603F80957l21307K05480B28597K90053j45362n2780N1483r5901J73499j2022
13593D37567K98332l31429J55462K5746k64673N34814B97808j41762L21319Q5618
13583E62983k02042p0932A08056K39708j73666M69509j40693j20757A58317L49618
13573E07935j74889N1765J21410A27719K73626K67627A31574l6280K87505N8528
$$ y = [434819, 301086, 252547, 426396, 443021, 501656, 656177, 262104, 632984, 414392, 392225, 304291, 621019, 341027, 498952, 630217, 821187, 198078, 390615, 382102, 391794, 488469, 328767, -29688, 526866, 665700, 314361, 474190, 310544, 415483, 223300, 100795, 299180, 492427, 678077, 272595, 381556, 83951, 89692, 173595, 680957, 359650, 565130, 228597, 518650, 373288, 320508, 371991, 276090, 449589, 437567, 735899, 404470, 559932, 585678, 321005, 855819, 297808, 156046, 477365, 562983, 360941, 290009, 108056, 347764, 174098, 643607, 502914, 382157, 158317, 507935, 333046, 384811, 506221, 127719, 401345, 668972, 131574, 95294, 382799, 441327]
13563D41327K4709B25038L98806k86835O4222O2591p9641j13443F8870L9190L00502
13552D08562A64193L53933L1688j13383j36579L3776j00518J29246J13194M1715
13542E17265D7735M45963O1738j75157m5631m9639L57947j21596B53889K08041
13532D61930B05186K71408r9480J63512A29486M09823k46677j30503K34699j66921
13522B29907p1300K08224j03141J09817j07453j13479n5488J83140m0356D1353
13511E84759B27722K97K28921N1391A44102K25041J16008E8986J17548K65802
13501D42336A88699J76874J36088j68781j47362K07936j46519C4774L92040j20598
13491C06216j51175m1974k3586K74244J80111e9019B45958M5561j38864K17853
$$ y = [441327, 466036, 225038, 623844, 337009, 401231, 463822, 384181, 270738, 68870, 108060, 408562, 164193, 518126, 549814, 436431, 299852, 333628, 233110, 362356, 475550, 517265, 47735, 493698, 555436, 380279, 334648, 285009, 642956, 521360, 253889, 461930, 205186, 476594, 377114, 540626, 129486, 539309, 292632, 162129, 396828, 229907, 158607, 366831, 263690, 373507, 266054, 152575, 97087, 280227, 239871, 41353, 584759, 227722, 228019, 456940, 508331, 144102, 369143, 485151, 58986, 176534, 442336, 188699, 365573, 501661, 332880, 185518, 393454, 246935, 34774, 426814, 306216, 155041, 113067, 89481, 363725, 543836, -59019, 245958, 291519, 152655, 370508]
13481C70508j82821K83405A62651M2012R7293J2831N4606H5499K18591K37918
13471E42008A91140K19678n9626A43828N4822L24066k00692H9626B1699J08927
13461A30626J29562O7644A16651K91228j79400J70441M1373l3742j10402l7121
13451B59028J06857H2702J69749d7614B25568n3432K49444j33144g8999E23384
13440A53586K59155m5171K5743b32069D03659p9150J3298l2932J23552k06527
13430B21900P37R237J10753j66250J90419H9059J85920D5751K02416M34985k30361
13419D52791B2531J46889J7000J89751j24041J435E1272J16575J71369A44445
13408A35544J52587N3328o4070L1248n0904J6757A8919i9167A68901h6479D73748
$$ y = [370508, 187687, 471092, 162651, 204663, 301956, 314787, 369393, 85499, 304090, 542008, 191140, 410818, 351192, 143828, 198650, 522716, 322024, 89626, 21699, 130626, 260188, 327832, 116651, 407879, 228479, 398920, 440293, 406551, 296149, 259028, 365885, 82702, 252451, -47614, 225568, 172136, 421580, 288436, -78999, 523384, 153586, 412741, 367570, 393313, -232069, 403659, 324509, 337807, 304875, 428427, 221900, 222637, 231874, 342627, 176377, 366796, 89059, 274979, 45751, 248167, 683152, 452791, 22531, 169420, 186420, 376171, 252130, 253565, 51272, 167847, 339216, 144445, 135544, 288131, 341459, 277389, 308637, 257733, 274490, 18919, -99167, 168901, -86479, 473748]
13396b8080G2588L50498A57293F8541g1610D16413A83359Q4232l5103K01018A36288
13384D30342A39673N030K60254D6464J27848N0132J28084b39720C75741a6080
13373g235D0034P5233J01703J12019K10338A62187J15067j05081H3168d3765F3525
13361B40279f7443C21286p5561K98159a32558A62112J38268b3516B52684A7969
13350A7425b7797C52698J30141j06143K30172k48316p5354C1914K80106F6451
13339D71166D9655K39111h6404C65999j39046H4286K1136B4021L50174K37171
13329F11366B17759C9184K24419h3914A91030Q279J25710k5032L1758p4047G4673
13317A49809K69168A89680p1618J2354J14009b8237C81845M1284A51793M0978
$$ y = [-28080, 72588, 423086, 157293, 68541, -71610, 416413, 183359, 267591, 232488, 433506, 136288, 430342, 139673, 144703, 404957, 46464, 174312, 224444, 352528, -239720, 375741, -16080, -7235, 40034, 115267, 216970, 328989, 539327, 162187, 277254, 172173, 83168, -43765, 63525, 240279, -67443, 321286, 245725, 543884, -132558, 162112, 300380, -23516, 252684, 17969, 17425, -27797, 352698, 482839, 376696, 606868, 358552, 283198, 31914, 312020, 66451, 471166, 49655, 288766, -86404, 365999, 226953, 84286, 105422, 24021, 374195, 611366, 217759, 39184, 263603, -83914, 191030, 199309, 325019, 299987, 331745, 257698, 74673, 149809, 418977, 189680, 118062, 130416, 244425, -28237, 381845, 423129, 151793, 192771]
13307A92771N2695d4749C48514R5321a05541D31643a501B93779j04097M75117
13297F64799B70169J74056b92199F4655b62959B61670E27O8023J70473N2222A36550
13285A7328f7150C3112J61832J25791g6933b2297A81745a13269A30124P3563P4009
13274B77696A2557Q4349K73220o9718a99461h9354r5185B69771A08431N6994d3354
13262H1983d5452G11O682Q8667P964J9936J98827a65585A90442Q2364G7582L32794
13250D10376g1371G2443K02763e1189k5878A22752L3744N4123a90963c8649j89775
13239b28424C75038E4782J09344a07286A4851J91842a57823a3023B97150K53710
13229E50860C6522J89897j06964a39127B36632I2922J02929h251B12392K3989
$$ y = [192771, 245466, -44749, 348514, 443835, -105541, 431643, -1501, 293779, 189682, 664799, 270169, 444225, -292199, 64655, -262959, 261670, 527, 68550, 239023, 291245, 136550, 17328, -67150, 33112, 194944, 320735, -76933, -22297, 181745, -113269, 130124, 203687, 277696, 12557, 96906, 370126, 300408, -199461, -89354, -184539, 269771, 108431, 165425, -43354, 81983, -45452, 711, 7393, 96060, 104024, 123960, 322787, -165585, 190442, 272806, 77582, 410376, -71371, 72443, 275206, -51189, -77067, 122752, 156496, 210619, -190963, -38649, -228424, 375038, 54782, 164126, -107286, 14851, 206693, -157823, -13023, 297150, 550860, 36522, 226419, 119455, -139127, 236632, 92922, 195851, -8251, 212392, 236381]
13219B36381c9150B13449C0273g2786B53372c842j24076A99960J27006a42823
13208c26380D82597a65969B47126r0621N63440I5245A4912K26137K08607B06451
13197D9242K09343j11520E8371J84335a81472A50577a0562F9223i2948G5930e0885
13185A36811e5912B67383a81877h2886E05406q1335A88885p0683L22647j30635
13175C10214j7930j2955J14052b164A56583b51777B64355o450j16379k8056K41953
13164C55423J01113A26911B5071J21965O8770M3322E0826J38672I2756f3775A51446
13152c82014A46456p2506K88830A66420R1329G2289c11554A92652a97428A10486
13141A62862J15778n6268m8274R2503Q4860A07077L7755l233o0701J67495c5889
$$ y = [236381, -39150, 213449, 30273, -72786, 253372, -3842, -127918, 199960, 326966, -142823, -326380, 482597, -165969, 247126, 156505, 719945, 95245, 14912, 241049, 449656, 206451, 49242, 258585, 147065, 58371, 242706, -181472, 150577, -10562, 69223, -92948, 75930, -50885, 136811, -55912, 267383, -181877, -82886, 505406, 424071, 188885, 118202, 440849, 310214, 292284, 279329, 393381, -2164, 156583, -251777, 264355, 257905, 141526, 113470, 355423, 456536, 126911, 25071, 147036, 215806, 259128, 50826, 189498, 92756, -63775, 151446, -382014, 146456, 73950, 362780, 166420, 257749, 72289, -311554, 192652, -197428, 110486, 162862, 278640, 222372, 174098, 266601, 351461, 107077, 144832, 141599, 80898, 248393, -35889]
13129C6326q208j0888a18349A34336c9114A20662J30908M4766A2135J89707J09177
13118C11019Q1576b74125C61903H5667R850a56031D20448A8337R9813e7363j68309
13107b25672B9702K18434A17761a27975G7293k3689K25400A4237a70897B31377
13096A57370a21498E7400P6663J15308J2062B9453Q2636a20214n9910C1356L54280
13085C85636j34051a23716o1477O4549B16537r2912R1594a54112c4264k5125C24192
13073E5140f6600B20986a87404O6712D96705A98416B4268a07715d6222k8096k9044
13062a03362E83964a02693B6176L9411A4988R9773b04332C2007K43361r3752g153
13050B19226n9248a34479j08201A80807D5941e0951m6886b551A70778d4663E1703
$$ y = [36326, 28118, 17230, -118349, 134336, -39114, 120662, 251570, 296336, 12135, 201842, 311019, 392595, -274125, 361903, 85667, 95517, -156031, 420448, 18337, 118150, -57363, -225672, 29702, 248136, 117761, -127975, 77293, 53604, 279004, 14237, -170897, 231377, 157370, -121498, 57400, 134063, 249371, 261433, 29453, 112089, -120214, -180124, 31356, 385636, 251585, -123716, -185193, -120644, 216537, 123625, 215219, -154112, -34264, -59389, 324192, 55140, -66600, 220986, -187404, -120692, 496705, 198416, 24268, -107715, -46222, -74318, -103362, 583964, -102693, 26176, 65587, 14988, 114761, -204332, 32007, 275368, 181616, -7153, 219226, 159978, -134479, -242680, 180807, 45941, -50951, -97837, -2551, 170778, -44663, 51703]
13038e9965A44418j4060c61693B26456E9440a48984d2619J7291B18117H8038l2066
13027E5972a58964G5161d3234A70090b7621A38244I818e1549C0029O4165M8960
13016A43154c7724B28640g2806B1656a68204A31645J57946C196a70912J4206B63903
13004C84334Q0442F5800j6396N0780M2211c35497C0583a10604A18250b54941A74880
12992A05900A0734a2089r3964A46339b53956A6795a33236I0010J56361B6794R1461
12981A18255K53634j63856O4949j02445b2090B3981J17961k8304c8396B95354
12970b02024G8651a42302d5117C39444q378b49280A69060f424D4632N7083a11615
12958D9519P4634e7500A16010J72901B5606d1581j52542C70288A9364P2662k9922
$$ y = [-59965, 144418, 130358, -361693, 226456, 59440, -148984, -42619, -25328, 218117, 88038, 55972, -158964, 75161, -43234, 170090, -27621, 138244, 9818, -51549, 30029, 94194, 143154, -37724, 228640, -72806, 21656, -168204, 131645, 289591, 3196, -170912, -156706, 263903, 384334, 464776, 65800, 49404, 100184, 142395, -335497, 30583, -110604, 118250, -254941, 174880, 105900, 10734, -12089, -106053, 146339, -253956, 16795, -133236, 90010, 246371, 26794, 118255, 371889, 208033, 272982, 170537, -22090, 23981, 141942, 113638, -38396, 295354, -202024, 78651, -142302, -45117, 339444, 331066, -249280, 169060, -6424, 44632, 101715, -111615, 49519, 124153, -57500, 116010, 288911, 25606, -41581, -194123, 370288, 19364, 92026, 62104]
12947F2104J59209b88626c6662k53368A61230J8899H4165J57736a51487M3063
12937a08424B36201h4471A26406O7183j2163g754k31873B12056p2600N1866J825
12926A93147I4483D5571k0496R7046b56430C16484a64561O5393A29893c7056j14958
12915a52014A6017K61385B5252o129b56109I9997L10498a21784E8901h1434j15423
12904a96857B76788G0581J74908b32494d1372A03226a00567B72316i1764I6719
12893b58031P969A60994F2298N805a24280A37476O113O8365j02101a13873B50479
12881b18253A1960b38367A3585b07315A34124O8504L7738j1623A8037K9317Q2410
12870A29764J2160C3961K16262a47630n678B07040D1950a12149A60883B3745L619
$$ y = [62104, 221313, -288626, -36662, -290030, 161230, 180129, 84165, 241901, -151487, -108424, 236201, -84471, 126406, 193589, 181426, -7754, -239627, 212056, 139456, 191322, 193147, 94483, 45571, 25075, 122121, -256430, 316484, -164561, -99168, 129893, -37056, -152014, 16017, 277402, 25252, 19123, -256109, 99997, 410495, -121784, 58901, -81434, -196857, 276788, 70581, 245489, -232494, -41372, 103226, -100567, 272316, -91764, 96719, -258031, -250062, 160994, 62298, 68103, -124280, 137476, 143589, 211954, 109853, -113873, 250479, -218253, 11960, -238367, 13585, -207315, 134124, 202628, 240366, 228743, 18037, 47354, 129764, 141924, 33961, 250223, -147630, -153308, 207040, 41950, -112149, 160883, 23745, 27364]
12859B7364b14215e7353B2185o342a38024D0359b37865G7249M21810a9278k2590
12848d1868k3065B17853d2330B90536c29857E14577a19371N2238A35544M0862
12838A76406A1848O1395a9725l0575q0898c8A65127g7467B50612b14537B81327
12826B83849j18943K07670A4992J7841r90J99454I4096J43953D4513M5025Q4411
12815A73949l5865L11658E5052c4926n61m07788a01757A74482b07071B89235A28618
12803b6042A72859P8197J54259b82078g6842C37428F2116j8082a602k76129G9722
12791B53014A13253a1448B48318q5711d3239j9523D9824J52026a2337B21714a9889
12779a99941i055C0976J95875l4862H1249a69259a241k14193h3457D1253N274
$$ y = [27364, -214215, -57353, 22185, 15843, -138024, 40359, -237865, 77249, 499059, -19278, -41868, -64933, 217853, -42330, 290536, -329857, 514577, -119371, -67133, 135544, 176406, 11848, 73243, -19725, -50300, -131198, -38, 165127, -77467, 250612, -214537, 281327, 283849, 164906, 372576, 14992, 32833, 31843, 231297, 94096, 238049, 44513, 89538, 173949, 138084, 449742, 55052, -34926, -35487, -443275, -101757, 174482, -207071, 289235, 128618, -26042, 172859, 251056, 405315, -282078, -76842, 337428, 62116, 44034, -1602, -277731, 79722, 253014, 113253, -11448, 248318, 162607, -43239, -62762, 49824, 201850, -12337, 221714, -19889, -199941, -9055, 30976, 226851, 191989, 81249, -169259, -1241, -215434, -83457, 41253, 46527]
12768D6527d9308L840e027C18037A44949K63700j54455g5104j221D4136a20968
12756A32202J06346j05260J44510b07619c1885j1289K0831l1332A33074B0661
12745F9699a22542A81710a07728n1404C82114a72539C64001a07782j1044J519
12735a17307A98192D709Q559c9884B2269K35164A5880M7529a01396A38510d443
12723b58262a08202N4035k08D22260b8199q4687B38847b10843A00484i6669A76639
12711C958J82843f0714m5584I1364J5032d7213A11179c8042A70346m8041D5793
12699H6652b1547B98133A20251J7677B9617J84093I1356L0695g7996k1713p701
12688a07410E43314f9032r1844B68125I370J9407J1844J85094a58576F4578b46958
$$ y = [46527, -49308, -45468, -5027, 318037, 144949, 408649, 254194, -75104, -76325, 44136, -120968, 132202, 238548, 133288, 277798, -207619, -31885, -43174, -22343, -53675, 133074, 20661, 69699, -122542, 181710, -107728, -159132, 382114, -172539, 364001, -107782, -118826, -117307, 198192, 4709, 13268, -39884, 22269, 257433, 15880, 63409, -101396, 138510, -4443, -258262, -108202, -54167, -54375, 422260, -28199, -112886, 238847, -210843, 100484, -96669, 176639, 3958, 186801, -60714, -106298, 91364, 106396, -47213, 111179, -38042, 170346, 122305, 45793, 86652, -21547, 298133, 120251, 137928, 29617, 213710, 91356, 122051, -77996, -99709, -107410, 543314, -69032, -160876, 268125, 9370, 28777, 40621, 225715, -158576, 64578, -246958]
12676E7827b41789G3611a16391m4876g2567C84269b24365A71861E5989f4535K7350
12665c7185A7723a19501n5503m1777E6595a9804r211A22546I242J38638f8117
12653A57738J30949j32151n1980a39931d503j27613B8643M67799A74743n8094
12643A16649a8279A13237b13862A43582n7986a2474A750M66635f0108k67463g2460
12631B47805H6969J44056q8436F2349K89117J8133J28055a13558C2111e2421C78584
12619A63921b72422A70987p0857g8618n0570D6547R0725a6330A874K4157O5681
12608I1712c4164J1964n4746B93378L4511j16532j00864m3058O4973r355C5104
12596c0528A59934e6537A6155K54693J58019J16184A09923a34509b9396k69052
$$ y = [57827, -241789, 73611, -116391, -161267, -72567, 384269, -224365, 171861, 55989, -64535, -37185, 17723, -119501, -175004, -216781, 56595, -19804, -29015, 122546, 9242, 147880, -68117, 157738, 288687, 156536, 104556, -139931, -4503, -132116, 28643, 496442, 174743, 116649, -18279, 113237, -213862, 143582, 85596, -12474, 1750, 468385, -60108, -327571, -72460, 247805, 86969, 231025, 142589, 62349, 351466, 369599, 497654, -113558, 32111, -52421, 378584, 163921, -272422, 170987, 100130, -78618, -129188, 46547, 137272, -16330, 1874, 26031, 91712, -34164, -22200, -76946, 293378, 327889, 211357, 110493, 67435, 132408, 123053, 35104, -30528, 159934, -56537, 16155, 270848, 428867, 545051, 109923, -134509, -29396, -298448]
12586b98448R1301j4381F6330A7783J48628n4075c1298j019L042k9660j49370
12575b08305Q3016E0471K4169L322g1967j98647A49719H028h5701B89658A38160
12563h2058a631j53798A36056b71729A15928d36087e8715A04963a1189A33642
12552B05487I7148b92217B5845Q114a6485q5911j85871A10738f6297A07541N5801
12541A63342M7089q4813h5801A13700M8214R0519n6895L1768G5364A0050g1135
12529h8052H1441i5087B74104p2577a5444j68338g8659E36188A88J04182c1086
12517D2543e2520n3695A87736I1323b4480A35999i5375j36634A35719a08809d3405
12505B36753d1068C80640e7409A07131J79761a75146f1745B09862D9534R5804
$$ y = [-298448, -207147, -221528, 66330, 17783, 166411, 112336, -31298, -32317, -29275, -58935, -208305, -125289, 50471, 74640, 77962, -71967, -270614, 149719, 8028, -85701, 289658, 138160, -82058, -1631, -155429, 136056, -271729, 115928, -436087, -58715, 104963, -11189, 133642, 205487, 97148, -292217, 25845, 33959, -16485, -102396, -288267, 110738, -66297, 107541, 163342, 210431, 125618, -85801, 113700, 161914, 252433, 195538, 227306, 75364, 10050, -71135, -88052, 81441, -95087, 274104, 201527, -15444, -183782, -78659, 536188, 188, 104370, -31086, 42543, -52520, -106215, 187736, 91323, -24480, 135999, -95375, -232009, 135719, -108809, -43405, 236753, -41068, 380640, -57409, 107131, 286892, -175146, -61745, 209862, 49534, 145338]
12495A45338b4501D4628K50115m7246b26605i8562K7813D1952J09223F643J37512
12484A44155J54219f1571j05557j87926f4354L0659B58799M7196C4582J48157
12474A82739J04468a57037O9463b3787B29528a19987j82025D6651J90148A5017
12463a56035H4366e7582K5379m0975E1050Q3933K7340g6817c0875B2271c2168
12451C8601K54595b6632r6936k22169J4068d706B28166a17885M1771B05726c94647
12439A17992a63539N6295G6027g0565E8931B6019j0938b9264B70900C8811M2168
12428H0979a75233M9337a5188j07029a7309B04367D0424J51694a21956A39144
12417G8082a09301A47183R7142l3919q1260a34490C57740E3778a75008D6257b87313
$$ y = [145338, -24501, 44628, 294743, 247497, -226605, -98562, -70749, 41952, 151175, 6643, 144155, 298374, -61571, -167128, -355054, -64354, -33695, 258799, 305995, 34582, 182739, 287207, -157037, -87574, -23787, 229528, -119987, -302012, 46651, 236799, 15017, -156035, 84366, -57582, -32203, -73178, 51050, 134983, 162323, -76817, -30875, 22271, -32168, 38601, 293196, -26632, -123568, -345737, -331669, -4706, 228166, -117885, -76114, 205726, -394647, 117992, -163539, -107244, 76027, -70565, 58931, 26019, 15081, -29264, 270900, 38811, 80979, -175233, -125896, -15188, -122217, -17309, 204367, 40424, 192118, -121956, 139144, 78082, -109301, 147183, 244325, 210406, 129146, -134490, 357740, 53778, -175008, 46257, -287313]
12405g982C39892a08558K9323j05176B18374a3328E8738N0283a56096p5206B91366
12393c56408A73295a49191H7769J8380a33239j03866g0046j30696C0999a5769
12382e8432A2888J77524L1204b31639f0438b0279C61274D8125a6165o2342a5508
12370b66558a2263B74818j26504b47478L5118B28051b48979a13622C7196J78004
12360B15200b37086e5285B27409B7320a09815l8810E9594B8642J69860r4216a01966
12348b4041j82425B62497a17428C03239M5909b8565F7888i3955B73330n0564a97208
12336A07875A2261a10322C1121O204b42823A46344f9405I7577a29160M4224B66338
12324I1682a17621k4603a1122l31240D7964a62272G336K15724B0177K30724C2321
$$ y = [-7982, 339892, -108558, -79235, -184411, 218374, -13328, 58738, 109021, -156096, -231302, 291366, -356408, 173295, -149191, 87769, 106149, -133239, -237105, -70046, -200742, 30999, -15769, -58432, 12888, 190412, 221616, -231639, -60438, -20279, 361274, 48125, -16165, -78507, -15508, -266558, -12263, 274818, 148314, -247478, -212360, 228051, -248979, -113622, 37196, 215200, -237086, -55285, 227409, 27320, -109815, -148625, 59594, 28642, 198502, 104286, -101966, -24041, -206466, 262497, -117428, 303239, 349148, -28565, 67888, -93955, 273330, 222766, -197208, 107875, 12261, -110322, 31121, 37325, -242823, 146344, -69405, 97577, -129160, -84936, 266338, 91682, -117621, -142224, -11122, -342362, 47964, -162272, 7336, 223060, 20177, 250901, 32321]
12312c60977G877d5904m7868c0646j85840F2083J02137a31682A56370a24194A70097
12300d07069a37740C31544d8307A48642o3104i8731p6733C291P0078b9364J1413
12289a7951A50024j6615c4435C67911H8009f4659B27418a12415d5053P442A29746
12277e0334B6968A1414B664K46613j11986J79736A17104a49917B47406E6819J21300
12266A78119h5627E1296K1414b68103L4119C70055A49535a50666M4921A00181
12255C01109A44390N8609d1094A5819J47503b0832A24846d111D37653A74423j3404
12244A61019N9748a91167n8713J8216a12782j99524D19880h1486H5431a40323
12233B67656b79638B52408c04588A41993L45073B16240J52391L2029l7089d8916
$$ y = [-360977, 7877, -45904, -93772, -30646, -216486, 62083, 164220, -131682, 156370, -124194, 170097, -407069, -137740, 331544, -48307, 148642, 85538, -98731, -175464, 3291, 73369, -29364, -17951, 150024, 133409, -34435, 367911, 88009, -64659, 227418, -112415, -45053, -37611, 129746, -50334, 26968, 11414, 2664, 249277, 137291, 317027, 117104, -149917, 247406, 56819, 178119, -85627, 51296, 72710, -268103, -233984, 370055, 149535, -150666, -105745, 100181, 301109, 144390, 202999, -41094, 15819, 163322, -20832, 124846, -4111, 437653, 174423, 161019, 220767, -191167, -249880, -231664, -112782, -312306, 419880, -81486, 85431, -140323, 267656, -279638, 252408, -304588, 141993, 487066, 216240, 368631, 400660, 363571, -48916]
12222A68766R7854j5265A02777L22852G3528a21423B52901e9579H4874A7829a6776
12210g7354E31276g7899G40501E5483J88308j1332q5990m2797M03990c7809B17626
12198f2464D1089J16731c5061A97141J59244j25764m6631D7399c7509G049b91743
12186a70245i206A79114q8814b3435A59946L5629b07835j12770B28532O983b68902
12174A28359n9267M17834B39744A4475a18744M928k2486K4699F5152M06526F2866
12162A19832J15197m9541a64134c6572p5397B17725F075a66517O6586F2240a74285
12150C9196K64116J30353H205K56240p2899b00440A67446c01837D3829p666J08302
12139A44465c3703J6056l0543j644E9429i3254q8487g5033A93375A5771b375A99440
$$ y = [168766, 266620, 251355, 102777, 425629, 73528, -121423, 252901, -59579, 84874, 17829, -16776, -77354, 531276, -77899, 740501, 55483, 243791, 232459, 146469, 103672, 507662, -37809, 217626, -62464, 41089, 157820, -35061, 197141, 356385, 230621, 183990, 47399, -37509, 7049, -291743, -170245, -9206, 179114, 90300, -23435, 159946, 195575, -207835, -320605, 228532, 235515, -268902, 128359, 69092, 486926, 239744, 14475, -118744, -113816, -136302, -111603, 65152, 471678, 62866, 119832, 235029, 185488, -164134, -36572, -111969, 217725, 6075, -166517, -99931, 62240, -174285, 39196, 303312, 433665, 8205, 264445, 191546, -200440, 167446, -301837, 43829, 36163, 144465, -33703, -17647, -48190, -49834, 59429, -93254, -181741, -75033, 193375, 15771, -2375, 199440]
12126A02900O2516M5326A01266a26820N5087D333e0516A16504B9349K03800q1336
12115A51813i0069C97377E4283G237M2268a53265j1398A18682K09696c5347l28779
12104c64126A13173g2629A43996a96319D7086C752K39826b54445A8959a04305
12093a7006n7828A80477e3239G3703c93177a02778G3533l1627L4004h8791a6764
12081g850A81652J01308j17347K6868c37125J52963A04297B916a21060b5437o9951
12070i5388A08182k5686L976J25684c5646k5673A28969K25539m6641L49215L66764
12059A023846k63202C51672A46509f4722j78631b4274B29102b53043f393q31B7098
12047A36476a12097b4840B03635b0256D22512j37366A15957b39057J13052L4408
$$ y = [102900, 165416, 210742, 101266, -126820, -71733, 4333, -50516, 116504, 29349, 233149, 151813, -90069, 397377, 54283, 7237, 49505, -153265, -164663, 118682, 328378, -35347, -364126, 113173, -72629, 143996, -196319, 47086, 3752, 243578, -254445, 18959, -104305, -17006, -74834, 180477, -53239, 73703, -393177, -102778, 73533, 41906, 75910, -88791, -16764, -7850, 181652, 282960, 165613, 192481, -337125, -184162, 104297, 2916, -121060, -25437, -95388, 108182, 82496, 86472, 212156, -35646, -61319, 128969, 354508, 307867, 657082, 1023846, 760644, 351672, 146509, -64722, -243353, -24274, 229102, -253043, -6393, -7224, 27098, 136476, -112097, -24840, 203635, -20256, 422512, 285146, 115957, -239057, -126005, -91597]
12037i1597J7632B1372J28182c6832k17461q8603D058J0439a31420c4094A60310
12025a04848b8650g803r0937L0974I4503e478F6619R4201a31604B30849A4350
12013B40118b06280k7824j1624a0767B65277A22379c03031B62846D0803d59351
12002i7073d0044C4814e3069C55205f342q9079d942l2507E9652L476J92525E9291
11989g5563g492r6910L924A77857a57928g5254l5572L6169C82795a60528B2727
11977A42896c69517e7782m1167C2472a4452A92829B966c32428A16581g350B59020
11965B21289a51406c1935A04517a09227A74020e0166A08548a91241c9084E9693
11954h5397C01009a05591l3113k1468H6481k3979b3435l40188N2061A7275J64310
$$ y = [-91597, -73965, 21372, 149554, -36832, -254293, -342896, 4058, 14497, -131420, -34094, 160310, -104848, -28650, -7803, -98740, -67766, 94503, -5478, 66619, 160820, -131604, 230849, 14350, 240118, -206280, -234104, -245728, -10767, 265277, 122379, -303031, 262846, 40803, -459351, -97073, -40044, 34814, -53069, 355205, -6342, -95421, -4942, -37449, 59652, 63128, 255653, 59291, -75563, -7492, -104402, -100478, 177857, -157928, -75254, -110826, -74657, 382795, -160528, 22727, 142896, -369517, -57782, -98949, 32472, -14452, 192829, 2966, -332428, 116581, -7350, 259020, 221289, -151406, -31935, 104517, -109227, 174020, -50166, 108548, -191241, -39084, 59693, -85397, 301009, -105591, -138704, -160172, 86481, 62502, -23435, -363623, -311562, 17275, 181585]
11943A81585d1475A63321a87665G3281g2089B76554A43O3846B3928J96456F9421
11931H1976b48508B02324c12261J49168r1076E3525c25463A20635d8032j7644
11921f5676j24190j71080R9485A82640a63066E2911c35544B7065N4606B5525b3550
11909a9792j73855O4964j93621B4559J19163J2190a75034j51232e8882j6240q0437
11898a55559g755G5560c18893A03088P9459H6046M3238n0173a75818H5117a72448
11886a16732k751q7693A02650N2540c47175g3004G1825b55934R0485k23344a46543
11874c09674e3901j77361A87417d35352J61870C75483A6075e67027K48621f8176
11863G9533h2610M0755B69466b65200A21763B849h1581a3833k22737A48662j6281
$$ y = [181585, -41475, 163321, -187665, 73281, -72089, 276554, 143, 63989, 23928, 220384, 69421, 81976, -248508, 202324, -312261, -163093, -254169, 53525, -325463, 120635, -48032, -65676, -189866, -360946, -261461, 182640, -163066, 52911, -335544, 27065, 81671, 25525, -23550, -19792, -193647, -128683, -322304, 24559, 143722, 155912, -175034, -326266, -58882, -75122, -155559, -7755, 75560, -318893, 103088, 182547, 86046, 129284, 79111, -175818, 85117, -172448, -116732, -119483, -207176, 102650, 155190, -347175, -73004, 71825, -255934, -165449, -388793, -146543, -309674, -53901, -231262, 187417, -435352, -273482, 375483, 16075, -567027, -318406, -68176, 79533, -82610, -41855, 269466, -265200, 121763, 2849, -81581, -13833, -236570, 148662, 132381]
11852A32381K62636a6933A79149d98224b01932F0497j3955g785l99587A68101
11841D6201Q7889a44866k14420A23520E6153O5717C2737c8308A0976i2647c085
11829G7463B2048a28326b2789k98015f8857H749L28826q7345b98628C45412A54425
11817Fg3244R524A48256a08009M1593j46753C1418a02651q5161f2826Q330O411
11805d8085r6441D51452a23862k1255A15473E3186a15181a7503j49284k83873
11795d50660c9640k12600d072I7927N1944C5454K13651a08837a6678A43414a78616
11783a21902r0338b5695B33203j04413L5061G5805a76186A05460L57239A47124
11772e5088H337f2544j78060C19081a58282k8720B80309a75602o0746a10130b8714
$$ y = [132381, 395017, -16933, 179149, -498224, -201932, 60497, 46542, -7785, -407372, 168101, 46201, 134090, -144866, -359286, 123520, 56153, 121870, 32737, -38308, 10976, -92647, -3085, 77463, 22048, -128326, -22789, -320804, -68857, 8749, 337575, 250230, -298628, 345412, 154425, 6, -73244, -63720, 148256, -108009, -66416, -213169, 31418, -102651, -187812, -62826, -54496, -48085, -144526, 451452, -123862, -145117, 115473, 53186, -115181, -17503, -166787, -450660, -39640, -252240, -4072, 97927, 149871, 35454, 249105, -108837, -16678, 143414, -178616, -121902, -212240, -25695, 233203, 128790, 163851, 75805, -176186, 105460, 462699, 147124, -55088, 8337, -62544, -240604, 319081, -158282, -187002, 280309, -175602, -236348, -110130, -28714]
11760a70995j58736C45987b24660R6491a6177A4882K30065j4218a50521M6234
11750a04287A4459b4870H6821R9591b93749A29626c37624e5760j53482f5435A88242
11738b75799F0749e0794k36121A75871a90668C0682P1059J9646J13234J02433
11728C37054b78457a12711M5260H4787a36640m5877A80271c63555e3623m072j0550
11717f8245L1594Q642j36472b6341j75154C9487D165h2937F5616K31400a2843
11705E2864a77892k14563A81291C4747b2692A34283M8022p0976a43148j03170
11695b46318P0172j76250d5202j01338B80897a01684L1144A83633a13609A31155
11684A05954i3667C37442j66412b4728B57810b2113A27198g2586o1197E9459a4031
$$ y = [-170995, -329731, 345987, -224660, -128169, -16177, 14882, 244947, 230729, -150521, -104287, 14459, -24870, 86821, 186412, -293749, 129626, -337624, -55760, -209242, -65435, 188242, -275799, 60749, -50794, -286915, 175871, -190668, 30682, 101741, 121387, 234621, 337054, -278457, -112711, -67451, 84787, -136640, -182517, 180271, -363555, -53623, -57695, -68245, -36651, -28009, -164481, -26341, -201495, 39487, 4165, -82937, 65616, 297016, -12843, 52864, -177892, -392455, 181291, 34747, -22692, 134283, 182305, 111329, -143148, -246318, -176146, -352396, -45202, -146540, 280897, -101684, -70540, 183633, -113609, 131155, 105954, -93667, 337442, 171030, -24728, 257810, -22113, 127198, -72586, -133783, 59459, -14031]
11672A39658m5390c05488I0932d4658a0962B3994P7448i0718k60215B09788b47410
11660A21317c96050b2284B5871K78926i8480D2399a57143C5961K03213f0254j76320
11649b36574O8322C1141N5015c33254A31312P4709F0542a46729E0245b40277k07134
11638d47411a65041L5656N0584a9990j45176H196J16380l4530b33378R7922j19722
11627b55178J18545A30196P9996a09781A54846a26737j2129A66276a76445G1086
11616a82831L8863C19904A00099D5817Q7348P8268a91816C26365b53936A2992
11605b25609K3279f6480b8183g06j41540B5105g2201m7880A31136j5392f5681
11593E9204f8585j95676g9381j7702M4313d152A38316C0290J31704a47345N733
$$ y = [139658, 94268, -305488, 90932, -44658, -10962, 23994, 101442, -90718, -350933, 209788, -247410, 121317, -396050, -22284, 25871, 304797, -98480, 42399, -157143, 35961, 239174, -60254, -236574, -168252, 31141, 86156, -333254, 131312, 206021, 60542, -146729, 50245, -240277, -447411, -165041, -129385, -78801, -19990, -165166, 8196, 124576, 90046, -233378, -135456, -255178, -136633, 130196, 210192, -109781, 154846, -126737, -138866, 166276, -176445, 71086, -182831, -143968, 319904, 100099, 45817, 133165, 211433, -191816, 326365, -253936, 12992, -225609, -202330, -66480, -28183, -706, -142246, 25105, -72201, -120081, 131136, 115744, -65681, 59204, -68585, -264261, -79381, -97083, -52770, -4152, 138316, 30290, 161994, -147345, -141612]
11582a41612a1862A05843a36987p4055B24476d160k74160C37008C6040N9664c96933
11570a80824c6328K924l66033B74557m2631a52730A01859a57032O6713G6943b97874
11558d6663B15850c6403A2709J24595a629l40892C71184b41479F038f8533A2036
11546B66881b64991h0137j39449B52418g5875D8946J54555K9843J17510A2092
11535d5951j41815c5228A63080h1524A98377a49483B42067C741L0976J4511J60879
11524B10107m2593A9538J14719P431h0119D04942a93293j84741a52666B57402
11513a5030A02525b5565E4847J49840Q078j8771f8306k31824A9702J18131a3919
11501A02300b7508k4976G0457R5689B1783f9992E0428M45848a18704F4697h9899
$$ y = [-141612, -11862, 105843, -136987, -211042, 224476, -4160, -278320, 337008, 36040, 95704, -396933, -180824, -36328, -33404, -399437, 274557, 231926, -152730, 101859, -157032, -90319, 76943, -297874, -46663, 215850, -36403, 12709, 137304, -1629, -342521, 371184, -241479, 6038, -68533, 12036, 266881, -264991, -80137, -219586, 252418, -75875, 48946, 203501, 233344, 350854, 12092, -45951, -187766, -35228, 163080, -81524, 198377, -149483, 242067, 3741, 34717, 49228, 210107, 167514, 19538, 134257, 141688, -80119, 404942, -193293, -378034, -152666, 257402, -15030, 102525, -25565, 54847, 204687, 212765, 193994, -68306, -300130, 19702, 137833, -13919, 102300, -27508, -52484, 70457, 166146, 21783, -69992, 50428, 496276, -118704, 64697, -89899]
11489C51477R1258F2502L31773b08098e8594M903B06747h9319J9716A66253a16652
11477B33894O4952b120B36390J2958b1508A64922K8370P8575j03261D5860O0067
11466A05927a65728c7875D22428A90999F0410h3564M1279C6023K00669D9722a85563
11454A86829l8270J18762b84040H1934J0019I96L6627K54717D3990J93497J1292
11443B48779b5557j82152A81417e6404C60373H7747d0565B90500b06146O4043
11433a42103A40853m8477l3900A2467c92192a24890C57730j71203j1568a08981
11422a82363A01706f7878B20559J03932b0140k9183A27758b40088a13361A383
11411f4777o4601k16669G4815K46949A4606K84378B3583N2211j9242O7342b79060
$$ y = [351477, 442735, 62502, 394275, -208098, -58594, -53691, 206747, -89319, -69603, 166253, -116652, 233894, 298846, -2120, 236390, 249348, -21508, 164922, 193292, 271867, 168606, 45860, 105927, -165728, -37875, 422428, 190999, 60410, -83564, -42285, 36023, 236692, 49722, -185563, 186829, 148559, 267321, -284040, 81934, 91953, 996, 37623, 292340, 43990, 237487, 248779, -25557, -207709, 181417, -56404, 360373, 87747, -40565, 290500, -206146, -142103, 140853, 92376, 58476, 12467, -392192, -124890, 357730, 186527, 174959, -108981, -182363, 101706, -67878, 220559, 324491, -20140, -49323, 127758, -240088, -113361, 1383, -64777, -129378, -346047, 74815, 321764, 14606, 298984, 23583, 75794, 56552, 123894, -279060]
11399B06912c94590C97703e472o1330j50504N9132g7598A67247J62173F6381a44231
11387A65862H293M9628k4772K8927K17249j34808g7692j71105a9140p815l83799
11376d10754d3606o9384l20341g2155A44007a77183p6425R5907C1243K1470O6207
11365A18920m8829K72990A41520J85920b32615A38290e2713j13922a5905C84981
11354e7678A49392b22175A60886p7449h839H572K98845B2888N5371b3123n3675
11343g6798j25143A8113a86894c4845B8779h6336k73807B45986D178J5944c03959
11331C27664A42725b74837J24354J3238B86928a25538k26711J29586A53161h4334
11320b0061j25530B62775r1826M3069A05472a24553j57540J03544P2544J548D6436
$$ y = [206912, -394590, 397703, -5472, -66802, -217306, -158174, -77598, 167247, 329420, 66381, -144231, 165862, 8293, 57921, 33149, 62076, 279325, 144517, -77692, -248797, -19140, -26955, -410754, -43606, -112990, -433331, -72155, 144007, -177183, -253608, -157701, 31243, 52713, 118920, 70091, 343081, 141520, 327440, -232615, 138290, -52713, -166635, -15905, 384981, -57678, 149392, -222175, 160886, 83437, -8839, 8572, 307417, 22888, 78259, -23123, -76798, -201941, 18113, -186894, -34845, 28779, -86336, -360143, 245986, 4178, 20122, -303959, 327664, 142725, -274837, -150483, -137245, 286928, -125538, -352249, -222663, 153161, -84334, -20061, -145591, 262775, 170949, 214018, 105472, -124553, -282093, -178549, -106005, -104457, 46436]
11308a52762D7973K5097O0794C7815b53514G2528d8588j07371j34696a7671r3501
11297a11172C75590H0728g4660j44a1686l06517J05846D567c04931b6490p8912
11286a05402B5584b1128j23288C27981h8940c3969o7647j5331A65963a12515n8189
11275a70704B40935a63380j46202J30638n5390D3700L2964b17917F7729b03478
11264A77025e2178C40441j64385f125C2553a11659A65454N2488r6270C6467d02449
11252I7684a52195j27509c5113B1275K26533d8440j66182J05115j88874j18798
11242d17179b9906o52G9861K69177c43703a54380E708b9359j25426j84157a51939
11230a51173j14121j48762J78683a12972j15396G9794l3959c3079l7470H1587
$$ y = [-152762, 47973, 73070, 133864, 37815, -253514, 72528, -48588, -155959, -290655, -17671, -111172, 375590, 80728, -74660, -74804, -11686, -318203, -212357, 4567, -304931, -26490, -105402, 25584, -21128, -144416, 327981, -88940, -33969, -101616, -116947, 165963, -112515, -170704, 240935, -163380, -309582, -178944, -234334, 43700, 76664, -217917, 67729, -203478, 177025, -52178, 340441, 176056, -6125, 32553, -111659, 165454, 217942, 121672, 36467, -402449, 97684, -152195, -279704, -35113, 21275, 247808, -48440, -214622, -109507, -298381, -417179, -29906, -30558, 79861, 349038, -343703, -154380, 5708, -29359, -154785, -338942, -151939, -151173, -265294, -414056, -235373, -112972, -228368, 79794, 45835, -33079, -70549, 81587]
11219a41179D8138c51275e2407A16851K0201d0401B68863c24333A97537a84459
11208b86726D2571b87957J22750A99552d43012A8810D823e2025A70430q3293a42682
11196h0756A52911E3209a07909A67930D9171c39165c7701B6395d7155A01821a70493
11184b3965q28k67225J21607Q2446C515P246J5157O8312c4930B24732f4907A46866
11171g2031j44695a1145j84494N3738M1378C04082a3190j43088f052r0939D3938
11159a70262m8262A29304J0529c5499l16956a56090F0377b15455D33378A21473
11148A54448f269k75053A08857a88587F9569J3525e1490k53568N2854m955C76238
11136a55895O6536a9049E26002a97285j31796B61215j13797J40792c81230C642
$$ y = [-141179, 48138, -351275, -52407, 116851, 137052, -40401, 268863, -324333, 197537, -184459, -286726, 42571, -287957, -165207, 199552, -443012, 18810, 4823, -52025, 170430, 87137, -142682, -80756, 152911, 53209, -107909, 167930, 49171, -339165, -37701, 26395, -47155, 101821, -170493, -23965, -24793, -292018, -170411, -87965, 3515, 10761, 25918, 94230, -34930, 224732, -64907, 146866, -72031, -216726, -11145, -195639, -141901, -100523, 304082, -13190, -156278, -6052, -96991, 43938, -170262, -218524, 129304, 139833, -35499, -352455, -156090, 60377, -215455, 433378, 121473, 154448, -6269, -281322, 108857, -188587, 69569, 83094, -51490, -305058, -252204, -257159, 376238, -155895, -89359, -19049, 526002, -197285, -329081, 261215, 147418, 288210, -381230, 3642]
11125a56635D32356G6543b18433A11270R5375I6993c00185E9680a10833e2255
11114I869h3753L3094E51J11664a37835B27888r7395g8614A7086J80815J690H1730
11101B4014J28082A5488J06093K59661a57097d3080A14339Q7657d8047A74610
11090A02819M2405J08853p6728a19100k8210B40790a44584K1361C29742A39599
11079D48962b7009H7295N4013a14746C07988A09472J49590A23275L31038k1385
11069D32928J12944r4533j98553K3063E2465J69010K93022N960q279G407O11979
11058F19386k45376m7551K25148K70522m04413J05354J91255p7217l6997N7518
11048F57629J42792O18R7848l30021B39842N3626M5383M31722j45868N4611o7468
$$ y = [-156635, 432356, 76543, -218433, 111270, 206645, 96993, -300185, 59680, -110833, -52255, 9869, -83753, -50659, 551, 112215, -137835, 227888, 130493, -78614, 17086, 197901, 199591, 81730, 24014, 152096, 15488, 121581, 381242, -157097, -43080, 114339, 201996, -48047, 174610, 102819, 145224, 254077, 177349, -119100, -147310, 240790, -144584, -123223, 329742, 139599, 448962, -27009, 87295, 141308, -114746, 307988, 109472, 259062, 123275, 454313, 432928, 545872, 451339, 252786, 275849, 52465, 221475, 514497, 520457, 512178, 7407, 619386, 374010, 326459, 551607, 822129, 417716, 523070, 714325, 637108, 600111, 657629, 800421, 801039, 898887, 568866, 239842, 293468, 338851, 770573, 624705, 679316, 611848]
11037F11848J61484C02614K55836K5983L09791k40626J0525N231K963P0858j18114
11026F25061q585N6363B39967J30731K614A85544L90151k12502J6386J69818r0055
11015D59342J61446q9244j68474R1776Q7225M3061p5135K82042l16465o3798O898
11004D18674q6351J27788K39767C07511M01424j00784B16763J48656K52491K16452
10994H34362C34425L49397j06939p5311m242J46779m2973K12739J69652L0289
10984A013816Q1456k08097K11948l805k9776J1996L42790q9163L46081J16955
10974A794201N93897M0961j90016K56498N800l73408l89640J77842J7712n47113
10964A386734j17822L52j94492q44l64304M51193l55972K9277K10512n9109m38896
$$ y = [611848, 773332, 302614, 558450, 584433, 894224, 653598, 664123, 669354, 672317, 743175, 625061, 616476, 672839, 239967, 370698, 373312, 185544, 575695, 363193, 379579, 549397, 459342, 620788, 531544, 363070, 454846, 542071, 585132, 509997, 792039, 475574, 411776, 418674, 332323, 460111, 699878, 307511, 708935, 608151, 216763, 365419, 617910, 834362, 334425, 683822, 576883, 501572, 497330, 644109, 601136, 813875, 983527, 1013816, 1095272, 887175, 1099123, 1095318, 1065542, 1077538, 1420328, 1331165, 1677246, 1794201, 2388098, 2429059, 2239043, 2495541, 2501341, 2127933, 1738293, 1916135, 1933847, 1386734, 1268912, 1269264, 1074772, 1073928, 709624, 1160817, 804845, 834122, 1044634, 985525, 546629]
10953E46629K60720A54610M47569k18703A50932l0938L21319B02509G0267O8464
10943A38731A8968K28078j02797J78691K96967i8831i229k8890A89172f172l7156
10932d3328j02348c2402I2700J05644b799k08582f1446k58420A7976L7272J45032
10921B00280c4142B81231q6641b83050J40842d72j02631A06949a27346A68782
10910b57893B61633e412C5644Q039b41062G1009R8117a06769A07308L3643o5665
10899G5286a93262H4973b85182P4748A99059F750b29046G2717c5683k41098I7849
10887c0348j6297j11782F9206K2891a47379F0466h8837B54737b31452D0020f2378
10875a68543H1192a80540E6594e7190d784r6449A3323J29337b29197J12935q216
$$ y = [546629, 807349, 154610, 602179, 383476, 150932, 119994, 441313, 202509, 70267, 138731, 18968, 247046, 144249, 322940, 619907, -98831, -9229, -38119, 189172, -6172, -43328, -145676, -32402, 92700, 198344, -2799, -211381, -61446, -319866, 17976, 55248, 200280, -34142, 281231, 194590, -283050, -142208, -472, -103103, 106949, -127346, 168782, -257893, 261633, -5412, 35644, 43683, -241062, 71009, 169126, -106769, 107308, 140951, 75286, -193262, 84973, -285182, -210434, 199059, 6750, -229046, 72717, -35683, -276781, 97849, -30348, -46645, -158427, 69206, 92097, -147379, 60466, -88837, 254737, -231452, 40020, -62378, -168543, 81192, -180540, 56594, -57190, -4784, -101233, 13323, 142660, -229197, -116262, -124478]
10864a24478j00042C85207c3485B39460M6333n3085g4330E7160i2880l969c7989
10852h5634B52335g96j28761C56668b71921A10409c2441C1451m694e7869A75453
10840A86438r1691j1904J01423a07798F8814g1526A81220K4460E6732J13871n6455
10829A14148c86309A03330j635c9080j44614B72234h3364j64130L7036j52221
10819c62679e9055A21015a39375G4777a31747C8758R5548a03448A00783A910b12633
10807e31I0264B8441J93074a45736o593f3774A47889E1585j0944a70752l2305
10796b03057N9096E4971d0736j12510B76028g7441A96236k0872a151I2437K1907
10785A14344i8257B77215g605k19570e7759A73185a13333l23773E146c2815F9080
$$ y = [-124478, -224520, 385207, -33485, 239460, 285793, 232708, -74330, 57160, -92880, -96849, -37989, -85634, 252335, -796, -129557, 356668, -271921, 110409, -32441, 31451, 26757, -57869, 175453, 186438, 94747, 82843, 184266, -107798, 68814, -71526, 181220, 205680, 56732, 170603, 114148, -386309, 103330, 101695, -39080, -183694, 272234, -83364, -247494, -210458, -362679, -59055, 121015, -139375, 74777, -131747, 38758, 134306, -103448, 100783, 1910, -212633, -531, 90264, 28441, 221515, -145736, -152329, -63774, 147889, 51585, 40641, -170752, -203057, -143961, 54971, -40736, -153246, 276028, -77441, 196236, 175364, -1151, 92437, 114344, -98257, 277215, -7605, -227175, -57759, 173185, -113333, -437106, 5146, -32815, 69080]
10773b1055l12934J34037f0238E4368J20854n068h6574k13079i1896A75578d1999
10761d03436A3485K62290j28303A7157c32176J37958A7793J37882a48681e39j63593
10750a64132p4680a293B54834h8614j8510l7790B34447d76102L8133A77522m0373
10739A37149n8247b00099j84776h2664j02316j43890A68192i969q4727B11254
10728B448P6562b07449j01945J39372D1596b1274q3198c46B20315p9427a20388
10716B52858e3890q6045f0668H5468C1281r150N8738a85089r1482B2066K0918
10705D2984a39186B01038E8183J06803p8938c01862J46064j49561b6493q1687
10695a08180g091m2570A89039E1448g7619c4766E2399b34973e9012m7820d0481
$$ y = [-21055, -333989, -199952, -60238, 54368, 175222, 170154, -86574, -299653, -91896, 175578, -41999, -403436, 13485, 275775, 147472, 17157, -332176, -194218, 17793, 155675, -148681, -539, -164132, -238812, -1293, 254834, -88614, -107124, -144914, 234447, -476102, -437969, 177522, 137149, 78902, -200099, -384875, -82664, -184980, -328870, 168192, -9969, -94696, 211254, 2448, 79010, -207449, -309394, -170022, 41596, -21274, -104472, -346, 220315, 140888, -120388, 252858, -53890, -139935, -60668, 85468, 31281, 22131, 80869, -185089, -276571, 22066, 42984, -139186, 201038, 58183, 164986, 86048, -301862, -155798, -305359, -26493, -108180, -7091, -49661, 189039, 51448, -77619, -34766, 52399, -234973, -59012, -106832, -40481]
10683A09002L15797B02646b33721A55068a165j52275A27573b0007m4597A71048
10672a18806I8608k1023j5894a95077k95432J60384O4832a07249j23378A99323
10661A6168M1968L73616j76032n6097e38348b26091H7254a13306j26198e3492
10650B35938a40517c4582j20617K0848l06168a16585J4291A3376a61858A19584
10639b60162E9675c75995a87876A4833K99682a09359A11903l1315f1945r4459
10629a56404A12728h0762L1827k15064F353J0728J42919h5554p1489P1981k52349
10618c37411A52128a20261j82179a2342B37829a73337H3519a87175j1934J1938
10608a87171A19476b88137n8564B6195O480c21219B52500a34117I3444b0186d127
$$ y = [109002, 424799, 202646, -233721, 155068, -1165, -153440, 127573, -20007, -64604, 171048, -118806, 98608, 77585, 61691, -195077, -490509, -330125, -265293, -107249, -230627, 199323, 16168, 58136, 431752, 255720, 199623, -538348, -226091, 87254, -113306, -239504, -53492, 235938, -140517, -34582, -155199, -134351, -440519, -116585, -102294, 13376, -161858, 119584, -260162, 59675, -375995, -187876, 14833, 314515, -109359, 111903, 80588, -61945, -156404, 112728, -80762, -48935, -263999, 6353, 17081, 160000, -85554, -157043, -85062, -337411, 152128, -120261, -302440, -12342, 237829, -173337, 83519, -187175, -199109, -187171, 119476, -288137, -346701, 26195, 32675, -321219, 252500, -134117, 93444, -20186, -4127]
10596A97760D8306a53147C4743M881c500m8605A13353J80525A42882F0226d02092
10584a41505B3495O1561J48834c0894k22367Q696g8559B8794q321b31762a6225
10572A45467d21685a24222O0401j01320O930L0962D4783h6522r2629e6790B95536
10560C08865M5191c0786r2123A99578C9115J6591i3507l6283k06831A05909h7008
10548B3080i1399k93587A7568K60332A5005J11572k451b47115i8155a5487c824
10536a60985g5911Q998q2848F2771b22776C59136A67935d2297k50665B8780M6251
10525G5031g5648C9558d89606a26478L9248q9223A5056j151J56813F7272N0498
10514A17770i9020M1070k77660J19130N3581j04084K1928b6319F3194Q8347b26607
$$ y = [197760, 48306, -153147, 34743, 39624, -3500, -52105, 113353, 293878, 142882, 60226, -402092, -141505, 23495, 85056, 233890, -30894, -253261, -244565, -78559, 28794, 20473, -231762, -16225, 145467, -421685, -124222, -63821, -165141, -158211, -127249, 44783, -86522, -179151, -56790, 295536, 308865, 354056, -30786, -122909, 199578, 39115, 55706, -93507, -129790, -336621, 105909, -87008, 23080, -91399, -384986, 17568, 277900, 15005, 126577, 124126, -247115, -98155, -15487, -3824, -160985, -75911, -66913, -149761, 62771, -222776, 359136, 167935, -42297, -292962, 28780, 75031, -75648, 39558, -489606, -126478, -87230, -176453, 15056, 13905, 170718, 67272, 117770, -99020, -57950, -335610, -216480, -162899, -266983, -245055, -26319, 63194, 151541, -226607]
10502D7721e3319j7187D5628c57562d2074c385k70678a176k07355F4769b09720
10490I6806a058A372h1969A55461E4810a42615F1731N0909g214n938B23013i4375
10477a65078q1098E0531R9255Q2497b65074B00658K81527A21785b01389G5212
10466a41538B32710b10481I8469a12612e0033j00896j83302A23075a78163A01967
10455c6763j60889n9360A2132h1740B92102c92178b2167k20255f2685B66231b33207
10443E9587P6506K6262d7544b2574j42882D13384i2157L6722A18288a31588A9551
10431C7358b10839A20897c5537A1220J47532f0719B45632i7938B72276a09635
10420C4367j0661b7848j95609j26913G9032a07710F3723q845b13271h7760E2064
$$ y = [47721, -53319, -70506, 45628, -357562, -42074, -3385, -274063, -1176, -208531, 64769, -209720, 96806, -1058, 1372, -81969, 155461, 54810, -142615, 61731, 112640, -7214, -13152, 223013, -94375, -165078, -246176, 50531, 149786, 232283, -265074, 200658, 482185, 121785, -201389, 75212, -141538, 232710, -210481, 98469, -112612, -50033, -150929, -334231, 123075, -178163, 101967, -36763, -197652, -257012, 12132, -81740, 292102, -392178, -22167, -242422, -62685, 266231, -233207, 59587, 136093, 162355, -47544, -22574, -165456, 413384, -92157, -55435, 118288, -131588, 19551, 37358, -210839, 120897, -35537, 11220, 158752, -60719, 245632, -97938, 272276, -109635, 34367, 23706, -27848, -223457, -350370, 79032, -107710, 63723, 54878, -213271, -87760, 52064]
10408G7238b19879h611k477L690l03862h1496E3632B0095a67903a5917n7792K3326
10396e0383A47475p0338J25453r4636D6878K28389M5673j20688m0028F1413j0031
10385E1382J51742a40288d8509j5195p1704A6591a00875B14847D6700K34352B0315
10373G5658J08647J67453G335J74174N2421K68018J82519B75301L6301o4353M16406
10362F63655B69590M3921D193O6288J29838b9023A07813K06921Q1596O891l5620
10351C67601J9225l332b9104H5405K27570O8640A77987M3395M4305I0517J72356
10340B62873o604C7883a64583B7672i7522b3063j3662A50089J95875b39592A52012
10328C44047C3494b60382C22757e2043A944J35293K50749q9106j12906o9570J9198
$$ y = [77238, -219879, -8611, -11088, -7398, -311260, -81496, 53632, 20095, -167903, -15917, -73709, -50383, 147475, 77137, 202590, 107954, 46878, 275267, 320940, 200252, 160224, 61413, 51382, 203124, -140288, -48509, -63704, -135408, 16591, -100875, 214847, 46700, 281052, 20315, 75658, 184305, 351758, 7335, 181509, 233930, 501948, 684467, 275301, 311602, 247249, 663655, 269590, 313511, 4193, 70481, 200319, -29023, 107813, 314734, 396330, 403221, 367601, 386826, 383494, -29104, 85405, 312975, 381615, 177987, 221382, 265687, 90517, 262873, 256269, 37883, -164583, 27672, -97522, -23063, -36725, 150089, 345964, -239592, 152012, 344047, 33494, -260382, 322757, -52043, 1944, 137237, 387986, 298880, 185974, 116404, 135602]
10317A35602M2038l3653b46236A07573a6854j96634M7194j22711o533B57630a48294
10305b73849A0868L15284J61969A29781O5946f2407A88893A580J65372C827K8729
10294C2556a56453a7843l20935J06440K6493g1554j76309j2065c6516k9946k3053
10283h9515j26690g926A41024b30666C8947g9281A6592a62807O8990c3275I8619
10271g7754A51478A5560g0725c3505j80560B02256A00106c00335G0497J5571B6087
10259D5864K16347e32980a27476C90126A50452n0728d7689C06041F8567J33624
10249B02191c88478a76702A72284J14534a33108L0012G9425b69891f146l596C89099
10237b34155A55644C7018a77228b72A41308e246q6471I8523b48434B66519a05177
$$ y = [135602, 177640, 143987, -246236, 107573, -16854, -213488, -166294, -289005, -295538, 257630, -148294, -273849, 10868, 326152, 488121, 129781, 195727, -62407, 188893, 1580, 166952, 3827, 32556, -156453, -17843, -338778, -232338, -205845, -71554, -247863, -259928, -36516, -66462, -89515, -216205, -7926, 141024, -230666, 38947, -79281, 16592, -162807, -93817, -33275, 98619, -77754, 151478, 15560, -70725, -33505, -214065, 202256, 100106, -300335, 70497, 86068, 26087, 45864, 262211, -532980, -127476, 390126, 150452, 99724, -47689, 306041, 68567, 202191, -388478, -176702, 172284, 286818, -133108, -103096, 79425, -269891, -6146, -9742, 389099, -234155, 155644, 37018, -177228, -272, 141308, -5246, -91717, 98523, -248434, 266519, -105177]
10225a2407A66089e0765C155L14298F0298B5534i6094A51611f3441j77867e6838
10213a10033L0673A88251p3277c23229a7602A39645a90727E3267b18774A52707
10202i810j45407G527R7683e3756A71500C9689R3319c5378E361b35368Q5244J849
10190a48275F5462d8242q9443d4206B036d4312A75975A9407g6330A29107n7585
10179G1522c2149C15771j50590f7240j88558d2731B1687i5671o0275A06594c17532
10167b74094O5963A44082e13980e4125j56954e7918k1061A35445c16679g4421
10156D4868B0152b38982J5656g5274j18704f2519p8214j1695e6388B68428f054
10144a51113k03763g0420B83767d99089B03483n0223B2078K10870b29650l321
$$ y = [-12407, 166089, -50765, 3155, 317453, 60298, 25534, -96094, 151611, -63441, -241308, -56838, -110033, -79360, 188251, 114974, -323229, -17602, 139645, -190727, 53267, -218774, 152707, -9810, -155217, 7527, 105210, -53756, 171500, 39689, 133008, -35378, 5361, -235368, -150124, -148275, 65462, -48242, -137685, -44206, 2036, -44312, 175975, 19407, -76330, 129107, 71522, -32149, 315771, 165181, -67240, -255798, -42731, 21687, -95671, -155946, 106594, -317532, -274094, -208131, 144082, -513980, -54125, -211079, -57918, -78979, 135445, -316679, -74421, 44868, 20152, -238982, -223326, -75274, -193978, -62519, -140733, -152428, -56388, 268428, -6054, -151113, -354876, -70420, 283767, -499089, 203483, 153260, 22078, 232948, -229650, -232971]
10134b32971a15114G4591a84159r8365f123m94028a06204b5590A95617C8717K5815
10123F4532b82788G613c5799j69520B7238a43936F238M6489a9013B85903d15433
10111D559a79908F6758N1745i4479k10794B94517c3910B12537b49964A39900L4939
10100A74839c92932f8758E1074a31683K6156D3777a4552n4291a9281k6415m9521
10089i5217k63637P3026p5609A57573b0387k72189a39358b6723j79460j7206B54860
10077a14623c7819j42531q9789A33677d26351d7398j16615A44034a3447B22425
10066A7061J097f0185B80993g650l1410k32534a2754j48837o2689G8325b92428
10054C98326G6403l0026i1156d0354A19969b9218k02607j2589R582O2173j90174
$$ y = [-232971, -115114, 74591, -184159, -282524, -6123, -500151, -106204, -25590, 195617, 38717, 64532, -282788, 7613, -35799, -205319, 27238, -143936, 6238, 52727, -19013, 285903, -415433, 4559, -179908, 66758, 118503, -94479, -305273, 294517, -33910, 212537, -249964, 139900, 174839, -392932, -68758, 51074, -131683, -105527, 43777, -14552, -68843, -19281, -45696, -95217, -358854, -285828, -361437, 157573, -20387, -292576, -139358, -26723, -206183, -223389, 254860, -114623, -37819, -180350, -270139, 133677, -426351, -47398, -164013, 144034, -13447, 222425, 17061, 18158, -60185, 280993, -7650, -39060, -271594, -12754, -161591, -224280, 78325, -292428, 398326, 76403, 46377, -91156, -40354, 119969, -29218, -231825, -244414, -234832, -172659, -362833]
10043c62833a37227K3188m7765M4911K5776A68710D9881d57979e1647p9898a1845
10031B53605g583q2413B33302M7331A27058F0367a32540B11945o119o6000o7360
10020G2466J04892l56a39010k01400B06384d90285c2471l9722j70128A62051a33346
10008h7461j08799c6371A9278d0569l44243J16605i3670j3129A49546p0207J20838
9997B00177f6179A64048e67499F6838b71515a14164j22103c9102k38163g8182
9986a0664j63251j4929L3484l36468a16590I8487C7734b07771G0873h8652a7179
9974A04054K6388a11283j68296H9899a81927A39319f4298C1903e3516m7437B79400
9962b69496j0310B47962h3457D0349b28175G0196a33012G6049R8967e2696k61097
$$ y = [-362833, -137227, -114039, -161804, -116893, -91117, 168710, 49881, -457979, -51647, -131545, -11845, 253605, -7583, -89996, 233302, 280633, 127058, 60367, -132540, 211945, 205826, 139826, 72466, 177358, 177002, -139010, -340410, 206384, -490285, -32471, -72193, -242321, 162051, -133346, -87461, -196260, -36371, 19278, -40569, -384812, -268207, -93670, -106799, 149546, 79339, 200177, -66179, 164048, -567499, 66838, -271515, -114164, -236267, -39102, -277265, -78182, -10664, -173915, -188844, -155360, -491828, -116590, 98487, 37734, -207771, 70873, -88652, -17179, 104054, 130442, -111283, -279579, 89899, -181927, 139319, -64298, 31903, -53516, -100953, 279400, -269496, -279806, 247962, -83457, 40349, -228175, 70196, -133012, 76049, 175016, -52696, -313793]
9951c13793e7545k56238J47668D7679G621a55251B81705b00375A4392f1911l4397
9940i6308j13223J1584G980g0833l2852H553d1540h577m41304B6075J67627a87014
9927a86663j25076M5375J29812A83163h5566D09452b83886J28139m7312C8263
9916d2980k26413A52219b02310I1306j8058A7990a31390E4957K3086c52565P4683
9905b77882C38001a77662B9947O367c222j53944I764M7694G924i4202I0563B8407
9892b81955a13451b3710q9659I8032a28998O3682B09836r1398m1405H423R4560
9881A02983l6850A0713n180J66479k663g6146J6376A26083A6069h4279m8163G1095
9868A15575f5309j87780a11286A52298G0939c04255E9846d42107A38824c46026
$$ y = [-313793, -57545, -313783, -166115, 47679, 7621, -155251, 281705, -200375, 14392, -61911, -96308, -209531, -197947, 7980, -70833, -103685, 8553, -41540, -8577, -449881, 26075, 193702, -187014, -186663, -311739, -266364, -136552, 183163, -85566, 409452, -283886, -155747, -203059, 38263, -42980, -269393, 152219, -202310, 91306, 73248, 17990, -131390, 54957, 78043, -352565, -277882, 338001, -177662, 29947, 36314, -3222, -157166, 9764, 57458, 7924, -94202, 90563, 28407, -281955, -113451, -23710, -113369, 98032, -128998, -65316, 209836, 118438, 77033, 8423, 102983, 66133, 10713, 5533, 172012, 169349, -76146, -59770, 126083, 16069, -84279, -132442, 71095, 115575, -65309, -253089, -111286, 152298, 70939, -304255, 59846, -442107, 138824, -346026]
9857b8940k31128A6223a01734B2955n645c27491a59374B15750a49158M7827r0107
9846a91438H430b9025p99F508f8926I9639a1184C3381J96998G8757f5634k93143
9834c58777J76819j58399g0856j0809A24096b24864K1650i5723C1076j5179a53139
9822A59245B8743k709K49138h8308A81892D0608J31411c2308m67052i4741j98292
9811b93033C0456a72140Q2476D8188O5844a81959I5417c9380e274m42149P3215
9800c74208F0785b88495N2218G1402a14305o7968E6922N6066E1847J1925B1811
9788a54803j54578a1104j15987G0373a5091A46454a39342C8399b17208A57448
9777G8923K87621a66124C7304c78977B55336A9311b97849c8378j79287A93999
$$ y = [-28940, -260068, 16223, -101734, 22955, 17310, -327491, -159374, 215750, -149158, -101331, -191438, 8430, -29025, -29824, 6508, -68926, 99639, -11184, 33381, 230379, 78757, -65634, -358777, -181958, -340357, -70856, -81665, 124096, -224864, -203214, -95723, 31076, 15897, -153139, 159245, 28743, 26034, 275172, -88308, 181892, 40608, 172019, -32308, -499360, -94741, -293033, 30456, -172140, -89664, 48188, 114032, -181959, 95417, -39380, -5274, -447423, -374208, 60785, -288495, -236277, 71402, -114305, -182273, 56922, 112988, 51847, 63772, 21811, -154803, -309381, -11104, -127091, 70373, -15091, 146454, -139342, 38399, -217208, 157448, 78923, 366544, -166124, 37304, -378977, 255336, 19311, -297849, -38378, -217665, 193999]
9766b4878C9706b01790k8764A91112a44124q0149J03931A67834a09047m0293c4086
9754I6881a03147H4138J33460a32645l57936a08856Q214L7456j1419r507l02713
9743c86825D9728h0125a8650A0753b04567a0809k4305k3754I8511J52375q6384
9732A64502J59403A2177h9939B1427a09m2587A23308c08687D10545A27571k2271
9721A05300i9322B89350a68912d0258o0251L8824d264j42797B5062g5558j08173
9710a83731A89316b32816c7437A05472a67598g0241A2667b19235n6413p6323A91028
9698A55627J3363b33253B79289f3743A14923g9546Q061k78292M7782a15831c7616
9686A44309k4151a20561e0677o9128j70349G6682b91511P9403N2201o710O33a6654
$$ y = [-24878, 39706, -201790, -230554, 191112, -144124, -224273, -120342, 167834, -109047, -149340, -34086, 96881, -103147, 84138, 217598, -132645, -490581, -108856, -100642, -63186, -74605, -84112, -386825, 49728, -80125, -18650, 10753, -204567, -10809, -35114, -58868, 98511, 250886, 164502, 323905, 12177, -89939, 21427, -109, -42696, 123308, -308687, 410545, 127571, 105300, -99322, 289350, -168912, -40258, -100509, -61685, -4264, -147061, 25062, -75558, -183731, 189316, -232816, -37437, 105472, -167598, -70241, 12667, -219235, -275648, -351971, 191028, 155627, 168990, -233253, 279289, -63743, 114923, -79546, -71485, -349777, -301995, -115831, -37616, 144309, 120158, -120561, -50677, -119805, -290154, 76682, -291511, -212108, -159907, -166617, -165984, -16654]
9673b63004N8364B41362b15816E5558a30798j19046A12659K85140B708b33631
9662E339b89744j607a00517c3567j95747o8894J38623j78689C20784I1163a00135
9650b21909a9416j4802j42165A13130Q1827K6982b98854a26528C90819h4572j45520
9639b30092d9663j26273A2517a39891q8934H9807b59356a09296j56392c7383H0490
9627A04314J39300I0429i6932m6027a1718j43471j0115h029j66902G4292K9013
9616A03305A1265b78793b2833m04026a55464b2524r5259B68642b27236c9190m2112
9605h1302C54730G3613R8517b43331G3173K12555o2031G1450f9446j72101N9455
9594a82092B6420G138M2365f4730B84992a90238K8498b5949j02144E7958b094
$$ y = [-263004, -204640, 241362, -215816, 55558, -130798, -249844, 112659, 397799, 2708, -233631, 5339, -289744, -291351, -100517, -33567, -229314, -298208, -159585, -338274, 320784, 91163, -100135, -221909, -19416, -34218, -176383, 113130, 194957, 221939, -298854, -126528, 390819, -84572, -230092, -49663, -175936, 12517, -139891, -228825, 89807, -259356, -109296, -265688, -37383, 80490, 104314, 243614, 90429, -96932, -142959, -11718, -155189, -165304, -8029, -174931, 74292, 103305, 11265, -278793, -22833, -426859, -155464, -22524, -117783, 268642, -227236, -39190, -81302, 354730, 73613, 172130, -243331, 73173, 285728, 223697, 71450, -69446, -241547, -182092, 26420, 7138, 49503, -64730, 284992, -190238, -161740, -25949, -128093, 57958, -2094]
9582A32897K9555p8184h47C65539c81574a64539e7020l820J8454Q987B0256a4016
9569B06053o0210p0180c527A35794A5225e6321F9792a25860B532a06017J0284
9558i5733n055K7293I1720c5790D2577b45120f4984j93434F7773a12939j56463
9547b69402B6201A2971a7477k14184C36900c40395J64592M4386D3654N3498a35583
9535B6140a01029l26276I9319i4439d5966k20084N753B471a0438m34175b14749
9523A07721Q4283a17409d1620j62407J218J6922r7946O8926o6117c888A19259
9511g4267b6443q0623E0919c77390N2959C2321a27483j39851J6872A18120a35998
9499b4722l66807a04143l31775A20774n0072a16148B09746J02897b79264i8557
$$ y = [132897, 162452, 84268, -847, 365539, -381574, -164539, -57020, -60840, -42386, -33399, 20256, -14016, 206053, 145843, 75663, -3527, 135794, 15225, -56321, 69792, -125860, 2532, -106017, -95733, -100788, -73495, 91720, -35790, 42577, -245120, -64984, -258418, 67773, -112939, -269402, 26201, 12971, -17477, -231661, 336900, -340395, -175803, -131417, 43654, 97152, -135583, 26140, -101029, -427305, 99319, -94439, -45966, -266050, -260297, 2471, -10438, -444613, -214749, 107721, 192004, -117409, -41620, -204027, -202809, -185887, -283833, -214907, -281024, -3888, 119259, -74267, -26443, -107066, 50919, -377390, -324431, 32321, -127483, -267334, -250462, 118120, -135998, -24722, -391529, -104143, -435918, 120774, 70702, -116148, 209746, 312643, -279264, -98557]
9488B7739a92605j5653P0196k84j89654R9823g090o4847a4599j01038C0056c952
9475A16601N6261m7640b25082B7562a46886D711c23418G3586L4923b9727H2805
9463b83044B44102b8337D2968O2793d39963g8255A17891b36373o3382a00324g178
9451c80A35697c6577n8651l9631C22466A07861J04139n7371L9279K20D1828J40573
9439A82401b47078a03183A08169b69531I4709e6472j89050A17545a47333k0996
9429a68329e2080C16209d432A5062c37492d4343J466B34442d8143A03871R5616
9418A99487a43499j22004c1295A1020J21287i3832r482A15092h811A09395a18614
9406D3313a5890j43333A2682b49589I3516a63312l5691K2765B96016c72369a36031
$$ y = [27739, -192605, -208258, -138062, -138346, -328000, -228177, -7090, -71937, -14599, -115637, 30056, -3952, 116601, 172862, 125222, -225082, 27562, -146886, 4711, -323418, 73586, 108509, -29727, 82805, -283044, 244102, -28337, 42968, 105761, -439963, -78255, 117891, -236373, -299755, -100324, -7178, -380, 135697, -36577, -95228, -134859, 322466, 107861, 212000, 154629, 193908, 194128, 41828, 182401, -247078, -103183, 108169, -269531, 94709, -56472, -245522, 117545, -147333, -168329, -52080, 316209, -4432, 15062, -337492, -44343, -42877, 234442, -48143, 103871, 199487, -143499, -265503, -31295, 11020, 132307, -93832, -103314, 115092, -8811, 109395, -118614, 43313, -15890, -159223, 12682, -249589, 93516, -163312, -199003, -176238, 296016, -372369, -136031]
9394I5432c13857I2187b3597k33739J6133A19890c3317R778B38922i8210a4023
9382i6383j65986a13828d6652l252o8931J1617p3990E4065a18926p2435a8242
9370F5320b17676c3223A34575d6907a1395k63052a06232K7290A50448b76514C5109
9358A3513J22644M6694N2646a45208A55553C8407c73405A50741d7879A28197c11430
9346A21640k6698b08991k1510M5181b536k32160A04754c35477A05630a63184C703
9334c79696a03769A29024l0546P3699K55546c25814G9511K48966F9697J21825
9324A91522a65183o8035n6051j53592b04807E4180a52456l53472A1829L38149
9314C49978b35902A7610b27138P0946B05542o8516c06752J44468B19104d6854
$$ y = [95432, -313857, 92187, -23597, -257336, -241203, 119890, -33317, -23539, 238922, -98210, -14023, -96383, -262369, -113828, -46652, -49904, -118835, -107218, -181208, 54065, -118926, -191361, -18242, 65320, -217676, -33223, 134575, -46907, -11395, -274447, -106232, -78942, 150448, -276514, 35109, 13513, 136157, 182851, 235497, -145208, 155553, 38407, -373405, 150741, -47879, 128197, -311430, 121640, 94942, -208991, -230501, -185320, -2536, -234696, 104754, -335477, 105630, -163184, 3703, -379696, -103769, 129024, 98478, 172177, 427723, -325814, 79511, 328477, 69697, 191522, -165183, -233218, -289269, -442861, -204807, 54180, -152456, -505928, 11829, 349978, -235902, 17610, -227138, -156192, 205542, 137026, -306752, -162284, 219104, -46854]
9303B65515D1237a75944e8138j4498j36655J9102p8371A26365D3841L42904A11923
9291a80875h1500C4531a07319r1414a0056B16822a41659M7655A75987b02746P0286
9280a32460b6470A03851b33615l9232D5945B1800a98071A53556a8327k21002B4977
9268C89504c6102B20030a83508F1894a54120K0885G0727b59099g1338k3436k60088
9257c54862Q6910P2889d1557m07245d0823l1730l8438J0750k30039o2700J44653
9246b48327h5795A16555e1069j98714M0600R9388G4910Q2348d58632a07125b2339
9234b55037A1067d5547j41158f5661r3103J7599j04651h723j77548A91519c38768
9222f7580o4528C34109f1799j77144K5103A98706e0208D5038A6495g5643j02467
$$ y = [265515, 41237, -175944, -58138, -72636, -209291, -190189, -268560, 126365, 43841, 386745, 111923, -180875, -81500, 34531, -107319, -198733, -10056, 216822, -141659, -94004, 175987, -202746, -132460, -26470, 103851, -233615, -272847, 45945, 21800, -198071, 153556, -18327, -239329, 24977, 389504, -36102, 220030, -183508, 61894, -154120, -133235, 70727, -259099, -71338, -94774, -354862, -267952, -195063, -41557, -448802, -40823, -72553, -110991, -100241, -330280, -392980, -248327, -85795, 116555, -51069, -249783, -209183, -109795, 74910, 157258, -458632, -107125, -22339, -255037, 11067, -45547, -186705, -65661, -158764, -141165, -245816, -8723, -186271, 191519, -338768, -67580, -132108, 334109, -61799, -238943, -213840, 198706, -50208, 45038, 16495, -75643, -178110]
9211a78110B28502c85025I3883J85901a07301l7289f5351D7977Q205b8299A12893
9199a17169j3299N0714I0681j797c7771q8862A39762a06437A70673h6618c5048
9187a58457N3024d5183l7944A98427b7488q7333k96498E813M5180Q3530J56593
9176B91116i3407E3674j4013a805j52026a2790q2408A27501a00573A59416r902
9165A49514K6096o4363P5630b12807F8589P0841d55650J10808H474L44579e00435
9153A13873C4278a57093c7875j90150B49490b06707A99865b58053A6826c74591
9142b084A19821a45683M2412j88469D7260b58622c3663D10019b2706n4272B5069
9130A7467K45741d01723e602A22538j5746N2283c42786J35963A96325f810I7476
$$ y = [-178110, 228502, -385025, 93883, 279784, -107301, -144590, -65351, 47977, 56182, -28299, 112893, -117169, -130468, -79754, 90681, 88884, -37771, -126633, 139762, -106437, 170673, -86618, -35048, -158457, -105433, -45183, -83127, 198427, -27488, -114821, -411319, 5813, 50993, 134523, 291116, -93407, 53674, 39661, -1805, -153831, -12790, -95198, 127501, -100573, 159416, 149514, 175610, 111247, 186877, -212807, 68589, 139430, -455650, -344842, 8474, 353053, -500435, 113873, 34278, -157093, -37875, -228025, 249490, -206707, 199865, -258053, 16826, -374591, -2084, 119821, -145683, -103271, -291740, 47260, -258622, -33663, 410019, -22706, -76978, 25069, 17467, 263208, -401723, -5602, 122538, 106792, 159075, -342786, -206823, 196325, -6810, 97476]
9118G6376b98010j25462a06497M8576l5366A58617b26160l84333B47039a46696
9107b50331Q0696B06375a24829A43248i0232j42747h4434p1703C9788J93124p476
9096B25436A08289a46622l14324G7696f4832j82462a01226k23798A30783C4221
9085a34139p4857J7635B54646a72250k44795g3577A81586k7551m1255a68042l17251
9074d85293A05555a50010k6657D11961G3379J99696q3263a8024A08685f25543
9063A13196K5834a75628c4349k6850A22344J05949a87547A67158c52711A71569
9052C4096b27859A47770c7770j02722p3014k3074J3345l8702J06092A08392A8251
9040B40554a68345j7965e4586l62o6248E3329b92842b9321k17264g7512j78551
$$ y = [76376, -298010, -423472, -106497, -57921, -93287, 158617, -226160, -610493, 247039, -146696, -250331, -169635, 206375, -124829, 143248, -90232, -232979, -84434, -156137, 39788, 232912, 225436, 108289, -146622, -460946, 77696, -64832, -247294, -101226, -325024, 130783, 34221, -134139, -208996, -191361, 254646, -172250, -417045, -73577, 181586, 154035, 112780, -168042, -485293, 105555, -150010, -176667, 411961, 73379, 273075, 189812, -18024, 108685, -625543, 113196, 139030, -175628, -34349, -61199, 122344, 228293, -187547, 167158, -352711, 171569, 34096, -227859, 147770, -37770, -140492, -213506, -236580, -223235, -261937, -155845, 108392, 18251, 240554, -168345, -186310, -54586, -54948, -121196, 53329, -292842, -29321, -246585, -77512, -256063]
9029b56063l1464D4723d1949A39336b62064h9464q9837H1552c54983f9751q0190
9018a49941e7788l9426k36793A70136m0231a75869c0512q1080A80119b40948h2013
9006a09175m6991B3723a09189H6843d1554B04981B427a71139J7117K0689p1913
8995b05246H2805e32313A89786i9203k47030a48985A61282a71353n7152J04111
8985a24394b9526C8793P6639b62076C2466J24813h552A32422a54933H5213a26674
8973f8532n7595L4589j2145j24717R8955A62896c50330a59505j27410C479h2680
8961b73758B05112p5828Q8891I1220i7447K4137E8361b0461l27894E2468a80092
8949A00049B2389J62188b5092m6441j04654e4565A51653d1794A48787G223b27334
$$ y = [-256063, -287527, 44723, -41949, 139336, -262064, -89464, -179301, 81552, -354983, -69751, -149941, -57788, -97214, -334007, 170136, 129905, -175869, -30512, -111592, 180119, -240948, -82013, -109175, -156166, 23723, -109189, 86843, -41554, 204981, 2427, -171139, -154022, -133333, -205246, 82805, -532313, 189786, -99203, -346233, -148985, 161282, -171353, -228505, -124394, -29526, 38793, 115432, -262076, 32466, 157279, -8552, 132422, -154933, 85213, -126674, -68532, -126127, -91538, -103683, -228400, -129445, 162896, -350330, -159505, -286915, 3479, -82680, -273758, 205112, 129284, 218175, 91220, -97447, -73310, 58361, -20461, -348355, 52468, -180092, 100049, 22389, 184577, -25092, -71533, -176187, -54565, 151653, -41794, 148787, 7223, -227334]
8937B72341J15246D4504J78200r1162J98288A23369i6714D0911a6333B58860A03035
8925D10790J02131Q26189J965516N603839j17995B587530G62748C48164F1906
8915E5550J73565j7363r4141a78781C6747J15493a9378C51436c78805a47991B6552
8903E8264a7329B18501B0231a14915A93257L2581h5126E4021a3725j68865g1778
8891A18714b9953C88619a41492B1994i0222k74072Q8198b0170k87034J45230A34262
8879b31600A93288e4764l5518B96639A39774j1779c0822E0909b17105M2932B10721
$$ y = [272341, 387587, 44504, 222704, 131542, 329830, 123369, -96714, 40911, -16333, 258860, 103035, 410790, 512921, 1339110, 3304626, 8908465, 8790470, 2587530, 762748, 348164, 61906, 55550, 229115, 211752, 117611, -178781, 36747, 152240, -19378, 351436, -378805, -147991, 26552, 58264, -17329, 218501, 20231, -114915, 193257, 225838, -85126, 54021, -13725, -182590, -71778, 118714, -29953, 388619, -141492, 21994, -90222, -364294, -276096, -20170, -307204, -161974, 134262, -231600, 193288, -54764, -90282, 296639, 139774, 127995, -30822, 50909, -217105, -174173, 210721]
$$ [...]
##END NTUPLES=NMR SPECTRUM
##END=
