
##TITLE=UV1106_M1_1161-1249_7180486_CHvc93Ckny
##JCAMPDX= 6.0         $$ Bruker NMR JCAMP-DX V2.0
##DATA TYPE= NMR SPECTRUM
##DATA CLASS= NTUPLES
##ORIGIN= BRUKER
##OWNER= Administrator
$$ 1.72 TOPSPIN		Version 2.1
$$ 2012-12-05 03:54:17.659 -0500  Administrator@X
$$ Compression mode = diff/dup
##.OBSERVE FREQUENCY= 400.02188249412
##.OBSERVE NUCLEUS= ^1H
##.ACQUISITION MODE= SIMULTANEOUS (DQD)
##.ACQUISITION SCHEME= undefined
##.AVERAGES= 64
##.DIGITISER RES= 22
##SPECTROMETER/DATA SYSTEM= spect
##.PULSE SEQUENCE= noesygpps1d.comp
##.SOLVENT NAME= COFFEE_meoh
##.SHIFT REFERENCE= INTERNAL, COFFEE_meoh, 1, 14.96085
##AUDIT TRAIL= $$ (NUMBER, WHEN, WHO, WHERE, PROCESS, VERSION, WHAT)
$$ ##TITLE= Audit trail, TOPSPIN		Version 2.1
$$ ##JCAMPDX= 5.01
$$ ##ORIGIN= Bruker BioSpin GmbH
$$ ##OWNER= Administrator
$$ $$ E:\/data/COFFEE/nmr/UV1106_M1_1161-1249_7180486_CHvc93Ckny/12/pdata/1/auditp.txt
$$ ##AUDIT TRAIL=  $$ (NUMBER, WHEN, WHO, WHERE, PROCESS, VERSION, WHAT)
(   1,<2012-12-05 03:54:11.660 -0500>,<Administrator>,<X>,<go>,<TOPSPIN 2.1>,
      <created by zg
	started at 2012-12-05 03:42:41.885 -0500,
	POWCHK enabled, PULCHK disabled,
       configuration hash MD5:
       86 BA 57 50 F2 9D 5C 9B 26 00 A9 28 5F 66 2E 89
       data hash MD5: 64K
       7D D3 F2 CC 13 E8 86 1E B7 68 5B 21 F5 CA 59 05>)
(   2,<2012-12-05 03:54:14.694 -0500>,<Administrator>,<X>,<proc1d>,<TOPSPIN 2.1>,
      <Start of raw data processing
       efp LB = 0.3 FT_mod = 6 PKNL = 1 PHC0 = 0 PHC1 = 0 SI = 128K 
       data hash MD5: 128K
       9C 73 30 E8 F5 E4 D7 95 43 D6 17 03 D2 FB A4 16>)
(   3,<2012-12-05 03:54:15.806 -0500>,<Administrator>,<X>,<proc1d>,<TOPSPIN 2.1>,
      <pk PHC0 = -81.12305 PHC1 = 0 
       data hash MD5: 128K
       48 98 E8 D8 BF 5C 9D 75 75 FC 10 83 FD 0C 54 68>)
(   4,<2012-12-05 03:54:16.530 -0500>,<Administrator>,<X>,<proc1d>,<TOPSPIN 2.1>,
      <abs ABSG = 1 
       data hash MD5: 128K
       9B 65 9B 17 4B 9D 62 05 9B 95 98 5C 43 14 94 D6>)
(   5,<2012-12-05 03:54:16.732 -0500>,<Administrator>,<X>,<proc1d>,<TOPSPIN 2.1>,
      <abs ABSG = 2 
       data hash MD5: 128K
       7C 8A F9 BA 4E 92 73 12 89 CB E2 53 E0 66 F4 73>)
(   6,<2012-12-05 03:54:16.935 -0500>,<Administrator>,<X>,<proc1d>,<TOPSPIN 2.1>,
      <abs ABSG = 3 
       data hash MD5: 128K
       D5 48 FB 4F 73 F6 7F CF 1F 42 B4 79 8B 41 34 EE>)
(   7,<2012-12-05 03:54:17.103 -0500>,<Administrator>,<X>,<proc1d>,<TOPSPIN 2.1>,
      <abs ABSG = 4 
       data hash MD5: 128K
       A2 36 18 AE 21 63 5A F0 BE 2D D0 0F 09 88 4D 1F>)
(   8,<2012-12-05 03:54:17.305 -0500>,<Administrator>,<X>,<proc1d>,<TOPSPIN 2.1>,
      <abs ABSG = 5 
       data hash MD5: 128K
       51 0D 2E 1D 66 61 48 43 9D F8 A8 27 8A 5B C2 7C>)
$$ ##END=
$$ 
$$ $$ hash MD5
$$ $$ F5 15 8F F1 05 36 BB B2 75 44 0A 94 46 DD 2B 3A
##$RELAX= 
##$RELAX= 
##$RELAX= 
##$RELAX= 
##$RELAX= 
##$RELAX= 
##$RELAX= 
##$RELAX= 
$$ Bruker specific parameters
$$ --------------------------
##$DU= <E:\>
##$EXPNO= 12
$$ [...]
##$TP07= 0
##$TPNAME0= <>
##$TPNAME1= <>
##$TPNAME2= <>
##$TPNAME3= <>
##$TPNAME4= <>
##$TPNAME5= <>
##$TPNAME6= <>
##$TPNAME7= <>
##$TPOAL= (0..7)
0.5 0.5 0.5 0.5 0.5 0.5 0.5 0.5
##$TPOFFS= (0..7)
0 0 0 0 0 0 0 0
##$TUNHIN= 0
##$TUNHOUT= 0
##$TUNXOUT= 0
##$USERA1= <user>
##$USERA2= <user>
##$USERA3= <user>
##$USERA4= <user>
##$USERA5= <user>
##$V9= 5
##$VALIST= <valist>
##$VCLIST= <CCCCCCCCCCCCCCC>
##$VD= 0
##$VDLIST= <DDDDDDDDDDDDDDD>
##$VPLIST= <PPPPPPPPPPPPPPP>
##$VTLIST= <TTTTTTTTTTTTTTT>
##$WBST= 2048
##$WBSW= 25
##$XGAIN= (0..3)
0 0 0 0
##$XL= 0
##$YL= 0
##$YMAX_a= 5871215
##$YMIN_a= -11321995
##$ZGOPTNS= <>
##$ZL1= 120
##$ZL2= 120
##$ZL3= 120
##$ZL4= 120
##$ABSF1= 14.96085
##$ABSF2= -5.597332
##$ABSG= 5
##$ABSL= 3
##$ALPHA= 0
##$AQORDER= 0
##$ASSFAC= 0
##$ASSFACI= 0
##$ASSFACX= 0
##$ASSWID= 0
##$AUNMP= <proc_prof1d_extract.lims>
##$AXLEFT= 0
##$AXNAME= <>
##$AXNUC= <1H>
##$AXRIGHT= 0
##$AXTYPE= 0
##$AXUNIT= <>
##$AZFE= 0.1
##$AZFW= 0.1
##$BCFW= 0
##$BC_mod= 0
##$BYTORDP= 0
##$COROFFS= 0
##$CY= 15
##$DATMOD= 1
##$DC= 0
##$DFILT= <>
##$DTYPP= 0
##$F1P= 0
##$F2P= 0
##$FCOR= 0.5
##$FTSIZE= 131072
##$FT_mod= 6
##$GAMMA= 0
##$GB= 0
##$INTBC= 1
##$INTSCL= 1
##$ISEN= 128
##$LB= 0.3
##$LEV0= 0
##$LPBIN= 0
##$MAXI= 10000
##$MC2= 0
##$MEAN= 0
##$ME_mod= 0
##$MI= 0
##$NCOEF= 0
##$NC_proc= -2
##$NLEV= 6
##$NOISF1= 0
##$NOISF2= 0
##$NSP= 0
##$NTH_PI= 0
##$NZP= 0
##$OFFSET= 14.96085
##$PC= 1
##$PHC0= -81.12305
##$PHC1= 0
##$PH_mod= 1
##$PKNL= yes
##$PPARMOD= 0
##$PPDIAG= 0
##$PPIPTYP= 0
##$PPMPNUM= 2147483647
##$PPRESOL= 1
##$PSCAL= 4
##$PSIGN= 0
##$PYNMP= <proc.py>
##$REVERSE= no
##$SF= 400.020009696045
##$SI= 131072
##$SIGF1= 0
##$SIGF2= 0
##$SINO= 400
##$SIOLD= 131072
##$SPECTYP= <>
##$SREGLST= <1H.CDCl3>
##$SSB= 0
##$STSI= 131072
##$STSR= 0
##$SW_p= 8223.68421052631
##$SYMM= 0
##$S_DEV= 0
##$TDeff= 65536
##$TDoff= 0
##$TI= <>
##$TILT= no
##$TM1= 0
##$TM2= 0
##$TOPLEV= 0
##$USERP1= <user>
##$USERP2= <user>
##$USERP3= <user>
##$USERP4= <user>
##$USERP5= <user>
##$WDW= 1
##$XDIM= 131072
##$YMAX_p= 378494904
##$YMIN_p= -12269
##$CURPLOT= <Network HP LaserJet P1505>
##$CURPRIN= <$Network HP LaserJet P1505>
##$DFORMAT= <normdp>
##$LAYOUT= <+/1D_H.xwp>
##$LFORMAT= <normlp>
##$PFORMAT= <normpl>
##$SURQMSG= 1
$$ End of Bruker specific parameters
$$ ---------------------------------
##NTUPLES= NMR SPECTRUM
##VAR_NAME=  FREQUENCY,     SPECTRUM/REAL,   SPECTRUM/IMAG
##SYMBOL=    X,             R,               I
##VAR_TYPE=  INDEPENDENT,   DEPENDENT,       DEPENDENT
##VAR_FORM=  AFFN,          ASDF,            ASDF
##VAR_DIM=   131072,        131072,          131072
##UNITS=     HZ,            ARBITRARY UNITS, ARBITRARY UNITS
##FACTOR=    0.0627417313425164, 1,          1
##FIRST=     8223.62146879497, 1444,         -48432
##LAST=      0,             1807,            -49129
##MIN=       0,             -12269,          0
##MAX=       8223.62146879497, 378494904,    0
$$ Real data points
##PAGE= N=1
##DATA TABLE= (X++(R..R)), XYDATA
$$ [...]
63946G85049N7704O6485P6250Q6946R8692J11856J26426J41521J55919J68990
63936A875838J80718J90925J99047K04695K07894K08389K05162J97045J83627
63927C653340J65270J42530J16108Q7103N6778K5893n328l6583o7258r6766j24562
63916C916525j49669j70728j86886j98271k05342k08225k07066k02607j95796
63907B191935j86998j76162j63590j50034j36026j21763j07649r4394q2352p1344
63897I01623o1351n2828m5919l9915l4136k8999k5516k3743k2417k0359j7644
63886E28796j5131j3276j1850j0618r704r246r016q611p784o513m923l266j791
63873D17067m42J146L149N197O761P799Q736R913J1395J3297J5759J8479K0709
$$ y = [785049, 842753, 909238, 985488, 1072434, 1171126, 1282982, 1409408, 1550929, 1706848, 1875838, 2056556, 2247481, 2446528, 2651223, 2859117, 3067506, 3272668, 3469713, 3653340, 3818610, 3961140, 4077248, 4164351, 4221129, 4247022, 4241694, 4205111, 4137853, 4041087, 3916525, 3766856, 3596128, 3409242, 3210971, 3005629, 2797404, 2590338, 2387731, 2191935, 2004937, 1828775, 1665185, 1515151, 1379125, 1257362, 1149713, 1055319, 972967, 901623, 840272, 787444, 741525, 701610, 667474, 638475, 612959, 589216, 566799, 546440, 528796, 513665, 500389, 488539, 477921, 468217, 458971, 449955, 441344, 433560, 427047, 422124, 418858, 417067, 416625, 417771, 420920, 426117, 432878, 440677, 449413, 459326, 470721, 484018, 499777, 518256, 538965]
63860E38965K2011K2678K3209K3737K4229K4861K5712K6400K6451K5811K4569
63849H08633K2477J9330J5607J2058Q758N223J465j839m387o740r527j2672j5777
63836H42609j8747k1675k4451k6766k8308k8883k8789k8927k9932l1035l0673
63825E44423k8520k6041k4530k3499k1821j9591j7764j6446j4859j2877j1388
63814C27087j0927j0928j0591r785q773p729o781o021n248m200l151k724k850
63801B37379k696j906j242j486k240k486j981j429j417j764j963j817j539j452
63787B11961j676k028k195k066j815j645j593j587j530j312r55p66r75j253r93
63772A89572k08L52K23j18J6M75N13j31r13j164o94K35J135J446Q71k56j191j404
$$ y = [538965, 560976, 583654, 606863, 630600, 654829, 679690, 705402, 731802, 758253, 784064, 808633, 831110, 850440, 866047, 878105, 886863, 892086, 893551, 891712, 887325, 880585, 871058, 858386, 842609, 823862, 802187, 777736, 750970, 722662, 693779, 664990, 636063, 606131, 575096, 544423, 515903, 489862, 465332, 441833, 420012, 400421, 382657, 366211, 351352, 338475, 327087, 316160, 305232, 294641, 284856, 276083, 268354, 261573, 255552, 250304, 246104, 242953, 240229, 237379, 234683, 232777, 231535, 230049, 227809, 225323, 223342, 221913, 220496, 218732, 216769, 214952, 213413, 211961, 210285, 208257, 206062, 203996, 202181, 200536, 198943, 197356, 195826, 194514, 193559, 192793, 191818, 190565, 189572, 189364, 189716, 189939, 189821, 189837, 190312, 190825, 190694, 189781, 188617, 187923, 188158, 189293, 190739, 191610, 191354, 190163, 188759]
63754A88759r74l87j10k78o06o38k37K56M90N31O30P31O50N70Q97J580J985J664
63736A95513R04L27K06M22Q56J470K093K480K651K928L470L970M027L749L689
63721B28755M134M695M912M913N115N381N045L887K535J585Q87L6q15j334j759
63706B67972k551l406l462k627j901k055k657k883k657k387k028j178P1J093J594
63691B40938J890K187K237J888J566J752K330K784K865K746K636K539K323J819
63677B72500R33m6m11L18J711K722K780K293J969K045K390K959L733M327M191
63662C04414L214J893P79M2m66r74j715k808l980m683m630m116l647l400l216
63647B76707k975k756k606k423k000j198q7R54J409J100M84K73P37J550K250K672
$$ y = [188759, 187785, 187398, 187288, 187010, 186404, 185766, 185529, 185785, 186275, 186806, 187436, 188167, 188817, 189387, 190284, 191864, 193849, 195513, 196417, 196744, 196950, 197372, 198228, 199698, 201791, 204271, 206922, 209850, 213320, 217290, 221317, 225066, 228755, 232889, 237584, 242496, 247409, 252524, 257905, 262950, 266837, 269372, 270957, 271844, 271880, 271065, 269731, 267972, 265421, 262015, 258553, 255926, 254025, 251970, 249313, 246430, 243773, 241386, 239358, 238180, 238251, 239344, 240938, 242828, 245015, 247252, 249140, 250706, 252458, 254788, 257572, 260437, 263183, 265819, 268358, 270681, 272500, 273433, 273387, 272976, 273294, 275005, 277727, 280507, 282800, 284769, 286814, 289204, 292163, 295896, 300223, 304414, 307628, 309521, 310300, 310342, 309876, 308902, 307187, 304379, 300399, 295716, 291086, 286970, 283323, 279923, 276707, 273732, 270976, 268370, 265947, 263947, 262749, 262662, 263616, 265025, 266125, 266609, 266882, 267619, 269169, 271419, 274091]
63631B74091K938L220L643M245M884N282N358N445O012P159Q472R455R957J0181
63617C60342J0446J1058J2319J4345J6819J9124K0901K2323K3837K5675K7795
63606E64984L0061L2275L4062L5000L4882L3672L1257K7439K2228J5972R208K601
63594H73641l065p148r541j0676j1122j1406j2010j3181j4639j5919j7068j8574
63582G29292k0505k2243k3278k3689k3485k2118j9330j6047j3566j2049j0531
63571E22451q386o025m036k421r89J83J100K202L853N742P215Q054Q607R259J0042
63556E56851J0731J1080J1045J0907J1220J2446J4590J7183J9707K2064K4695
63545G22519K8095L2178L6228L9550M1873M2785M1163L5765K6581J5218L913n601
$$ y = [274091, 277029, 280249, 283892, 288137, 293021, 298303, 303661, 309106, 315118, 322277, 330749, 340204, 350161, 360342, 370788, 381846, 394165, 408510, 425329, 444453, 465354, 487677, 511514, 537189, 564984, 595045, 627320, 661382, 696382, 731264, 764936, 796193, 823632, 845860, 861832, 871040, 873641, 870576, 863428, 853887, 843211, 832089, 820683, 808673, 795492, 780853, 764934, 747866, 729292, 708787, 686544, 663266, 639577, 616092, 593974, 574644, 558597, 545031, 532982, 522451, 514065, 508040, 504004, 501583, 500594, 500777, 501877, 504079, 507932, 513674, 520889, 528943, 537550, 546809, 556851, 567582, 578662, 589707, 600614, 611834, 624280, 638870, 656053, 675760, 697824, 722519, 750614, 782792, 819020, 858570, 900443, 943228, 984391, 1020156, 1046737, 1061955, 1065868, 1060267]
63533A060267j2405j6326j7897j8008j7261j5869j4260j3302j3641j5088j7011
63522H89199j9161k1781k5002k8418l1212l2660l2623l1594l0106k8155k5557
63511E82930k2735k0522j9025j7350j4927j2487j1128j0778j0301q992p296o081
63499D21308n682n760n705n107m129l350l058k833k209j503j481k275l223l739
63485C71254l807l528k793j647m90L98J159J932K495K689K839L349L957L918K964
63470C84689J763J196J332J307K63j710l671m778m984m764m447m044l648l571
63456C54933l977m473m349l295j823q25n65l77M58J686K454K616K999M194N719
63441C55375O830P597Q545R755J1028J2564J4732J7318J9854K2506K5797K9423
$$ y = [1060267, 1047862, 1031536, 1013639, 995631, 978370, 962501, 948241, 934939, 921298, 906210, 889199, 870038, 848257, 823255, 794837, 763625, 730965, 698342, 666748, 636642, 608487, 582930, 560195, 539673, 520648, 503298, 488371, 475884, 464756, 453978, 443677, 434685, 427389, 421308, 415626, 409866, 404161, 399054, 394925, 391575, 388517, 385684, 383475, 381972, 380491, 378216, 374993, 371254, 367447, 363919, 361126, 359479, 358989, 359387, 360546, 362478, 364973, 367662, 370501, 373850, 377807, 381725, 384689, 386452, 387648, 388980, 390287, 390550, 388840, 385169, 380391, 375407, 370643, 366196, 362152, 358504, 354933, 350956, 346483, 342134, 338839, 337016, 336191, 335626, 335249, 335707, 337393, 339847, 342463, 345462, 349656, 355375, 362205, 369802, 378347, 388102, 399130, 411694, 426426, 443744, 463598, 486104, 511901, 541324]
63429E41324L2203L3204L2206K9041K3604J6821J0660O558M498M098N691R672
63417G49580J5307K1079K5960K9791L2784L5194L7183L8374L7756L4518K8808
63406A086334K1407J3071M697k497p768j1576j4832j7620j9371k0038k0324k0798
63394I90685k1582k2935k5332k8682l2041l4346l5059l4075l1586k8227k4871
63383F71949k2016j9555j7215j4866j2472j0191q427p295o087l917r49J701L440
63370E54100M813O449Q105R255J0016J0905J2107J3542J5306J7434J9446K0810
63358G02288K1794K3368K6195K9949L3633L6370L7881L8443L8307L7179L4436
63347A059843K9935K4255J7913J0792K765n352j2035j6246j8094j8467j8344j8443
$$ y = [541324, 573527, 606731, 638937, 667978, 691582, 708403, 719063, 725621, 730119, 734217, 739908, 749580, 764887, 785966, 811926, 841717, 874501, 909695, 946878, 985252, 1023008, 1057526, 1086334, 1107741, 1120812, 1125509, 1123012, 1115244, 1103668, 1088836, 1071216, 1051845, 1031807, 1011483, 990685, 969103, 946168, 920836, 892154, 860113, 825767, 790708, 756633, 725047, 696820, 671949, 649933, 630378, 613163, 598297, 585825, 575634, 567207, 559912, 553825, 549908, 548959, 550660, 554100, 558913, 565362, 573467, 582722, 592738, 603643, 615750, 629292, 644598, 662032, 681478, 702288, 724082, 747450, 773645, 803594, 837227, 873597, 911478, 949921, 988228, 1025407, 1059843, 1089778, 1114033, 1131946, 1142738, 1145503, 1140151, 1128116, 1111870, 1093776, 1075309, 1056965, 1038522]
63335A038522j9073k0174k1619k3491k5895k8574l0950l2486l2889l2124l0509
63324G40738k8630k6774k4543k1349j7265j2992r011n274j872M45P60j173m765
63311E88295r045j3130j6404j8570j9515j9140j7494j5028j2544j0605r220q200
63299D19400p585p443p498p355p070p068p423p577o989n817m712m101l886l735
63285C31141l419k967k745l201m237m940m414k934j786j761k271k318j829j446
63271B90873j349j057m18j0l35j099j656j744j536j265j134j275j501j361p47
63256B74386k01j98m75m08J00N84P40O61M09o3n02l70M74J481K030K039J831J662
63238B84180J664J922K308K397J971J466J577K462L544M176M190L818L361L078
$$ y = [1038522, 1019449, 999275, 977656, 954165, 928270, 899696, 868746, 836260, 803371, 771247, 740738, 712108, 685334, 660791, 639442, 622177, 609185, 600174, 594900, 593028, 593473, 594233, 593060, 588295, 579250, 566120, 549716, 531146, 511631, 492491, 474997, 459969, 447425, 436820, 427600, 419400, 411815, 404372, 396874, 389519, 382449, 375381, 367958, 360381, 353392, 347575, 342863, 338762, 334876, 331141, 327722, 324755, 322010, 318809, 314572, 309632, 305218, 302284, 300498, 298737, 296466, 294148, 292319, 290873, 289524, 288467, 288049, 288039, 287704, 286605, 284949, 283205, 281669, 280404, 279270, 277995, 276494, 275133, 274386, 274185, 273987, 273512, 273104, 273204, 273788, 274528, 275189, 275598, 275535, 275033, 274663, 275137, 276618, 278648, 280687, 282518, 284180, 285844, 287766, 290074, 292471, 294442, 295908, 297485, 299947, 303491, 307667, 311857, 315675, 319036, 322114]
63224C22114L142L465L711L663L483L492L737L993M086M006L792L459L075K651
63210C71869K047J257P00Q56J498J739J108J45l64l96m65p31r09q78p22k61Q33
63193C77326K335L529M164M740N639O549P090P482Q158R132J0184J1272J2340
63180D69940J3096J3446J3797J4395J4716J4162J3094J2453J2470J2428J1757
63169F15754J0679R666Q797P872O702N114L065Q91r27k409m153o668r853j3165
63155F31365j5995j7820j8510j8537j8563j8664j8378j7522j6446j5325j3857
63144D41748j2023j0501r747r138p704n560l863l347l480l244k246r06J06L82
63130C70477M0k28L72J912L506M214M129M153M677N013M468L502L230L911M681
$$ y = [322114, 325256, 328721, 332432, 336095, 339578, 343070, 346807, 350800, 354886, 358892, 362684, 366143, 369218, 371869, 373916, 375173, 375873, 376729, 378227, 379966, 381074, 381219, 380855, 380459, 379994, 379263, 378354, 377476, 376754, 376493, 377326, 379661, 383190, 387354, 392094, 397733, 404282, 411372, 418854, 427012, 436144, 446328, 457600, 469940, 483036, 496482, 510279, 524674, 539390, 553552, 566646, 579099, 591569, 603997, 615754, 626433, 636099, 644896, 652768, 659470, 664584, 667649, 668540, 667613, 665204, 661051, 654383, 644530, 631365, 615370, 597550, 579040, 560503, 541940, 523276, 504898, 487376, 470930, 455605, 441748, 429725, 419224, 409477, 400339, 392635, 387075, 383212, 379865, 376385, 373141, 370895, 369989, 370095, 370477, 370517, 370289, 370661, 372573, 376079, 380293, 384422, 388575, 393252, 398265, 402733, 406235, 409465, 413376, 418057]
63115D18057M874M868N324O205P052P686Q023P688O559N458N401O240O883O837
63101E07155O766P341Q357R252R826J0046R787R209Q832Q855Q850Q512Q137P905
63087F28830P247N567L153P73j344l427n363o697p401p999q916j0061j1132j1843
63073E71387j1950j1366j0342r219q085o921n940n385n093m605l731k698j794
63060D84258j084m22M59J714L048L895M186M580N561O669P239P552Q487J0117
63046E46259J1426J1584J0929J0459J0842J2037J3443J4229J3912J2837J1874
63035F79831J1558J1773J2151J2389J2145J1209R841Q537P376O017M355K630Q51
63022G90663j289l688n706p072q327r892j1209j1408j0481r194q056o978n839
$$ y = [418057, 422931, 427799, 433123, 439328, 446380, 454066, 462089, 469777, 476336, 481794, 487195, 493435, 500318, 507155, 513921, 521262, 529619, 538871, 548697, 558743, 568530, 577739, 586571, 595426, 604276, 612788, 620925, 628830, 636077, 641644, 644797, 645570, 644226, 640799, 635436, 628739, 621338, 613339, 604423, 594362, 583230, 571387, 559437, 548071, 537729, 528510, 520425, 513504, 507564, 502179, 497086, 492481, 488750, 486052, 484258, 483174, 482752, 483211, 484925, 487973, 491868, 496054, 500634, 506195, 512864, 520103, 527655, 536142, 546259, 557685, 569269, 580198, 590657, 601499, 613536, 626979, 641208, 655120, 667957, 679831, 691389, 703162, 715313, 727702, 739847, 751056, 760897, 769434, 776810, 782827, 787182, 789812, 790663, 789374, 785686, 779980, 772908, 764581, 754689, 743480, 732072, 721591, 712397, 704341, 697363, 691524]
63009F91524m775l752k312K0L196O640R673J1909J3392J4451J5492J6851J8615
62996G90924K0422K1579K1710K1275K1086K1321K1401K0888K0086J9501J9112
62985A019305J8503J7399J5733J3342R995N739J059l355p083j0358j3929j8253
62973A048097k2832k6736k9726l2247l4263l4945l3955l2291l1036k9839k7537
62962G12690k4080k0856j9020j8329j7857j7088j5958j4482j2907j1785j1347
62951E28981j1011j0105q979q790j0006j1543j1816j0484q802q129q518q968q819
62938D03011q351q065p867p343o447n518m718l924l179k830l002l226k881j954
62924C33706j129j029j522j895j688j131o75m01j14J45J77J09L14P07O97J00m12
$$ y = [691524, 686749, 682997, 680685, 680705, 683901, 690541, 700214, 712123, 725515, 739966, 755458, 772309, 790924, 811346, 832925, 854635, 875910, 896996, 918317, 939718, 960606, 980692, 1000193, 1019305, 1037808, 1055207, 1070940, 1084282, 1094277, 1100016, 1101075, 1097720, 1090637, 1080279, 1066350, 1048097, 1025265, 998529, 968803, 936556, 902293, 867348, 833393, 801102, 770066, 740227, 712690, 688610, 667754, 648734, 630405, 612548, 595460, 579502, 565020, 552113, 540328, 528981, 517970, 507865, 498886, 490096, 480090, 468547, 456731, 446247, 437445, 429316, 420798, 411830, 403011, 394660, 386595, 378728, 371385, 364938, 359420, 354702, 350778, 347599, 344769, 341767, 338541, 335660, 333706, 332577, 331548, 330026, 328131, 326443, 325312, 324637, 324236, 324122, 324267, 324444, 324553, 324867, 325574, 326271, 326371, 325959]
62907C25959j90N04R82J154J434J871K095K133K584L827N500O912P571P282O282
62892C75900N441N758P255Q748R061Q138O709N249L792K393J247K71r11k472m144
62877D32435n499o307o648o870p323p891p945p114o016n694o272o785o543o033
62863C39495n983o061n260l438j628p91r02j483k255k923k881j875o13q4l60o47
62847C02311m10P5L44M08N71Q99J046M99q78k403k896j910m20K06k34q04q72o62
62829B94870m22P9Q44J299J152R14J055J259J063O97O23P52P51P10Q31Q49M34
62812C07760j38m08m23l90n5O93J106M48o68r27j78M84N24O09J208J764J747J560
62794C14716J748K090K131J967J935K073K372K976L711L977L663L549M266N465
$$ y = [325959, 325769, 326273, 327255, 328409, 329843, 331714, 333809, 335942, 338526, 342353, 347853, 354765, 362336, 369618, 375900, 381341, 387099, 394354, 403102, 412163, 420301, 427010, 432259, 436051, 438444, 439691, 439962, 439051, 436579, 432435, 426936, 420629, 413981, 407111, 399788, 391897, 383952, 376838, 370822, 365128, 358856, 352071, 345528, 339495, 333512, 327451, 322191, 318753, 317125, 316334, 315432, 313949, 311694, 308771, 305890, 304015, 303402, 303318, 302958, 302311, 301901, 301976, 302320, 302728, 303299, 304198, 305244, 305743, 304865, 302462, 299566, 297656, 297236, 297442, 297208, 296404, 295532, 294870, 294448, 294527, 295371, 296670, 297822, 298736, 299791, 301050, 302113, 302810, 303433, 304185, 304936, 305646, 306477, 307326, 307760, 307622, 307214, 306791, 306401, 306346, 307039, 308145, 308593, 307925, 306998, 306820, 307304, 307828, 308437, 309645, 311409, 313156, 314716, 316464, 318554, 320685, 322652, 324587, 326660, 329032, 332008, 335719, 339696, 343359, 346908, 351174, 356639]
62780C56639O594P793R331J0757J1594J2298J3552J4862J5000J3793J2381J1611
62768D96205J1087J0212R207Q512P732N973K992m39l341n377o867q214r469j0470
62754E07743j1182j1700j1975j1901j1758j2129j3035j3554j2788j0974r193q092
62742C69462p461o918o429o071n819n760o005o223n711m265k566j427q56l24L25
62727C03952O46L61j18j13N60J505K317K964L518L769L505L027K995L707M871
62712C37466O189P708R317J0437J0760J0949J1965J3801J5550J6744J7982K0023
62700D88891K2759K5450K7610K9366L1155L3350L5964L8529M0347M1077M0976
62689H55474M0468L9654L8291L6046L2612K7727K1421J4133O441j309r011j6490
$$ y = [356639, 363233, 371026, 380357, 391114, 402708, 415006, 428558, 443420, 458420, 472213, 484594, 496205, 507292, 517504, 526711, 535223, 542955, 548928, 551920, 551481, 548140, 542763, 535896, 527682, 518213, 507743, 496561, 484861, 472886, 460985, 449227, 437098, 424063, 410509, 397721, 386747, 377554, 369462, 362001, 355083, 348654, 342583, 336764, 331004, 324999, 318776, 313065, 308800, 306234, 304807, 303951, 303627, 303952, 304598, 304959, 304841, 304728, 305288, 306793, 309110, 312074, 315592, 319361, 322866, 325893, 328888, 332595, 337466, 343655, 351363, 360680, 371117, 381877, 392826, 404791, 418592, 434142, 450886, 468868, 488891, 511650, 537100, 564710, 594076, 625231, 658581, 694545, 733074, 773421, 814498, 855474, 895942, 935596, 973887, 1009933, 1042545, 1070272, 1091693, 1105826, 1112267, 1110958, 1101947, 1085457]
62677A085457k3425k9557l4848l9221m2337m3766m3545m2364m0969l9482l7539
62666F68404l5113l2713l0680k8643k6099k3190k0523j8421j6789j5535j4657
62655D06041j3901j2833j1279r401p429n630m462m202m467m605m555m730n085
62642C13462n004m285l430k698j655k07P49M57m91r43p31n33m69J1Q66J162M17
62625B96678o19j025q91r25j319j654j639j399j126q81o92n70l99o6L75Q03J208
62608B85859J553J587J103L19k47l42j54J07N47J383K513L426L658L264K855L048
62592C10479L861M788N490O129O878P387P163O347N646N379N034L965K207L64
62578C81117j104k166l002l777m531n108n329n352n627o264o709o448n761n275
$$ y = [1085457, 1062032, 1032475, 997627, 958406, 916069, 872303, 828758, 786394, 745425, 705943, 668404, 633291, 600578, 569898, 541255, 515156, 491966, 471443, 453022, 436233, 420698, 406041, 392140, 379307, 368028, 358627, 351198, 345568, 341106, 336904, 332437, 327832, 323277, 318547, 313462, 308458, 304173, 300743, 298045, 296390, 296183, 296932, 297389, 296898, 295955, 295224, 294691, 294222, 294233, 295099, 296261, 296678, 296059, 295034, 294143, 293218, 291899, 290245, 288606, 287207, 286081, 285200, 284508, 283938, 283539, 283473, 283848, 284651, 285859, 287412, 288999, 290102, 290421, 290174, 289832, 289678, 289785, 290332, 291715, 294228, 297654, 301312, 304576, 307431, 310479, 314340, 319128, 324618, 330747, 337625, 345012, 352175, 358522, 364168, 369547, 374581, 378546, 380753, 381117, 380013, 377847, 374845, 371068, 366537, 361429, 356100, 350748, 345121, 338857, 332148, 325700, 319939, 314664]
62564C14664m997m415l530l056l325l668l308k408j718j526j436j049l83L45R62
62549B81152J336J411J277J078Q72O53M44K11p5k27Q6Q24J449J610J643K043K680
62532B98467L036L019L014L166L137K652J916J471J870L369N470O986P202O913
62518C51688P596R517J1484J2744J4058J6334J8989K0732K1464K2310K3822K5207
62506E55945K5641K5384K5065K4502K2988K0388J7235J3777R716N007L58l504
62494G42502o566r107j0935j1634j1400j0881j0139q543n984l407j645j67K297
62481F54391O139J0530J4463J7625K0222K2510K4479K5673K5445K3762K1419J8998
62469H85656J5957J1462N878M75m238q939j4132j9352k4025k8203l1896l4538
$$ y = [314664, 309667, 305252, 301722, 298666, 295341, 291673, 288365, 285957, 284239, 282713, 281277, 280228, 279845, 280190, 281152, 282488, 283899, 285176, 286254, 287126, 287779, 288223, 288434, 288359, 288132, 288218, 289042, 290491, 292101, 293744, 295787, 298467, 301503, 304522, 307536, 310702, 313839, 316491, 318407, 319878, 321748, 325117, 330587, 337573, 344775, 351688, 359284, 368801, 380285, 393029, 407087, 423421, 442410, 463142, 484606, 506916, 530738, 555945, 581586, 606970, 632035, 656537, 679525, 699913, 717148, 730925, 740641, 745648, 746006, 742502, 735936, 726829, 715894, 704260, 692860, 681979, 671840, 663297, 657313, 653906, 652261, 652094, 654391, 660530, 671060, 685523, 703148, 723370, 745880, 770359, 796032, 821477, 845239, 866658, 885656, 901613, 913075, 918953, 919428, 915190, 906251, 892119, 872767, 848742, 820539, 788643, 754105]
62457G54105l5692l5683l5008l3696l1825k9898k8096k5758k2453j9035j6712
62446D40249j5421j4013j1878r522p592o195n192m473l748k745j684j078r31p05
62432C55072j93Q3l50j189j689j500r49o66j056k008k979l449l300k795k342k276
62416C28414k591k788k240r87J56M35j27r87j628j721j226o85p75j224q92N25
62400C11659J653J180k18q21k23N26Q57J342K302L163L528L735L937L695L051
62385C39366K975L984N201N528N148N045N576O271O726P037P559Q641J0372J2221
62371D31650J3289J3347J3253J3937J5324J6707J7806J8961K0528K2604K5158
62360F22564K8066L1176L4607L8758M3753M9146N4325N8866O2308O4161O4417
$$ y = [754105, 718413, 682730, 647722, 614026, 582201, 552303, 524207, 498449, 475996, 456961, 440249, 424828, 410815, 398937, 389415, 381823, 375628, 370436, 365963, 362215, 359470, 357786, 356708, 355777, 355072, 354879, 354962, 354612, 353423, 351734, 350234, 349285, 348619, 347563, 345555, 342576, 339127, 335827, 333032, 330690, 328414, 325823, 323035, 320795, 319808, 319964, 320399, 320272, 319285, 317657, 315936, 314710, 314025, 313250, 312026, 311134, 311659, 313312, 314492, 314274, 313453, 313230, 313756, 314613, 315955, 318257, 321420, 324948, 328683, 332620, 336315, 339366, 342341, 346325, 351526, 357054, 362202, 367247, 372823, 379094, 385820, 392857, 400416, 409057, 419429, 431650, 444939, 458286, 471539, 485476, 500800, 517507, 535313, 554274, 574802, 597406, 622564, 650630, 681806, 716413, 755171, 798924, 848070, 902395, 961261, 1023569, 1087730, 1152147]
62349A152147O3491O1191N6427M8529L8414K7700J7114O475m017j3453k1190k7487
62337A405341l3041l8322m3353m7678n0565n1586n1000m9335m6799m3437l9607
62326I10618l5819l2288k9032k6229k4046k2334k0923j9958j9497j9054j8160
62315F43278j7172j6824j7138j7365j6940j5908j4555j3238j2513j2623j2883
62304D76119j2225j0448q320o461m891l679l108k961k480j492q22j076j604j328
62290D15224j56J088J889K478L110L519L379L040L408M936O868P775P042N499
62276D69099M463M420N009N861O794P462P606P655Q315R617J0998J2388J4323
62263E74010J6861J9327K1535K4354K8525L3586L8620M3369M7996N2360N6276
$$ y = [1152147, 1215638, 1276829, 1333256, 1381785, 1420199, 1447899, 1465013, 1471488, 1467471, 1454018, 1432828, 1405341, 1372300, 1333978, 1290625, 1242947, 1192382, 1140796, 1089796, 1040461, 993662, 950225, 910618, 874799, 842511, 813479, 787250, 763204, 740870, 719947, 699989, 680492, 661438, 643278, 626106, 609282, 592144, 574779, 557839, 541931, 527376, 514138, 501625, 489002, 476119, 463894, 453446, 445126, 438665, 433774, 430095, 426987, 424026, 421546, 420054, 419232, 418156, 416552, 415224, 415068, 416156, 418045, 420523, 423633, 427152, 430531, 433571, 436979, 441915, 448783, 456558, 463600, 469099, 473562, 477982, 482991, 488852, 495646, 503108, 510714, 518369, 526684, 536301, 547299, 559687, 574010, 590871, 610198, 631733, 656087, 684612, 718198, 756818, 800187, 848183, 900543, 956819]
62252I56819O0021O3691O6400O6834O4478N9682N2788M3956L3630K2440J0719
62241A501458j234j2558k2252l0291l7468m4082m9496n3245n5852n7972n9281
62230A077727n8792n6113n1957m7466m3295l9354l5234l0856k6758k3673k1785
62219F42444k0508j8998j6855j4333j2082j0641j0051r840r439q640p633o770
62207D96654o324o308o300n736m569l503l175l286k957j893o90N0M47J004J962
62192D55376L159M306N147N645O110O916P952Q708R077R619J0739J2006J2718
62179E57478J2899J3125J3544J3674J3176J2287J1365J0565J0188J0784J2545
62168F91630J5002J7772K1191K5705L0926L5926M0276M4090M7129M8656M8418
$$ y = [956819, 1016840, 1080531, 1146931, 1213765, 1278243, 1337925, 1390713, 1434669, 1468299, 1490739, 1501458, 1500224, 1487666, 1465414, 1435123, 1397655, 1353573, 1304077, 1250832, 1194980, 1137008, 1077727, 1018935, 962822, 910865, 863399, 820104, 780750, 745516, 714660, 687902, 664229, 642444, 621936, 602938, 586083, 571750, 559668, 549027, 538976, 529136, 519697, 511057, 503424, 496654, 490330, 484022, 477722, 471986, 467417, 463914, 460739, 457453, 454496, 452603, 451913, 451963, 452410, 453414, 455376, 458535, 462841, 467988, 473633, 479743, 486659, 494611, 503319, 512396, 522015, 532754, 544760, 557478, 570377, 583502, 597046, 610720, 623896, 636183, 647548, 658113, 668301, 679085, 691630, 706632, 724404, 745595, 771300, 802226, 838152, 878428, 922518, 969647, 1018303, 1066721]
62157A066721M6944M4453M0172L3366K4605J5351O620j332q390j4419j9686k4627
62145A209778k9196l3002l6082l8678m0253l9626l6559l2443k8896k6196k3587
62134H45260k0590j7415j4502j2280j1090j0733j0307r082p439o462o647p424
62122G11289p822p181n442l232j507n67M06K335M904O937P963Q594R224R247P954
62107G43102N530K701j2k128k861j769K97J565Q74j498m519p446r988j1824j2500
62092F99524j1905j0509q860o933m321j104J885L909N178O444Q024R680J1298
62079G02310J3059J4910J6453J7636J9024K1006K3200K4964K6228K7345K8408
62068I34543K9153K9509K9750L0264L1338L3063L5096L6686L7389L7623L7888
$$ y = [1066721, 1113665, 1158118, 1198290, 1231656, 1256261, 1271612, 1278232, 1276900, 1268510, 1254091, 1234405, 1209778, 1180582, 1147580, 1111498, 1072820, 1032567, 992941, 956382, 923939, 895043, 868847, 845260, 824670, 807255, 792753, 780473, 769383, 758650, 748343, 739261, 731822, 725360, 718713, 711289, 703467, 696286, 690844, 687612, 686105, 685538, 685944, 688279, 693183, 700120, 708083, 716677, 725901, 735148, 743102, 748632, 751333, 751321, 749193, 746332, 744563, 744860, 746425, 747299, 745801, 741282, 733836, 723848, 712024, 699524, 687619, 677110, 668250, 661317, 656996, 655892, 657777, 661686, 666864, 673308, 681332, 691012, 702310, 715369, 730279, 746732, 764368, 783392, 804398, 827598, 852562, 878790, 906135, 934543, 963696, 993205, 1022955, 1053219, 1084557, 1117620, 1152716, 1189402, 1226791, 1264414, 1302302]
62057A302302L7514L4893K9289K1804J4115O701r33q656j5291k0050k3595k7155
62045A350938l1026l4590l7530m0268m3011m5001m5166m3335m0479l7745l5477
62034I17310l3229l0611k7883k5653k3992k2243j9888j7272j5114j3443j1683
62023F76299r754q368p981q000p591o767o243o473p318q364r074q911p844o634
62009E66977o064o041n890n329m520l445j917k20J046J828K614L457L780L374
61995E49650K844K643K358J503M61k4J1k73j527l606n821p513q389q657q679q535
61979E06446q096p517p178p042o653n953n486n438n181m243l130k487k085j412
61965D34545q22j031j766j943j251n04k66j01M52J012J020O47M25M28M19M52Q33
$$ y = [1302302, 1339816, 1374709, 1403998, 1425802, 1439917, 1446618, 1445685, 1437029, 1421738, 1401688, 1378093, 1350938, 1319912, 1285322, 1247792, 1207524, 1164513, 1119512, 1074346, 1031011, 990532, 952787, 917310, 884081, 853470, 825587, 799934, 775942, 753699, 733811, 716539, 701425, 687982, 676299, 666545, 658177, 650196, 642196, 634605, 627838, 621595, 615122, 607804, 599440, 590366, 581455, 573611, 566977, 560913, 554872, 548982, 543653, 539133, 535688, 533771, 533551, 534597, 536425, 539039, 542496, 546276, 549650, 552494, 555137, 557495, 558998, 559459, 559435, 559446, 559173, 557646, 554040, 548219, 540706, 532317, 523660, 514981, 506446, 498350, 490833, 483655, 476613, 469960, 464007, 458521, 453083, 447902, 443659, 440529, 438042, 435957, 434545, 433723, 432692, 430926, 428983, 427732, 427228, 426962, 426861, 427313, 428325, 429345, 429992, 430417, 430845, 431264, 431716, 432549]
61948D32549J625K684M017N602P018P795Q210R230J1383J4048J6176J7545J8854
61935E56736K0592K2236K2909K2517K1829K1472K1298K0834J9882J8410J6270
61924G84985J3484J0519P815N183K202q99l374n063o689q761j0641j1235j0284
61911G67242q548o737m728j995J586N510R166J2306J4936J6965J8174J8459J7859
61898H60195J6262J3391R247M357o38n417r772j3316j5796j7509j8850j9604j9317
61885G83233j8324j7661j7656j7386j6021j4121j2912j2672j2625j2357j2422
61874F19076j3261j4215j4155j2775j0777q939p443o179n172m454l811k931j749
61861E13215l96J075K685M326N907P673J0032J2954J5934J8644K1322K4277K7435
$$ y = [432549, 434174, 436858, 440875, 446477, 453495, 461290, 469500, 478730, 490113, 504161, 520337, 537882, 556736, 577328, 599564, 622473, 644990, 666819, 688291, 709589, 730423, 750305, 768715, 784985, 798469, 808988, 816803, 821986, 824188, 823289, 819915, 814852, 808163, 799402, 788761, 777526, 767242, 758694, 751957, 747229, 745234, 746820, 752330, 761496, 773802, 788738, 805703, 823877, 842336, 860195, 876457, 889848, 899095, 903452, 902814, 897397, 887625, 874309, 858513, 841004, 822154, 802550, 783233, 764909, 747248, 729592, 712206, 696185, 682064, 669152, 656480, 643855, 631498, 619076, 605815, 591600, 577445, 564670, 553893, 544954, 537511, 531332, 526160, 521706, 517895, 514964, 513215, 512819, 513894, 516579, 520905, 526812, 534485, 544517, 557471, 573405, 592049, 613371, 637648, 665083]
61848F65083L0629L3896L7024L9188L9709L9027L8229L7592L6265L3484K9406
61837A059532K4500J8763J2069M827k152q271j3179j6419j7546j6577j4061j0661
61825A020825o839k813J354N607R706J3252J5892J7317J6972J4250R244K975l552
61812A114190j0302j7663k5168l1416l5496l7888l9622m0885m0980l9504l6963
61801G58303l4106l1117k7890k4801k2589k1319k0011j7773j5009j2928j1951
61790E18809j1155r547p370n751n337n660n819n445m892m630m567m117k995j775
61776D39749j273j477j602j267r94j232j491j058j65L24J86N8M12R97J441J773
61760D34381K120K392K586K958L562M055M252M487N034N507N360M759M383M461
$$ y = [665083, 695712, 729608, 766632, 805820, 845529, 884556, 922785, 960377, 996642, 1030126, 1059532, 1084032, 1102795, 1114864, 1119691, 1117539, 1109268, 1096089, 1079670, 1062124, 1045547, 1031486, 1020825, 1013986, 1011173, 1012527, 1018134, 1027840, 1041092, 1056984, 1074301, 1091273, 1105523, 1114767, 1117742, 1114190, 1103888, 1086225, 1061057, 1029641, 994145, 956257, 916635, 875750, 834770, 795266, 758303, 724197, 693080, 665190, 640389, 617800, 596481, 576470, 558697, 543688, 530760, 518809, 507654, 498107, 490737, 484986, 479649, 473989, 468170, 462725, 457833, 453203, 448636, 444519, 441524, 439749, 438476, 436999, 435397, 434130, 433136, 431904, 430413, 429355, 429190, 429514, 429700, 429758, 430170, 431167, 432608, 434381, 436501, 438893, 441479, 444437, 447999, 452054, 456306, 460793, 465827, 471334, 476694, 481453, 485836, 490297]
61746D90297M566M350L931L406K499J045n66j774k466k869k965k511j580p58n75
61731D94030r75j427j430q20J91J113J459J129N50K95N63J039J213P93n4q05r60
61714D95904m46L30Q48Q55M20j63n49o40q50j738l195m272m218l469l143l641
61698D72033m272m306l893l646l750l835l506k670j496l91Q5m11j597k693l009
61683D32643k428j384m84o6k9n1O1K48L84M42M60M43L73K26lk38l30k43j47k11
61663D29666l79n88r30j375j448o65P54K012K585K563K223J798J648J987K294
61648D42145J738N22N9J292L412M840N006M470L727K834K066J991K645L243K980
61633D82970J805K78j085k182l233m331n034m706l471k524k936m391n536n430
$$ y = [490297, 494863, 499213, 503144, 506550, 509049, 510094, 509528, 507754, 505288, 502419, 499454, 496943, 495363, 494605, 494030, 493055, 491628, 490198, 489378, 489569, 490682, 492141, 493270, 493820, 494115, 494678, 495717, 496930, 497723, 497669, 496864, 495904, 495458, 495788, 496636, 497491, 497911, 497748, 497199, 496559, 495709, 493971, 490776, 486504, 482286, 478817, 475674, 472033, 467761, 463455, 459562, 455916, 452166, 448331, 444825, 442155, 440659, 440268, 440353, 439942, 438345, 435652, 432643, 430215, 428831, 428347, 428281, 428252, 428201, 428262, 428510, 428894, 429336, 429796, 430239, 430612, 430838, 430835, 430597, 430267, 430024, 429877, 429666, 429287, 428699, 427769, 426394, 424946, 424281, 425035, 427047, 429632, 432195, 434418, 436216, 437864, 439851, 442145, 443883, 444405, 444464, 445756, 449168, 454008, 459014, 463484, 467211, 470045, 472111, 474102, 476747, 479990, 482970, 484775, 485053, 483968, 481786, 478553, 474222, 469188, 464482, 461011, 458487, 455551, 451160, 445624, 440194]
61619D40194m225k669j502j200j639j973j463m35J19j75q49j572k558l736m407
61604D11910m217l847m202n274o281o642o350n673m938m468m300m085l523k804
61590C45306k386k452k813l190l351l069k304j421j030j460k439l263l392k895
61576C09841k293j947j743j528j489j778j973j503n07K58K97k39j000j645j686
61561B91065q75J61M20j40o00n85q64j902k811k566j523p79n08j6Q97J715K234
61544B83323K731L047K522J139r4l58Q8N74R98J593K253K629K651K500K244J906
61528C09746J693J702J565Q27l17j134j277j230j513j890j810j430j554k436l261
61513B97681l230k645k304k208j726r49p93j456j757p60O88R74o8r89p06K43O34
$$ y = [440194, 435969, 433300, 431798, 430598, 428959, 426986, 425523, 425088, 425207, 425032, 424183, 422611, 420053, 416317, 411910, 407693, 403846, 399644, 394370, 388089, 381447, 375097, 369424, 364486, 360018, 355718, 351633, 348110, 345306, 342920, 340468, 337655, 334465, 331114, 328045, 325741, 324320, 323290, 321830, 319391, 316128, 312736, 309841, 307548, 305601, 303858, 302330, 300841, 299063, 297090, 295587, 295080, 295338, 295635, 295396, 294396, 292751, 291065, 290190, 290351, 290771, 290631, 290031, 289446, 288582, 286680, 283869, 281303, 279780, 279001, 278493, 278477, 279374, 281089, 283323, 286054, 289101, 291623, 292762, 292668, 292310, 292398, 292972, 293970, 295563, 297816, 300445, 303096, 305596, 307840, 309746, 311439, 313141, 314706, 315533, 315216, 314082, 312805, 311575, 310062, 308172, 306362, 304932, 303378, 300942, 297681, 294451, 291806, 289502, 287294, 285568, 284619, 283826, 282370, 280613, 279853, 280541, 281515, 281447, 280458, 279752, 279995, 280629]
61496B80629P7p79j125o43L77J340J782J689J299P21j02j056j789k037j792j216
61480B77375n47r0k1j55j28K31Q28J460J824J528N66l65m65J99P47O15J39j36
61462B83605l10q43j638j921j176qL59m87j513j420l36L56n1o34l19N26Q65P40
61444B75795J022J716J875J338J164J878K460J944R98R58J933K975L586M024M286
61429C07952L937L046K336K201K228J974J610J486J574J684J880K288K715K802
61415C39713K469K015J794J921K230K381K070J228J22p01p11O5P59K85j505l466
61399C50669m286l779k797k134j925j950j934j566p23J41L29k25q36r48p30n41
61383C26765l70j19k4k20k95J57P14N96r2l38L73J305J526J207J242J936K706
$$ y = [280629, 280706, 279927, 278802, 278159, 278536, 279876, 281658, 283347, 284646, 285367, 285265, 284209, 282420, 280383, 278591, 277375, 276828, 276738, 276717, 276562, 276434, 276665, 277493, 278953, 280777, 282305, 282871, 282506, 282041, 282240, 282987, 283602, 283741, 283605, 283295, 282452, 280814, 278893, 277717, 277709, 278068, 277581, 276068, 274648, 274312, 274668, 274617, 273983, 273664, 274190, 275055, 275795, 276817, 278533, 280408, 281746, 282910, 284788, 287248, 289192, 290190, 291148, 293081, 296056, 299642, 303666, 307952, 311889, 314935, 317271, 319472, 321700, 323674, 325284, 326770, 328344, 330028, 331908, 334196, 336911, 339713, 342182, 344197, 345991, 347912, 350142, 352523, 354593, 355821, 355943, 355242, 354531, 354596, 355355, 355640, 354135, 350669, 346383, 342604, 339807, 337673, 335748, 333798, 331864, 330298, 329575, 329716, 330045, 329820, 328984, 328036, 327306, 326765, 326395, 326276, 326252, 326032, 325737, 325894, 326608, 327204, 327112, 326774, 327147, 328452, 329978, 331185, 332427, 334363, 337069]
61366C37069K976K760K283J625R90Q61J474K365K798K542J953J478J384J830K826
61351C67214M018M941N498O046O876P902Q945R998J0963J1478J1246J0492R677
61338D75294Q836P572N811M193L409L296K980J882L10j097k103k817l160k921
61324E01485k369k241k912l913m587m839m903m724m133l436l136l034k336q81
61310D54041L91O15J76J53R52K085L145M286N680P021P894Q275Q454Q564Q432
61295E20164P769O338M030R88k340n309p319q038p554o438n466n116n231n241
61281D81237m756l890k993k201j346k88Q89K056L216M379N381O054O464O765O911
61266E07878O831O856P532Q791R721R504Q409P474P316P649P960Q275R056J0534
$$ y = [337069, 340045, 342805, 345088, 346713, 347703, 348564, 350038, 352403, 355201, 357743, 359696, 361174, 362558, 364388, 367214, 371232, 376173, 381671, 387717, 394593, 402495, 411440, 421438, 432401, 443879, 455125, 465617, 475294, 484130, 491702, 497513, 501706, 505115, 508411, 511391, 513273, 513583, 512486, 510383, 507566, 504406, 501485, 499116, 496875, 493963, 490050, 485463, 480624, 475721, 470997, 466864, 463428, 460292, 457258, 454922, 454041, 454432, 455047, 455223, 455376, 456328, 458413, 461558, 465844, 471524, 478545, 486439, 494714, 503168, 511732, 520164, 527933, 534271, 538301, 539289, 536949, 531640, 524321, 516283, 508729, 502291, 496825, 491709, 486478, 481237, 476481, 472591, 469598, 467397, 466051, 465763, 466652, 468708, 471924, 476303, 481684, 487738, 494202, 500967, 507878, 514709, 521565, 529097, 537888, 547609, 557113, 565522, 572996, 580312, 587961, 595921, 604196, 613252, 623786]
61252F23786J2363J3804J4190J3315J1546R494P466N323K971P30r96k331l813
61239G07848n565o989p526p439p394p472p192o504o132o544p146p022o199n514
61225F13210n352n208m552l551k663j987j397r25o97o51p15j093j985l055l514
61210E75865k833j281K93J162J271J093R77P08j15j332k168k026j051K26J498
61195E72287K718L844M948O365Q358J0621J2523J3831J4890J5955J6748J6769
61183F99857J5840J4117J1819R254P051N889N827O100N894N187M597M361L959
61170G99752K823J148l50j263j785k336l255m647o183p159p233p022p456q531
61156G46503r326r349r228r681j0414j0507r551p875n959m123k614j511n44N48
$$ y = [623786, 636149, 649953, 664143, 677458, 689004, 698498, 705964, 711287, 714258, 714988, 713992, 711661, 707848, 702283, 695294, 687768, 680329, 672935, 665463, 658271, 651767, 645635, 639091, 631945, 624923, 618724, 613210, 607858, 602650, 598098, 594547, 591884, 589897, 588500, 587575, 586878, 586227, 585512, 584419, 582434, 579379, 575865, 573032, 571751, 572044, 573206, 574477, 575570, 576547, 577255, 577140, 575808, 573640, 571614, 570563, 570789, 572287, 575005, 578849, 583797, 590162, 598520, 609141, 621664, 635495, 650385, 666340, 683088, 699857, 715697, 729814, 741633, 750887, 757938, 763827, 769654, 775754, 781648, 786835, 791432, 795793, 799752, 802575, 803723, 803373, 802110, 800325, 797989, 794734, 790087, 783904, 776745, 769512, 762490, 755034, 746503, 737177, 727828, 718600, 708919, 698505, 687998, 678447, 670572, 664613, 660490, 657876, 656365, 655821, 656369]
61142F56369J512J758J081j27j419k784m451o399q157r182r385r238r160q980
61128E91438q184o706n080l757k701j656m31J194L333N565P138P924Q687J0056
61114F06820J1731J3042J3869J4534J5218J5972J6839J7535J7503J6811J6458
61103G76332J7079J7913J7865J7143J6772J6797J6099J4023J1105Q069M980J699
61091I35876j651m878p801r967j1053j1637j2672j4031j4470j3460j2150j1881
61079H10225j2489j2728j1886j0278q587p378o992p317p714p594o994o353n891
61066F98024n414m576l153j301L72J320J732K317L303M137M429M626N395O708
61052G17919P952Q691R001R228R775J0862J2360J3985J5685J7544J9345K0710
$$ y = [656369, 657881, 659639, 660720, 660593, 659174, 656390, 651939, 645540, 637383, 628201, 618816, 609578, 600418, 591438, 583254, 576548, 571468, 567711, 565010, 563354, 562923, 564117, 567450, 573015, 580153, 588077, 596764, 606820, 618551, 631593, 645462, 659996, 675214, 691186, 708025, 725560, 743063, 759874, 776332, 793411, 811324, 829189, 846332, 863104, 879901, 896000, 910023, 921128, 929197, 934177, 935876, 934225, 929347, 921546, 911579, 900526, 888889, 876217, 862186, 847716, 834256, 822106, 810225, 797736, 785008, 773122, 762844, 754257, 746879, 739887, 732570, 724856, 717262, 710268, 703915, 698024, 692610, 688034, 684881, 683580, 683952, 685272, 687004, 689321, 692624, 696761, 701190, 705816, 711211, 717919, 725871, 734562, 743563, 752791, 762566, 773428, 785788, 799773, 815458, 833002, 852347, 873057]
61040H73057K1720K2886K4449K6197K8107L0463L3168L5642L7646L9634M1965
61029A214934M4450M6933M9672N2846N6378O0470O5344P0165P3330P4460P5087
61018A884069P6747P9600Q3706R0322J00414J12945J26237J40274J56106J73652
61008C024072J92187K12884K39211K74820L22492L84885M64390N62229O79820
60999F356990Q21346R93182J200794J448622J741837K080451K443205K774889
60991A9861316K992416L008834K762919K247000J529191P54941J07690k66002
60983C2998305l23735j41265J29982L23808L04839j603n83990j334568k080100
60974B9291673k652253k956016k991450k824272k538790k206174j874741j571686
$$ y = [873057, 894777, 917663, 942112, 968309, 996416, 1026879, 1060047, 1095689, 1133335, 1172969, 1214934, 1259384, 1306317, 1355989, 1408835, 1465213, 1525683, 1591027, 1661192, 1734522, 1808982, 1884069, 1960816, 2040416, 2124122, 2214444, 2314858, 2427803, 2554040, 2694314, 2850420, 3024072, 3216259, 3429143, 3668354, 3943174, 4265666, 4650551, 5114941, 5677170, 6356990, 7178336, 8171518, 9372312, 10820934, 12562771, 14643222, 17086427, 19861316, 22853732, 25862566, 28625485, 30872485, 32401676, 33156617, 33264307, 32998305, 32674570, 32533305, 32663287, 32987095, 33291934, 33290331, 32706341, 31371773, 29291673, 26639420, 23683404, 20691954, 17867682, 15328892, 13122718, 11247977, 9676291]
60966I676291j307872j083939q96346p40866o13285n09412m25563l58814l06583
60957C433611k66084k34257k08277j86258j67338j50836j35556j20426j05619
60948A858960r2251q0896p1233o3199n7520n4517n3153n2021n0688m9483m8359
60937A185640m6748m4300m1243l8137l5608l4002l2921l1459k9299k7203k5955
60926G98765k5223k4084k2331k0625j9526j8901j8228j7039j5203j3133j1509
60915E92963j0491r499q171o993o409n911m833l634l305l650l344j857k27M50
60901E25089M35O42J290J922K281K460K429K032J314M94l68j341k374l367m374
60886E28564n473o540p383q031q622r131r390r329q969q271p299o417o036o105
$$ y = [9676291, 8368419, 7284480, 6388134, 5647268, 5033983, 4524571, 4099008, 3740194, 3433611, 3167527, 2933270, 2724993, 2538735, 2371397, 2220561, 2085005, 1964579, 1858960, 1766709, 1685813, 1614580, 1551381, 1493861, 1439344, 1386191, 1334170, 1283482, 1233999, 1185640, 1138892, 1094592, 1053349, 1015212, 979604, 945602, 912681, 881222, 851923, 824720, 798765, 773542, 749458, 727127, 706502, 686976, 668075, 649847, 632808, 617605, 604472, 592963, 582472, 572973, 564802, 557809, 551400, 545489, 540656, 537022, 533717, 530067, 526723, 524866, 524639, 525089, 525524, 526166, 527456, 529378, 531659, 534119, 536548, 538580, 539894, 540388, 540020, 538679, 536305, 532938, 528564, 523091, 516551, 509168, 501137, 492515, 483384, 473994, 464665, 455696, 447425, 440126, 433709, 427673, 421568]
60872D21568o111n708n052m415l746k894k065j642j522j090RJ363K360L035L908
60857C97998N109O068O255N810N312N133N247N399N329M921M372M083M226M472
60843D69734M292L429K074P49L2J10M68K82o81j808k465k765l271m213n368o409
60827D54190p070p077o435n627n148m920m547m066l954m366m862n033m997n038
60813C81050n089m851m255l521k915k516k244j939j523j045o20k91j19j76l57
60798C49589k85K60Q69Q85L15N1R07K611M055M477M176M024M451N104N430N331
60782C92250N136N091N166N293N483N654N712N836O342P120P632P683P750Q147
60768D80295Q370P831O948O738P454Q287Q470Q082P656P535P798Q332Q841R123
$$ y = [421568, 415457, 409749, 404697, 400282, 396536, 393642, 391577, 389935, 388413, 387323, 387332, 388695, 391055, 394090, 397998, 403107, 409175, 415430, 421240, 426552, 431685, 436932, 442331, 447660, 452581, 456953, 461036, 465262, 469734, 474026, 477455, 479529, 480278, 480310, 480420, 480888, 481170, 480489, 478681, 476216, 473451, 470180, 465967, 460599, 454190, 447120, 440043, 433608, 427981, 422833, 417913, 413366, 409300, 405346, 400980, 396118, 391085, 386088, 381050, 375961, 371110, 366855, 363334, 360419, 357903, 355659, 353720, 352197, 351152, 350532, 350241, 350122, 349946, 349589, 349304, 349564, 350433, 351318, 351633, 351684, 352591, 355202, 359257, 363734, 367910, 371934, 376385, 381489, 386919, 392250, 397386, 402477, 407643, 412936, 418419, 424073, 429785, 435621, 441963, 449083, 456715, 464398, 472148, 480295, 488665, 496496, 503444, 510182, 517636, 525923, 534393, 542475, 550131, 557666, 565464, 573796, 582637, 591760]
60754E91760R480J0394J1690J2507J2336J1703J1523J2167J3318J4384J4821J4414
60742G40497J3597J3061J2820J1937R564N921J905j929n583r047j2090j4593j6620
60729G49440j8147j9015j9282j9283j9227j8919j8056j6677j5273j4362j4011
60718E57188j3712j2831j1235r398p943p079o533n871m930m048l795m333n071
60705D60409n228m741m337m688n691o625o839o298n622n539o076o441o073n488
60691C80723n536o013n872m851l949l940m263l986l114k238j478n69L48Q58R69
60676C37089J030J092J042J151J799K727L188K872K110J282N89K77M01M29k72
60661C56806j489k356k469k137j598p65J24M81K90L01R43J824K579L432M390M798
$$ y = [591760, 601240, 611634, 623324, 635831, 648167, 659870, 671393, 683560, 696878, 711262, 726083, 740497, 754094, 767155, 779975, 791912, 801476, 807397, 809302, 807373, 801790, 792743, 780653, 766060, 749440, 731293, 712278, 692996, 673713, 654486, 635567, 617511, 600834, 585561, 571199, 557188, 543476, 530645, 519410, 510012, 502069, 494990, 488457, 482586, 477656, 473608, 469813, 465480, 460409, 455181, 450440, 446103, 441415, 435724, 429099, 422260, 415962, 410340, 404801, 398725, 392284, 386211, 380723, 375187, 369174, 363302, 358451, 354502, 350562, 346299, 342313, 339199, 336961, 335483, 334914, 335262, 336120, 337089, 338119, 339211, 340253, 341404, 343203, 345930, 349118, 351990, 354100, 355382, 355971, 356248, 356649, 357078, 356806, 355317, 352961, 350492, 348355, 346757, 345992, 346116, 346597, 346887, 347188, 348131, 349955, 352534, 355966, 360356, 365154]
60645C65154M363L963M480N408N544M768M002L607K961J827J030J208J687J317
60631D11319P4r54r80l20J92R4o06j685k724l111k539j535j096j611k382k488
60615C89648j893j379j548k200k732k724k064q48O12J834K386K077J094Q7j29
60600C82221N36J028K34j443k344j597j66N45M10K37K73N8n15r34q90o87n81m02
60582C75983N8P58J641K669L510L752L568L707M547N661O613P643R215J1267J3334
60567D53926J5164J6830J8516K0469K2832K5152K6365K5698K3376K0002J5629
60556F83959J0038L741k159p083j1266j4668j6392j5668j2962r465n767j680K806
60543F03434P093J0775J4395J8918K4533L0313L5094L8537M1074M2920M3370M1315
$$ y = [365154, 369517, 373480, 377960, 383368, 388912, 393680, 397682, 401289, 404250, 406077, 407107, 408315, 410002, 411319, 411393, 410439, 409459, 409139, 409331, 409425, 408819, 407134, 404410, 401299, 398760, 397225, 396129, 394518, 392136, 389648, 387755, 386376, 384828, 382628, 379896, 377172, 375108, 374260, 374872, 376706, 379092, 381169, 382263, 382350, 382221, 382757, 383785, 384019, 382576, 380232, 378635, 378469, 379014, 379424, 379661, 379934, 379992, 379477, 378543, 377653, 376966, 376385, 375983, 376041, 376799, 378440, 381109, 384619, 388371, 391939, 395646, 400193, 405854, 412467, 420110, 429325, 440592, 453926, 469090, 485920, 504436, 524905, 547737, 572889, 599254, 624952, 648328, 668330, 683959, 693997, 697738, 695579, 688496, 677230, 662562, 646170, 630502, 617540, 608075, 602308, 600628, 603434, 610527, 621302, 635697, 654615, 679148, 709461, 744555, 783092, 824166, 867086, 910456, 951771]
60531I51771L6369K9209K0765J1459J556p981j5619k0412k2704k3429k3108k1879
60519I15997k0204j8823j7894j6737j4792j2466j0596r301p818n474k356J027
60507G80563M332P417J0154J2564J5074J8325K2702K8185L4663M2156N0674N9890
60495A086699O9099P7567Q5010R1595R7294J01233J01954R8583R1636Q2522P2219
60484B055411O0666M7282L1913J5049k706k1164m0360n9855p8405r4458j06880
60473A806493j15038j18482j17118j11861j04445r6179q7168p7257o7307n8780
60463H52858n2040m6007l9761l3827k9269k6052k3105j9840j6824j4783j3555
60452E37795j2426j1120r985r295q823q149p174o132n279m670m207l746l140k322
$$ y = [951771, 988140, 1017349, 1038114, 1049573, 1051129, 1043148, 1027529, 1007117, 984413, 960984, 937876, 915997, 895793, 876970, 859076, 842339, 827547, 815081, 804485, 795184, 787366, 781892, 779536, 780563, 784895, 792312, 802466, 815030, 830104, 848429, 871131, 899316, 933979, 976135, 1026809, 1086699, 1155798, 1233365, 1318375, 1409970, 1507264, 1608497, 1710451, 1809034, 1900670, 1983192, 2055411, 2116077, 2163359, 2195272, 2210321, 2207615, 2186451, 2146091, 2086236, 2007831, 1913373, 1806493, 1691455, 1572973, 1455855, 1343994, 1239549, 1143370, 1056202, 978945, 911638, 852858, 800818, 754811, 715050, 681223, 651954, 625902, 602797, 582957, 566133, 551350, 537795, 525369, 514249, 504264, 494969, 486146, 477997, 470823, 464691, 459412, 454742, 450535, 446789, 443649, 441327]
60438D41327j387n72o3J64K11K6n93j651k741l287l123k706k664l084l447l352
60422D13058l125l429m303m999m889m214l629l254k614j443r6R13J385J349Q39
60407C81549L0o90r78p98k98L84J058J448J479J400J429J434J223R87J091J475
60391C92223J670J411R70P57P92P55M30l5k72l0O29J373J849J857J386O21p9l82
60373D05925k15K31Q00J404J831J800J400J189J543K152K442K332K170K100J913
60358D29017J514J165J107J288J536J742J833J789J791K023K367K552K645L046
60344D55415L908M859N433N541N337M922M311L532K568J329k06j980l878n607
60330D85484o587o433n532m718m198l363j826k64L40q6o68o30O0R93J838K548
$$ y = [441327, 439940, 439368, 439305, 439469, 439680, 439706, 439113, 437462, 434721, 431434, 428311, 425605, 422941, 419857, 416410, 413058, 409933, 406504, 402201, 397202, 392313, 388099, 384470, 381216, 378602, 377159, 377063, 377976, 379361, 380710, 381549, 381579, 380889, 379911, 379113, 378815, 379199, 380257, 381705, 383184, 384584, 386013, 387447, 388670, 389657, 390748, 392223, 393893, 395304, 396274, 397031, 397823, 398578, 399008, 398973, 398701, 398671, 399300, 400673, 402522, 404379, 405765, 406386, 406307, 405925, 405710, 405941, 406741, 408145, 409976, 411776, 413176, 414365, 415908, 418060, 420502, 422834, 425004, 427104, 429017, 430531, 431696, 432803, 434091, 435627, 437369, 439202, 440991, 442782, 444805, 447172, 449724, 452369, 455415, 459323, 464182, 469615, 475156, 480493, 485415, 489726, 493258, 495826, 497155, 496949, 494969, 491091, 485484, 478897, 472464, 466932, 462214, 458016, 454653, 452827, 452563, 452903, 452817, 452149, 451519, 451579, 452572, 454410, 456958]
60314D56958L264M083M840N239N328N626O676Q578J1119J4106J7418K0976K4857
60301E89068K9126L3356L6539L7717L6409L2353K5417J6144N855m322j4081k2978
60289H00603k9530l2298l1710k9740k7746k5587k2914k0241j8171j6476j4584
60278E31606j2497j0601r050p894p382p570p843p426o231m821l718l116l010l128
60264D37319k903k067j220j228k078k786k565j695j002r01j122j214r87n93l38
60249D14620m55q80j247j156m95M06J009R90N67K71M21Q63J251J445J543J602
60233D20755J522J191O85L51O23J613K871L662L622K993K230J584J130R03Q06
60218D46541O03K28OK68R23J613K201K806L367L541L182K697K683L265L908L968
$$ y = [456958, 460222, 464305, 469145, 474384, 479712, 485338, 492014, 500592, 511711, 525817, 543235, 564211, 589068, 618194, 651550, 688089, 725806, 762215, 794568, 819985, 836129, 841984, 837662, 823581, 800603, 771073, 738775, 707065, 677325, 649579, 623992, 601078, 580837, 562666, 546190, 531606, 519109, 508508, 499458, 491564, 484182, 476612, 468769, 461343, 455112, 450291, 446573, 443457, 440447, 437319, 434416, 432349, 431129, 429901, 427823, 425037, 422472, 420777, 419775, 418874, 417752, 416538, 415551, 414958, 414620, 414165, 413285, 412038, 410882, 410387, 410793, 411802, 412792, 413359, 413630, 414051, 414914, 416165, 417610, 419153, 420755, 422277, 423468, 424153, 424504, 425127, 426740, 429611, 433273, 436895, 439888, 442118, 443702, 444832, 445735, 446541, 447144, 447372, 447378, 447646, 448569, 450182, 452383, 455189, 458556, 462097, 465279, 467976, 470659, 473924, 477832, 481800]
60202D81800L383K712K482K612K666K550K576K856K969K525J741J141Q84P18N04
60187E14119L86M52N54N01K23k55q00j170j221j093r99r11p24o44j031j750k132
60170E03505j732r09l44k31k18l7J42qm76q78q38l70J66N07P66J131J476J524
60152E03176J442J892L253N023O253O489O052N504N109M817M434L732K614J345
60138E61135M18O6L6k0o5J18M29N09L62M60J039J600J425M37p95j797k514k930
60120E59913k823k172j441j159j237j008l0J372K427K827L167M280O175P902Q613
60105E86806Q438Q064P740P283O738O271N412L333K55k269l161l258m134n875
60091F21643p028o631n364m425m053l592k579j271k55J91L13N23P95O48j02q50
$$ y = [481800, 485183, 487895, 490377, 492989, 495655, 498205, 500781, 503637, 506606, 509131, 510872, 512013, 512897, 513615, 514119, 514505, 514957, 515511, 516012, 516235, 515980, 515180, 514010, 512789, 511696, 510697, 509786, 509062, 508418, 507387, 505637, 503505, 501773, 500864, 500520, 500289, 500071, 500034, 500176, 500168, 499692, 498814, 497976, 497606, 497772, 498279, 499045, 500176, 501652, 503176, 504618, 506510, 509763, 514786, 521039, 527528, 533580, 539084, 544193, 549010, 553444, 557176, 559790, 561135, 561553, 561619, 561655, 561635, 561570, 561688, 562117, 562626, 562988, 563448, 564487, 566087, 567512, 567949, 567154, 565357, 562843, 559913, 557090, 554918, 553477, 552318, 551081, 550073, 550043, 551415, 553842, 556669, 559836, 564116, 570291, 578193, 586806, 595244, 603308, 611048, 618331, 625069, 631340, 636752, 640085, 640340, 638071, 634910, 631652, 627518, 621643, 614615, 607984, 602620, 598195, 594142, 590550, 587971, 586700, 586445, 586636, 586949, 587472, 588267, 588915, 588813, 587963]
60075E87963r80q76j581l319n007n457m593l245k268k126k910m192n098n075m554
60060E36682m530n425o601p090o641n933n789o232o482n924m830l968l649l508
60046D60080l096k309j268k34L33J34l78k94P06J880K331J958J361J074J190J459
60030D64927J489J078N19L23M97M23k81j194j653j597j522j838k514l185l469
60015D52003l396l527m223m844m354k863j712j689k052j872j401j269j158n09
60001D17134J97K26J91J363L451M703M393L712L680L662K805J666J286J510J393
59986D51372Q10N41J007J868K763L716M654N215N100M359L379K738K792L112K768
59971D96194J461k7q65j132j206r11m5O80L46p33j318r84n91q19j279j374j205
$$ y = [587963, 586983, 586107, 584526, 581207, 576200, 570743, 566150, 562905, 560637, 558511, 555601, 551409, 546311, 541236, 536682, 532152, 526727, 520126, 513036, 506395, 500462, 494673, 488441, 481959, 476035, 471205, 467237, 463588, 460080, 456984, 454675, 453407, 453173, 453506, 453640, 453262, 452968, 453674, 455554, 457885, 459843, 461204, 462278, 463468, 464927, 466416, 467494, 468013, 468336, 468833, 469256, 468975, 467781, 466128, 464531, 463009, 461171, 458657, 455472, 452003, 448607, 445080, 440857, 436013, 431659, 428796, 427084, 425395, 423343, 421471, 420070, 418801, 417643, 417134, 417331, 417557, 417748, 419111, 422562, 427265, 431658, 435370, 439050, 442712, 445517, 447183, 448469, 449979, 451372, 452182, 452723, 453730, 455598, 458361, 462077, 466731, 471946, 477046, 481405, 484784, 487522, 490314, 493426, 496194, 497655, 497628, 496763, 495631, 494425, 493514, 493469, 494149, 494495, 493762, 492444, 491460, 490869, 490050, 488771, 487397, 486192]
59954D86192j055p38p3M50K08o51j349j390q72q9P07J182J014K46o29j016o28
59937D81509K92J107J258P74J86p4lK44N83Q62Q74P36Q58J242J245M86l61l10
59919D91508N52J078N32n20j030p14j86j01m89q34o05K59J249J718J427O59j06
59902D94397m44p7R31J991K392K103J886K359L208L651L446L042K826K709K582
59887E27002K693L200L654L358K278J249J118J913K975L696L931L807L459L019
59873E67352K537J912J045J85k26j89l36j174k399l334l839m263m641m548l897
59858E44185l235k948k686k053j355j127j165p10N25K088L548M927O329P675R091
59843E63089J0960J3234J4992J5132J3364J0293O740L342O67p62p50L83J930L079
$$ y = [486192, 485137, 484399, 484326, 484776, 484984, 484333, 482984, 481594, 480722, 480633, 481340, 482522, 483536, 483782, 483153, 482137, 481509, 481801, 482908, 484166, 484940, 485126, 485052, 485049, 485293, 485876, 486738, 487612, 488348, 489206, 490448, 491693, 492179, 491818, 491508, 492060, 493138, 493670, 493150, 492120, 491406, 491220, 491119, 490630, 489796, 489191, 489450, 490699, 492417, 493844, 494503, 494397, 493953, 493876, 494807, 496798, 499190, 501293, 503179, 505538, 508746, 512397, 515843, 518885, 521711, 524420, 527002, 529695, 532895, 536549, 539907, 542185, 543434, 544552, 546465, 549440, 553136, 557067, 560874, 564333, 567352, 569889, 571801, 572846, 573031, 572805, 572616, 572280, 571106, 568707, 565373, 561534, 557271, 552630, 548082, 544185, 540950, 538002, 535316, 533263, 531908, 530781, 529616, 528906, 529431, 531519, 535067, 539994, 546323, 553998, 563089, 574049, 587283, 602275, 617407, 630771, 641064, 647804, 651146, 651813, 651051, 650301, 650684, 652614, 655693]
59829F55693L198K034l00l545p403j1349j4587j6417j6698j5796j4249j2556j1131
59816E36894j0125r274q200o862n608m714m113l655l397l477l803m013l838l394
59802D62421l104l231l588l760l629l416l203k701j802j045j098j793k184j751
59788D26116j065r71j436j692j377j013j250k047k855l312l419l183k511j521
59774C98464o87m22o08p58n57j14K97O16R80J419J655J323M92j93r2O87J426J791
59756D05719K229L087L788L521K569K159K869L903M224L769L102K503K005J885
59742D47332K350K898K749J894J182J147J349J055K07n50o37j84P9m12j389k006
59726D57064j834j292r12o33k22N0j91o92r25r61j179j335q40K0K14m35p85L5
$$ y = [655693, 658891, 660925, 660625, 657080, 649677, 638328, 623741, 607324, 590626, 574830, 560581, 548025, 536894, 526769, 517495, 509295, 502433, 496825, 492111, 487998, 484343, 480946, 477469, 473666, 469653, 465815, 462421, 459317, 456086, 452498, 448738, 445109, 441693, 438490, 435789, 433987, 432942, 431844, 430051, 427867, 426116, 425051, 424080, 422644, 420952, 419575, 418562, 417312, 415265, 412410, 409098, 405679, 402496, 399985, 398464, 397777, 397355, 396747, 395989, 395432, 395318, 395615, 396231, 397211, 398630, 400285, 401608, 402100, 401907, 401815, 402502, 403928, 405719, 407948, 411035, 414823, 418344, 420913, 423072, 425941, 429844, 434068, 437837, 440939, 443442, 445447, 447332, 449682, 452580, 455329, 457223, 458405, 459552, 460901, 461956, 462163, 461613, 460976, 460792, 460871, 460459, 459070, 457064, 455230, 453938, 453026, 452393, 452171, 452221, 452030, 451338, 450413, 449452, 448273, 446938, 446098, 446118, 446332, 445897, 445112, 445147]
59708D45147J405K221K317K265K381K612K962L315L322L007L110M121N392N911
59694D89488N657N400N507N613N362M691L577K087O48l92j196j872j866p55O43
59679E22592J005L02k14J20N31J49q67j890k648k976k579j639j010j297k209l179
59663E04191l959m208l364j592j43M2m34l84L50J081J578K095K404J995J247J263
59647E02162K271L137K884J914J209R76O91M4p50j480k207l006l708l993l686
59632D96458l016k540k637l050l166k789k306k061j870j385o70o5L14N72O22Q6
59616D72497j204k839m119m721m924n141n313m948l811k382j444j275j441j390
59602D27545j061p72o91o18l22R2L42M53Q20J626K332K191J200J94q3K55O01N62
$$ y = [445147, 446552, 448773, 451090, 453355, 455736, 458348, 461310, 464625, 467947, 470954, 474064, 478185, 483577, 489488, 495145, 500545, 506052, 511665, 517027, 521718, 525295, 527382, 528030, 527638, 526442, 524570, 522704, 521949, 522592, 523597, 523899, 523685, 523805, 524336, 524485, 523618, 521728, 519080, 516104, 513525, 511886, 510876, 509579, 507370, 504191, 500232, 496024, 492660, 491068, 490925, 490967, 490533, 490149, 490499, 491580, 493158, 495253, 497657, 499652, 500899, 502162, 504433, 507570, 510454, 512368, 513577, 514553, 515244, 515288, 514538, 513058, 510851, 507845, 504137, 500144, 496458, 493442, 490902, 488265, 485215, 482049, 479260, 476954, 474893, 473023, 471638, 470968, 470903, 471217, 471789, 472411, 472497, 471293, 468454, 464335, 459614, 454690, 449549, 444236, 439288, 435477, 433095, 431651, 430376, 428935, 427545, 426484, 425712, 425021, 424403, 424081, 424173, 424515, 424968, 425788, 427414, 429746, 431937, 433137, 433331, 433248, 433503, 434104, 434666]
59584D34666J08o08j217j250p26l76q48j871k669l018l307l663l664l056k126
59569D06375j251n92l07n63j096j353j234j202j363j146k89N07N14Q8Q8O02R85
59552C98763R60Q95J075J343J600J968K366K482K311K302K797L760N096O733Q337
59537D42788R533J0628J2478J5282J7923J8840J7211J3058O876k03o378j0179
59525E47857j1542j1386j0291q180n225k283j02J417K800M121M892M700L639K157
59511E22574O66o69j853k898l759m408m833n029n081n322o016o802o806n739m499
59496D59526m216m833n231m679l461k081o40O86J316R77K87K3K08M04O00J103
59480D39989J845K473L028L851M825N439N655N987O538O700O137N370M853M089
$$ y = [434666, 434774, 434166, 432949, 431699, 430973, 430597, 429749, 427878, 425209, 422191, 418884, 415221, 411557, 408501, 406375, 405124, 404532, 404225, 403662, 402566, 401213, 399979, 398777, 397414, 396268, 395979, 396486, 397000, 397088, 397176, 397778, 398763, 399723, 400618, 401693, 403036, 404636, 406604, 408970, 411452, 413763, 416065, 418862, 422622, 427718, 434451, 442788, 452321, 462949, 475427, 490709, 508632, 527472, 544683, 557741, 564617, 564414, 558036, 547857, 536315, 524929, 514638, 506458, 501233, 498950, 498848, 500265, 503065, 507186, 512078, 516778, 520417, 522574, 523240, 522571, 520718, 517820, 514061, 509653, 504820, 499791, 494710, 489388, 483372, 476570, 469764, 464025, 459526, 455310, 450477, 445246, 440567, 437106, 435025, 434385, 435071, 436387, 437364, 437651, 437674, 437882, 438286, 438886, 439989, 441834, 444307, 447335, 451186, 456011, 461450, 467105, 473092, 479630, 486330, 492467, 497837, 502690, 506779]
59466E06779K353kj711k078j646j377j628k070k154j456J51K387M692O566P776
59451E16582Q281Q206P922P959Q684J0044J1604J2710J2724J1375Q948O046L049
59438F34134l5l156n868p608q326q617r148r895j0117r211p554o261o003o303
59424E36032o226n477m480l478k123q0K394M779O881Q839J0800J2992J5887J9758
59410E96498K3973K7182K8323K7087K3329J6652P252l122j1733j6632j7529j4995
59398F86285r629k523M140P988Q044M836r40q889j7819k5220k8885k8761k6491
59385E62136k3461k0062j6541j3382j0652p916n301l705l399l166j743M16J763
59372D54987J755J339J420J837K121K306K537K584K291K020K084K189J942J562
$$ y = [506779, 509132, 509130, 507419, 505341, 503695, 502318, 500690, 498620, 496466, 495010, 495161, 497548, 502240, 508806, 516582, 524863, 533069, 540991, 548950, 557634, 567678, 579282, 591992, 604716, 616091, 625039, 631085, 634134, 634099, 630943, 625075, 617467, 609141, 600524, 591376, 581481, 571364, 562153, 554599, 548338, 542335, 536032, 529806, 524329, 519849, 516371, 514248, 514168, 516562, 521341, 528222, 537061, 547861, 560853, 576740, 596498, 620471, 647653, 675976, 703063, 726392, 743044, 750296, 747174, 735441, 718809, 701280, 686285, 676656, 674133, 678273, 686261, 694305, 699141, 698201, 689312, 671493, 646273, 617388, 588627, 562136, 538675, 518613, 502072, 488690, 478038, 470122, 464821, 461116, 457717, 454551, 452808, 453224, 454987, 456742, 458081, 459501, 461338, 463459, 465765, 468302, 470886, 473177, 475197, 477281, 479470, 481412, 482974]
59358D82974J509J705J819K066K993M498N771O375O690P126P526P706Q020Q902
59344E55680J0222J1581J2895J4262J5473J6145J6242J5995J5482J4697J3876
59333G12550J3210J2274J0335P399M380K105N62o49j660k481l368m541n761o639
59319G37716p185p657q020p956p424o740o119n478m817m362m231m218m128m054
59305F55327m117m149l787k830j306O25K677M513O022P510R437J1946J4797J7543
59291G14208J9568K0043J8205J3877P538q5q156j5355j9962k1006j9263j6640
59279F92972j4313j1967q975n758l359j997p70J102L326N074O017O512P044P841
59265F82749Q882R897J0383R888Q375O224L962K039O32n72k284m932q077j0732
$$ y = [482974, 484483, 486188, 488007, 490073, 493066, 497564, 503335, 509710, 516400, 523526, 531052, 538758, 546778, 555680, 565902, 577483, 590378, 604640, 620113, 636258, 652500, 668495, 683977, 698674, 712550, 725760, 738034, 748369, 755768, 760148, 762253, 762815, 762166, 760506, 758025, 754657, 750116, 744355, 737716, 730531, 722874, 714854, 706898, 699474, 692734, 686615, 681137, 676320, 671958, 667727, 663509, 659381, 655327, 651210, 647061, 643274, 640444, 639138, 639763, 642440, 646953, 652975, 660485, 669922, 681868, 696665, 714208, 733776, 753819, 772024, 785901, 793439, 793354, 785198, 769843, 749881, 728875, 709612, 692972, 678659, 666692, 657717, 651959, 648600, 646603, 645833, 646935, 650261, 655335, 661352, 667864, 674908, 682749, 691631, 701528, 711911, 721799, 730174, 736398, 740360, 742399, 743031, 742459, 740175, 735243, 727166, 716434]
59251G16434j2313j2994j3185j2947j2184j1157j0460j0395j0517r965q340o231
59239E85746m737m387m613m383l199j416K29J101R06r5j059j132k83O52R27O13
59223E64870J73l59j299k540l426l593l508l856m625n180n146m796m531m413m341
59208E13430m324m346m229l930l717l634l138j770k2J129J539J988K822L362L101
59193D98261K731L174M138M532M136L844M281N017N490N914O691P459P355O176
59179E69199M767M150M526N234N532N239M670M154L886M049M644N144M891M101
59165F34186L898M889O170O459N786N241N301N397N088M672M338L729K678J583
59151F99415N64r17l003m744n244m937m995n832o961p901q422q150o829n023l798
$$ y = [716434, 704121, 691127, 677942, 664995, 652811, 641654, 631194, 620799, 610282, 600317, 591977, 585746, 581009, 576622, 572009, 567626, 564427, 563011, 563240, 564341, 565247, 565152, 564093, 562961, 562678, 563330, 564257, 564870, 565043, 564684, 563385, 560845, 557419, 553826, 550318, 546462, 541837, 536657, 531511, 526715, 522184, 517771, 513430, 509106, 504760, 500531, 496601, 492884, 489250, 486112, 484342, 484320, 485449, 486988, 488976, 491798, 495160, 498261, 500992, 504166, 508304, 512836, 516972, 520816, 525097, 530114, 535604, 541518, 548209, 555668, 563023, 569199, 573966, 578116, 582642, 587876, 593408, 598647, 603317, 607471, 611357, 615406, 620050, 625194, 630085, 634186, 638084, 642973, 649143, 655602, 661388, 666629, 671930, 677327, 682415, 687087, 691425, 695154, 697832, 699415, 699979, 699062, 696059, 691315, 686071, 681134, 676139, 670307, 663346, 655445, 647023, 638873, 632044, 627021, 623223]
59136F23223l576l839l937l656l033k119j103j96O70J654K559L030L185L557M337
59121F20756N165N760O298P029P946Q992J0169J1294J1992J2127J1891J1417J0623
59108G41459R606Q717Q137P650P031O217N040L276J216l36j027j494k535m089
59094G88868n458o224o480o388o079n860n977o152n835n013m350m385m959n574
59080G10134o054o653p622q838r815j0121r899r812j0273j0806j0555r377q045
59067E92264p296p044o804o373n841n230m527l921l534l122k414j679j460j737
59053E31282j885j543j105j116j538j907j902j506r01l83k14k14Q6P51J214J056
59037E20175O47N71Q08R92J138J460J709J481J044J171K071L259M396N468O120
$$ y = [623223, 619647, 615808, 611871, 608215, 605182, 603063, 601960, 601764, 602434, 604088, 606647, 609677, 612862, 616419, 620756, 625921, 631681, 637979, 645008, 652954, 661946, 672115, 683409, 695401, 707528, 719419, 730836, 741459, 751065, 759782, 767919, 775569, 782600, 788817, 793857, 797133, 798349, 798013, 796986, 795492, 792957, 788868, 783410, 777186, 770706, 764318, 758239, 752379, 746402, 740250, 734415, 729402, 725052, 720667, 715708, 710134, 704080, 697427, 689805, 680967, 671152, 661031, 651132, 641320, 631047, 620241, 609686, 600309, 592264, 584968, 577924, 571120, 564747, 558906, 553676, 549149, 545228, 541694, 538572, 536158, 534479, 533019, 531282, 529397, 527854, 526749, 525633, 524095, 522188, 520286, 518780, 517879, 517496, 517282, 517068, 517154, 517905, 519119, 520175, 520822, 521393, 522201, 523193, 524331, 525791, 527500, 528981, 530025, 531196, 533267, 536526, 540922, 546390, 552510]
59022E52510N801M870M583N549P043Q322R634J1172J1997J1096R009P187O092
59009F54865M909L059R66p22j820k340k296j936j595j242n64M41J458K301K912
58994F58396L042K594K054J912J788R49m35j453j900k474l459m281m670n244o311
58979F40508p103o946o406o397o656o077m264k029l70N06J211K517M513O269O755
58964F16031O245O158P179Q266Q236P507P306P621P209N563L667K466J557o4k520
58949F92427m953o586p492q335r638j1168j1982j1251r182p028n956n977o072
58936E86807n379m129l342l614m484n085n141m956m626l930l066k728l122l451
58922E29754k912j764r19p83j092j559k058k271j814p86K38P92Q14N34M14J062
$$ y = [552510, 558311, 563181, 567764, 573313, 580356, 588678, 598312, 609484, 621481, 632577, 641586, 648773, 654865, 659774, 662833, 663799, 663077, 661257, 658917, 656621, 654685, 653090, 651848, 651284, 651725, 653183, 655484, 658396, 661438, 664032, 666086, 667998, 669786, 670735, 670300, 668847, 666947, 664473, 661014, 656733, 652063, 646819, 640508, 633405, 626459, 620053, 613656, 607000, 600923, 596659, 594630, 594260, 594766, 595977, 598494, 603007, 609276, 616031, 622276, 628434, 635613, 643879, 652115, 659622, 666928, 674549, 681758, 687321, 690988, 693454, 695011, 694947, 692427, 687474, 680888, 673396, 665061, 655423, 644255, 632273, 621022, 611840, 604812, 598856, 592879, 586807, 581428, 577299, 573957, 570343, 565859, 560774, 555633, 550677, 546051, 542121, 539055, 536327, 533205, 529754, 526842, 525078, 524159, 523376, 522284, 520725, 518667, 516396, 514582, 513796, 514034, 514826, 515640, 516174, 516588, 517650]
58906E17650K634M455N697O341P031Q056R050R721J0222J0686J0930J0835J0565
58893F23873J0177R495Q551P780P485P531P803Q593J0083J1797J2988J3495J3816
58880G53467J4316J4626J4010J2162R602P243N512L976J858j094m425p432r594
58867H14227j0619j0548r952r632r769r588q262o156m766n311p508r844j0993
58854G01279j0815j0112r755j0113j1008j1837j1903j1059j0027r691r989r955
58842E75015q890p120n398m179l714m154n028n244m376l474l682m453m238k858
58828E08207j885k410l583l958l336k485j784j084m96l33m74n51o45j062j401
58813D82720p52R52K528K947K559K434K798K867K136J149P37R30J013N23k46o72
$$ y = [517650, 520284, 524739, 530436, 536777, 543808, 551864, 560914, 570635, 580857, 591543, 602473, 613308, 623873, 634050, 643545, 652096, 659876, 667361, 674892, 682695, 691288, 701371, 713168, 726156, 739651, 753467, 767783, 782409, 796419, 808581, 818183, 825426, 830938, 834914, 836772, 835678, 831253, 823821, 814227, 803608, 793060, 783108, 773476, 763707, 754119, 745857, 739701, 734935, 729624, 722116, 712272, 701279, 690464, 680352, 670597, 660484, 649476, 637639, 625736, 614677, 604650, 594959, 584970, 575015, 566125, 559005, 553607, 549428, 545714, 541560, 536532, 531288, 526912, 523438, 519756, 515303, 511065, 508207, 506322, 503912, 500329, 496371, 493035, 490550, 488766, 487682, 487186, 486853, 486379, 485828, 485183, 484121, 482720, 481968, 482920, 485448, 488395, 490954, 493388, 496186, 499053, 501189, 502338, 503075, 504005, 505018, 505541, 505295, 504623]
58797E04623n30j79j81p86j644k059j621o39J98N62O94Q60R93J018J197J876L016
58780E07398M206N075N539N818O272P023P653P556O692N614M597L239J236r39
58766E76979k609l698m455m836m825m944n541n901n064l434k494k754l093k478
58752E20853j298m15J99J053K029K580K730L017L574L911L653L069K765L111L966
58737E54797M810N284N689O587P825Q474Q087P489P742Q656R042Q298P035O140
58723F55955N810N705N532N181M635M052L765M030M691N281N422N209N180N791
58709G26239O837P530P250O105M562K777N43k169m964p350r186j0700j2240j3983
58695G01251j5802j7356j8315j8569j8284j7758j7140j6163j4386j1904r640q507
$$ y = [504623, 504093, 503914, 503733, 502947, 501303, 499244, 497623, 496984, 497182, 497744, 498438, 499298, 500291, 501309, 502506, 504382, 507398, 511604, 516679, 522218, 528036, 534308, 541331, 548984, 556540, 563232, 568846, 573443, 576682, 577918, 576979, 574370, 570672, 566217, 561381, 556556, 551612, 546071, 540170, 535106, 531672, 529178, 526424, 523331, 520853, 519555, 519140, 519339, 520392, 522421, 525001, 527731, 530748, 534322, 538233, 541886, 544955, 547720, 550831, 554797, 559607, 564891, 570580, 577167, 584992, 593466, 601553, 609042, 616784, 625440, 634482, 642780, 649815, 655955, 661765, 667470, 673002, 678183, 682818, 686870, 690635, 694665, 699356, 704637, 710059, 715268, 720448, 726239, 733076, 740606, 747856, 753961, 758523, 761300, 761843, 759674, 754710, 747360, 738174, 727474, 715234, 701251, 685449, 668093, 649778, 631209, 612925, 595167, 578027, 561864, 547478, 535574, 525934, 517427]
58683E17427q302p961o902n677m992m703m181l306k498j911j167L9J433K406K558
58668D72263J997J341J355K418M168N817O839P324P665P955P782O608M384J728
58654E39644n78k158l040l359l395l620m286m927m820l993l264l103l057k561
58640D93483j819j478j848k812m153n474o141n790m775l726k934k405k226k284
58626D45618k013r61N44J906L231N093P379R165R923J0194J0644J1009J0477Q914
58612E31123P194O279O262O422O063N160M194L525L061K548J931J313P28J09n81
58597E85331j278j860k199k299k338k409k274j642o39L31J190K158L107L521L382
58582E82082L500M525O151P665Q798R538R555Q605P151N914N005M125L457L544
$$ y = [517427, 509125, 501164, 494262, 488585, 483593, 478890, 474709, 471403, 468905, 466994, 465827, 465866, 467299, 469705, 472263, 474260, 475601, 476956, 479374, 483542, 489359, 496198, 503522, 511187, 519142, 526924, 533532, 537916, 539644, 539066, 536908, 533868, 530509, 527114, 523494, 519208, 514281, 509461, 505468, 502204, 499101, 496044, 493483, 491664, 490186, 488338, 485526, 481373, 475899, 469758, 463968, 459193, 455467, 452533, 450128, 447902, 445618, 443605, 442644, 443188, 445094, 448325, 453418, 460797, 469962, 479885, 490079, 500723, 511732, 522209, 531123, 538317, 544596, 550858, 557280, 563343, 568503, 572697, 576222, 579283, 581831, 583762, 585075, 585803, 585912, 585331, 584053, 582193, 579994, 577695, 575357, 572948, 570674, 569032, 568393, 568724, 569914, 572072, 575179, 578700, 582082, 585582, 590107, 596258, 603923, 612721, 622259, 631814, 640419, 647570, 653484, 658489, 662614, 666071, 669615]
58568F69615M372N315O105P144Q721J0527J2158J3650J5171J6617J7688J8196
58556H05279J8148J7753J7286J6693J5381J2777R151N435K303l10k749n164p440
58543I04543r282j0306j0463j0383j0829j1822j2644j2817j2626j2593j2864j3259
58531G64655j3561j3584j3190j2410j1443j0466r620q967q259o976m974k865j358
58518F46982m34L04P78O52K09K16Q47J483J706J777J940J974J729J458J367J367
58502F64355J415J524J308K40j388k497k528k037j645j253p22m82p65r82o08j03
58486F53832m5N0J060K771M071M463M492M706N164N995P482R314J0570J0798J0535
58471G35258J0349R990Q930P277N523L693J376j350l652m797n009n053n176m846
$$ y = [669615, 673987, 679302, 685407, 692551, 701272, 711799, 723957, 737607, 752778, 769395, 787083, 805279, 823427, 841180, 858466, 875159, 890540, 903317, 912468, 917903, 920206, 919896, 917147, 911983, 904543, 895261, 884955, 874492, 864109, 853280, 841458, 828814, 815997, 803371, 790778, 777914, 764655, 751094, 737510, 724320, 711910, 700467, 690001, 680381, 671414, 663155, 656179, 651205, 648340, 646982, 646548, 646852, 647630, 648282, 648491, 648707, 649554, 651037, 652743, 654520, 656460, 658434, 660163, 661621, 662988, 664355, 665770, 667294, 668602, 668842, 667454, 664957, 662429, 660392, 658747, 657494, 656772, 656290, 655525, 654543, 653935, 653832, 653787, 653837, 654897, 657668, 661739, 666202, 670694, 675400, 680564, 686559, 694041, 703355, 713925, 724723, 735258, 745607, 755597, 764527, 771804, 777327, 781020, 782396, 781046, 777394, 772597, 767588, 762535, 757359, 752513]
58457G52513l631j919n11L14Q90J526K209K960L908M837N148M641L907L534L202
58442G83528K077k0k271l670l860l187k283j576j026k82P81J779K285K459K906
58427G77640L909N098N928O254O409O889Q010R665J1301J2241J2130J1145R719
58414H86338Q106O144L501K47k873m871n361m830m085l615l529l782m202m459
58400H62729m352m022l678l139j972j57J714K990L556L713L724L718L887M345
58386H73056M713M295K983J632J194J618K123K369K690L168L298K938K848L667
58372I12592M911N641N731N785O166O847P889R188J0020R768R053R097R984J0587
58358A023259J0408J0312J1018J2045J2713J3159J3539J3250J1924J0412R608
$$ y = [752513, 748882, 746963, 746452, 746766, 747656, 749182, 751391, 754351, 758259, 763096, 768244, 772885, 776792, 780326, 783528, 785605, 785585, 783314, 779644, 775784, 772597, 770314, 768738, 767712, 767430, 768211, 769990, 772275, 774734, 777640, 781549, 786647, 792575, 798829, 805238, 812127, 820137, 829802, 841103, 853344, 865474, 876619, 886338, 894444, 900588, 904089, 904336, 901463, 896592, 891231, 886401, 882316, 878701, 875172, 871390, 867188, 862729, 858377, 854355, 850677, 847538, 845566, 845409, 847123, 850113, 853669, 857382, 861106, 864824, 868711, 873056, 877769, 882064, 885047, 886679, 887873, 889491, 891614, 893983, 896673, 899841, 903139, 906077, 908925, 912592, 917503, 923144, 928875, 934660, 940826, 947673, 955562, 964750, 974770, 984538, 993591, 1002688, 1012672, 1023259, 1033667, 1043979, 1054997, 1067042, 1079755, 1092914, 1106453, 1119703, 1131627, 1142039, 1151647]
58347A151647Q938P355N478N167O905Q993R867R994J0677J2017J3044J3429J3879
58334A277390J4926J6163J6963J7222J7181J7024J6997J7449J8276J8610J7724
58323A465925J6061J4787J4319J3961J3110J2146J1724J1816J1938J1927J1883
58312A609597J1736J1483J1595J2615J4346J5990J7075J7857J8885K0484K2506
58301A784169K4282K5089K4988K4881K5392K6200K6824K7435K8198K8513K7927
58290B073898K7229K7531K8662K9648L0427L1726L3529L5051L6220L7733L9465
58279B431119M0417M0516M1082M2986M5621M8170N0593N2825N4335N5161N6280
58268B959105N8226O0417O2359O4473O7084O9831P2660P6161Q0254Q3762Q6214
$$ y = [1151647, 1160585, 1167940, 1173418, 1178585, 1185490, 1194483, 1204350, 1214344, 1225021, 1237038, 1250082, 1263511, 1277390, 1292316, 1308479, 1325442, 1342664, 1359845, 1376869, 1393866, 1411315, 1429591, 1448201, 1465925, 1481986, 1496773, 1511092, 1525053, 1538163, 1550309, 1562033, 1573849, 1585787, 1597714, 1609597, 1621333, 1632816, 1644411, 1657026, 1671372, 1687362, 1704437, 1722294, 1741179, 1761663, 1784169, 1808451, 1833540, 1858528, 1883409, 1908801, 1935001, 1961825, 1989260, 2017458, 2045971, 2073898, 2101127, 2128658, 2157320, 2186968, 2217395, 2249121, 2282650, 2317701, 2353921, 2391654, 2431119, 2471536, 2512052, 2553134, 2596120, 2641741, 2689911, 2740504, 2793329, 2847664, 2902825, 2959105, 3017331, 3077748, 3140107, 3204580, 3271664, 3341495, 3414155, 3490316, 3570570, 3654332, 3740546]
58257C740546Q8732R2235R5977R8915J01360J04113J07010J09533J11981J14913
58247D765315J18255J21971J26752J32989J39924J46921J54616J63791J73923
58238F044457J83985J93913K04289K15342K27201K40278K54530K69315K84797
58229H118107L02402L22937L45524L69266L94615M22103M51286M82173N16172
58220A1724585N54356N96436O42756O95462P56049Q23623Q97474R79592J072847
58211A8743180J178628J298398J435570J593775J775493J984732K228913K515832
58203C2754521K851944L247103L718412M286148M969373N789871O776780P961836
58195G2355988R373455J1041710J3004461J5297391J7934021K0890681K4081053
$$ y = [3740546, 3829278, 3921513, 4017490, 4116405, 4217765, 4321878, 4428888, 4538421, 4650402, 4765315, 4883570, 5005541, 5132293, 5265282, 5405206, 5552127, 5706743, 5870534, 6044457, 6228442, 6422355, 6626644, 6841986, 7069187, 7309465, 7563995, 7833310, 8118107, 8420509, 8743446, 9088970, 9458236, 9852851, 10274954, 10726240, 11208413, 11724585, 12278941, 12875377, 13518133, 14213595, 14969644, 15793267, 16690741, 17670333, 18743180, 19921808, 21220206, 22655776, 24249551, 26025044, 28009776, 30238689, 32754521, 35606465, 38853568, 42571980, 46858128, 51827501, 57617372, 64394152, 72355988, 81729443, 92771153, 105775614, 121073005, 139007026, 159897707, 183978760]
58188A83978760K7291089L0096029L1840655L1745408K9120070K3613177J5422448
58181C73107636N387268n124969j4567153k1679511k5849815k7192678k6357373
58174B57723405k4225280k1656489j9330841j7644448j6649215j6090179j5575550
58167A26551403j4800089j3673704j2287737j0795648r326669p967428o768441
58160E0931687n744929m883514m161785l561537l065357k652357k304450k011626
58152B2546132j766851j560716j384968j236457j113146j009717r20603q43897
58144A2709777p78549p20699o66239o14570n66554n21137m76919m34932l96790
58135G533388l61937l29531l01113k78603k61273k47311k36707k29820k24529
$$ y = [183978760, 211269849, 241365878, 273206533, 304951941, 334072011, 357685188, 373107636, 378494904, 373369935, 358802782, 337123271, 311273456, 284080778, 257723405, 233498125, 211841636, 192510795, 174866347, 158217132, 142126953, 126551403, 111751314, 98077610, 85789873, 74994225, 65667556, 57700128, 50931687, 45186758, 40303244, 36141459, 32579922, 29514565, 26862208, 24557758, 22546132, 20779281, 19218565, 17833597, 16597140, 15483994, 14474277, 13553674, 12709777, 11931228, 11210529, 10544290, 9929720, 9363166, 8842029, 8365110, 7930178, 7533388, 7171451, 6841920, 6540807, 6262204, 6000931, 5753620, 5516913, 5287093, 5062564]
58126E062564k17791k09052j99541j89216j77103j63960j51968j41997j33202
58117C478734j25046j17756j11188j04965r9413r4809r0279q4978p9763p6059
58107B494478p3622p1106o8178o5437o2768n9630n6537n4458n2995n0879m8100
58096A830768m5843m4388m2805m0762l8956l7511l5526l2652k9886k8246k7602
58085A426591k7181k6449k5274k3920k2996k2842k2972k2734k2300k2266k2535
58074A165122k2503k2145k2011k2197k2153k1547k0521j9182j7550j5979j4857
58063I44477j4054j3210j2435j2025j1782j1363j1071j1432j2158j2391j1955
58052H10601j1549j1746j2426j3177j3570j3203j2115j0957j0220r532q378p112
$$ y = [5062564, 4844773, 4635721, 4436180, 4246964, 4069861, 3905901, 3753933, 3611936, 3478734, 3353688, 3235932, 3124744, 3019779, 2920366, 2825557, 2735278, 2650300, 2570537, 2494478, 2420856, 2349750, 2281572, 2216135, 2153367, 2093737, 2037200, 1982742, 1929747, 1878868, 1830768, 1784925, 1740537, 1697732, 1656970, 1618014, 1580503, 1544977, 1512325, 1482439, 1454193, 1426591, 1399410, 1372961, 1347687, 1323767, 1300771, 1277929, 1254957, 1232223, 1209923, 1187657, 1165122, 1142619, 1120474, 1098463, 1076266, 1054113, 1032566, 1012045, 992863, 975313, 959334, 944477, 930423, 917213, 904778, 892753, 880971, 869608, 858537, 847105, 834947, 822556, 810601, 799052, 787306, 774880, 761703, 748133, 734930, 722815, 711858, 701638, 692106, 683728, 676616]
58040F76616o449o314o144o012o356o878o834o378o419p066p437p211p213q056
58026E81849r174r781r884r838r607r062q467q096p776p233o549n995n678n590
58012D69119n684n753n517m989m393l815l248k901k942k976k452j616j339j816
57998D19678k133j545n38j60o57j280j267n35M71J311J856K153K062J262j94j586
57982D18898k154j944j630j628j796j995k334k774k972k687k129j669j478j430
57968C90278j200m33Q17J900K140J574Q96O58Q31J013P92P9o58p51k67k25j339
57951C96105k959l951m232m529m877m566l559k810k772k746k157j450j072m93
57937C53932R04K676L998M868N785O593O713O293O158O545O793O407N727N234
$$ y = [676616, 670167, 663853, 657709, 651697, 645341, 638463, 631629, 625251, 618832, 611766, 604329, 597118, 589905, 581849, 572675, 562894, 553010, 543172, 533565, 524503, 516036, 507940, 500164, 492931, 486382, 480387, 474709, 469119, 463435, 457682, 452165, 447176, 442783, 438968, 435720, 432819, 429877, 426901, 424449, 422833, 421494, 419678, 417545, 416000, 415462, 415302, 414645, 413365, 412098, 411563, 412034, 413345, 415201, 417354, 419416, 420678, 420484, 418898, 416744, 414800, 413170, 411542, 409746, 407751, 405417, 402643, 399671, 396984, 394855, 393186, 391708, 390278, 389078, 388645, 389462, 391362, 393502, 395076, 395972, 396630, 397461, 398474, 399266, 399345, 398687, 397936, 397669, 397444, 396105, 393146, 389195, 384963, 380434, 375557, 370991, 367432, 364622, 361850, 359104, 356947, 355497, 354425, 353932, 354836, 357512, 361510, 366378, 372163, 378756, 385469, 391762, 397920, 404465, 411258, 417665, 423392, 428626]
57923D28626M828M190L337K398J225l84k200l750m857n638o126o244o213o500
57909D02692p157p605p365o779o508o547o299n599n023m950m957m582m209m522
57895C20590n387n957n761n121m452l772l012k301j726j210q01o78p03l41O75
57880B80043J911K776L216L540L692L205J857J39j193j853k166k544l058l545
57866B86020l972m378m621m533m241m022l722k829j292K25J173J820K697L784
57852B62109M665N213N569N732N717N855O345O708O354N537N071N127N073M515
57838C39590L754L055K204J062r6j091k138l337m307m693m620m377m002l446k758
57823C14800j955j048l63l89j014j469j233n87MN58J211J685J684J444J397J459
$$ y = [428626, 433454, 437644, 440981, 443379, 444604, 444220, 442020, 438270, 433413, 427775, 421649, 415405, 409192, 402692, 395535, 387930, 380565, 373786, 367278, 360731, 354432, 348833, 343810, 338860, 333903, 329321, 325112, 320590, 315203, 309246, 303485, 298364, 293912, 290140, 287128, 284827, 283101, 281891, 281090, 280412, 279709, 279368, 280043, 281954, 284730, 287946, 291486, 295178, 298383, 300240, 300379, 299186, 297333, 295167, 292623, 289565, 286020, 282048, 277670, 273049, 268516, 264275, 260253, 256531, 253702, 252410, 252635, 253808, 255628, 258325, 262109, 266774, 271987, 277556, 283288, 289005, 294860, 301205, 307913, 314267, 319804, 324875, 330002, 335075, 339590, 343344, 346399, 348603, 349665, 349569, 348478, 346340, 343003, 338696, 334003, 329383, 325006, 321004, 317558, 314800, 312845, 311797, 311434, 311045, 310031, 308562, 307329, 306742, 306746, 307304, 308515, 310200, 311884, 313328, 314725, 316184]
57807C16184J146K16j195k901m689o186p101p530p691p458o584n286m137l386
57793B53402k773k100j617j515j456q49L57J506J900J496P83J63k68m07J0J000
57777B49632K111K848L173L286L206K976K998L571M240M249L671L354L543L391
57763B96249K218N92n14j177k336m326o349p544q015q429q967r042q067o202m156
57748B23935k355o06J365L258M437M629M135L389K632J984J463R17K29l48m29
57733B48635j07Q2j86o90j105j350j366j002l41K27N34R04J640K492K897K573
57717B53837J769R99O81Q00R24P14L23K0l99j271k285k650k225j697j486j195
57701B46859m33M80J117J577J987K030J605J421K174L489M296M056K963J308n99
$$ y = [316184, 317330, 317546, 316351, 313450, 308761, 302575, 295474, 287944, 280253, 272795, 266211, 260925, 256788, 253402, 250629, 248529, 246912, 245397, 243941, 243092, 243449, 244955, 246855, 248351, 249134, 249297, 249029, 248622, 248632, 249632, 251743, 254591, 257764, 261050, 264256, 267232, 270230, 273801, 278041, 282290, 285961, 289315, 292858, 296249, 298467, 299059, 298545, 297368, 295032, 290706, 284357, 276813, 268798, 260369, 251402, 242360, 234293, 228091, 223935, 221580, 220974, 222339, 225597, 230034, 234663, 238798, 242187, 244819, 246803, 248266, 249183, 249412, 249064, 248635, 248528, 248610, 248424, 247734, 246629, 245279, 243913, 242911, 242570, 242797, 243331, 244235, 245875, 248367, 251264, 253837, 255606, 256605, 257286, 258086, 259010, 259724, 260047, 260067, 259668, 258397, 256112, 253462, 251237, 249540, 248054, 246859, 246426, 246906, 248023, 249600, 251587, 253617, 255222, 256643, 258817, 262306, 266602, 270658, 273621, 274929, 274330]
57686B74330k115k604k211j657j285p83J23J327K716M418O565R198J2389J6157
57672C16568K0252K4499K9354L5682M3792N2922O1660O8496P1808O9663O0107
57661H54803M2187J7239j0640l5943n4424o4833o8274o6409o0702n2783m4468
57650D55753l7025l0772k5509k1053j7310j4197j1629r451p428n559m158l381
57638B68281k811j974j049n48m01JQ45J566J733J609J580J490J012L08j83m52
57622B71007r26j731k410k509k212k054k126j947j223m36k94p91j212j063n15
57607B49558Q8P05J305J609J438R79M29l00j114j439q85N0N14L06j43n85j127
57590B51388j731k078k074j958j903j881j857j778j454q74n38r54j852k397k193
$$ y = [274330, 272215, 269611, 267400, 265743, 264458, 263675, 263798, 265125, 267841, 272259, 278824, 288022, 300411, 316568, 336820, 361319, 390673, 426355, 470147, 523069, 584729, 653225, 725033, 794696, 854803, 896990, 914229, 903589, 867646, 813222, 748389, 680115, 613706, 553004, 500221, 455753, 418728, 387956, 362447, 341394, 324084, 309887, 298258, 288807, 281379, 275820, 271662, 268281, 265470, 263496, 262447, 261899, 261498, 261499, 262344, 263910, 265643, 267252, 268832, 270322, 271334, 271642, 271459, 271007, 270081, 268350, 265940, 263431, 261219, 259165, 257039, 255092, 253869, 253433, 253139, 252348, 251136, 250073, 249558, 249646, 250351, 251656, 253265, 254703, 255682, 256111, 255811, 254697, 253258, 252373, 252423, 252937, 253243, 253100, 252515, 251388, 249657, 247579, 245505, 243547, 241644, 239763, 237906, 236128, 234674, 233800, 233262, 232308, 230456, 228059, 225866]
57575B25866j574r42l82ll2l97o82o81o15o54o40m72l20l30m11m38l42K4O86J197
57555B18858J015L54J16P47J633J932J592J230J296J725K167K311K086J714J423
57540B40199J190R97J147J838K473K195J212Q18J612K482K081P41k5L57Q76N92
57524B60785m0k3O03Q62L77K2O54J824K319J895J573K083K796K795K384K589L431
57507B86929L773L012K039J999K733L071K336J090M24Q49J833K339J833P24k62
57492C14722q76j233j183m26Q17J831K232K163J801J281J120J841K985L388K742
57477C33205K009J905J876J248M70L59P72R70Q29O87M54j23n76p4J305K590L157
57460C51063L188K910K320J751J822K492K897K477J744J562K173L218M238M850
$$ y = [225866, 224292, 223350, 222968, 222965, 222933, 222536, 221854, 221173, 220558, 219904, 219264, 218792, 218472, 218142, 217731, 217293, 216951, 216975, 217661, 218858, 219873, 220227, 220343, 221090, 222723, 224655, 226247, 227477, 228773, 230498, 232665, 234976, 237062, 238776, 240199, 241389, 242386, 243533, 245371, 247844, 250039, 251251, 252069, 253681, 256163, 258244, 258985, 258960, 259317, 260193, 260785, 260745, 260722, 261325, 262187, 262564, 262586, 263240, 265064, 267383, 269278, 270851, 272934, 275730, 278525, 280909, 283498, 286929, 290702, 293714, 295753, 297752, 300485, 303556, 305892, 306982, 307406, 308255, 310088, 312427, 314260, 314984, 314722, 313846, 312613, 311430, 311004, 311821, 313652, 315884, 318047, 319848, 321129, 322249, 324090, 327075, 330463, 333205, 335214, 337119, 338995, 340243, 340713, 341072, 341844, 342814, 343643, 344330, 344784, 344661, 344085, 344011, 345316, 347906, 351063, 354251, 357161, 359481, 361232, 363054, 365546, 368443, 370920, 372664, 374226, 376399, 379617, 383855, 388705]
57446C88705M781M185L602L346L198K889K576K504K571K551K620L219M387N525
57432D36659N902N303M200L335L144L488L877L975L833L757L976M446M887N044
57418D95826M940M762M544M143L603L253L335L727M228M823N494O003O129N954
57404E60764N651N303N135N503O294O668O029M968M623N268O144O625O766O777
57390F42518O641O472O555O830O917O845P174Q063Q888R118Q998Q934Q711P999
57376G50663P168O957P493Q223Q689Q837Q664Q148P592P530Q047Q519Q269P420
57362H62219O832P200Q243R017R069R055R783J0844J0888R490Q002Q022R450J0834
57348I88948J1335J1437J1770J2152J2157J1913J1788J1684J1252J0608J0324
$$ y = [388705, 393486, 397671, 401273, 404619, 407817, 410706, 413282, 415786, 418357, 420908, 423528, 426747, 431134, 436659, 442561, 447864, 452064, 455399, 458543, 462031, 465908, 469883, 473716, 477473, 481449, 485895, 490782, 495826, 500766, 505528, 510072, 514215, 517818, 521071, 524406, 528133, 532361, 537184, 542678, 548681, 554810, 560764, 566415, 571718, 576853, 582356, 588650, 595318, 601347, 606315, 610938, 616206, 622350, 628975, 635741, 642518, 649159, 655631, 662186, 669016, 675933, 682778, 689952, 698015, 706903, 716021, 725019, 733953, 742664, 750663, 757831, 764788, 772281, 780504, 789193, 798030, 806694, 814842, 822434, 829964, 838011, 846530, 854799, 862219, 869051, 876251, 884494, 893511, 902580, 911635, 921418, 932262, 943150, 952640, 960642, 968664, 978114, 988948, 1000283, 1011720, 1023490, 1035642, 1047799, 1059712, 1071500, 1083184, 1094436, 1105044, 1115368]
57337A115368J0760J1771J3038J4341J5394J5806J5428J4578J3791J3387J3380
57326A267042J3631J3912J3949J3655J3386J3657J4485J5261J5503J5488J5866
57315A425835J6707J7364J7353J6963J6823J7118J7475J7473J6993J6320J6041
57304A612465J6659J8013J9244J9617J9293J8987J9057J9319J9583J9867K0075
57293A822179J9989J9716J9665J9924K0121K0164K0517K1363K1975K1559K0405
57282B047577J9561J9510J9860K0201K0578K0934K0876K0347J9967K0256K0902
57271B270569K1236K1143K1051K1276K1758K2356K2915K3168K2961K2547K2271
57260B513251K2009K1369K0490K0159K0895K2256K3277K3439K3028K2720K2961
$$ y = [1115368, 1126128, 1137899, 1150937, 1165278, 1180672, 1196478, 1211906, 1226484, 1240275, 1253662, 1267042, 1280673, 1294585, 1308534, 1322189, 1335575, 1349232, 1363717, 1378978, 1394481, 1409969, 1425835, 1442542, 1459906, 1477259, 1494222, 1511045, 1528163, 1545638, 1563111, 1580104, 1596424, 1612465, 1629124, 1647137, 1666381, 1685998, 1705291, 1724278, 1743335, 1762654, 1782237, 1802104, 1822179, 1842168, 1861884, 1881549, 1901473, 1921594, 1941758, 1962275, 1983638, 2005613, 2027172, 2047577, 2067138, 2086648, 2106508, 2126709, 2147287, 2168221, 2189097, 2209444, 2229411, 2249667, 2270569, 2291805, 2312948, 2333999, 2355275, 2377033, 2399389, 2422304, 2445472, 2468433, 2490980, 2513251, 2535260, 2556629, 2577119, 2597278, 2618173, 2640429, 2663706, 2687145, 2710173, 2732893, 2755854]
57249B755854K3589K3966K3670K3046K2872K3335K3721K3298K2268K1457K1269
57238C008345K1295K0927K0015J8866J7925J7570J7927J8696J9277J9191J8434
57227C218468J7393J6570J6390J7014J8112J8945J8969J8402J7991J8111J8358
57216C414723J8149J7566J7207J7272J7166J6212J4499J2741J1446J0506R578
57205C577065Q535P494O552N648M573L137J499K17k52j87m13j295k234k372j727
57190C606240j145j290j981k661l163l681m202m408m179l880l904m191m493m884
57176C558178n584o337o470n711m527l440k456j465q04q46j358j732j791j856
57162C513801k129k517k973l472l687l298k701k721l477m140m145m039m706o203
$$ y = [2755854, 2779443, 2803409, 2827079, 2850125, 2872997, 2896332, 2920053, 2943351, 2965619, 2987076, 3008345, 3029640, 3050567, 3070582, 3089448, 3107373, 3124943, 3142870, 3161566, 3180843, 3200034, 3218468, 3235861, 3252431, 3268821, 3285835, 3303947, 3322892, 3341861, 3360263, 3378254, 3396365, 3414723, 3432872, 3450438, 3467645, 3484917, 3502083, 3518295, 3532794, 3545535, 3556981, 3567487, 3577065, 3585600, 3593094, 3599646, 3605294, 3609867, 3613004, 3614503, 3614720, 3614468, 3614281, 3613868, 3612573, 3610339, 3607967, 3606240, 3605095, 3603805, 3601824, 3599163, 3596000, 3592319, 3588117, 3583709, 3579530, 3575650, 3571746, 3567555, 3563062, 3558178, 3552594, 3546257, 3539787, 3534076, 3529549, 3526109, 3523653, 3522188, 3521384, 3520538, 3519180, 3517448, 3515657, 3513801, 3511672, 3509155, 3506182, 3502710, 3499023, 3495725, 3493024, 3490303, 3486826, 3482686, 3478541, 3474502, 3469796, 3463593]
57148C463593p926r564j1361j3542j5966j8321k0408k2251k4044k5873k7380k7965
57136C238992k7433k6140k4372k2036j9165j6264j3702j1228q568o179m806m489
57124C054610m633m865n244n547m986k836J004O177J2280J9017K6222L3836M1728
57111C166763M9623N7479O5982P6337Q9498J05681J24545J45740J69395J96370
57101D247413K28020K65705L10639L64247M28159N03532N90565O88889P97897
57092H425066R15980J039423J162513J278674J381297J463861J520068J544392
57084A8731274J532764J483227J396137J273078J115107R22782O99063M52047
57076B7605479J93665o4923l16721n58475p88088j002181j194717j357217j481113
$$ y = [3463593, 3455667, 3446103, 3434742, 3421200, 3405234, 3386913, 3366505, 3344254, 3320210, 3294337, 3266957, 3238992, 3211559, 3185419, 3161047, 3139011, 3119846, 3103582, 3089880, 3078652, 3070084, 3063905, 3059099, 3054610, 3049977, 3045112, 3039868, 3034321, 3029335, 3026499, 3027503, 3033680, 3045960, 3064977, 3091199, 3125035, 3166763, 3216386, 3273865, 3339847, 3416184, 3505682, 3611363, 3735908, 3881648, 4051043, 4247413, 4475433, 4741138, 5051777, 5416024, 5844183, 6347715, 6938280, 7627169, 8425066, 9341046, 10380469, 11542982, 12821656, 14202953, 15666814, 17186882, 18731274, 20264038, 21747265, 23143402, 24416480, 25531587, 26454369, 27153432, 27605479, 27799144, 27734221, 27417500, 26859025, 26070937, 25068756, 23874039, 22516822, 21035709]
57067B1035709j560895j595393j586806j539720j461152j360106j245764j125946
57059I559927j006970q93709p88902o93072o06034n28263m60438m02314l52807
57050C827418l10819k75319k44986k18576j95570j75829j58836j43829j30508
57041A973146j18891j08593r8911q9588q0934p3130o5955n9229n3009m7214m1508
57030A136184l5695k9766k3467j6236p773J645J1794K3366L7878N6381P7666R7251
57018A329228J08300J04504Q3141M6380M06m6456q5966j12355j24130j23900j16146
57007A063006j04782r2184p9649o7942n7412m8066l9892l3088k7853k3981k0842
56996D67315j7922j5237j3145j1730j0634r514q364p302o192m747k975j282o4
$$ y = [21035709, 19474814, 17879421, 16292615, 14752895, 13291743, 11931637, 10685873, 9559927, 8552957, 7659248, 6870346, 6177274, 5571240, 5042977, 4582539, 4180225, 3827418, 3516599, 3241280, 2996294, 2777718, 2582148, 2406319, 2247483, 2103654, 1973146, 1854255, 1745662, 1646751, 1557163, 1476229, 1403099, 1337144, 1277915, 1224906, 1177692, 1136184, 1100489, 1070723, 1047256, 1031020, 1023247, 1024892, 1036686, 1060052, 1097930, 1154311, 1231977, 1329228, 1437528, 1542032, 1625173, 1671553, 1671959, 1625503, 1539537, 1427182, 1303052, 1179152, 1063006, 958224, 866040, 786391, 718449, 661037, 612971, 573079, 539991, 512138, 488157, 467315, 449393, 434156, 421011, 409281, 398647, 389133, 380769, 373467, 367275, 362528, 359553, 358271, 358207]
56983C58207O84J255J763J828Q97j119l641n943p766r235j0338j0813j0505r596
56969B95678q393p159o014m800l128r14J218K596L462M807P089R692J1695J2591
56955C18420J2055R865O484L026j6l401p740j1957j4157j3891j2583j1666j1076
56942B63363r864p586m579j391J566M039O010P771R706J1935J4215J6136J7309
56929C28630J7354J5845J2481P498J765l831r014j3739j7331j8711j7769j5872
56917B87306j4479j3747j2914j1651j0277q974p568o040m655l580k778k219j838
56904A86586j439r99p84p86m27N69J459J431R22J026J849K568L082M310O590Q972
56888B14929J0653J2030J3644J4971J5080J3785J1375P875L481p53l673n279o375
$$ y = [358207, 358891, 360146, 361909, 363737, 364634, 363515, 359874, 353931, 346165, 336930, 326592, 315779, 305274, 295678, 287285, 280126, 274112, 269312, 266184, 265270, 266488, 269084, 272546, 277353, 284442, 294134, 305829, 318420, 330475, 340340, 346824, 349850, 349834, 346433, 338693, 326736, 312579, 298688, 286105, 274439, 263363, 253499, 245913, 241334, 239943, 241509, 245548, 251558, 259329, 269035, 280970, 295185, 311321, 328630, 345984, 361829, 374310, 381808, 383573, 379742, 370728, 356989, 339658, 320947, 303178, 287306, 272827, 259080, 246166, 234515, 224238, 215264, 207696, 201656, 197001, 193421, 190643, 188424, 186586, 185147, 184148, 183364, 182578, 182151, 182720, 184179, 185610, 186532, 187558, 189407, 191975, 195057, 199367, 205957, 214929, 225582, 237612, 251256, 266227, 281307, 295092, 306467, 314342, 317823, 317070, 313397, 308118, 301743]
56875C01743p219p300o452n239m104k723n01K772O820J1123J5114J8538K1721
56862C44293K5230K9193L3168L6506L8447L7886L3667K5490J4433K467q468j7051
56850E95261k2711k5492k5811k4224k1317j7526j2863p117n52N933J1768J7564
56838D72913K4324L1927L9165M5403N1248N7007O1115O0853N4365M1581K3741
56827I63642L028j7505l4795m7194n4697n7753n6565n1792m5034l7881l0766k3412
56815E09276j5882q546j332O025J3181J9539K5397L1605L7745M1707M1713L7788
56803G38216L0557J9602M536j2724k8275l9185m5252m7691m7165m3848l8602l3005
56791D57164k8129k3742j8869j3065p031j972J765N122R144J3638J7480J9934
$$ y = [301743, 294524, 287224, 280772, 275533, 271429, 268706, 268205, 270977, 277797, 288920, 304034, 322572, 344293, 369523, 398716, 431884, 468390, 506837, 544723, 578390, 603880, 618313, 620780, 612312, 595261, 572550, 547058, 521247, 497023, 475706, 458180, 445317, 438200, 437648, 443581, 455349, 472913, 497237, 529164, 568329, 613732, 664980, 721987, 783102, 843955, 898320, 939901, 963642, 966670, 949165, 914370, 867176, 812479, 754726, 698161, 646369, 601335, 563454, 532688, 509276, 493394, 484848, 483516, 489541, 502722, 522261, 547658, 579263, 617008, 658715, 700428, 738216, 768773, 788375, 792911, 780187, 751912, 712727, 667475, 619784, 572619, 528771, 490169, 457164, 429035, 405293, 386424, 373359, 366328, 364356, 366121, 371243, 380387, 394025, 411505, 431439]
56779D31439K0916J9989J6187R315O74p969j5661k2054k6670k9145k9831k9355
56767C37835k7810k5081k1733j8836j6766j4894j2617j0187q286p222o742o363
56755A61298n712m804m078l878l851l322k308j714k133k905k898j983j138j081
56741A19493j430j469j248j376k006k519k361j685r95m91o3L26N78O88P65Q41
56725A07048Q77Q78Q37O87M95N72J069J631J774J495J120P51L23R5M18R94J029
56708A22093L09n07q58r17r47p13o1N19N67M11N98Q80N68k80q26n97k1K99L17
56689A20834L48N36P34O95L09j73k38L11R93J151P46K64jj70k73p1N14J092J141
56670A28742M62o12j334j015J92J168R72j0n71l15j1k34m92j97J93k62j661l135
$$ y = [431439, 452355, 472344, 488531, 497846, 498520, 490551, 474890, 452836, 426166, 397021, 367190, 337835, 310025, 284944, 263211, 244375, 227609, 212715, 200098, 189911, 181625, 174403, 167661, 161298, 155586, 150782, 146704, 142826, 138975, 135653, 133345, 131631, 129498, 126593, 123695, 121712, 120574, 119493, 118063, 116594, 115346, 113970, 111964, 109445, 107084, 105399, 104404, 103913, 103850, 104176, 104754, 105442, 106207, 107048, 107925, 108803, 109640, 110327, 110822, 111394, 112463, 114094, 115868, 117363, 118483, 119234, 119557, 119652, 120070, 121064, 122093, 122402, 121895, 121037, 120120, 119173, 118460, 118399, 118918, 119485, 119896, 120494, 121374, 121942, 121662, 120836, 120239, 120218, 120517, 120834, 121182, 121718, 122452, 123147, 123456, 123283, 123045, 123356, 124349, 125500, 126246, 126510, 126509, 126339, 126066, 125995, 126509, 127601, 128742, 129204, 128592, 127258, 126243, 126435, 127603, 128575, 128565, 127994, 127679, 127668, 127434, 126942, 126745, 126938, 126676, 125015, 121880]
56652A21880l974m187m000l391k453j725j779k542l311l454k928k097j274n99
56638H4166j93r4Q9R85K670M245M641L794K698K326K791L601M234M361L908L126
56622A27348K421J922J488J161J251J706J900J436Q47Q78J328J212J92q75j102
56607A43113p26o24r76j121o82j37n0j62J37P19P04l52j718k245j613n17K31M70
56589A34451N25O39P48P61Q14J077J322R78j19j176j127P2J282J518J041P71J040
56572A44617J422J575J561J461J229J039J229J745K103K101K198K951M380O086
56558A75697P682Q859R331Q999Q051O714N102L411K073J444J459J773K089K232
56544B44916K025J378M19n87j374j794j926k141k797l701m186l872l196k881l070
$$ y = [121880, 117906, 113719, 109719, 106328, 103875, 102150, 100371, 97829, 94518, 91064, 88136, 86039, 84765, 84166, 83973, 83879, 83968, 84953, 87623, 91868, 96509, 100303, 103001, 105327, 108118, 111719, 115953, 120314, 124222, 127348, 129769, 131691, 133179, 134340, 135591, 137297, 139197, 140633, 141480, 142358, 143686, 144898, 145090, 144215, 143113, 142387, 141763, 140787, 139666, 138984, 138847, 138797, 138635, 138772, 139491, 140195, 139843, 138125, 135880, 134267, 133750, 133981, 134451, 134976, 135615, 136363, 137124, 137938, 139015, 140337, 141315, 141196, 140020, 138893, 138965, 140247, 141765, 142806, 143577, 144617, 146039, 147614, 149175, 150636, 151865, 152904, 154133, 155878, 157981, 160082, 162280, 165231, 169611, 175697, 183379, 192238, 201569, 210568, 218619, 225333, 230435, 233846, 235919, 237363, 238822, 240595, 242684, 244916, 246941, 248319, 248738, 248151, 246777, 244983, 243057, 240916, 238119, 234418, 230232, 226360, 223164, 220283, 217213]
56529B17213l315l304l256l502l873l757k727j130O6J70n35j126j121r45j210
56514A87648j901k460k494k020j252m24J40K12r0m06n25m61k22J93N26L64k99
56497A76529q97q92m14j3O6R3L78Q54J274J519J556J188J81j267k420k540j586
56480A73609k56O28P83N22K70R9j88n83o94j68P81J565J919K110K403K581K325
56463A87706J780J429J447J530J349Q95L63o9k44m9L95P88R03P14K89k69o83n31
56445A97743L86J682K535K272J014k50n09K58J064J087N87L15L96L50Q5J08N39
56428B09662O39k09j498k070j471l51M14N39K96L3o8M0K69L92K12j56l00L7N92
56409B07002R06R39J046J247J072L42m06o52o91j047j555j718j641j766j845j220
$$ y = [217213, 213898, 210594, 207338, 203836, 199963, 196206, 193479, 192349, 192415, 192585, 192050, 190924, 189803, 188858, 187648, 185747, 183287, 180793, 178773, 177521, 177097, 177237, 177449, 177359, 176953, 176428, 175967, 175745, 175938, 176464, 176828, 176529, 175632, 174740, 174326, 174313, 174379, 174472, 174850, 175704, 176978, 178497, 180053, 181241, 181422, 180155, 177735, 175195, 173609, 173353, 173981, 174764, 175286, 175556, 175655, 175467, 174884, 174190, 174022, 174803, 176368, 178287, 180397, 182800, 185381, 187706, 189486, 190915, 192362, 193892, 195241, 196136, 196499, 196430, 196186, 196137, 196532, 197320, 198223, 198937, 199226, 198957, 198274, 197743, 198129, 199811, 202346, 204618, 205632, 205382, 204873, 205131, 206195, 207282, 207869, 208184, 208580, 208930, 209015, 209123, 209662, 210301, 210092, 208594, 206524, 205053, 204702, 205116, 205655, 205951, 205984, 205916, 205956, 206225, 206617, 206829, 206673, 206373, 206410, 207002, 207908, 208847, 209893, 211140, 212212, 212554, 212148, 211496, 210805, 209758, 208203, 206485, 204844, 203078, 201233, 200013]
56393B00013j51K36l79r63o52J16O69J274K422L684M370M813N932P705R088R394
56377B47571Q897Q073P054N946M937L848K231J90j382j773j261p24o95j025j329
56362B80558j475j616j818j843j420p85n39q20j043p38l12m44j063j413j032j61
56346B64036O92J161J051M11l71q91j098j101q17j80N39J010J265J433J371J012
56330B69523Q04J151J668J746J561J802K474K930K991L066L142K655J720J351
56316B98584K004K774K593J595O52K56M02R81J566J405L44o59o12K70J071J509
56300C14735J951K436K561K310K144K173J942J215M34J58M41R68J420J552J268
56285C37708P41L20J67K85P38J562K440K928L134L674M716N502N243M182L289
$$ y = [200013, 199862, 200098, 199719, 198756, 198104, 198220, 198889, 200163, 202585, 206269, 210639, 215452, 221384, 229089, 238177, 247571, 256468, 264541, 271595, 277541, 282478, 286326, 288557, 288747, 287365, 285592, 284331, 283607, 282912, 281887, 280558, 279083, 277467, 275649, 273806, 272386, 271601, 271062, 270242, 269199, 268461, 268149, 267705, 266642, 265229, 264197, 264036, 264728, 265889, 266940, 267351, 266980, 266089, 264991, 263890, 263073, 262893, 263432, 264442, 265707, 267140, 268511, 269523, 270327, 271478, 273146, 274892, 276453, 278255, 280729, 283659, 286650, 289716, 292858, 295513, 297233, 298584, 300588, 303362, 305955, 307550, 308202, 308458, 308860, 309841, 311407, 312812, 313156, 312497, 311885, 312155, 313226, 314735, 316686, 319122, 321683, 323993, 326137, 328310, 330252, 331467, 331901, 332059, 332500, 333468, 334888, 336440, 337708, 338449, 338769, 338936, 339221, 339959, 341521, 343961, 346889, 350023, 353697, 358413, 363915, 369158, 373340, 376629]
56270C76629L020K949K743K904M081N908P096O864N838N288N694O444O817O896
56256D49171P347Q527J0110J1578J2885J4412J6282J8000J9126K0136K2047K5049
56244F34670K8083L0116L1357L2631L4002L4771L4686L4248L3675L2297K9348
56233I89884K4868J9508J3927Q612L877l86m693r397j4263j8668k1988k3820k4270
56220I43191k4086k4034k4041k3438k2163k1035k0622k0488j9966j9048j7993
56209G06277j6703j5102j3663j2793j2075j0837r243q061p466o850n809m653l804
56196E79218l241k734k249j909j731j481q01L88J526J848J362R69J214J458Q84
56181E74721j56n62K1R61J733K322K667K532K156K153K575K885K989L437M286
$$ y = [376629, 379649, 382598, 385341, 388245, 392326, 398234, 405330, 412194, 418032, 423320, 429014, 435458, 442275, 449171, 456518, 465045, 475155, 486733, 499618, 514030, 530312, 548312, 567438, 587574, 609621, 634670, 662753, 692869, 724226, 756857, 790859, 825630, 860316, 894564, 928239, 960536, 989884, 1014752, 1034260, 1048187, 1056799, 1060676, 1060290, 1055597, 1046200, 1031937, 1013269, 991281, 967461, 943191, 919105, 895071, 871030, 847592, 825429, 804394, 783772, 763284, 743318, 724270, 706277, 689574, 674472, 660809, 648016, 635941, 625104, 615861, 607800, 600334, 593484, 587675, 583022, 579218, 575977, 573243, 570994, 569085, 567354, 565873, 565072, 565460, 566986, 568834, 570196, 571165, 572379, 573837, 574721, 574565, 574003, 574024, 574985, 576718, 579040, 581707, 584239, 586395, 588548, 591123, 594008, 596997, 600434, 604720]
56166F04720M707M302L980M676N904O536O550O999Q272R488R778R417R284R821
56152G04434J0894J2225J3544J4605J5485J6669J8432K0368K1970K3557K6151
56141H98334L0308L5672M1748M8611N6433O4916P3786Q3536R4766J06646J16785
56130A651541J22824J23778J19708J10938R8355Q4008P0595O0063N2843M8044
56120B542697M3921L8366K9856J8421N692o211j5823k2759k7563l1427l5958m2822
56108B496390n3168o6932q2385r6599j06782j11429j10473j04711r5300q3645
56098A584966p1325n9734m9604m0794l2693k5108j8598j3761j0301p306m306j557
56086A249879O76K506L969M856N268N732O493P182P509P690P864P811P736Q536
$$ y = [604720, 609427, 613729, 617709, 622385, 628289, 634825, 641375, 648374, 656646, 666134, 675912, 685329, 694613, 704434, 715328, 727553, 741097, 755702, 771187, 787856, 806288, 826656, 848626, 872183, 898334, 928642, 964314, 1006062, 1054673, 1111106, 1176022, 1249808, 1333344, 1428110, 1534756, 1651541, 1774365, 1898143, 2017851, 2128789, 2227144, 2311152, 2381747, 2441810, 2494653, 2542697, 2586618, 2624984, 2654840, 2673261, 2678953, 2672742, 2656919, 2634160, 2606597, 2575170, 2539212, 2496390, 2443222, 2376290, 2293905, 2197306, 2090524, 1979095, 1868622, 1763911, 1668611, 1584966, 1513641, 1453907, 1404303, 1363509, 1330816, 1305708, 1287110, 1273349, 1263048, 1255742, 1251436, 1249879, 1250555, 1253061, 1257030, 1261886, 1267154, 1272886, 1279379, 1286561, 1294070, 1301760, 1309624, 1317435, 1325171, 1333707]
56072A333707J0604J2913J4136J4259J4410J5381J7011J8746K0078K0683K0745
56061A512673K0968K1774K2812K3701K4688K6003K7158K7684K8009K8677K9264
56050A793411K9120K8640K8666K9017K8894K8466K8687K9658L0498L0971L1898
56039B117926L3708L5848L7849L9846M1747M3056M3935M5274M7256M8968N0023
56028B585436N1485N4379N8107O1180O3004O4203O5584O7343O9159P0736P2332
56017C282948P4657P7955Q1479Q4432Q7201R0873R5768J01273J06903J12555J17947
56006D313991J22910J28105J34317J41133J47569J53782J60844J68917J77239
55997E648807J85968J96265K08284K20734K32925K45653K59667K74736K90763
$$ y = [1333707, 1344311, 1357224, 1371360, 1385619, 1400029, 1415410, 1432421, 1451167, 1471245, 1491928, 1512673, 1533641, 1555415, 1578227, 1601928, 1626616, 1652619, 1679777, 1707461, 1735470, 1764147, 1793411, 1822531, 1851171, 1879837, 1908854, 1937748, 1966214, 1994901, 2024559, 2055057, 2086028, 2117926, 2151634, 2187482, 2225331, 2265177, 2306924, 2349980, 2393915, 2439189, 2486445, 2535413, 2585436, 2636921, 2691300, 2749407, 2810587, 2873591, 2937794, 3003378, 3070721, 3139880, 3210616, 3282948, 3357605, 3435560, 3517039, 3601471, 3688672, 3779545, 3875313, 3976586, 4083489, 4196044, 4313991, 4436901, 4565006, 4699323, 4840456, 4988025, 5141807, 5302651, 5471568, 5648807, 5834775, 6031040, 6239324, 6460058, 6692983, 6938636, 7198303, 7473039, 7763802]
55988G763802L08238L27115L46815L67767L91387M18158M47473M79686N16260
55979A1366701N57435O01969O50033P04077P65928Q35308R12313R99100J097941
55970A8490805J210029J337537J484709J655574J853052K081720K349203K663896
55962C3126525L034584L474103M000909M636022N402051O326468P441375Q778105
55954G6220142J0366425J2239552J4430759J6956250J9796245K2872130K5993570
55947A98875073K8778485L0614799L0741121K8445873K3312369J5433420N527950
55940C61729090n129592j5024549k2867288k7964876l0301002l0343837k8765380
55933B01332566k6227564k3268973k0263741j7431366j4879220j2647211j0734532
$$ y = [7763802, 8072040, 8399155, 8745970, 9113737, 9505124, 9923282, 10370755, 10850441, 11366701, 11924136, 12526105, 13176138, 13880215, 14646143, 15481451, 16393764, 17392864, 18490805, 19700834, 21038371, 22523080, 24178654, 26031706, 28113426, 30462629, 33126525, 36161109, 39635212, 43636121, 48272143, 53674194, 60000662, 67442037, 76220142, 86586567, 98826119, 113256878, 130213128, 150009373, 172881503, 198875073, 227653558, 258268357, 289009478, 317455351, 340767720, 356201140, 361729090, 356599498, 341574949, 318707661, 290742785, 260441783, 230097946, 201332566, 175105002, 151836029, 131572288, 114140922, 99261702, 86614491, 75879959]
55926G5879959r115230p753598o614934n666222m874448m210093l650711l178780
55918C0815943k778534k437170k146232j898880j687230j504010j344798j206632
55910A5812457j086147r80429q87806q06238p32745o65870o06736n56055n11763
55901H978668m71269m34335m01892l73471l47598l23698l01873k81642k62292
55892E780598k43765k26078k08651j91176j74174j57792j41101j23545j05874
55883D208442q8504p0186m9652k7634n976J4130L1544M3619M7009L9719K1380
55872D163891p557m4978q5804j23406j53040j73393j85113j89107j86401j78469
55862B836623j66917j53106j38267j23694j10569r9568r0507q2489p4754o7402
$$ y = [75879959, 66764729, 59011131, 52396197, 46729975, 41855527, 37645434, 33994723, 30815943, 28037409, 25600239, 23454007, 21555127, 19867897, 18363887, 17019089, 15812457, 14726310, 13745881, 12858075, 12051837, 11319092, 10653222, 10046486, 9490431, 8978668, 8507399, 8073064, 7671172, 7297701, 6950103, 6626405, 6324532, 6042890, 5780598, 5536833, 5310755, 5102104, 4910928, 4736754, 4578962, 4437861, 4314316, 4208442, 4119938, 4049752, 4000100, 3972466, 3966490, 3980620, 4012164, 4055783, 4102792, 4142511, 4163891, 4156334, 4111356, 4025552, 3902146, 3749106, 3575713, 3390600, 3201493, 3015092, 2836623, 2669706, 2516600, 2378333, 2254639, 2144070, 2044502, 1953995, 1871506, 1796752, 1729350]
55852A729350o0859n4911m9120m4098m1123m0174l9524l7890l5837l4389l3352
55841A258073l2034l0583k9467k8324k6557k4491k2832k1518k0143j9057j8851
55830I84216j9085j8713j7579j6429j5629j4901j4222j3868j3592j2864j2032
55819H15302j2192j3590j5097j5591j5140j4443j3816j3141j2313j1306j0061
55808F68612q633p253o089n134m374l811l338k763k018j192m99k60n53p86o5J578
55792F23422K891K862K075J849K414K819K494J932J646J230q9k470n410q449j1522
55777F17694j4658j7445j8935j8419j6291j3739j1303q312m195K34L506N043N096
55764E08276L505k19n415j0040j2471j2921j2591j2015j0881r105p429o796p417
$$ y = [1729350, 1668491, 1613580, 1564460, 1520362, 1479239, 1439065, 1399541, 1361651, 1325814, 1291425, 1258073, 1226039, 1195456, 1165989, 1137665, 1111108, 1086617, 1063785, 1042267, 1022124, 1003067, 984216, 965131, 946418, 928839, 912410, 896781, 881880, 867658, 853790, 840198, 827334, 815302, 803110, 789520, 774423, 758832, 743692, 729249, 715433, 702292, 689979, 678673, 668612, 659979, 652726, 646637, 641503, 637129, 633318, 629980, 627217, 625199, 624007, 623508, 623248, 622695, 621909, 621844, 623422, 626313, 629175, 631250, 633099, 635513, 638332, 640826, 642758, 644404, 645634, 645545, 643075, 637665, 629216, 617694, 603036, 585591, 566656, 548237, 531946, 518207, 506904, 498592, 494397, 494631, 498137, 503180, 508276, 511781, 511562, 506147, 496107, 483636, 470715, 458124, 446109, 435228, 426123, 418694, 411898, 404481]
55751D04481q570r302r332r156r245r462r445r221q957q430p321n894m749l939
55737B91458k973j794j088j359k176k660k405j778j512k110l362m409m573m139
55723B55120l913m129m260l968l624l690m001l996l324k094p84N4K88M77J298
55708B19454K631L630L735L178K402J573Q35M42L03j96j504l336n078o433p365
55693B14271p738p467o757n909m998m090l427l142k890k219j235n22l55l02K39
55678A63459J259K071K111J616J270J185O62p59k422l276l156k768k585k490k468
55663A53709k726k980k508j296l02q1O1Q91J994K532K591K808L071K730J928J611
55647A64033K089K582K447J989J745J675J537J419J416J251O59k45j324k740m477
$$ y = [404481, 395911, 386609, 377277, 368121, 358876, 349414, 339969, 330748, 321791, 313361, 306040, 300146, 295397, 291458, 288485, 286691, 285603, 284244, 282068, 279408, 277003, 275225, 273713, 271603, 268241, 263832, 259259, 255120, 251207, 247078, 242818, 238850, 235226, 231536, 227535, 223539, 220215, 218121, 217337, 217391, 217679, 218156, 219454, 222085, 225715, 229450, 232628, 235030, 236603, 237438, 237880, 238183, 237987, 236483, 233147, 228069, 221636, 214271, 206533, 199066, 192309, 186400, 181402, 177312, 173885, 170743, 167853, 165634, 164399, 163877, 163522, 163220, 163459, 164718, 166789, 168900, 170516, 171786, 172971, 173633, 172874, 170452, 167176, 164020, 161252, 158667, 156177, 153709, 150983, 148003, 145495, 144199, 143897, 143816, 143877, 144768, 146762, 149294, 151885, 154693, 157764, 160494, 162422, 164033, 166122, 168704, 171151, 173140, 174885, 176560, 178097, 179516, 180932, 182183, 182842, 182597, 181273, 178533, 174056]
55632A74056n953o580o461o035n366m366l422l072l146k907k170j596j639j864
55618A19479j683j224r56r09q65r70j431j763j174J51Q92J46j460k586k731k426
55602A00490k181j952j558j115q33p66r06j238j578j572j062l11K24K94J9k02
55586H5753OO33J151R44Jr14q99K87J983L127L154K528K354L199M504N326N505
55569A18642N672O226O838P078O924O339M945K622N3j951l482n189p006p958p583
55554A32170o792o758p353p410o420n181m581m449m065l350k797k515k045j203
55540F7251m58k05k50l41o69j393k067k157j818j588j502j160o31n40j078j548
55524D9846j228l26L21J74n54j182j114l41M77O06N5n11n88j94O25K074M003N591
$$ y = [174056, 168103, 161523, 155062, 149027, 143661, 139295, 135873, 132801, 129655, 126748, 124578, 122982, 121343, 119479, 117796, 116572, 115616, 114707, 113842, 112872, 111441, 109678, 108504, 108655, 109547, 109693, 108233, 105647, 102916, 100490, 98309, 96357, 94799, 93684, 92851, 92085, 91179, 89941, 88363, 86791, 85729, 85418, 85642, 85936, 85955, 85753, 85759, 86392, 87543, 88487, 88488, 87574, 86675, 86962, 88945, 92072, 95226, 97754, 100108, 103307, 107811, 113137, 118642, 124314, 130540, 137378, 144456, 151380, 157719, 162664, 165286, 165339, 163388, 159906, 154717, 147711, 139753, 132170, 125378, 118620, 111267, 103857, 97437, 92256, 87675, 83226, 79161, 75811, 73014, 70499, 68454, 67251, 66793, 66588, 66338, 65997, 65328, 63935, 61868, 59711, 57893, 56305, 54803, 53643, 53012, 52472, 51394, 49846, 48618, 48292, 48613, 48787, 48233, 47051, 45937, 45596, 46073, 46679, 46734, 46223, 45635, 45441, 46066, 48140, 52143, 57734]
55506E7734O135N928N763N761N211L650J599K4o36p11q18j245j771j985j777j528
55490H1334j700k275k698k458j626p72l61l23l14k88m85q58q68j97O52Q80M53
55473F8096N7N6J02j04k52K1M78O51N10L21J47n3k8M89J124J044m5j431k106j755
55453F7322r21l84m65q34r05m34K28N56M10J31P0J24j37q46j428j106P4J033P78
55434F3266l64j128p97J94J105J681J883J545P74J78J91N37P74R76J307J374P38
55417G4234j76m51J18Q94J446J932K414K534K116J453P08l98j887l090l393l046
55401G5408k751k676k455j941j381q59j30P94J302Q60j78q68p88n00o87j152j134
55384F0864m95Qk27p63p41k3P68J107R32K91p07j522j422m03N62O04Rk39K29P47
$$ y = [57734, 63869, 69797, 75560, 81321, 86532, 90182, 91781, 91805, 91169, 90458, 89640, 88395, 86624, 84639, 82862, 81334, 79634, 77359, 74661, 72203, 70577, 69805, 69444, 69121, 68807, 68519, 68034, 67176, 66308, 66111, 66763, 67643, 68096, 68153, 68209, 68311, 68207, 67955, 67976, 68454, 69105, 69615, 69936, 70083, 70030, 70002, 70491, 71615, 72659, 72614, 71183, 69077, 67322, 66401, 66017, 65552, 64718, 63813, 63379, 63607, 64163, 64573, 64704, 64774, 64898, 64761, 63915, 62487, 61381, 61455, 62488, 63266, 62902, 61774, 60977, 61171, 62276, 63957, 65840, 67385, 68159, 68337, 68528, 69065, 69839, 70815, 72122, 73496, 74234, 74058, 73607, 73725, 74619, 76065, 77997, 80411, 82945, 85061, 86514, 87222, 86824, 84937, 81847, 78454, 75408, 72657, 69981, 67526, 65585, 64204, 63345, 63215, 64009, 65311, 66171, 65993, 65125, 64337, 63837, 63150, 61998, 60864, 60369, 60377, 60150, 59387, 58646, 58623, 59391, 60498, 61430, 61721, 61014, 59492, 58070, 57667, 58229, 58833, 58842, 58603, 58832, 59579]
55364E9579N74j54o85o62m93o42q72o01J33N63K38l05l03K28O85Q28Q73Q71O43
55345F0498L95N61R21N38r30k493k856j828k71J012J732J817J302N29p2m77r13
55328E9465j250j039k97K40J8n60o31K0P73J062R88R41R54Q41P16Q98J297J368
55310F5804Q90L22R1o1n55j101j003k99J63r4n76o26l40k12l60n25n62m81k75
55291F0200p3k14o86q54k25P05J045P08L83L86L81K48L61P10O26n9m01L70J552
55272F5163J841J115L70M3m35j330j887j448m38L37P44J031J035N05j34j87K37
55255F6562L39j47n67l73J32L98M07N05Q19J152J225P88k24j358j875j539r41
55238F5303p37q78q85o50m78n16m94r0O50J249J159L18n86p68k67J56J67K97R36
$$ y = [59579, 60153, 59999, 59314, 58652, 58159, 57517, 56645, 56044, 56177, 56740, 56978, 56673, 56370, 56598, 57283, 58111, 58984, 59855, 60498, 60893, 61454, 62375, 62913, 61983, 59490, 56634, 54806, 54535, 55547, 57279, 59096, 60398, 60927, 60855, 60378, 59465, 58215, 57176, 56879, 57119, 57137, 56577, 55946, 55966, 56739, 57801, 58789, 59730, 60684, 61525, 62241, 63139, 64436, 65804, 66694, 67016, 67107, 67046, 66491, 65390, 64387, 64088, 64251, 64157, 63581, 62955, 62615, 62403, 62043, 61518, 60956, 60475, 60200, 60127, 59913, 59227, 58373, 58148, 58853, 59898, 60606, 60989, 61375, 61756, 62004, 62365, 63075, 63701, 63642, 63241, 63611, 65163, 67004, 68119, 68489, 68532, 68097, 66767, 64880, 63432, 62994, 63331, 64075, 65106, 66141, 66646, 66512, 66325, 66562, 66901, 66754, 66187, 65814, 65946, 66344, 66751, 67256, 68075, 69227, 70452, 71240, 71016, 69658, 67783, 66244, 65303, 64566, 63688, 62803, 62153, 61675, 61159, 60665, 60575, 61225, 62474, 63633, 63951, 63365, 62597, 62330, 62486, 62653, 62950, 63886]
55219F3886J569J531J000N45J61m78j124j240r41p67o13J12J203J611R48J07n2
55202F7458K08K30N0P9K76L20L03N30Q69P77n0j315k280k229j163m3J45k65M4
55183F3944J389K334J622N1n86P5P13L75l84n59J0P73J188J015L72k57m08k04
55165G1463j16j61R9P15J061P12M6l61n08o77p70m10L68R90R20J79p18j207j100
55146G0525o12k0O01J137J148L04r53j648j398p58k61L18J270K040J714L15j097
55129G2625j690j590j267p38J86J226J743J453P29K03K52P64J254J172L99n65
55113G6156j084j057q71o98k45O11J274J064K29k12K29Q30O46k08p14k74O04J047
55095G7327Q95O95Q26R91P01j6o24p89p51q30q53m05M57J150J254Q94L12m38j149
$$ y = [63886, 65455, 66986, 67986, 68531, 68692, 68214, 67090, 65850, 64909, 64142, 63529, 63641, 64844, 66455, 67403, 67510, 67458, 67666, 67896, 67946, 68025, 68301, 68621, 68924, 69454, 70323, 71100, 71050, 69735, 67455, 65226, 64063, 64020, 64165, 63900, 63944, 65333, 67667, 69289, 69340, 68754, 68829, 69542, 69917, 69533, 68974, 68984, 69757, 70945, 71960, 72332, 72075, 71667, 71463, 71347, 71186, 71285, 72000, 73061, 73773, 73819, 73458, 72950, 72273, 71503, 71093, 71461, 72451, 73371, 73550, 72832, 71625, 70525, 69913, 69893, 70494, 71631, 72779, 73083, 72130, 70482, 69084, 68326, 68065, 68383, 69653, 71693, 73407, 73722, 72625, 70935, 69345, 68078, 67340, 67526, 68752, 70495, 71948, 72677, 72880, 73132, 73896, 75150, 76322, 76721, 76156, 75072, 74015, 73144, 72446, 72201, 72812, 74086, 75150, 75379, 75167, 75396, 76226, 76872, 76664, 75950, 75676, 76280, 77327, 78222, 78917, 79743, 80734, 81435, 81419, 80795, 80006, 79255, 78425, 77572, 77167, 77624, 78774, 80028, 80922, 81234, 80796, 79647]
55076G9647j252m33P21J266R62M01J18O7J9n3j87n77j224j710j614j068n61m00
55058G4122m82n67m79j39L83Q15Q42M18j03k08K79R16R83K68n28n11K84Q46M87
55039G7626k86n12j10J86Q8K09R53J595J075m87j801j916j164m73k12r8J40M84
55021G5297Q22R76O47j90r23q53k16k2o62j231p37N41J472J578J345J196R34M25
55003H0399Q8J99K62l79j447j865j000O01J861K208J842J185L98m89j212j296
54987H1355n67M71J039Q84M99M20N54M09q3l46J64J258K159K308J803J144O76
54970I4147M09J85j50o62j239j515j170l39L91N95L85N3m05j036j426j011N4Q75
54952H8141R29P09Q92J275J181O14L03M99N19j93j175j574j306r63p94m94J0J83
$$ y = [79647, 78395, 77962, 78683, 79949, 80911, 81312, 81430, 81497, 81516, 81463, 81276, 80699, 79475, 77765, 76151, 75083, 74522, 74122, 73640, 73073, 72594, 72455, 72838, 73653, 74495, 74913, 74810, 74602, 74881, 75797, 76780, 77048, 76520, 76009, 76293, 77139, 77626, 77340, 76828, 76718, 76904, 76992, 77201, 78154, 79749, 80824, 80337, 78536, 76620, 75456, 74983, 74771, 74673, 74813, 75297, 76119, 77095, 77742, 77552, 76629, 75776, 75560, 75538, 74876, 73645, 72908, 73449, 74921, 76499, 77844, 79040, 79974, 80399, 80487, 80686, 80948, 80569, 79122, 77257, 76257, 76858, 78719, 80927, 82769, 83954, 84352, 83863, 82651, 81355, 80788, 81259, 82298, 83182, 83681, 84101, 84655, 85064, 84981, 84635, 84799, 86057, 88216, 90524, 92327, 93471, 94147, 94556, 94741, 94591, 93929, 92690, 91175, 90005, 89666, 90057, 90652, 91037, 91090, 90685, 89649, 88223, 87212, 87266, 88141, 89070, 89779, 90671, 91946, 93127, 93741, 94044, 94543, 95062, 94869, 93694, 92120, 90814, 89851, 89057, 88563, 88573, 88756]
54934H8756k77p71m18Q04J931K065J277M35K80P92J351J463J301J450K185L123
54918A05747L672L675L590M019N114O347O936O682O256O335O506N605L304O74
54904A74462j183k478m077n961p247p528p291o926o138m646k867j561j147j507
54890A13905k112k231j558o48k91m56m41n3K38L11O61J282J450J084J235K426
54874A14802L617L866M042N436P418Q075O967N577M998M694L875K635J158r59
54860A76201l734o084p010o836o592o623o533o047n293m487l853l580l497l073
54846A02959k131j180p72q82j258j777k112j650l70P43Q56M03K99M62N2r73j567
54829I1102j030O7O91N28L9j85J32Q69J540J634J049J12q13j545j956j980j816
$$ y = [88756, 88479, 87708, 87290, 88094, 90025, 92090, 93367, 93802, 94082, 94874, 96225, 97688, 98989, 100439, 102624, 105747, 109419, 113094, 116684, 120703, 125817, 132164, 139100, 145782, 152038, 158373, 164879, 170484, 173788, 174462, 173279, 170801, 166724, 160763, 153516, 145988, 138697, 131771, 125633, 120987, 118120, 116559, 115412, 113905, 111793, 109562, 108004, 107356, 107065, 106609, 106168, 106115, 106353, 106664, 107325, 108607, 110057, 111141, 112376, 114802, 118419, 122285, 126327, 131763, 139181, 147256, 154223, 159800, 164798, 169492, 173367, 176002, 177160, 176201, 172467, 166383, 159373, 152537, 145945, 139322, 132789, 126742, 121449, 116962, 113109, 109529, 106032, 102959, 100828, 99648, 98876, 97994, 96736, 94959, 92847, 91197, 90827, 91570, 92426, 92829, 93128, 93590, 93642, 92669, 91102, 90072, 90139, 90830, 91358, 91397, 91212, 91344, 92213, 93753, 95387, 96436, 96548, 95735, 94190, 92234, 90254, 88438]
54812H8438j815j992j905j177j7R12J124P54M64P95J577K116J962J370P96K99
54796I3701k57o72n95k02r7m67p63m53K49P20O95L97P9k29m76m14J55J092J939
54777I4402K293K056J408P05M17R43K149L229L404K810K346K590L253L876M553
54762A30434N552O616P170P091O782O550O391O206N793M683K522l22k986n036
54748A87446o652p859q216p574o532n688m838l492j941j148j542k450k879k524
54734A24111j881j535j604j698j335l79P91J581J710J430J244J415J797K093K186
54719A29926K152K133K274K766L675M748N532N784N567M862L448J363p95k396
54705A71039l475m485n472n971n758n208m717m270l753l346l166k897k220j448
$$ y = [88438, 86623, 84631, 82726, 81549, 81532, 82444, 83568, 84322, 84786, 85581, 87158, 89274, 91236, 92606, 93402, 93701, 93444, 92772, 92177, 91975, 91878, 91411, 90648, 90195, 90444, 91164, 91859, 92256, 92335, 92106, 91630, 91216, 91371, 92463, 94402, 96695, 98751, 100159, 100864, 101281, 102224, 104373, 107602, 111006, 113816, 116162, 118752, 122005, 125881, 130434, 135986, 142602, 149772, 156863, 163645, 170195, 176586, 182792, 188585, 193268, 195790, 195468, 192482, 187446, 180794, 172935, 164719, 157145, 150613, 144925, 140087, 136595, 134654, 133506, 131964, 129514, 126635, 124111, 122230, 120695, 119091, 117393, 116058, 115679, 116470, 118051, 119761, 121191, 122435, 123850, 125647, 127740, 129926, 132078, 134211, 136485, 139251, 142926, 147674, 153206, 158990, 164557, 169419, 172867, 174230, 173435, 171039, 167564, 163079, 157607, 151636, 145878, 140670, 135953, 131683, 127930, 124584, 121418, 118521, 116301, 114853]
54691A14853j219j584j868j551r38o75q36q75m35R7J6q04j735k084j785j184m42
54674I6951N37J516J849J250L29j13j08l26q86j007k06P16N15q80k208k417j769
54657I3743j154q40m40K01P04Q22Q42J041J143O31n19j689k156j634m39P66J446
54640I2468J624J730J933J845J099K3o34n48p1L54O46Q87J041J070J009P50Jj221
54622A04006k264k375j564o05j49j22j07J9O7K0J53O27J216J530J369P79n8q37
54604A01705j177r13l11J91L97M24L68K41K00M78R44J019L59n69q90k85O74J182
54586A04037R98N69M82Q82J348J287M34r46k269k889k434j124K23Q36O81L22J14
54569A02551l8j51L2M46N48J43j20L01Q76P61J66O9O18Q59K27n79o76j89J78J76
$$ y = [114853, 113634, 112050, 110182, 108631, 107693, 107018, 106182, 105307, 104872, 104969, 104985, 104181, 102446, 100362, 98577, 97393, 96951, 97488, 99004, 100853, 102103, 102432, 102319, 102211, 101885, 100999, 99992, 99786, 100502, 101017, 100137, 97929, 95512, 93743, 92589, 91749, 91309, 91510, 92214, 93036, 93878, 94919, 96062, 96693, 96174, 94485, 92329, 90695, 90256, 91022, 92468, 94092, 95822, 97755, 99600, 100699, 100722, 100088, 99540, 99469, 99823, 100469, 101356, 102397, 103467, 104476, 105226, 105227, 104006, 101742, 99367, 97803, 97198, 97049, 96927, 96820, 96839, 96906, 96926, 97079, 97706, 98922, 100452, 101821, 102600, 102542, 101705, 100528, 99615, 99304, 99495, 99892, 100316, 100684, 100925, 101125, 101603, 102547, 103566, 103925, 103356, 102466, 102181, 102855, 104037, 105035, 105604, 106086, 106968, 108316, 109603, 110037, 109091, 106822, 103933, 101499, 100375, 100598, 101434, 102115, 102437, 102551, 102513, 102362, 102394, 102840, 103388, 103531, 103411, 103712, 104588, 105349, 105515, 105584, 106202, 107061, 107288, 106709, 106033, 105844, 106022, 106198]
54549A06198M3j56m36m97L2R19J464J321Q13L95K47M20J017J986K910L189K524
54532A22389J306N10Q80K051K723K056O98n3J18L05j87q93j004n28j16j8O0K06
54514A30503K3o72j419j628j238n48K26Q71R59K83o25r81q01r11j681k351k036
54497A17974r38J0M38P95J315J482Q23j76m74K82J329J672J227Q24J096J704J835
54480A31218J345R11J043J435J516J227Q44M59J37K92J198K247K401J467K92l91
54464A47641p15j015j080n19N15J439J898J972J873J711J435Q77N2n58l50N68
54448A55744J226Q14l96j371j439q07j82j52q25j814k559k753k442j824j161p83
54432A39276q18r56q75p95j098j443j008K24J201J200O76L35J21j80j66M59J015
$$ y = [106198, 106241, 106085, 105649, 105152, 105184, 106103, 107567, 108888, 109701, 110096, 110343, 110763, 111780, 113766, 116676, 119865, 122389, 123695, 124205, 125085, 127136, 129859, 131915, 132613, 132560, 132678, 132983, 132796, 131903, 130899, 130371, 130255, 130237, 130297, 130503, 130526, 129854, 128435, 126807, 125569, 125021, 125247, 126118, 127077, 127360, 126735, 125754, 124953, 124042, 122361, 120010, 117974, 117036, 117046, 117484, 118279, 119594, 121076, 121899, 121723, 121249, 121531, 122860, 124532, 125759, 126583, 127679, 129383, 131218, 132563, 133474, 134517, 135952, 137468, 138695, 139539, 139998, 140135, 140427, 141625, 143872, 146273, 147740, 148032, 147641, 146926, 145911, 144831, 144312, 144827, 146266, 148164, 150136, 152009, 153720, 155155, 156032, 156084, 155526, 155176, 155744, 156970, 157784, 157388, 156017, 154578, 153771, 153589, 153437, 152612, 150798, 148239, 145486, 143044, 141220, 140059, 139276, 138458, 137502, 136627, 135832, 134734, 133291, 132283, 132507, 133708, 134908, 135584, 135919, 136040, 135860, 135694, 136153, 137168]
54415A37168P39Q8J5L04r9j163j569p06L74N49J34J09O27J137J379J541J647J519
54397A43793J163P28K96PJ69P95J283J050L21j25Q8N89Q35O36J22n38j222j822
54379A48168k110j781q01K64O15J05n57o77l79j81j87r4J26J27j98m11l7P86J367
54360A44145J101J38o80o07J55O62L18m15o30j06M87L69n32j520j775j162l89
54343A39559k44o46q49n73m31r01j501j516j074q04p58m46J56M96M01L48N61N71
54325A32349J4p05r77p88n00k34Q4L32L13J57J97M86O80L87m74j529k138j906
54307A25748j168o59o34o42k61L23P62J028J116P63o2p20n80J31P04Q75Q31M99
54289A28054l07j124j056jR62Q11k84j300j462q45q7K27J53K83Q26J088M01o84
$$ y = [137168, 137907, 137995, 138010, 138314, 138215, 137052, 135483, 134777, 135151, 135700, 135834, 135943, 136570, 137707, 139086, 140627, 142274, 143793, 144956, 145684, 145980, 145987, 146156, 146951, 148234, 149284, 149605, 149480, 149568, 150157, 150992, 151628, 151750, 151212, 149990, 148168, 146058, 144277, 143476, 143740, 144355, 144460, 143903, 143226, 142847, 142666, 142479, 142385, 142511, 142638, 142440, 142029, 141992, 142778, 144145, 145246, 145384, 144704, 144097, 144252, 144914, 145232, 144817, 144187, 144081, 144568, 144937, 144405, 142885, 141110, 139948, 139559, 139315, 138669, 137820, 137247, 136816, 135915, 134414, 132898, 131824, 131020, 130262, 129816, 129972, 130468, 130869, 131217, 131778, 132349, 132363, 131658, 130681, 129893, 129393, 129159, 129243, 129575, 129888, 130045, 130242, 130728, 131408, 131795, 131321, 129792, 127654, 125748, 124580, 123921, 123287, 122645, 122384, 122707, 123469, 124497, 125613, 126376, 126314, 125594, 125014, 125145, 125849, 126724, 127555, 128054, 127747, 126623, 125567, 125566, 126528, 127339, 127055, 125755, 124293, 123448, 123361, 123588, 123741, 124024, 124850, 125938, 126339, 125655]
54271A25655j014n42l72q96j052n8J229J557J076Q04R00O72L4k76M9M20L50P8
54253A28614m9q7j38r0P6J34Oj60l58p23j111j196j025r41q96m85J64L12l40j066
54233A20641j042l51L05N32N05N85R31J326J272N70k64n78n20p76j370j556j065
54216A19145o09p39j033r25o26n56n71l76j76j96j49J73L27n4m97m37j78k19j98
54197A12106M49J220J135L50J3N10J010Q15J39n56j021r46k03N67O52N37J319
54180A18096K667K875J366k43m19K01J59n15p08k88k81j159k129k321j733q74
54164A14694j49K58M06N62Q08P57J07p64j227j274j358j533j386p77n8M96R14
54147A10476J097P67N0m14j80N50J306J816J883J278J75o40n11K02M18l32j193
$$ y = [125655, 124641, 124099, 123727, 122831, 121779, 121721, 122950, 124507, 125583, 126387, 127287, 127959, 127993, 127717, 127766, 128186, 128536, 128614, 128565, 128478, 128340, 128250, 128326, 128460, 128466, 128306, 127948, 127225, 126114, 124918, 123893, 122952, 122056, 121571, 121735, 122047, 121707, 120641, 119599, 119248, 119553, 120085, 120590, 121175, 122106, 123432, 124704, 125274, 125010, 124432, 123912, 123136, 121766, 120210, 119145, 118536, 117797, 116764, 115839, 115213, 114657, 114086, 113710, 113534, 113338, 113189, 113362, 113689, 113635, 113138, 112701, 112523, 112304, 112106, 112555, 113775, 114910, 115260, 115273, 115783, 116793, 117608, 117747, 117191, 116170, 115224, 115021, 115588, 116240, 116777, 118096, 120763, 123638, 125004, 124761, 124342, 124543, 124702, 124187, 123479, 123191, 122910, 121751, 119622, 117301, 115568, 114694, 114545, 114803, 115209, 115771, 116579, 117336, 117443, 116679, 115452, 114178, 112820, 111287, 109901, 109124, 109066, 109562, 110476, 111573, 112340, 112390, 111976, 111796, 112346, 113652, 115468, 117351, 118629, 118804, 118164, 117653, 117855, 118273, 117941, 116748]
54130A16748r28N31J913K070J242N36M82O34N57M04L43J00m21o55j54M90K70p54
54112A23408j402q82K72J002J019Q52J004J381J580J396R71N17K3o00j168j275
54096A28098q15k39%m3j6J62K96L15K28j12q08j443j339l80P62J333J204P75N00
54077A28478N51P46P37M96M61R21J402J181L83j4N01J261J369Q30L08J06Oo7J54
54058A39810P21J154R23Qj129j925j966j092M47K009K902K876K288J742J551J577
54042A51896J523J326J195J388K010K901L669L950L815L806M315N004N130M457
54028A96385L554L105L202L504L779M065M369M519M368L959L421K790K013J160
54014B44193M89J52j04p28j674k246j994j491j780k973m027l994l079k180j795
$$ y = [116748, 115820, 116351, 118264, 120334, 121576, 122112, 122594, 123228, 123785, 124189, 124532, 124632, 124211, 123556, 123402, 123892, 124162, 123408, 122006, 121124, 121396, 122398, 123417, 124269, 125273, 126654, 128234, 129630, 130601, 131118, 131141, 130541, 129373, 128098, 127283, 127044, 127044, 127001, 126985, 127147, 127443, 127758, 127986, 127874, 127066, 125623, 124284, 123904, 124666, 125999, 127203, 127978, 128478, 129029, 129775, 130512, 131008, 131469, 132390, 133792, 134973, 135356, 135342, 135843, 137104, 138473, 139303, 139611, 139717, 139723, 139656, 139810, 140531, 141685, 142608, 142616, 141487, 139562, 137596, 136504, 136951, 138960, 141862, 144738, 147026, 148768, 150319, 151896, 153419, 154745, 155940, 157328, 159338, 162239, 165908, 169858, 173673, 177479, 181794, 186798, 191928, 196385, 199939, 203044, 206246, 209750, 213529, 217594, 221963, 226482, 230850, 234809, 238230, 241020, 243033, 244193, 244682, 244834, 244730, 244002, 242328, 240082, 238088, 236597, 234817, 231844, 227817, 223823, 220744, 218564, 216769]
53999B16769j731j561r04M43K152L322L362K853K997M108N225N312M251K406j09
53984B48895l083n598o661o428o160o700p550p670o760n305l810k419j288p26
53970A78737q51j349j715j664j318j050j102j234r14l6P43O95l6n28j62Q15J768
53953A70799K329K488K365K172K026J755J160N52O65J717L002L601L263K366J475
53938B01735J175J846L154M140M251L959L925M037L810L321K931K440J465M87
53924B42676N17J636K766L143L111L230L341L106K736K689L138M064N322O273
53910B87748O071M875M180N171P173Q374P771N795L454J498K33n72j472k476k729
53895C35094j708l56j27j081j996k384l173m941o635o830n623m418m191m725n375
$$ y = [216769, 215038, 213477, 212573, 213016, 215168, 218490, 221852, 224705, 227702, 231810, 237035, 242347, 246598, 249004, 248895, 245812, 240214, 233553, 227125, 220965, 214265, 206715, 199045, 192285, 186980, 183170, 180751, 179463, 178737, 177886, 176537, 174822, 173158, 171840, 170790, 169688, 168454, 167540, 167504, 168247, 168942, 168906, 168378, 168216, 169031, 170799, 173128, 175616, 177981, 180153, 182179, 183934, 185094, 185646, 186311, 188028, 191030, 194631, 197894, 200260, 201735, 202910, 204756, 207910, 212050, 216301, 220260, 224185, 228222, 232032, 235353, 238284, 240724, 242189, 242676, 243193, 244829, 247595, 250738, 253849, 257079, 260420, 263526, 266262, 268951, 272089, 276153, 281475, 287748, 293819, 298694, 302874, 308045, 315218, 323592, 331363, 337158, 340612, 342110, 342343, 341771, 340299, 337823, 335094, 333386, 333030, 332903, 331822, 329826, 327442, 324269, 319328, 312693, 305863, 300240, 295822, 291631, 286906, 281531]
53880B81531n793n863n533m913m241l615k992k465k262k403k664k914l256l679
53866B28938l820l318k322j455j209j531j966k164k171k266k545k691k226j118
53852A98136q5l4j058k188k421j800j175r81q06k27M73Q02Q32R46J106R38M30
53835A92888M2Q3N13J299K467L715M544M985N608O519O882N910L897J759j28k034
53819B38949l990n566o466o742o386n323l938k934k370j507p5R52O18m36n85O54
53803A94855K148K898L319M250N435N938N574N099N077N351N641N915N972N373
53789B62845M141K950K263J742R33P8l09l56o96j544k440k871k678k026j383j500
53773B59149k737m389n208m769l857l412l565l877m043l960l595l127k954l163
$$ y = [281531, 275738, 269875, 264342, 259429, 255188, 251573, 248581, 246116, 243854, 241451, 238787, 235873, 232617, 228938, 225118, 221800, 219478, 218023, 216814, 215283, 213317, 211153, 208982, 206716, 204171, 201480, 199254, 198136, 198051, 198017, 196959, 194771, 192350, 190550, 189375, 188394, 187588, 187361, 187834, 188636, 189468, 190414, 191520, 192458, 192888, 192930, 193013, 193526, 194825, 197292, 201007, 205551, 210536, 216144, 222663, 229545, 235455, 239352, 241111, 240983, 238949, 234959, 229393, 222927, 216185, 209799, 204476, 200538, 197604, 195234, 193727, 193652, 194604, 195222, 194786, 194201, 194855, 197003, 199901, 203220, 207470, 212905, 218843, 224417, 229516, 234593, 239944, 245585, 251500, 257472, 262845, 266986, 269936, 272199, 273941, 274874, 274952, 274643, 274287, 273591, 272047, 269607, 266736, 264058, 262032, 260649, 259149, 256412, 252023, 246815, 242046, 238189, 234777, 231212, 227335, 223292, 219332, 215737, 212610, 209656, 206493]
53759B06493l301k974k441k234k422k630k548k107j347n41j99n07r02p00m1L60
53743A81959L28L94P86R18K53q30j459j228m24M60J052J178R38O75N79M30p6q89
53725A85044j603j793j201K5J194J447O55l27n96j96K00K65J77P7k5O7N63J180
53707A85153J403J293J373J676J641J135Q16J076J356J095P57J096J931K424K374
53692B06599K349K627K826K696K487K362K081J519R27L97l70j394k026j684o91
53677B20705Q5K15j3j47l5J95L05J60o4p6N8j45q73j560j499p52r8r9o26j198
53657B14538j448j176l82N40R30M91k91o02k00L64M70K12J66M76N74Rq19j121
53639B12731p26j27L43P84J140J014L74j07J75J047J950K590K780K214J012J44
$$ y = [206493, 203192, 200218, 197777, 195543, 193121, 190491, 187943, 185836, 184489, 183948, 183749, 183242, 182340, 181640, 181599, 181959, 182287, 182681, 183467, 184385, 184638, 183808, 182349, 181121, 180697, 181157, 182209, 183387, 184325, 185000, 185579, 186009, 185933, 185044, 183441, 181648, 180447, 180472, 181666, 183113, 183768, 183441, 182845, 182649, 182849, 183114, 183291, 183368, 183343, 183410, 183973, 185153, 186556, 187849, 189222, 190898, 192539, 193674, 194490, 195566, 196922, 198017, 198774, 199870, 201801, 204225, 206599, 208948, 211575, 214401, 217097, 219584, 221946, 224027, 225546, 226473, 226870, 226500, 225106, 223080, 221396, 220705, 220790, 221005, 220992, 220845, 220810, 221005, 221310, 221470, 221406, 221330, 221388, 221243, 220370, 218810, 217311, 216559, 216461, 216362, 215736, 214538, 213090, 211914, 211532, 212072, 213002, 213493, 213202, 212600, 212400, 212764, 213234, 213446, 213612, 214088, 214662, 214671, 213852, 212731, 212005, 211878, 212221, 213005, 214145, 215159, 215533, 215426, 215601, 216648, 218598, 221188, 223968, 226182, 227194, 227338]
53623B27338M87J635K354K189J906K261L027L452L146K290J377R66J340K172K795
53608B58735K878K589K171J785J699K077K530K414J743J189J081J011O74L93M08
53593B83377L62k3m01n18q76j908k938k907j874r23o53o43m59l45o22j056j214
53576B66379j037p79o48p15q86q71m63O8K50J38K93R35J545J549R81K91j58j24
53558B66748N19J437J855J368N54L27Q85J651K106K265K339K466K826L672M922
53543B95940N971O192N611M937M841N211N296M692L987M102N063N864N805N495
53529C69007O083P769R620J0769J1230J1464J1702J1912J2134J2509J3156J4138
53517E01493J5429J6778J7854J8621J9366K0248K1094K1767K2395K3026K3352
$$ y = [227338, 227825, 229460, 231814, 234003, 235909, 238170, 241197, 244649, 247795, 250085, 251462, 252428, 253768, 255940, 258735, 261613, 264202, 266373, 268158, 269857, 271934, 274464, 276878, 278621, 279810, 280891, 281902, 282576, 282969, 283377, 283739, 283716, 283315, 282797, 281921, 280013, 277075, 274168, 272294, 271371, 270718, 270075, 269616, 269271, 268649, 267593, 266379, 265342, 264563, 263915, 263200, 262314, 261443, 260980, 261048, 261298, 261436, 261729, 262664, 264209, 265758, 266739, 267030, 266872, 266748, 267267, 268704, 270559, 271927, 272481, 272808, 273693, 275344, 277450, 279715, 282054, 284520, 287346, 291018, 295940, 301911, 308103, 313714, 318651, 323492, 328703, 333999, 338691, 342678, 346780, 351843, 357707, 363512, 369007, 375090, 382859, 392479, 403248, 414478, 425942, 437644, 449556, 461690, 474199, 487355, 501493, 516922, 533700, 551554, 570175, 589541, 609789, 630883, 652650, 675045, 698071, 721423]
53506G21423K3136K2665K2396K2352K2271K2176K2296K2431K1999K0827J9518
53495I63490J8767J8702J9039J9556K0061K0199J9686J8689J7645J6785J6040
53484A168659J5273J4414J3411J2309J1325J0593R918R017P949O991O060M637
53472A290556K461Pk067l809n944q815j1724j3632j4429j5047j6230j7691j8796
53459A164840j9669k0870k2189k2665k2029k1285k1374k1942k2031k1419k0540
53448I28827j9519j8296j7345j7239j7527j7040j5492j3820j2676j1576r933q020
53436G50344o335m749l021j504n61K24J488L173M843O528Q454J0317J1669J2786
53422G93656J4316J6152J7607J8580J9656K0993K2048K2654K3479K5100K7303
$$ y = [721423, 744559, 767224, 789620, 811972, 834243, 856419, 878715, 901146, 923145, 943972, 963490, 982257, 1000959, 1019998, 1039554, 1059615, 1079814, 1099500, 1118189, 1135834, 1152619, 1168659, 1183932, 1198346, 1211757, 1224066, 1235391, 1245984, 1255902, 1264919, 1272868, 1279859, 1285919, 1290556, 1293017, 1293024, 1290957, 1287148, 1281204, 1272389, 1260665, 1247033, 1232604, 1217557, 1201327, 1183636, 1164840, 1145171, 1124301, 1102112, 1079447, 1057418, 1036133, 1014759, 992817, 970786, 949367, 928827, 909308, 891012, 873667, 856428, 838901, 821861, 806369, 792549, 779873, 768297, 758364, 750344, 744009, 739260, 736239, 734735, 734174, 734398, 735886, 739059, 743902, 750430, 758884, 769201, 780870, 793656, 807972, 824124, 841731, 860311, 879967, 900960, 923008, 945662, 969141, 994241, 1021544]
53411A021544K9631L1960L4105L5566L6188L6571L7433L8885M0725M2859M5080
53400A430547M6973M8517N0299N2481N4112N4162N2996N2039N2092N2672N2899
53389A999789N2356N1056M9266M7464M5957M4280M1535L7530L3177K9460K6418
53378B458288K3382J9855J5765J1206O401J786k324o232j0627j5814k1393k6856
53366B453437l2223l7839m3674m9066n3250n5992n7657n8759n9539n9916n9698
53355A885824n8828n7477n5896n4280n2774n1504n0414m9113m7284m5338m4225
53344A318691m4181m4135m2872m0534l8341l6883l5446l3209l0348k7611k5300
53333I19831k3162k0911j8424j5728j3136j1178j0054r376q674p857o967n915
$$ y = [1021544, 1051175, 1083135, 1117240, 1152806, 1188994, 1225565, 1262998, 1301883, 1342608, 1385467, 1430547, 1477520, 1526037, 1576336, 1628817, 1682929, 1737091, 1790087, 1842126, 1894218, 1946890, 1999789, 2052145, 2103201, 2152467, 2199931, 2245888, 2290168, 2331703, 2369233, 2402410, 2431870, 2458288, 2481670, 2501525, 2517290, 2528496, 2534897, 2536683, 2534359, 2528127, 2517500, 2501686, 2480293, 2453437, 2421214, 2383375, 2339701, 2290635, 2237385, 2181393, 2123736, 2064977, 2005438, 1945522, 1885824, 1826996, 1769519, 1713623, 1659343, 1606569, 1555065, 1504651, 1455538, 1408254, 1362916, 1318691, 1274510, 1230375, 1187503, 1146969, 1108628, 1071745, 1036299, 1003090, 972742, 945131, 919831, 896669, 875758, 857334, 841606, 828470, 817292, 807238, 797862, 789188, 781331, 774364, 768449]
53321G68449m742l732k861j639R4J726K768L686N055O438P052P263Q292J0449
53307H08298J2684J4133J5153J6494J8252K0042K1545K2551K3012K3404K4420
53296A019988K5992K7201K7575K7727K8333K9072K9197K8599K7615K6220K4147
53285A321666K1545J8817J6063J3236J0705Q937P745O364M274J456j937n649r106
53272A414116j1773j3691j5274j6649j7759j8953k0778k3115k5175k6503k7390
53261A197056k8184k8841k9436l0447l2016l3440l3960l3731l3439l3133l2179
53250H48250l0302k8137k6476k5432k4663k4095k4003k4385k4673k4276k3220
53239E68588k2059k1245k0742k0172j9092j7222j4753j2435j1008j0343r522p991
$$ y = [768449, 763707, 759975, 757114, 755475, 755569, 757295, 760063, 763749, 768804, 775242, 782294, 789557, 797849, 808298, 820982, 835115, 850268, 866762, 885014, 905056, 926601, 949152, 972164, 995568, 1019988, 1045980, 1073181, 1100756, 1128483, 1156816, 1185888, 1215085, 1243684, 1271299, 1297519, 1321666, 1343211, 1362028, 1378091, 1391327, 1402032, 1410969, 1418714, 1425078, 1429352, 1430808, 1428871, 1423222, 1414116, 1402343, 1388652, 1373378, 1356729, 1338970, 1320017, 1299239, 1276124, 1250949, 1224446, 1197056, 1168872, 1140031, 1110595, 1080148, 1048132, 1014692, 980732, 947001, 913562, 880429, 848250, 817948, 789811, 763335, 737903, 713240, 689145, 665142, 640757, 616084, 591808, 568588, 546529, 525284, 504542, 484370, 465278, 448056, 433303, 420868, 409860, 399517, 389995, 382004]
53227C82004o245n120m758m757n027n800o836p274o591n294m392m389m890n128
53213C05503m747m178m155m743n111m547l425k699k641k682k487k358k478k450
53199B56802k050j794k209k917l054k414j649j423j732k084k070j767j630j957
53185B28052k422k431j942j583j738k005j916j679j756j990j770r49k9M99O03
53170B06944M45J42k09o14j211j973k450k175j284l62K51O38R09J047J082J012
53154B02192N48n13j702k194j806j148p11l88n3N1j51k25Q2L19P8k56p3M47O32
53135A95129L78J91K23K1n67r98q56n34o50j122j330r27j40O40J167J287R94O00
53117A93506M64N06K38m85j097r88l37J13J8k50l36m46q83j382j439j053o83m89
$$ y = [382004, 375759, 370639, 365881, 361124, 356097, 350297, 343461, 336187, 329596, 324302, 319910, 315521, 310631, 305503, 300756, 296578, 292423, 287680, 282569, 278022, 274597, 271898, 269257, 266575, 264088, 261730, 259252, 256802, 254752, 252958, 250749, 247832, 244778, 242364, 240715, 239292, 237560, 235476, 233406, 231639, 230009, 228052, 225630, 223199, 221257, 219674, 217936, 215931, 214015, 212336, 210580, 208590, 206820, 205871, 205842, 206341, 206944, 207389, 207531, 207322, 206708, 205497, 203524, 201074, 198899, 197615, 197253, 197504, 198142, 199051, 200098, 201180, 202192, 202740, 202227, 200525, 198331, 196525, 195377, 194666, 194278, 194225, 194276, 194125, 193900, 193982, 194301, 194379, 194123, 194050, 194497, 195129, 195507, 195698, 195921, 195942, 195375, 194377, 193521, 192987, 192337, 191215, 189885, 188958, 188818, 189458, 190625, 191912, 192906, 193506, 193970, 194476, 194714, 194229, 193132, 192144, 191807, 191920, 191938, 191688, 191352, 190906, 190023, 188641, 187202, 186149, 185466, 184977]
53099A84977k55k8k71j073j766j712j107n47j93J38L03mo08r20p45l86K9P12J449
53080A77993J494N48o28j112q81n01k46j31m20j256j975j617k41J054J480J268
53064A74829Q17J6j090j753j379n14j81n16q02o56l68j10L54R52J087N90J78M79
53046A71933J042R96L45o7J61M78K24n41j317j831k059j898j253l47L29M75J78
53029A66848l12p92j091j106j023j173j569j709j228n49m38r07j061l31O59R00
53013A55118L99Q9M82J024R81L83j97m00k51J07M81O02L52n6l34l93j99L18R80
52994A59486J308J081P01O16O63M74K10K69M37J63m18n55j23O9m58j123j279j211
52976A60310j399j486q15L57J144J341J497J733J473O25L9L77J182J664J769J895
$$ y = [184977, 184722, 184694, 184423, 183350, 181584, 179872, 178765, 178218, 178025, 178163, 178466, 178462, 177854, 176934, 176189, 175803, 175832, 176544, 177993, 179487, 180035, 179407, 178295, 177414, 176913, 176667, 176536, 176116, 174860, 172885, 171268, 171027, 172081, 173561, 174829, 175646, 175662, 174572, 172819, 171440, 170926, 170745, 170229, 169427, 168771, 168403, 168293, 168647, 169599, 170686, 171276, 171454, 171933, 172975, 173971, 174316, 174249, 174410, 174888, 175112, 174571, 173254, 171423, 169364, 167466, 166213, 165866, 166195, 166670, 166848, 166536, 165744, 164653, 163547, 162524, 161351, 159782, 158073, 156845, 156296, 155858, 154951, 153890, 153559, 154218, 155118, 155517, 155606, 156088, 157112, 158093, 158476, 158279, 157879, 157628, 157735, 158216, 158818, 159170, 159114, 158780, 158387, 158188, 158506, 159486, 160794, 161875, 162576, 163192, 163855, 164329, 164539, 164808, 165245, 165408, 164990, 164435, 164312, 164381, 163923, 162800, 161521, 160310, 158911, 157425, 156610, 156967, 158111, 159452, 160949, 162682, 164155, 164780, 164819, 165196, 166378, 168042, 169811, 171706]
52960A71706J987J714J232R98R13M20m79j046q95o26r53j676k042j828j508j468
52944A66449j576j568j366r55l52J50J7q28j641j512m22P03J008N10j38m10k47
52927A57822N7J29k80j006j465j193m53n8m05r94j101o51j03L37Q09J150Q22k27
52909A53190j120j031l00M2l67q64q39m64j46J32N73J080J407J536J515J140K83
52892A55767o12q67m02J74L69L33M54Q13J175J305J074M34m93j419k060k273k023
52875A51749j382n86Q1N07P16O30J39m62n01L49J548K231K171J935K105K671L174
52858A67075L206K603J446Q4r36j223r09n40n39q04r34p72n82o16p10n22j18o5
52840A65144p43j762k343k221j891j856j978j781j191n99k28J64P68J320J477
$$ y = [171706, 173693, 175407, 176639, 177637, 178550, 178970, 178491, 177445, 176550, 175924, 174971, 173295, 171253, 169425, 167917, 166449, 164873, 163305, 161939, 160984, 160632, 160782, 160799, 159971, 158330, 156818, 156396, 157099, 158107, 158617, 158479, 158069, 157822, 157879, 158008, 157728, 156722, 155257, 154064, 153611, 153553, 153148, 152154, 151053, 150402, 150299, 150636, 151445, 152595, 153417, 153190, 152070, 151039, 150739, 150781, 150414, 149550, 148711, 148247, 148101, 148233, 148806, 149886, 151293, 152829, 154344, 155484, 155767, 155155, 154288, 153886, 154060, 154429, 154762, 155216, 156029, 157204, 158509, 159583, 160017, 159524, 158105, 156045, 153772, 151749, 150367, 149781, 149862, 150369, 151085, 151715, 151854, 151392, 150891, 151240, 152788, 155019, 157190, 159125, 161230, 163901, 167075, 170281, 172884, 174330, 174414, 173478, 172255, 171346, 170806, 170267, 169463, 168529, 167757, 167175, 166559, 165849, 165327, 165209, 165144, 164401, 162639, 160296, 158075, 156184, 154328, 152350, 150569, 149378, 148779, 148551, 148715, 149483, 150803, 152280]
52825A52280J390J492J799J831J312N52k9l86o98r38r77q90r13j038r77n24K20
52808A53506R97J591J922K043K092K177K254K128J507J69j685l302l917l565l013
52793A54904k770k517j826r31l68j98j38j57l28l54Q0N74M63n0n6O14J010N18
52775A48470j73j24M50N96k7q63j293j095l13P47J433J227L33n49r58q91n22n7
52757A46391K01J81K80Q73J633J808J102n4j095j682j585p94J82O18M02J76M45
52740A49082R85J308J322J247J165J004Q06O55M76J80K1M32J396K226K223J509
52724A66037Q91Q06P10j37j479k186j669o24o9j32k69k27k11k94l13l24n67r27
52706A59016j012q37q78j261j448r81j09N89Q38O33j0r00j513j381n60M64J216
$$ y = [152280, 153670, 155162, 156961, 158792, 160104, 160656, 160627, 160241, 159543, 158605, 157628, 156738, 155825, 154787, 153810, 153286, 153506, 154503, 156094, 158016, 160059, 162151, 164328, 166582, 168710, 170217, 170386, 168701, 165399, 161482, 157917, 154904, 152134, 149617, 147791, 146860, 146492, 146294, 146156, 145999, 145671, 145317, 145397, 145971, 146434, 146384, 146328, 146942, 147952, 148470, 148297, 148173, 148623, 149219, 149192, 148329, 147036, 145941, 145628, 146375, 147808, 149035, 149368, 148819, 147861, 146970, 146448, 146391, 146592, 146773, 147053, 147926, 149559, 151367, 152469, 152415, 151320, 149638, 148053, 147259, 147441, 148059, 148461, 148637, 149082, 150067, 151375, 152697, 153944, 155109, 156113, 156919, 157574, 158050, 158230, 158251, 158683, 160079, 162305, 164528, 166037, 166928, 167734, 168444, 168307, 166828, 164642, 162973, 162349, 162280, 162148, 161879, 161652, 161441, 161147, 160834, 160510, 159943, 159016, 158004, 157167, 156289, 155028, 153580, 152599, 152490, 153079, 153917, 154550, 154540, 153640, 152127, 150746, 150186, 150650, 151866]
52689A51866J408R53R2o60q93n98nO70J178J259R53P15R49J500J806J544Q86K60
52671A63883p1k11m66r53j311j054j85P49J246J229Q59L31kJ89O98Q45L95l1J49
52652A66289O37Q61J052J894L259M120L865K945J905N31j478l432m080l143j809
52637A73416j421j981k364j833q58k70k8O43J930K972K925K056J269Q46L47m11
52621A77238r05o49J68J004J514J477O74p25j919k152j571r80q28q91r36j107
52605A69412j448j549j067k90K49M66N83N50J92j14L13J322J766J008p2j94O12
52588A71739J247J272J352J881K154J413M0r26r94m23M14J184J425Q74l0n45m78
52571A81599k26m6J39K00k74j244j955j787j052n91p95j296j517j163l27O33J272
$$ y = [151866, 153274, 154227, 154319, 153659, 152766, 152168, 152163, 152833, 154011, 155270, 156223, 156938, 157887, 159387, 161193, 162737, 163623, 163883, 163812, 163601, 163135, 162182, 160871, 159817, 159632, 160381, 161627, 162856, 163715, 164046, 164044, 164233, 164931, 165776, 166171, 166140, 166289, 166926, 167787, 168839, 170733, 173992, 178112, 181977, 184922, 186827, 187358, 185880, 182448, 178368, 175225, 173416, 171995, 170014, 167650, 165817, 164959, 164689, 164661, 165304, 167234, 170206, 173131, 175187, 176456, 177302, 177649, 177238, 176333, 175684, 175852, 176856, 178370, 179847, 180521, 179796, 177877, 175725, 174154, 173174, 172346, 171455, 170519, 169412, 167964, 166415, 165348, 165058, 165307, 165773, 166356, 166906, 167098, 166984, 167297, 168619, 170385, 171393, 171321, 171127, 171739, 172986, 174258, 175610, 177491, 179645, 181058, 181098, 180172, 179178, 178755, 179169, 180353, 181778, 182652, 182622, 182077, 181599, 181373, 181327, 181466, 181666, 181392, 180148, 178193, 176406, 175354, 174763, 173968, 172672, 171155, 169992, 169665, 170298, 171570]
52554A71570J359J077Q21P59O43P5r83k013k244j371K6R22Q30K40K2M55J050J216
52536A74454Q73L58j20o12j083j175n90M42J249J386J002N55L02J80j3l90q31
52519A75987r52m66L38P62N60L14O13J179J285R26Q88J576K415K672K417K241
52503A92755K287K131J509P06P6m63j220k098k520k076j176p14j050j572j474
52488A85101p81k45l56q11j017p22n5O47Q87K78q68j556j051K78J418J837J825
52471A84809J807J822J709J451J122P46M34M52R42J630J997J792J249P48L67j13
52455B02964p56j205j041l31K99K66m53j427k233k673k724k454j998j464r04l93
52439A83473q8m8j40k16l00m71o41o45n14l86k42M3M12O18N89N40O05N89L00m5
$$ y = [171570, 172929, 174006, 174827, 175586, 176229, 176304, 175321, 173308, 171064, 169693, 169719, 170641, 171471, 171711, 171733, 172188, 173238, 174454, 175327, 175685, 175565, 174953, 173870, 172695, 172105, 172547, 173796, 175182, 176184, 176739, 177041, 177221, 177208, 176818, 175987, 175035, 174569, 174907, 175669, 176229, 176543, 177156, 178335, 179620, 180546, 181434, 183010, 185425, 188097, 190514, 192755, 195042, 197173, 198682, 199388, 199464, 199001, 197781, 195683, 193163, 191087, 189911, 189197, 188147, 186575, 185101, 184320, 184075, 183719, 182908, 181891, 181169, 181114, 181761, 182648, 182926, 182058, 180502, 179451, 179729, 181147, 182984, 184809, 186616, 188438, 190147, 191598, 192720, 193466, 193900, 194352, 195294, 196924, 198921, 200713, 201962, 202710, 203077, 202964, 202208, 201003, 199962, 199631, 199930, 200196, 199743, 198316, 196083, 193410, 190686, 188232, 186234, 184770, 183866, 183473, 183385, 183337, 183197, 182981, 182681, 182210, 181569, 180924, 180410, 180024, 179782, 179825, 180237, 180855, 181444, 181984, 182589, 183178, 183478, 183433]
52419A83433nN18J144J444J375J177R96P68M69K91M75R52J449J912K650L910N393
52402B08351O478O807O490N690M329K353P3j907l093l397l138k817k749k829k776
52387B17865k525k237j896j238k84M38M67O0j60l1M2j79l58r6M74Q35P10L87M53
52368B12727J191K218K821K825K863L493M159L692J902Q1m69L9L45k15j058j306
52352B35308q24j73P3j81n90p53n95l68k21j0L77P23Q28R37J396K053K372K194
52334B42546J935K030K493L128L761M236M529M927N723O665P196P282P512Q110
52320C12073Q452P953O902N968N257M529M000M163M861N275M946M306L964L964
52306C86613L961L829L723L735L730L450K773J991J820K705M047M504L461J888
$$ y = [183433, 183428, 183946, 185090, 186534, 187909, 189086, 190082, 190850, 191319, 191610, 192085, 193037, 194486, 196398, 199048, 202958, 208351, 214829, 221636, 228126, 233816, 238145, 240498, 240571, 238664, 235571, 232174, 229036, 226219, 223470, 220641, 217865, 215340, 213103, 211207, 209969, 209685, 210123, 210590, 210650, 210490, 210459, 210501, 210322, 209964, 209868, 210342, 211177, 211887, 212274, 212727, 213918, 216136, 218957, 221782, 224645, 228138, 232297, 235989, 237891, 237972, 237503, 237542, 237887, 237672, 236614, 235308, 234484, 234311, 234384, 234203, 233613, 232860, 232265, 231897, 231676, 231666, 232043, 232766, 233594, 234531, 235927, 237980, 240352, 242546, 244481, 246511, 249004, 252132, 255893, 260129, 264658, 269585, 275308, 281973, 289169, 296451, 303963, 312073, 320525, 328478, 335380, 341348, 346605, 351134, 355134, 359297, 364158, 369433, 374379, 378685, 382649, 386613, 390574, 394403, 398126, 401861, 405591, 409041, 411814, 413805, 415625, 418330, 422377, 426881, 430342, 432230]
52292D32230J288J896K486K081J156P37P98L73q64j983k125j690j559j695j286
52277D31843r9J181K030K655L301L679L550L170K838K436J965J941K698L673M034
52262D70895L758L494L607L896M081M030L635L049K884L567M705N565O044O462
52248E29672O718O417N768N441N448N011L720K102Q02k6l15J67J266K286K744
52233E77221K735K387J697J116J407K470L227L137K924L176L302K768K371K990
52219F12928L875L678K682K427L188L577K889K311L075M622N537N448N091N014
52205F66342N111N113M905M415L742L228L091L123L023K803K601K439K362K526
52191G14824K786K566J582M13q7K36Q22J201J385J539J673J698J381M02j237k896
$$ y = [432230, 433518, 435414, 437900, 439981, 441137, 441874, 442672, 443045, 442181, 440198, 438073, 436383, 434824, 433129, 431843, 431744, 432925, 434955, 437610, 440911, 444590, 448140, 451310, 454148, 456584, 458549, 460490, 463188, 466861, 470895, 474653, 478147, 481754, 485650, 489731, 493761, 497396, 500445, 503329, 506896, 511601, 517166, 523210, 529672, 536390, 542807, 548575, 554016, 559464, 564475, 568195, 570297, 571099, 571073, 570758, 570925, 572191, 574477, 577221, 579956, 582343, 584040, 585156, 586563, 589033, 592260, 595397, 598321, 601497, 604799, 607567, 609938, 612928, 616803, 620481, 623163, 625590, 628778, 632355, 635244, 637555, 640630, 645252, 650789, 656237, 661328, 666342, 671453, 676566, 681471, 685886, 689628, 692856, 695947, 699070, 702093, 704896, 707497, 709936, 712298, 714824, 717610, 720176, 721758, 722171, 722084, 722320, 723142, 724343, 725728, 727267, 728940, 730638, 732019, 732421, 731184, 728288]
52175G28288l783l894m048m849n900o305n785m952m467m237l657k572j560j120
52161F71159q99j63J094K124K565K873L376L524K736J481P20M96m7j202k105j921
52145F85811q75K39J047J611J873J703J276Q96O52M62L17J23m09j250j765j400
52129F90311n36K8L05J098K676M256N149N733O813Q462J0118J1509J2858J4244
52115G73024J5274J5445J4520J2651J0368Q333O781N313L619K131J470J352O86
52102H70967j018k940l882l581k758k163j885j518p32L13J104J394J511J842K076
52087H58730J463j83k188l879n178o133o480o121n544n156m499k906p09Q85J216
52072H13318Q09N35O64J000J377J627J495J000P00J110J946K368K007J397J220
$$ y = [728288, 724505, 720611, 716563, 711714, 705814, 699509, 693724, 688772, 684305, 680068, 676411, 673839, 672279, 671159, 670260, 670097, 671191, 673315, 675880, 678753, 682129, 685653, 688389, 689870, 690590, 691086, 691039, 689837, 687732, 685811, 684936, 685175, 686222, 687833, 689706, 691409, 692685, 693581, 694233, 694695, 695012, 695135, 694726, 693476, 691711, 690311, 689775, 689803, 690108, 691206, 693882, 698138, 703287, 709020, 715833, 724295, 734413, 745922, 758780, 773024, 788298, 803743, 818263, 830914, 841282, 849615, 856396, 861709, 865328, 867459, 868929, 870281, 870967, 869949, 867009, 863127, 859546, 856788, 854625, 852740, 851222, 850490, 850803, 851907, 853301, 854812, 856654, 858730, 860193, 860010, 857822, 853943, 848765, 842632, 836152, 830031, 824487, 819331, 814832, 811926, 811217, 812102, 813318, 814127, 814662, 815326, 816326, 817703, 819330, 820825, 821825, 822525, 823635, 825581, 827949, 829956, 831353, 832573]
52057H32573J380J162K63p53j241j413k038l272m326m438l808l250l241l647m108
52042G99843m305m090l757l948m836n585n284m279l819m350m872m292k703q71
52028G42852Q28K305L146K990K293J920J989J834J264R52J283J536Q82k52n96
52013G65226K37J192J115M5j160k052k906m029n354o766q372j0123j1579j2370
$$ y = [832573, 833953, 835115, 835378, 834625, 833384, 831971, 829933, 826661, 822335, 817897, 814089, 810839, 807598, 803951, 799843, 795538, 791448, 787691, 783743, 778907, 773322, 768038, 763759, 759940, 755590, 750718, 746426, 743723, 742852, 743680, 745985, 749131, 752121, 754414, 756334, 758323, 760157, 761421, 762373, 763656, 765192, 766074, 765822, 765226, 765463, 766655, 767770, 767815, 766655, 764603, 761697, 757668, 752314, 745548, 737176, 727053, 715474, 703104]
$$ [...]
##END NTUPLES=NMR SPECTRUM
##END=
