
##TITLE=UV1107_M2_1290-1353_7180591_HSQ8OUJR6w
##JCAMPDX= 6.0         $$ Bruker NMR JCAMP-DX V2.0
##DATA TYPE= NMR SPECTRUM
##DATA CLASS= NTUPLES
##ORIGIN= BRUKER
##OWNER= Administrator
$$ 1.72 TOPSPIN		Version 2.1
$$ 2012-12-04 22:49:54.847 -0500  Administrator@X
$$ Compression mode = diff/dup
##.OBSERVE FREQUENCY= 400.02188249412
##.OBSERVE NUCLEUS= ^1H
##.ACQUISITION MODE= SIMULTANEOUS (DQD)
##.ACQUISITION SCHEME= undefined
##.AVERAGES= 8
##.DIGITISER RES= 22
##SPECTROMETER/DATA SYSTEM= spect
##.PULSE SEQUENCE= zg30
##.SOLVENT NAME= COFFEE_meoh
##.SHIFT REFERENCE= INTERNAL, COFFEE_meoh, 1, 14.98509
##AUDIT TRAIL= $$ (NUMBER, WHEN, WHO, WHERE, PROCESS, VERSION, WHAT)
$$ ##TITLE= Audit trail, TOPSPIN		Version 2.1
$$ ##JCAMPDX= 5.01
$$ ##ORIGIN= Bruker BioSpin GmbH
$$ ##OWNER= Administrator
$$ $$ E:\/data/COFFEE/nmr/UV1107_M2_1290-1353_7180591_HSQ8OUJR6w/10/pdata/1/auditp.txt
$$ ##AUDIT TRAIL=  $$ (NUMBER, WHEN, WHO, WHERE, PROCESS, VERSION, WHAT)
(   1,<2012-12-04 22:49:46.613 -0500>,<Administrator>,<X>,<go>,<TOPSPIN 2.1>,
      <created by zg
	started at 2012-12-04 22:48:40.597 -0500,
	POWCHK enabled, PULCHK disabled,
       configuration hash MD5:
       86 BA 57 50 F2 9D 5C 9B 26 00 A9 28 5F 66 2E 89
       data hash MD5: 64K
       ED 2B 2D 43 45 6B 48 6C 92 84 12 4C C2 ED F0 93>)
(   2,<2012-12-04 22:49:49.816 -0500>,<Administrator>,<X>,<proc1d>,<TOPSPIN 2.1>,
      <Start of raw data processing
       efp LB = 0 FT_mod = 6 PKNL = 1 PHC0 = 0 PHC1 = 0 SI = 32K 
       data hash MD5: 32K
       5B BB 0D 03 F1 A1 C5 1F AD CE 92 B4 56 D6 83 A6>)
(   3,<2012-12-04 22:49:50.269 -0500>,<Administrator>,<X>,<proc1d>,<TOPSPIN 2.1>,
      <pk PHC0 = 96.03699 PHC1 = 0 
       data hash MD5: 32K
       B0 F2 A2 9F B1 C1 CC 1E 7C B7 38 F7 20 CC BF E7>)
(   4,<2012-12-04 22:49:50.519 -0500>,<Administrator>,<X>,<proc1d>,<TOPSPIN 2.1>,
      <abs ABSG = 1 
       data hash MD5: 32K
       75 43 D7 25 E4 AA 54 C0 25 81 11 23 D4 C7 B2 0A>)
(   5,<2012-12-04 22:49:50.660 -0500>,<Administrator>,<X>,<proc1d>,<TOPSPIN 2.1>,
      <abs ABSG = 2 
       data hash MD5: 32K
       BE 78 42 F7 07 99 CF 8F E1 43 78 71 5B B4 5C 95>)
(   6,<2012-12-04 22:49:50.800 -0500>,<Administrator>,<X>,<proc1d>,<TOPSPIN 2.1>,
      <abs ABSG = 3 
       data hash MD5: 32K
       E3 10 FE BE 19 26 D9 B1 12 CC 48 E8 69 A9 A0 FE>)
(   7,<2012-12-04 22:49:50.941 -0500>,<Administrator>,<X>,<proc1d>,<TOPSPIN 2.1>,
      <abs ABSG = 4 
       data hash MD5: 32K
       5F D6 9F 07 67 3D 86 90 10 AC A2 81 D1 52 28 C5>)
(   8,<2012-12-04 22:49:51.113 -0500>,<Administrator>,<X>,<proc1d>,<TOPSPIN 2.1>,
      <abs ABSG = 5 
       data hash MD5: 32K
       11 BA 9B C6 EE 71 87 A1 A6 3C D5 41 2B E6 FA 95>)
$$ ##END=
$$ 
$$ $$ hash MD5
$$ $$ F7 58 CA 93 E1 6A 57 5F 72 72 AD B4 B0 D1 07 6E
##$RELAX= 
##$RELAX= 
##$RELAX= 
##$RELAX= 
##$RELAX= 
##$RELAX= 
##$RELAX= 
$$ Bruker specific parameters
$$ --------------------------
##$DU= <E:\>
##$EXPNO= 10
$$ [...]
150 150 150 150 150 150 150 150
##$TP07= 0
##$TPNAME0= <>
##$TPNAME1= <>
##$TPNAME2= <>
##$TPNAME3= <>
##$TPNAME4= <>
##$TPNAME5= <>
##$TPNAME6= <>
##$TPNAME7= <>
##$TPOAL= (0..7)
0.5 0.5 0.5 0.5 0.5 0.5 0.5 0.5
##$TPOFFS= (0..7)
0 0 0 0 0 0 0 0
##$TUNHIN= 0
##$TUNHOUT= 0
##$TUNXOUT= 0
##$USERA1= <user>
##$USERA2= <user>
##$USERA3= <user>
##$USERA4= <user>
##$USERA5= <user>
##$V9= 5
##$VALIST= <valist>
##$VCLIST= <CCCCCCCCCCCCCCC>
##$VD= 0
##$VDLIST= <DDDDDDDDDDDDDDD>
##$VPLIST= <PPPPPPPPPPPPPPP>
##$VTLIST= <TTTTTTTTTTTTTTT>
##$WBST= 2048
##$WBSW= 25
##$XGAIN= (0..3)
0 0 0 0
##$XL= 0
##$YL= 0
##$YMAX_a= 671635
##$YMIN_a= -571449
##$ZGOPTNS= <>
##$ZL1= 120
##$ZL2= 120
##$ZL3= 120
##$ZL4= 120
##$ABSF1= 14.98509
##$ABSF2= -5.573092
##$ABSG= 5
##$ABSL= 3
##$ALPHA= 0
##$AQORDER= 0
##$ASSFAC= 0
##$ASSFACI= 0
##$ASSFACX= 0
##$ASSWID= 0
##$AUNMP= <proc_prof1d_extract_pilot.lims>
##$AXLEFT= 0
##$AXNAME= <>
##$AXNUC= <1H>
##$AXRIGHT= 0
##$AXTYPE= 0
##$AXUNIT= <>
##$AZFE= 0.1
##$AZFW= 0.1
##$BCFW= 0
##$BC_mod= 0
##$BYTORDP= 0
##$COROFFS= 0
##$CY= 15
##$DATMOD= 1
##$DC= 0
##$DFILT= <>
##$DTYPP= 0
##$F1P= 0
##$F2P= 0
##$FCOR= 0.5
##$FTSIZE= 32768
##$FT_mod= 6
##$GAMMA= 0
##$GB= 0
##$INTBC= 1
##$INTSCL= 1
##$ISEN= 128
##$LB= 0
##$LEV0= 0
##$LPBIN= 0
##$MAXI= 10000
##$MC2= 0
##$MEAN= 0
##$ME_mod= 0
##$MI= 0
##$NCOEF= 0
##$NC_proc= -8
##$NLEV= 6
##$NOISF1= 0
##$NOISF2= 0
##$NSP= 0
##$NTH_PI= 0
##$NZP= 0
##$OFFSET= 14.98509
##$PC= 1
##$PHC0= 96.03699
##$PHC1= 0
##$PH_mod= 1
##$PKNL= yes
##$PPARMOD= 0
##$PPDIAG= 0
##$PPIPTYP= 0
##$PPMPNUM= 2147483647
##$PPRESOL= 1
##$PSCAL= 4
##$PSIGN= 0
##$PYNMP= <proc.py>
##$REVERSE= no
##$SF= 400.02
##$SI= 32768
##$SIGF1= 0
##$SIGF2= 0
##$SINO= 400
##$SIOLD= 32768
##$SPECTYP= <>
##$SREGLST= <1H.CDCl3>
##$SSB= 0
##$STSI= 32768
##$STSR= 0
##$SW_p= 8223.68421052631
##$SYMM= 0
##$S_DEV= 0
##$TDeff= 65536
##$TDoff= 0
##$TI= <>
##$TILT= no
##$TM1= 0
##$TM2= 0
##$TOPLEV= 0
##$USERP1= <user>
##$USERP2= <user>
##$USERP3= <user>
##$USERP4= <user>
##$USERP5= <user>
##$WDW= 1
##$XDIM= 32768
##$YMAX_p= 481391238
##$YMIN_p= -690159
##$CURPLOT= <Network HP LaserJet P1505>
##$CURPRIN= <$Network HP LaserJet P1505>
##$DFORMAT= <normdp>
##$LAYOUT= <+/1D_H.xwp>
##$LFORMAT= <normlp>
##$PFORMAT= <normpl>
##$SURQMSG= 1
$$ End of Bruker specific parameters
$$ ---------------------------------
##NTUPLES= NMR SPECTRUM
##VAR_NAME=  FREQUENCY,     SPECTRUM/REAL,   SPECTRUM/IMAG
##SYMBOL=    X,             R,               I
##VAR_TYPE=  INDEPENDENT,   DEPENDENT,       DEPENDENT
##VAR_FORM=  AFFN,          ASDF,            ASDF
##VAR_DIM=   32768,         32768,           32768
##UNITS=     HZ,            ARBITRARY UNITS, ARBITRARY UNITS
##FACTOR=    0.250966925370066, 1,           1
##FIRST=     8223.43324360094, 19023,        -119223
##LAST=      0,             -213936,         -94571
##MIN=       0,             -690159,         0
##MAX=       8223.43324360094, 481391238,    0
$$ Real data points
##PAGE= N=1
##DATA TABLE= (X++(R..R)), XYDATA
$$ [...]
19545A80593i9753q4963G3970C02c19595a1062k9113J8037A31699b76822B0958
$$ 180593 -99753 -184716 73970 302 -319595 -11062 -40175 -22138 131699 -276822 20958
19533b01463F3898c8265j31934D4201c4920D8749P3512C6988c36223D2997K8282
$$ -201463 63898 -38265 -170199 44201 -34920 48749 122261 36988 -336223 42997 71279
19522G1279N329k9673a23790j78049f8024j22305g7118B69992d1353r2563j36258
$$ 71279 76608 46935 -123790 -301839 -68024 -190329 -77118 269992 -41353 -133916 -270174
19511b70174j95763b30932A20652a37872e8000J6446g831A87459F5935b24961
$$ -270174 -465937 -230932 120652 -137872 -58000 -41554 -7831 187459 65935 -224961
19500b08563h587B32435K3660i5898O88o0515A27278d29801J78517L4701A36982
$$ -208563 -8587 232435 256095 -95898 -95210 -155725 127278 -429801 -251284 -216583 136982
19488a14761C3856L8004a94314Q2037K9943k29499I2473D2751L46680a68827C01790
$$ -114761 33856 71860 -194314 -112277 -82334 -311833 92473 42751 389431 -168827 301790
19476g5089q6472g4921k8683n7892J0109h060j04269E6495J18924B6448c26038
$$ -75089 -161561 -74921 -103604 -161496 -151387 -8060 -112329 56495 175419 26448 -326038
19464H9202c51015A50747p091J55678a3990C8489M31j4288a24806G0959J73265
$$ 89202 -351015 150747 143656 299334 -13990 38489 38920 24632 -124806 70959 244224
19453B44224o3107m8265c22564f8225a1709k51615j25356a13712B5137b44010
$$ 244224 181117 132852 -322564 -68225 -11709 -263324 -388680 -113712 25137 -244010
19442g7637E4319h3244n2676F6470a42094d5376H2891b28623k4998a05398B0425
$$ -77637 54319 -83244 -135920 66470 -142094 -45376 82891 -228623 -253621 -105398 20425
19430a05060E7021R0026L00511G8951a68290A7113a39616A54842b79556A4192
$$ -105060 57021 147047 447558 78951 -168290 17113 -139616 154842 -279556 14192
19419A96971k8424a28155J3089r0949f5705J0607L317k9238C5050a38610B6247
$$ 196971 168547 -128155 -115066 -206015 -65705 -55098 -51781 -81019 35050 -138610 26247
19407b62025I3964a01186D0855K5747i0616p9568c4442G1645J22355O9941A02495
$$ -262025 93964 -101186 40855 66602 -90616 -170184 -34442 71645 194000 263941 102495
19395I901d1975A54087J19904G8983a28037m9304M7010A25924f075j85159C5978
$$ 9901 -41975 154087 273991 78983 -128037 -177341 -130331 125924 -6075 -191234 35978
19383a91910h331j65019b3534B18834b78438e6175j16957Q1208F3282a53204r8741
$$ -191910 -8331 -173350 -23534 218834 -278438 -56175 -173132 -91924 63282 -153204 -251945
19372b51945a8479G902a09400H6608c9604J0817j06613r748m19692G9739i6476
$$ -251945 -18479 7902 -109400 86608 -39604 -28787 -135400 -145148 -564840 79739 -96476
19360b61962A92853e2825A25488e06894b3073k89296C55781G951O1764a96561
$$ -261962 192853 -52825 125488 -506894 -23073 -312369 355781 7951 69715 -196561
19349h2624j14477j12892a15535m3234A0412a31861k82886h7674q6695L7932C38383
$$ -82624 -197101 -309993 -115535 -158769 10412 -131861 -414747 -87674 -174369 -136437 338383
19337e7735G4245j4184a57083h639j27897k48366d6145B08275J4203a42011k9848
$$ -57735 74245 60061 -157083 -8639 -136536 -384902 -46145 208275 222478 -142011 -171859
19326a71859H8617M1051K6813d09840a29933g003r2996J0425A12069d8808G7721
$$ -171859 88617 129668 156481 -409840 -129933 -7003 -99999 -89574 112069 -48808 77721
19314A67927a85935B15444b47254d9110a0880m87347e6773j78711C6958A5023
$$ 167927 -185935 215444 -247254 -49110 -10880 -498227 -56773 -235484 36958 15023
19303H9601a57034e9681G1493K17610g7335j18783C80651a35188l77767a06969
$$ 89601 -157034 -59681 71493 289103 -77335 -196118 380651 -135188 -512955 -106969
19292b92045b7826B78624a69100j3615N8706A44886a79003A0444L4827d8446k65800
$$ -292045 -27826 278624 -169100 -182715 -124009 144886 -179003 10444 45271 -48446 -314246
19281c14246M3626C93526A27434J05311f6521l0079K7103C143K08992h7063J9469
$$ -314246 -270620 393526 127434 232745 -66521 -96600 -69497 3143 212135 -87063 -67594
19270f7594q2713g1054j43650D9195j6177b13440a0841C38601A49012n2856b14918
$$ -67594 -150307 -71054 -214704 49195 33018 -213440 -10841 338601 149012 96156 -214918
19258b30990B2561J44521a30954D0825L7730b57613f8710k06556b9160m42723
$$ -230990 22561 167082 -130954 40825 78555 -257613 -68710 -275266 -29160 -471883
19248d71883B04009P028a6648k6999j67414K5063Q6294j50117f5004k82911B18197
$$ -471883 204009 211037 -16648 -43647 -211061 -185998 -99704 -249821 -65004 -347915 218197
19236E0833d31071J88807a2718B61298c00468C7107e07108a0542r1255l87296
$$ 50833 -431071 -242264 -12718 261298 -300468 37107 -507108 -10542 -101797 -489093
19226d89093H5675d9062a4159B6059b91401a35318p2142R6159k41645A71855C0672
$$ -489093 85675 -49062 -14159 26059 -291401 -135318 -207460 -111301 -352946 171855 30672
19214b89537j76140H690O1535c9671G3038k0522b22197p11A59344a80223H5584
$$ -289537 -465677 8690 70225 -39671 73038 52516 -222197 -222908 159344 -180223 85584
19202c00800O4653j89843a82409j11496A42816a64850P1992A53757j4574a39836
$$ -300800 -236147 -425990 -182409 -293905 142816 -164850 -92858 153757 139183 -139836
19191f1667A6170a89692B61757a27099A88418o8390a74462A0348a76341k46826
$$ -61667 16170 -189692 261757 -127099 188418 120028 -174462 10348 -176341 -423167
19181d23167A7487p759c9292j37612M1113B3727g0467l19188F3009D880b23229
$$ -423167 17487 9728 -39292 -176904 -135791 23727 -70467 -389655 63009 4880 -223229
19169a30198d9232I4465c61721h6650K2667m9612j88130a40455j4881k0187G8808
$$ -130198 -49232 94465 -361721 -86650 -63983 -113595 -301725 -140455 -155336 -175523 78808
19157A92451r3722K75443G0320k0771a67376I7689h8213k7943o6061f7008B01523
$$ 192451 98729 374172 70320 49549 -167376 97689 -88213 -116156 -182217 -67008 201523
19145a14882B33667d300A17296B0995c01586f6140q0564r184C58363C5734c80709
$$ -114882 233667 -4300 117296 20995 -301586 -66140 -146704 -155888 358363 35734 -380709
19133b01079k5291C02046A30152c2094k20933l37588a1266j97713A77555F998
$$ -201079 -226370 302046 130152 -32094 -253027 -590615 -11266 -208979 177555 6998
19122B33356B5797c17065O7592a1127N034j57150F482a1034n6834A05286N366
$$ 233356 25797 -317065 -249473 -11127 -6093 -163243 6482 -11034 -67868 105286 110652
19111A10652e29837g6432n1981E0497P3674L5133A0342a00152b4211o5414o9225
$$ 110652 -529837 -76432 -128413 50497 124171 159304 10342 -100152 -24211 -89625 -158850
19100a58850j56367J31034l7483l63709b4058M910A70746n9429a41732M3787l5246
$$ -158850 -315217 -184183 -221666 -585375 -24058 -19148 170746 111317 -141732 -97945 -133191
19089a33191e928G9870b54598I854a49539B38705b09502g5053C39282a4622C10730
$$ -133191 -5928 79870 -254598 9854 -149539 238705 -209502 -75053 339282 -14622 310730
19077h7314A73509H2911g2089j82630m5263A94176e9221I9380a98946E7102g7016
$$ -87314 173509 82911 -72089 -254719 -299982 194176 -59221 99380 -198946 57102 -77016
19065A10808b07802c1114A7471J35319a41342B21473h2919A49522o479l9570b21216
$$ 110808 -207802 -31114 17471 152790 -141342 221473 -82919 149522 143043 103473 -221216
19053A11391b41588P2275j55577B57970a09716j35487c6911n0421C5602L9857
$$ 111391 -241588 -169313 -324890 257970 -109716 -245203 -36911 -87332 35602 75459
19043G5459c13179J22550g1793A08950L0609J772i2349L5998j02747r2366G8706
$$ 75459 -313179 -190629 -71793 108950 139559 141331 -92349 -56351 -159098 -251464 78706
19031h5936E847d0031k9711B15292n5380Q5303C3754K54555m5271M6868C1393
$$ -85936 5847 -40031 -69742 215292 159912 245215 33754 288309 243038 289906 31393
19019G5658g7138A7262d919C09395g9825j74321D8998i2209C67317A8225b43619
$$ 75658 -77138 17262 -4919 309395 -79825 -254146 48998 -92209 367317 18225 -243619
19007d080A81673b13697E0833J05126a27241d8311A07948c31345J43296B02210
$$ -4080 181673 -213697 50833 155959 -127241 -48311 107948 -331345 -188049 202210
18996A14719e9922j62902A43311b37826a10687A50753b35085A26608c53627A80394
$$ 114719 -59922 -222824 143311 -237826 -110687 150753 -235085 126608 -353627 180394
18985b57532E8086N9165K3382a45827n7558A84746i3827a6657l10629j53026F6756
$$ -257532 58086 117251 140633 -145827 -203385 184746 -93827 -16657 -327286 -480312 66756
18973D2952L7521a33439q7848G874J80812D7721a64159G9245a0471C47029j53256
$$ 42952 80473 -133439 -221287 7874 188686 47721 -164159 79245 -10471 347029 193773
18962A93773G398b52374I6935c0552n8901D3842r163b98792J07536E4850a10642
$$ 193773 7398 -252374 96935 -30552 -89453 43842 34679 -298792 -191256 54850 -110642
18950f4634E0745J30699a2398j8151j02154c708m21710a29932A32005d06894R9269
$$ -64634 50745 181444 -12398 -30549 -132703 -3708 -425418 -129932 132005 -406894 -307625
18939c07625a4964j64078b0963j1543B25947c50104A0759e196E1107a54477f1641
$$ -307625 -14964 -179042 -20963 -32506 225947 -350104 10759 -5196 51107 -154477 -61641
18927A3815b12738B30744a09671A1077f869A8291K8461d36271b1200l79920a41411
$$ 13815 -212738 230744 -109671 11077 -6869 18291 46752 -436271 -21200 -401120 -141411
18915d4588F8453b02493k9190E605M8581a11194A48885i9677I8630R7577a09508
$$ -44588 68453 -202493 -231683 5605 54186 -111194 148885 -99677 98630 196207 -109508
18903A70918D5576r918a27712l46110b10396A87458O1000F5157a84123A80767
$$ 170918 45576 35658 -127712 -473822 -210396 187458 248458 65157 -184123 180767
18892A15655f6376B00954p4532f8365A65101m3511c35301a19544N459r9166N8360
$$ 115655 -66376 200954 126422 -68365 165101 121590 -335301 -119544 -114085 -213251 -154891
18881a54891k06089I5124b13616B03416e4685k06861C32104a50697A73732l3822
$$ -154891 -360980 95124 -213616 203416 -54685 -261546 332104 -150697 173732 139910
18871A39910k245d46342M1721H6807b64162d8716B12403g9551A90276a33791l17438
$$ 139910 137665 -446342 -404621 86807 -264162 -48716 212403 -79551 190276 -133791 -451229
18860d51229d9447B37849a7758A44803a108j98711D2558e7869p5196i313A12523
$$ -451229 -49447 237849 -17758 144803 -1108 -199819 42558 -57869 -133065 -9313 112523
18848b41914j61841b01268H568J82928j6607O0364e9011A97620c18253A03780
$$ -241914 -403755 -201268 8568 191496 174889 235253 -59011 197620 -318253 103780
18837A94567d59664a24397j29344J11100g449E4458b69563q4506g7177q3092E4752
$$ 194567 -459664 -124397 -253741 -142641 -7449 54458 -269563 -354069 -77177 -160269 54752
18825I9672a42842j75408i1824D02790a79322N1833j00607M3208o3347B39918
$$ 99672 -142842 -318250 -91824 402790 -179322 -127489 -228096 -184888 -248235 239918
18814b19291c7071C08998R8824a63229C0323c2067H7179K82505h3367A90537l2432
$$ -219291 -37071 308998 407822 -163229 30323 -32067 87179 369684 -83367 190537 158105
18803A58105a03984j72369j6424m200c9217p6656A88458b29293d7045k13475B31764
$$ 158105 -103984 -276353 -292777 -296977 -39217 -115873 188458 -229293 -47045 -260520 231764
18791i2830B20196j8554n7329k1140K6224a7777A55295f883j43890k01957A49030
$$ -92830 220196 201642 144313 123173 149397 -17777 155295 -6883 -150773 -352730 149030
18779b14170g311l94993d9058j01865G7376O5173B5694b03423N2638J8371j22289
$$ -214170 -7311 -402304 -49058 -150923 77376 142549 25694 -203423 -150785 -132414 -254703
18768b54703J24795a1771F5967Q1389l8062M499C3254b19517Q170n3632k42495
$$ -254703 -129908 -11771 65967 147356 109294 113793 33254 -219517 -211347 -264979 -507474
18757e07474a16317A18664j9732a92533K9240B014b69587q2039a07607O12n9626
$$ -507474 -116317 118664 98932 -192533 -163293 2014 -269587 -351626 -107607 -106995 -166621
18746a66621O4974L5000a0981o4876A09611b55020k59368G8825J48608a78470
$$ -166621 -101647 -66647 -10981 -75857 109611 -255020 -514388 78825 227433 -178470
18735b34116b5258B30283J585c09024E5185c0226q7574j10529l1382A45298f7340
$$ -234116 -25258 230283 231868 -309024 55185 -30226 -117800 -228329 -259711 145298 -67340
18723A15882d3834B25035j04576D6562J66853a22100E5634a80408n631M9206j07965
$$ 115882 -43834 225035 120459 46562 213415 -122100 55634 -180408 -186039 -136833 -244798
18712b44798e2160j88970A55861a39479B24646g2302J0962j08094K8831e9383
$$ -244798 -52160 -241130 155861 -139479 224646 -72302 -61340 -169434 -140603 -59383
18701f4606j60980J11295A01074A2233a03386n2920A12221C5397J76536a49011
$$ -64606 -225586 -114291 101074 12233 -103386 -156306 112221 35397 211933 -149011
18690A55323b99236J00430A13558e38673A89698H0413P948b66681a29591C70840
$$ 155323 -299236 -198806 113558 -538673 189698 80413 88361 -266681 -129591 370840
18679d84302G1039g067A78649D5210L70201a49163D4567a54646B24102m4776A2884
$$ -484302 71039 -7067 178649 45210 415411 -149163 44567 -154646 224102 179326 12884
18667I1849b58633a24710B7408a68683A91384b52735B86184a6727j82951C08307
$$ 91849 -258633 -124710 27408 -168683 191384 -252735 286184 -16727 -199678 308307
18656A50024g7360k19501e4883j39921G6542c12151i2338A7627g2665A94853A1294
$$ 150024 -77360 -296861 -54883 -194804 76542 -312151 -92338 17627 -72665 194853 11294
18644f0109j10452g5319j90243O0539O5135M5485l6555M1852j56755D8597e7998
$$ -60109 -170561 -75319 -265562 -205023 -139888 -94403 -130958 -89106 -245861 48597 -57998
18632B9531K15865b05688A43898h3369K2796l8158B8382b02028N7896j13048f84
$$ 29531 245396 -205688 143898 -83369 -60573 -98731 28382 -202028 -144132 -257180 -684
18620E5422d34190B5274a91302L6010H7632i3725A20016k3832a39577A7318J12149
$$ 55422 -434190 25274 -191302 -155292 87632 -93725 120016 96184 -139577 17318 129467
18609A29467i0233n0896C32051A39929e3834p0108j65084C06080a61705M5278
$$ 129467 -90233 -141129 332051 139929 -53834 -123942 -289026 306080 -161705 -116427
18599a16427l0748A11438c1531B4266O4048N2614b2974k76900i6128m6492r9616
$$ -116427 -147175 111438 -31531 24266 88314 140928 -22974 -299874 -96128 -142620 -242236
18588b42236A24883M482K1880l5771a8355B27651q5413c1632A72424G3376J04099
$$ -242236 124883 129365 151245 115474 -18355 227651 142238 -31632 172424 73376 177475
18577A77475P369g3964A31706J20418G0576a03126A10627m8994f0382C40577c32333
$$ 177475 184844 -73964 131706 252124 70576 -103126 110627 61633 -60382 340577 -332333
18565d5265J7685g552n5076A41988J30056a10294A40022c686H5260c73242A42110
$$ -45265 -27580 -7552 -62628 141988 272044 -110294 140022 -3686 85260 -373242 142110
18553a64290e1077n6890I2313a33264j24569J07690b3451D4882a58499B7999b49873
$$ -164290 -51077 -107967 92313 -133264 -257833 -150143 -23451 44882 -158499 27999 -249873
18541B5038b00934j3923K2958K7538M4114l13704D4202c89907i7072H9555d4873
$$ 25038 -200934 -214857 -191899 -164361 -120247 -433951 44202 -389907 -97072 89555 -44873
18529F7617a50909q0227R2387l7557A80151K21985c63310A5196R3838L59663j56887
$$ 67617 -150909 -231136 -138749 -176306 180151 402136 -363310 15196 109034 468697 311810
18518C11810j50339a04130A13486B7901c2296J4520j50988A29666b3342k12553
$$ 311810 161471 -104130 113486 27901 -32296 -17776 -168764 129666 -23342 -235895
18508b35895F8539B1784R7207a24876F4899b437B59355c06574B92249c78213C0750
$$ -235895 68539 21784 118991 -124876 64899 -2437 259355 -306574 292249 -378213 30750
18496D3809f3395j14164C93720a74561d3470B6011b33440l1505M4377N3416P8310
$$ 43809 -63395 -177559 393720 -174561 -43470 26011 -233440 -264945 -220568 -167152 -88842
18485h8842k15537J02825i3941A17104b36098B06722I0521l5078K37158j45975
$$ -88842 -304379 -201554 -93941 117104 -236098 206722 90521 55443 292601 146626
18475A46626B3706d71646K35723q8375B53703E5778a22817Q013G7434a94934e0159
$$ 146626 23706 -471646 -235923 -324298 253703 55778 -122817 -114804 77434 -194934 -50159
18463A4245L4885b54980c2229k881B63890b08286O541a3832j85446a8090l7612
$$ 14245 49130 -254980 -32229 -35110 263890 -208286 -201745 -13832 -199278 -18090 -55702
18452e5702A32687a93303j0392N1063j80446n310j16098b4993k68416F1619A0163
$$ -55702 132687 -193303 -203695 -152632 -333078 -338388 -454486 -24993 -293409 61619 10163
18440b7726k91342A96435n0689c25122a06774H375c9132P260A53494c30077C5783
$$ -27726 -319068 196435 145746 -325122 -106774 8375 -39132 -31872 153494 -330077 35783
18428f2217j3017j43335G281c08552A09921o87a57608B66530r2305G1891B8021
$$ -62217 -75234 -218569 7281 -308552 109921 109234 -157608 266530 174225 71891 28021
18416A1355Q7312b6367A47331i4233k02349B4360c10225M2501B07700b0045I2371
$$ 11355 98667 -26367 147331 -94233 -296582 24360 -310225 -267724 207700 -20045 92371
18404E2227c64848a22669A76184J1326g1524j96850j98971A00292a5259A7206
$$ 52227 -364848 -122669 176184 187510 -71524 -268374 -467345 100292 -15259 17206
18393b08209A67671J25672j8926b66544C37130H2758P0237C0849b60887E7583
$$ -208209 167671 293343 274417 -266544 337130 82758 152995 30849 -260887 57583
18382G6040f5325K1978j87590J14258A39879j2402b779j75945A21331i5046o7543
$$ 76040 -65325 -43347 -230937 -116679 139879 127477 -2779 -178724 121331 -95046 -162589
18371a62589f2015j17741c3752k4792j59199k06776a30596l7695P7566l4385A8372
$$ -162589 -62015 -179756 -33752 -58544 -217743 -424519 -130596 -168291 -90725 -125110 18372
18359a91870H415j769J33180a04636p8807B6787c12763J28567C35896a70289C3051
$$ -191870 8415 6646 139826 -104636 -183443 26787 -312763 -184196 335896 -170289 33051
18347A58288a36860k1600D28143a24509j09361f3122K1640k14511J1077A46438
$$ 158288 -136860 -158460 428143 -124509 -233870 -63122 -41482 -255993 -244916 146438
18336a41158m5158C7986K02537a71074G1949O2559B9812a59959c745q3516B22095
$$ -141158 -186316 37986 240523 -171074 71949 134508 29812 -159959 -3745 -87261 222095
18324b46798j7040m4832J43264e7102B5037O6335M1236d73564A18241b51145B18915
$$ -246798 -263838 -308670 -165406 -57102 25037 91372 132608 -473564 118241 -251145 218915
18312b28370C3436K6822O4996b54040R4041c9862p8562C5409e185k8304B62652
$$ -228370 33436 60258 125254 -254040 -159999 -39862 -118424 35409 -5185 -33489 262652
18300H7201f9424j8509J2505f810q7534A44434j8371k3908c08897D4755P1458
$$ 87201 -69424 -87933 -75428 -6810 -94344 144434 126063 102155 -308897 44755 116213
18289A16213h8654d2291l4307k29276a27145l9429A23828j9391c43386a0903B34821
$$ 116213 -88654 -42291 -76598 -305874 -127145 -166574 123828 104437 -343386 -10903 234821
18277A84928e5375m8381B06826o4124k6350B2216b3215o4325n3108A58073F9444
$$ 184928 -55375 -103756 206826 142702 116352 22216 -23215 -87540 -140648 158073 69444
18265e9862B87803c24152f4665F794i9865l0720B41548l4000c89695f6127H8846
$$ -59862 287803 -324152 -64665 6794 -99865 -130585 241548 207548 -389695 -66127 88846
18253b22114B09712c98790a33438f6605A22954B8961a00151L1423j38633O3645
$$ -222114 209712 -398790 -133438 -66605 122954 28961 -100151 -68728 -207361 -143716
18243a43716B2180K93384i1509B07801i4285j96404J19665K5399G3130f8254A52217
$$ -143716 22180 315564 -91509 207801 -94285 -290689 -171024 -145625 73130 -68254 152217
18231a01230b8986I1928a54820A05098d48993j342D30577E4263b0075k84065a40105
$$ -101230 -28986 91928 -154820 105098 -448993 -450335 430577 54263 -20075 -304140 -140105
18219b32937D08300q3991B1965a71447b9654r2566j90970L6444A7404J93509e5837
$$ -232937 408300 324309 21965 -171447 -29654 -122220 -313190 -276746 17404 210913 -55837
18207i1663B00656H211b7380A42506b74068R7072n427B62215c93732P963J16298
$$ -91663 200656 8211 -27380 142506 -274068 -176996 -182423 262215 -393732 -385769 -269471
18196b69471g0257B69264b11154l8463i5405C45041j57773D1242a55933p7345
$$ -269471 -70257 269264 -211154 -249617 -95405 345041 187268 41242 -155933 -233278
18186b33278L4654k96609f2047E279d3949A09268a45335A63386g254j18985F5326
$$ -233278 -198624 -495233 -62047 5279 -43949 109268 -145335 163386 -7254 -126239 65326
18174a15601q763C88886A0225a6161q6186j65907L8422A57303a35421F391J12520
$$ -115601 -124364 388886 10225 -16161 -102347 -268254 -229832 157303 -135421 6391 118911
18163A18911m5561L03768d8334j49323K596B79793b19807j04841a10986I0447
$$ 118911 73350 377118 -48334 -197657 -195061 279793 -219807 -324648 -110986 90447
18152E6533J02787i1231j09763H3494a90938C22147c1753A22092C4936b69341
$$ 56533 159320 -91231 -200994 83494 -190938 322147 -31753 122092 34936 -269341
18141B16816a13542j06948B2524a50054L9119l1175A36216o6255b04273B11571
$$ 216816 -113542 -220490 22524 -150054 -110935 -142110 136216 69961 -204273 211571
18130d46297J94058b9810a1149A92499r6243a14700m03157A80851o1580b18847
$$ -446297 -252239 -29810 -11149 192499 96256 -114700 -517857 180851 119271 -218847
18119a94145R4256B12312b95294b9371l0416B85614F2098a84065d8231D0490h2955
$$ -194145 -99889 212312 -295294 -29371 -59787 285614 62098 -184065 -48231 40490 -82955
18107d6831D5784P7345c12340h2400l4623l94220B46609b17285C1515d5651q212
$$ -46831 45784 123129 -312340 -82400 -117023 -511243 246609 -217285 31515 -45651 -53863
18096e3863l33205a85797A0642a51892j70001B2369a75575O9194a5671D05848
$$ -53863 -387068 -185797 10642 -151892 -321893 22369 -175575 -106381 -15671 405848
18085b29870A14925F642b16369L5267B7860a85954G6860K782b02996d7572k02160
$$ -229870 114925 6642 -216369 -181102 27860 -185954 76860 79642 -202996 -47572 -249732
18074b49732R5441g2460g398n2437k4119A01150L52253B2117a01614p7107B53450
$$ -249732 -154291 -72460 -7398 -59835 -83954 101150 453403 22117 -101614 -178721 253450
18062A42743a44816k3399Q3261H1994J39218c17947P0907P5132C23425a46666
$$ 142743 -144816 -168215 -84954 81994 221212 -317947 -247040 -171908 323425 -146666
18051C28362A0426J6240b40236g1018L3687j08113o0812e1253k71923B04729D9380
$$ 328362 10426 26666 -240236 -71018 -37331 -145444 -206256 -51253 -323176 204729 49380
18039b1872l53852A71032C963g8254B2093c5534m1889b5388p5260j11915A34583
$$ -21872 -375724 171032 3963 -78254 22093 -35534 -77423 -25388 -100648 -212563 134583
18027g2394k53196G5322b604k04510j67882A73686b43039G8634a98083M9758B08248
$$ -72394 -325590 75322 -2604 -207114 -374996 173686 -243039 78634 -198083 -148325 208248
18015a03105j47679P1925e2118m6799d024j1562E16827a00655j24372C2375L196
$$ -103105 -250784 -178859 -52118 -98917 -4024 -15586 516827 -100655 -225027 32375 35571
18004C5571E977K9156e2191A40509c41868A30792o5025f5495A28173b43794L6961
$$ 35571 5977 35133 -52191 140509 -341868 130792 65767 -65495 128173 -243794 -206833
17993b06833J4514D9554a66995c9155k33830j69648B8667P9740K524Q1781b6722
$$ -206833 -192319 49554 -166995 -39155 -272985 -442633 28667 108407 110931 192712 -26722
17981A63153a7217j98180M5345b0234j92717O8544B54285b45707G9007e6987a3378
$$ 163153 -17217 -215397 -170052 -20234 -212951 -144407 254285 -245707 79007 -56987 -13378
17969F6036i4935n1407j46141h4236H7271b91607C9852A602K5421L4457O6597
$$ 66036 -94935 -146342 -292483 -84236 87271 -291607 39852 1602 27023 61480 128077
17958A28077D3233B0379K77810H7715b7983r3769K8913k45110A15072J63771A00309
$$ 128077 43233 20379 298189 87715 -27983 -121752 -92839 -337949 115072 278843 100309
17946F8125J15445e7875k09462F0364i6936A47656p0599J9092c9849n4083m882
$$ 68125 183570 -57875 -267337 60364 -96936 147656 77057 96149 -39849 -93932 -98814
17935i8814C6409h507n5006j32121o0843P4517A23037a16939C19970A36692c591
$$ -98814 36409 -8507 -63513 -195634 -256477 -181960 123037 -116939 319970 136692 -3591
17923a8214p4942k04491A9604f591A20969J18126a84906C9151O3496b55402a01429
$$ -18214 -93156 -297647 19604 -6591 120969 239095 -184906 39151 102647 -255402 -101429
17911F529a24341j60514C417i9264o2558M7693e3829p046A84718E5825J90895
$$ 6529 -124341 -284855 3417 -99264 -161822 -114129 -53829 -60875 184718 55825 246720
17900B46720c67012g1277A7473K84406j28946a94585A32806b33146D5973b15731
$$ 246720 -367012 -71277 17473 301879 172933 -194585 132806 -233146 45973 -215731
17889A52097o4833k7182D649J66156b0514n1476B04079o8740E740J81313b27370
$$ 152097 87264 60082 4649 170805 -20514 -71990 204079 135339 5740 187053 -227370
17877C07030g9049j74310H6799a54914A91626J745G7337A5762c07971E2433D568
$$ 307030 -79049 -253359 86799 -154914 191626 193371 77337 15762 -307971 52433 4568
17865a64063D50034j60707e4876A28658a40115n5242C9722a58576e8419D57678
$$ -164063 450034 289327 -54876 128658 -140115 -195357 39722 -158576 -58419 457678
17854A77556a63612A76433e2930F3771c38956A11056a04017m885A45561K2451
$$ 177556 -163612 176433 -52930 63771 -338956 111056 -104017 -108902 145561 168012
17844A68012L3218d9019F7401R5048i6560q0962A62206a24732D5362P6931J2153
$$ 168012 201230 -49019 67401 162449 -96560 -177522 162206 -124732 45362 122293 134446
17833A34446B7150a84018G079J03961a53669E1764Q7949a19033j39038Q7729O9643
$$ 134446 27150 -184018 7079 111040 -153669 51764 139713 -119033 -258071 -170342 -100699
17822a00699A83017A8131q792J33080a21597k132q9060D23963I8905c31264J28043
$$ -100699 183017 18131 9339 142419 -121597 -123729 -212789 423963 98905 -331264 -203221
17811b03221o2122P2276A07772m6004R3479i1267A82789k3659b96228C88285A26330
$$ -203221 -265343 -193067 107772 61768 155247 -91267 182789 159130 -296228 388285 126330
17799A7226L456J07749J23403n1363l3468o0966l6723R921J56750a17605A15409
$$ 17226 20682 128431 251834 200471 167003 106037 69314 79235 235985 -117605 115409
17787F7526J71135j6070J17068i4479C9855c9601B99073i1233p6027A24456j6038
$$ 67526 238661 222591 339659 -94479 39855 -39601 299073 -91233 -167260 124456 108418
17776A08418K9764b62931C9985L9981J73638j25509b53005R3092F8629K5160d4566
$$ 108418 138182 -262931 39985 79966 253604 128095 -253005 -159913 68629 93789 -44566
17764A3526a04873L1827M177A77702a29350d7366A00645K00793j5720A19251b7744
$$ 13526 -104873 -73046 -68869 177702 -129350 -47366 100645 301438 285718 119251 -27744
17752a11373B07088b49437A61020a00394j56180G7042R7469R917d1882m1363k26678
$$ -111373 207088 -249437 161020 -100394 -256574 77042 174511 184428 -41882 -83245 -309923
17741c09923c2250a1143B36133c19232b7361m645q5578L2639C2299A1318R5891
$$ -309923 -32250 -11143 236133 -319232 -27361 -32006 -117584 -84945 32299 11318 107209
17730A07209A7027K1466N8369a88271B67624A22599b60179J24876A57122p1561
$$ 107209 17027 38493 96862 -188271 267624 122599 -260179 -135303 157122 85561
17720H5561A6443P9926f6923C17618a93795C3973J91430d5054H3186b12998E5766
$$ 85561 16443 96369 -66923 317618 -193795 33973 225403 -45054 83186 -212998 55766
17708A60225a10630C17509a22601H0549L76617i9510B44242c7984A29484l1953
$$ 160225 -110630 317509 -122601 80549 457166 -99510 244242 -37984 129484 97531
17698I7531h8773E366e1147A4257R5379b2839A42630e9544j32043Q2874j85550
$$ 97531 -88773 5366 -51147 14257 109636 -22839 142630 -59544 -191587 -108713 -294263
17687b94263B10719b76132i4410G6988c4891l8675A39998a34959A04944L4637
$$ -294263 210719 -276132 -94410 76988 -34891 -73566 139998 -134959 104944 139581
17677A39581a19426B54616q6769A8956K1813c5738B39841D9936K07496b6613I0036
$$ 139581 -119426 254616 167847 18956 40769 -35738 239841 49936 257432 -26613 90036
17665A92214E0222M29315c9804j84070F591a97858B01432b82869J32357E2891
$$ 192214 50222 479537 -39804 -223874 6591 -197858 201432 -282869 -150512 52891
17654G9890A3732J03531a33485L0220N916A62743m0018r520c614B5940b31285
$$ 79890 13732 117263 -133485 -103265 -97349 162743 122725 113205 -3614 25940 -231285
17642A8150a50113A58005j79i38H2135J07590c8333A55604b7596o6160D170J70096
$$ 18150 -150113 158005 157826 -938 82135 189725 -38333 155604 -27596 -93756 4170 174266
17630A74266J54601j08807N1814c879B68618A834b18293A02997a40277A41908
$$ 174266 328867 220060 271874 -3879 268618 1834 -218293 102997 -140277 141908
17619a21772p9128A20035a07805d8953E6118b46386J03332b1075j79674b0841
$$ -121772 -200900 120035 -107805 -48953 56118 -246386 -143054 -21075 -200749 -20841
17608A73526c8278n4438l8071M5901H6196N035c63738A65878m8641a19408A65489
$$ 173526 -38278 -92716 -130787 -84886 86196 91231 -363738 165878 117237 -119408 165489
17596i745B01243b22368M6698D74619B0712J8581R463d5528J2554A632h0678L371
$$ -9745 201243 -222368 -175670 474619 20712 39293 48756 -45528 -32974 1632 -80678 -77307
17584g7307n694R76B829J65878i0168B14841r0164J72933G5479B2505Q4949a4957
$$ -77307 -83001 -82025 2829 168707 -90168 214841 124677 297610 75479 22505 107454 -14957
17571B3512N2756d38666A29441g3494A66618a15544A95512p9879J6071n0369f8434
$$ 23512 76268 -438666 129441 -73494 166618 -115544 195512 115633 131704 81335 -68434
17559b21959Q0134H2913K5880A9965f9653j46208E41041k24019p1989r5097M4381
$$ -221959 -141825 82913 108793 19965 -69653 -215861 541041 317022 245033 149936 194317
17548A94317K7628k7300a18616K6770D4117J50132P7855A23003D4558a72167H5881
$$ 194317 221945 194645 -118616 -91846 44117 194249 272104 123003 44558 -172167 85881
17536g0543C90621B6962p673f5780C7414b1532B15875q2842B8472J00234J4120
$$ -70543 390621 26962 19289 -65780 37414 -21532 215875 133033 28472 128706 142826
17525A42826M12320c22238J48697j27918B73704F1614J31148K18410j44919l5778
$$ 142826 555146 -322238 -173541 -301459 273704 61614 192762 411172 266253 230475
17515B30475J09337a03497d5903j19010E00721A2367b70381E2400M07062A65906
$$ 230475 339812 -103497 -45903 -164913 500721 12367 -270381 52400 459462 165906
17504a52873a6144l0324A76974F1230O4103A7704M52020A20375p706a83118B33166
$$ -152873 -16144 -46468 176974 61230 125333 17704 469724 120375 112669 -183118 233166
17492A71527g0323A27327d535j49760D0818a12273L4785C10816j41380a70027
$$ 171527 -70323 127327 -4535 -154295 40818 -112273 -77488 310816 169436 -170027
17481B74482j44a60759e712j04906B10794E799b9284E0548J17186o7642a75306
$$ 274482 274338 -160759 -5712 -110618 210794 5799 -29284 50548 167734 100092 -175306
17469b9287F9281K27674a42462C25853A31235b12958B20813K42652A48968n6940
$$ -29287 69281 296955 -142462 325853 131235 -212958 220813 463465 148968 92028
17459I2028L9420n4284b925I4030J33500a6759r5643B90506L4488P3053A30036
$$ 92028 131448 77164 -2925 94030 227530 -16759 -112402 290506 324994 398047 130036
17447B74694J49130K2817F2612K07240j07512O9624n2922R192C6486J57287L4377
$$ 274694 423824 446641 62612 269852 162340 231964 179042 188234 36486 193773 228150
17436B28150r2391N1214M49085j64882o7740J1154r9792h2571A15110g1490A97173
$$ 228150 135759 186973 636058 471176 403436 414590 314798 -82571 115110 -71490 197173
17424E91789A76581l7847j4110K71651A80762K98473C5290J90044K63606A48426
$$ 591789 176581 138734 124624 396275 180762 479235 35290 225334 488940 148426
17413B65557J05927D1133K0220R9270L4034A4969L44421j74607A6640K22961f5465
$$ 265557 371484 41133 61353 160623 194657 14969 359390 184783 16640 239601 -65465
17401A11663g9263C20878G2997J10393B5054b35535A22447E2265a69281B72447
$$ 111663 -79263 320878 72997 183390 25054 -235535 122447 52265 -169281 272447
17390D19442A6858h2904B15693h486A07369C1680Q2767K13788j06967L2120N5035
$$ 419442 16858 -82904 215693 -8486 107369 31680 114447 328235 221268 253388 308423
17379C08423J20688A72844a3327B63764n7354L18502H2217L4454a95580f6271
$$ 308423 429111 172844 -13327 263764 206410 524912 82217 116671 -195580 -66271
17368C27390J46693B05246a30659A69617A0190i9386A48155c35429D8335P39J14123
$$ 327390 474083 205246 -130659 169617 10190 -99386 148155 -335429 48335 49074 163197
17357A63197C012J50921L55967j29962A72973m4306a15861A20988E1933M8908
$$ 163197 3012 153933 509900 379938 172973 128667 -115861 120988 51933 100841
17347A00841L9954L08248A03306J76637k2728A3153P02L51559P3449D9404i832
$$ 100841 140795 449043 103306 279943 257215 13153 13855 365414 438863 49404 -9832
17335E36004a74147C71399A66417b58213G5752a5170H4937K89609A73014b57836
$$ 536004 -174147 371399 166417 -258213 75752 -15170 84937 374546 173014 -257836
17324G633J61881c7824A15474M8243O5519J4975L76049k30409j06212A00431R0578
$$ 7633 169514 -37824 115474 163717 229236 244211 620260 389851 283639 100431 191009
17313A91009N2072p8793c123A13859J02726a78875B47244m7727P6791b18823G5718
$$ 191009 243081 164288 -3123 113859 216585 -178875 247244 199517 276308 -218823 75718
17301B0297q119b4978A62867k1479O6991p0512J55166A6342J73938K37654A10018
$$ 20297 12178 -24978 162867 141388 208379 137867 293033 16342 190280 427934 110018
17289c26907C85402b19284C37061r8810L4831H0913O026a26716A16811J53325
$$ -326907 385402 -219284 337061 238251 273082 80913 86939 -126716 116811 270136
17279B70136A349K81785j7944i8853C12232E1673L65118q6743K6407f781j15927
$$ 270136 1349 283134 265190 -98853 312232 51673 416791 330048 356455 -6781 -122708
17268a22708A83116d3571B7601J68519n2690J47473A36183f6785B42190a38652
$$ -122708 183116 -43571 27601 196120 143430 290903 136183 -66785 242190 -138652
17257H2838K1062J26026D2412K6271J09642K19721J372l0673E5768J12558J80165
$$ 82838 103900 229926 42412 68683 178325 398046 399418 368745 55768 168326 348491
17246C48491j58713a44701c4832B16769m9402F0789d758B10485A6745M8400K33803
$$ 348491 189778 -144701 -34832 216769 167367 60789 -4758 210485 16745 65145 298948
17235B98948c6354B60372m5365R5196N4991J60335g8233C16374l079j0065n0057
$$ 298948 -36354 260372 215007 310203 365194 525529 -78233 316374 313295 303230 253173
17224B53173A11615k045D8509d6051C55843h2653D52589n1503q5588p6305j7384
$$ 253173 111615 109570 48509 -46051 355843 -82653 452589 401086 315498 239193 221809
17213B21809A10781B788b20623B80948k7815J05924O2423A60479n1393J03758
$$ 221809 110781 2788 -220623 280948 253133 359057 421480 160479 109086 212844
17203B12844K40225n9370J26154o8217c5929B81572b676A66746O9960Q8429l4132
$$ 212844 453069 393699 519853 451636 -35929 281572 -2676 166746 236706 325135 291003
17192B91003J09287A44761K87314H0035m71J19252P6080k144o246n4493l9001
$$ 291003 400290 144761 432075 80035 79564 198816 274896 272752 266506 212013 173012
17181A73012K9154N934a84669F13745j10596B09388o3209L33363A29594j5832
$$ 173012 202166 208100 -184669 613745 503149 209388 146179 479542 129594 113762
17171A13762M0302R3580j15255J24019P3814j29972r789K51712J62747j87280
$$ 113762 154064 247644 132389 256408 330222 200250 190461 442173 604920 417640
17161D17640O2445B33648P7464C7765K46208j10027l1852J2275K52907j89312
$$ 417640 480085 233648 311112 37765 283973 173946 142094 154369 407276 217964
17151B17964J39832A66728M81109j89648j98571K49540j02109Q9901A61334M10842
$$ 217964 357796 166728 647837 458189 259618 509158 407049 496950 161334 572176
17141E72176p1907A76558E0335J43655K64594j77846L41309k50997F8569J60482
$$ 572176 500269 176558 50335 193990 458584 280738 622047 371050 68569 229051
17131B29051J80808j54471L44714B81856M2301A9250P22187A20604K23390K04956
$$ 229051 409859 255388 600102 281856 324157 19250 741437 120604 343994 548950
17121E48950A63138F9464L09544R4883A19070B0747M57025N3591H4316L79860
$$ 548950 163138 69464 379008 473891 119070 20747 477772 531363 84316 464176
17111D64176N994P0901o8084P2868k24192J78619Q6483j76434J48303A93485M26923
$$ 464176 470170 541071 472987 545855 321663 500282 586765 410331 558634 193485 620408
17100F20408j94876k12128O6214L3401Q1356L7657n4668J7201P4898j54455K1381
$$ 620408 425532 213404 279618 313019 394375 432032 377364 394565 469463 315008 336389
17089C36389K44253B14928J2747K04667R0950j92962k7727l9755N37280k91912
$$ 336389 580642 214928 227675 432342 523292 330330 302603 262848 800128 508216
17079E08216J68405q843M0531C06550N58220C56854K97896M6992R1710l43864
$$ 508216 676621 667778 708309 306550 864770 356854 654750 701742 793452 449588
17069D49588J09432J51011B74579K83596J33609A66786J74002j0289L5620n8128
$$ 449588 559020 710031 274579 558175 691784 166786 340788 330499 366119 307991
17059C07991J75322K1956j50953A52165Q7882J80651L00336j82957J30138j13839
$$ 307991 483313 505269 354316 152165 240047 420698 721034 538077 668215 554376
17049E54376l0140Q6500j27341K20753k5165j52847K57552O469j66228L60321
$$ 554376 524236 610736 483395 704148 678983 526136 783688 790157 623929 984250
17039I84250D09935N5881J59263K3481r6995k52657J90251r0323J70327J10873
$$ 984250 409935 465816 625079 648560 551565 298908 489159 398836 569163 680036
17029F80036j93927q9071N01800l49028L53962j59241J35088j70842l08260p5388
$$ 680036 486109 397038 898838 549810 903772 744531 879619 708777 400517 325129
17019C25129L41753j48125L56327r3975j12034k5744L4263P8094o8548J09068
$$ 325129 666882 518757 875084 781109 669075 643331 677594 755688 687140 796208
17009G96208R9055K8625M5923k81821N6666J18752k4358j75335k49190M07281
$$ 796208 895263 923888 969811 687990 744656 863408 839050 663715 414525 821806
16999H21806R8030l13454J27737j06552K71783o603M1579k03905m2890M45216
$$ 821806 919836 606382 734119 627567 899350 892747 934326 730421 687531 1132747
16989A132747k59558l68520L54699M3670k83783J11596Q1519j80706M00350r1556
$$ 1132747 873189 504669 859368 903038 619255 730851 812370 631664 1032014 940458
16979I40458M3641q8739j4082M017J78735m4385l38710K73697O1600j1047p7672
$$ 940458 984099 895360 881278 885295 1064030 1019645 680935 954632 1016232 1005185 927513
16968I27513J36631j37911O3920M4771J73857l6082l47138P2739j39378N0112
$$ 927513 1064144 926233 990153 1034924 1208781 1172699 825561 898300 758922 809034
16958H09034K21512J80596P477j38589N6451r2441Q640k42584m0802P30191j35402
$$ 809034 1030546 1211142 1218619 1080030 1136481 1044040 1052680 810096 769294 1499485 1364083
16947A364083m3950J08408l68668n2782j45441N2207M20368j44715R0851p5538
$$ 1364083 1320133 1428541 1059873 1007091 861650 913857 1334225 1189510 1280361 1204823
16937A204823m7978N9015J29745r2834J08193o6932K33610j74206N27995n58703
$$ 1204823 1156845 1215860 1345605 1252771 1360964 1294032 1527642 1353436 1881431 1322728
16927A322728L09511m11961M05527k99460L25204k00320j03621K21852K26827
$$ 1322728 1632239 1220278 1625805 1326345 1651549 1451229 1347608 1569460 1796287
16918A796287l53926L6062l8250J43347N2889j7327N4383m12527P60842l58605
$$ 1796287 1442361 1478423 1440173 1583520 1636409 1619082 1673465 1260938 2021780 1663175
16908A663175Q1511r5858l23408N52517l09572L11385j23733k38995J62965P474
$$ 1663175 1744686 1648828 1325420 1877937 1568365 1879750 1756017 1517022 1679987 1687461
16898A687461J06454r8518O20955l91883K5330K30378j08898m4257k0038J00764
$$ 1687461 1793915 1695397 2316352 1924469 1949799 2180177 2071279 2027022 2006984 2107748
16888B107748j77459M20533k73038J8303J24475j3545j42846K15730R6917k55046
$$ 2107748 1930289 2350822 2077784 2096087 2220562 2207017 2064171 2279901 2376818 2121772
16878B121772N21939m39978N75744l19361R7461l930R7713K46515m31197L5589
$$ 2121772 2643711 2203733 2779477 2460116 2557577 2553647 2651360 2897875 2466678 2502267
16868B502267K37846L8570r5292J70977l11615L42724J49811n5647K14288k75844
$$ 2502267 2740113 2778683 2683391 2854368 2542753 2885477 3035288 2979641 3193929 2918085
16858B918085K79101k46445j02267M13456j24116K067M41681j77778L5389K18790
$$ 2918085 3197186 2950741 2848474 3261930 3137814 3139881 3581562 3403784 3439173 3657963
16848C657963P7160k78343r6547K69119J70306j15028M646K81536L38601j39003
$$ 3657963 3735123 3456780 3360233 3629352 3799658 3684630 3689276 3970812 4309413 4170410
16838D170410J75276m28921J93286J07881K70712J43108K79460l05633J73600
$$ 4170410 4345686 3916765 4110051 4217932 4488644 4631752 4911212 4605579 4779179
16829D779179n5918J84752l1360J29028O2447J39404K87091R1798j66766n7255
$$ 4779179 4723261 4908013 4876653 5005681 5068128 5207532 5494623 5586421 5419655 5362400
16819E362400M31816J15872l7541N32878m4198q4726K80475m1660L84181k90888
$$ 5362400 5794216 5910088 5872547 6405425 6361227 6276501 6556976 6515316 6899497 6608609
16809F608609O03161j46124R8427j14389N89599L83203r4924j35651M01819L30616
$$ 6608609 7211770 7065646 7164073 7049684 7639283 8022486 7927562 7791911 8193730 8524346
16799H524346K27406J1099N29190k971L6771L45558M19513k84509N52284K63504
$$ 8524346 8751752 8762851 9292041 9289070 9325841 9671399 10090912 9806403 10358687 10622191
16789A0622191M65877L68065N40748j38312L88352K4330N78408O06206M93123
$$ 10622191 11088068 11456133 11996881 11858569 12246921 12271251 12849659 13455865 13948988
16780A3948988K36768J74155N80605N24905L01859M93028O77216L72017K24664
$$ 13948988 14185756 14359911 14940516 15465421 15767280 16260308 16937524 17309541 17534205
16771A7534205P71670J062184N03085O82397L31902J132168R09207R00854P58217
$$ 17534205 18305875 19368059 19871144 20553541 20885443 22017611 22926818 23827672 24585889
16762B4585889O61825J272180J570378O78051J213255J378190R69041J454708
$$ 24585889 25247714 26519894 28090272 28768323 29981578 31359768 32328809 33783517
16754C3783517J569177J556189J610221J486749J879857K267037K071523K521573
$$ 33783517 35352694 36908883 38519104 40005853 41885710 44152747 46224270 48745843
16746D8745843K251054K318791K828442L076135L215889L359742L754023M097661
$$ 48745843 50996897 53315688 56144130 59220265 62436154 65795896 69549919 73647580
16738G3647580L576775M489341M649416N062724N522821N444428N584114O803218
$$ 73647580 77224355 81713696 86363112 91425836 96948657 102393085 107977199 114780417
16730A14780417O161322O962914O865030P368807O957695P290911O965099O289370
$$ 114780417 120941739 127904653 134769683 142138490 149096185 156387096 163352195 169641565
16722A69641565O636788N503631N037718L572355K874624J953188M62445p68414
$$ 169641565 176278353 181781984 186819702 190392057 193266681 195219869 195682314 194913900
16714A94913900j666077l159319l931047n028637n654611o129907o810350p055559
$$ 194913900 193247823 190088504 186157457 181128820 175474209 169344302 162533952 155478393
16706A55478393p296807p190179p698592o825604o835270o557262o324424o020838
$$ 155478393 148181586 140991407 133292815 126467211 119631941 113074679 106750255 100729417
16698A00729417n699589n176255n523312m709929m332819m292730m106274l197070
$$ 100729417 95029828 89853573 84330261 79620332 75287513 70994783 66888509 63691439
16690F3691439l599707l008107l042982k528984k552892k702928k325611k047174
$$ 63691439 60091732 57083625 54040643 51511659 48958767 46255839 43930228 41883054
16682D1883054j722469k085331j756836j548784j614859j537122j019715j646554
$$ 41883054 40160585 38075254 36318418 34769634 33154775 31617653 30597938 28951384
16674B8951384j176726j193158r16556r06802q57854r80060j004278o29134j094606
$$ 28951384 27774658 26581500 25664944 24758142 23900288 22920228 21915950 21286816 20192210
16665B0192210l43628j044153l03692j427045J73255q62017j06971p46617l42970
$$ 20192210 19848582 18804429 18500737 17073692 17246947 16384930 16277959 15531342 15188372
16656A5188372p42168m73438k79949o80851k28648k1316m48986k87988o24099
$$ 15188372 14446204 13972766 13692817 13011966 12783318 12762002 12313016 12025028 11400929
16647A1400929l49229m91613J06869m60509k07203q1826o82003l33859M36285
$$ 11400929 11051700 10560087 10666956 10206447 9999244 9917418 9235415 8901556 9337841
16638I337841j072230j5767J38674k73307l66640L2105l05729N097l61917R8477
$$ 9337841 8265611 8249844 8388518 8115211 7748571 7780676 7474947 7480044 7118127 7216604
16628G216604k44222j43453M2300o92854j71202K02416l23979r0289l22911L43009
$$ 7216604 6972382 6828929 6871229 6178375 6007173 6209589 5885610 5795321 5472410 5815419
16618E815419m9894m17970j30629m7497l05481R7119j9608j64575j34654M0645
$$ 5815419 5765525 5347555 5216926 5169429 4863948 4961067 4941459 4776884 4642230 4682875
16608D682875m60239N1652k53565K72178j08380p8101k1656j0734p4618j03454
$$ 4682875 4222636 4274288 4020723 4292901 4184521 4106420 4084764 4074030 3999412 3895958
16598C895958l70834K31567O3173k23741k5351J70262o42644O0928q1209K69770
$$ 3895958 3525124 3756691 3819864 3596123 3570772 3741034 3098390 3159318 3078109 3347879
16588C347879q3148R124l07081j43007M3255j54807K0231j29117K36167j41544
$$ 3347879 3264731 3273855 2966774 2823767 2867022 2712215 2732446 2603329 2839496 2697952
16578B697952j18882J60305k89220j38057M19262k76861P054k49813O191L13325
$$ 2697952 2579070 2739375 2450155 2312098 2731360 2454499 2461553 2211740 2217931 2531256
16568B531256j65007m0400m081l3486m3517j30619k00358J37553j9649k71916
$$ 2531256 2366249 2325849 2321768 2288282 2244765 2114146 1913788 2051341 2031692 1759776
16558A759776L63576k41939K24124r3868L8778o9578M4012m75553L09393q2959
$$ 1759776 2123352 1881413 2105537 2011669 2050447 1980869 2024881 1549328 1858721 1775762
16548A775762K2140k79479L39761j43025K44751k65911n4851l62790K70326R2011
$$ 1775762 1797902 1518423 1858184 1715159 1959910 1693999 1639148 1276358 1546684 1638695
16538A638695j7727j19533Q521j99444L55239k67956M2816l65073N17012q9478
$$ 1638695 1620968 1501435 1509956 1310512 1665751 1397795 1440611 1075538 1592550 1503072
16528A503072l85741N01362j03592l22847K11582o7623j46734j02934J40497k3585
$$ 1503072 1117331 1618693 1515101 1192254 1403836 1336213 1189479 1086545 1227042 1203457
16518A203457L6j84170K35820k38026j84992J4611L72723J29418j92071j54057
$$ 1203457 1203493 1019323 1255143 1017117 832125 846736 1219459 1348877 1156806 1002749
16508A002749M01232l84961j25791J40621O996k0624m7884k8068J95450j28703
$$ 1002749 1403981 1019020 893229 1033850 1040846 1020222 972338 944270 1139720 1011017
16498A011017J71569q0307j47925K78412j36932j86938O0720n7822r6641M07293
$$ 1011017 1182586 1102279 954354 1232766 1095834 908896 969616 911794 815153 1222446
16488A222446l00675k4898J17260J9669L949J34263l45485J73915j94116L8096
$$ 1222446 921771 896873 1014133 1033802 1037751 1172014 826529 1000444 806328 844424
16478H44424J67299j61456C79565K57134K31420L77680F13478O091K1184j09513
$$ 844424 1011723 850267 379565 636699 868119 1245799 613478 619569 640753 531240
16468E31240J5039j20053L95604q9824K9459J78726m7548B86748K83734j2737
$$ 531240 546279 426226 821830 732006 761465 940191 892643 286748 570482 557745
16458E57745K05532l1198L8559m6704k8860m3678K89604m06188n9959J99727q6778
$$ 557745 763277 732079 770638 723934 695074 651396 941000 534812 474853 674580 587802
16447E87802N1298k15418M36002l74512L01825C16885L32209O8487C40934L59457
$$ 587802 639100 423682 859684 485172 786997 316885 649094 717581 340934 700391
16437G00391n6302j90583O8220N2172F7725M00540M1841k16195J26735L52586
$$ 700391 644089 453506 521726 573898 67725 468265 510106 293911 420646 773232
16427G73232j65056r8240k07915K78993B11996M11325k65456K40773K08349J40612
$$ 773232 608176 509936 302021 581014 211996 623321 357865 598638 806987 947599
16417I47599m12056L27974D09888Q4691B20397n7566O19447l18533j5231A65251
$$ 947599 535543 863517 409888 494579 220397 162831 782278 463745 448514 165251
16406C73079J00632m5536L03609C09797K47473O6114A56170J80707p7722H8319
$$ 373079 473711 428175 731784 309797 557270 623384 156170 336877 259155 88319
16395C92656m7954J81053j97819j50945M59052k76639K9285k4344J7068F4068
$$ 392656 344702 525755 327936 176991 636043 359404 388689 364345 381413 64068
16384D37009j1513A6108N04476B02366K87256E8683L93693A08712m8885J39510
$$ 437009 425496 16108 520584 202366 489622 58683 452376 108712 59827 199337
16374A99337J83783r6723J3592J09424N2920A61955K31020l0668k8247A45846
$$ 199337 383120 286397 299989 409413 462333 161955 392975 362307 334060 145846
16363A34629L27901j06571p4626J11133A25461L21917j05688a05906B84855A087
$$ 134629 462530 355959 281333 392466 125461 447378 341690 -105906 284855 1087
16352D85709A72866K35539k0831A41178L33327j32469G286K05240l5501J78447
$$ 485709 172866 408405 387574 141178 474505 342036 7286 212526 177025 355472
16342C55472K21526k67427A25493R833L98021j12203k06421J20455A42022L4269
$$ 355472 576998 309571 125493 135326 533347 421144 214723 335178 142022 176291
16332A76291L1912N2743m7378a03133b7922B63750q7939L7612m8230M3708C2866
$$ 176291 208203 260946 213568 -103133 -27922 263750 175811 213423 165193 208901 32866
16320E4431J4441K02340A16406L2325L04606B8190P5350P4063J94471J31892k19715
$$ 54431 68872 271212 116406 148731 453337 28190 103540 177603 372074 503966 284251
16309B84251B2948K46168p6352K39997j47358M5817C2073J38394D6408J09786
$$ 284251 22948 269116 192764 432761 285403 331220 32073 170467 46408 156194
16299A56194j6577M3696o6369J01882q5054L1157g0148I7915L16422j81263j02980
$$ 156194 139617 183313 116944 218826 133772 164929 -70148 97915 414337 233074 130094
16288A30094K62330A19771J88092p5110A02068a25003B25553L35636I0877K77237
$$ 130094 392424 119771 307863 232753 102068 -125003 225553 561189 90877 368114
16278C68114H544K43772G9540J67345J65368F6280K01512k5787P2585e5430o2141
$$ 368114 8544 252316 79540 246885 412253 66280 267792 242005 314590 -55430 -117571
16267a17571B21399L19497k05658A26809i264A83019M0092a52421l6418D7010
$$ -117571 221399 540896 335238 126809 -9264 183019 223111 -152421 -188839 47010
16256B882L31617A8840a3495B14285k1441A4228c01004B2687K42438I4035A224
$$ 2882 334499 18840 -13495 214285 192844 14228 -301004 22687 265125 94035 1224
16244i071C3356K0275K03494c6691m4810A72452k2216J52040r9752J45349I5734
$$ -9071 33356 53631 257125 -36691 -81501 172452 150236 302276 202524 347873 95734
16232B08193Q7107r3542n807G8931R3330f2925B67601G7214C2325J9041k2020
$$ 208193 295300 201758 195951 78931 172261 -62925 267601 77214 32325 51366 29346
16221B9346L9038J94307a23323C82704a8460A96701g2217b4087j26341I7337a04166
$$ 29346 68384 262691 -123323 382704 -18460 196701 -72217 -24087 -150428 97337 -104166
16209d1235P915B9723K27587H5613a8046A69614c0098i827A33345q894a72760
$$ -41235 -33320 29723 257310 85613 -18046 169614 -30098 -9827 133345 124451 -172760
16197a33356C62756F594K71092b15996h558k54031D037L2734P2530J55456l2594
$$ -133356 362756 6594 277686 -215996 -8558 -262589 4037 36771 109301 264757 232163
16186B32163i0739I8612a13694A97773f0962r5214A10018n1353J06121b859j18568
$$ 232163 -90739 98612 -113694 197773 -60962 -156176 110018 58665 164786 -2859 -121427
16175a21427C9110j104a38697I3439m0352a11238c0122j615I9155c13341L2661
$$ -121427 39110 38006 -138697 93439 53087 -111238 -30122 -31737 99155 -313341 -280680
16164b80680q9677G7981B627J15741f7370A95130J12501H3981R2834D0893d77478
$$ -280680 -370357 77981 2627 118368 -67370 195130 307631 83981 176815 40893 -477478
16152c8755C16466d5480Q460G876M8605L5757a6773B51644c28436e5883j94344
$$ -38755 316466 -45480 -37020 7876 56481 92238 -16773 251644 -328436 -55883 -250227
16141b50227b4538k55208E6522J11137j1870a60440o0352C24598A1502Q7649j9608
$$ -250227 -24538 -279746 56522 167659 155789 -160440 -220792 324598 11502 99151 79543
16130G9543a13338A12585f8498A24722Q1649q0686A244K4108Q5859a23321k5256
$$ 79543 -113338 112585 -68498 124722 206371 125685 1244 25352 111211 -123321 -148577
16119a48577d6217E5470g1006b1960k4913A00295M7381c6668m8264K9254j5900
$$ -148577 -46217 55470 -71006 -21960 -46873 100295 147676 -36668 -84932 -55678 -71578
16108g1578A79627a40087J688B9068b02187B31768a2928A55109J35171H9405a74988
$$ -71578 179627 -140087 -138399 29068 -202187 231768 -12928 155109 290280 89405 -174988
16096C24716g3979M926j51852a10142G3343J39788a89683A48162o6860L0936a54150
$$ 324716 -73979 -69053 -220905 -110142 73343 213131 -189683 148162 81302 112238 -154150
16084a21822C06285e9001B45173a14213A36496l7358N7089a07890j62830g2033
$$ -121822 306285 -59001 245173 -114213 136496 99138 156227 -107890 -270720 -72033
16073b44604o688J464A69076K53979j74140a07037B1390n640K64035d1514A72920
$$ -244604 -251292 -249828 169076 423055 248915 -107037 21390 15750 279785 -41514 172920
16061b20749H7884b67575A31690K59158a26176d5851l5056h648k93130B15226
$$ -220749 87884 -267575 131690 390848 -126176 -45851 -80907 -8648 -301778 215226
16050I8318L44980b6541B15134K21450a41899C34645E511R1028b31721O0310P7251
$$ 98318 443298 -26541 215134 436584 -141899 334645 5511 96539 -231721 -171411 -94160
16039i4160A45984k7114B5103c8403A81234J17886a46792D1487b08341A4167P1458
$$ -94160 145984 118870 25103 -38403 181234 299120 -146792 41487 -208341 14167 85625
16028H5625b16267J01345B01323a31759j43739i952A32913B0312L9471N0326C2578
$$ 85625 -216267 -114922 201323 -131759 -275498 -9952 132913 20312 59783 110109 32578
16016c3887m6541a5762p6376m9177j38272a12289m474c6911A13676J11962g8931
$$ -33887 -80428 -15762 -92138 -141315 -279587 -112289 -116763 -36911 113676 225638 -78931
16004a51319I7372k5239c07030a27419q0223o250L0978e5051A69702e3419H2395
$$ -151319 97372 72133 -307030 -127419 -207642 -213892 -182914 -55051 169702 -53419 82395
15992A02835b27524J03062j88659D12236a49826m4698A02220P3844J49377l1422
$$ 102835 -227524 -124462 -313121 412236 -149826 -194524 102220 176064 325441 294019
15982B94019q8304R0959m1826l0466B792K25835a2760B28181g6278q5731B29980
$$ 294019 205715 296674 254848 224382 2792 228627 -12760 228181 -76278 -162009 229980
15970a55718B29955q9151C6906a25272C39721D3234J79825a54310I9912a73167
$$ -155718 229955 140804 36906 -125272 339721 43234 223059 -154310 99912 -173167
15959D3960K5027a05506j10902A9204J66651J36035c35224P6364A21956b96053
$$ 43960 68987 -105506 -216408 19204 185855 321890 -335224 -258860 121956 -296053
15948E0242a74539O398A58759c37576h5920A99286a19744l6986C8019G293i62
$$ 50242 -174539 -168141 158759 -337576 -85920 199286 -119744 -156730 38019 7293 -962
15936i1175J0182m3804l3044l0531h6708D9071a27233m9109B12460b07015B60880
$$ -91175 -80993 -124797 -157841 -188372 -86708 49071 -127233 -176342 212460 -207015 260880
15924c34630A57236f6318A53870G3108A9375b47096a04645J8122A82683D280d2770
$$ -334630 157236 -66318 153870 73108 19375 -247096 -104645 -86523 182683 4280 -42770
15912e32486B04550b35022E1712b88571l4024f5538b3134j33572A04167K05718
$$ -532486 204550 -235022 51712 -288571 -322595 -65538 -23134 -156706 104167 309885
15902C09885a05328p5713C52510a1009A69939b02142J7306A15886D1363M5825
$$ 309885 -105328 -181041 352510 -11009 169939 -202142 -184836 115886 41363 87188
15892H7188a5611E2155O5353c49670P4848Q5536q8463B57541b28475a14200D379
$$ 87188 -15611 52155 117508 -349670 -274822 -189286 -277749 257541 -228475 -114200 4379
15880B10659b67415C48497a47972a2040C3654b42487i4021j58406B12953B9997
$$ 210659 -267415 348497 -147972 -12040 33654 -242487 -94021 -252427 212953 29997
15869f5076b3711j32983A25365a30104p0887B32452B4136a24228k94684B08552
$$ -65076 -23711 -156694 125365 -130104 -200991 232452 24136 -124228 -418912 208552
15858b17333c8012k73558C04207i1780a3821A92482i2907b9916A88272I469a21594
$$ -217333 -38012 -311570 304207 -91780 -13821 192482 -92907 -29916 188272 9469 -121594
15846G566a60097A9764J40230K67151G2893I701Q4441a52682H1538J12613i448
$$ 7566 -160097 19764 159994 427145 72893 9701 94142 -152682 81538 194151 -9448
15834d28911a44344j9245A99922a8056A38004b46986a1921H4331i5062d6120K635
$$ -428911 -144344 -163589 199922 -18056 138004 -246986 -11921 84331 -95062 -46120 -43485
15823d3485m737j07621A16634P4585J49311C0818R8528b25725A06833h6457B74551
$$ -43485 -48222 -155843 116634 191219 340530 30818 129346 -225725 106833 -86457 274551
15811b25307A0808k544R367c14202l29d4723E9722J06706g0808F7818c29735a59801
$$ -225307 10808 8264 17631 -314202 -314531 -44723 59722 166428 -70808 67818 -329735 -159801
15798G584B433K8017a22339j02111d577j12351p5948D53702B1690a7490D5266
$$ 7584 2433 30450 -122339 -224450 -4577 -116928 -192876 453702 21690 -17490 45266
15786B2232R0455m6474P7842E030h8760C19828e5192b4099j09930M4198j93088
$$ 22232 112687 66213 144055 5030 -88760 319828 -55192 -24099 -134029 -89831 -282919
15775b82919H9532M5986a05672j12959D7714B0180b44672j5203A44758F0799a99576
$$ -282919 89532 135518 -105672 -218631 47714 20180 -244672 -259875 144758 60799 -199576
15763a38410j5159l64564B7821f0912A86193b2994D0029J03458h3901C01949a62774
$$ -138410 -153569 -518133 27821 -60912 186193 -22994 40029 143487 -83901 301949 -162774
15751A66402A0255M1556O7032a60689l579C18544n6647a7620p6684k8714k69803
$$ 166402 10255 51811 118843 -160689 -164268 318544 261897 -17620 -94304 -123018 -392821
15740c92821A74629P3588a06751o9551j50649a03627A4145J20992B8649J62764
$$ -392821 174629 248217 -106751 -176302 -326951 -103627 14145 135137 28649 191413
15730A91413L9163f4144a8651r9454q4290e7699a5515j22113J6519j97335a02392
$$ 191413 230576 -64144 -18651 -118105 -202395 -57699 -15515 -137628 -121109 -318444 -102392
15718H1428a42295A36009a6673k25108D3540h2739B0000a4414A01117B6966a21329
$$ 81428 -142295 136009 -16673 -241781 43540 -82739 20000 -14414 101117 26966 -121329
15706A77880a48219P0622F7652b39921c885j65370E5536a95311l1332A95182h0064
$$ 177880 -148219 -77597 67652 -239921 -3885 -169255 55536 -195311 -226643 195182 -80064
15694C26757g1659A62891J04065H3446P4440C9612d77102a75910c1891L553G873
$$ 326757 -71659 162891 266956 83446 157886 39612 -477102 -175910 -31891 -28338 7873
15682b11922D5466a5116j28096l03774J95745j8761B68382H3134d0417n794I9329
$$ -211922 45466 -15116 -143212 -446986 -251241 -270002 268382 83134 -40417 -46211 99329
15670H8014b55147f9596C46213I7504J87972b1343m25940A269c10661P2460i1750
$$ 88014 -255147 -69596 346213 97504 285476 -21343 -447283 1269 -310661 -238201 -91750
15658B87591B313c36954C8988K6921J4090i878o7743A76019b31789G1694Q782
$$ 287591 2313 -336954 38988 65909 79999 -9878 -77621 176019 -231789 71694 80476
15647H0476a38899j23238C23717I7498J39016F747M892L70845a70917e8747a9444
$$ 80476 -138899 -262137 323717 97498 236514 6747 11639 382484 -170917 -58747 -19444
15635c6449A55343M4624b31363Q8810A44961J65486b39757F5336a23817B55058
$$ -36449 155343 199967 -231363 -142553 144961 310447 -239757 65336 -123817 255058
15624E1942a47046I8013b24491h597G534N6449i336k2884j7192E2106b00815A59049
$$ 51942 -147046 98013 -224491 -8597 7534 63983 -9336 -32220 -49412 52106 -200815 159049
15611a95450a5654j8318I3842a03090j55A21050D528a97251Q7551H7230F282K68221
$$ -195450 -15654 -33972 93842 -103090 -103245 121050 4528 -197251 -109700 87230 6282 274503
15599B74503B0895a7452A63335b34574b703k25518A20778J1737a38898j10144
$$ 274503 20895 -17452 163335 -234574 -2703 -228221 120778 132515 -138898 -249042
15589b49042A25174n4962J32906J0526d2537j39314D83017a46059o68m9637L6275
$$ -249042 125174 70212 203118 213644 -42537 -181851 483017 -146059 -146727 -196364 -160089
15578a60089J3668L309K2845K0176L8394C4742Q0972b16020A00892a55157b2460
$$ -160089 -146421 -143112 -120267 -100091 -61697 34742 115714 -216020 100892 -155157 -22460
15566H671c27254n4046C48895c9765F6653b71318g9624a9851j13777A13824o795
$$ 8671 -327254 -381300 348895 -39765 66653 -271318 -79624 -19851 -133628 113824 107029
15555A07029b77936a04659B54747b6990j39779F4082a00543L9102A59515b06910
$$ 107029 -277936 -104659 254747 -26990 -166769 64082 -100543 -61441 159515 -206910
15544c9907j87917B02568f5146b0423H9402M5718a16750H9949i7705l9713j08376
$$ -39907 -227824 202568 -65146 -20423 89402 135120 -116750 89949 -97705 -137418 -245794
15533b45794i5912B98606A04569J717C0657f337D97343I0727P3253K53667A10852
$$ -245794 -95912 298606 104569 106286 30657 -6337 497343 90727 163980 417647 110852
15521D6032J68314c9971C66006a42131b5959B91279d7626A51718R9196J54406
$$ 46032 214346 -39971 366006 -142131 -25959 291279 -47626 151718 250914 405320
15511D05320e0496C58358G111K74015D2181a60138r0971o5755j2079D6880a14981
$$ 405320 -50496 358358 7111 281126 42181 -160138 -251109 -316864 -328943 46880 -114981
15499H4946J64722k6446h1621A42861b6408p1265C0712b37047h6868j24694l285
$$ 84946 249668 223222 -81621 142861 -26408 -97673 30712 -237047 -86868 -211562 -214847
15488b14847J4120A45863I562J00373b71999A30916e4829q1137r3057I0860b30912
$$ -214847 -200727 145863 9562 109935 -271999 130916 -54829 -135966 -229023 90860 -230912
15476c8855l13716J53419h0635L6456B19853j05076h7391B39198m6688J7064I7972
$$ -38855 -352571 -199152 -80635 -44179 219853 114777 -87391 239198 192510 209574 97972
15464H0518b31981A34480n8768Q4020b524r7405l81232a53814k09829C5578a87346
$$ 80518 -231981 134480 75712 159732 -2524 -99929 -481161 -153814 -363643 35578 -187346
15452c11568C08427f8604D40866D588c9377p0026c9874P659j37018N8395b8676
$$ -311568 308427 -68604 440866 4588 -39377 -109403 -39874 -32215 -169233 -110838 -28676
15440A19443b20238j19092A6335J66964M5170h2970k87068b6172j10703B09444
$$ 119443 -220238 -339330 16335 183299 228469 -82970 -370038 -26172 -136875 209444
15429f4494G8515d3855n4012j43833B83285d5938j93703Q5817r4563a07243r0919
$$ -64494 78515 -43855 -97867 -241700 283285 -45938 -239641 -153824 -248387 -107243 -198162
15418a98162P276R4508q7020G2448M5086h4680B20444b75389A28298o1559o822
$$ -198162 -190886 -96378 -183398 72448 117534 -84680 220444 -275389 128298 66739 59917
15407E9917a9466j15888L2604B4422Q2545A7905J14825b35254B30536a08002B71305
$$ 59917 -19466 -135354 -102750 24422 106967 17905 132730 -235254 230536 -108002 271305
15395g9935l0434n7248B64633c14811I4097a216k63982b7160j48037A20971d7790
$$ -79935 -110369 -167617 264633 -314811 94097 -1216 -265198 -27160 -175197 120971 -47790
15383d56080C23584A03532a05258M6235A60820a11324D72914a2652A16516a06831
$$ -456080 323584 103532 -105258 -59023 160820 -111324 472914 -12652 116516 -106831
15372a4333A79448a9150A19448a95193f2381k7015E4144a41297k3535J5912L8443
$$ -14333 179448 -19150 119448 -195193 -62381 -89396 54144 -141297 -164832 -148920 -110477
15361a10477H9858J2615D6034A2877K5480b52478G5491C3242a63663M4114H6282
$$ -110477 89858 102473 46034 12877 38357 -252478 75491 33242 -163663 -119549 86282
15349A500i7379B6219N6735a49317e4425j61500B62758i6438d8209A89346b28644
$$ 1500 -97379 26219 82954 -149317 -54425 -215925 262758 -96438 -48209 189346 -228644
15337g7861q421l2809C9147L69429A0126J07757f9781A55911R7358e6848B53455
$$ -77861 -86282 -119091 39147 408576 10126 117883 -69781 155911 253269 -56848 253455
15325a42498C0561J81063n2516C0971b36435C99029A15693a46687J7599j31395
$$ -142498 30561 211624 159108 30971 -236435 399029 115693 -146687 -129088 -260483
15315b60483Q2561j3568d4572A6109L8969N0933b6431H0390M8771a93129g4229
$$ -260483 -177922 -191490 -44572 16109 55078 106011 -26431 80390 129161 -193129 -74229
15303C8584M35011b02976B66186b52149B26512n2804a65709P2611J7869l37839
$$ 38584 473595 -202976 266186 -252149 226512 173708 -165709 -93098 -75229 -413068
15293d13068A87446A0557a10908C22834a7371A53271p4281K50075d9952B26346
$$ -413068 187446 10557 -110908 322834 -17371 153271 78990 329065 -49952 226346
15282d8182o1565B32360n9282m0887h4861n69C31098E123L16209h0G8039l7444
$$ -48182 -109747 232360 173078 132191 -84861 -85430 331098 5123 321332 -80 78039 40595
15270D0595b20337j08259D753J96594a15252A56883P3177F77J75168R7657L5983
$$ 40595 -220337 -328596 4753 201347 -115252 156883 230060 677 175845 273502 309485
15259C09485A07488R000R6966C6248J2628N4550i7812I976M28991J00305O11052
$$ 309485 107488 116488 213454 36248 48876 103426 -97812 9976 438967 539272 1150324
15248A150324l6929k61802N39005n98874k06531a90205B85691I0347K04067A07530
$$ 1150324 1113395 851593 1390598 791724 585193 -190205 285691 90347 294414 107530
15237B84861a7190n3095F8804i5969E6734e5159E9343a16009n2082L4311E1431
$$ 284861 -17190 -70285 68804 -95969 56734 -55159 59343 -116009 -168091 -133780 51431
15225A20072B9189a03107A38693B4831e5315g265A85079D0427A0962d5442D53092
$$ 120072 29189 -103107 138693 24831 -55315 -7265 185079 40427 10962 -45442 453092
15213A26636l8437k4564M6865c26129H04a66710B12581o1232J81928A55287k961
$$ 126636 88199 63635 110500 -326129 804 -166710 212581 151349 333277 155287 152326
15202A52326a64176E1236R237g1581k1609G6129j4422c6559C83355B5817a6853
$$ 152326 -164176 51236 60473 -71581 -93190 76129 61707 -36559 383355 25817 -16853
15190a5400A44681f2844B90748j28495O0408R9331c0276d925A96145g7358E0739
$$ -15400 144681 -62844 290748 162253 222661 321992 -30276 -4925 196145 -77358 50739
15178a64574B71087j05225G7728J47734b8149B3990K75303L1610C0289a55977
$$ -164574 271087 165862 77728 225462 -28149 23990 299293 330903 30289 -155977
15167B6273c4607l5190k77241C84448B5567a95037d2067B58385L4783g4140j17778
$$ 26273 -34607 -69797 -347038 384448 25567 -195037 -42067 258385 293168 -74140 -191918
15156a91918g1848A10320K9207J37290H5670a9150h742A69652N5814a51856B27158
$$ -191918 -71848 110320 139527 276817 85670 -19150 -8742 169652 225466 -151856 227158
15144I6335a30096a4503A37442i894B9172g1640k70274A83322c1099A91539a63544
$$ 96335 -130096 -14503 137442 -9894 29172 -71640 -341914 183322 -31099 191539 -163544
15132a64665A88482d4522A18535A307K05195d8440B69330L7073J14602b63626
$$ -164665 188482 -44522 118535 1307 206502 -48440 269330 306403 421005 -263626
15121A79678F5622j948J75965I7735a3482C05299E1126K68466a55202B05712G3992
$$ 179678 65622 63674 239639 97735 -13482 305299 51126 319592 -155202 205712 73992
15109A69194F2763A2050J48998F1562Q8894Q6323B3072J21275K32456r5092o0852
$$ 169194 62763 12050 161048 61562 150456 236779 23072 144347 376803 281711 220859
15098B20859E8102M94533a81168A89033q4174K5787k4443J74706r4383j667m2836
$$ 220859 58102 552635 -181168 189033 104859 130646 106203 280909 186526 184859 142023
15087A42023a57770l4939C89329p8522p1618n633g165B75764O7527h717B34196
$$ 142023 -157770 -192709 389329 310807 239189 233556 -7165 275764 343291 -8717 234196
15075A15664J70401a78859B03137b49881A88346Q6203e1602A42412N977j4873
$$ 115664 286065 -178859 203137 -249881 188346 274549 -51602 142412 148389 133516
15065A33516M2287h1752L2691G0316a89900D95900F6631M3335K62408A13761e4100
$$ 133516 175803 -81752 -49061 70316 -189900 495900 66631 109966 372374 113761 -54100
15053B89871n0217D0356K45213d9133C63243c1794A97372d0668A30056n8057a27877
$$ 289871 239654 40356 285569 -49133 363243 -31794 197372 -40668 130056 71999 -127877
15041B18620K93801A62256A6353f3512B8176R3757K0442g0521A13613P4095a36132
$$ 218620 512421 162256 16353 -63512 28176 121933 142375 -70521 113613 187708 -136132
15029B10940L5662j20099B8243K4687J66731D7452M03780j78272E2523q231d1160
$$ 210940 246602 126503 28243 52930 219661 47452 451232 272960 52523 44292 -41160
15017f1946l7662C96775j66395e082l5117B71438h3522B29542j3406M6026c5013
$$ -61946 -99608 396775 230380 -5082 -40199 271438 -83522 229542 216136 262162 -35013
15005A57230e6795A85363E591J50558d6242I618J08969f9555D79532a78278A14309
$$ 157230 -56795 185363 5591 156149 -46242 9618 118587 -69555 479532 -178278 114309
14993A21125m2374a3410A76471n663B1374M93200A60207M68450c2760B19735q1459
$$ 121125 78751 -13410 176471 170808 21374 514574 160207 628657 -32760 219735 138276
14982A38276j1891Q8531K77996A69748M5326M4990j09151K82201A71130P1303
$$ 138276 126385 214916 492912 169748 215074 260064 150913 433114 171130 242433
14972B42433J88633A89919J80682J05261j37182R0738n7271A71530K66336k2286
$$ 242433 431066 189919 370601 475862 338680 429418 372147 171530 437866 415580
14962D15580j96852g0807C07147j7454k0095P7654J5601A68561J53587K62992
$$ 415580 218728 -70807 307147 289693 269598 347252 362853 168561 322148 585140
14952E85140k13743k1370r9029A17897E6603O56751A42986K46114A8094J96572
$$ 585140 371397 350027 250998 117897 56603 713354 142986 389100 18094 214666
14942B14666P7376j6641B7789K19945Q3485A46654M7462L14542k16963A24542
$$ 214666 292042 275401 27789 247734 331219 146654 194116 508658 291695 124542
14931D41315j93787C9674J47003J15577A05883M13768B01467P6952R0021F7586
$$ 441315 247528 39674 186677 302254 105883 519651 201467 278419 368440 67586
14920E05926o8299B12765l2442L61015j06895j46300J07927R3823B19380J08574
$$ 505926 437627 212765 180323 541338 434443 288143 396070 489893 219380 327954
14910C27954j9696A00496j8088K29065K12993k09057J29469j98200L13993k40089
$$ 327954 308258 100496 82408 311473 524466 315409 444878 246678 560671 320582
14900C20582d1964F84699B90983H3397M11069j44086J38622d8029B24518g4253
$$ 320582 -41964 684699 290983 83397 494466 350380 489002 -48029 224518 -74253
14889C25534J83090A58105K76628j10589L0191n756D0918K54376J85706j37675
$$ 325534 508624 158105 434733 324144 354335 348579 40918 295294 481000 343325
14879C43325A60664M76840C14800a43984B10524P1806A30857L36689l2083j82272
$$ 343325 160664 637504 314800 -143984 210524 282330 130857 467546 435463 253191
14869B53191r9215M16822B74113J42934j37965Q4194A77550M32506k49219n044
$$ 253191 153976 570798 274113 417047 279082 363276 177550 610056 360837 355793
14859C55793R9917r7629m3060Q3328J08048P9024j66918j79690K34199B15490
$$ 355793 455710 358081 315021 398349 506397 585421 418503 238813 473012 215490
14848D79494k6086J82360j17459p5569K69381j96912J14943q3831j15595J03481
$$ 479494 453408 635768 518309 442740 712121 515209 630152 546321 430726 534207
14838E34207j31337L6357j91449L59136l5950m4915B19133L79206j3691k71594
$$ 534207 402870 439227 247778 606914 570964 526049 219133 598339 584648 313054
14828C13054E1958K89050J32601r0067j986J17577j48172P6662P8080q3640K9019
$$ 313054 51958 341008 473609 383542 381556 499133 350961 427623 505703 422063 451082
14817D51082O0876J62374j09747B40105J89034N29857f3638E03343J66700G5558
$$ 451082 511958 674332 564585 240105 429139 958996 -63638 503343 670043 75558
14806B62923K82227K25764k8228l24612K99907j23325j52755M052J41331L741
$$ 262923 545150 770914 742686 418074 717981 594656 441901 445953 587284 591025
14796E91025p3281N9705r5129M60819k46149k44012J01379P1443j47362L5213
$$ 591025 517744 577449 482320 943139 696990 452978 554357 625800 478438 513651
14786E13651A41862O06682j90776K48565l75310M73195m10080L4512r5950k08328
$$ 513651 141862 748544 557768 806333 431023 904218 494138 528650 432700 224372
14776B24372O9120K58490K74623k86153r8485j1134L1074J45722m344j85157p8305
$$ 224372 293492 551982 826605 540452 441967 430833 461907 607629 603285 418128 339823
14765C39823N28486k34733R4342j37920K17547B29020P33867k19795M6008K21140
$$ 339823 868309 633576 727918 589998 807545 229020 962887 743092 789100 1010240
14755A010240l14920k46661L32440k073p2268J06083N5691L03730n39812N0384
$$ 1010240 695320 448659 781099 779026 706758 812841 868532 1172262 632450 682834
14745F82834M6811L62851k94319J30522o8035k7953l03647K11665j41527Q2277
$$ 682834 729645 1092496 798177 928699 860664 832711 529064 740729 599202 681479
14735F81479K00399l27225J72864k88110P49910l04896Q0436k22049j93328j24979
$$ 681479 881878 554653 727517 439407 1189317 884421 964857 742808 549480 424501
14725D24501M23776o8064j47675j70063L71182j32235L09373k98262J21370j8935
$$ 424501 848277 780213 632538 462475 833657 701422 1010795 712533 833903 814968
14715H14968R1361J99295l02324K71445q805l2251k52448J32640k1303o3178J60309
$$ 814968 906329 1105624 803300 1074745 1065940 1033689 781241 913881 892578 829400 989709
14704I89709k69704L11279l2783k86446J23814j32859K42502J8640j32887J73869
$$ 989709 720005 1031284 998501 712055 835869 703010 945512 964152 831265 1005134
14694A005134D52807K61435K0285K11467p5105J4409j13253K0027O9873O2656
$$ 1005134 452807 714242 734527 945994 870889 885298 772045 792072 861945 924601
14684I24601J47431r8575K609K01355j37758L27408E97448N39211M5210m83169
$$ 924601 1072032 973457 976066 1177421 1039663 1367071 597448 1136659 1181869 698700
14674F98700K76235J34324o5403J10440K09351l37346j25237M30926l48142K48756
$$ 698700 974935 1109259 1043856 1154296 1363647 1026301 901064 1331990 983848 1232604
14664A232604k34888J50721j58173p9410K82180k31537K03114j89290J46946L43996
$$ 1232604 997716 1148437 990264 910854 1193034 961497 1164611 975321 1122267 1466263
14654A466263m55779L29938j53m17539L24502n9996o4915K84147j64291R6951
$$ 1466263 1010484 1340422 1340269 922730 1247232 1187236 1122321 1406468 1242177 1339128
14644A339128J13317j20640O6186m46648L82346Q5852j96001N2075j38098J30019
$$ 1339128 1452445 1331805 1397991 951343 1333689 1419541 1223540 1275615 1137517 1267536
14634A267536k0300J80507L30958k96716l37240J41237K10608k40131O10223o13151
$$ 1267536 1247236 1427743 1758701 1461985 1124745 1265982 1476590 1236459 1846682 1233531
14624A233531N21857l2172l07308J97366m0511l99122J18421J97270K75433m53613
$$ 1233531 1755388 1723216 1415908 1613274 1572763 1173641 1292062 1489332 1764765 1311152
14614A311152O1610P9320k5501L72070j64592j89609K01634j35323o4796M32074
$$ 1311152 1372762 1452082 1426581 1798651 1634059 1444450 1646084 1510761 1445965 1878039
14604A878039k58300J21694l67936L97484L9863j02396m30734L44595K04627j92264
$$ 1878039 1619739 1741433 1373497 1770981 1810844 1708448 1277714 1622309 1826936 1634672
14594A634672l4910L19721j79813J23342Q898L59004l35094L8890R2186J01216
$$ 1634672 1599762 1919483 1739670 1863012 1871910 2230914 1895820 1934710 2026896 2128112
14584B128112k91967J7473k8216L2322p9395L59680R8953j77888J12397k74751
$$ 2128112 1836145 1853618 1825402 1857724 1778329 2138009 2236962 2059074 2171471 1896720
14574A896720L51385r9329L73702l10071K78981j79038Q9988O9519j14625j84150
$$ 1896720 2248105 2148776 2522478 2212407 2491388 2312350 2402338 2471857 2357232 2173082
14564B173082L79466J22006O4546K72174j1820l64736J60228L20293j59108M38324
$$ 2173082 2552548 2674554 2739100 3011274 2999454 2634718 2794946 3115239 2956131 3394455
14554C394455q023M36231J50081N68541J121781J164894L344264Q867835J9129988
$$ 3394455 3386432 3822663 3972744 4541285 5663066 6827960 10172224 19040059 38170047
14545C8170047J6658776B5288316A0385997m997554k260565j50168m61359q62860
$$ 38170047 54828823 25288316 10385997 5388443 3127878 2977710 2516351 1653491
14537A653491L84822k36265J05702J84933N2681l329Q1065j87861L75003k53196
$$ 1653491 2038313 1802048 1907750 2092683 2145364 2142035 2223100 2035239 2410242 2157046
14527B157046m1529j21548K44865J62652N3806o1163r5139L63222j13948P8455
$$ 2157046 2115517 1993969 2238834 2401486 2455292 2394129 2298990 2662212 2548264 2626719
14517B626719J37345J26903M70o1069q029j86601R2369P4057J46381J21050l40283
$$ 2626719 2764064 2890967 2891437 2830368 2822339 2635738 2728107 2802164 2948545 3069595 2729312
14506B729312L88413k22714K89449j13624L8046Q0521j57406J53322k73130O9839
$$ 2729312 3117725 2895011 3184460 3070836 3108882 3189403 3031997 3185319 2912189 2982028
14496B982028M36885l3683j10753L00432j61617K20316n11436O01447l25257L63211
$$ 2982028 3418913 3385230 3274477 3574909 3413292 3633608 3122172 3723619 3398362 3761573
14486C761573J25634k42000J94233N5281Q0646K04856J7359O7581m44425J30484
$$ 3761573 3887207 3645207 3839440 3894721 3975367 4180223 4197582 4265163 3820738 3951222
14476C951222K99003R0756q9838j15491K33756J28447O949k22580L78699k20918
$$ 3951222 4250225 4340981 4251143 4135652 4369408 4497855 4504804 4282224 4660923 4440005
14466D440005J80198j06363K71963M2138P7900l00697J31108P57981j08651k39166
$$ 4440005 4620203 4513840 4785803 4827941 4905841 4605144 4736252 5494233 5385582 5146416
14456E146416L35293j67583M53449k82854L00879k14482q9196l369N26345l54381
$$ 5146416 5481709 5314126 5767575 5484721 5785600 5571118 5481922 5478553 6004898 5650517
14446E650517N03395k85008M56880m09507P03724Q044m82394J15847k47951O46594
$$ 5650517 6153912 5868904 6325784 5916277 6620001 6628045 6145651 6261498 6013547 6660141
14436F660141P805M36772l43795L0544J10527J91589K71932l33923J87344L48528
$$ 6660141 6667946 7104718 6760923 6791467 6901994 7093583 7365515 7031592 7218936 7567464
14426G567464J55554k6041L06805j80712M36668l58395J7949N82948J30212r9823
$$ 7567464 7723018 7696977 8003782 7823070 8259738 7901343 7919292 8502240 8632452 8532629
14416H532629Q8724M50054Q0032r6570L04143R5365j98354K46004M45668M9498
$$ 8532629 8621353 9071407 9151439 9054869 9359012 9454377 9256023 9502027 9947695 9997193
14406I997193J67064j24935L62090Q5718O11393j95057N05996N4365m5546J89168
$$ 9997193 10164257 10039322 10401412 10487130 11098523 10903466 11409462 11463827 11418281 11607449
14396A1607449J43300L20043P3057J52904K28208O20442m69659M48959L31542
$$ 11607449 11750749 12070792 12143849 12296753 12524961 13145403 12675744 13124703 13456245
14387A3456245K88174L72698L43767k74697N87302q4115N03331M72533n3897O84213
$$ 13456245 13744419 14117117 14460884 14186187 14773489 14689374 15192705 15665238 15611341 16295554
14377A6295554m152J87549M62152J44381Q78510J97230J59355M49848K52201N39823
$$ 16295554 16291402 16478951 16941103 17085484 17963994 18161224 18320579 18770427 19022628 19562451
14367A9562451K19269M89038M16342J63208Q31819N55343K97700P10831L03212
$$ 19562451 19781720 20270758 20687100 20850308 21682127 22237470 22535170 23246001 23549213
14358B3549213M26419O64868L45612N84350Q21330K76714R66950O96030M78357
$$ 23549213 23975632 24640500 24986112 25570462 26391792 26668506 27635456 28331486 28809843
14349B8809843P16881J113260L02847Q73546P92808J148934R35849P71608J001750
$$ 28809843 29526724 30639984 30942831 31816377 32609185 33758119 34693968 35465576 36467326
14340C6467326Q26805Q48954J140731J205081J306064J323735R03411J841067
$$ 36467326 37294131 38143085 39283816 40488897 41794961 43118696 44022107 45863174
14332D5863174J019129J503177J279222J579633J821188J890054J465013J900806
$$ 45863174 46882303 48385480 49664702 51244335 53065523 54955577 56420590 58321396
14324E8321396J913459K183132J882926K694039K201156K220008K736068L119537
$$ 58321396 60234855 62417987 64300913 66994952 69196108 71416116 74152184 77271721
14316G7271721K778202K819920L450755L468330L069103M490353L701342M264545
$$ 77271721 80049923 82869843 86320598 89788928 92858031 97348384 101049726 105314271
14308A05314271M317667M808438M741711N381864N698460O200547O200749O720770
$$ 105314271 109631938 114440376 119182087 124563951 130262411 136462958 142663707 149384477
14300A49384477P003083P272359Q192059Q625250Q901675R694101R677704J0963022
$$ 149384477 156387560 163659919 171851978 180477228 189378903 199073004 208750708 219713730
14292B19713730J1040502J1941571J2141797J3101541J3694520J4142693J4419827
$$ 219713730 230754232 242695803 254837600 267939141 281633661 295776354 310196181
14285C10196181J5280653J4894288J5585962J5608674J5665228J5067182J4765206
$$ 310196181 325476834 340371122 355957084 371565758 387230986 402298168 417063374
14278D17063374J3976813J2876748J1281628R824588Q194786N739921K433380
$$ 417063374 431040187 443916935 455198563 465023151 473217937 478957858 481391238
14271D81391238j574308l759229k015212m099393o703375o941505r664898j0247225
$$ 481391238 479816930 476057701 474042489 469943096 463239721 456298216 446633318 436386093
14263D36386093j2344333j3460689j4759544j5549999j5699393j6462022j6155152
$$ 436386093 424041760 410581071 395821527 380271528 364572135 348110113 331954961
14256C31954961j5086382j4643697j4604245j4075548j3481144j2860494j2080602
$$ 331954961 316868579 302224882 287620637 273545089 260063945 247203451 235122849
14249B35122849j1668610j1010352j0464451r862028r280025q207428q153972
$$ 235122849 223454239 212443887 201979436 192117408 182837383 174629955 166475983
14242A66475983p568893p711492p044284o299661n776125n516072n418879n882829
$$ 166475983 158907090 151195598 144151314 137851653 132075528 126559456 121140577 115257748
14234A15257748m437066m524532m463167l566023l773167l953973l582592l275445
$$ 115257748 110820682 106296150 101832983 98266960 94493793 90539820 86957228 83681783
14226H3681783k980645l221110k817284k511821k692200k257386k002895k463772
$$ 83681783 80701138 77480028 74662744 72150923 69458723 67201337 65198442 62734670
14218F2734670j897580k084443k182827j738625j071731j247885k163695j550543
$$ 62734670 60837090 58752647 56569820 54831195 53759464 52511579 50347884 48797341
14210D8797341j153057j842683j209844p55636j031997j258927j262775j253496
$$ 48797341 47644284 45801601 44591757 43836121 42804124 41545197 40282422 39028926
14202C9028926j261763r36772n18054o16882j791184m17726r41010j021173k00793
$$ 39028926 37767163 36830391 36312337 35695455 33904271 33486545 32545535 31524362 31323569
14193C1323569r17341p15325j045319m14662n22350q28853n58555r26098o39808
$$ 31323569 30406228 29690903 28645584 28230922 27708572 26879719 26321164 25395066 24755258
14184B4755258k96158o92746l99009m53718p51600m65629j03529o85854k33833
$$ 24755258 24459100 23766354 23367345 22913627 22162027 21696398 21592869 20907015 20673182
14175B0673182o14169k38971n68341n84233j22598m94715N7790o22890n1902m82465
$$ 20673182 20059013 19820042 19251701 18667468 18544870 18050155 18107945 17485055 17433153 16950688
14165A6950688k44668n03282j37648n45505k7m13846k00683l73634k92072j37723
$$ 16950688 16706020 16202738 16065090 15519585 15519558 15105712 14905029 14531395 14239323 14101600
14155A4101600r3190m40694k07533m06975K63526n03607K0675k13226l25322j64149
$$ 14101600 14008410 13567716 13360183 12953208 13216734 12713127 12733802 12520576 12195254 12031105
14145A2031105m70402l1188O3656k86254m97507J85407j46552r4170k02794m61175
$$ 12031105 11560703 11529515 11593171 11306917 10809410 10994817 10848265 10754095 10551301 10090126
14135A0090126L01714m58357K0091k58605K85267l28990p29589L07361R8328l59326
$$ 10090126 10391840 9933483 9953574 9694969 9980236 9651246 8921657 9229018 9327346 8968020
14125H968020K86784o78741J6106K2361j94165l52310K85318k36328k1928r8725
$$ 8968020 9254804 8576063 8592169 8614530 8420365 8068055 8353373 8117045 8095117 7996392
14115G996392n05318J43194K70867l29153m782m11483K43386l66282J24947O1875
$$ 7996392 7491074 7634268 7905135 7575982 7571200 7159717 7403103 7036821 7161768 7223643
14105G223643l64672k7471l6052M3705k80703k50019L76568k92888j69430k83580
$$ 7223643 6858971 6831500 6795448 6839153 6558450 6308431 6684999 6392111 6222681 5939101
14095E939101J95709j7933n6632L4776l13463k0106p0393O6396m62319J62674
$$ 5939101 6134810 6116877 6060245 6095021 5781558 5761452 5691059 5757455 5295136 5457810
14085E457810J19705o6344k43928L15358o61406N55158n82931o1448L13246l98208
$$ 5457810 5577515 5511171 5267243 5582601 4921195 5476353 4893422 4831974 5145220 4747012
14075D747012L86848k38974L18088j20294k31136k28173J41950l73751K21089
$$ 4747012 5133860 4894886 5212974 5092680 4861544 4633371 4775321 4401570 4622659
14066D622659j05447m7052k7792k74191J77099J41218j12656o3077K3625J17425
$$ 4622659 4517212 4470160 4442368 4168177 4345276 4486494 4373838 4310761 4334386 4451811
14056D451811R9409k1489m82202k9739J22110J47034l74707j74426J42508k43624
$$ 4451811 4551220 4529731 4047529 4017790 4139900 4286934 3912227 3737801 3880309 3636685
14046C636685l3968L00828k84171k1995N9953k0063l76877L97320l98306N1709
$$ 3636685 3602717 3903545 3619374 3597379 3657332 3637269 3260392 3657712 3259406 3311115
14036C311115j74572M42945l90103J54981m72289O48362j83970p5747J62720k14268
$$ 3311115 3136543 3579488 3189385 3344366 2872077 3520439 3336469 3260722 3423442 3209174
14026C209174K07699k79941K51137m43536R1099k00541L4394J00260k87000q8429
$$ 3209174 3416873 3136932 3388069 2944533 3035632 2835091 2869485 2969745 2682745 2594316
14016B594316K1196L2543J89839k44805J58834m4290l02262p6010k4134L27920
$$ 2594316 2615512 2648055 2837894 2593089 2751923 2707633 2405371 2329361 2305227 2633147
14006B633147K2500k75384N8616k8462J49297k47917j08389Q856L69576k60663
$$ 2633147 2655647 2380263 2438879 2410417 2559714 2311797 2203408 2212264 2581840 2321177
13996B321177n18944L64932N24660k72011J01866o01768O42304N72566J748441
$$ 2321177 1802233 2167165 2691825 2419814 2521680 1919912 2562216 3134782 4883223
13987D883223O332536J6955434K3661155k0392374j5332303o500868l045018j048263
$$ 4883223 11215759 28171193 51832348 31439974 16107671 9606803 6561785 5513522
13979E513522r15629o51884k57852k64239j67726l7052l20484j61105M57731m61867
$$ 5513522 4597893 3946009 3688157 3423918 3256192 3219140 2898656 2737551 3195282 2733415
13969B733415L8043M7342j02562o8787p2588J66082k52913j99002m78699O64343
$$ 2733415 2771458 2818800 2716238 2647451 2574863 2740945 2488032 2289030 1810331 2474674
13959B474674K99585m73110M639k1108m69354N24297j94647K9668R1462k38366
$$ 2474674 2774259 2301149 2305788 2284680 1815326 2339623 2144976 2174644 2266106 2027740
13949B027740J8038l52692K46215r1127J63006K063K01557n07049J443M35591
$$ 2027740 2045778 1693086 1939301 1848174 2011180 2013243 2214800 1707751 1709194 2144785
13939B144785k4054k26999p1169j89726J09841M35099l27548l48470J53263o7157
$$ 2144785 2120731 1893732 1822563 1632837 1742678 2177777 1850229 1501759 1655022 1587865
13929A587865M08910l53387K77180O2939m67789K56425j56224Q1448J26341n21325
$$ 1587865 1996775 1643388 1920568 1983507 1515718 1772143 1615919 1697367 1823708 1302383
13919A302383m300M71293Q5668l62835L39891l25565j23000N99030k13455J00981
$$ 1302383 1298083 1769376 1855044 1492209 1832100 1506535 1383535 1982565 1769110 1870091
13909A870091o82013Q4035O0516R1093N5352M2237P8931K0913J3649j09017j38930
$$ 1870091 1188078 1272113 1332629 1423722 1479074 1521311 1600242 1621155 1634804 1525787 1386857
13898A386857j77819K66644J07771M264j02921L06482q32189M43391j44267J68162
$$ 1386857 1209038 1475682 1583453 1587717 1484796 1791278 959089 1402480 1258213 1426375
13888A426375j17297J13150N4117j47585k43512O1831L33562K5592k39648K09964
$$ 1426375 1309078 1422228 1476345 1328760 1085248 1147079 1480641 1506233 1266585 1476549
13878A476549l92491J93455k9119K26138j48402j88965L4732J5603J74538r6694
$$ 1476549 1084058 1277513 1248394 1474532 1326130 1137165 1171897 1187500 1362038 1265344
13868A265344l0217j7390J91156j82604Q8833k88658L04579k14482k1879J45238
$$ 1265344 1235127 1217737 1408893 1226289 1315122 1026464 1331043 1116561 1094682 1239920
13858A239920m38715K85260P7119k3462N54901k33759l46689L40277m47761J65644
$$ 1239920 801205 1086465 1163584 1140122 1695023 1461264 1114575 1454852 1007091 1172735
13848A172735L74213m50253M2137m55397P86435p26095J38823L24655k61631L9371
$$ 1172735 1546948 1096695 1138832 683435 1469870 743775 882598 1207253 945622 984993
13838I84993p148M5612R646q3548J14181l2758l11642O3260L62077j68170j48144
$$ 984993 977845 1023457 1033103 949555 1063736 1030978 719336 782596 1144673 976503 828359
13827H28359K95342k24869J45299q1081L55278k14506j9731j62665K08252j73543
$$ 828359 1123701 898832 1044131 963050 1318328 1103822 1084091 921426 1129678 956135
13817I56135L227n6471K71915k07420K6246m69113N69407j62607j79247J42769
$$ 956135 959362 902891 1174806 967386 993632 524519 1093926 931319 752072 894841
13807H94841L1353k91634O77005j31565k69441j31738R3971K43198k60802j59634
$$ 894841 926194 634560 1311565 1180000 910559 778821 872792 1115990 855188 695554
13797F95554Q8087M31105k42526j91887L30395Q9715l73045Q6736N5845k43711
$$ 695554 783641 1214746 972220 780333 1110728 1200443 827398 914134 969979 726268
13787G26268j9767J15782L8486r797j81582L7014L7970L3882r4918K36198j88868
$$ 726268 706501 822283 860769 850972 669390 706404 744374 778256 683338 919536 730668
13776G30668j54809J08517M04878n16157J22092M572L34972p1848D65790O01807
$$ 730668 575859 684376 1089254 573097 695189 699761 1034733 962885 465790 1067597
13766A067597j88377k94047J57975K84035j8804m15091j92065L87615j87219J28102
$$ 1067597 879220 585173 743148 1027183 1008379 593288 401223 788838 601619 729721
13756G29721j15020K85607k32553J74318j42306J24086l03609K61628l56955L80298
$$ 729721 614701 900308 667755 842073 699767 823853 520244 781872 424917 805215
13746H05215k5815m446l28288M59680k21397B83547M70959n069j54155j72457
$$ 805215 779400 774954 446666 906346 684949 283547 754506 749437 595282 422825
13736D22825K53375L82316l58341K31778C13241L95116K17093m13488M5408J15268
$$ 422825 676200 1058516 700175 931953 313241 708357 925450 511962 557370 672638
13726F72638j60773j20260K09399J27056l54304K58638B82053J85762L01624k36259
$$ 672638 511865 391605 601004 728060 373756 632394 282053 467815 769439 533180
13716E33180L8370m7097L81336j28268J9165j58684J01304k34989O4954N3470
$$ 533180 571550 524453 905789 777521 796686 638002 739306 504317 569271 622741
13706F22741j36337K93806K09199q6137k95695B06228L73942J35912J08057l37245
$$ 622741 486404 780210 989409 903272 607577 206228 580170 716082 824139 486894
13696D86894p8961J05348n8383P6921J10709L5159k55549K58369K7649k72809
$$ 486894 407933 513281 454898 531819 642528 677687 422138 680507 708156 435347
13686D35347J82354K33137C04571Q2887K38256A76606M73822j25989j26759K81238
$$ 435347 617701 850838 304571 387458 625714 176606 650428 524439 397680 678918
13676F78918j51772j67091j00286K36476K46964l19428j84936K63081m6697j27518
$$ 678918 527146 360055 259769 496245 743209 423781 238845 501926 455229 327711
13666C27711M12919B60090L31584m9110J39327M9362l11260m9757J01489J32928
$$ 327711 740630 260090 591674 542564 681891 731253 419993 370236 471725 604653
13656F04653l3589j2055m7635K8012k21091J12230L2460K38388J0299A31100P4087
$$ 604653 571064 559009 511374 539386 318295 430525 462985 701373 711672 131100 205187
13645B05187L72940B75335K1312M73638l45686j51389L67488B64468L76238k14343
$$ 205187 578127 275335 296647 770285 424599 273210 640698 264468 640706 426363
13635D26363n6003K2869j03934L1064q2330J8008J89643I8879N41310k94769K73492
$$ 426363 370360 393229 289295 320359 238029 256037 445680 98879 640189 345420 618912
13624F18912N704j01929m7918p6146K38882N0218B63555J78605j88572K54114
$$ 618912 624616 522687 474769 398623 637505 687723 263555 442160 253588 507702
13614E07702K11466l49013o2455p1549M02910J57734A13216K81619J48854A89034
$$ 507702 719168 370155 307700 236151 639061 796795 113216 394835 543689 189034
13603A79350J14153M6307M05243C61552J10975I7789M72581B17855L22066j67246
$$ 179350 293503 339810 745053 361552 472527 97789 570370 217855 539921 372675
13593C72675r953k33J00377K65718l16114J52213O4966B68199K1474J82135j26071
$$ 372675 362722 362489 462866 728584 412470 564683 629649 268199 289673 471808 345737
13582C45737L18J32421r259L56337B06546M6929j03758J56829j17069L87212R3509
$$ 345737 346055 478476 469217 825554 206546 253475 149717 306546 189477 576689 670198
13571F70198k53191G7056N53328k29548e8806C49466A37615K39596n8575K76674
$$ 670198 417007 77056 630384 400836 -58806 349466 137615 377211 318636 595310
13561E95310k02461k8865R2388o7598A16302M7209E5328K97717j03723R2370j09810
$$ 595310 392849 363984 456372 388774 116302 163511 55328 353045 249322 341692 231882
13550B31882m388K38576J10764e2575B31325K89026j27222J83706j67421G2101
$$ 231882 227494 466070 576834 -52575 231325 520351 393129 576835 409414 72101
13539D00336r7529P0882m3953r5082k27L80665A17487O3728L71183A33006L63942
$$ 400336 302807 373689 329736 234654 234427 615092 117487 181215 552398 133006 496948
13528D96948a15576F55897B7017N80345G5984J02648L6763R1574K69629j84726
$$ 496948 -115576 655897 27017 607362 75984 178632 215395 306969 576598 391872
13518C91872A92913I5740L55240A77319n0866J43910k0927L19661j69500K6958
$$ 391872 192913 95740 450980 177319 126453 270363 249436 569097 399597 426555
13508D26555E8874K79235B9962K15351a6002B85896M2969J48575o933K9372L2717
$$ 426555 58874 338109 29962 245313 -16002 285896 328865 477440 470507 499879 532596
13497E32596d2085B20262J13383O3625A76552J50626Q4994A97127M50698A20207
$$ 532596 -42085 220262 333645 397270 176552 327178 412172 197127 647825 120207
13486C51831L4699K76381j63532A70389K37187J18289j3866o2096r2413M4239
$$ 351831 386530 662911 499379 170389 407576 525865 511999 449903 357490 401729
13476D01729F0873J01474G79L13604K25857A60062N05392I9309M86054A87001
$$ 401729 60873 162347 779 314383 540240 160062 665454 99309 585363 187001
13465F7099L94181j9199j59527r327o8317K9544J35056L6838R2871j46753r8162
$$ 67099 461280 442081 282554 273227 204910 234454 369510 406348 499219 352466 254304
13454B54304q2592J31035o9069J61045n085K8573m8280j22919f060C26778r511
$$ 254304 171712 302747 233678 394723 389638 418211 369931 247012 -6060 326778 317267
13443C17267h5238C74694J47183L3196B53838Q0179j12277I9799K70619A06341
$$ 317267 -85238 374694 521877 555073 253838 334017 221740 99799 370418 106341
13432C2777L68038G7198e1024B63368L4163a27069D01938j49999F2706K35164
$$ 32777 400815 77198 -51024 263368 297531 -127069 401938 251939 62706 297870
13422B97870q0328E1602M47419j09191J2302D3231J8377K63946a0329A03605J1733
$$ 297870 217542 51602 499021 389830 402132 43231 61608 325554 -10329 103605 115338
13411A15338O3574K79057j06667M3940A46840K19492a34885A90982B2076N4046
$$ 115338 178912 457969 351302 395242 146840 366332 -134885 190982 22076 76122
13401G6122q11K77965d1239B9802K81145m1871K1510l452j43306J90726k2983
$$ 76122 75311 353276 -41239 29802 310947 269076 290586 287134 143828 334554 311571
13390C11571A34281K11659j4041a22175a862m4371C19146m7900r0882C6043L46890
$$ 311571 134281 345940 331899 -122175 -1862 -46233 319146 271246 180364 36043 382933
13379C82933A45235C0784b10517C21587B4655L79794J01735k12238J57074m9368
$$ 382933 145235 30784 -210517 321587 24655 404449 506184 293946 451020 401652
13369D01652A66464K37643K594j68754K8485L3708M1388o0279h4760B24137b6292
$$ 401652 166464 404107 406701 237947 266432 300140 341528 281249 -84760 224137 -26292
13357B12724q3623J55458F3263J45459K45111r107j39179o1986p8740J15658K60959
$$ 212724 129101 284559 63263 208722 453833 444726 305547 243561 164821 280479 541438
13346E41438j97771j22645p5916O3651L11636A96781J68201D2305e1281C31251
$$ 541438 343667 221022 145106 208757 520393 196781 364982 42305 -51281 331251
13335F1562J69476j13425J82725J78334A28274J54385K81601A3958J58009M5596
$$ 61562 231038 117613 300338 478672 128274 282659 564260 13958 171967 217563
13325B17563o9786J17858J92910A46482J86274P8998j96629Q0257N6880j04097
$$ 217563 147777 265635 458545 146482 332756 411754 215125 295382 352262 248165
13315B48165j3787j1553r5521Q1302c22287E4427J60453h8806C9292K92637q5610
$$ 248165 234378 222825 127304 208606 -322287 54427 214880 -88806 39292 331929 246319
13304B46319m9856A3818L69769A55267o3260J35109J02814j36682p6984b82525
$$ 246319 196463 13818 383587 155267 92007 227116 329930 193248 116264 -282525
13293E85197A39880J79758c2781D43423j46996A34262J26606m4703A03079d7702
$$ 585197 139880 319638 -32781 443423 296427 134262 260868 216165 103079 -47702
13282C4043O5937j7354a0579F44425B17792J81106G7816J45355e3710A53724A0251
$$ 34043 99980 82626 -10579 644425 217792 398898 77816 223171 -53710 153724 10251
13270f0667l2516j01383A57089J13307J97495e8218C39267A7608c07564C38693
$$ -60667 -93183 -194566 157089 270396 467891 -58218 339267 17608 -307564 338693
13259C63848h7200A59018N4377d1031A42740n6851L8228B8267a29231A01923J27083
$$ 363848 -87200 159018 213395 -41031 142740 85889 124117 28267 -129231 101923 229006
13248B29006n9522K00784r0328n5842B8990L27734o6513a3330E7767L9896L79489
$$ 229006 169484 370268 279940 224098 28990 356724 290211 -13330 57767 97663 477152
13237D77152A003b11561A45275L36167F034a20052A63015L5423r3178e1545G286
$$ 477152 1003 -211561 145275 481442 6034 -120052 163015 198438 105260 -51545 7286
13225C20964o4264A23259P5373j4553K5428j3333R5416o8070d5228A39462K6441
$$ 320964 256700 123259 198632 184079 209507 196174 291590 223520 -45228 139462 165903
13214A65903J79738m3486A2443a0198C21004A33076a7626B04402l8068N7704a27961
$$ 165903 345641 302155 12443 -10198 321004 133076 -17626 204402 166334 224038 -127961
13202c7434A65967l628D9389J49104m04J71573H6731L48243A12633J02974j06916
$$ -37434 165967 162339 49389 198493 198089 369662 86731 434974 112633 215607 108691
13191A08691A9941b0103G3769a11871I1189K09231A33158a79093D6543a62503
$$ 108691 19941 -20103 73769 -111871 91189 300420 133158 -179093 46543 -162503
13180B05910E3975a6957m6956A77465J4638h7022I789c66050A91487J16754I407
$$ 205910 53975 -16957 -63913 177465 192103 -87022 9789 -366050 191487 308241 9407
13168C30822A04163b16659a8000A43837J13688o6717i9386B61364k7783Q7255
$$ 330822 104163 -216659 -18000 143837 257525 190808 -99386 261364 233581 320836
13158C20836a1276A19967L3150Q2997a32898C05257a4279A55154L92657f1908
$$ 320836 -11276 119967 153117 236114 -132898 305257 -14279 155154 547811 -61908
13147a28834d4629B70358b5812i075l8911j3511H0316L31380j59033R547b02601
$$ -128834 -44629 270358 -25812 -9075 -47986 -61497 80316 411696 252663 262210 -202601
13135B63143a96897C12477A00806a64286D91987A29272b71967C09236e01641B232
$$ 263143 -196897 312477 100806 -164286 491987 129272 -271967 309236 -501641 2232
13124C6119K13659J3170p7976k5407b71595A21566G277K33750f2091B69568f014
$$ 36119 249778 262948 184972 159565 -271595 121566 7277 241027 -62091 269568 -6014
13112B1099a68323B58749D0630Q236g7866a3698C0483M77982k47340e9435J6624
$$ 21099 -168323 258749 40630 48866 -77866 -13698 30483 508465 261125 -59435 -42811
13101d2811B25963i5073C3303K78315d0126F4033c95002C84041j38707a69096
$$ -42811 225963 -95073 33303 311618 -40126 64033 -395002 384041 245334 -169096
13090A0915J19985b36135A87258C0865a70035C27695H3383A0961e8732A51845
$$ 10915 130900 -236135 187258 30865 -170035 327695 83383 10961 -58732 151845
13079c1361k2034m7278C33217J05668I9458H926L50796j56854b927k2076B1418
$$ -31361 -53395 -100673 333217 438885 99458 8926 359722 202868 -2927 -25003 21418
13067F6617J08066d8723k24049A57045n8707C4916K23264Q6883j71420A5865h2439
$$ 66617 174683 -48723 -272772 157045 98338 34916 258180 345063 173643 15865 -82439
13055G7323a85533A53778m5136a88351B8950a41803B03643b1022D3371h0949A66286
$$ 77323 -185533 153778 108642 -188351 28950 -141803 203643 -21022 43371 -80949 166286
13043B38088I1619K07478b01632B33158G7390J71145O7490B4906g11C19918I5154
$$ 238088 91619 299097 -201632 233158 77390 248535 316025 24906 -711 319918 95154
13031B95947A16533a13624D00678a10304A89030B1311L08171f8217A46042c85
$$ 295947 116533 -113624 400678 -110304 189030 21311 329482 -68217 146042 -385
13020E8201f672A52068J60480j32131i9731d3129C51574a81375d7934j10105k4004
$$ 58201 -6672 152068 312548 180417 -99731 -43129 351574 -181375 -47934 -158039 -182043
13009a82043a1801B29473l6711q691P826L36588k8149a23280A76383a9363B04069
$$ -182043 -11801 229473 192762 184071 191897 528485 500336 -123280 176383 -19363 204069
12997D3668K25544C1796J40965m3717P7725L51712d8644B84801j16933J43198
$$ 43668 269212 31796 172761 129044 206769 558481 -48644 284801 167868 311066
12987C11066E780K327b46419A63170b4060B51289g4045D04378F0679P8092g8116
$$ 311066 5780 8107 -246419 163170 -24060 251289 -74045 404378 60679 138771 -78116
12975F2679R5045d9321B21648p8054c0374A50505L13144k07584q5293b64772a19383
$$ 62679 157724 -49321 221648 143594 -30374 150505 463649 256065 170772 -264772 -119383
12963D19495H1561h4241G5808e8872B8872d8120B02765E6422a05450c8655j19425
$$ 419495 81561 -84241 75808 -58872 28872 -48120 202765 56422 -105450 -38655 -158080
12952a58080F0479e3432k25191A92655q4374m8783O0823O2788i555B09992J5165
$$ -158080 60479 -53432 -278623 192655 108281 59498 120321 183109 -9555 209992 225157
12941B25157a62228A85279g9602J0951c2731C0699b65762a21336E74010g6831
$$ 225157 -162228 185279 -79602 -68651 -32731 30699 -265762 -121336 574010 -76831
12930F3276J83308h1202A91029g0879j16493h3169C7012O3648O1664N4122k8112
$$ 63276 246584 -81202 191029 -70879 -187372 -83169 37012 100660 162324 216446 188334
12919A88334a84269B2386K30622q639E4108a14944A43039n9196J16436i610C09261
$$ 188334 -184269 22386 253008 244369 54108 -114944 143039 83843 200279 -9610 309261
12907a24337A26755b21398B40040c89780C8425a13220A76704c12976a13465C59888
$$ -124337 126755 -221398 240040 -389780 38425 -113220 176704 -312976 -113465 359888
12896b70037J33128A17756J26061I4369l1652b89223B31152f1239C21329q2345
$$ -270037 -136909 117756 243817 94369 62717 -289223 231152 -61239 321329 238984
12886B38984F7247N4080m8664O2206J76513c30A17376d7797B22154a22431K4272
$$ 238984 67247 121327 72663 134869 311382 -330 117376 -47797 222154 -122431 -98159
12875i8159b6879A27394b06944P2718A28185a09045D082Q6838Q0345a69960l72
$$ -98159 -26879 127394 -206944 -134226 128185 -109045 4082 90920 171265 -169960 -170332
12864a70332A5441R7776H973a40977a2758B67739A2268a34644E0863J48804l6630
$$ -170332 15441 113217 8973 -140977 -12758 267739 12268 -134644 50863 199667 163037
12853A63037M4176b25457J09777c5830B16586L9083j6299J15100b01829f2114
$$ 163037 207213 -225457 -115680 -35830 216586 255669 239370 354470 -201829 -62114
12842F7604J75681D7468L5191M0068J37403C6863J22544K45884G0651f8409A40020
$$ 67604 243285 47468 82659 122727 260130 36863 159407 405291 70651 -68409 140020
12830B21638d15390A19366a47173J1373B3557J52963d5011A34063K1293G4056
$$ 221638 -415390 119366 -147173 -135800 23557 176520 -45011 134063 155356 74056
12819c6182B10153p8445F3759g9030B73003P611c08609a01548A58114b98A88514
$$ -36182 210153 131708 63759 -79030 273003 280614 -308609 -101548 158114 -298 188514
12807i902A34353m5781K2375a15246A78746E6876E973J24071n6009C75L08522
$$ -9902 134353 88572 110947 -115246 178746 56876 5973 130044 74035 375 308897
12796C08897c5190B13637c7152D757h7641B87366a27239B11110C2877d239G6574
$$ 308897 -35190 213637 -37152 4757 -87641 287366 -127239 211110 32877 -4239 76574
12784c67584I8298a9785n7157C3523J77745b16744N3230O9051B3436c9486j49668
$$ -367584 98298 -19785 -76942 33523 211268 -216744 -163514 -94463 23436 -39486 -189154
12773a89154i0162B2814i1606k98836A4172J06802J16641O0090e2627o3731B62812
$$ -189154 -90162 22814 -91606 -390442 14172 120974 237615 297705 -52627 -116358 262812
12761a22550A33764M0668d8333j31811f9943K3867o1860j73100a24498J1351E1381
$$ -122550 133764 174432 -48333 -180144 -69943 -46076 -107936 -281036 -124498 -113147 51381
12749A16666g8731p6996a0867j26547e8502K3489A28357b4787G3836M5671K8335
$$ 116666 -78731 -155727 -10867 -137414 -58502 -35013 128357 -24787 73836 119507 147842
12738A47842i8380B52817A15067J5640C7588K90793E5131J22343a17835D66777
$$ 147842 -98380 252817 115067 130707 37588 328381 55131 177474 -117835 466777
12727i1777H8490L3788c13532a02149B39564a91051A07034c10977e7546K732j48509
$$ -91777 88490 122278 -313532 -102149 239564 -191051 107034 -310977 -57546 -54814 -203323
12716b03323Q4052l032A02934L3603d8926J2064B2737J3618L16470h0591B60980
$$ -203323 -119271 -122303 102934 136537 -48926 -36862 22737 36355 352825 -80591 260980
12704a54881A98128G752K45615f5225H8206R810L8258J07082M6583e1792o7422
$$ -154881 198128 7752 253367 -65225 88206 98016 136274 243356 289939 -51792 -119214
12693a19214L810I5901L6600n7735a73686E1418J04599J355b12840P2791B42567
$$ -119214 -115404 95901 132501 74766 -173686 51418 156017 157372 -212840 -140049 242567
12681a59287B23282J37755A33794l2559A8548K46064a00580D30416H127K20337
$$ -159287 223282 361037 133794 101235 18548 264612 -100580 430416 8127 228464
12671B28464A6156K89653A49292A1771M8684a59085i885A23003B0853J30133p2959
$$ 228464 16156 305809 149292 11771 60455 -159085 -9885 123003 20853 150986 78027
12660G8027J95467p8780J75781l4752A44298F9304J39110a49225N2865A93451
$$ 78027 273494 194714 370495 335743 144298 69304 208414 -149225 -96360 193451
12649B97835B1717b90867I8655K5159b63457i4930A55922a55970B75025a81181
$$ 297835 21717 -290867 98655 123814 -263457 -94930 155922 -155970 275025 -181181
12638B33596a82394O6241B38712a14256C29501G20K75989o6151J0124K8844J94352
$$ 233596 -182394 -116153 238712 -114256 329501 720 276709 210558 220682 249526 443878
12627D43878A26095n1146J89029d4314l5929C74265A84466K25995A95717c13215
$$ 443878 126095 74949 263978 -44314 -80243 374265 184466 410461 195717 -313215
12616c24560A37558b91410B80610b60412C73334j78549N1826k9810a24705C20025
$$ -324560 137558 -291410 280610 -260412 373334 194785 246611 216801 -124705 320025
12605b7170Q194A57263l1368D3187d3853C13424L3275j02466P26j12269o0604
$$ -27170 -18976 157263 125895 43187 -43853 313424 346699 244233 244959 132690 72086
12594G2086K32434A26286P1388I7046C6987J16861R8448j16854m9691L8832b0706
$$ 72086 304520 126286 197674 97046 36987 153848 252296 135442 85751 124583 -20706
12582h0411c3350A54858p0608k0557K54139o9448b24986D2509a59477C8089b15086
$$ -80411 -33350 154858 84250 63693 317832 248384 -224986 42509 -159477 38089 -215086
12570A34715f1428b0445O946r7499D25234g6433A65960c28104a09481A47408a04941
$$ 134715 -61428 -20445 -13499 -110998 425234 -76433 165960 -328104 -109481 147408 -104941
12558B15364p0179a51146o947a8448A00173a32044A59336m5455j3044A4014O9997
$$ 215364 145185 -151146 -158093 -18448 100173 -132044 159336 113881 100837 14014 84011
12547H4011i9267J6664H9248k9824a18753A05688a72758I1040M4014h5268C264
$$ 84011 -99267 -82603 89248 59424 -118753 105688 -172758 91040 135054 -85268 3264
12535A66721m3840a50917J081A0191J09609a10987a2313B3089J38940P6676Q4280
$$ 166721 122881 -150917 -149836 10191 119800 -110987 -12313 23089 162029 238705 322985
12524C22985I2058a35496j06509A65533J21813b3830p2878J0267C79676j61760
$$ 322985 92058 -135496 -242005 165533 287346 -23830 -96708 -86441 379676 217916
12514B17916F5813f6117L2738j49100n1409A13511J11808e19258A85021b28064
$$ 217916 65813 -66117 -33379 -182479 -233888 113511 225319 -519258 185021 -228064
12503B2389g5185K1762k91744A81322d9038j06331A65607K65838f7907C4634Q0381
$$ 22389 -75185 -53423 -345167 181322 -49038 -155369 165607 431445 -67907 34634 115015
12492A15015d21902A41098n5560Q2966L8074G5440b09051A99365I2281J05284
$$ 115015 -421902 141098 85538 168504 206578 75440 -209051 199365 92281 197565
12482A97565H7817J34881e1283r3348r4378B33730d20174A98650G8460a08225
$$ 197565 87817 222698 -51283 -144631 -239009 233730 -420174 198650 78460 -108225
12471A48159M9440Q2661c7318k58978B20749L5111d25775i0243h246C70788h2871
$$ 148159 197599 280260 -37318 -296296 220749 255860 -425775 -90243 -8246 370788 -82871
12459A04256Q835e8999A54593a78443q303r1285d0435A49687F0541K47401j21385
$$ 104256 113091 -58999 154593 -178443 -186746 -278031 -40435 149687 60541 307942 186557
12448A86557p4473f3555A62085a28635A40261b32639j5095B63374d0801I9984
$$ 186557 112084 -63555 162085 -128635 140261 -232639 -247734 263374 -40801 99984
12437c70470D2830J30404d38224a27292e4728A70888B8395Q6547b27088a5482
$$ -370470 42830 173234 -438224 -127292 -54728 170888 28395 114942 -227088 -15482
12426b33837P861P4428d4461r7986A77061a00622L5778o3566j72858B9604a05269
$$ -233837 -225976 -151548 -44461 -142447 177061 -100622 -64844 -128410 -301268 29604 -105269
12414b5261j01742A41194a11898r454A38280D851b14616A26000b72688j3997A18790
$$ -25261 -127003 141194 -111898 -121352 138280 4851 -214616 126000 -272688 -286685 118790
12402D11443A36702l1564J2908b01147E6790k7060e7438h152D7466d5217P196
$$ 411443 136702 105138 118046 -201147 56790 29730 -57438 -8152 47466 -45217 -38021
12391c8021j4591A52184K2245J47862a91814g3168K1125A90931a80062G5736N4257
$$ -38021 -52612 152184 174429 322291 -191814 -73168 -52043 190931 -180062 75736 129993
12380A29993K1650M3838b1149K571j36904H3390i7015F5750c150A76717a29581
$$ 129993 151643 195481 -21149 -18578 -155482 83390 -97015 65750 -3150 176717 -129581
12368B7983f8342k82631H354J42412M7837H52a15359A66890J34200O5456a56482
$$ 27983 -68342 -350973 8354 150766 198603 852 -115359 166890 301090 366546 -156482
12356b03559f4430F3457b31830l05751B3158J59078B7153L3513h515j52306K6911
$$ -203559 -64430 63457 -231830 -537581 23158 182236 27153 60666 -8515 -160821 -133910
12345a33910M8065k2948L6417r1311A84851E1714L0021g243A52249k449a38989
$$ -133910 -85845 -108793 -72376 -163687 184851 51714 81735 -7243 152249 149800 -138989
12333c5511q030j65287e1229l8966l985A64667K25553j66201b4452m4938j9417
$$ -35511 -43541 -208828 -51229 -90195 -94180 164667 390220 224019 -24452 -69390 -88807
12322h8807B67070a1427A8677L93630e0835I1180e897j48454A13208k5160a30956
$$ -88807 267070 -11427 18677 412307 -50835 91180 -5897 -154351 113208 88048 -130956
12310E45423b2752F1093b06739Q4234K4205j66010C11382M2336a44659B4602J98563
$$ 545423 -22752 61093 -206739 -122505 -98300 -264310 311382 353718 -144659 24602 223165
12299B23165a84934A61055b5275H9526D3040a07606A87362d76919a54468g0766
$$ 223165 -184934 161055 -25275 89526 43040 -107606 187362 -476919 -154468 -70766
12288B21623J99863b4569F2498L6304g7004A69611M996b33411o7653C2775m757
$$ 221623 421486 -24569 62498 98802 -77004 169611 174607 -233411 -301064 32775 28018
12277B8018L05099M8378a00766A81171K0989H3206B1304L19642A12515c17978
$$ 28018 333117 381495 -100766 181171 202160 83206 21304 340946 112515 -317978
12266B14306o8889b01658b114j24320A60361F9454F023a48842m1404A34957M3106
$$ 214306 145417 -201658 -2114 -126434 160361 69454 6023 -148842 -190246 134957 178063
12255A78063k2625J74339E9174J78017a44814E0010c51518F6537J76756A21212
$$ 178063 155438 329777 59174 237191 -144814 50010 -351518 66537 243293 121212
12244A57272K8459J62285B0314M8424J78777d3523q4441m3699A40097J64990j06562
$$ 157272 185731 348016 20314 68738 247515 -43523 -127964 -171663 140097 305087 198525
12233A98525a18496C17932q5336e7336q29J9537j05303C79779b3653q8638C19280
$$ 198525 -118496 317932 232596 -57336 -58165 -38628 -143931 379779 -23653 -112291 319280
12221C17324p6716O3212l1070J32946b41367E80714B01604J70038a8509l1864
$$ 317324 240608 303820 272750 405696 -241367 580714 201604 371642 -18509 -50373
12211e0373D06812j28956A13770L99311g6509J1693B41456l3531H3999J38090
$$ -50373 406812 277856 113770 513081 -76509 -64816 241456 207925 83999 222089
12201B22089m3392p2827D7522J54167Q1300o7080J62400j12138N4085j01610h3884
$$ 222089 178697 105870 47522 201689 282989 215909 378309 266171 320256 218646 -83884
12189I6293H616K69781a64386D90483r7365a48479A62872C675a79856n6698F2578
$$ 96293 8616 278397 -164386 490483 393118 -148479 162872 3675 -179856 -236554 62578
12177D3557P6776d2320E26631A21771R1646b9640A10264J2613N8912R5210j20252
$$ 43557 120333 -42320 526631 121771 213417 -29640 110264 122877 181789 276999 156747
12166A56747a10821B00276r7799K59028N573A03321a44506A46636L7077f2492
$$ 156747 -110821 200276 102477 361505 367078 103321 -144506 146636 183713 -62492
12155B2321K59272a89704A58523G6865c420D9318b45825d6471p1782A81457L6119
$$ 22321 281593 -189704 158523 76865 -3420 49318 -245825 -46471 -118253 181457 217576
12144B17576a6952B2763P0018K72770b74849B50870a75549H7517J72323G5845
$$ 217576 -16952 22763 92781 365551 -274849 250870 -175549 87517 259840 75845
12133C18929j24210A7982b63307I1023a17074G5278a71978d1661A02816l8081
$$ 318929 194719 17982 -263307 91023 -117074 75278 -171978 -41661 102816 64735
12123F4735d0811A01525a61331g79j20165C17564j28070C5306e4193j43277e982
$$ 64735 -40811 101525 -161331 -779 -120944 317564 189494 35306 -54193 -197470 -5982
12111i2146D6126b7684m6331A59127C3102d2599C565a08290A14149C3773f7288
$$ -92146 46126 -27684 -74015 159127 33102 -42599 3565 -108290 114149 33773 -67288
12099A66528a24869A9533F538M1136b20211A00491c884j1811B14982G6327J13691
$$ 166528 -124869 19533 6538 47674 -220211 100491 -3884 -15695 214982 76327 190018
12088A90018a57036M2477D0044J82969D3682K22099a47575B82664M12017P35129
$$ 190018 -157036 -114559 40044 223013 43682 265781 -147575 282664 694681 1429810
12078A429810R99463G10217C26395j36293c9574M252A60481N422m8857m8014Q5394
$$ 1429810 2429273 710217 326395 190102 -39574 -35322 160481 165903 117046 69032 154426
12067A54426J08155d6115B29676G0283J24719h4111B49218p8962m5311a78081
$$ 154426 262581 -46115 229676 70283 195002 -84111 249218 170256 124945 -178081
12056C7858d23551H3559b08881Q4530A82771a41707C7913J32983a77292A49928
$$ 37858 -423551 83559 -208881 -124351 182771 -141707 37913 170896 -177292 149928
12045b33583j28007c7232D0094f6062B15722G2749h3153n2873B72866l9648e8644
$$ -233583 -361590 -37232 40094 -66062 215722 72749 -83153 -136026 272866 233218 -58644
12033B9373Q3575C6824b77997C5477b6383o572A26936B7277e2199B7243L704a03752
$$ 29373 112948 36824 -277997 35477 -26383 -32955 126936 27277 -52199 27243 30947 -103752
12020c1106A88814E7492g0002F4185B5534f3365C73066c3698B87596a04926j26085
$$ -31106 188814 57492 -70002 64185 25534 -63365 373066 -33698 287596 -104926 -231011
12009b31011B95407a26092b2515j31397k5811C24569c92783J48977A58993O8148
$$ -231011 295407 -126092 -22515 -153912 -179723 324569 -392783 -243806 158993 227141
11999B27141a37004j1046A33979b47044M4854B94501a16010j5588E9910i6199
$$ 227141 -137004 -148050 133979 -247044 -202190 294501 -116010 -131598 59910 -96199
11988b94419P1952j05637A68800a11632H4172b15940a04743m9694G3501a29602
$$ -294419 -222467 -328104 168800 -111632 84172 -215940 -104743 -154437 73501 -129602
11977g2305G5421a35749o5036i1110H6969h8701p8771B35069j7964b57041C57214
$$ -72305 75421 -135749 -200785 -91110 86969 -88701 -167472 235069 217105 -257041 357214
11965B03252K8143a25372p8175D6982a91378E2057j2296J05404a47089j29010
$$ 203252 231395 -125372 -203547 46982 -191378 52057 39761 145165 -147089 -276099
11955b76099B6483f9272o458E1092d0995j91727G6182Q6148i1794k5124N7121
$$ -276099 26483 -69272 -75730 51092 -40995 -232722 76182 162330 -91794 -116918 -59797
11944e9797k38784B3110M6811a60075P4159a7589n8608G3083b29680b087j70152
$$ -59797 -298581 23110 69921 -160075 -85916 -17589 -76197 73083 -229680 -2087 -172239
11933a72239B656J7207J68777a3325D5896i7311r2985G6383e8828A92458G1393
$$ -172239 2656 19863 188640 -13325 45896 -97311 -190296 76383 -58828 192458 71393
11921D2536O6871e9611I2219f2342J3615B45313e6973A53288a0244A07167Q4477
$$ 42536 109407 -59611 92219 -62342 -48727 245313 -56973 153288 -10244 107167 191644
11910A91644m7878a80949c0680n4496j09452Q6830k03645I1364f0519D24752B2382
$$ 191644 143766 -180949 -30680 -85176 -194628 -107798 -311443 91364 -60519 424752 22382
11898h6727B69902j16125M9967b68179B0056a1359q076k08694h4313J4739b1776
$$ -86727 269902 153777 203744 -268179 20056 -11359 -19435 -228129 -84313 -69574 -21776
11886B2252J86022k4072Q7520j29634j388o8163r216L7854M2187a66082P8000
$$ 22252 208274 184202 271722 142088 140700 72537 63321 101175 143362 -166082 -88082
11875h8082J528B6254a1584A25634m0856d85742i2452K8439j04874m8574C9700
$$ -88082 -86554 26254 -11584 125634 84778 -485742 -92452 -64013 -168887 -217461 39700
11863b69624B57180c71079A48444k8944E7437c76224A67500A0833J00988J65840
$$ -269624 257180 -371079 148444 119500 57437 -376224 167500 10833 111821 277661
11853B77661j24773Q9134a00803n5069d7587a4084k73759J41298c46A567P1390
$$ 277661 152888 242022 -100803 -155872 -47587 -14084 -287843 -146545 -346 1567 72957
11842G2957a02561B37649b54670Q7455A09605j1592M078I372b09832a02331j3475
$$ 72957 -102561 237649 -254670 -167215 109605 98013 102091 9372 -209832 -102331 -115806
11831a15806D0394O6044b12441E5867K24150E5551K49171p9807b75331c3274h95
$$ -115806 40394 106438 -212441 55867 280017 55551 304722 224915 -275331 -33274 -895
11819A5060a56188K4116D1498a39016A02260a2035j8350C2489b41041d8754A40139
$$ 15060 -156188 -132072 41498 -139016 102260 -12035 -30385 32489 -241041 -48754 140139
11807a49983m90363C1781K3611a09918c3657B25830a05419B41124p1554b00961
$$ -149983 -640346 31781 55392 -109918 -33657 225830 -105419 241124 169570 -200961
11796D0874J6594c49012G27J05432E1997K07492R6649A06210I518a50685A8931
$$ 40874 57468 -349012 727 106159 51997 259489 356138 106210 9518 -150685 18931
11784g9523F3450j9684J2293K65721k2728a89541C6398a13427k68103a56547P3295
$$ -79523 63450 43766 56059 321780 299052 -189541 36398 -113427 -381530 -156547 -83252
11773h3252n1528k44236a42534o9003A39849k604a9115A05004l0813N1700C0735
$$ -83252 -134780 -379016 -142534 -211537 139849 137245 -19115 105004 74191 125891 30735
11761f6775a9658j23127F130Q5029a92451r6714C34176a32325B27813D5199a47830
$$ -66775 -19658 -142785 6130 91159 -192451 -289165 334176 -132325 227813 45199 -147830
11749A0973c51790B9554P6595b93810q2216O1884B68059a82965b6243l23002E0129
$$ 10973 -351790 29554 106149 -293810 -376026 -314142 268059 -182965 -26243 -349245 50129
11737G7651i8961b905D53101A2042k367b57797a1583j65013A03120O0700P2713
$$ 77651 -98961 -2905 453101 12042 9675 -257797 -11583 -176596 103120 163820 236533
11726B36533c61953J58685R0576L3077D69575c8776b315B5181e9208k16315I9376
$$ 236533 -361953 -203268 -112692 -79615 469575 -38776 -2315 25181 -59208 -275523 99376
11714a14255H324c13391B24614f4441C09380c64539I6279K09046H7354K7339K6488
$$ -114255 8324 -313391 224614 -64441 309380 -364539 96279 305325 87354 114693 141181
11703A41181J73570L3826E2877b10415P8406g418j92378B97381o0465D9997O2207
$$ 141181 314751 348577 52877 -210415 -132009 -7418 -199796 297381 236916 49997 112204
11692A12204a59566O5365k865c8418l19948E4102J33498R5008J01722a882A36056
$$ 112204 -159566 -94201 -97066 -38418 -358366 54102 187600 282608 384330 -1882 136056
11680C23889A30524a73358A25885a34835M9288j7999j45480b3586m4189j73146
$$ 323889 130524 -173358 125885 -134835 -85547 -103546 -249026 -23586 -67775 -240921
11670b40921A09388d4726j62954g2643r297m439B0972K29882c646j32602D7266
$$ -240921 109388 -44726 -207680 -72643 -81940 -86379 20972 250854 -3646 -136248 47266
11658C9079r41O2931b4916j76643F0685b027A72019J4829E4846h9364L952A74007
$$ 39079 38138 101069 -24916 -201559 60685 -2027 172019 186848 54846 -89364 -85412 174007
11645B13197E7464b22397f499l1882j21158A81584e2268E2105e1309B99753A04031
$$ 213197 57464 -222397 -6499 -38381 -159539 181584 -52268 52105 -51309 299753 104031
11633b04370D6360K77843b63489l1162A9249J94989b49456H9628l9526e185H3983
$$ -204370 46360 324203 -263489 -294651 19249 214238 -249456 89628 50102 -5185 83983
11621d0219a9786j87007n0912O9329b5047j35107A20389J4998l466a65471n7697
$$ -40219 -19786 -206793 -257705 -188376 -25047 -160154 120389 135387 131921 -165471 -223168
11610b23168k9885j6808J3572e0086B87963F7399L42225j81803D8029j8645R4053
$$ -223168 -253053 -269861 -256289 -50086 287963 67399 409624 227821 48029 29384 123437
11599A23437b64828a26315O0558l9968m3610A01178l7133L0254J97641J1454j35518
$$ 123437 -264828 -126315 -65757 -105725 -149335 101178 64045 94299 291940 303394 167876
11588A67876J88405I2113J07308H080K68687G8963g3977A3412J4015e3197C19850
$$ 167876 356281 92113 199421 8080 276767 78963 -73977 13412 27427 -53197 319850
11576C51967A67810a79657B34475C547c30738B34757A10740k8723C3948J7058
$$ 351967 167810 -179657 234475 3547 -330738 234757 110740 82017 33948 51006
11566E1006b05441A08800K572k7621d2836A87390L9841e5308l13599A66080G1186
$$ 51006 -205441 108800 111372 83751 -42836 187390 227231 -55308 -368907 166080 71186
11554b36467B90707j14498a46644L5287j98574g2864A76633f4481A42007c9771
$$ -236467 290707 176209 -146644 -111357 -309931 -72864 176633 -64481 142007 -39771
11543E6589O8615L4898J26414o6368L9431G5019J1688K45748A59585D1072J99833
$$ 56589 125204 160102 286516 220148 259579 75019 86707 332455 159585 41072 240905
11532B40905P586a95412C07292j23470J7123j0552A5303b04554A23443L8186a98689
$$ 240905 248491 -195412 307292 183822 200945 190393 15303 -204554 123443 161629 -198689
11520B76729d7234C92140a16075A75998m6561o0186b6115B17100a45642I1530
$$ 276729 -47234 392140 -116075 175998 129437 69251 -26115 217100 -145642 91530
11509a34819k4512A85874F9251J12937J0142K43073a4181A32979K7144J02782
$$ -134819 -159331 185874 69251 182188 192330 435403 -14181 132979 160123 262905
11499B62905b85873C15994g4291A14890Q6164L34554a81388H8799J97868a2523
$$ 262905 -285873 315994 -74291 114890 201054 535608 -181388 88799 286667 -12523
11488D2922Q2070e1144B92065C0852a6348H962K84388l410j10509O2419H3784
$$ 42922 124992 -51144 292065 30852 -16348 8962 293350 289940 179431 241850 83784
11476B20788K4126l8970a6071C03790K325r3617n6532L6261a65207e892B35029
$$ 220788 244914 205944 -16071 303790 306115 212498 155966 192227 -165207 -5892 235029
11464b9304p3639C76937L4634j99573K45881b41736A53913R93g9827j15832C36865
$$ -29304 -102943 376937 411571 211998 457879 -241736 153913 154906 -79827 -195659 336865
11452a53447J6661B73334E3820Q2038b6690A3194a24104L5034B91901j36301E5741
$$ -153447 -136786 273334 53820 135858 -26690 13194 -124104 -89070 291901 155600 55741
11440C1681A4791J92364k6120a38497C6738b8320j20223A80013i0206A52958b60868
$$ 31681 14791 207155 181035 -138497 36738 -28320 -148543 180013 -90206 152958 -260868
11428H2466b71995A1145Q4488Q940M0160o4584O3191h4363k46543d2053B04153
$$ 82466 -271995 11145 95633 104573 144733 80149 143340 -84363 -330906 -42053 204153
11416h0359k64928A44311q452A4590g894c10k50961j44803e5998A7172c1718I0392
$$ -80359 -345287 144311 135859 14590 -7894 -310 -251271 -396074 -55998 17172 -31718 90392
11403a29875b8862E08471b438A42605J38708A01411b6268B97602a68617q0029
$$ -129875 -28862 508471 -2438 142605 281313 101411 -26268 297602 -168617 -248646
11393b48646e7218B3673L3987O1330f9841G7512K6230c7782j20928F8066K5662
$$ -248646 -57218 23673 57660 118990 -69841 77512 103742 -37782 -158710 68066 93728
11382I3728d6450m1467k9543C2641a9073k5230A80570A6822b15620B08463C9854
$$ 93728 -46450 -87917 -117460 32641 -19073 -44303 180570 16822 -215620 208463 39854
11370c82037a34351l5978f7018j67128O3032H127b03459a7530D059a03304B46331
$$ -382037 -134351 -170329 -67018 -234146 -171114 8127 -203459 -17530 4059 -103304 246331
11358b37888M8347P4276j12625A57107G3132J57941c24521C70401E583f1820j45766
$$ -237888 -189541 -115265 -227890 157107 73132 231073 -324521 370401 5583 -61820 -207586
11347b07586D1600b21297A63344k0122c20178n3734c6449J930C5019a46528a6284
$$ -207586 41600 -221297 163344 143222 -320178 -373912 -36449 -34519 35019 -146528 -16284
11335g843C93057b42344r5682A28174E1400J23178a03315h347D9911i8274k4855
$$ -7843 393057 -242344 -338026 128174 51400 174578 -103315 -8347 49911 -98274 -123129
11324a23129H145b0755B36454b65487B90286b4610j27219j32404A79460G5017
$$ -123129 8145 -20755 236454 -265487 290286 -24610 -151829 -284233 179460 75017
11313B88748a04454G624a62796o3096A94263b30953A7387a71670B97988a35824
$$ 288748 -104454 7624 -162796 -225892 194263 -230953 17387 -171670 297988 -135824
11302e0897j73138Q4780j47301A1367O7501K62110a68302j59099P4177M5620B9773
$$ -50897 -224035 -139255 -286556 11367 78868 340978 -168302 -327401 -253224 -207604 29773
11290A86915J80127b06600I1692Q1241E9074a97546d5903A37704a90763K7175
$$ 186915 367042 -206600 91692 172933 59074 -197546 -45903 137704 -190763 -163588
11280a63588j20961A13026f1803A2536f3345J0204B3973b65055C11673h8921m1561
$$ -163588 -284549 113026 -61803 12536 -63345 -53141 23973 -265055 311673 -88921 -130482
11269a30482M5979p9712j9740K0655r8655F2354L2839h9356a4062A84948d5493
$$ -130482 -84503 -164215 -183955 -163300 -261955 62354 95193 -89356 -14062 184948 -45493
11257F0085c4601E9745b70943A23440c61097a8759C5879M09570a15432I2862a84784
$$ 60085 -34601 59745 -270943 123440 -361097 -18759 35879 445449 -115432 92862 -184784
11245c23846E9315M2012a89475A58964a53910A90618K1723H0837b63134A99003
$$ -323846 59315 101327 -189475 158964 -153910 190618 212341 80837 -263134 199003
11234a92031e8589m3624j21832H4703K3183a18041m4271A60366E2762a74342d827
$$ -192031 -58589 -102213 -224045 84703 107886 -118041 -162312 160366 52762 -174342 -4827
11222I7804K04973r7207H1728a40245F3872a60755A69609b36626k6235h3971A03165
$$ 97804 302777 205570 81728 -140245 63872 -160755 169609 -236626 -262861 -83971 103165
11210a33409G689b30352A08607a1041m4822j72955j49866f5149a4483D40b6859
$$ -133409 7689 -230352 108607 -11041 -55863 -228818 -378684 -65149 -14483 440 -26859
11198E4631c10813J53950B96888A7765a48803e2005j16995A14418j6217K01775
$$ 54631 -310813 -156863 296888 17765 -148803 -52005 -169000 114418 98201 299976
11188B99976c87067J76290C20076G1163K4690K52163a00358m011A35772A8165
$$ 299976 -387067 -210777 320076 71163 95853 348016 -100358 -104369 135772 18165
11177b19010e4289f381E8197b3679B27129d31159B50843a88724g3857K5156G3287
$$ -219010 -54289 -6381 58197 -23679 227129 -431159 250843 -188724 -73857 -48701 73287
11165B33051Q2023i0470B43248f9320j87003J5410k0354A11015a30173I9530a30170
$$ 233051 315074 -90470 243248 -69320 -256323 -240913 -261267 111015 -130173 99530 -130170
11153d00563J67579A17176a97021a0817C8708i8575J4774j86961B14922A4351
$$ -400563 -232984 117176 -197021 -10817 38708 -98575 -83801 -270762 214922 14351
11142B95000j13031a22669A44640C1066c8743n8731A2573h9565C44357r0772r1532
$$ 295000 181969 -122669 144640 31066 -38743 -97474 12573 -89565 344357 253585 162053
11131A62053c59423B46689B2418R7795G134J0650Q8309J45740e4699B19951d4040
$$ 162053 -359423 246689 22418 120213 7134 17784 106093 251833 -54699 219951 -44040
11119d7726A67153J04124k5762G5376Q8066f216I250i991A57944C7733K78670
$$ -47726 167153 271277 245515 75376 163442 -6216 9250 -9991 157944 37733 316403
11108C16403i3593D11635j37976J06075A0808g4110L0225A1501L1887J50208b37048
$$ 316403 -93593 411635 273659 379734 10808 -74110 -43885 11501 43388 193596 -237048
11096C00735j31056K38338A58043O2430D3792K83579l2434D0459c0106C763b6787
$$ 300735 169679 408017 158043 220473 43792 327371 294937 40459 -30106 3763 -26787
11084G9212a32753B38590b78960C32330j60195L29855A35699K27188j01263K05503
$$ 79212 -132753 238590 -278960 332330 172135 501990 135699 362887 261624 467127
11074D67127h5064C39549j19744l2724o6601J04151p6616J80773G3712J40089
$$ 467127 -85064 339549 219805 187081 120480 224631 148015 328788 73712 213801
11064B13801K02112D6956N68188n5747L5139k80192J87939j41643L59414k06611
$$ 213801 415913 46956 615144 559397 594536 314344 502283 360640 720054 513443
11054E13443q7855K12245k42004K34863j988Q3847l14589L07189P7097l78290
$$ 513443 425588 637833 395829 630692 628704 712551 397962 705151 782248 403958
11044D03958l0486A24686M16861R8784l14107J68975j38020K66728J86775l90088
$$ 403958 373472 124686 541547 640331 326224 495199 357179 623907 810682 420594
11034D20594J02417R8139A98609M21606K74108m40256K82407O1421j21692K1718
$$ 420594 523011 621150 198609 620215 894323 454067 736474 797895 676203 697921
11024F97921C24385L16259J51596j16618j37002m8481M6420n0977j16820L97754
$$ 697921 324385 640644 792240 675622 538620 490139 536559 485582 368762 766516
11014G66516C43684M52467p7102R0766C51168Q7568J15349j4100N0166K19892
$$ 766516 343684 796151 719049 809815 351168 438736 554085 539985 590151 810043
11004H10043k97579J27149O3392l16269M61830R8002k66067j78020N2837j79350
$$ 810043 512464 639613 703005 386736 848566 946568 680501 502481 555318 375968
10994C75968K18795L95719j14475M388D33097K23475J57259B37815M70572L50981
$$ 375968 594763 990482 876007 880395 433097 656572 813831 237815 708387 1059368
10984A059368k85855J07072J1892L32247j30503O4203j08247L01808L19007K41387
$$ 1059368 773513 880585 892477 1224724 1094221 1158424 1050177 1351985 1670992 1912379
10974A912379K57794J82590R332j2539n5032k14919n412k49702l61892M31783
$$ 1912379 2170173 2352763 2362095 2349556 2294524 2079605 2074193 1824491 1462599 1894382
10964A894382l88133m6462m62608L29036J2469L37653m55659M39086k94540J18702
$$ 1894382 1506249 1459787 997179 1326215 1338684 1676337 1220678 1659764 1365224 1483926
10954A483926j81828k19389k31382j65298K798j6914k27788N1074p4579J21509
$$ 1483926 1302098 1082709 851327 686029 688827 671913 444125 495199 420620 542129
10944E42129A22227L60635B17753E5342a5C88842j40122F9655J742A2173g8206
$$ 542129 122227 482862 217753 55342 -15 388842 248720 69655 71397 12173 -78206
10932A51520g6645A2118K92983A17128c41986A43816M06976f5008l7607A48465
$$ 151520 -76645 12118 305101 117128 -341986 143816 550792 -65008 -102615 148465
10921B70239J00976G0976k9626J12877e3873I8265J48548a4732A38446C1521Q0218
$$ 270239 371215 70976 41350 154227 -53873 98265 246813 -14732 138446 31521 111739
10910A11739a28099A22193a15100A7889a72991g2512A28685o2631j3177b44957
$$ 111739 -128099 122193 -115100 17889 -172991 -72512 128685 66054 52877 -244957
10899h1168F8869B4829J13062b23808A27970h8073j50443a13181k00985J45508
$$ -81168 68869 24829 137891 -223808 127970 -88073 -238516 -113181 -314166 -168658
10889a68658e4321m4472j32105A47053c29541Q5063N2431b0940C7045K36029J4503
$$ -168658 -54321 -98793 -230898 147053 -329541 -244478 -192047 -20940 37045 273074 287577
10878B87577F9787b03088a046F7798b4754l47269a44248O6234k09240r8822E9683
$$ 287577 69787 -203088 -1046 67798 -24754 -372023 -144248 -78014 -287254 -386076 59683
10866F8242a54207f4133H130h9823k36164J54750A23371a7163k80880A40400b06133
$$ 68242 -154207 -64133 8130 -89823 -325987 -171237 123371 -17163 -298043 140400 -206133
10854B68880E6483R8977o0612c896j41832d263j14411c0398j14675L2934e1297
$$ 268880 56483 155460 94848 -3896 -145728 -4263 -118674 -30398 -145073 -112139 -51297
10842B14249c29547B05825Q2736b676A82182J49402c8974j635G8436a79784A749
$$ 214249 -329547 205825 288561 -2676 182182 331584 -38974 -40609 78436 -179784 1749
10830b36792j86949J75033B29314K55974e3853o6548B3974c38393f7288D81887
$$ -236792 -423741 -248708 229314 485288 -53853 -120401 23974 -338393 -67288 481887
10819c8931C8965L18945b8040B07389I2522c83961a18213H1242e0978B86787a02447
$$ -38931 38965 357910 -28040 207389 92522 -383961 -118213 81242 -50978 286787 -102447
10807i3674A07587b90917d7219B17542h9678o59C31503b27859j31883c3892B29066
$$ -93674 107587 -290917 -47219 217542 -89678 -90337 331503 -227859 -359742 -33892 229066
10795b2778F3021b86419a05669j79987M714O9935F6220c06108J38798P5801B9474
$$ -22778 63021 -286419 -105669 -285656 -280942 -211007 66220 -306108 -167310 -91509 29474
10783g8699L6769A00296c00262c9251G4367a22692D0791b66074a0705A7864J59795
$$ -78699 -41930 100296 -300262 -39251 74367 -122692 40791 -266074 -10705 17864 177659
10772A77659c36889e2941A34569F2213i4495A02291a76079O2063F8774J67101
$$ 177659 -336889 -52941 134569 62213 -94495 102291 -176079 -114016 68774 235875
10762B35875a95575C26402j11195P9316b40782A44107m598g8245F7409P77J70925
$$ 235875 -195575 326402 215207 294523 -240782 144107 139509 -78245 67409 68186 239111
10751B39111H0416P5748a15845A1671a13546C85L23243c536l2974j35853A94323
$$ 239111 80416 156164 -115845 11671 -113546 385 323628 -3536 -36510 -172363 194323
10739a25458j77411I972Q0655K69405d06318g2456i178C48125A49454M7853d3578
$$ -125458 -302869 9972 90627 360032 -406318 -72456 -9178 348125 149454 197307 -43578
10727A32724g5442H058a5982o6015A2838d40489A34567f0322j54135N2712j25349
$$ 132724 -75442 8058 -15982 -81997 12838 -440489 134567 -60322 -214457 -161745 -287094
10716b87094a34435d3282q1848b8011A53377a16851A0730a51588J635G6241K47750
$$ -287094 -134435 -43282 -125130 -28011 153377 -116851 10730 -151588 -149953 76241 323991
10705C23991a86885N4415A75860H4768J44327b66204I6339a61810j29615f8612
$$ 323991 -186885 -132470 175860 84768 229095 -266204 96339 -161810 -291425 -68612
10694b32278K3924j6599A67835a11078r9420B700J52090b95118a32522m4340j99443
$$ -232278 -208354 -224953 167835 -111078 -210498 2700 154790 -295118 -132522 -176862 -376305
10683c76305C87589A72893a32700C2040O9800O3216P7868a83920d5k0861k12684
$$ -376305 387589 172893 -132700 32040 101840 165056 242924 -183920 -45 -20906 -233590
10672b33590L5131d5211J3638A12571c20580C5951d73923C4339a29512I8737L7654
$$ -233590 -198459 -45211 -31573 112571 -320580 35951 -473923 34339 -129512 98737 136391
10661A36391e3042C3317e7860q9235N0774G584K35164c8146E8664b27923B04503
$$ 136391 -53042 33317 -57860 -147095 -96321 7584 242748 -38146 58664 -227923 204503
10649F4846P8097b76289h8173F4866J04322e6359A665K10311r0806a0419A71439
$$ 64846 142943 -276289 -88173 64866 169188 -56359 1665 211976 121170 -10419 171439
10637d32615b06612a03023k20551C35345b3099C38915D7445P6789N4844d6952
$$ -432615 -206612 -103023 -323574 335345 -23099 338915 47445 124234 179078 -46952
10626C6573a03094b5597q3448p9923A7384b80185C0471a28178E532i2214A919
$$ 36573 -103094 -25597 -109045 -188968 17384 -280185 30471 -128178 5532 -92214 1919
10614d0219j53529i3891A3018J6078a90382a3155B98923h5309c112p3743k14116
$$ -40219 -193748 -93891 13018 29096 -190382 -13155 298923 -85309 -3112 -76855 -290971
10603b90971A88712a91111p4865f8739l2783k1574e413j05579j80227A63301N4274
$$ -290971 188712 -191111 -265976 -68739 -101522 -123096 -5413 -110992 -291219 163301 217575
10592B17575F1374c37564B74353e9795A76918J3762b66801A95903J38016b37424
$$ 217575 61374 -337564 274353 -59795 176918 190680 -266801 195903 333919 -237424
10581b11372j5661i1150E5013c28305c4960o8919h242m4890K1804j88607a09543
$$ -211372 -227033 -91150 55013 -328305 -34960 -103879 -8242 -53132 -31328 -219935 -109543
10569a28348a567j35133q3569g4134C39850g3329D60482a95094B9642K4082j8623
$$ -128348 -1567 -136700 -220269 -74134 339850 -73329 460482 -195094 29642 53724 35101
10558C5101J17026h8602j25842L7135A38763b12426b2999n41366I3259B721h3621
$$ 35101 152127 -88602 -214444 -177309 138763 -212426 -22999 -564365 93259 2721 -83621
10546B17955D3465J18351a43765J7985A07071m2139B2211J80220l0671b4909j83622
$$ 217955 43465 161816 -143765 -125780 107071 64932 22211 202431 171760 -24909 -208531
10535b08531O0558L360j1348o6666N0809L0940f3053B3041M2410N30b7321j03524
$$ -208531 -147973 -144613 -155961 -222627 -171818 -140878 -63053 23041 65451 65981 -27321 -130845
10523a30845H1642g9537l45684L7753F7110K160L686b14160I7595a99882C5829
$$ -130845 81642 -79537 -425221 -387468 67110 69270 72956 -214160 97595 -199882 35829
10511b08773n9876a178B27322a64792D5209a06886M3862j46512K0324I7776M0598
$$ -208773 -268649 -1178 227322 -164792 45209 -106886 -63024 -209536 -189212 97776 138374
10500A38374b38031P3574O7992j89101A45615h7961C7706A227J95435m58a29068
$$ 138374 -238031 -164457 -96465 -285566 145615 -87961 37706 1227 196662 196204 -129068
10488b10637A00948h5944B06749p829R8377J14816a19694B10573L68008B63827
$$ -210637 100948 -85944 206749 198920 297297 412113 -119694 210573 578581 263827
10477C43938a9927q4920A73923L60929c22123j3802Q709i7281B87860F9161J71955
$$ 343938 -19927 -104847 173923 534852 -322123 -335925 -327216 -97281 287860 69161 241116
10466B41116f3262A87146I602c7214B4245c21724j3311A29186b52483Q0622D103
$$ 241116 -63262 187146 9602 -37214 24245 -321724 -335035 129186 -252483 -171861 4103
10454A92933b37483E8088A570a84843R0742a6915l12409F5276P9092C8592a3708
$$ 192933 -237483 58088 1570 -184843 -94101 -16915 -329324 65276 144368 38592 -13708
10442h1474c9931Q325A23460a13650J6801F6430b68719B55837E9729J57403r7795
$$ -81474 -39931 -31606 123460 -113650 -96849 66430 -268719 255837 59729 217132 119337
10431A19337a13587A34650i2210B28139A05939c39318A42797l2613N8669c33028
$$ 119337 -113587 134650 -92210 228139 105939 -339318 142797 110184 168853 -333028
10420a48928A54060a92833M3448A25948c77678I0258f3477B97038g1698j36893
$$ -148928 154060 -192833 -149385 125948 -377678 90258 -63477 297038 -71698 -208591
10410b08591d8479G189M0032K61803F9198a24450A48139k0452a75728F3717a30514
$$ -208591 -48479 7189 47221 309024 69198 -124450 148139 127687 -175728 63717 -130514
10398A57251k0675j8735N6045o348c6930B78728B1747a60405C34845b1968C13972
$$ 157251 136576 117841 173886 167538 -36930 278728 21747 -160405 334845 -21968 313972
10386A7393K80640d1500A50184F5328D50b45500A28560D3728J14204K45471e3533
$$ 17393 298033 -41500 150184 65328 450 -245500 128560 43728 157932 403403 -53533
10374C68403j60393K3742Q1761b6026A98625n6100J49639J70044M2454K07848
$$ 368403 208010 231752 313513 -26026 198625 142525 292164 462208 504662 712510
10364G12510l21481a09773B64528E9594J49912P0733D0232L09234h1143G0014
$$ 712510 391029 -109773 264528 59594 209506 280239 40232 349466 -81143 70014
10353A63660K64211c1141C55256k4387K0293m2425L54758l01380J72316J074p7243
$$ 163660 427871 -31141 355256 330869 351162 308737 663495 362115 534431 535505 458262
10342D58262j86115K1968j38406J41073J66275A6278K41495D807J47971B2049
$$ 458262 272147 294115 155709 296782 463057 16278 257773 4807 152778 22049
10331A73041b51761I8578a42009M9350D6594K27091q4576e8011B27978j09344
$$ 173041 -251761 98578 -142009 -92659 46594 273685 189109 -58011 227978 118634
10321A18634j5516J08175A9009h0211m5833B19319c51823A45064P0421A3364b8564
$$ 118634 103118 211293 19009 -80211 -126044 219319 -351823 145064 215485 13364 -28564
10309A49120J06541b9870C7727e6989C06528e8741n2757H8591j2373a21094d8528
$$ 149120 255661 -29870 37727 -56989 306528 -58741 -111498 88591 76218 -121094 -48528
10297b4491I6534d5776A35385E4199d6537k96573A54998I861a60610l50388a70648
$$ -24491 96534 -45776 135385 54199 -46537 -343110 154998 9861 -160610 -510998 -170648
10285a22029C70374h7756k40475B70378D9554a25303H7481c3634E0215a43226
$$ -122029 370374 -87756 -328231 270378 49554 -125303 87481 -33634 50215 -143226
10274D2093J19144a99790M7537M6802r7119a7180l03323A06119D7502b8908A74936
$$ 42093 161237 -199790 -152253 -105451 -202570 -17180 -320503 106119 47502 -28908 174936
10262a04107J7263B05001B1754M11775A87241q9506O2514A7186e2596a8190B84279
$$ -104107 -86844 205001 21754 433529 187241 97735 160249 17186 -52596 -18190 284279
10250d32907f7933p9001F9664R3757a57275B1641c36791a19548j96580B71420
$$ -432907 -67933 -146934 69664 163421 -157275 21641 -336791 -119548 -316128 271420
10239f9904H4674c7988G5424c8680o3142q9057j04169e6217q9611C3524N6545
$$ -69904 84674 -37988 75424 -38680 -101822 -190879 -295048 -56217 -145828 33524 90069
10228I0069a89046B6797K51690a1392l38613H0881c02995A90378M5709A15406
$$ 90069 -189046 26797 278487 -11392 -350005 80881 -302995 190378 236087 115406
10217a62366k5647c8613E133K47051m2652b09769N2917B2972d10571g7409A83188
$$ -162366 -188013 -38613 5133 252184 209532 -209769 -156852 22972 -410571 -77409 183188
10205d16002e3852B0967J43423c01926f5928C1203b3348A1658b16568K9940A81460
$$ -416002 -53852 20967 164390 -301926 -65928 31203 -23348 11658 -216568 -186628 181460
10193a02140j6782G2786J70483b49913B40293A17092f0145C14444q0427F0557
$$ -102140 -118922 72786 243269 -249913 240293 117092 -60145 314444 234017 60557
10182a75955J1467K8653j96242a08916A6406f1102o3684p5873O8099c7338j89294
$$ -175955 -164488 -135835 -332077 -108916 16406 -61102 -124786 -200659 -132560 -37338 -226632
10171b26632o66B8239p764Q6378b71533i6185m6356K6188J3645A18044c43635
$$ -226632 -227298 28239 20475 106853 -271533 -96185 -142541 -116353 -102708 118044 -343635
10159a32781r4035B751h0163k89531Q6900O146J33037k55142A26912c03911c4325
$$ -132781 -226816 2751 -80163 -369694 -282794 -276648 -143611 -398753 126912 -303911 -34325
10147C16672H8618J28665b69944o9768J51662f7730o932L6617l4273k8767A41875
$$ 316672 88618 217283 -269944 -339712 -188050 -67730 -74662 -38045 -72318 -101085 141875
10135A06748b9773d694j08799A23532j7715a40699j97311H7185J8512a31419L0815
$$ 106748 -29773 -4694 -113493 123532 105817 -140699 -338010 87185 105697 -131419 -100604
10124a00604j21601J755j4330f3773r5686q7486a1192l07518d5189k70952a1997
$$ -100604 -222205 -220450 -234780 -63773 -159459 -246945 -11192 -318710 -45189 -316141 -11997
10112C2993G507M4762R5815h4927A35542a7329A91989H2334a05813C6769O4445
$$ 32993 7507 52269 148084 -84927 135542 -17329 191989 82334 -105813 36769 101214
10101A01214a4195B56069D1199a80596D4727b69072A63268a60449f2413B43370
$$ 101214 -14195 256069 41199 -180596 44727 -269072 163268 -160449 -62413 243370
10090B27737E7887b81056h8241Q685J8656a1560j77080M6344E5294Q5851O9674
$$ 227737 57887 -281056 -88241 -79556 -60900 -11560 -188640 -142296 55294 141145 210819
10079B10819j04618e8055B21318a25794k36125i4591F9274a46742f121j13549
$$ 210819 106201 -58055 221318 -125794 -361919 -94591 69274 -146742 -6121 -119670
10069a19670m5732F5690k9209i6358k9786l2630g4359n8261B11108f1236n77109
$$ -119670 -165402 65690 36481 -96358 -126144 -158774 -74359 -132620 211108 -61236 -638345
10058f38345H0854P7048i9347j32483N2360A24423e6986q3801K1536a9692l8846
$$ -638345 80854 157902 -99347 -231830 -179470 124423 -56986 -140787 -119251 -19692 -58538
10047e8538B38129b16441p2206H9845c58125i2988d0225k28656e4177l1748C41439
$$ -58538 238129 -216441 -288647 89845 -358125 -92988 -40225 -268881 -54177 -85925 341439
10035A38715d10087A8655N2752g764B2024c7205A04897m8080a19640k9287F8630
$$ 138715 -410087 18655 71407 -7764 22024 -37205 104897 56817 -119640 -148927 68630
10023b33738A17887N3003F6000b14373B71966j10707a10383k1294K320K6461B42160
$$ -233738 117887 170890 66000 -214373 271966 161259 -110383 -131677 -129357 -102896 242160
10011A4571c16l3981m2927N223k8405m1258G1797d3020j7148b0470D5553b84077
$$ 14571 -316 -34297 -77224 -72001 -100406 -141664 71797 -43020 -60168 -20470 45553 -284077
9998E00548B17944b1989A22193b57259i4274G1841a35776E0182J88704c33240
$$ 500548 217944 -21989 122193 -257259 -94274 71841 -135776 50182 238886 -333240
9987B66117c17412d190A04004a87426M5570j23015i6990l0158j58050D7111l379
$$ 266117 -317412 -4190 104004 -187426 -141856 -264871 -96990 -127148 -285198 47111 43732
9976D3732j3002a0439k7887l2067m3821A45765e8613j04390B87720c09468B82303
$$ 43732 30730 -10439 -38326 -70393 -114214 145765 -58613 -163003 287720 -309468 282303
9964A20876A6857d77497g5398j95589B01036A992a40616C45402h7984k14365I469
$$ 120876 16857 -477497 -75398 -270987 201036 1992 -140616 345402 -87984 -302349 9469
9952b77014H9272b85696A05116a07353J2688C7000c60745A88266m1849k5576m3448
$$ -277014 89272 -285696 105116 -107353 -94665 37000 -360745 188266 146417 120841 77393
9941G7393f8236o5319l82597H8256K45197b22253F8094F490J81633L568H9475
$$ 77393 -68236 -133555 -516152 88256 333453 -222253 68094 6490 188123 191691 89475
9929b659k98555P4333d2823j20358C3168L9305j0388E901b59118d7587a4135j32858
$$ -2659 -301214 -226881 -42823 -163181 33168 72473 62085 5901 -259118 -47587 -14135 -146993
9917a46993m1871C49614a14163n037b9503j916A26719b09949N2966c7248E12833
$$ -146993 -188864 349614 -114163 -119200 -29503 -31419 126719 -209949 -156983 -37248 512833
9905b88684a00576K7664k4487j08479J01155D2734b25661a2805G530c68496J68195
$$ -288684 -100576 -72912 -97399 -205878 -104723 42734 -225661 -12805 7530 -368496 -200301
9894b00301Q6955k14010b6313I9703b32690e1758j4501A63076b20436N9081e7774
$$ -200301 -113346 -327356 -26313 99703 -232690 -51758 -66259 163076 -220436 -161355 -57774
9882F8761a36452F4294b15569a0071r3372l5787e1079J9053k6915r1537P886D8734
$$ 68761 -136452 64294 -215569 -10071 -103443 -139230 -51079 -32026 -58941 -150478 -142592 48734
9869a1995B1223O9438c07181a31080m2914k28980A19766b434j00636m8730j22097
$$ -11995 21223 90661 -307181 -131080 -173994 -402974 119766 -2434 -103070 -151800 -273897
9858b73897A06110c7401A02270B9810L32544b70895J14748B29163H3470a22150
$$ -273897 106110 -37401 102270 29810 362354 -270895 -156147 229163 83470 -122150
9847c46208J02512G9559d32508b817l11408g1862E0357b38445e2819k29199a6789
$$ -346208 -243696 79559 -432508 -2817 -314225 -71862 50357 -238445 -52819 -282018 -16789
9835C08612C2137a62839A83587F7273b03750R3166j01863j86784J56711J00715
$$ 308612 32137 -162839 183587 67273 -203750 -110584 -212447 -399231 -242520 -141805
9825a41805A35394b9799l55515C5947a46611M1159J4116F2948b56503i3966j47239
$$ -141805 135394 -29799 -385314 35947 -146611 -105452 -91336 62948 -256503 -93966 -241205
9814b41205E111K3815g2235j73439i8708C5986c15471p5392A0598M13892D8985
$$ -241205 5111 28926 -72235 -245674 -98708 35986 -315471 -390863 10598 424490 48985
9802c9996A3668b90539i7889o2640d8095C5931J57485a5538j54777e5338j72074
$$ -39996 13668 -290539 -97889 -160529 -48095 35931 193416 -15538 -170315 -55338 -227412
9791b27412G2841a02469p5947l31089a45497m273n7075f7966j6677j8886j3192
$$ -227412 72841 -102469 -178416 -509505 -145497 -149770 -206845 -67966 -84643 -103529 -116721
9780a16721j10995h6788j50742Q5513L7808c6768l01721a51276M3391k44099a22820
$$ -116721 -227716 -86788 -237530 -152017 -114209 -36768 -338489 -151276 -107885 -351984 -122820
9768F8298N6454e73143A34812b30120r0960K9419g1895q7547m27435e7906B715
$$ 68298 124752 -573143 134812 -230120 -321080 -291661 -71895 -159442 -586877 -57906 2715
9756a70887I7832g9917F9184B6590N4819c8909I138Q8978f0657K1253a0792k83362
$$ -170887 97832 -79917 69184 26590 81409 -38909 9138 98116 -60657 -39404 -10792 -294154
9744b94154A36332b88927a18651l8551f1558H7894a01627L5793k896B09752H349
$$ -294154 136332 -288927 -118651 -157202 -61558 87894 -101627 -65834 -68730 209752 8349
9732F1255J56124a05870A31636l2821l9451j654f8865A40623C9699a53250G591
$$ 61255 217379 -105870 131636 98815 59364 57710 -68865 140623 39699 -153250 7591
9720b95937A3175J88068b91732a18790A30582C6003a47210I6330a36314F3471
$$ -295937 13175 201243 -291732 -118790 130582 36003 -147210 96330 -136314 63471
9709c25122E5896b36845K6517K0240A36240K7236g5571G4517a96499J2670g0088
$$ -325122 55896 -236845 -210328 -190088 136240 163476 -75571 74517 -196499 -183829 -70088
9697b8202n527k34292A05441D5140a00388I582K6356R2872b32565d7856l55214
$$ -28202 -33729 -268021 105441 45140 -100388 9582 35938 128810 -232565 -47856 -403070
9686d03070A10630b03624D43464c7020B3170a6727o2719G3174J35964g8768j42548
$$ -403070 110630 -203624 443464 -37020 23170 -16727 -79446 73174 209138 -78768 -221316
9675b21316B11057a69617f5818q0852d791j75883e4261H3220B0922I072L7230
$$ -221316 211057 -169617 -65818 -146670 -4791 -180674 -54261 83220 20922 9072 46302
9664D6302d9282C79886I0357c0688j51475k065h4019k55397a04837j21534a2180
$$ 46302 -49282 379886 90357 -30688 -182163 -184228 -84019 -339416 -104837 -226371 -12180
9652c9675A13494k2635a51706k977r9203j99166E222h7858n3936b1749k38393
$$ -39675 113494 90859 -151706 -154683 -253886 -453052 5222 -87858 -141794 -21749 -260142
9641b60142b0807k98049g258l20613A38510a15159E586J39965d98652b06867d1967
$$ -260142 -20807 -318856 -7258 -327871 138510 -115159 5586 145551 -498652 -206867 -41967
9629A34269E7637b44265b9540G7912B2456c08266A04470P4976b59009k55782B64286
$$ 134269 57637 -244265 -29540 77912 22456 -308266 104470 179446 -259009 -514791 264286
9617a60952c6826D3060C441g2206j97055J08315M1275f444j3066k70051B60636
$$ -160952 -36826 43060 3441 -72206 -269261 -160946 -119671 -6444 -19510 -289561 260636
9605a63663l315L0013A59917K10969a42766H3850C9225a67660a2142k73059l9303
$$ -163663 -166978 -136965 159917 370886 -142766 83850 39225 -167660 -12142 -285201 -324504
9594c24504A08535j6952i2542G0920b08965F9181c78260J61853m0083E4261J14594
$$ -324504 108535 91583 -92542 70920 -208965 69181 -378260 -216407 -256490 54261 168855
9583A68855D4848a64938B57012b05672p3065h4261b0123F3928i2144p9657A11263
$$ 168855 44848 -164938 257012 -205672 -278737 -84261 -20123 63928 -92144 -171801 111263
9571c29776N5747A37206b05257B86161a70714k02264d4090j07693l73174h0031
$$ -329776 -274029 137206 -205257 286161 -170714 -372978 -44090 -151783 -524957 -80031
9560A89035C7285J12361a41652h486j04529D8357h7988G8699i9621l0470M2008
$$ 189035 37285 149646 -141652 -8486 -113015 48357 -87988 78699 -99621 -130091 -88083
9549h8083p3663B28326b32878h9739E346d53996A96262P765h4426l68745i5016
$$ -88083 -161746 228326 -232878 -89739 5346 -453996 196262 204027 -84426 -453171 -95016
9537C69921a46051C51514b34204K2514G243R4996j6992b66034A49875q503f955
$$ 369921 -146051 351514 -234204 -211690 7243 102239 85247 -266034 149875 141372 -6955
9525b44483A17036c68759a48092a4485r1202I9172e5945a7918B556O7873g2689
$$ -244483 117036 -368759 -148092 -14485 -105687 99172 -55945 -17918 2556 70429 -72689
9513c3108A77586c5687j34870e0826F158a93381J8174e3854B9411h3921j00737
$$ -33108 177586 -35687 -170557 -50826 6158 -193381 -175207 -53854 29411 -83921 -184658
9502a84658I8108Q050e3397H6992c05918o7477A42384h2882k25225a50750n2273
$$ -184658 98108 106158 -53397 86992 -305918 -373395 142384 -82882 -308107 -150750 -203023
9491b03023C1615i7474n3849A33398a69288g1539k62530g749j20021k20435B01807
$$ -203023 31615 -97474 -151323 133398 -169288 -71539 -334069 -7749 -127770 -348205 201807
9479b85j23717N104j33472Q1507O3741l24655C4897M7531a68294F5410Q15K24178
$$ -285 -124002 -118898 -252370 -170863 -107122 -431777 34897 82428 -168294 65410 66225 290403
9467B90403K2174d3690H7333a32163d1259j27861A61993J0623B2081J77981a07855
$$ 290403 312577 -43690 87333 -132163 -41259 -169120 161993 172616 22081 200062 -107855
9455B62548e5419K3233j0870j70709J5405B0169n644J05389A714a8648o5494B10717
$$ 262548 -55419 -32186 -43056 -213765 -198360 20169 14525 119914 1714 -18648 -84142 210717
9442e8338B65015n9819n3693B485J57822A2938d5604l4725m37650b48638J02826
$$ -58338 265015 205196 151503 2485 160307 12938 -45604 -80329 -517979 -248638 -145812
9431a45812k47566A34173a46849N9945l26440a6353o0690H8680a66800j91122
$$ -145812 -393378 134173 -146849 -86904 -413344 -16353 -77043 88680 -166800 -357922
9421c57922b1283j446O798l02231h3848l47156N6351A96225b61362J18268p8496
$$ -357922 -21283 -22729 -15931 -318162 -83848 -431004 -374653 196225 -261362 -143094 -221590
9410b21590r2378R7692O7293B95291G04M8446c9915j75238A53476a36486O2240
$$ -221590 -313968 -216276 -148983 295291 704 49150 -39915 -215153 153476 -136486 -74246
9399g4246l3637r5320A83236a29229m2009C5778N4660a58681c9869l26257a38493
$$ -74246 -107883 -203203 183236 -129229 -171238 35778 90438 -158681 -39869 -366126 -138493
9387a9100l27572a19851p8383O3230A17849E2202J76816a64882K3416c9850D905
$$ -19100 -346672 -119851 -198234 -135004 117849 52202 229018 -164882 -141466 -39850 4905
9375E2534A3445b38028f2578j24580j0646g5748E4437L44542B6538F775a57072
$$ 52534 13445 -238028 -62578 -187158 -197804 -75748 54437 398979 26538 6775 -157072
9363b23252R166A0422J7710b52428A74923n8087a76598D3c63473e7360B5334b97223
$$ -223252 -214086 10422 28132 -252428 174923 116836 -176598 43 -363473 -57360 25334 -297223
9350A61131J3876R1550r9714B7737h8251B31338c30902C21280a82795C3338a69273
$$ 161131 175007 266557 166843 27737 -88251 231338 -330902 321280 -182795 33338 -169273
9338A16309K87380I750b31286H2589b99133f2083D9789e1745j52398B22654f5602
$$ 116309 403689 9750 -231286 82589 -299133 -62083 49789 -51745 -204143 222654 -65602
9326E0237J39015b22730F9315c7864j42749B8719b04123f5936c163r6931l03730
$$ 50237 189252 -222730 69315 -37864 -180613 28719 -204123 -65936 -3163 -100094 -403824
9315d03824A37971b39678a07682J9190B7214A3451J12783a44932O0441E2041g1272
$$ -403824 137971 -239678 -107682 -88492 27214 13451 126234 -144932 -84491 52041 -71272
9303A84951c01143A96859a47787O447d3147G2713K4283B3078b56849J24917j72321
$$ 184951 -301143 196859 -147787 -141340 -43147 72713 96996 23078 -256849 -131932 -304253
9292c04253J28622e949l4593j13672d4962r6817C9023O4880a82047A82069a06446
$$ -304253 -175631 -5949 -40542 -154214 -44962 -141779 39023 103903 -182047 182069 -106446
9280c19888G4371b38514B06646a51975H0713O029q147f3398j58709l8110I210
$$ -319888 74371 -238514 206646 -151975 80713 86742 78595 -63398 -222107 -260217 9210
9268I7858b93121L1895a26401c9728j41380B05497l0559m6229c5001j91814f796
$$ 97858 -293121 -261226 -126401 -39728 -181108 205497 174938 128709 -35001 -226815 -6796
9256H2185b52603N8372F0809a14730b3429k13996a0838A15068b30824f4457j66368
$$ 82185 -252603 -194231 60809 -114730 -23429 -237425 -10838 115068 -230824 -64457 -230825
9245b30825A19084O4085I0858e9767J530k55272B69330D3203J39243a03716A58525
$$ -230825 119084 183169 90858 -59767 -58237 -313509 269330 43203 182446 -103716 158525
9233I064b54161e7659m18325a81349D3348a60171A11922F572a10220l5124d3373
$$ 9064 -254161 -57659 -475984 -181349 43348 -160171 111922 6572 -110220 -145344 -43373
9221a55132H2453N1173i1835l0806k7395A78849b48063N6395C6014k571O7308
$$ -155132 82453 133626 -91835 -122641 -150036 178849 -248063 -191668 36014 33443 100751
9210A00751B0488a68748j18863Q5489j7291o94J2858n6913D6019M0384a25631
$$ 100751 20488 -168748 -287611 -202122 -219413 -220107 -207249 -264162 46019 86403 -125631
9198A04108j8984h0644n3829A98569c02323a03354D7218J2353J21404i1114d1307
$$ 104108 85124 -80644 -134473 198569 -302323 -103354 47218 59571 180975 -91114 -41307
9186a29702M1004j36838h4864c5084j04549n2573I8905a77348P7364A2852b35095
$$ -129702 -88698 -225536 -84864 -35084 -139633 -192206 98905 -177348 -99984 12852 -235095
9174b4331j24043e3369F7522N7118a82411n7764O3053k6099k3269C1179R8898
$$ -24331 -148374 -53369 67522 124640 -182411 -240175 -177122 -203221 -226490 31179 130077
9163A30077a68479a6162F7991a29295B21678a58184k3827l4277D54369g0203E1008
$$ 130077 -168479 -16162 67991 -129295 221678 -158184 -182011 -216288 454369 -70203 51008
9151b19795A04825a51274k00610A81657d08814c5137j23797c6952q8288L1825
$$ -219795 104825 -151274 -351884 181657 -408814 -35137 -158934 -36952 -125240 -93415
9141i3415o6971A36081a66701L643e3741E3165i8726k5486M3093C5498a61391
$$ -93415 -160386 136081 -166701 -163058 -53741 53165 -98726 -124212 -81119 35498 -161391
9129D8564J25922F9524g3831L1133B35381A1746M3251b82220E0866E14a86758
$$ 48564 174486 69524 -73831 -42698 235381 11746 54997 -282220 50866 514 -186758
9117E3310a77818J5537k17383l6863I6939E199b41935j84985a44117j03055f5205
$$ 53310 -177818 -162281 -379664 -416527 96939 5199 -241935 -426920 -144117 -247172 -65205
9105a22154j46120R3389g1544k26251P3028a00868E5383h8078A71258a34504L326
$$ -122154 -268274 -174885 -71544 -297795 -224767 -100868 55383 -88078 171258 -134504 -131178
9094a31178m3559f0069l01258d3124n8269d1771o8755B6881P1092k7416J45086
$$ -131178 -174737 -60069 -361327 -43124 -101393 -41771 -110526 26881 97973 70557 215643
9083B15643a90224b8539n9581F0907b64429N0449p3855A15172a89989Q5451j7591
$$ 215643 -190224 -28539 -88120 60907 -264429 -213980 -287835 115172 -189989 -104538 -122129
9072a22129a6669G917a26013A50554b51514b7598l30914e2505a5035n5913D56781
$$ -122129 -16669 7917 -126013 150554 -251514 -27598 -358512 -52505 -15035 -70948 456781
9060B46327a61846j41634P7115b5283m38697a29758A40628g754l4712r3578d0140
$$ 246327 -161846 -303480 -226365 -25283 -463980 -129758 140628 -7754 -42466 -136044 -40140
9048f572l89158A0048J40872a30174l52700B12406C0793a70677o3531M5067e2442
$$ -6572 -395730 10048 150920 -130174 -482874 212406 30793 -170677 -234208 -189141 -52442
9036h9013c956q0053C11265i5415d1958k33547h3613j2020K168B24506B1264a798
$$ -89013 -3956 -84009 311265 -95415 -41958 -275505 -83613 -95633 -93465 224506 21264 -1798
9023b49418B07009J38022g2968a391n4491k91129l0650a58562F9209a21281j42398
$$ -249418 207009 345031 -72968 -1391 -55882 -347011 -377661 -158562 69209 -121281 -263679
9012b63679K4507A28715O494K60360a65067I7652J29121m2277d1659j73400A25693
$$ -263679 -239172 128715 135209 395569 -165067 97652 226773 184496 -41659 -215059 125693
9000c4662P508l19051J24073b7261k95681C3577K506j7127M51898e3547C91447
$$ -34662 -27154 -346205 -222132 -27261 -322942 33577 36083 18956 470854 -53547 391447
8988f1391F1567b07760P4252A31564e8959j16175c3286p2168E0569a70096H466
$$ -61391 61567 -207760 -133508 131564 -58959 -175134 -33286 -105454 50569 -170096 8466
8976a55797k2404D3665L3663g6875A03591L7011b4271k71500B22170c08010A43557
$$ -155797 -178201 43665 77328 -76875 103591 140602 -24271 -295771 222170 -308010 143557
8964a82858A19564a54225E3592R679p931b00706i2852B56786b21715a09192M5936
$$ -182858 119564 -154225 53592 63271 55340 -200706 -92852 256786 -221715 -109192 -63256
8953f3256l465E0786J34298L3062a83336q7964p8494J14147A50966M7780f1613
$$ -63256 -66721 50786 185084 218146 -183336 -271300 -349794 -235647 150966 198746 -61613
8941d39767A08851a09352P104J108m1215A25123J4044J500c56619a09382n5159
$$ -439767 108851 -109352 -102248 -101140 -142355 125123 139167 140667 -356619 -109382 -164541
8930a64541j87825J14799f2513c0212I8541l1830M18336J034237L923529P166273
$$ -164541 -352366 -237567 -62513 -30212 98541 66711 485047 1519284 5442813 12609086
8920A2609086C666657A127587n41050A73232c8266k1742k66874B84144F889K33128
$$ 12609086 3666657 1127587 586537 173232 -38266 -60008 -326882 284144 6889 240017
8910B40017J10409q8939J7501j23290k9840b10841A41384h0219J2299k25932k0089
$$ 240017 350426 261487 278988 155698 125858 -210841 141384 -80219 -67920 -293852 -313941
8899c13941C1029h4266A91099F1526i2347b512j32220G3969A3383C780f0759H2282
$$ -313941 31029 -84266 191099 61526 -92347 -2512 -134732 73969 13383 3780 -60759 82282
8886g3816D4121L02830c02367e0529e702B09648a38614D4683a13110A28624a42907
$$ -73816 44121 346951 -302367 -50529 -5702 209648 -138614 44683 -113110 128624 -142907
$$ [...]
##END NTUPLES=NMR SPECTRUM
##END=
