
##TITLE=UV1108_M2_1290-1353_7180768_6d9Npm8vV0
##JCAMPDX= 6.0         $$ Bruker NMR JCAMP-DX V2.0
##DATA TYPE= NMR SPECTRUM
##DATA CLASS= NTUPLES
##ORIGIN= BRUKER
##OWNER= Administrator
$$ 1.72 TOPSPIN		Version 2.1
$$ 2012-12-05 04:17:29.325 -0500  Administrator@X
$$ Compression mode = diff/dup
##.OBSERVE FREQUENCY= 400.02188249412
##.OBSERVE NUCLEUS= ^1H
##.ACQUISITION MODE= SIMULTANEOUS (DQD)
##.ACQUISITION SCHEME= undefined
##.AVERAGES= 8
##.DIGITISER RES= 22
##SPECTROMETER/DATA SYSTEM= spect
##.PULSE SEQUENCE= zg30
##.SOLVENT NAME= COFFEE_meoh
##.SHIFT REFERENCE= INTERNAL, COFFEE_meoh, 1, 14.98509
##AUDIT TRAIL= $$ (NUMBER, WHEN, WHO, WHERE, PROCESS, VERSION, WHAT)
$$ ##TITLE= Audit trail, TOPSPIN		Version 2.1
$$ ##JCAMPDX= 5.01
$$ ##ORIGIN= Bruker BioSpin GmbH
$$ ##OWNER= Administrator
$$ $$ E:\/data/COFFEE/nmr/UV1108_M2_1290-1353_7180768_6d9Npm8vV0/10/pdata/1/auditp.txt
$$ ##AUDIT TRAIL=  $$ (NUMBER, WHEN, WHO, WHERE, PROCESS, VERSION, WHAT)
(   1,<2012-12-05 04:17:21.215 -0500>,<Administrator>,<X>,<go>,<TOPSPIN 2.1>,
      <created by zg
	started at 2012-12-05 04:16:15.278 -0500,
	POWCHK enabled, PULCHK disabled,
       configuration hash MD5:
       86 BA 57 50 F2 9D 5C 9B 26 00 A9 28 5F 66 2E 89
       data hash MD5: 64K
       AA B3 9B 80 D6 FA 2B 35 D3 6F 2D 60 50 11 5B CE>)
(   2,<2012-12-05 04:17:24.278 -0500>,<Administrator>,<X>,<proc1d>,<TOPSPIN 2.1>,
      <Start of raw data processing
       efp LB = 0 FT_mod = 6 PKNL = 1 PHC0 = 0 PHC1 = 0 SI = 32K 
       data hash MD5: 32K
       FD 57 A3 93 D4 55 AD 18 F0 C3 52 F8 16 62 41 69>)
(   3,<2012-12-05 04:17:24.731 -0500>,<Administrator>,<X>,<proc1d>,<TOPSPIN 2.1>,
      <pk PHC0 = 98.42102 PHC1 = 0 
       data hash MD5: 32K
       48 BA D7 CB 77 77 B3 94 AA CB 35 6B D7 93 59 2D>)
(   4,<2012-12-05 04:17:24.981 -0500>,<Administrator>,<X>,<proc1d>,<TOPSPIN 2.1>,
      <abs ABSG = 1 
       data hash MD5: 32K
       37 7D 25 42 CF 73 D0 1B 9E 30 4E 60 49 B6 8D A0>)
(   5,<2012-12-05 04:17:25.122 -0500>,<Administrator>,<X>,<proc1d>,<TOPSPIN 2.1>,
      <abs ABSG = 2 
       data hash MD5: 32K
       38 5F 61 8E 33 A5 71 DF 78 CB 79 E3 2B C2 99 2F>)
(   6,<2012-12-05 04:17:25.278 -0500>,<Administrator>,<X>,<proc1d>,<TOPSPIN 2.1>,
      <abs ABSG = 3 
       data hash MD5: 32K
       4B DA 5A C5 2A 3A A5 B7 0D 0C 2E 19 1A 0B A7 74>)
(   7,<2012-12-05 04:17:25.418 -0500>,<Administrator>,<X>,<proc1d>,<TOPSPIN 2.1>,
      <abs ABSG = 4 
       data hash MD5: 32K
       E5 71 2C FB 9B 90 37 08 61 9B 45 E4 6A D4 20 FC>)
(   8,<2012-12-05 04:17:25.575 -0500>,<Administrator>,<X>,<proc1d>,<TOPSPIN 2.1>,
      <abs ABSG = 5 
       data hash MD5: 32K
       EF CF 8B 75 D8 5B 01 13 BA 28 B5 CB 97 94 92 01>)
$$ ##END=
$$ 
$$ $$ hash MD5
$$ $$ 91 A6 78 D5 39 9F B7 C4 C1 BB 9F 11 97 C4 69 BF
##$RELAX= 
##$RELAX= 
##$RELAX= 
##$RELAX= 
##$RELAX= 
##$RELAX= 
##$RELAX= 
$$ Bruker specific parameters
$$ --------------------------
##$DU= <E:\>
##$EXPNO= 10
$$ [...]
150 150 150 150 150 150 150 150
##$TP07= 0
##$TPNAME0= <>
##$TPNAME1= <>
##$TPNAME2= <>
##$TPNAME3= <>
##$TPNAME4= <>
##$TPNAME5= <>
##$TPNAME6= <>
##$TPNAME7= <>
##$TPOAL= (0..7)
0.5 0.5 0.5 0.5 0.5 0.5 0.5 0.5
##$TPOFFS= (0..7)
0 0 0 0 0 0 0 0
##$TUNHIN= 0
##$TUNHOUT= 0
##$TUNXOUT= 0
##$USERA1= <user>
##$USERA2= <user>
##$USERA3= <user>
##$USERA4= <user>
##$USERA5= <user>
##$V9= 5
##$VALIST= <valist>
##$VCLIST= <CCCCCCCCCCCCCCC>
##$VD= 0
##$VDLIST= <DDDDDDDDDDDDDDD>
##$VPLIST= <PPPPPPPPPPPPPPP>
##$VTLIST= <TTTTTTTTTTTTTTT>
##$WBST= 2048
##$WBSW= 25
##$XGAIN= (0..3)
0 0 0 0
##$XL= 0
##$YL= 0
##$YMAX_a= 638570
##$YMIN_a= -545675
##$ZGOPTNS= <>
##$ZL1= 120
##$ZL2= 120
##$ZL3= 120
##$ZL4= 120
##$ABSF1= 14.98509
##$ABSF2= -5.573092
##$ABSG= 5
##$ABSL= 3
##$ALPHA= 0
##$AQORDER= 0
##$ASSFAC= 0
##$ASSFACI= 0
##$ASSFACX= 0
##$ASSWID= 0
##$AUNMP= <proc_prof1d_extract_pilot.lims>
##$AXLEFT= 0
##$AXNAME= <>
##$AXNUC= <1H>
##$AXRIGHT= 0
##$AXTYPE= 0
##$AXUNIT= <>
##$AZFE= 0.1
##$AZFW= 0.1
##$BCFW= 0
##$BC_mod= 0
##$BYTORDP= 0
##$COROFFS= 0
##$CY= 15
##$DATMOD= 1
##$DC= 0
##$DFILT= <>
##$DTYPP= 0
##$F1P= 0
##$F2P= 0
##$FCOR= 0.5
##$FTSIZE= 32768
##$FT_mod= 6
##$GAMMA= 0
##$GB= 0
##$INTBC= 1
##$INTSCL= 1
##$ISEN= 128
##$LB= 0
##$LEV0= 0
##$LPBIN= 0
##$MAXI= 10000
##$MC2= 0
##$MEAN= 0
##$ME_mod= 0
##$MI= 0
##$NCOEF= 0
##$NC_proc= -8
##$NLEV= 6
##$NOISF1= 0
##$NOISF2= 0
##$NSP= 0
##$NTH_PI= 0
##$NZP= 0
##$OFFSET= 14.98509
##$PC= 1
##$PHC0= 98.42102
##$PHC1= 0
##$PH_mod= 1
##$PKNL= yes
##$PPARMOD= 0
##$PPDIAG= 0
##$PPIPTYP= 0
##$PPMPNUM= 2147483647
##$PPRESOL= 1
##$PSCAL= 4
##$PSIGN= 0
##$PYNMP= <proc.py>
##$REVERSE= no
##$SF= 400.02
##$SI= 32768
##$SIGF1= 0
##$SIGF2= 0
##$SINO= 400
##$SIOLD= 32768
##$SPECTYP= <>
##$SREGLST= <1H.CDCl3>
##$SSB= 0
##$STSI= 32768
##$STSR= 0
##$SW_p= 8223.68421052631
##$SYMM= 0
##$S_DEV= 0
##$TDeff= 65536
##$TDoff= 0
##$TI= <>
##$TILT= no
##$TM1= 0
##$TM2= 0
##$TOPLEV= 0
##$USERP1= <user>
##$USERP2= <user>
##$USERP3= <user>
##$USERP4= <user>
##$USERP5= <user>
##$WDW= 1
##$XDIM= 32768
##$YMAX_p= 483919465
##$YMIN_p= -749213
##$CURPLOT= <Network HP LaserJet P1505>
##$CURPRIN= <$Network HP LaserJet P1505>
##$DFORMAT= <normdp>
##$LAYOUT= <+/1D_H.xwp>
##$LFORMAT= <normlp>
##$PFORMAT= <normpl>
##$SURQMSG= 1
$$ End of Bruker specific parameters
$$ ---------------------------------
##NTUPLES= NMR SPECTRUM
##VAR_NAME=  FREQUENCY,     SPECTRUM/REAL,   SPECTRUM/IMAG
##SYMBOL=    X,             R,               I
##VAR_TYPE=  INDEPENDENT,   DEPENDENT,       DEPENDENT
##VAR_FORM=  AFFN,          ASDF,            ASDF
##VAR_DIM=   32768,         32768,           32768
##UNITS=     HZ,            ARBITRARY UNITS, ARBITRARY UNITS
##FACTOR=    0.250966925370066, 1,           1
##FIRST=     8223.43324360094, 23143,        -20573
##LAST=      0,             -197899,         -174643
##MIN=       0,             -749213,         0
##MAX=       8223.43324360094, 483919465,    0
$$ Real data points
##PAGE= N=1
##DATA TABLE= (X++(R..R)), XYDATA
$$ [...]
19548B0179c28254j34287J05194I8964a4626A44331j0418a81403j955j07861F276
$$ 20179 -328254 -462541 -357347 98964 -14626 144331 133913 -181403 -183358 -291219 6276
19536d15263A94374h6254A7280a99318Q2666e0642a9124j80152G1777M2925a05705
$$ -415263 194374 -86254 17280 -199318 -116652 -50642 -19124 -199276 71777 114702 -105705
19524H7049B2570a89366I9339b21211J2378C27264D8481g1177o3320o7567K4451
$$ 87049 22570 -189366 99339 -221211 -208833 327264 48481 -71177 -134497 -202064 -177613
19513a77613B53148i5369m5646M6553j43413a12246A10935A2980c02811F8879
$$ -177613 253148 -95369 -141015 -94462 -237875 -112246 110935 12980 -302811 68879
19502g2835J5279b2582q4213A35967m9429A3676c83196i6690C7794J03690J04746
$$ -72835 -57556 -22582 -106795 135967 86538 13676 -383196 -96690 37794 141484 246230
19491B46230D0307d92754A20383b21692I7113c79622b5673A01489h931A4148l897
$$ 246230 40307 -492754 120383 -221692 97113 -379622 -25673 101489 -8931 14148 10251
19480A0251b60319b3325j93379C9460a75350j64649d1712A70623N3688b21092
$$ 10251 -260319 -23325 -216704 39460 -175350 -339999 -41712 170623 224311 -221092
19469D933J15572n2444e22407C48336b31512A70324e46415G892a53868l9882k6159
$$ 4933 120505 68061 -522407 348336 -231512 170324 -546415 7892 -153868 -193750 -219909
19458b19909C7336h3036D5815b98716g3724q4628H4895e3892E0296c5859l05262
$$ -219909 37336 -83036 45815 -298716 -73724 -158352 84895 -53892 50296 -35859 -341121
19447c41121a14953A35234E4409b6466F4501a67092I8965D5883P7060a08439j25208
$$ -341121 -114953 135234 54409 -26466 64501 -167092 98965 45883 122943 -108439 -233647
19436b33647J07844A56665a74410o5068g3583p597k29145f5806r109o0012c4164
$$ -233647 -125803 156665 -174410 -239478 -73583 -81180 -310325 -65806 -74915 -134927 -34164
19424B90907b43176a18117c7689B6129e9408q3594J8281a9136A21427K38034a38176
$$ 290907 -243176 -118117 -37689 26129 -59408 -143002 -124721 -19136 121427 359461 -138176
19412B58185c29095a13920k24174G4861b065F0297M8036m9678e6976E2136B4373
$$ 258185 -329095 -113920 -338094 74861 -2065 60297 108333 58655 -56976 52136 24373
19400B84512d2699A55754c48555d1241A01285a52670j37107P2307N7527j0644
$$ 284512 -42699 155754 -348555 -41241 101285 -152670 -289777 -217470 -159943 -170587
19390a70587j4647O3517r5898B0033a05603M0703A3732e88986E3983M9776i5526
$$ -170587 -185234 -121717 -217615 20033 -105603 -64900 13732 -588986 53983 103759 -95526
19378e5036B74987c33144i9687k46917G9017c6869F0998a741j19042j06710A84117
$$ -55036 274987 -333144 -99687 -346604 79017 -36869 60998 -1741 -120783 -227493 184117
19366A27228B2564b12374N5220B24355b16194D0144a6678e68D9023b04533A49629
$$ 127228 22564 -212374 -157154 224355 -216194 40144 -16678 -568 49023 -204533 149629
19354h992A26566a95957J8072B07379a88532A456a09349j82279C22513a43793
$$ -8992 126566 -195957 -177885 207379 -188532 1456 -109349 -291628 322513 -143793
19343a97845o3232j37439a54142I702e356j84343B642c12589J37522j14902C5745
$$ -197845 -261077 -398516 -154142 9702 -5356 -189699 2642 -312589 -175067 -289969 35745
19331c22246A14498b78052f3914A37994c05590R4142e1752j16756g50n8127A56823
$$ -322246 114498 -278052 -63914 137994 -305590 -211448 -51752 -168508 -750 -58877 156823
19319a16366A6557a36597i233H3998b46329J21115o3225Q1402a8301A22602a6563
$$ -116366 16557 -136597 -9233 83998 -246329 -125214 -188439 -107037 -18301 122602 -16563
19307g3667I1610g0350l6228A09722d274j9831H6044a16455J7199j14551K6779
$$ -73667 91610 -70350 -106578 109722 -4274 -24105 86044 -116455 -99256 -213807 -187028
19296a87028C32481a09415C04552c27685B07619a1049l70502B42883a92713L2122
$$ -187028 332481 -109415 304552 -327685 207619 -11049 -381551 242883 -192713 -160591
19286a60591l4082E6085c9958A45725E8406J58678d9907J5246H0154k3393c20982
$$ -160591 -194673 56085 -39958 145725 58406 217084 -49907 -34661 80154 56761 -320982
19274A06993J77365b01617G2986a11584B29589a29449A91088B557a78604B01307
$$ 106993 284358 -201617 72986 -111584 229589 -129449 191088 2557 -178604 201307
19263B11523n8009e1204G8816a05569j80611J38268d5689k57954J25159b4224
$$ 211523 153514 -51204 78816 -105569 -286180 -147912 -45689 -303643 -178484 -24224
19252A47790e83636a75796H2775N2042G736e6627b3083B9069b74732E2470K154
$$ 147790 -583636 -175796 82775 134817 7736 -56627 -23083 29069 -274732 52470 54624
19241E4624M370K18876E689Q1018K6445G438J71946H6834A4216l276b600D1384
$$ 54624 58994 277870 5689 86707 113152 7438 179384 86834 14216 10940 -2600 41384
19228A4643g9192A76578I627b43713L0962e7440p7603A29324a36266l07032B796
$$ 14643 -79192 176578 9627 -243713 -212751 -57440 -135043 129324 -136266 -443298 2796
19216I3747l0854J10064A4924c4914p3536A31680c03649M1495B63846m4198a38988
$$ 93747 62893 172957 14924 -34914 -108450 131680 -303649 -262154 263846 219648 -138988
19204a87817A23710i8535A47620B1874a30215I592K2404a25523A23884M0217h9391
$$ -187817 123710 -98535 147620 21874 -130215 9592 31996 -125523 123884 164101 -89391
19192d32510f8776J0855A8274i120C22374a23664N3525b3703B69447r7113g9688
$$ -432510 -68776 -57921 18274 -9120 322374 -123664 -70139 -23703 269447 172334 -79688
19180a20282A42102i4145L0498k29301A98606A5146L3252g4892j14852l0174A54915
$$ -120282 142102 -94145 -63647 -292948 198606 15146 48398 -74892 -189744 -219918 154915
19168a31062k45018J12078l34253B51246A09551b44186L3990b3553B0596b99347
$$ -131062 -376080 -264002 -598255 251246 109551 -244186 -210196 -23553 20596 -299347
19157F7087d2750l91820A00086e0549k5368l43651e4406j78060i7090L0927k20654
$$ 67087 -42750 -434570 100086 -50549 -75917 -419568 -54406 -232466 -97090 -66163 -286817
19146b86817k7362C0332a43588I9534J02307D4703i2142F6399B6941a30186A2546
$$ -286817 -314179 30332 -143588 99534 201841 44703 -92142 66399 26941 -130186 12546
19134a54679j64025c9503A57377K9146a15886l82711J37188a75818p6692E7574
$$ -154679 -318704 -39503 157377 186523 -115886 -498597 -361409 -175818 -252510 57574
19123A2701a27163G8534a2398F541b92100N3843B23141I0207j188C477M4150K38110
$$ 12701 -127163 78534 -12398 6541 -292100 -238257 223141 90207 89019 3477 47627 285737
19111B85737b78748J01195c3187m6666A51907g511A86158J1082C3684L05657a63589
$$ 285737 -278748 -177553 -33187 -79853 151907 -7511 186158 197240 33684 339341 -163589
19099b06132o6175a30577E0021a23751e156A07021J3J6988a61523m09484I6269
$$ -206132 -272307 -130577 50021 -123751 -5156 107021 107034 124022 -161523 -571007 96269
19087b32574Q2734d2845I2775A8073K7215f863E6900c05896A58590i8826L2967
$$ -232574 -149840 -42845 92775 18073 45288 -6863 56900 -305896 158590 -98826 -65859
19076f5859l86792A22326G884d77346b6912j26620r5782H2226O2053b51964o3903
$$ -65859 -452651 122326 7884 -477346 -26912 -153532 -249314 82226 144279 -251964 -315867
19065c15867a35526B75545a87271l5722j23718R4226i8752A28345i0532k83806
$$ -315867 -135526 275545 -187271 -222993 -346711 -252485 -98752 128345 -90532 -374338
19055c74338D5818c59440A15338g1142j27534r1221a38322l62b8775q9143A18438
$$ -374338 45818 -359440 115338 -71142 -198676 -289897 -138322 -138684 -28775 -117918 118438
19043A18274a75702m5055I9763a59487A0498g9852d426j4250A82702J24111r3135
$$ 118274 -175702 -220757 99763 -159487 10498 -79852 -4426 -18676 182702 306813 213678
19032B13678i1939K102A10933a70279G3847c8247p4710l21562C2522f292j62914
$$ 213678 -91939 -89837 110933 -170279 73847 -38247 -112957 -434519 32522 -6292 -169206
19021a69206B76485f6096J1642A79295a70042E356K95015c94510d6652j05649
$$ -169206 276485 -66096 -54454 179295 -170042 5356 300371 -394510 -46652 -152301
19011a52301k18308I2210b34299F9177J6006b38416A57102k8149a53530A26663
$$ -152301 -370609 92210 -234299 69177 85183 -238416 157102 128953 -153530 126663
19000A98615a07604j77053L5648A49502a10775M0491k31705b1443j29221j48599
$$ 198615 -107604 -284657 -249009 149502 -110775 -70284 -301989 -21443 -150664 -299263
18990b99263l1681I0757a15579n8928k33164F9096C4113J22696A4253L831M2891
$$ -299263 -330944 90757 -115579 -174507 -407671 69096 34113 156809 14253 18084 60975
18979F0975g0981j3201b3992I9560C4118h7907C8928c83558a8847B45634L8232
$$ 60975 -70981 -84182 -23992 99560 34118 -87907 38928 -383558 -18847 245634 283866
18968B83866a42873D1725L1171c6182r252B1973a2919n6751n5128q8570A2059
$$ 283866 -142873 41725 72896 -36182 -45434 21973 -12919 -69670 -124798 -213368 12059
18956c82459g5590q6168d8018r4567O5465a828A59417o5197C0958P6928B4332
$$ -382459 -75590 -161758 -48018 -142585 -77120 -1828 159417 94220 30958 107886 24332
18944a36263A48386b33594c8477B64529j30710M9155a05878j37311A35714A1594
$$ -136263 148386 -233594 -38477 264529 133819 182974 -105878 -243189 135714 11594
18933c4959A87825K02244a14007F292f2377j25179C3570i0114m4412M5182r2245
$$ -34959 187825 390069 -114007 6292 -62377 -187556 33570 -90114 -134526 -89344 -181589
18922a81589B9156i8467Q834m8926M5518q415k53810q225C85306J49022k50247
$$ -181589 29156 -98467 -89633 -138559 -93041 -101456 -355266 -363491 385306 534328 284081
18911B84081b75948A26745a14769q0757C2252b10521i736B58050c9669B48209
$$ 284081 -275948 126745 -114769 -195526 32252 -210521 -9736 258050 -39669 248209
18900A91785E1081a73971M0464E3012j1225b92846d9611k04321g0717j4454m016
$$ 191785 51081 -173971 -133507 53012 41787 -292846 -49611 -253932 -70717 -85171 -89187
18889h9187A10845M0721b65526f505A64516a40655H8613J28411L2221a36354k6396
$$ -89187 110845 151566 -265526 -6505 164516 -140655 88613 217024 249245 -136354 -162750
18878a62750n6882c9683G9670R6821a7884A12423a71876A14084e37185E366J04668
$$ -162750 -219632 -39683 79670 176491 -17884 112423 -171876 114084 -537185 5366 110034
18867A10034O3153b05634B5406a04477m9001A50770p0909c8188m44982a73027
$$ 110034 173187 -205634 25406 -104477 -153478 150770 79861 -38188 -483170 -173027
18856i6360j3634j56947G905a4476l8523k18670a17846F5621a71482A36475h756
$$ -96360 -109994 -266941 7905 -14476 -52999 -271669 -117846 65621 -171482 136475 -8756
18844B13183e0777C0919O6466f01048C66294a70827A41504e1518j84172j64179
$$ 213183 -50777 30919 97385 -601048 366294 -170827 141504 -51518 -235690 -399869
18834c99869D8675h2115k8689G5353K3345m4047a60527r619M3513k6195l7247
$$ -399869 48675 -82115 -110804 75353 98698 54651 -160527 -170146 -126633 -152828 -190075
18823a90075C73367g8990j65807O6240M4372A40090a44676l6595d7731j9529H9624
$$ -190075 373367 -78990 -244797 -178557 -134185 140090 -144676 -181271 -47731 -67260 89624
18811h574A41195a38956c2623C58650a34510E4567a81294C6307J04854b50035
$$ -8574 141195 -138956 -32623 358650 -134510 54567 -181294 36307 141161 -250035
18800b08172k16931a67801N3932j76344I3987a1957k32984i1789K0965c5107j57236
$$ -208172 -425103 -167801 -113869 -290213 93987 -11957 -244941 -91789 -70824 -35107 -192343
18789a92343k94221A46145a6143j26688G9803J01210a68009c3531A70970b94165
$$ -192343 -486564 146145 -16143 -142831 79803 181013 -168009 -33531 170970 -294165
18778d10005F9168b7615A06944b17638A01530J36138a0481A2553K4804d60255
$$ -410005 69168 -27615 106944 -217638 101530 237668 -10481 12553 37357 -460255
18767A42886c8498G3045G001d73452A3798N34K72481a01325b9839k03117F6872
$$ 142886 -38498 73045 7001 -473452 13798 14332 286813 -101325 -29839 -232956 66872
18755A15568g6825m6757A31977a42240A46328a9083q5623A08068c79143A9848
$$ 115568 -76825 -123582 131977 -142240 146328 -19083 -104706 108068 -379143 19848
18744a69494j34985a1296K975A55799b50281A00569J17512l2142k5701R3020A20762
$$ -169494 -304479 -11296 -8321 155799 -250281 100569 218081 185939 160238 253258 120762
18732A87808h1226r0514e8359l82089B62598A7274a57821j04996m2586I7106Q344
$$ 187808 -81226 -171740 -58359 -440448 262598 17274 -157821 -262817 -305403 97106 105450
18721A05450j6828J66706M2336A07664a06133j44807d571j32399A91223F9253
$$ 105450 88622 255328 297664 107664 -106133 -250940 -4571 -136970 191223 69253
18710a22082c5526A57870f1625j02651A2083c05404A92341a04303b280D8315c7542
$$ -122082 -35526 157870 -61625 -164276 12083 -305404 192341 -104303 -2280 48315 -37542
18698e4791j81157d2424A02857K03256d5486k06320f9148r7745F0083h8771a7861
$$ -54791 -235948 -42424 102857 306113 -45486 -251806 -69148 -166893 60083 -88771 -17861
18686a29171C20084b01336R2659L2827K1605N138j4270j08583B95886r1025Q3963
$$ -129171 320084 -201336 -108677 -75850 -54245 -49107 -63377 -171960 295886 204861 288824
18675B88824a74463l434M6280G194J56309a03798j627c3632A41418F1006G753
$$ 288824 -174463 -177897 -131617 7194 163503 -103798 -105425 -33632 141418 61006 7753
18663a6467B82926b08887A05256f0463m283K3572r3502A00894b03106A35149b881
$$ -16467 282926 -208887 105256 -60463 -64746 -41174 -134676 100894 -203106 135149 -2881
18651G6899g7220A89640a9848A82919c33864A32339e428C6847e3157l07576B15961
$$ 76899 -77220 189640 -19848 182919 -333864 132339 -5428 36847 -53157 -360733 215961
18639a42853A22974a09815n9618j43549R9117i9956A04723J49314a58356B14293
$$ -142853 122974 -109815 -169433 -312982 -213865 -99956 104723 254037 -158356 214293
18628A4267a73510c0998A22197d38034H6718a4952A42977O178b72108A34462p778
$$ 14267 -173510 -30998 122197 -438034 86718 -14952 142977 149155 -272108 134462 126684
18617A26684e4018l04853a35273B36301B3186N2396h2761l32417C1731d8807j20268
$$ 126684 -54018 -358871 -135273 236301 23186 75582 -82761 -415178 31731 -48807 -169075
18606a69075k1179j70714F6158B5032c41975Q402h7583j72069J06890A29113B1815
$$ -169075 -190254 -360968 66158 25032 -341975 -333573 -87583 -259652 -152762 129113 21815
18594a02135j60840B62723e9397n3346b5982E2432a08501m5110e9430n9260M3258
$$ -102135 -262975 262723 -59397 -112743 -25982 52432 -108501 -153611 -59430 -118690 -75432
18583g5432c849D5532b34989h6789j4061k23095a50614J9031d0665J9613n95C5589
$$ -75432 -3849 45532 -234989 -86789 -100850 -323945 -150614 -131583 -40665 -21052 -21647 35589
18570b9617j69533P3359j21410m5193G6146d0094A09607d6061r2009C24268c03166
$$ -29617 -199150 -125791 -247201 -292394 76146 -40094 109607 -46061 -138070 324268 -303166
18558G884l14J75534a96844A26198J21689f5993o6499j91497q7880A7974b31343
$$ 7884 7570 183104 -196844 126198 247887 -65993 -132492 -323989 -411869 17974 -231343
18546I821K52919c24638b8160j8977G7902N1929n6647k9368R6258e5306F9339
$$ 9821 262740 -324638 -28160 -47137 77902 129831 73184 43816 140074 -55306 69339
18534D244b0724B0867i2512I3803a13931m81910B46629f7565j42239B59919I7746
$$ 4244 -20724 20867 -92512 93803 -113931 -595841 246629 -67565 -209804 259919 97746
18522h882A30298b17614D8884a18895B0967b71960a22131d0492C01688a87914
$$ -8882 130298 -217614 48884 -118895 20967 -271960 -122131 -40492 301688 -187914
18511B8330c37086h7434n2435A80594b64119R4792b1318l21330B94338j43580
$$ 28330 -337086 -87434 -139869 180594 -264119 -169327 -21318 -342648 294338 150758
18501A50758o6479p787a6874k45087G2691a43345L5148d8800E53518i3967K7456
$$ 150758 84279 76492 -16874 -261961 72691 -143345 -108197 -48800 553518 -93967 -66511
18490f6511B0217a16994A87363D1220M9805a21915d8255A10156g5730c5897o4110
$$ -66511 20217 -116994 187363 41220 91025 -121915 -48255 110156 -75730 -35897 -100007
18479a00007q666A9254L03759i9637A97502J6674b5173H2284q152c8749j88679
$$ -100007 -108673 19254 323013 -99637 197502 214176 -25173 82284 74132 -38749 -227428
18468b27428J3942F5775a1292r4558r6175C57347b62912P8942B76673A3774J08169
$$ -227428 -213486 65775 -11292 -105850 -202025 357347 -262912 -183970 276673 13774 121943
18457A21943k3955g2969A05081A5699N4251B7218a28281q171a6112b727G1355
$$ 121943 97988 -72969 105081 15699 69950 27218 -128281 -136452 -16112 -2727 71355
18445A74985P8409b27555d7868k83682D8449a10852B2111a29059a3508q2101k6324
$$ 174985 253394 -227555 -47868 -331550 48449 -110852 22111 -129059 -13508 -95609 -121933
18434a21933j25332k5182A29714a98446B4016a0233j41057l7957j7120B26203
$$ -121933 -247265 -272447 129714 -198446 24016 -10233 -151290 -189247 -206367 226203
18423a90781I58J8648O3019b13748M7521I942d69136d7580A01275c18341F1937
$$ -190781 958 19606 82625 -213748 -166227 9942 -469136 -47580 101275 -318341 61937
18411a26106m4786q8962H6656a23018A55786g0838G3933f3905m2284j23299e8369
$$ -126106 -170892 -259854 86656 -123018 155786 -70838 73933 -63905 -106189 -229488 -58369
18399a6285A37988c28550c1245B01982H8976a33110A27688a76423P8890F5351
$$ -16285 137988 -328550 -31245 201982 88976 -133110 127688 -176423 -97533 65351
18388A2214P0667b9588a1683B35337a97347g5580k4038A29112b28490A83026D4975
$$ 12214 82881 -29588 -11683 235337 -197347 -75580 -99618 129112 -228490 183026 44975
18376b79733B45582H6787c9368H7923A3015h3000o446p5148o1077H568R05M1076
$$ -279733 245582 86787 -39368 87923 13015 -83000 -89446 -164594 -225671 8568 9473 50549
18364E0549O2887L2189b23339f2521E71644B70377g4813A14983a18239D1504c65814
$$ 50549 113436 145625 -223339 -62521 571644 270377 -74813 114983 -118239 41504 -365814
18352B09305c96316G2749M93l2208L6870R7685c11600B36666p3559a0995k84153
$$ 209305 -396316 72749 73242 41034 77904 175589 -311600 236666 163107 -10995 -295148
18341b95148J1622e0339k85081A70555i3378G292g3428o9935n12H4863a35796
$$ -295148 -283526 -50339 -335420 170555 -93378 7292 -73428 -143363 -143875 84863 -135796
18329a05234A63226i3452B51276j08546M6876h386G9348R4867c48884H2802G829
$$ -105234 163226 -93452 251276 142730 189606 -8386 79348 174215 -348884 82802 7829
18317A23572n6565c56238J44224c7091C9467o848J24723c68280h1862q6554A64287
$$ 123572 67007 -356238 -212014 -37091 39467 32619 157342 -368280 -81862 -168416 164287
18305D9598M7672a54989O5568C4837J31171a8498G2943a62704A21901a46516K9917
$$ 49598 97270 -154989 -89421 34837 166008 -18498 72943 -162704 121901 -146516 -116599
18294a16599B50464f9775A47441R7309a14513a0342m4507j9779B5330K13004b27793
$$ -116599 250464 -69775 147441 244750 -114513 -10342 -54849 -74628 25330 238334 -227793
18282a41467O9824l84381f2623A77652G3655b51654K9689N2983A09726m841b23460
$$ -141467 -71643 -456024 -62623 177652 73655 -251654 -221965 -168982 109726 104885 -223460
18270a12925A5146K43419a20230L1087D0182c5617B57659a59140A63544e1098
$$ -112925 15146 258565 -120230 -89143 40182 -35617 257659 -159140 163544 -51098
18259C41917C9168a87817D799a90509A63184G001K66978c03925J22035A96272
$$ 341917 39168 -187817 4799 -190509 163184 7001 273979 -303925 -181890 196272
18248I4625a55091q7013B7395K09191a03739A81a50382d6397D4124h7774o9761
$$ 94625 -155091 -242104 27395 236586 -103739 181 -150382 -46397 44124 -87774 -157535
18237a57535P1663F4966k075J24918F8065c82137a25013H3489Q9000c51308d8108
$$ -157535 -85872 64966 62891 187809 68065 -382137 -125013 83489 172489 -351308 -48108
18225B5912a83721m0320o6508J19312R355A02150A7726L8119O5950c42357f7606
$$ 25912 -183721 -224041 -290549 -171237 -161882 102150 17726 55845 121795 -342357 -67606
18213a24094j03603k41079F7327K47845A32396b19021B60908i97j20261D8793
$$ -124094 -227697 -468776 67327 315172 132396 -219021 260908 -997 -121258 48793
18202B47097e4101B38717A3451a27792o5258C97439c20660d0988j88581C4347
$$ 247097 -54101 238717 13451 -127792 -193050 397439 -320660 -40988 -229569 34347
18191A71875a03894b3424j07907K6756q2583n385k08782R2289a21922l8826A22149
$$ 171875 -103894 -23424 -131331 -104575 -187158 -192543 -401325 -309036 -121922 -160748 122149
18179f583j57641A13648d29369C27069a30047a0828D2299g481H1332a04396l28211
$$ -6583 -164224 113648 -429369 327069 -130047 -10828 42299 -7481 81332 -104396 -432607
18168d32607i61k16467r0346a42665i928A02930a87692f132B86704d3888B41301
$$ -432607 -961 -217428 -307774 -142665 -9928 102930 -187692 -6132 286704 -43888 241301
18156a11296k0600j88708f6405A40013n3408a76973n3717k3488E1411Q8604c5759
$$ -111296 -131896 -320604 -66405 140013 86605 -176973 -230690 -254178 51411 140015 -35759
18144a42631I4841C3048J77345A8204b6231A28140A1766K43893G2443a47690H0330
$$ -142631 94841 33048 210393 18204 -26231 128140 11766 255659 72443 -147690 80330
18132h9487j79316H7397a39468H2034b94216O1603B25130c58910J68488B65778
$$ -89487 -268803 87397 -139468 82034 -294216 -232613 225130 -358910 -190422 265778
18121A01162c08794l747a03773q3087Q5402B03355a49279j397I8087m3619L8953
$$ 101162 -308794 -312541 -103773 -186860 -101458 203355 -149279 -150676 98087 54468 93421
18110I3421P4058D4967a61200J1592N3676c3025r6048A09372a72393C35635b70167
$$ 93421 167479 44967 -161200 -149608 -95932 -33025 -129073 109372 -172393 335635 -270167
18098A21623J79463a04700l4214q3474a05176E5842A2996J16904a5740I7927N6477
$$ 121623 301086 -104700 -138914 -222388 -105176 55842 12996 129900 -15740 97927 154404
18087A54404a65754A03521b0315j16600J0570B25259a04897H5495N2122C2608
$$ 154404 -165754 103521 -20315 -136915 -126345 225259 -104897 85495 137617 32608
18076B00784H2753e3004j39847B9407b01583A99974C9303c23450p1417B07735
$$ 200784 82753 -53004 -192851 29407 -201583 199974 39303 -323450 -394867 207735
18065d6995B28282a69388A63787A3508g5374A01795c4996r8850B23534D0965J58355
$$ -46995 228282 -169388 163787 13508 -75374 101795 -34996 -133846 223534 40965 199320
18054A99320E3020g3434a9984F093j335a75243G1078J56088i6731M4131B52321
$$ 199320 53020 -73434 -19984 6093 4758 -175243 71078 227166 -96731 -52600 252321
18042B08737a50315n8229P5734n65K2233B52920f636A12846c50435b559k89039
$$ 208737 -150315 -208544 -132810 -133375 -111142 252920 -6636 112846 -350435 -2559 -291598
18031b91598P6175A9562c51484a62359F3016L4537p463m3068d995j9750B59908
$$ -291598 -215423 19562 -351484 -162359 63016 97553 90090 47022 -4995 -24745 259908
18019I6286a60497A74922J2794K6139a77446c2126l06893G6014c88589P0933A37476
$$ 96286 -160497 174922 187716 213855 -177446 -32126 -339019 76014 -388589 -317656 137476
18007a65821B21243b1716A38255J06202F9456b65329a31224A72004D0029c45960
$$ -165821 221243 -21716 138255 244457 69456 -265329 -131224 172004 40029 -345960
17996G50a97725a3574k69324O4117J03367J7427E2051L9534C6654N2745C8237
$$ 750 -197725 -13574 -282898 -218781 -115414 -97987 52051 91585 36654 89399 38237
17984c3212A50727a69127E47876B3064J1191b15372B464a42500j69096M1748J23179
$$ -33212 150727 -169127 547876 23064 34255 -215372 2464 -142500 -311596 -269848 -146669
17973a46669q0101P7064H3097C8252P8547a69276P1295b3724A737a81157k13413
$$ -146669 -226770 -149706 83097 38252 116799 -169276 -97981 -23724 1737 -181157 -394570
17962c94570a07605A73217J98269a45042a6537r2047p3069A22254B4956d7256
$$ -394570 -107605 173217 371486 -145042 -16537 -108584 -181653 122254 24956 -47256
17951c5685A02043K1508i6583L5262a0944j43344C46088a66960g5087C74372d03878
$$ -35685 102043 123551 -96583 -61321 -10944 -154288 346088 -166960 -75087 374372 -403878
17939E9041d4653b0281B1902c51101A09091a91333k01519h4389k10926e2632C67326
$$ 59041 -44653 -20281 21902 -351101 109091 -191333 -392852 -84389 -295315 -52632 367326
17927G4756J06653k555c69151J67655A64038c02105C6835b08239L7644I4168J69499
$$ 74756 181409 178854 -369151 -201496 164038 -302105 36835 -208239 -170595 94168 263667
17916B63667l6002a00369k09906D2420i5066r2701A31754O488a3107B12764p6240
$$ 263667 227665 -100369 -310275 42420 -95066 -187767 131754 138242 -13107 212764 136524
17905A36524a05475A21804a59897g9351B7025a88567B03803c75804F1479K15665
$$ 136524 -105475 121804 -159897 -79351 27025 -188567 203803 -375804 61479 277144
17895B77144d16123J89442B29998b40664A34961a7725j5272l91239B60928A04613
$$ 277144 -416123 -226681 229998 -240664 134961 -17725 -32997 -424236 260928 104613
17884d7631p5236n9958N9334H7342A3786L5867b2246l6010I6618h9952j24218
$$ -47631 -122867 -182825 -123491 87342 13786 49653 -22246 -58256 96618 -89952 -214170
17873b14170c0530E8245c8342A40951g6197n9480A27895D4J76535b08016g2696
$$ -214170 -30530 58245 -38342 140951 -76197 -135677 127895 44 176579 -208016 -72696
17861A40567i448B29859b22587k2081j54765A09789m8875a98973e7391j16395
$$ 140567 -9448 229859 -222587 -244668 -399433 109789 60914 -198973 -57391 -173786
17851a73786B30368c92845I3518g6901r4372B0660c25219c6885E8303a3772k64684
$$ -173786 230368 -392845 93518 -76901 -171273 20660 -325219 -36885 58303 -13772 -278456
17840b78456a26618q9301A01376C1126b38053C5226f7559I5051K05250a97315
$$ -278456 -126618 -215919 101376 31126 -238053 35226 -67559 95051 300301 -197315
17829a5555j09704o1282b1544A11706m3118P5407d74747d7276D318a85738r0743
$$ -15555 -125259 -186541 -21544 111706 68588 143995 -474747 -47276 4318 -185738 -276481
17818b76481C3084j857a40239b717C39381A13707M1410c95712E6497a89732J9301
$$ -276481 33084 31227 -140239 -2717 339381 113707 155117 -395712 56497 -189732 -170431
17807a70431h4698H0741d189B5378b72069m1007B04236F0787K97490b37126B2109
$$ -170431 -84698 80741 -4189 25378 -272069 -313076 204236 60787 358277 -237126 22109
17795A478a77276B9126Q8569J44108f2881A23705C4672f8265l767A36841i0105
$$ 1478 -177276 29126 117695 261803 -62881 123705 34672 -68265 -72032 136841 -90105
17783B49584a36726D44798A58850P9142d7617q9207A10320J76181A30304E135
$$ 249584 -136726 444798 158850 237992 -47617 -136824 110320 286501 130304 5135
17772g5770c3619C2282J18590b83963C5416L75022b34200i1486B7102R1306f1304
$$ -75770 -33619 32282 150872 -283963 35416 410438 -234200 -91486 27102 118408 -61304
17760D34628F8545h6032k88972A3355Q6861J30081o1932G6017J7927a7882A80473
$$ 434628 68545 -86032 -375004 13355 100216 230297 168365 76017 93944 -17882 180473
17748d42588A56552J67527a72329j02361O8295q3112D56131A82128D2612a32842
$$ -442588 156552 324079 -172329 -274690 -206395 -289507 456131 182128 42612 -132842
17737A52506F0445M8361m7585a21111b1163D93166E1783L76263A43563c14462
$$ 152506 60445 108806 61221 -121111 -21163 493166 51783 428046 143563 -314462
17726F3685d51542i7065A83568o340J55880I4891j3422b99095B47913b07666A60106
$$ 63685 -451542 -97065 183568 177228 333108 94891 81469 -299095 247913 -207666 160106
17714h480k58394Q2339h4969j36069i5611A96311k8947i4426B37728q8222G1604
$$ -8480 -266874 -184535 -84969 -221038 -95611 196311 167364 -94426 237728 149506 71604
17702c0173B3337f5663B38752G8503J7129K54351G7263c25128f680k16611i4000
$$ -30173 23337 -65663 238752 78503 95632 349983 77263 -325128 -6680 -223291 -94000
17690a67911A9193K17544M645A00568b18441A74555k8888b91223A27486R0448
$$ -167911 19193 236737 241382 100568 -218441 174555 145667 -291223 127486 217934
17680B17934c0614l76378d9912j88831j22535J47342J1745B66728F7266a37783
$$ 217934 -30614 -406992 -49912 -238743 -361278 -213936 -202191 266728 67266 -137783
17669B65489e1510A8172b99874a23935B9739a13859B76989B9149a19760L0442
$$ 265489 -51510 18172 -299874 -123935 29739 -113859 276989 29149 -119760 -89318
17659h9318j79942G0301J06648D6074M738b31449A22851j8855J84471I6099a4685
$$ -89318 -269260 70301 176949 46074 50812 -231449 122851 103996 288467 96099 -14685
17647a8623A66f7546B81069b18190A23235J5203a71333C0811J48450h9809i204
$$ -18623 166 -67546 281069 -218190 123235 138438 -171333 30811 179261 -89809 -9204
17635A84284A7751b28687E2032g3380l7860F8418N71250I2576k1715R1520b33190
$$ 184284 17751 -228687 52032 -73380 -111240 68418 639668 92576 70861 162381 -233190
17623A01791J9511K96501i2830F7366b51753A784J15051e1845A4616c16379e1855
$$ 101791 121302 417803 -92830 67366 -251753 1784 116835 -51845 14616 -316379 -51855
17611a15152B08490K67669A52244K50282f3370B18686A08334k1725a06362B00426
$$ -115152 208490 476159 152244 402526 -63370 218686 108334 86609 -106362 200426
17600D29815a58336K4588k8454j14537J12587j03536A76973K0075D8178J31563
$$ 429815 -158336 -133748 -162202 -276739 -164152 -267688 176973 197048 48178 179741
17590A79741c42050F2956f7106C33742e1870H3977g314l33286e4731A15784a3442
$$ 179741 -342050 62956 -67106 333742 -51870 83977 -7314 -340600 -54731 115784 -13442
17578f9713B70440A14469a18785c2145l35382B5444h6598D1166j0609j4608a58802
$$ -69713 270440 114469 -118785 -32145 -367527 25444 -86598 41166 30557 15949 -158802
17566f5929l1305c6592A19758O5434P8375a35118A47251A1905J07516a05281J4248
$$ -65929 -97234 -36592 119758 185192 263567 -135118 147251 11905 119421 -105281 -91033
17555i1033D9922N2045i4085J024c5618a7172A1521K2436b12267h2354l1339M2125
$$ -91033 49922 101967 -94085 -93061 -35618 -17172 11521 33957 -212267 -82354 -113693 -71568
17543g1568G7623c5109F5598P7025d61534h2544C3998L6394b6480O357B36670
$$ -71568 77623 -35109 65598 142623 -461534 -82544 33998 70392 -26480 -20123 236670
17531a81358A88102c1709B51167a05055j72830a27098n6108e639C76303b37805
$$ -181358 188102 -31709 251167 -105055 -277885 -127098 -183206 -5639 376303 -237805
17520D64497d17464g0425I5807K76258A67988L61p6745g0381m4134D69262a11677
$$ 464497 -417464 -70425 95807 372065 167988 168349 91604 -70381 -114515 469262 -111677
17508C92873a09547A73312K5423G1041b12014F6629J78687a34083l0971A33957
$$ 392873 -109547 173312 198735 71041 -212014 66629 245316 -134083 -165054 133957
17497A69840P355p283b19688l3307B55869B6044L256J3929a40061J298O4217j4322
$$ 169840 177195 169912 -219688 -252995 255869 26044 29300 43229 -140061 -138763 -74546 -88868
17485h8868B3350g6232l478C45801E6410O3407A2635J57170a13354I7719b71496
$$ -88868 23350 -76232 -79710 345801 56410 119817 12635 169805 -113354 97719 -271496
17473B52914D4034k928d5555B51274j20289R3696E417K52257e0310C76439m5854
$$ 252914 44034 41106 -45555 251274 130985 224681 5417 257674 -50310 376439 330585
17462C30585A16437d5475C13188n2528l0128f565C95904a45827B13894J50702
$$ 330585 116437 -45475 313188 260660 230532 -6565 395904 -145827 213894 364596
17452C64596A26801C6451N18369A15444K88689m0291J07522j64388K45818I8072
$$ 364596 126801 36451 554820 115444 404133 363842 471364 306976 552794 98072
17441a36828D95210k14274m53j31279J12426n5224M9879r9984h5432A64339K53659
$$ -136828 495210 280936 280483 149204 261630 206406 256285 156301 -85432 164339 417998
17430D17998A0123J21306m689k292K11442J78919j95378a1487B88025m234l474
$$ 417998 10123 131429 126740 124448 335890 514809 319431 -11487 288025 283791 280317
17419B80317c49729D51231A57920K13564e137B15863n55d0494B10031J30421A68825
$$ 280317 -349729 451231 157920 371484 -5137 215863 215308 -40494 210031 340452 168825
17407a40388K6797F3628a1121D13256p7856D9421a7449C10398o4100l6930p5460
$$ -140388 -113591 63628 -11121 413256 335400 49421 -17449 310398 246298 209368 133908
17396A33908l4530e0305C58426J0460G5698J77417j25684Q9431a31591E0069J39649
$$ 133908 99378 -50305 358426 368886 75698 253115 127431 216862 -131591 50069 189718
17385A89718m168n234F1671N02977j85113a5492C12703g2193K6001B7996O8216
$$ 189718 185550 180316 61671 564648 379535 -15492 312703 -72193 -46192 27996 96212
17374I6212a65049A49068J38379r6784b41751F1682K7790r824K5570K06981K9460
$$ 96212 -165049 149068 287447 190663 -241751 61682 89472 79648 105218 312199 341659
17363C41659I2131g218k33342E9001B7402c9864A96030a5821B65727M0629A01836
$$ 341659 92131 -7218 -240560 59001 27402 -39864 196030 -15821 265727 306356 101836
17351B98240B68J76414J81780j51438J62811G198N0243J23767K784J79366M5668
$$ 298240 268 176682 358462 207024 369835 7198 57441 181208 183992 363358 409026
17340D09026A17566J99383q7702O6040f6986C05932f1081C2680L9250O3725R1767
$$ 409026 117566 316949 229247 295287 -66986 305932 -61081 32680 71930 135655 227422
17329B27422J04660j56841A4139K38789j22532a03287D04295e3700A93612m2545
$$ 227422 332082 175241 14139 252928 130396 -103287 404295 -53700 193612 151067
17319A51067a68795A82876j7995f8968A29926N4202M0025m6468e0297B62587A5326
$$ 151067 -168795 182876 164881 -68968 129926 184128 224153 177685 -50297 262587 15326
17307I6905a71760C80200j2339d6768B50568R4429b61161B50099I4626a6991B06016
$$ 96905 -171760 380200 367861 -46768 250568 344997 -261161 250099 94626 -16991 206016
17295a93890D49425i359A42164K23722A40901K10721m3852r4633q0278D2470M2930
$$ -193890 449425 -9359 142164 365886 140901 351622 307770 213137 132859 42470 85400
17284H5400B1953K91411k2602M1044j63742E9807J16114q0081J43169g9296A47003
$$ 85400 21953 313364 290762 331806 168064 59807 175921 95840 239009 -79296 147003
17272A57801J74212i3884F8099K9259R0193l6137C8478J47095Q1326p3482K4857
$$ 157801 332013 -93884 68099 97358 187551 151414 38478 185573 266899 193417 218274
17261B18274j00149J08338m3389n3714K35769F088J82959D5370K19114M7762J32042
$$ 218274 118125 226463 183074 129360 365129 6088 189047 45370 264484 312246 444288
17250D44288H8838K68198d5781C45763K74171B31596F1760p088L37508b1887q6154
$$ 444288 88838 357036 -45781 345763 619934 231596 61760 54672 392180 -21887 -108041
17239a08041A16826B6119J17975r564e6083a6201B49368b23715A60188J02437
$$ -108041 116826 26119 144094 134530 -56083 -16201 249368 -223715 160188 262625
17229B62625G8130b00586E0823K47020j28978M23156A39236J35156K21108K4672
$$ 262625 78130 -200586 50823 297843 168865 592021 139236 274392 495500 520172
17219E20172j67622A21192J37664A17856J8637b0070E991J68553a0682A70913
$$ 520172 352550 121192 258856 117856 136493 -20070 5991 174544 -10682 170913
17208A24669f9856J3386C0072c3910D57052j18501D1324a0899B51659j3058l1518
$$ 124669 -69856 -56470 30072 -33910 457052 338551 41324 -10899 251659 238601 207083
17197B07083P3329J80105K4155k03081L3174j2758d6702D19806o9973J81141A92382
$$ 207083 280412 460517 484672 281591 314765 302007 -46702 419806 349833 530974 192382
17185a6310B02778J05884c9930D93631m0971k09309O8434K11928D0345L42056
$$ -16310 202778 308662 -39930 493631 452660 243351 311785 523713 40345 382401
17175C82401a63871p285C66986k7426o1861a58822C24061K44684k42594C626Q5127
$$ 382401 -163871 -171156 366986 339560 277699 -158822 324061 568745 326151 3626 88753
17164H8753L65238j03744K6743A01948a75911C10884Q1852K18775j34997L0514
$$ 88753 453991 350247 376990 101948 -175911 310884 392736 611511 476514 507028
17154E07028A24332L79338k06494j9297R194K24925j35631p7077K02042A19712
$$ 507028 124332 503670 297176 277879 287073 511998 376367 299290 501332 119712
17143B77472r4783L89951m5329B1268L83413I9516L99427I8783L47032B16264
$$ 277472 182689 572640 527311 21268 404681 99516 498943 98783 445815 216264
17132C71804j73012I4587J53376k4067K24839B13589P9972j46310P6077l078K89555
$$ 371804 198792 94587 247963 223896 448735 213589 293561 147251 223328 220250 509805
17121E09805B52090m6961J18122J44326l3180J86886D5305L50918m5949J16348
$$ 509805 252090 205129 323251 467577 434397 621283 45305 396223 350274 466622
17111D66622P9445k23630K5183l8755B5177M26966j57021d135D54566j45455j54196
$$ 466622 546067 322437 347620 308865 25177 452143 295122 -4135 454566 309111 154915
17100A54915m5395K96519A45703J64514N1587J51879J6886q2345j89312J4924
$$ 154915 109520 406039 145703 310217 361804 513683 530569 448224 258912 273836
17090B73836k7428K77882L60203C65575J00674Q3945L7021k11578M47693l01277
$$ 273836 246408 524290 884493 365575 466249 550194 587215 375637 823330 522053
17080E22053L8037M3243A70943J93477J62028A26072L4202a69775E27583k09777
$$ 522053 560090 603333 170943 364420 526448 126072 160274 -169775 527583 317806
17070C17806M45681B72445L25380k63926o5689L27843p2706j63554P2544k3411
$$ 317806 763487 272445 597825 333899 268210 596053 523347 359793 432337 408926
17060D08926J68947p4056j73349p3346K20020n3355J3181A33641M7052J61568
$$ 408926 577873 503817 330468 257122 477142 423787 436968 133641 180693 342261
17050C42261J87678J66684j7628m8611k17390m8377j163o7924J34595L63215j98134
$$ 342261 529939 696623 678995 630384 412994 364617 363454 295530 430125 793340 595206
17039E95206J2515n6957j21579K41933J00373l03612J76699j50099K88336k27216
$$ 595206 607721 550764 429185 671118 771491 467879 644578 494479 782815 555599
17029E55599J55652B82259K86961K19168j52855k00078q6465L08319j89155o8209
$$ 555599 711251 282259 569220 788388 635533 435455 348990 657309 468154 399945
17019C99945J93547R3161D5790O02252j30072N31799j70298k38227J87109k11811
$$ 399945 593492 686653 45790 648042 517970 1049769 879471 641244 828353 616542
17009F16542L2938m8309L44488j03097l659k59779J33708j09244J75245J20477
$$ 616542 649480 601171 945659 842562 838903 579124 712832 603588 778833 899310
16999H99310q7696C84151J9733O32272D80013L53773J700l25767J53978J864j31209
$$ 899310 811614 384151 403884 1036156 480013 833786 835486 509719 663697 665561 534352
16988E34352N4259L92236C63704L80800M15511D03135N65672k77067k23273J04814
$$ 534352 588611 980847 363704 744504 1160015 403135 968807 691740 468467 573281
16978E73281J12623N26062C98090P18377k03920k19527r3798N80478n39898K33790
$$ 573281 685904 1211966 398090 1116467 912547 693020 599222 1179700 639802 873592
16968H73592J85410l90263L79632k44760n3803L30533k72719J31546l6124q3109
$$ 873592 1059002 668739 1048371 803611 749808 1080341 807622 939168 903044 819935
16958H19935K51372K685p0718r2184k24687R3727K54944k99469N41798j70651
$$ 819935 1071307 1073992 1003274 911090 686403 780130 1035074 735605 1277403 1106752
16948A106752K75507k78429j4715k56187n877J98303L0562L26604o6143k26017
$$ 1106752 1382259 1103830 1089115 832928 827051 1025354 1055916 1382520 1316377 1090360
16938A090360J09203l18826J13823j1241J56206k482q0510J1315J15745L0461
$$ 1090360 1199563 880737 994560 983319 1139525 1137043 1056533 1067848 1183593 1214054
16928A214054k80395M04207K00087k56772K44421r1021L3880j50158n6982o5133
$$ 1214054 933659 1337866 1537953 1281181 1525602 1434581 1468461 1318303 1261321 1196188
16918A196188r9168J34102L0330J56167r2997N7746Q1760J69435k79662Q857j46816
$$ 1196188 1097020 1231122 1261452 1417619 1324622 1382368 1464128 1633563 1353901 1362758 1215942
16907A215942K56917J1069J33577M59820m44878J1585j04132K57748p6932J04889
$$ 1215942 1472859 1483928 1617505 2077325 1632447 1644032 1539900 1797648 1720716 1825605
16897A825605k662J25727j34956q0043q9672k6580L38985j343k73223L04585k24398
$$ 1825605 1822943 1948670 1813714 1733671 1643999 1617419 1956404 1955061 1681838 1986423 1762025
16886A762025N7630J07080j01735L60106m81972K61797M05100j53321K28881k95519
$$ 1762025 1819655 1926735 1825000 2185106 1703134 1964931 2370031 2216710 2445591 2150072
16876B150072j07159m302N2957J54034j20010J62977M5945J17672j08286J26711
$$ 2150072 2042913 2038611 2091568 2245602 2125592 2288569 2334514 2452186 2343900 2470611
16866B470611l00666L49366K93360l85373N70012l12325O3301j5613Q5678l8614
$$ 2470611 2169945 2519311 2812671 2427298 2997310 2684985 2748286 2732673 2818351 2779737
16856B779737L87645k41730P9899k14046M25467q7092k81692K12142J12228l8272
$$ 2779737 3167382 2925652 3005551 2791505 3216972 3129880 2848188 3060330 3172558 3134286
16846C134286J12986K0264K23893Q687K61659j82320j744N5739m89037O22695
$$ 3134286 3247272 3267536 3491429 3500116 3761775 3579455 3577711 3633450 3144413 3767108
16836C767108j96429J03006J60973l0807K97518N3041L49259k56118M03113j72267
$$ 3767108 3570679 3673685 3834658 3803851 4101369 4154410 4503669 4247551 4650664 4478397
16826D478397M7156K65415J19203J12366M04607q4396k36886L74446j18948J59896
$$ 4478397 4525553 4790968 4910171 5022537 5427144 5342748 5105862 5480308 5361360 5521256
16816E521256P8187K27517j06168L00776m04784P10728M0541J71074k77684N30557
$$ 5521256 5599443 5826960 5720792 6021568 5616784 6327512 6368053 6539127 6261443 6792000
16806F792000O5613k32072M81113K44802P8370M26408o4770K40069J66809K64604
$$ 6792000 6857613 6625541 7106654 7351456 7429826 7856234 7791464 8031533 8198342 8462946
16796H462946K5015L54641L3343N01936o7575J64552M49497K98079J91156K21254
$$ 8462946 8487961 8842602 8875945 9377881 9310306 9474858 9924355 10222434 10413590 10634844
16786A0634844J04662K40789N11890K82554M7673O55654K25463J66666O10923
$$ 10634844 10739506 10980295 11492185 11774739 11822412 12478066 12703529 12870195 13481118
16777A3481118O63730R3104M71053M88733L04175O15280L43805O11612O60031
$$ 13481118 14144848 14237952 14709005 15197738 15501913 16117193 16460998 17072610 17732641
16768A7732641R38155N52084O94302M67288P71767Q69857O52118J004337O86266
$$ 17732641 18670796 19222880 19917182 20384470 21156237 22026094 22678212 23682549 24368815
16759B4368815J289813R79019P83523J490883P92164J776874J322988J826432
$$ 24368815 25658628 26637647 27421170 28912053 29704217 31481091 32804079 34630511
16751C4630511J232709J597838J952478J680396K002295K236825K165809K797228
$$ 34630511 35863220 37461058 39413536 41093932 43096227 45333052 47498861 50296089
16743E0296089K431014K974223L025038L190687L420711M125341L782807M412991
$$ 50296089 52727103 55701326 58726364 61917051 65337762 69463103 73245910 77658901
16735G7658901M364635M952914N599034N058633O098802O454532O512112O265872
$$ 77658901 82023536 86976450 92575484 97634117 103732919 110187451 116699563 122965435
16727A22965435P107603P508372O972722P158249P125056O620337O484514N088624
$$ 122965435 130073038 137581410 144554132 151712381 158837437 165457774 171942288 177030912
16719A77030912N049996L642101K682212J666982q1893p84215k217936l424116
$$ 177030912 182080908 185723009 188405221 190072203 189990310 189206095 186988159 183564043
16711A83564043m421670n422249n997884o410425o951678p051184p060383p339782
$$ 183564043 179142373 173720124 167722240 161311815 154360137 147308953 140248570 132908788
16703A32908788p451235o651346o632131o512982n899782n818311n495936m897187
$$ 132908788 125457553 118806207 112174076 105661094 99761312 93943001 88447065 83549878
16695H3549878n025794m385066m282468l736492l745924l383225l183803k825703
$$ 83549878 78524084 74139018 69856550 66120058 62374134 58990909 55807106 52981403
16687E2981403k779636k735277k482420k232506k084950j708265j573842k250716
$$ 52981403 50201767 47466490 44984070 42751564 40666614 38958349 37384507 35133791
16679C5133791j713261j544976j306851j262400r47312j496770j204939q00824
$$ 35133791 33420530 31875554 30568703 29306303 28358991 26862221 25657282 24856458
16671B4856458j075012r60228j040651q95540n51756p70388o35735r00727m68054
$$ 24856458 23781446 22821218 21780567 20885027 20333271 19562883 18927148 18026421 17558367
16662A7558367p60020l17534o56201q18764m5163q29160l27736n50530l47038
$$ 17558367 16798347 16480813 15824612 15005848 14960685 14131525 13803789 13253259 12906221
16653A2906221n44911n46579p8616n47287M9409m10779q22473q0761j72448K0738
$$ 12906221 12361310 11814731 11736115 11188828 11238237 10827458 10004985 9924224 9751776 9772514
16643I772514n23740l73951K6278m60495M8567n78114k64925j4789r267k02192
$$ 9772514 9248774 8874823 8901101 8440606 8489173 7911059 7646134 7631345 7622078 7419886
16633G419886J1701m58827l62831j4676j64258j63118l42270k66259K58390m26537
$$ 7419886 7431587 6972760 6609929 6595253 6430995 6267877 5925607 5659348 5917738 5491201
16623E491201J05637j59109J47481n59974k15097K8686o8081k67061O3947J45775
$$ 5491201 5596838 5437729 5585210 5025236 4810139 4838825 4770744 4503683 4567630 4713405
16613D713405k82463n1909n722j19915j73333L1777l99703J66960K1441J60131
$$ 4713405 4430942 4379033 4373311 4253396 4080063 4111840 3712137 3879097 3900538 4060669
16603D060669l28782j26547j8899J1561k29115K85929l0368j68725j83859r0354
$$ 4060669 3731887 3605340 3586441 3598002 3368887 3654816 3624448 3455723 3271864 3181510
16593C181510P6171l8860l91649J74752J44937J25315l18169k35299J00754j16890
$$ 3181510 3257681 3218821 2827172 3001924 3146861 3272176 2954007 2718708 2819462 2702572
16583B702572Q1916l2065K45754m26550Q4569L5677n9604m37302K50264j47426
$$ 2702572 2784488 2752423 2998177 2571627 2656196 2691873 2632269 2194967 2445231 2297805
16573B297805M83486k75770m07466L17128j52639j65606o3596M14358j09745l89892
$$ 2297805 2781291 2505521 2098055 2415183 2262544 2096938 2033342 2447700 2337955 1948063
16563A948063L75398l28431m195P6502r1115M1106M109k57494L8896o406n4686
$$ 1948063 2323461 1995030 1990835 2067337 1976222 2017328 2021437 1763943 1802839 1796433 1741747
16552A741747l36493M78580l16782j85510M25732k8375K82250n54870J29867j93955
$$ 1741747 1405254 1883834 1567052 1381542 1807274 1778899 2061149 1506279 1636146 1442191
16542A442191J0064j6340k63599J41906K11342j35827R6818l5331L241k07498
$$ 1442191 1452255 1435915 1172316 1314222 1525564 1389737 1486555 1451224 1454465 1246967
16532A246967R1227o8998k23520L80331k17113j75736K12077P80k98470j8800
$$ 1246967 1338194 1269196 1045676 1426007 1208894 1033158 1245235 1246015 947545 928745
16522I28745N48487k20076J33089j37225n0290N6171k52374K83696n2263k58356
$$ 928745 1477232 1257156 1390245 1253020 1202730 1258901 1006527 1290223 1237960 979604
16512I79604K14798l09928K66371j41437r2J83343q8162o9673l18414l8534N05577
$$ 979604 1194402 884474 1150845 1009408 1009316 1192659 1104497 1034824 716410 677876 1183453
16501A183453j58113K1919K76605m21520j94552J79814k97649K05924J1085J38678
$$ 1183453 1025340 1047259 1323864 902344 707792 887606 589957 795881 806966 945644
16491I45644J07700l27494m6700L36647j19353J446l49244M63615j10641j98806
$$ 945644 1053344 725850 679150 1015797 896444 897890 548646 1012261 901620 702814
16481G02814J78646l26993K13859q3198j94042O54L99206k48982K4887L0005L62015
$$ 702814 881460 554467 768326 685128 491086 491740 890946 641964 666851 696856 1058871
16470A058871k09343l57834L15631o9986J76705D10184L09946K33834n9438j27578
$$ 1058871 849528 491694 807325 737339 914044 410184 720130 953964 894526 766948
16460G66948j92224j71887J97087J5849r2764J97715M5347j51449j42519j34146
$$ 766948 574724 402837 599924 615773 523009 720724 766071 614622 472103 337957
16450C37957L91270q4071B14849L37781K95044k69591J11523j85966k08076O089
$$ 337957 729227 645156 214849 552630 847674 578083 689606 503640 295564 301653
16440C01653K05353K54955J24446m26940L49509j47090N3258j15635M0178l05241
$$ 301653 507006 761961 886407 459467 808976 661886 715144 599509 639687 334446
16430C34446J74532A49155L65522j19621K47385j26140k52057J92234J40685A57859
$$ 334446 508978 149155 514677 395056 642441 516301 264244 456478 597163 157859
16419C83033n7479K498O6021A59183K36575j33452J4103o803L2629o255L19536
$$ 383033 325554 328052 394073 159183 395758 262306 276409 269606 302235 295980 615516
16408F15516L3209j59638k17042K15874L196A74096K76168j55639J90J98103J28628
$$ 615516 648725 489087 272045 487919 491115 174096 450264 294625 294815 492918 621546
16397F21546B39397J69458Q5257J7987N8709J23530l9970j64730q3518j85258
$$ 621546 239397 408855 494112 512099 570808 694338 654368 489638 406120 220862
16387B20862J89000k3696j45975P7846A08049J94504J10069I1138M32649A1437
$$ 220862 409862 386166 240191 318037 108049 302553 412622 91138 523787 11437
16376D74146I8132M50793q1320r4004j09097J98272B9301M63489A41307J50440
$$ 474146 98132 548925 467605 373601 264504 462776 29301 492790 141307 291747
16366B91747J14838A0636L12227A06633L72578B38243K9177N3046A53766j2915
$$ 291747 406585 10636 322863 106633 479211 238243 267420 320466 153766 140851
16356A40851M15663B66030A21111K68764M457f963G01168B48213K60979J68570
$$ 140851 556514 266030 121111 389875 394332 -6963 701168 248213 509192 677762
16346F77762a1032C00426l8610A26162L86455A891L50658k6442I092L67401K2834
$$ 677762 -11032 300426 261816 126162 512617 1891 352549 326107 9092 376493 399327
16335C99327F0771K47764O3493c04448A01423J19993n3101F3753M2997A1649h63
$$ 399327 60771 308535 372028 -304448 101423 221416 168315 63753 106750 11649 -863
16323C11472j38799E583J34653o9019K76802q182G7719J19145J62263j70394J08585
$$ 311472 172673 5583 140236 71217 348019 339837 77719 196864 359127 188733 297318
16312B97318K35293k27491G2431J01153L2891K14451D7961f39A76183p2900K22925
$$ 297318 532611 305120 72431 173584 206475 420926 47961 -639 176183 103283 326208
16301C26208D9825L77183B04753A00417A3462d2642C87007R2715d7786m06589
$$ 326208 49825 427008 204753 100417 13462 -42642 387007 479722 -47786 -454375
16291d54375A88574L6152J27072j52892H6179J05178J25521A17490J77993D8008
$$ -454375 188574 224726 351798 198906 86179 191357 316878 117490 295483 48008
16280C35650n8776J02250j19495M2851I8454a14870r8922B34245F8973a08501
$$ 335650 276874 379124 259629 302480 98454 -114870 -213792 234245 68973 -108501
16269b7414A4644a83620A02051Q5330e4725D4533f5214p026k8298j72709f0341
$$ -27414 14644 -183620 102051 187381 -54725 44533 -65214 -72240 -100538 -273247 -60341
16257C5540e652C50251a3814A01178k27B6091J66396G560M7755q879K33317b6401
$$ 35540 -5652 350251 -13814 101178 100951 26091 192487 7560 55315 46436 279753 -26401
16244C13918G9977d9711o4074B87748A5430J07023a03807j55121D4579J11128
$$ 313918 79977 -49711 -113785 287748 15430 122453 -103807 -258928 44579 155707
16234A55707K97054G2726a72491A72747j4305B6129a42368c8193B0910b5801k23197
$$ 155707 452761 72726 -172491 172747 158442 26129 -142368 -38193 20910 -25801 -248998
16223b48998B11002B8492J23778a0340B416a00046D28693r6396H5641R3156P6109
$$ -248998 211002 28492 152270 -10340 2416 -100046 428693 332297 85641 178797 254906
16212B54906C1892Q7624j4161K5959R6246a28224B5497Q3993m0939A6737J66665
$$ 254906 31892 119516 105355 131314 227560 -128224 25497 109490 68551 16737 183402
16201A83402D7339K14117c507C44456d613C01760K9341j34601H2569a95900H4567
$$ 183402 47339 261456 -3507 344456 -4613 301760 331101 196500 82569 -195900 84567
16189B31143q4306F1981J17077J41633a12620B63249g0228B7621d1599j60978
$$ 231143 146837 61981 179058 320691 -112620 263249 -70228 27621 -41599 -202577
16179b02577j41406A34898c63816A56717b64129j3323E690K90156H5068a66976
$$ -202577 -343983 134898 -363816 156717 -264129 -277452 5690 295846 85068 -166976
16168C14345C6813J1098J51431K02949g4685j06535F8912L8643F37f4407A06501
$$ 314345 36813 47911 199342 402291 -74685 -181220 68912 107555 637 -64407 106501
16156C26708g0510A39281d6182k05068B71784f3253A01346c13282D7612a33644
$$ 326708 -70510 139281 -46182 -251250 271784 -63253 101346 -313282 47612 -133644
16145a26682C7996R701a9548l1582a8460j40227A33492c40616h1260C62757A03547
$$ -126682 37996 47697 -19548 -51130 -18460 -158687 133492 -340616 -81260 362757 103547
16133E3899f0068E5327J61271A2531N3729b17473A13177a02568a808p5449k637
$$ 53899 -60068 55327 216598 12531 66260 -217473 113177 -102568 -1808 -77257 -79894
16122g9894A15602J52215J4616F9713d5321o6964C7407f5652a9669B26188B0530
$$ -79894 115602 267817 282433 69713 -45321 -112285 37407 -65652 -19669 226188 20530
16110A88782H7153J12803A7697c7643j21350A6429a30815d7371K135A62830E8009
$$ 188782 87153 199956 17697 -37643 -158993 16429 -130815 -47371 -45236 162830 58009
16098g9589B0241b40185D23163a75286B16773E0832d7469A9191P7328e950I2438
$$ -79589 20241 -240185 423163 -175286 216773 50832 -47469 19191 96519 -5950 92438
16086D3666J39508a75152I9592O6714O3384C636J78179b26929A45794l5448a59532
$$ 43666 183174 -175152 99592 166306 229690 3636 181815 -226929 145794 110346 -159532
16074A24641D9748J94697G3495c8431E3516a8305C60324D5451r709I508f3111
$$ 124641 49748 244445 73495 -38431 53516 -18305 360324 45451 35742 9508 -63111
16062B38211d3025C30900a10358q2293N9864o5207d8118A55572Q4403A5409L1759
$$ 238211 -43025 330900 -110358 -192651 -132787 -197994 -48118 155572 239975 15409 47168
16051D7168a00025A59903b95120J27200C27883D5238a11502M1332B3497h9578
$$ 47168 -100025 159903 -295120 -167920 327883 45238 -111502 -70170 23497 -89578
16040h4424j83069e4507a8433j4701j4361B2832N643P6726D7615i1191j44822
$$ -84424 -267493 -54507 -18433 -33134 -47495 22832 28475 105201 47615 -91191 -236013
16029b36013F7016a40122B52621i948F4564B6049f8278o4560A87937b10940k3340
$$ -236013 67016 -140122 252621 -9948 64564 26049 -68278 -132838 187937 -210940 -234280
16018b34280e1884j32080F5514D112a30935d4772A44396b88895h7357B8772Q8495
$$ -234280 -51884 -183964 65514 4112 -130935 -44772 144396 -288895 -87357 28772 117267
16007A17267b61660j8093O1742G9006A6827d9717j37082K6499B49188c10455E4596
$$ 117267 -261660 -279753 -218011 79006 16827 -49717 -186799 -160300 249188 -310455 54596
15995B18331c442l6195F9804K50038a950k35630A04737D9221K15769a57708E611
$$ 218331 -3442 -39637 69804 319842 -1950 -237580 104737 49221 264990 -157708 5611
15983I3953L51246k19327J367L2369J57885j12143r862d2839A97382b54167c8841
$$ 93953 445199 225872 227239 259608 417493 305350 295488 -42839 197382 -254167 -38841
15971a75771f3294C61101a29040A30717i7840A82470H0291B4337J95167d4818
$$ -175771 -63294 361101 -129040 130717 -97840 182470 80291 24337 219504 -44818
15960B30570r082D360a01749A83040c34444c9514k09471d508r8387A67887K08641
$$ 230570 221488 4360 -101749 183040 -334444 -39514 -248985 -4508 -102895 167887 376528
15949C76528g4936c7238F5026a04073q031B48428A452a96274n6609r0977B8107
$$ 376528 -74936 -37238 65026 -104073 -112104 248428 1452 -196274 -252883 -343860 28107
15937b994A26416b54434c2521l39081C2803R6009c1253p8404j67766A58592J7013
$$ -2994 126416 -254434 -32521 -371602 32803 128812 -31253 -109657 -277423 158592 175605
15926A75605C2509a5539l65816R3939A66978a61274H2474M1106a36772j12173
$$ 175605 32509 -15539 -381355 -287416 166978 -161274 82474 123580 -136772 -248945
15916b48945p825B8495o480M109J61623p4336l2965b01081j31340A02194d10452
$$ -248945 -256770 28495 22015 26124 187747 113411 80446 -201081 -332421 102194 -410452
15904A60120b6957j38276C0990g7160A65392b8016q4586k57445A46376b44539
$$ 160120 -26957 -165233 30990 -77160 165392 -28016 -112602 -370047 146376 -244539
15893a04194l13283A40771E0744O3228Q1272Q110a44587A23517a8307o149j03248
$$ -104194 -417477 140771 50744 113972 195244 203354 -144587 123517 -18307 -24456 -127704
15882a27704p5533A43642a18479j17271j1892f7743B83130j28347b39143a11255
$$ -127704 -203237 143642 -118479 -235750 -247642 -67743 283130 154783 -239143 -111255
15871a11786A5789D449N7122a9251k2388A08970a68601g9058j81807a17719A9253
$$ -111786 15789 4449 61571 -19251 -41639 108970 -168601 -79058 -260865 -117719 19253
15859H0232h8771j21882I2913a79265M0784c5535j31021k9256D632L32516G0444
$$ 80232 -88771 -210653 92913 -179265 -138481 -35535 -166556 -195812 4632 337148 70444
15847I3076b28989Q0673N8077c65G0828Q7172e8854k4372a0988B18529b04598
$$ 93076 -228989 -148316 -90239 -365 70828 158000 -58854 -83226 -10988 218529 -204598
15835i6468M5256k29410A84138H8125b09022D2613K35935c61222A86429B2164
$$ -96468 -51212 -280622 184138 88125 -209022 42613 278548 -361222 186429 22164
15824e9363k59030E1685N0698h8883B33976a14258j45122J4326K5446g7566B17115
$$ -59363 -318393 51685 102383 -88883 233976 -114258 -259380 -245054 -219608 -77566 217115
15812A51974C083L4650c53895Q8915a06704j05625d7343J6421A9427c04318e8116
$$ 151974 3083 37733 -353895 -264980 -106704 -212329 -47343 -30922 19427 -304318 -58116
15800C14342P3855B0576a8440E2942a21237A96164F6746h2565G3465L41432B5769
$$ 314342 388197 20576 -18440 52942 -121237 196164 66746 -82565 73465 414897 25769
15788a95211A23660h0814b3408F0328k7574J96923r7454b66679f9814a8094n5045
$$ -195211 123660 -80814 -23408 60328 32754 229677 132223 -266679 -69814 -18094 -73139
15777g3139m39j43740J7715o9454A679b84209E4768K12464B6484c22831Q2955
$$ -73139 -73578 -217318 -199603 -269057 1679 -284209 54768 267232 26484 -322831 -239876
15766b39876E4037a36121L6145G1538a11500B8466G40M08381b84156P7266b4813
$$ -239876 54037 -136121 -99976 71538 -111500 28466 740 409121 -284156 -206890 -24813
15754H9866C7213J00687i9787B08179i1782b6778B7459L21134a01613a9619G9528
$$ 89866 37213 137900 -99787 208179 -91782 -26778 27459 348593 -101613 -19619 79528
15742A10130m0035i8505A27272O6470J8682Q7708j24881a95508D6059b03412l02661
$$ 110130 70095 -98505 127272 193742 212424 300132 175251 -195508 46059 -203412 -506073
15731e06073B47790g4727j2478c2455A15095a04770k34650A57351b41057h9070
$$ -506073 247790 -74727 -87205 -32455 115095 -104770 -339420 157351 -241057 -89070
15720a60910n0540C80720j13090b52166C623b16444C1226a22334A16329A496K84356
$$ -160910 -211450 380720 267630 -252166 3623 -216444 31226 -122334 116329 1496 285852
15709B85852A4699e1679A10331a67623A73839Q4919i1981l05433J51758d4901
$$ 285852 14699 -51679 110331 -167623 173839 258758 -91981 -397414 -245656 -44901
15698C4770K7870a00869K5318I8308a12159B68503b88378B40445i1581K0804B0799
$$ 34770 62640 -100869 -75551 98308 -112159 268503 -288378 240445 -91581 -70777 20799
15686d5717R238n9202j28187j6779F2884J48422a40992l5347L9210C42979g6335
$$ -45717 -36479 -95681 -223868 -240647 62884 211306 -140992 -176339 -137129 342979 -76335
15674b8045j22827P3971q3139A50805A6914a08367d240l2363q3454j18881I0a94265
$$ -28045 -150872 -76901 -160040 150805 16914 -108367 -4240 -36603 -120057 -238938 90 -194265
15661I4801b93979a3965A91407g403G8388a2283A17451c28470A50686J93590G7804
$$ 94801 -293979 -13965 191407 -7403 78388 -12283 117451 -328470 150686 344276 77804
15649d2681m2069A84764D9745K15584b92446C13959c3439q8456n47I2492d1630
$$ -42681 -84750 184764 49745 265329 -292446 313959 -33439 -121895 -122442 92492 -41630
15637B11395r2937k9654a92591A10486d0606a1192q5102j15881k63268f0541j55884
$$ 211395 118458 88804 -192591 110486 -40606 -11192 -96294 -212175 -475443 -60541 -216425
15626b16425f0305K5826A22463P0728O7162K3978k2396f8137G316K60597a19705
$$ -216425 -60305 -34479 122463 193191 260353 284331 261935 -68137 7316 267913 -119705
15614H9659e9541E1556b23691k5628B13150e6538j33080b7354j47312A36828O730
$$ 89659 -59541 51556 -223691 -249319 213150 -56538 -189618 -27354 -174666 136828 143558
15603A43558D7402J26039a0556A105a07340F4397d36515a35078N7179A67117g6759
$$ 143558 47402 173441 -10556 1105 -107340 64397 -436515 -135078 -77899 167117 -76759
15591b0974k26211D4339l493a96930A38207K9405b98210c0659F6498a69460e944
$$ -20974 -247185 44339 40846 -196930 138207 167612 -298210 -30659 66498 -169460 -5944
15579c30665A5350a37697r0819H6651J4972a52766j34582q065g5359p9419A50082
$$ -330665 15350 -137697 -228516 86651 101623 -152766 -287348 -295413 -75359 -154778 150082
15567a80160J2222f7913A24766n1566a41498M169C30373A32921L7931D0309J29095
$$ -180160 -167938 -67913 124766 73200 -141498 -137329 330373 132921 170852 40309 169404
15556A69404f3476A25692e0225F5206D344K4234d1007o14963C2353f8563C7418
$$ 169404 -63476 125692 -50225 65206 4344 28578 -41007 -655970 32353 -68563 37418
15544B33044a22144L2399j31363i0987r0296H3469K5581J38935b574B35109E2463
$$ 233044 -122144 -89745 -221108 -90987 -181283 83469 109050 247985 -2574 235109 52463
15532B57581G4194K10649I9332m1597O8678D4018b58577P4976e2805p7813I6873
$$ 257581 74194 284843 99332 57735 126413 44018 -258577 -183601 -52805 -130618 96873
15520c1909m2389B2190a84855B63083J01849A19496n6060d7178B37943j14002
$$ -31909 -74298 22190 -184855 263083 364932 119496 63436 -47178 237943 123941
15510A23941a88862O7151G6354f4337a0557l2046H8028c5968n3320A36765l1654
$$ 123941 -188862 -121711 76354 -64337 -10557 -42603 88028 -35968 -89288 136765 105111
15499A05111b55023m9470b5679r7942b1778k14685R7600I50M1035a04445c8505
$$ 105111 -255023 -304493 -25679 -123621 -21778 -236463 -138863 950 41985 -104445 -38505
15487B80972b00464d3945j15764j26309A27835a35440G5026A3257a71986N8025
$$ 280972 -200464 -43945 -159709 -286018 127835 -135440 75026 13257 -171986 -113961
15477a13961m6821I3101a4653B11405a54051j16249B55857b04388r3863E0691
$$ -113961 -160782 93101 -14653 211405 -154051 -270300 255857 -204388 -298251 50691
15466I8403e5510D2676L2405j5399k7456a21394j1162B1944c01151B25693c8584
$$ 98403 -55510 42676 75081 59682 32226 -121394 -132556 21944 -301151 225693 -38584
15454b4946m3702G1441N9027M7651F0098J10116A2673b679B3421d0155k91440
$$ -24946 -68648 71441 130468 178119 60098 170214 12673 -2679 23421 -40155 -331595
15443c31595B45104a50208F4228b7010F7287a7377C72033c8995k61133C32383
$$ -331595 245104 -150208 64228 -27010 67287 -17377 372033 -38995 -300128 332383
15432B06232B0181a20134B41332a00880A11273b27219a09276C77148e50851b7561
$$ 206232 20181 -120134 241332 -100880 111273 -227219 -109276 377148 -550851 -27561
15421D0522b05195A584K48514a35406K9228b9040r616q9352A60820J57367f0648
$$ 40522 -205195 1584 250098 -135406 -106178 -29040 -38656 -128008 160820 318187 -60648
15409f8398A79116a34934F2579e6736B24991f5997A5275b08050D7078c2392E9060
$$ -68398 179116 -134934 62579 -56736 224991 -65997 15275 -208050 47078 -32392 59060
15397a80655B9916Q0091J0904g3178j17466G8618a14180N710N2822A2462a06825
$$ -180655 29916 110007 120911 -73178 -190644 78618 -114180 -108470 -55648 12462 -106825
15385C3735b18663C91835r7404c28310C1750d1741E3408a11134c6252B69945E465
$$ 33735 -218663 391835 294431 -328310 31750 -41741 53408 -111134 -36252 269945 5465
15373B12143f3183A45163a27881A79676F4039J8670b14322c7558r1680I5416A3104
$$ 212143 -63183 145163 -127881 179676 64039 82709 -214322 -37558 -129238 95416 13104
15361a74442n3675B03789q2439f76474A89609b3489q8337k5680A65837p1596J1660
$$ -174442 -228117 203789 121350 -676474 189609 -23489 -111826 -137506 165837 94241 105901
15350A05901J62718A8877b54012a03010j37999j2042O5820j47994B57722b53161
$$ 105901 268619 18877 -254012 -103010 -241009 -253051 -187231 -335225 257722 -253161
15339b54942C59601c3881j47105P9813A0494c37870A40859I855Q5245b47264e3993
$$ -254942 359601 -33881 -180986 -101173 10494 -337870 140859 9855 95100 -247264 -53993
15327a10034l73139a38680n0362A71469F7829j7107P7001a6385j04089B28618
$$ -110034 -483173 -138680 -189042 171469 67829 50722 127723 -16385 -120474 228618
15316B1070J75472p4678L915J7560e9310o284J1625B53280F9315K22560e934F2886
$$ 21070 196542 121864 125779 143339 -59310 -65594 -53969 253280 69315 291875 -5934 62886
15303f735C6149R7282o0411J78332a29112F0285a38275I5653J68472D3222J36546
$$ -6735 36149 133431 73020 251352 -129112 60285 -138275 95653 264125 43222 179768
15292A79768c3728D8914a77216r188A34148k3096d3030j4503C3790i3979k77065
$$ 179768 -33728 48914 -177216 -186404 134148 111052 -43030 -57533 33790 -93979 -371044
15281c71044B11311o0826N0378a24612I2974l0240K19763j07309D4380k0732K7563
$$ -371044 211311 150485 200863 -124612 92974 62734 282497 175188 44380 23648 51211
15270E1211f9209B50751d8444F4933e4220B22420A0188K29012B6517e954l27429
$$ 51211 -69209 250751 -48444 64933 -54220 222420 10188 239200 26517 -5954 -333383
15259c33383A34922i1463A66466E8534J45276M4263f7595B17051h0354B52190
$$ -333383 134922 -91463 166466 58534 203810 248073 -67595 217051 -80354 252190
15248H85262M91992l39882N70849G95800B62752A2166K83211l7051G3138B7385
$$ 885262 1377254 1037372 1608221 795800 262752 12166 295377 258326 73138 27385
15237A300a0318I499a27576e6002l34003f2329D5779b81190C58651H5124L50819
$$ 1300 -10318 9499 -127576 -56002 -390005 -62329 45779 -281190 358651 85124 435943
15226D35943j56924K63411b6699A35702M4085e8124C7850J04965a08073A67416
$$ 435943 279019 542430 -26699 135702 179787 -58124 37850 142815 -108073 167416
15215I7583L55741a73158G7971g926A03673Q3724Q4800f2863A3932J59637k8380
$$ 97583 453324 -173158 77971 -7926 103673 187397 272197 -62863 13932 173569 145189
15204A45189C0788c50136C20186I2890i8366A39274J5171j9140a05610E6210J8438
$$ 145189 30788 -350136 320186 92890 -98366 139274 154445 135305 -105610 56210 74648
15193G4648f783B17566a76455A74880e8511C12913r7694R7995g9356B29957F7636
$$ 74648 -6783 217566 -176455 174880 -58511 312913 215219 313214 -79356 229957 67636
15181A07351a66201C34101a89291m7212h2121C8747A0727K4756J44448N1966k2372
$$ 107351 -166201 334101 -189291 -236503 -82121 38747 10727 35483 179931 231897 209525
15170B09525E151J20225k5983m761a78364A47811K87992j63495B0360a08323D42059
$$ 209525 5151 125376 99393 94632 -178364 147811 435803 272308 20360 -108323 442059
15158A26581B2015j098L9274J5493P1285j107m2881i1860k70297A94961n7771
$$ 126581 22015 20917 60191 75684 146969 145862 102981 -91860 -362157 194961 137190
15147A37190J5755Q9983m2913a86887C6250J8084K03412A2823a92008D0286M38827
$$ 137190 152945 242928 200015 -186887 36250 54334 257746 12823 -192008 40286 479113
15136D79113A37162Q4971J53497a49108j39545R0898o2130A30317a8350I0049
$$ 479113 137162 222133 375630 -149108 -288653 -197755 -259885 130317 -18350 90049
15125a16519A33106A5378f5214p4220c581I4471J7000a1888k27500a9800B0889
$$ -116519 133106 15378 -65214 -139434 -3581 94471 111471 -11888 -239388 -19800 20889
15113g412p631F1976a38772B22775b2434B35695G2693J51237K01920a01100A54884
$$ -7412 -15043 61976 -138772 222775 -22434 235695 72693 223930 425850 -101100 154884
15101B26075J63955A18191K4189h0851C80503B6554L5255f2966B54267P5706q1976
$$ 226075 390030 118191 142380 -80851 380503 26554 61809 -62966 254267 329973 247997
15090B47997B5750J15470K6940l4397L16738a87979B55476a06213H5072b18266
$$ 247997 25750 141220 168160 133763 450501 -187979 255476 -106213 85072 -218266
15079C98161A78493M8405m5933L82476B81625j17968b36853P8713I8672Q079B4711
$$ 398161 178493 226898 180965 563441 281625 163657 -236853 -158140 98672 106751 24711
15067D02666r6833k6377a41903B04181I6875q512P0485K91772k22760q6947R122
$$ 402666 305833 279456 -141903 204181 96875 88363 158848 450620 227860 140913 150035
15056A50035K51208A5185d084a434E6500q558b80080i3634B16337a59868D15064
$$ 150035 401243 15185 -4084 -1434 56500 47942 -280080 -93634 216337 -159868 415064
15044c4800J1127C05805H9664L66250h2158F8757N16380I9055l3209b54559G980
$$ -34800 -23673 305805 89664 455914 -82158 68757 585137 99055 65846 -254559 7980
15032A9510N17117a4534p6775K4543E3895J40828J0255j3059p162k2834k7459
$$ 19510 536627 -14534 -91309 -66766 53895 194723 204978 191919 184757 161923 134464
15021A34464b0080H0229Q13073B63024D7699N995M8338K6452L2187k0873F9746
$$ 134464 -20080 80229 893302 263024 47699 53694 102032 128484 160671 139798 69746
15009A72029m2591a60765I6693J01573d1566B00397J96804k2273H1637b2853E595
$$ 172029 129438 -160765 96693 198266 -41566 200397 397201 374928 81637 -22853 5595
14997D25623o508j68609i3438D43002A51984o2685K08878l2618h157C31905K866
$$ 425623 419115 250506 -93438 443002 151984 89299 298177 265559 -8157 331905 334771
14986C34771M8141M6A29210K54427l9443j00755I1997J05502J53850j46358l6080
$$ 334771 382912 382958 129210 383637 344194 243439 91997 197499 351349 204991 168911
14975A68911F2293g5188c7148A76595R8719j23033O9573r4456C6792a96615C44116
$$ 168911 62293 -75188 -37148 176595 275314 152281 221854 127398 36792 -196615 344116
14963B55614A9192K78986Q2594G3852O25079k81397j93444I1145L68502B28522
$$ 255614 19192 298178 380772 73852 698931 417534 224090 91145 459647 228522
14952E06654a52490E45879A58055l1132J63363A44520J81468b8036A11994J62752
$$ 506654 -152490 545879 158055 126923 290286 144520 325988 -28036 111994 274746
14942B74746Q3881M5326j70282K07874B6366N82220k16169G4772J13051a10666
$$ 274746 358627 403953 233671 441545 26366 608586 392417 74772 187823 -110666
14931A00344m6304Q3852b348B92759K38916B41494K74141j59240C313L66032j26811
$$ 100344 54040 137892 -2348 292759 531675 241494 515635 356395 3313 369345 242534
14920B42534J31957A85163L01832k42093A20730M0613N246L93950I6064L75607
$$ 242534 374491 185163 486995 244902 120730 161343 166589 560539 96064 471671
14910D71671H5163K26615G2800M33118n9177b17049E45570A27355k6050J08727
$$ 471671 85163 311778 72800 505918 446741 -217049 545570 127355 101305 210032
14900B10032K40195J52663B81212J69067r3924p3481m7649K03162A97360J76186
$$ 210032 450227 602890 281212 450279 356355 282874 235225 438387 197360 373546
14890C73546Q3356M6141n6095j18557n581e3139C97646j25206m8916J29698j42836
$$ 373546 456902 503043 446948 328391 322810 -53139 397646 272440 223524 353222 210386
14879B10386J05421h8106E29553k30243O6507n1105k0458R436L0223E8906Q101
$$ 210386 315807 -88106 529553 299310 365817 314712 294254 303690 333913 58906 67007
14868F7007N5922J7220J38353J77763B15821j870J29501n8384j01711G1678J28396
$$ 67007 122929 140149 278502 456265 215821 213951 343452 285068 183357 71678 200074
14857B00074K31226I0006K88438L7030K59108k04224j10957m6465A12120J18977
$$ 200074 431300 90006 378444 415474 674582 470358 359401 312936 112120 231097
14847B31097Q5763L68431Q7530l76033A69593J35057l0805F3870M83708j9131
$$ 231097 316860 685291 772821 396788 169593 304650 273845 63870 547578 528447
14837E28447B12437P1937M73173B75012J02124K63175j94960K45260C29514K54479
$$ 528447 212437 284374 757547 275012 377136 640311 445351 690611 329514 583993
14827E83993B48791M84340C51861L53425j50969A43985Q6728J03579j56562J23178
$$ 583993 248791 733131 351861 705286 554317 143985 230713 334292 177730 300908
14817C00908o1514G6251M00600J58180k476k53798o0417J46841R0991k37150J96408
$$ 300908 239394 76251 476851 635031 632555 378757 318340 465181 556172 319022 515430
14806E15430B07862K33818J08448k59045J98747j53746l9080J79781A74769L90532
$$ 515430 207862 441680 550128 291083 489830 336084 297004 476785 174769 565301
14796E65301O140L50316k33547j08256K02775j23961k06907J01122j59278j59435
$$ 565301 571441 921757 688210 579954 782729 658768 451861 552983 393705 234270
14786B34270K57387P9670j51827r6441M45316B89982L94245C09913j680J94443
$$ 234270 491657 571327 419500 323059 768375 289982 684227 309913 308233 502676
14776E02676J56090k06127J94897j51269J45324N3627k80215J36450J91863l45725
$$ 502676 658766 452639 647536 496267 641591 695218 415003 551453 743316 397591
14766C97591L83880j98330j98057n0577K4905j4538K03988N0112k09438Q772L13792
$$ 397591 781471 583141 385084 334507 359412 344874 548862 598974 389536 398308 712100
14755G12100k19202k09230L91466q6631J79843j52367j90687K72120L9974R3230
$$ 712100 492898 283668 675134 588503 768346 615979 425292 697412 737386 830616
14745H30616j00995k9834j20029J54713k87274N10075C46660J7639M10299R6221
$$ 830616 729621 699787 579758 734471 447197 957272 346660 364299 774598 870819
14735H70819j71880k54591K4637O26339n10460I2118O18229o1475l002K67363
$$ 870819 698939 444348 468985 1095324 584864 92118 710347 648872 645870 913233
14725I13233P1687k21458k72853K43708j12517r3850K15564J48347j42776L31244
$$ 913233 984920 763462 490609 734317 621800 527950 743514 891861 749085 1080329
14715A080329k99033l1554j82901K96483J46776j90920k27495J25193j05695J59000
$$ 1080329 781296 749742 566841 863324 1010100 819180 591685 716878 611183 770183
14705G70183N1948m3596J99898M9691k19857p972k00565K02386J19242k9847j4402
$$ 770183 822131 778535 978433 1028124 808267 800295 599730 802116 921358 891511 877109
14694H77109l32048L68408o7741l86393Q6425J00197K2627J67655j7522J15435
$$ 877109 545061 913469 845728 459335 545760 645957 668584 836239 818717 934152
14684I34152m36842m8671N24737k676l55720L5867J38974L72025q6386j85655
$$ 934152 497310 448639 973376 970700 614980 650847 789821 1161846 1075460 889805
14674H89805j4364j60828K75466o1765l75974K72989L05018m2597n866k56246
$$ 889805 875441 714613 990079 928314 552340 825329 1130347 1087750 1081884 825638
14664H25638J29578L3507r2370L24538M2903m56724K96610l45995K04559J78672
$$ 825638 955216 988723 896353 1220891 1263794 807070 1103680 757685 962244 1140916
14654A140916J17418m44618N58152l17250L01537k38443k6730k8924k60960L30434
$$ 1140916 1258334 813716 1371868 1054618 1356155 1117712 1090982 1062058 801098 1131532
14644A131532j1309q1470J23574Q2474Q448j69004K47286j83842N5791m5767k19791
$$ 1131532 1120223 1038753 1162327 1244801 1253249 1084245 1331531 1147689 1203480 1157713 937922
14633I37922K95971K37299l59816o9080J42197J52569j82121L8073j51565K7648
$$ 937922 1233893 1471192 1111376 1042296 1184493 1337062 1154941 1193014 1041449 1069097
14623A069097j36742M56053j60162j75107O40578n10097J43882J75688k72822
$$ 1069097 932355 1388408 1228246 1053139 1693717 1183620 1327502 1503190 1230368
14614A230368M09006k43295j36590J30115P2763k95227m1017J46934J54718n0563
$$ 1230368 1639374 1396079 1259489 1389604 1462367 1167140 1126123 1273057 1427775 1377212
14604A377212J50125M2962n9144J48754k87159K77639m47216K21073n375j72699
$$ 1377212 1527337 1570299 1511155 1659909 1372750 1650389 1203173 1424246 1418871 1246172
14594A246172K43045k32238K87600j34446J42235J18419J56587j54548P9488j96638
$$ 1246172 1489217 1256979 1544579 1410133 1552368 1670787 1827374 1672826 1752314 1555676
14584A555676J80517m1235q3449n7181K55365k51228M02566k40556N7902J19282
$$ 1555676 1736193 1694958 1611509 1554328 1809693 1558465 1961031 1720475 1778377 1897659
14574A897659p1102k35682N8400M63340J2806k05115k76351J97262K42168K2785
$$ 1897659 1826557 1590875 1649275 2112615 2125421 1920306 1643955 1841217 2083385 2106170
14564B106170P8645L75652o05030K37065K30079j07303l75069R98074k27279N39088
$$ 2106170 2184815 2560467 1955437 2192502 2422581 2315278 1940209 2938283 2711004 3250092
14554C250092m23342L68994J82760P81793Q18253J421824L867143R304675K0820493
$$ 3250092 2826750 3195744 3378504 4160297 4978550 6400374 10267517 19572192 40392685
14545D0392685Q323409A9798817H670921l912084j739158n54955n10805J7630
$$ 40392685 48716094 19798817 8670921 4758837 3019679 2464724 1953919 1971549
14537A971549k87833J55194p3874K91187k52790K97023l72013J15023K31560k35878
$$ 1971549 1683716 1838910 1765036 2056223 1803433 2100456 1728443 1843466 2075026 1839148
14527A839148L39505o3882R0962k21835l1560M98526m46146L01246k24188J11585
$$ 1839148 2178653 2114771 2205733 1983898 1952338 2450864 2004718 2305964 2081776 2193361
14517B193361K68658j37636q8344L0734n590L25967K9065M9332N7151P0847m75662
$$ 2193361 2462019 2324383 2236039 2266773 2261183 2587150 2616215 2665547 2722698 2793545 2317883
14506B317883M24860j47914N978J29422J24418l09784k26019M94023K42999Q1649
$$ 2317883 2742743 2594829 2600807 2730229 2854647 2544863 2318844 2812867 3055866 3137515
14496C137515k47478J9407K22596k6301J06081k79050K03974J81199n7183K4718
$$ 3137515 2890037 2909444 3132040 3105739 3211820 2932770 3136744 3317943 3260760 3285478
14486C285478j6816J19863q9263R630J341K05417k02859L96148l13912M43731
$$ 3285478 3268662 3388525 3299262 3308892 3310233 3515650 3312791 3708939 3395027 3838758
14476C838758L987J66970k45118p6988J46555K6809O9056J7670K7258M33014n38003
$$ 3838758 3842745 4009715 3764597 3687609 3834164 3860973 3930029 3947699 3974957 4407971 3869968
14465C869968J27084M260K48716j29279L1796l35881J101788l66372M2601o4086
$$ 3869968 3997052 4001312 4250028 4120749 4152545 3816664 4918452 4552080 4594681 4530595
14455D530595K250J12231Q2190j19382Q0150Q3371J5379K30758j12347K48031
$$ 4530595 4532845 4645076 4727266 4607884 4688034 4771405 4786784 5017542 4905195 5153226
14445E153226J83449j56399j98078K89616J13657J31235K12794k362L75294j25280
$$ 5153226 5336675 5180276 4982198 5271814 5385471 5516706 5729500 5727138 6102432 5977152
14435E977152j04781J07915M586L00544k78051K66673r2463L32489K26233k22120
$$ 5977152 5872371 5980286 5984872 6285416 6007365 6274038 6181575 6514064 6740297 6518177
14425F518177M14842k45773L19846l1996R0336J44267J75764k44439L25737K50161
$$ 6518177 6933019 6687246 7007092 6975096 7065432 7209699 7385463 7141024 7466761 7716922
14415G716922j35577L66100q4231L87976M3606L87901l74635M4871M81398J167
$$ 7716922 7581345 7947445 7863214 8251190 8294796 8682697 8308062 8352933 8834331 8835498
14405H835498n2719L17941J63750j92117L44127J05010j52738N64397L91879Q2813
$$ 8835498 8782779 9100720 9264470 9072353 9416480 9521490 9368752 9933149 10325028 10407841
14395A0407841J18880K06393J88185R4965J12656R3679L27162J43297M27835M30692
$$ 10407841 10526721 10733114 10921299 11016264 11128920 11222599 11549761 11693058 12120893 12551585
14385A2551585P3092J80431J69269l2651P79982J07720N16942R5626J84921M77447
$$ 12551585 12624677 12805108 12974377 12941726 13721708 13829428 14346370 14441996 14626917 15104364
14375A5104364K13918J57798K36590O36495J70229L88877L17708L88955P6061
$$ 15104364 15318282 15476080 15712670 16349165 16519394 16908271 17225979 17614934 17690995
14366A7690995Q44854J49456M59518L04127M44068O13147L36824M04835M95990
$$ 17690995 18535849 18685305 19144823 19448950 19893018 20506165 20842989 21247824 21743814
14357B1743814L54716K61528J015487M41550M63819N04558Q32587J45891J051197
$$ 21743814 22098530 22360058 23375545 23817095 24280914 24785472 25618059 25763950 26815147
14348B6815147L30112N76245M86343J289732O89342O59192M25425J012278R49961
$$ 26815147 27145259 27721504 28207847 29497579 30186921 30846113 31271538 32283816 33233777
14339C3233777O28791J387975P33530R28724N71411J642854J160988J274725J144819
$$ 33233777 33862568 35250543 35984073 36912797 37484208 39127062 40288050 41562775 42707594
14330D2707594J236112J236080J879491J082142J687695J754155J906864J652152
$$ 42707594 43943706 45179786 47059277 48141419 49829114 51583269 53490133 55142285
14322E5142285K053471J882984J921383K462543K111360K402545K762724K695007
$$ 55142285 57195756 59078740 61000123 63462666 65574026 67976571 70739295 73434302
14314G3434302K703281L344998L308774L793982K828211M093209M227802M042927
$$ 73434302 76137583 79482581 82791355 86585337 89413548 93506757 97734559 101777486
14306A01777486M726794M730925N055811N482699N707173O643734O338497P369536
$$ 101777486 106504280 111235205 116291016 121773715 127480888 134124622 140463119 147832655
14298A47832655P244761P882538Q608619R262629R538147J0396153J0761589J1627272
$$ 147832655 155077416 162959954 171568573 180831202 190369349 200765502 211527091 223154363
14290B23154363J2130189J3239907J3450718J4278178J5346399J5523956J6360962
$$ 223154363 235284552 248524459 261975177 276253355 291599754 307123710 323484672
14283C23484672J6264738J7235714J7702961J6821397J6884471J5899735J5212933
$$ 323484672 339749410 356985124 374688085 391509482 408393953 424293688 439506621
14276D39506621J4074599J2311479J0049508O555801J421457r56469k812770j726508
$$ 439506621 453581220 465892699 475942207 482498008 483919465 482962996 480150226 478423718
14268D78423718l514401p618260q306434j0295305j1467658j2253231j3053286
$$ 478423718 474909317 467291057 458984623 448689318 437221660 424968429 411915143
14261D11915143j5664672j7228900j7813792j6939450j6954205j6489093j4993291
$$ 411915143 396250471 379021571 361207779 344268329 327314124 310825031 295831740
14254B95831740j5309534j4667612j3675898j3320006j2438896j1799324j1091357
$$ 295831740 280522206 265854594 252178696 238858690 226419794 214620470 203529113
14247B03529113j0561900r711186r145824q399123q302441p554296p092010p338684
$$ 203529113 192967213 183256027 174110203 165711080 157408639 149854343 142762333 135423649
14239A35423649n987579n698359n586386n291677n135908m771512m361476m201417
$$ 135423649 129436070 123737711 118151325 112859648 107723740 102952228 98590752 94389335
14231I4389335l344294l826450l727662l328847l009557k876746l203706k216390
$$ 94389335 91045041 87218591 83490929 80162082 77152525 74275779 71072073 68855683
14223F8855683k883593k195775k044140k060071k123910k050652j621194k083230
$$ 68855683 65972090 63776315 61732175 59672104 57548194 55497542 53876348 51793118
14215E1793118j957776r91759r02770k066279j506326j494583j291652j073877
$$ 51793118 49835342 48843583 47940813 45874534 44368208 42873625 41581973 40508096
14207D0508096j92875j762922j065111j451910j029247j356255m45910n21405
$$ 40508096 40315221 38552299 37487188 36035278 35006031 33649776 33203866 32682461
14199C2682461r96631j291507m85022j252932m90657o30593o89790p55121k59817
$$ 32682461 31685830 30394323 29909301 28656369 28165712 27535119 26845329 26090208 25830391
14190B5830391n29936j002318q50123k90695n73415r01228n75522J3636m31898
$$ 25830391 25300455 24298137 23448014 23157319 22583904 21682676 21107154 21120790 20688892
14181B0688892l71840m22113o70204o66846j59576k14938j43095p24624n66875
$$ 20688892 20317052 19894939 19224735 18557889 18398313 18183375 18040280 17315656 16748781
14172A6748781r9368o49611j7992l56278k97243j50692l59501M136p48918K7270
$$ 16748781 16649413 15999802 15981810 15625532 15328289 15177597 14818096 14822232 14073314 14100584
14162A4100584k87850q2729m13958k66938J41745o51366N2994k62749q3354j22227
$$ 14100584 13812734 13730005 13316047 13049109 13190854 12539488 12592482 12329733 12246379 12124152
14152A2124152l70430k75140R9567l17729N903m08599k52625K28212m11939n0122
$$ 12124152 11753722 11478582 11578149 11260420 11266323 10857724 10605099 10833311 10421372 10371250
14142A0371250j43133j99627R5793o05971K47200l15777m16528p0716J61293n8874
$$ 10371250 10228117 10028490 10124283 9518312 9765512 9449735 9033207 8962491 9123784 9064910
14132I064910l49537P2435J5694j93847j14742p00543K34886j48924p8266l75712
$$ 9064910 8715373 8787808 8803502 8609655 8494913 7794370 8029256 7880332 7802066 7426354
14122G426354J35852k09559N8959o3868k31111m92294L12286J24908p5080l02902
$$ 7426354 7562206 7352647 7411606 7347738 7116627 6624333 6936619 7061527 6986447 6683545
14112F683545j16597J58264l48042O3605j43429o8204K5652J87976l78907q5137
$$ 6683545 6566948 6725212 6377170 6440775 6297346 6229142 6254794 6442770 6063863 5978726
14102E978726K02081k65839m05892L67979m53531J28181K09650l84600N7019m5997
$$ 5978726 6180807 5914968 5509076 5877055 5423524 5551705 5761355 5376755 5433774 5387777
14092E387777n315K42847l54174r1269J07585j62257k06101m72657J66347O9217
$$ 5387777 5382462 5625309 5271135 5179866 5287451 5125194 4919093 4446436 4612783 4682000
14082D682000J05434l06986K73736J22256m62641L98289l71946l4293l28565J68185
$$ 4682000 4787434 4480448 4754184 4876440 4413799 4812088 4440142 4405849 4077284 4245469
14072D245469N6673o554j94036r2452N9170j4312L45909m18785r2230r7663N07597
$$ 4245469 4302142 4295588 4101552 4009100 4068270 4053958 4399867 3981082 3888852 3791189 4298786
14061D298786m03136M9809J86791j92115J80274j74838j86017p2143l0691m39369
$$ 4298786 3895650 3945459 4132250 3940135 4120409 3945571 3759554 3687411 3656720 3217351
14051C217351K71560q7017J19807J42520l1545j60842k04290k61045L12710K2409
$$ 3217351 3488911 3401894 3521701 3664221 3632676 3471834 3267544 3006499 3319209 3341618
14041C341618j75105m5243o2090P7798r7891j24421J92320N6784k44641Q7743
$$ 3341618 3166513 3121270 3059180 3136978 3039087 2914666 3106986 3163770 2919129 3006872
14031C006872j65008L5497l34305J61547N6712J01296l875l46049N2725J23783
$$ 3006872 2841864 2877361 2543056 2704603 2761315 2862611 2858736 2512687 2565412 2689195
14021B689195k25205M1623J62923M9652j84956M1614L3902k80999N8788Q1866
$$ 2689195 2463990 2505613 2668536 2718188 2533232 2574846 2608748 2327749 2386537 2468403
14011B468403J29461k05861o4444l25363L23590l25439J79758k90096P6769j1668
$$ 2468403 2597864 2392003 2327559 2002196 2325786 2000347 2180105 1890009 1966778 1955110
14001A955110M55644l52224N79294l93028M8153j6924k1603m51179j06182M37038
$$ 1955110 2410754 2058530 2637824 2244796 2292949 2276025 2254422 1803243 1697061 2134099
13991B134099l09298N42849M91634K613339O792166J9867303J6797164k3046935
$$ 2134099 1824801 2367650 2859284 5472623 12264789 32132092 48929256 25882321
13983B5882321j2909565m304516k605527j384748n23059k70536p12836j52420
$$ 25882321 12972756 8668240 6062713 4677965 4154906 3884370 3171534 3019114
13975C019114k44652K00783n1803m26127j11823L30689l24344J94563j91092j56451
$$ 3019114 2774462 2975245 2923442 2497315 2385492 2716181 2391837 2586400 2395308 2238857
13965B238857j62774J2768P4074n784L56437j86165m93770Q2077k03808K53331
$$ 2238857 2076083 2088851 2162925 2157141 2513578 2327413 1833643 1915720 1711912 1965243
13955A965243j2267J5317K47575n19709j5703L49881l99297J94660j36300M5012
$$ 1965243 1952976 1968293 2215868 1696159 1680456 2030337 1631040 1825700 1689400 1734412
13945A734412o0261k72662L81283J34132o89979N63139m81293N20386o42220O82153
$$ 1734412 1674151 1401489 1782772 1916904 1226925 1790064 1308771 1829157 1186937 1869090
13935A869090k83988K54758k45634L0484J1792K36504l77605J6178K04870n3408
$$ 1869090 1585102 1839860 1594226 1624710 1636502 1873006 1495401 1511579 1716449 1663041
13925A663041Q2900k43787L5089r5763J78408l94956L02069j44477J37199k09553
$$ 1663041 1745941 1502154 1537243 1441480 1619888 1224932 1527001 1382524 1519723 1310170
13915A310170J62406p5069J35129r2577o7423N34790m94664J5760j60091O6635
$$ 1310170 1472576 1397507 1532636 1440059 1372636 1907426 1412762 1428522 1268431 1335066
13905A335066M7052L03913l42557p4448J56952k11252J07627K5496j36440k70679
$$ 1335066 1382118 1686031 1343474 1269026 1425978 1214726 1322353 1347849 1211409 940730
13895I40730L05830j58530Q7281p9354R2270L0118J01365l48778j21499O21448
$$ 940730 1246560 1088030 1175311 1095957 1188227 1218345 1319710 970932 849433 1470881
13885A470881p20758N63086L51585o16056J40052q8532R8799r2254P7206K0604
$$ 1470881 750123 1313209 1664794 1048738 1188790 1100258 1199057 1106803 1184009 1204613
13875A204613l1590K01306k55564K01396n6895j12120k38190L83491l81638L3826
$$ 1204613 1173023 1374329 1118765 1320161 1263266 1151146 912956 1296447 914809 948635
13865I48635N9924l73539N86744j38019J49747l80077j186N41272k19577l4838
$$ 948635 1008559 635020 1221764 1083745 1233492 853415 852229 1393501 1173924 1139086
13855A139086K12811k33785q2023J66956k90259J66260m0228Q681p5737j5565
$$ 1139086 1351897 1118112 1036089 1203045 912786 1079046 1038818 1047499 971762 956197
13845I56197l29445O264M26698l35856M50389l57807k26285N17790l01097J67850
$$ 956197 626752 633016 1059714 723858 1174247 816440 590155 1107945 806848 974698
13835I74698l4284o3586N4644J4735J86497l00467J63531J45975l72027l24920
$$ 974698 940414 876828 931472 946207 1132704 832237 995768 1141743 769716 444796
13825D44796Q82572n96527K72173l25800J71651k04869l16617O13801N1146k90005
$$ 444796 1327368 730841 1003014 677214 848865 643996 327379 941180 992326 702321
13815G02321n9106L33912L1512l30158L7701J88647R4880l19280P5526Q5458O2316
$$ 702321 643215 977127 1008639 678481 716182 904829 999709 680429 755955 841413 903729
13804I03729k28509J59881l6964O0915J12693D52148M05112r7335L07896k28238
$$ 903729 675220 835101 798137 859052 971745 452148 857260 759925 1067821 839583
13794H39583l1015q4166K5367m3088J10554o491j9355k9991j90506O3413K99409
$$ 839583 808568 724402 749769 706681 817235 810744 791389 761398 570892 634305 933714
13783I33714l48578Q6546K59802k57633O9678k86163L50049k40756m7864J7316
$$ 933714 585136 671682 931484 673851 743529 457366 807415 566659 518795 536111
13773E36111K79418k04542j0810j89875N67230l92917J95501B91440K41522p3112
$$ 536111 815529 610987 600177 410302 977532 584615 780116 291440 532962 459850
13763D59850J50138J29709k6491K94080B40576J30875N10389j59818o6776q976
$$ 459850 609988 739697 713206 1007286 240576 371451 881840 722022 655246 646270
13753F46270o7508J4262K2370r2380J81416j76312p5632K77553p6876M05452m72472
$$ 646270 578762 593024 615394 523014 704430 528118 452486 730039 653163 1058615 586143
13742E86143J8987p2900l9792Q0142k34424M47048j11197A53593J96998j48466
$$ 586143 605130 532230 492438 572580 338156 785204 674007 153593 350591 202125
13732B02125P7395M40461j50501j37121p070J00438j989r712j03910J62842j9745
$$ 202125 279520 719981 569480 432359 425289 525727 523738 514026 410116 572958 553213
13721E53213K50682C14102K27971j14553N0795l7331Q9982P028J98997j64985
$$ 553213 803895 314102 542073 427520 478315 440984 530966 537994 736991 572006
13711E72006P4731k77687J88822O7805k57465L4667K33327j19309j06426J75325
$$ 572006 646737 369050 557872 625677 368212 402879 636206 516897 410471 585796
13701E85796m3938l5161j38068J1336j70152K03221J67953m1440A36857J92391
$$ 585796 541858 506697 368629 379965 209813 413034 580987 539547 136857 329248
13691C29248K71576j54005j31777F3765M75144p3150j38377K60793j74993O9852
$$ 329248 600824 446819 315042 63765 538909 465759 327382 588175 413182 483034
13681D83034j78209L08285j49828k26817J11981L60492n846j36278A70424M31782
$$ 483034 304825 613110 463282 236465 348446 708938 703092 566814 170424 602206
13671F02206J36513l67971K21859n4713O7429B28124J68887J8088K85530j87484
$$ 602206 738719 370748 592607 537894 605323 228124 397011 415099 700629 513145
13661E13145O2318k75314K06711L6932k01888J339J78958B15341M94935B88150
$$ 513145 575463 300149 506860 543792 341904 343243 522201 215341 710276 288150
13650C66915j68833K34153k10638K58864J50486C12179M07465B18678J64631j27643
$$ 366915 198082 432235 221597 480461 630947 312179 719644 218678 383309 255666
13640B55666L27545j8750k80621J39085j71636J75194a11586B37944K84306b4266
$$ 255666 583211 564461 283840 422925 251289 426483 -111586 237944 522250 -24266
13629B78039J38564j764K3666B15183n5253K03056J3253A08757N49072B64089
$$ 278039 416603 414839 438505 215183 159930 362986 376239 108757 657829 264089
13618A86357J40862K89473R9884B62298B7412M16594O8408j33562L5103k5731
$$ 186357 327219 616692 716576 262298 27412 444006 512414 378852 413955 388224
13608C88224K3276j08333J56156p0420m3311j3037A53505K52927l7625P860o9992
$$ 388224 411500 303167 459323 388903 345592 332555 153505 406432 368807 376667 306675
13597C06675A50964M65136j6609q6430j21654l2754j29758r4667M06540j68863
$$ 306675 150964 616100 599491 513061 391407 358653 228895 134228 540768 371905
13587C71905j42795L762H2968K12896J17370o7574j36091K51926J8121H7747J58240
$$ 371905 229110 232872 82968 295864 413234 345660 209569 461495 479616 87747 245987
13576B45987J1300A8638K69419l0971l0845K99539j76437q5603J14457p199B8579
$$ 245987 257287 18638 288057 257086 226241 525780 349343 263740 378197 370998 28579
13564G68306h6074D41168o7704l0769K4652K60124B33726R5263J08855o2703k856
$$ 768306 -86074 441168 373464 342695 367347 627471 233726 328989 437844 375141 372285
13553C72285K03910j74919G9636J62073Q6881j62621J554M53094B92617j21380
$$ 372285 576195 401276 79636 241709 328590 165969 167523 620617 292617 171237
13543A71237M79000k52341H9727h714B57283n8980a63288C28177o3873K75082
$$ 171237 650237 397896 89727 -8714 257283 198303 -163288 328177 264304 539386
13533E39386B03594K64455A18306K31129r0921R8837J21941m6321A61504L2119
$$ 539386 203594 468049 118306 349435 258514 357351 479292 432971 161504 193623
13523A93623O8661O6803j16885O880J89124j43662R2635L8277J98468k03291A25154
$$ 193623 262284 329087 212202 219082 408206 264544 357179 395456 593924 390633 125154
13511E79824k50064m8307j417G8289K84494J94186m6093j39096A38163J7812p6160
$$ 579824 329760 281453 280036 78289 362783 556969 510876 371780 138163 155975 79815
13500G9815M17765B06021J67106l6239k4394a76740D05699j18603L8098j16710
$$ 79815 497580 206021 373127 336888 312494 -176740 405699 287096 325194 208484
13490B08484R7565C8043f7214C77110n3121A35642J38559A16259k0786K23206
$$ 208484 306049 38043 -67214 377110 323989 135642 274201 116259 95473 318679
13480C18679J09695a31086E45998A41568L0493K8456Q8731b68887D78760K8956
$$ 318679 428374 -131086 545998 141568 172061 200517 289248 -268887 478760 507716
13470E07716B21295P9028p5914j0788J66281j49000N0963E9363M31459A87160
$$ 507716 221295 300323 224409 213621 379902 230902 281865 59363 490822 187160
13459B13664M8013I3492C8206j688J95649K01023j62856I8596M04236n8165B1594
$$ 213664 261677 93492 38206 36518 232167 433190 270334 98596 502832 444667 21594
13447E5364J58157L42120j64908E6644f2488A48055F4198K15505q3357K13921
$$ 55364 213521 555641 390733 56644 -62488 148055 64198 279703 196346 410267
13437D10267j97374J78368K6838A5587R5054K03669e9526A24735J41970j5745
$$ 410267 212893 391261 418099 15587 110641 314310 -59526 124735 266705 250960
13427B50960L0836A4184M90009j24311G5102c5658D48666G1030a37124C97230
$$ 250960 281796 14184 504193 379882 75102 -35658 448666 71030 -137124 397230
13416C59760k1369P196j49664K5141i8o8145A05041J644B2429O3338b0307D28053
$$ 359760 338391 345587 195923 221064 -98 -68243 105041 106685 22429 85767 -20307 428053
13403A66471K61503j752A67624n106L009j8604L35779j07221A61016A6816J95685
$$ 166471 427974 426222 167624 162518 165527 146923 482702 375481 161016 16816 212501
13392B12501l6002P03a45003A77317O3803r4383m0660h6708D97825a2663B94255
$$ 212501 176499 177202 -145003 177317 241120 146737 106077 -86708 497825 -12663 294255
13380B92892A38887O2127C2025M66582j0318K3205D7445a2410m0238C57852L00920
$$ 292892 138887 201014 32025 498607 488289 511494 47445 -12410 -52648 357852 658772
13369F58772B61036D5227b0565B44502J01680b288B07318J31944J09007f0581
$$ 658772 261036 45227 -20565 244502 346182 -2288 207318 339262 448269 -60581
13358a75518C23087A09172K22243A38382M6684K02815J15418c8975O635A86304
$$ -175518 323087 109172 331415 138382 185066 387881 503299 -38975 -32340 186304
13347E1598b3419B36784R3195K98300N8897C42218H1058M69004A50190K0105R3860
$$ 51598 -23419 236784 329979 628279 687176 342218 81058 550062 150190 170295 264155
13336B64155J04013A68278p928J00801A8592J01861f878A9260K20151J72015j31389
$$ 264155 368168 168278 160350 261151 18592 120453 -6878 19260 239411 411426 280037
13325B80037N4746J24709I1130B0765i0444k8053M6297C95692a25411A94337p6453
$$ 280037 334783 459492 91130 20765 -90444 -118497 -72200 395692 -125411 194337 117884
13314A17884d9300C95369j91498E9084J06854P6536r2693K1102J10431n7092L335
$$ 117884 -49300 395369 203871 59084 165938 242474 149781 170883 281314 224222 227557
13303B27557J29628a3764A33731a53384D94141a8378A37228K07457A62187A269
$$ 227557 357185 -13764 133731 -153384 494141 -18378 137228 344685 162187 1269
13292B11739l9457m8213K34607a05781j50873C56322D6813L2741L6956J0726h5635
$$ 211739 172282 124069 358676 -105781 -256654 356322 46813 79554 116510 127236 -85635
13280C09776q2542J20913A56472R1483g3873A64497a54535A61877F7734M5932
$$ 309776 227234 348147 156472 247955 -73873 164497 -154535 161877 67734 113666
13270A13666M4457a15010l3372A75916o2711a98684M3586j44123D36498E579J88510
$$ 113666 158123 -115010 -148382 175916 113205 -198684 -155098 -299221 436498 5579 194089
13259A94089r5652K85435I6505K01975a72282C94517b9760C39273j42205a18012
$$ 194089 98437 383872 96505 298480 -172282 394517 -29760 339273 197068 -118012
13248A3653K38025K38951H4988J80416A15825B2837i3064K7596m2390d3385A49327
$$ 13653 251678 490629 84988 265404 115825 22837 -93064 -65468 -107858 -43385 149327
13236A420a266A5687J63521M3541a06561B30189E821K71616d5717E8533i1871
$$ 1420 -1266 15687 179208 222749 -106561 230189 5821 277437 -45717 58533 -91871
13224a49347B3671K7727K79327C3414a03120C06849A24672a80327C77054m3831
$$ -149347 23671 51398 330725 33414 -103120 306849 124672 -180327 377054 333223
13214C33223c1882B473K38596e7822D3594a90077i625j70154B1096J97425k6482
$$ 333223 -31882 2473 241069 -57822 43594 -190077 -9625 -179779 21096 218521 192039
13203A92039b38281F2474a32283D5670L1421K43588b55995E7750R905C2522a85696
$$ 192039 -238281 62474 -132283 45670 77091 320679 -255995 57750 67655 32522 -185696
13191a19773C60089i50A23653b61714C9242h4384H6213b36648e531H6031J17404
$$ -119773 360089 -950 123653 -261714 39242 -84384 86213 -236648 -5531 86031 203435
13180B03435b73975C04909A09753J13912R5521j02453e2863A51575J38103a33093
$$ 203435 -273975 304909 109753 223665 319186 216733 -52863 151575 289678 -133093
13169A21278P9677n7810K8058b86277A88263h6065B42811a6386e484k0068j35335
$$ 121278 200955 143145 171203 -286277 188263 -86065 242811 -16386 -5484 -25552 -160887
13158a60887B24926J24299I0600K9494d7963B62905F1655J36037h3539A73553
$$ -160887 224926 349225 90600 120094 -47963 262905 61655 197692 -83539 173553
13147i270j53994A9745K55596a9999p7018B02477k1616J18824r9478d572A43638
$$ -9270 -163264 19745 275341 -19999 -97017 202477 180861 299685 200207 -4572 143638
13135B85744A08614h7781f53C24115a6729q6411K2839G8448k3842J70743j07428
$$ 285744 108614 -87781 -653 324115 -16729 -103140 -80301 78448 54606 225349 117921
13124A17921a30242C25544j43505J17483q8903q7969c1836C3570M51550A22376
$$ 117921 -130242 325544 182039 299522 210619 122650 -31836 33570 485120 122376
13113a88679m2208K9659A13614K25091G4588c30888A19450k9671J69941b1131
$$ -188679 -230887 -201228 113614 338705 74588 -330888 119450 89779 259720 -21131
13102A07866J86484I6400P0889a8888A06648J60148J41410j78587L3042F2638
$$ 107866 294350 96400 167289 -18888 106648 266796 408206 229619 262661 62638
13091h4649C69571B7567L79847A57902q191n4930J06477j0572E6955i76A63505
$$ -84649 369571 27567 407414 157902 149711 94781 201258 190686 56955 -976 163505
13079A85645e0885C50113p0673j826J20300f3463A82061F0077J24131K1934M2576
$$ 185645 -50885 350113 279440 277614 397914 -63463 182061 60077 184208 206142 248718
13068B48718l1324i8195B32690b8123A58873c46153G0579J52417J11414O661b4049
$$ 248718 217394 -98195 232690 -28123 158873 -346153 70579 222996 334410 341071 -24049
13056c08610C36203D0759a46269A4865a2130N029H9219j013e695A23632C8478
$$ -308610 336203 40759 -146269 14865 -12130 -7101 89219 88206 -5695 123632 38478
13044e5307B02904O0584a02293q5314a1507A82855J79243p4502G7917J53658f0634
$$ -55307 202904 263488 -102293 -187607 -11507 182855 362098 287596 77917 231575 -60634
13032b13051A04528K62839b8128j64226B89624l9338O0332q0951b57599C10283
$$ -213051 104528 367367 -28128 -192354 289624 250286 310618 229667 -257599 310283
13021B54099B4065J91269n0376c29256j11536A43445b20395C13735G5962J05550
$$ 254099 24065 215334 164958 -329256 -440792 143445 -220395 313735 75962 181512
13011A81512b1900I5099n149J14543N6512J21872j63637G372J76308l0277e0689
$$ 181512 -21900 95099 89950 204493 261005 382877 219240 7372 183680 153403 -50689
12999A75140H5237a80936l3886H3526B8039c55205J61638C54605g3512A30054
$$ 175140 85237 -180936 -214822 83526 28039 -355205 -193567 354605 -73512 130054
12988A17639a11031C48868I2094a2425B60931A12461J63214a70621A38833N1190
$$ 117639 -111031 348868 92094 -12425 260931 112461 275675 -170621 138833 190023
12978A90023Q2290a59120h673A79147F2736J5855a01407n6364A41884a13936o340
$$ 190023 272313 -159120 -8673 179147 62736 78591 -101407 -157771 141884 -113936 -120276
12967a20276L3800A52235D5790N1372r410b4548j42385B38290m5461F5119b4433
$$ -120276 -86476 152235 45790 97162 87752 -24548 -166933 238290 192829 65119 -24433
12955B78611b42624K4720N6206A71767g71l0503B40012d7430E1756A3473K50976
$$ 278611 -242624 -217904 -161698 171767 -771 -31274 240012 -47430 51756 13473 264449
12944B64449D0830a13444b9484B87435e255A50617C943J34892b75333C39645a35114
$$ 264449 40830 -113444 -29484 287435 -5255 150617 3943 138835 -275333 339645 -135114
12932D34512o5079a77330h5376C19563j5889j2826f9768A68333e7740H0715L8431
$$ 434512 369433 -177330 -85376 319563 303674 290848 -69768 168333 -57740 80715 119146
12921A19146D3510B0723K57895a45717B58569d3170A04570m4165N7125O6066b47937
$$ 119146 43510 20723 278618 -145717 258569 -43170 104570 60405 117530 183596 -247937
12909C75816b7856A66827a98408c4420a3501j9780a10C3714M7748M7683J67569
$$ 375816 -27856 166827 -198408 -34420 -13501 -33281 -110 33714 81462 129145 296714
12898B96714E2711j995I434J61625C9472D084J49411o4712c22388B2857O2816
$$ 296714 52711 50716 9434 171059 39472 4084 153495 88783 -322388 22857 85673
12887H5673e1962A52274L62406b4955C74076d2723A80850k2561o3747e3078p6204
$$ 85673 -51962 152274 514680 -24955 374076 -42723 180850 158289 94542 -53078 -129282
12876a29282J8117I8789N2138D6342k0858b99762A78955b29197j70656A2649L94435
$$ -129282 -111165 98789 150927 46342 25484 -299762 178955 -229197 -399853 12649 407084
12865D07084b18331G6903b17222A07873a38395j20101A51577r442a74320g1708
$$ 407084 -218331 76903 -217222 107873 -138395 -258496 151577 142135 -174320 -71708
12854e65623D2819c36034a09177B30448C4522b59145J22789A83997G490i7264
$$ -565623 42819 -336034 -109177 230448 34522 -259145 -136356 183997 7490 -97264
12843C48564c40497B5630o243a18416A09893D9422e7076q2145B00114p9420j9446
$$ 348564 -340497 25630 19387 -118416 109893 49422 -57076 -139221 200114 120694 101248
12832A01248d8514B05894B2487a00820A00133C0461K9782O3361i2441r9375B73864
$$ 101248 -48514 205894 22487 -100820 100133 30461 60243 123604 -92441 -191816 273864
12820a37140A17150D9264J48502a8903B72795J55905A05609J64211p5685C16M6976
$$ -137140 117150 49264 197766 -18903 272795 428700 105609 269820 194135 316 47292
12809D7292B2548b93049A69877C311J43420R4554c93938a6502I9757J94672A24337
$$ 47292 22548 -293049 169877 3311 146731 241285 -393938 -16502 99757 294429 124337
12797A34396b7051k8583b6606j74734e4797p929A25671a64472B55336c67803a82990
$$ 134396 -27051 -55634 -26606 -201340 -54797 -62726 125671 -164472 255336 -367803 -182990
12785g9884B58331A08640b47797A88671J41197g8587o8379A66423b57001C5308
$$ -79884 258331 108640 -247797 188671 329868 -78587 -146966 166423 -257001 35308
12774C29414d38401D01793d9883j29797A66435a48845l7737C13129J4259G9499
$$ 329414 -438401 401793 -49883 -179680 166435 -148845 -186582 313129 327388 79499
12763a02823A77896i9895B89925I0716l5108B5185L5118k8999q90e0573I3948
$$ -102823 177896 -99895 289925 90716 55608 25185 60303 31304 30414 -50573 93948
12751a54686P322e5654l6450B48804a80077A81479J2674c6974A2367K02705b64233
$$ -154686 -147364 -55654 -92104 248804 -180077 181479 194153 -36974 12367 215072 -264233
12739B01576b73632C4539K31398a37990B75555g3761A02554M01504j95218a56440
$$ 201576 -273632 34539 265937 -137990 275555 -73761 102554 504058 308840 -156440
12728a96356b5136A6583b2289k92346A07288l0806J48630g6614A52260b48707
$$ -196356 -25136 16583 -22289 -314635 107288 76482 225112 -76614 152260 -248707
12717H9788A7866K66478b76435a31184K9261d9133D41389B19588f0345J0991J0382
$$ 89788 17866 284344 -276435 -131184 -101923 -49133 441389 219588 -60345 -49354 -38972
12706c8972A64329J89514A5720b1916p1804A124J51574J92793C9386J01383K29421
$$ -38972 164329 353843 15720 -21916 -93720 1124 152698 345491 39386 140769 370190
12695C70190A60885e1867C1050a44869a7436A04238J71293A34945J34378k5392
$$ 370190 160885 -51867 31050 -144869 -17436 104238 275531 134945 269323 243931
12685B43931j21160K8729E2073O1083J3804J62191R2217j66528k5385b40835K7750
$$ 243931 122771 151500 52073 113156 126960 289151 381368 214840 189455 -240835 -213085
12674b13085A42922o9011f4032j72202q8086c4470D09111h2649l7298e5587C0241
$$ -213085 142922 73911 -64032 -236234 -324320 -34470 409111 -82649 -119947 -55587 30241
12662C96463M2872B00826l2744A804J39698J14392H0581J43720r1375K27881b8088
$$ 396463 439335 200826 168082 1804 141502 255894 80581 224301 132926 360807 -28088
12650C28558f8583C52003a19654A74934J838a60113E2237a43576H1497a89009
$$ 328558 -68583 352003 -119654 174934 176772 -160113 52237 -143576 81497 -189009
12639g2035A16809J55297E2021J34118f2354A2170d16C56020A50045J94860h9620
$$ -72035 116809 272106 52021 186139 -62354 12170 -416 356020 150045 344905 -89620
12627A46152L80765d9B06133b633H8804k8581B4598L41180h5645G6064L3363c2729
$$ 146152 526917 -49 206133 -2633 88804 60223 24598 365778 -85645 76064 109427 -32729
12614B57693a57082B65411a69973D7059L73291a08425A18428d021k85463B244
$$ 257693 -157082 265411 -169973 47059 420350 -108425 118428 -4021 -289484 2244
12603A44976a57369H6061K63756b7430A54058i0652k1332i045l4637I3159J07296
$$ 144976 -157369 86061 349817 -27430 154058 -90652 -111984 -9045 -43682 93159 200455
12592B00455I5332b1207A66457E6075J7660a62585H7242e761l0020j73233i8678
$$ 200455 95332 -21207 166457 56075 73735 -162585 87242 -5761 -35781 -209014 -98678
12580b7782p7161A63814m1333b10861C30602d4718A89754C7812K54073h3714A33683
$$ -27782 -104943 163814 122481 -210861 330602 -44718 189754 37812 291885 -83714 133683
12568C26290c9792A19441c27286a43749C5381e6681k5657C023K26896r2661D8013
$$ 326290 -39792 119441 -327286 -143749 35381 -56681 -82338 3023 229919 137258 48013
12556D7991j5134a04645k62150A14546g4283J5553l4015l79153a61646e5773k07889
$$ 47991 32857 -104645 -366795 114546 -74283 -58730 -92745 -471898 -161646 -55773 -263662
12545b63662C01282e4908b1396k61703C21132B0141J36676Q6423b36063k4590
$$ -263662 301282 -54908 -21396 -283099 321132 20141 156817 243240 -236063 -260653
12535b60653a25203F0808a01704A04566a28797A15113l7523O2803a23112A06371
$$ -260653 -125203 60808 -101704 104566 -128797 115113 77590 140393 -123112 106371
12524d8381A8292b51278A26497a56249C05353f3618C33653c07819M8880A24031
$$ -48381 18292 -251278 126497 -156249 305353 -63618 333653 -307819 -258939 124031
12513A47817q095f0203j18020C39720a77256C9964b75768A74030c06333J29974
$$ 147817 139722 -60203 -178223 339720 -177256 39964 -275768 174030 -306333 -176359
12503a76359D61651A42216a03609j10749A98441F4835B2218e2544m0978B61841
$$ -176359 461651 142216 -103609 -214358 198441 64835 22218 -52544 -93522 261841
12492D965a1704D5540a86256m5124a9418o1649A07215j3764D4720A4923a5100
$$ 4965 -11704 45540 -186256 -231380 -19418 -81067 107215 93451 44720 14923 -15100
12480C676J43967f1641k261k23499a41489J7472A90701d130A04771J4494h7367
$$ 3676 147643 -61641 -63902 -287401 -141489 -124017 190701 -4130 104771 119265 -87367
12468b88622d5578l5416c9393A45229r815D2824a51354a3879j03842I6349h8337
$$ -288622 -45578 -80994 -39393 145229 135414 42824 -151354 -13879 -117721 96349 -88337
12456b7225F4030a22131j30751Q4883G902J21766a89235B29507k0154q2212A573
$$ -27225 64030 -122131 -252882 -167999 7902 129668 -189235 229507 209353 127141 1573
12444b9651B21111f3997A67175P6724q0436d905j08719B51734a9227A82188c31847
$$ -29651 221111 -63997 167175 243899 163463 -4905 -113624 251734 -19227 182188 -331847
12432A55173h2246A03099J48724r6456D4405a05689j16126C3333Q4218e0928o805
$$ 155173 -82246 103099 251823 155367 44405 -105689 -221815 33333 117551 -50928 -57733
12421e7733j00668A98499k8876F448a51305D20938A65104c14607D2554p753c09321
$$ -57733 -158401 198499 169623 6448 -151305 420938 165104 -314607 42554 34801 -309321
12409g9491q7783j8023F29a15041L7011K7580A02268J11381f9262B27068k5454
$$ -79491 -167274 -185297 629 -115041 -78030 -50450 102268 213649 -69262 227068 201614
12398B01614J40806F5593b00842A84539K0353H0943K05121b22418a04448o4409
$$ 201614 342420 65593 -200842 184539 204892 80943 286064 -222418 -104448 -168857
12388a68857D0925b71566h6248K043C29403b67561J31455j10321D6999Q8067c1394
$$ -168857 40925 -271566 -86248 -84205 329403 -267561 -136106 -246427 46999 135066 -31394
12376A91933J19199a07983j44029N7584r5695A85843i0601A59996m1559J16048
$$ 191933 311132 -107983 -252012 -194428 -290123 185843 -90601 159996 118437 234485
12366B34485b2099j87467J0407D4292J35796d27524H6183l0311C906a5405F0415
$$ 234485 -22099 -209566 -199159 44292 180088 -427524 86183 55872 3906 -15405 60415
12354f7508r8272C14618a91901E6610a15470n3184O1845N0073B28953i7179k01407
$$ -67508 -165780 314618 -191901 56610 -115470 -168654 -106809 -56736 228953 -97179 -298586
12343b98586i798B4222g9613k89073I0332b6245j02346E5037K9082a67015M3039
$$ -298586 -9798 24222 -79613 -368686 90332 -26245 -128591 55037 84119 -167015 -123976
12332a23976C00229A47300a5118c302C49441j41055p965f8259B41805E2283K9942
$$ -123976 300229 147300 -15118 -3302 349441 208386 200421 -68259 241805 52283 82225
12321H2225J24271a05134G3419L36447b3528r0287K8729I4798N4719L780b1989
$$ 82225 206496 -105134 73419 409866 -23528 -113815 -85086 94798 149517 153297 -21989
12309B91571a98489a1722N89E876J18918i8531c234B92156b1966H0943J67128
$$ 291571 -198489 -11722 -11133 5876 124794 -98531 -3234 292156 -21966 80943 248071
12298B48071a82721C1264J95001C5519J16506a63575E9600i9015l18119B5550
$$ 248071 -182721 31264 226265 35519 152025 -163575 59600 -99015 -417134 25550
12287i1476G9233Q0943D6494J43314e4473B2029a31589b2367B9721L23964e0378
$$ -91476 79233 160176 46494 189808 -54473 22029 -131589 -22367 29721 353685 -50378
12275A19953J91623a05478I7859L44882d1336A27130e6415k07256h7126b4873
$$ 119953 311576 -105478 97859 442741 -41336 127130 -56415 -263671 -87126 -24873
12264A24094J69381G0023J32210n1671D1239b63102B7740L48917H4958B6135J33475
$$ 124094 293475 70023 202233 150562 41239 -263102 27740 376657 84958 26135 159610
12253A59610a79676A70980J83027c44969c9226C68882J02372g6158B5318K62510
$$ 159610 -179676 170980 354007 -344969 -39226 368882 471254 -76158 25318 287828
12243B87828d2678B94676j06519J27177b5897D05198a46610A87997Q9293a73534
$$ 287828 -42678 294676 188157 315334 -25897 405198 -146610 187997 277290 -173534
12232A81525l7818J09848e8529E56162A14967C8998M35479d0735A18614L75045
$$ 181525 143707 253555 -58529 556162 114967 38998 474477 -40735 118614 493659
12222D93659g0995B82214r1553Q7223R5716j84094K28010F1496J11202b10102
$$ 493659 -70995 282214 190661 277884 373600 189506 417516 61496 172698 -210102
12211A5470R6380c4968a2440j09801H0967k8132b04129R3904D89272a79583B67992
$$ 15470 111850 -34968 -12440 -122241 80967 52835 -204129 -110225 489272 -179583 267992
12199D47625A46283F2223L6739Q9220n3057K75068F508L26096A12532N9199q4952
$$ 447625 146283 62223 98962 188182 135125 410193 6508 332604 112532 171731 86779
12188H6779a2376k74802R7824C10770d5169C79192A43825D284J0150K29008q4945
$$ 86779 -12376 -287178 -189354 310770 -45169 379192 143825 4284 14434 243442 158497
12177A58497g0231B08924j03343a20147A85997J76170D6314m762b27276I709a02023
$$ 158497 -70231 208924 105581 -120147 185997 362167 46314 41552 -227276 9709 -102023
12165C5424j3074J81099F1817O2133L79656A16954k5027a232k89286i1905B61615
$$ 35424 22350 203449 61817 123950 503606 116954 91927 -1232 -290518 -91905 261615
12153E0134L79512o3864a5606F4468a62430A86912r2549C0598K07989n801n8109
$$ 50134 429646 365782 -15606 64468 -162430 186912 94363 30598 238587 232786 174677
12142A74677o3189J12281o5555a81571A41948F8725a97360A41342a74011b2985
$$ 174677 111488 223769 158214 -181571 141948 68725 -197360 141342 -174011 -22985
12131A27607j7826K2787a75696r200D9401a48402j23558A80139q6438J06620G956
$$ 127607 109781 132568 -175696 -184896 49401 -148402 -271960 180139 93701 200321 7956
12119b78822H1027C4a57148l2995D4683K444K11994e7591I5915a6692C12286E8616
$$ -278822 81027 34 -157148 -190143 44683 47127 259121 -57591 95915 -16692 312286 58616
12106H282a76924A7916J93256r2508R0092d408C3451b52974J05875I0001b43654
$$ 8282 -176924 17916 211172 118664 208756 -4408 33451 -252974 -147099 90001 -243654
12094a67615b018p2423j05265D7213J58385C2387b94851A92484c11151A96728
$$ -167615 -2018 -74441 -179706 47213 205598 32387 -294851 192484 -311151 196728
12083A23204q587J0861J50048j8340M63538J413463p68929E26967D217K121d2393
$$ 123204 114617 125478 275526 257186 720724 2134187 1365258 526967 4217 6338 -42393
12071H6170f3586A50786h7303L3022j34145B15482b15965B1942b27073d3464B4496
$$ 86170 -63586 150786 -87303 -54281 -188426 215482 -215965 21942 -227073 -43464 24496
12059A76074a42383J5695d649j06338N0943A50944a03175j5284K1827b0080C7351
$$ 176074 -142383 -126688 -4649 -110987 -60044 150944 -103175 -118459 -96632 -20080 37351
12047c31729a15295j0176o8493A34932A9098R8062i7643k57102B10989p7500L595
$$ -331729 -115295 -125471 -193964 134932 19098 117160 -97643 -354745 210989 133489 137084
12036A37084a47900k3861I8334g5050k93096c5823H3067e8679B56812l8095c5166
$$ 137084 -147900 -171761 98334 -75050 -368146 -35823 83067 -58679 256812 218717 -35166
12024b06522c9702q5970B19601G6323K51854D2160b72974g285k10913A84901b64505
$$ -206522 -39702 -125672 219601 76323 328177 42160 -272974 -7285 -218198 184901 -264505
12012c17468E2497a3876q3167A29013n0123b4226A27318C0417a08864B51889k7570
$$ -317468 52497 -13876 -97043 129013 78890 -24226 127318 30417 -108864 251889 224319
12001B24319d1816D5624J28841J85202I6310a25627A01916n0830J93123A1204
$$ 224319 -41816 45624 174465 359667 96310 -125627 101916 51086 244209 11204
11990b8398A12724N5543C2289b14906f9166k2176k17488J30934k732N2172H7935
$$ -28398 112724 168267 32289 -214906 -69166 -91342 -308830 -177896 -180628 -128456 87935
11978c6633j12080k8808B42152b1677j76343b6047B53163o0113g1547k70500a64992
$$ -36633 -148713 -177521 242152 -21677 -198020 -26047 253163 193050 -71547 -342047 -164992
11966a00792j5457c9470j87587a12415b8705J1649k89371M567A9962a71975A9371
$$ -100792 -116249 -39470 -227057 -112415 -28705 -17056 -306427 -301860 19962 -171975 19371
11954i631j83135b7167B04609p5548g7314J1127E7267a90039A9756a00204A28975
$$ -9631 -192766 -27167 204609 129061 -77314 -66187 57267 -190039 19756 -100204 128975
11942c7647A71971N3125F6842e2301J7691j4919p3320k7707d8512A67804a03842
$$ -37647 171971 225096 66842 -52301 -34610 -49529 -122849 -150556 -48512 167804 -103842
11930A10051b46984a05279H9998D2119b7115D7120f4296k90253D3619e1438A51311
$$ 110051 -246984 -105279 89998 42119 -27115 47120 -64296 -354549 43619 -51438 151311
11918I4382Q1624N064O0561a48621m8739A36141d18014A71546a7315B3299b27862
$$ 94382 176006 181070 241631 -148621 -197360 136141 -418014 171546 -17315 23299 -227862
11906A04689A9761K16504b05160M9425M6960o7948B57134i9574m01250e8059A7509
$$ 104689 19761 236265 -205160 -155735 -108775 -176723 257134 -99574 -500824 -58059 17509
11894A44323a89920K1479D4742a35715k8378A62547J1139m9869e0432l05655C6960
$$ 144323 -189920 -168441 44742 -135715 -164093 162547 173686 123817 -50432 -356087 36960
11882A46829c67354c1775f040j19014A39085a0706A25546Q087B4549b36010L1314
$$ 146829 -367354 -31775 -6040 -125054 139085 -10706 125546 133633 24549 -236010 -204696
11871b04696L9733k26686A30401a37692M6421a6592n3064g3E6306L710h5525k26250
$$ -204696 -164963 -391649 130401 -137692 -91271 -16592 -69656 -73 56306 60016 -85525 -311775
11859c11775K9508E80502A71088a56684M2840j3962C09373H4127a39952A41279
$$ -311775 -282267 580502 171088 -156684 -113844 -127806 309373 84127 -139952 141279
11848c2898E6514c23224L9390o6897h4971p9768g5220a1431A05642f5696k07002
$$ -32898 56514 -323224 -283834 -350731 -84971 -164739 -75220 -11431 105642 -65696 -272698
11837b72698O5066D2775L9900a35028N0739G8672C6627c30523E1683K78985a20432
$$ -272698 -207632 42775 82675 -135028 -84289 78672 36627 -330523 51683 330668 -120432
11825i9604d9015k7547K0919D1443O5733L7377f1374p4369J0370j47702a28572
$$ -99604 -49015 -76562 -55643 41443 107176 144553 -61374 -135743 -125373 -273075 -128572
11813G3427j2109a99473i524B71013f9338a5264k05764p2780f3182j54965F5765
$$ 73427 61318 -199473 -9524 271013 -69338 -15264 -221028 -293808 -63182 -218147 65765
11801b30704L5013J4958g7077a7459B42509d39469A20354b4275B2990Q5692a14884
$$ -230704 -195691 -180733 -77077 -17459 242509 -439469 120354 -24275 22990 108682 -114884
11789a00201A11043J24757b16262A60729C3804R0385c34101i411k26008Q722B28645
$$ -100201 111043 235800 -216262 160729 33804 124189 -334101 -9411 -235419 -226697 228645
11777c99506b7609p0070c8715p4994l2092B6637d64056C05224j6009B4681a73936
$$ -399506 -27609 -97679 -38715 -113709 -145801 26637 -464056 305224 289215 24681 -173936
11765B12117G457R7572k4364a23746E5700M0352J31820E5975J22374R828a63205
$$ 212117 7457 105029 80665 -123746 55700 96052 227872 55975 178349 188177 -163205
11753g2529c2232B04768b04116C8716K5494R5147J03094o5010G7125N094M481
$$ -72529 -32232 204768 -204116 38716 64210 159357 262451 197441 77125 82219 86700
11742H6700J35385a65718P3400B37268c05249B33344b85334d3659A35676K08351
$$ 86700 222085 -165718 -92318 237268 -305249 233344 -285334 -43659 135676 344027
11732C44027f7268r9935B06595q7339m3803g9897j20550B43289b5957G6418k9047
$$ 344027 -67268 -167203 206595 119256 75453 -79897 -200447 243289 -25957 76418 47371
11721D7371i7228c9462j20110a3283m0778j63851G8853a43017D6314c27737D92339
$$ 47371 -97228 -39462 -159572 -13283 -54061 -217912 78853 -143017 46314 -327737 492339
11709A04251A9103J54825C8317c061l1793k972L360D76574e7524F5746O1738K4621
$$ 104251 19103 173928 38317 -3061 -34854 -37826 -34466 476574 -57524 65746 127484 152105
11697A52105g8984A50323A1891a9941p4655J2631o7628m2457d8118A87473Q8739
$$ 152105 -78984 150323 11891 -19941 -94596 -81965 -149593 -192050 -48118 187473 276212
11686B76212b0217j04384A78297e9153B29576J1461B9089g0830j814F1679f7927
$$ 276212 -20217 -124601 178297 -59153 229576 241037 29089 -70830 -72644 61679 -67927
11674g0401B1043J12280i3994j74698e8104j58116g3371B02911C9898K66818C0036
$$ -70401 21043 133323 -93994 -268692 -58104 -216220 -73371 202911 39898 306716 30036
11662a13859H0888b5186k07643a6147l9518K4210A17403g1049A17715b44819A03129
$$ -113859 80888 -25186 -232829 -16147 -55665 -31455 117403 -71049 117715 -244819 103129
11650i2408K5209r9467F9666b00190N6507j6414A54871K14574c10759b7463A7413
$$ -92408 -67199 -166666 69666 -200190 -143683 -160097 154871 369445 -310759 -27463 17413
11638B03249R025H0563d4620l44068h2025D50013B06070f8692A90175a88749h514
$$ 203249 212274 80563 -44620 -388688 -82025 450013 206070 -68692 190175 -188749 -8514
11626F666J81793D5216A5823b60792A64703d6027I7025a23061C4318O8464a78568
$$ 6666 188459 45216 15823 -260792 164703 -46027 97025 -123061 34318 102782 -178568
11614A97144G6768A801f9731B7089J17366b01192K6530Q6508j62756i1938q1533
$$ 197144 76768 1801 -69731 27089 144455 -201192 -174662 -88154 -250910 -91938 -173471
11603a73471j10530F9996M1393B9691J96387I7302i1285E4808i8312K8007A18157
$$ -173471 -284001 69996 111389 29691 226078 97302 -91285 54808 -98312 -70305 118157
11591a02772j54395A04011a67673B76603g7336A4011J63866a0956o714F3634d3251
$$ -102772 -257167 104011 -167673 276603 -77336 14011 177877 -10956 -17670 63634 -43251
11579A28907l3484M2239k7206a16509j63280D0663A7547J6146R0715J34041F9895
$$ 128907 95423 137662 110456 -116509 -279789 40663 17547 33693 124408 258449 69895
11567a0589B78717i0415L8117A329a38075E0738J94371J13275a37888H3979e3254
$$ -10589 278717 -90415 -52298 1329 -138075 50738 245109 358384 -137888 83979 -53254
11555d7151A6197i313A38450L01600g0642G5099b53101A62465b14948d3623A45863
$$ -47151 16197 -9313 138450 440050 -70642 75099 -253101 162465 -214948 -43623 145863
11543a43601K2759J0784J1452l8275A77173F2508J65068I0615b17868b8217A79245
$$ -143601 -120842 -110058 -98606 -136881 177173 62508 227576 90615 -217868 -28217 179245
11531G8844J03119J54762q919m1371b81604a00029d5553o392a3840k61602a21798
$$ 78844 181963 336725 327806 286435 -281604 -100029 -45553 -51945 -13840 -275442 -121798
11519C37041b1310l2631B34192E800K20005F2493K50772c9487B63818K03709A26148
$$ 337041 -21310 -53941 234192 5800 225805 62493 313265 -39487 263818 467527 126148
11507e0048j40293C25407g1184B05003I0030K257N3400K9514M5143k7760N4192
$$ -50048 -190341 325407 -71184 205003 90030 92287 145687 175201 220344 192584 246776
11496B46776A20294f44o9230a0458p0877B61706l1108c14388D7725a36786c2554
$$ 246776 120294 -644 -69874 -10458 -81335 261706 230598 -314388 47725 -136786 -32554
11484B39086A04404N6104a375E8577O7283d7746j6184j11046D61914j51111R2302
$$ 239086 104404 160508 -1375 58577 125860 -47746 -63930 -174976 461914 310803 403105
11473D03105j87847c1466A00775D7499M84859A24226e2841A39262c55929D75074
$$ 403105 215258 -31466 100775 47499 532358 124226 -52841 139262 -355929 475074
11462D03811n5005c77653E4723k4500N4129J6921J86895A42907J9573h4676B92081
$$ 403811 348806 -377653 54723 30223 84352 101273 288168 142907 162480 -84676 292081
11450B30650j0561k8217g6220J8410l69154B45878E0273a10149M823A32308a87043
$$ 230650 220089 191872 -76220 -57810 -426964 245878 50273 -110149 -105326 132308 -187043
11438a08139D3731L9457J30143i6200M0910F0029b29957a1029j62451b1378A8060
$$ -108139 43731 83188 213331 -96200 -55290 60029 -229957 -11029 -173480 -21378 18060
11426a32438D094J13260a46581N4986A80141g7687j79945A95640b87879A64092
$$ -132438 4094 117354 -146581 -91595 180141 -77687 -257632 195640 -287879 164092
11415a6347A02516b92359B42248h6653k9199H5097L4361i1500A9139J11906d424
$$ -16347 102516 -292359 242248 -86653 -115852 85097 119458 -91500 19139 131045 -4424
11403B0156e5312k21945b6713o5889B7128a07197A11602J52316f0949G3017L0693
$$ 20156 -55312 -277257 -26713 -92602 27128 -107197 111602 263918 -60949 73017 103710
11392A03710a3366m6319J545B47408A692K9763j1187c3549j29711J1350j3123
$$ 103710 -13366 -59685 -58140 247408 1692 31455 20268 -33549 -163260 -151910 -165033
11381a65033H1749b52574c6199A34145E1139J08069K8591K0420A2056J35801b8008
$$ -165033 81749 -252574 -36199 134145 51139 159208 187799 208219 12056 147857 -28008
11369b54527j95841g6843a7942j62755A75123k081b43786J06377O8610j26899
$$ -254527 -450368 -76843 -17942 -180697 175123 173042 -243786 -137409 -68799 -195698
11359a95698G9145a63287D1823J40298f0116l1323A08279K0972a64037p7104d3494
$$ -195698 79145 -163287 41823 182121 -60116 -91439 108279 129251 -164037 -241141 -43494
11347A57802h0022G4522j8688a47216p1338F3993a0490j29591D1177c7267k83041
$$ 157802 -80022 74522 55834 -147216 -218554 63993 -10490 -140081 41177 -37267 -320308
11336c20308A15193l5499k5782b38432o3079C1063K38894a1528q8313H1017b4852
$$ -320308 115193 79694 53912 -238432 -301511 31063 269957 -11528 -99841 81017 -24852
11324I7700e10458B17798B7793L7919k242Q4414n4520a68634b3834H8913k6822
$$ 97700 -510458 217798 27793 65712 63470 147884 93364 -168634 -23834 88913 62091
11313F2091P442b43841h8217b9663k92161a16667A4237J24617l1161r871a7141
$$ 62091 69533 -243841 -88217 -29663 -321824 -116667 14237 138854 107693 97822 -17141
11301A10238d63882a01018J1770A20472n1520J5286A6714J00196f6681j35506
$$ 110238 -463882 -101018 -89248 120472 68952 84238 16714 116910 -66681 -202187
11291b02187A51235F840Q5406b37360f6605j13971g0734F4812a39084j7994q9691
$$ -202187 151235 6840 92246 -237360 -66605 -180576 -70734 64812 -139084 -157078 -246769
11280b46769J18406A74982a46388A86728d4070C3489J77744B5031f6999m64923
$$ -246769 -128363 174982 -146388 186728 -44070 33489 211233 25031 -66999 -531922
11270e31922B78390H5906k5604i746k10754e9089H1451b10661O5316B6322L8982
$$ -531922 278390 85906 60302 -9746 -220500 -59089 81451 -210661 -145345 26322 65304
11259F5304J45066I1872B5041J24791b26285O2311o5523N6289n4850a09957j61948
$$ 65304 210370 91872 25041 149832 -226285 -163974 -229497 -173208 -228058 -109957 -271905
11248b71905E2207a14784A95761d9529G279a30170B8893a58323l945k8128q7169
$$ -271905 52207 -114784 195761 -49529 7279 -130170 28893 -158323 -162268 -190396 -277565
11237b77565R2601O706j44226D6752e4264K5088A16610J8680b98958a39060G2384
$$ -277565 -184964 -178258 -322484 46752 -54264 -29176 116610 135290 -298958 -139060 72384
11225A15072O0714E812P8666o441K11403C5576L9062N764c37814C52028e2291
$$ 115072 175786 5812 84478 78037 289440 35576 74638 80402 -337814 352028 -52291
11213d7264j49054G6286d0176J4557H8914b45158D4756c35898J12539n1489h2468
$$ -47264 -196318 76286 -40176 -25619 88914 -245158 44756 -335898 -223359 -274848 -82468
11201A91934c4757j59965N9912c7261j17767M6007d1239B21358a76056A9024a41366
$$ 191934 -34757 -194722 -134810 -37261 -155028 -109021 -41239 221358 -176056 19024 -141366
11189B9905c4211l2743A2748R0061b57272E6288a61653k5305g306b253l0533A16428
$$ 29905 -34211 -66954 12748 102809 -257272 56288 -161653 -186958 -7306 -2253 -32786 116428
11176h5416o476A16327j6534b0651j91074e9911B16138a77899h0773B4125b34460
$$ -85416 -91892 116327 99793 -20651 -211725 -59911 216138 -177899 -80773 24125 -234460
11164a19855B31739b09125m0715g4770A32003b78292c4329A39468D9129b8976
$$ -119855 231739 -209125 -249840 -74770 132003 -278292 -34329 139468 49129 -28976
11153d197j85661D2577N458a20170j13431b3781l90926a70048K2481A00198J81343
$$ -4197 -189858 42577 48035 -120170 -233601 -23781 -414707 -170048 -147567 100198 281541
11142B81541g6028k45283h3970p54R998E9911d8703J520F0644F734g9970C07077
$$ 281541 -76028 -321311 -83970 -84724 -74726 59911 -48703 -47183 60644 6734 -79970 307077
11129A38876b82532B51431b25147g790n3649B89331j30536B101a33363E4493g4271
$$ 138876 -282532 251431 -225147 -7790 -61439 289331 158795 2101 -133363 54493 -74271
11117b20j22408B6880i3135B03996G6380K30103K6636C6882L6906d7328K1164
$$ -220 -122628 26880 -93135 203996 76380 306483 333119 36882 73788 -47328 -26164
11106b6164A24810b18196A07103Q7882P8818C3103L1323L92708b61602B54790
$$ -26164 124810 -218196 107103 194985 273803 33103 64426 457134 -261602 254790
11095A53074J94668p7929K6281a36363N7047k9581j9049A69260b68506B8954L36064
$$ 153074 347742 269813 296094 -136363 -79316 -108897 -127946 169260 -268506 28954 365018
11084C65018m2069A28462L10748A15997K05941D0166a236E60264k26323J28706
$$ 365018 322949 128462 439210 115997 321938 40166 -1236 560264 333941 462647
11074D62647j40189J09128j48564A02217J68328L2865I4432N1925N73919B43599
$$ 462647 322458 431586 283022 102217 270545 303410 94432 146357 720276 243599
11063B77949p6867L36383B19947O06499A40388J30297L87407j51927J85890A51804
$$ 277949 201082 537465 219947 826446 140388 270685 658092 506165 692055 151804
11052E67817L5655O254p8240j35287J54801B47989L64140o9617j85449J34446
$$ 567817 603472 609726 531486 396199 551000 247989 612129 542512 357063 491509
11042D91509K27361C52987L42547R9003j20548j26265p6789J06383l3013K03218
$$ 491509 718870 352987 695534 794537 673989 547724 470935 577318 544305 747523
11032G47523r4249j98675L93575C05622J33960K17275C03283J94574K34890j90763
$$ 747523 653274 454599 848174 305622 439582 656857 303283 497857 732747 541984
11022E41984k03753Q5879J10968L40L02615l45209N5785J13965A96913L76165
$$ 541984 338231 424110 535078 535418 838033 492824 548609 662574 196913 573078
11012E73078k72190M36312K4153k30260K02940C40622Q7044m1745J95371k01252
$$ 573078 300888 737200 761353 531093 734033 340622 427666 385921 581292 380040
11002C80040Q1184O7791l5931J34207k74997L51193B84545K41568R5714K34402
$$ 380040 461224 529015 493084 627291 352294 703487 284545 526113 621827 856229
10992H56229k65320k3668J40944r139k35627K75950m3163L0583J27530K46814
$$ 856229 590909 567241 708185 699046 463419 739369 696206 726789 854319 1101133
10982A101133j87823o1975J13808Q9325K33149p5793J63725M53570M25689r3806
$$ 1101133 913310 851335 965143 1054468 1287617 1211824 1375549 1829119 2254808 2161002
10972B161002K95020m45599J59641l19411M14344l36982o14172p7300K40j30972
$$ 2161002 2456022 2010423 2170064 1850653 2264997 1928015 1313843 1236543 1236783 1105811
10962A105811J56545K03672j02365j00549J30685n2860N3675m7105j88170k23554
$$ 1105811 1262356 1466028 1363663 1263114 1393799 1340939 1394614 1347509 1159339 935785
10952I35785n164O220A20933M53037j59525m9864j60014J35635o5655j12834K82532
$$ 935785 930621 936841 120933 573970 414445 364581 204567 340202 274547 161713 444245
10941D44245j4939j79340a2706I9691O1507A9513K39779j20396b1271j23892q4263
$$ 444245 429306 249966 -12706 99691 161198 19513 259292 138896 -21271 -145163 -229426
10930b29426q9459A32733b47738A08495a81833C665b54438g7396F5473P3865D4601
$$ -229426 -318885 132733 -247738 108495 -181833 3665 -254438 -77396 65473 139338 44601
10918I5508P4303f2488J8666A64167G4323A0607J15631O9495o4144h4911L1200
$$ 95508 169811 -62488 -43822 164167 74323 10607 126238 195733 131589 -84911 -53711
10907e3711L263b427n1598I0529c04578C5222J11984a99976h4333B1992b43392
$$ -53711 -50448 -2427 -54025 90529 -304578 35222 147206 -199976 -84333 21992 -243392
10895d7550j7629A01014B6196a1988j95535b8589j46832G8714c26359d2599j60381
$$ -47550 -65179 101014 26196 -11988 -207523 -28589 -175421 78714 -326359 -42599 -202980
10884b02980b9321a0998k66959a1495j12249A03644d2222p3713B00445C7150a35753
$$ -202980 -29321 -10998 -277957 -11495 -123744 103644 -42222 -115935 200445 37150 -135753
10872e1362F4559g7901F6734J72078j06641a57487q6470C911M5731L00021c12531
$$ -51362 64559 -77901 66734 238812 132171 -157487 -243957 3911 49642 349663 -312531
10860B03185f9640F27516B47564b57117E9245A14a40566B2848O4448I024K54335
$$ 203185 -69640 627516 247564 -257117 59245 114 -140566 22848 87296 9024 263359
10849B63359j27227c65180J79828I7324J73069E8252a16254C23309a25396M617
$$ 263359 136132 -365180 -185352 97324 270393 58252 -116254 323309 -125396 -120779
10839a20779o1030E5534B4076j0265N8881P5951m2085a32794I3232a99375e035
$$ -120779 -181809 55534 24076 13811 72692 148643 106558 -132794 93232 -199375 -5035
10827B89692a40681J8004j0738k61901a03563a6409p2710n11B48436b95404D9070
$$ 289692 -140681 -122677 -133415 -395316 -103563 -16409 -89119 -89630 248436 -295404 49070
10815A5955b45441m33264C9079A212J55951a43180p0588i9950b4642j64342A37982
$$ 15955 -245441 -678705 39079 1212 157163 -143180 -213768 -99950 -24642 -188984 137982
10803c9077l41704a63714b4466r4719F4250r640a20243h44G9888a1165j75695
$$ -39077 -380781 -163714 -24466 -119185 64250 54610 -120243 -844 79888 -11165 -186860
10792a86860g2300A24185k1411a61845A97914F0215a27659j46386D8139M3254
$$ -186860 -72300 124185 102774 -161845 197914 60215 -127659 -274045 48139 91393
10782I1393j16b28877j15648g6075E0442a21633C16518a21032M6816c3062H2153
$$ 91393 91277 -228877 -344525 -76075 50442 -121633 316518 -121032 -74216 -33062 82153
10770A17844a69064d3064j08211C1944a83968O9064k66160J56031E0250a74737
$$ 117844 -169064 -43064 -151275 31944 -183968 -114904 -381064 -225033 50250 -174737
10759a21024A4039N2090K78641A3787b18154i9910l1180A35901f6560k8063A21843
$$ -121024 14039 66129 344770 13787 -218154 -99910 -131090 135901 -66560 -94623 121843
10747a80198E9395h9191D6567b29953R1174N1581A91677b49524A7296a42174f9343
$$ -180198 59395 -89191 46567 -229953 -138779 -87198 191677 -249524 17296 -142174 -69343
10735b22291R2607j68972a1965A67922B851e051A12200b64989B2422L33740r8140
$$ -222291 -129684 -298656 -11965 167922 2851 -5051 112200 -264989 22422 356162 258022
10724B58022L03763c2387C3389g0580j19215k8477R2310i002j66245a8497j53696
$$ 258022 561785 -32387 33389 -70580 -189795 -218272 -125962 -9002 -175247 -18497 -172193
10713a72193h1658B80473B2180b191j47564b7331B31712b59524B3943J89148q4245
$$ -172193 -81658 280473 22180 -2191 -149755 -27331 231712 -259524 23943 213091 128846
10702A28846O9955k7734a2678C2420R7167E3816c7785o9586A37626D0383i872
$$ 128846 198801 171067 -12678 32420 129587 53816 -37785 -107371 137626 40383 -9872
10690B6408b43948e6393j12007A80647b08388A27996L2369i2539I0093I138c6066
$$ 26408 -243948 -56393 -168400 180647 -208388 127996 160365 -92539 90093 9138 -36066
10678c40065C23431a40k90412b6206k51750a15461d8683k14137b4006k21873H1852
$$ -340065 323431 -140 -290552 -26206 -277956 -115461 -48683 -262820 -24006 -245879 81852
10666a27678M8333B1610L08143b63718P8275G2016j1952R6229J46985A25705b26744
$$ -127678 -79345 21610 329753 -263718 -185443 72016 60064 156293 303278 125705 -226744
10654A45143D6918b3154n1223a2471B1042h2231c1612j62498L9352L4396l3579
$$ 145143 46918 -23154 -74377 -12471 21042 -82231 -31612 -194110 -154758 -120362 -153941
10643a53941l5403C71581g3752q9843H44c49310h9610P086r3070j95242A92432
$$ -153941 -189344 371581 -73752 -163595 844 -349310 -89610 -82524 -175594 -370836 192432
10631f8647K0004H3824J5265g029D11801b69562A8730J01040b5994m20555N5756
$$ -68647 -48643 83824 99089 -7029 411801 -269562 18730 119770 -25994 -446549 -390793
10620c90793M1740J17212m8240B47764f0012j84426N8474i327r9858B15313B3158
$$ -390793 -349053 -231841 -280081 247764 -60012 -244438 -185964 -9327 -109185 215313 23158
10608c72681a58258j22814I2440b33313c9146o3769n8486P5995l7628A89186I3917
$$ -372681 -158258 -281072 92440 -233313 -39146 -102915 -161401 -85406 -123034 189186 93917
10596b5811r9827j08232p6507b2010l0582k4852l6894K2320A29684b69799B44657
$$ -25811 -125638 -233870 -310377 -22010 -52592 -77444 -114338 -92018 129684 -269799 244657
10584A23852d5714j47299A36641h71C1524b2655A24383K4522a48247A24037b43253
$$ 123852 -45714 -193013 136641 -871 31524 -22655 124383 148905 -148247 124037 -243253
10572e48631A5313e3765E2147J13998E208a41B08066d9069A68124c14043H5549
$$ -548631 15313 -53765 52147 166145 5208 -141 208066 -49069 168124 -314043 85549
10560G0769B2276d0657D0082i1384B4552L01690P0281d1903B14258n7046O9980
$$ 70769 22276 -40657 40082 -91384 24552 326242 396523 -41903 214258 157212 227192
10549B27192b87817D5877K34894b44856D82374d72734J52759g9761L7484k06925
$$ 227192 -287817 45877 280771 -244856 482374 -472734 -319975 -79761 -42277 -249202
10539b49202K4825e5346j94321H9252K18862H502g5012G6280b08657A2689a5571
$$ -249202 -224377 -55346 -249667 89252 308114 8502 -75012 76280 -208657 12689 -15571
10527c6551Q531n168B62023m41j11694i1674H1354i9254j05928O8050K848k34780
$$ -36551 -28020 -33188 262023 261582 149888 -91674 81354 -99254 -205182 -137132 -134284 -369064
10515c69064A0430c4248D87848e6387k2268j75476C38737A43375a49267B15012
$$ -369064 10430 -34248 487848 -56387 -78655 -254131 338737 143375 -149267 215012
10504B13390A2866b02680f2529K3703k12249D2309J5207R3783k312b58236G9647
$$ 213390 12866 -202680 -62529 -38826 -251075 42309 57516 151299 148987 -258236 79647
10492a40895f7812m2324c5189m5181H2800B6684L5419B8521J22209L2971J75155
$$ -140895 -67812 -110136 -35189 -80370 82800 26684 62103 28521 150730 183701 358856
10481C58856J36769k47235B7435J91461n8996a09349B0512E416a06925e2326l6305
$$ 358856 495625 248390 27435 218896 159900 -109349 20512 5416 -106925 -52326 -88631
10470h8631m2438m5422C5343m665c12684F5525a45170A69405q597f1667n3788
$$ -88631 -131069 -176491 35343 30678 -312684 65525 -145170 169405 160808 -61667 -115455
10459a15455a2405B79195j23387a18309m6324k709g0912Q420k49236R3603K4181
$$ -115455 -12405 279195 155808 -118309 -164633 -167342 -70912 -62492 -311728 -218125 -193944
10448a93944M4052A58786M2902f6248L2758A17799c1393o3662j3089c0395r7706
$$ -193944 -149892 158786 201688 -66248 -33490 117799 -31393 -95055 -108144 -30395 -128101
10437a28101B4323J31023a57756A13666a00498r7281E834M9339e1330k96278K9518
$$ -128101 24323 155346 -157756 113666 -100498 -197779 5834 55173 -51330 -347608 -318090
10426c18090J05725G928m94a95530G9321C7838c41273a51060M0008l7326F4451
$$ -318090 -212365 7928 7434 -195530 79321 37838 -341273 -151060 -111052 -148378 64451
10414C39595g4727o3861B37693H7312e5308a2250B3751a41588D043O175b19954
$$ 339595 -74727 -138588 237693 87312 -55308 -12250 23751 -141588 4043 10218 -219954
10402b21459j93143A15485e7732j97893A29855L6571b27488i8938D18338a71798
$$ -221459 -414602 115485 -57732 -255625 129855 166426 -227488 -98938 418338 -171798
10391B21662I0915B1038i4847B85809c0285E4321a92302o118C55855d6065A79753
$$ 221662 90915 21038 -94847 285809 -30285 54321 -192302 -198420 355855 -46065 179753
10379C2496R8454I922L06506P474q3653e2202G4109a42269B58251a12206c831
$$ 32496 130950 9922 316428 323902 240249 -52202 74109 -142269 258251 -112206 -3831
10367D30875R3697k37643j7561J20552q5552a16468J8372A97037o963a29067G3957
$$ 430875 524572 286929 269368 389920 304368 -116468 -98096 197037 190074 -129067 73957
10355B46054R1291j27205P358K92282M2678A95360N97789F1805N3822R3810a11828
$$ 246054 337345 210140 217498 509780 552458 195360 793149 61805 115627 209437 -111828
10343B09849m6672K4939k7027l1444M2826N9823b9393A6302L46622g3001E05108
$$ 209849 163177 188116 161089 129645 172471 232294 -29393 16302 362924 -73001 505108
10331e5180n2476C62677F1838c42277C64943B5682M17232F5439A7062K62811O9486
$$ -55180 -107656 362677 61838 -342277 364943 25682 442914 65439 17062 279873 349359
10320C49359j56398d3587B34113a2154I804a74731B66298L7502a59157j38931
$$ 349359 192961 -43587 234113 -12154 9804 -174731 266298 303800 -159157 -298088
10310b98088B9273L2494a30405A64792b16826h2218A11262C622L89451A62214
$$ -298088 29273 61767 -130405 164792 -216826 -82218 111262 3622 393073 162214
10299G1438J2926f3859A90894a16953o713j04891C6470j0301o200i2537M2583
$$ 71438 84364 -63859 190894 -116953 -123666 -228557 36470 26169 19969 -92537 -49954
10288d9954m7780I1727a87336r2354g8517j3273b8303q8162M6798j8721o6910
$$ -49954 -97734 91727 -187336 -279690 -78517 -91790 -28303 -116465 -69667 -88388 -155298
10277a55298j6004A62930e6036A34636a8556B28329H2263a5926M778j34840k3909
$$ -155298 -171302 162930 -56036 134636 -18556 228329 82263 -15926 -11148 -145988 -169897
10266a69897F676g9531C89210b86580c5353B87284R8165H2525J3952a13617L7541
$$ -169897 6676 -79531 389210 -286580 -35353 287284 385449 82525 96477 -113617 -76076
10255g6076C3299M09157A68127b95701F3207K0363j5347f3093a8253A08197e95377
$$ -76076 33299 442456 168127 -295701 63207 83570 68223 -63093 -18253 108197 -595377
10243a26538j32964R9580f3832l43232c9147B06083a23653b4618l60526a54708
$$ -126538 -259502 -159922 -63832 -407064 -39147 206083 -123653 -24618 -385144 -154708
10232H3302J10274f9306p1665A09399b16013c1959B42040b51406B31710l6128
$$ 83302 193576 -69306 -140971 109399 -216013 -31959 242040 -251406 231710 195582
10222A95582a7835A08039i4238L3991b6994B4514d52242A17861e7654A11573K2747
$$ 195582 -17835 108039 -94238 -60247 -26994 24514 -452242 117861 -57654 111573 134320
10211A34320K27865j41575a52379O0898K616J5692c761l44893J10454E7545a14435
$$ 134320 362185 220610 -152379 -91481 -88865 -73173 -3761 -348654 -238200 57545 -114435
10199e2530D07745a17334j1196A28858I825R1580a1175E3193b20131I6869B0445
$$ -52530 407745 -117334 -128530 128858 9825 101405 -11175 53193 -220131 96869 20445
10187f8882p1306n7239H6901g9524j33381J0450B9836R114J16489e922p0067A65635
$$ -68882 -140188 -197427 86901 -79524 -212905 -202455 29836 38950 155439 -5922 -75989 165635
10174a83790k1682d2626B58070G7413b08690k63898a9223k14380C2523b76203
$$ -183790 -205472 -42626 258070 77413 -208690 -472588 -19223 -233603 32523 -276203
10163a85550N4124m0395A2892L9603e3273H841j125a88839B86385j32173D4953
$$ -185550 -131426 -171821 12892 52495 -53273 8841 7716 -188839 286385 154212 44953
10151F4176a56972A51731h1780D0488b01913j49864C00976C4782J00757b32164
$$ 64176 -156972 151731 -81780 40488 -201913 -351777 300976 34782 135539 -232164
10140a16361B6047K02202a23132j26060d6874l1928o475K5343A90231g5113j38008
$$ -116361 26047 228249 -123132 -249192 -46874 -78802 -85277 -59934 190231 -75113 -213121
10129b13121J01645C1670a97893A33474a08484A6675J21441e9196H7187a30364
$$ -213121 -111476 31670 -197893 133474 -108484 16675 138116 -59196 87187 -130364
10118e35701a41360c5546j04366k49652a70104d9083A44970i0471B25186q7102
$$ -535701 -141360 -35546 -139912 -389564 -170104 -49083 144970 -90471 225186 138084
10108A38084i2754o4192E083b26274R5242A0744a52841e5509r9203B10268D0988
$$ 138084 -92754 -156946 5083 -226274 -131032 10744 -152841 -55509 -154712 210268 40988
10096c57427b3804E4933g301B9786a56404j0335G945b25958C61505b62465H3750
$$ -357427 -23804 54933 -7301 29786 -156404 -166739 7945 -225958 361505 -262465 83750
10084C8391g1964m3136n5286H1057N357a52191N999D5893a58385f8593n40521
$$ 38391 -71964 -115100 -170386 81057 86414 -152191 -146192 45893 -158385 -68593 -609114
10073f09114A07562h1961J4605j43270e7412k3656j9915m6740e0781n3392B33770
$$ -609114 107562 -81961 -67356 -210626 -57412 -81068 -100983 -147723 -50781 -104173 233770
10061H0305a33968A0271c13249i3347G7051g2579o8736j57930D0864N184M2225
$$ 80305 -133968 10271 -313249 -93347 77051 -72579 -141315 -299245 40864 46048 88273
10050H8273b3609l2409l9025j38743g9293j83851P2188G2106c94839a0903B78022
$$ 88273 -23609 -56018 -95043 -233786 -79293 -263144 -190956 72106 -394839 -10903 278022
10038G8824a03735o0712j27747k0393J35999J1322J9442o6782l8993L5972j1079
$$ 78824 -103735 -164447 -292194 -312587 -176588 -165266 -145824 -212606 -251599 -215627 -226706
10027b26706A41463e3214H252a65105F6316a49550O3373p4797K2837A2094e6654
$$ -226706 141463 -53214 8252 -165105 66316 -149550 -86177 -160974 -138137 12094 -56654
10015a12150r8730P5038A51763c31770C57330c84716l8028J33611g4799A30277
$$ -112150 -210880 -135842 151763 -331770 357330 -384716 -422744 -289133 -74799 130277
10004D2917a56370j0708O2961j08385A03631B8039b2516j70213A02870a87063
$$ 42917 -156370 -167078 -104117 -212502 103631 28039 -22516 -192729 102870 -187063
9993g4917D1601a02415j60016f203k21312F2589a2762E2433a69056A68302d09078
$$ -74917 41601 -102415 -262431 -6203 -227515 62589 -12762 52433 -169056 168302 -409078
9981A25314e0205l8774k49853A64830F0535c78471n3993J35966b3270A79713a65289
$$ 125314 -50205 -88979 -338832 164830 60535 -378471 -432464 -296498 -23270 179713 -165289
9969i1812L340B50049O193c413j48723o4696j27477A29901b01718B60231j21677
$$ -91812 -88472 250049 256242 -3413 -152136 -216832 -344309 129901 -201718 260231 138554
9958A38554R6262l3541a1206l14080B39708j11845a01785C91212f8916G4368c8871
$$ 138554 234816 201275 -11206 -325286 239708 127863 -101785 391212 -68916 74368 -38871
9946f8759C6566O6619b3013B9056J28311c59259R5643K3465J16095a2819A61616
$$ -68759 36566 103185 -23013 29056 157367 -359259 -263616 -240151 -124056 -12819 161616
9934a8470A65271a6285B21346g4925j46888f9418c4484k3269k70349A2181O4243
$$ -18470 165271 -16285 221346 -74925 -221813 -69418 -34484 -57753 -328102 12181 76424
9923G6424a6864E3386L6596M362a40546D8647a93494b6531G2891a1367k87539
$$ 76424 -16864 53386 89982 94344 -140546 48647 -193494 -26531 72891 -11367 -298906
9912b98906h1522J0240j90778B48230a60162g8739A58259p227E6832c43005E34594
$$ -298906 -81522 -71282 -262060 248230 -160162 -78739 158259 151032 56832 -343005 534594
9900a61740p5742L4035F2950d07336b4174A52238a1544l1270o7804k16285J38257
$$ -161740 -237482 -203447 62950 -407336 -24174 152238 -11544 -42814 -110618 -326903 -188646
9889a88646C93652j01615D6277g8458j36174E6447a1599j71953j51278J32369
$$ -188646 393652 292037 46277 -78458 -214632 56447 -11599 -183552 -334830 -202461
9879b02461R5185B47814m5726I7398d00122d6161l77198A44266a30932A04069
$$ -202461 -107276 247814 202088 97398 -400122 -46161 -423359 144266 -130932 104069
9868a15943p4433l00463A36037b82767o1969b9936k36204P092A91848a03007A2656
$$ -115943 -190376 -490839 136037 -282767 -344736 -29936 -266140 -259048 191848 -103007 12656
9856D6752J86975a32962l16766A24618a11571G122K31619G7532i0821E75761A24516
$$ 46752 233727 -132962 -449728 124618 -111571 7122 238741 77532 -90821 575761 124516
9844a31138E48999c00778a03324d8804j24734b7686o3647A09641A9146d32060
$$ -131138 548999 -300778 -103324 -48804 -173538 -27686 -91333 109641 19146 -432060
9833a7080j16261C740a38035o2190B58490e7965l41383a56371D1343f6535n3674
$$ -17080 -133341 3740 -138035 -200225 258490 -57965 -399348 -156371 41343 -66535 -120209
9822a20209j69206a0728D2602a63970A05829e1978G5239g0905j66382J09124E99
$$ -120209 -289415 -10728 42602 -163970 105829 -51978 75239 -70905 -237287 -128163 599
9810d3710A13394b07075h7554h390A5063a18240C92960c22932J1983i7997d0696
$$ -43710 113394 -207075 -87554 -8390 15063 -118240 392960 -322932 -310949 -97997 -40696
9798H4031b07712I9309J08417c35703j7098C8220d54421b6527B4799b08914a02688
$$ 84031 -207712 99309 207726 -335703 -352801 38220 -454421 -26527 24799 -208914 -102688
9786A74855a48092G4409a6096m24918g5802k34036B4686k922a24641C0072b82310
$$ 174855 -148092 74409 -16096 -441014 -75802 -309838 24686 21764 -124641 30072 -282310
9774i1535O329A4974g1763b3528l21055a63560A3474c05894R1733N521a0230E4130
$$ -91535 -85206 14974 -71763 -23528 -344583 -163560 13474 -305894 -214161 -208640 -10230 54130
9761A47185a60682K7398r62l5767c4305j03108j43829e0323A18218i2330d2990
$$ 147185 -160682 -133284 -134246 -170013 -34305 -137413 -281242 -50323 118218 -92330 -42990
9749a61733J5511g1510A66520A4724K13576r2772c81562a17777d7622p6232A22074
$$ -161733 -146222 -71510 166520 14724 228300 135528 -381562 -117777 -47622 -123854 122074
9737B34597a64616j01998f2944r3118A25326E7045a71684j1137c9677j63019R9528
$$ 234597 -164616 -266614 -62944 -156062 125326 57045 -171684 -182821 -39677 -202696 -103168
9726a03168B99544a36323q5533M8360A80109f396A1151i4304l58389J72006D7683
$$ -103168 299544 -136323 -221856 -173496 180109 -6396 11151 -94304 -452693 -280687 47683
9714a05043B5705a50469G9469b9464j27479a9303A24676c87980A37983a82093
$$ -105043 25705 -150469 79469 -29464 -156943 -19303 124676 -387980 137983 -182093
9703d3158C954J37767a46636D8088a97017j28678A18755f7048j64087k9310A41529
$$ -43158 3954 141721 -146636 48088 -197017 -325695 118755 -67048 -231135 -260445 141529
9691B74145g9103E6028J33559Q174c61295g1519o0721L0434a8330q0548J856B7340
$$ 274145 -79103 56028 189587 197761 -361295 -71519 -132240 -101806 -18330 -98878 -97022 27340
9678a52796B17759p7532M0239a42212C7368d52656i2799j00112B17247j0471b98191
$$ -152796 217759 140227 180466 -142212 37368 -452656 -92799 -192911 217247 206776 -298191
9666d9181G163K12552a44794A69601g639k35572R3951A11658h0336B71060B7473
$$ -49181 7163 219715 -144794 169601 -7639 -243211 -149260 111658 -80336 271060 27473
9654c96819A19009g1912j5083j16566C73384A9190b23112J6783I4923J26223A0356
$$ -396819 119009 -71912 -86995 -203561 373384 19190 -223112 -206329 94923 221146 10356
9642A78190b32254H8569a69379F5010a18802N2652J8588a7873j72527L5427A41368
$$ 178190 -232254 88569 -169379 65010 -118802 -66150 -47562 -17873 -190400 -154973 141368
9630D5143J4148M4994Q3644a84775B26535i5199k2908B20407a28199A03514a75379
$$ 45143 59291 104285 187929 -184775 226535 -95199 -118107 220407 -128199 103514 -175379
9618f7972j02331D2677d3809C48991e9338o3703L776q2078j5540A69189e8885
$$ -67972 -170303 42677 -43809 348991 -59338 -123041 -119265 -201343 -216883 169189 -58885
9606b69379P8630F9487J53062a21972k10014a32319B76207h9339B62052a7659
$$ -269379 -190749 69487 222549 -121972 -331986 -132319 276207 -89339 262052 -17659
9595B09730b77711L6955h4697J1495k7927C6897J24838c00099b4323j135B19334
$$ 209730 -277711 -240756 -84697 -73202 -101129 36897 161735 -300099 -24323 -25458 219334
9583e8324B7561f1096A68318b73542a08293B99134b54872C0887b23028a02960
$$ -58324 27561 -61096 168318 -273542 -108293 299134 -254872 30887 -223028 -102960
9572a08665A24473J47740P6171a83085C31526C4422m115d46889a47435M0078q2058
$$ -108665 124473 272213 348384 -183085 331526 34422 30307 -446889 -147435 -107357 -189415
9561a89415G7879a5271I8571b9263k41617C02865g8053H5938a632A18586f8615
$$ -189415 77879 -15271 98571 -29263 -270880 302865 -78053 85938 -1632 118586 -68615
9549H005b36407I5791M7115b4249k46251R1113A8094a19081A53898P1658a24943
$$ 8005 -236407 95791 142906 -24249 -270500 -179387 18094 -119081 153898 225556 -124943
9537g8942C37685C3063b30B7385J27976a43255k50073D6758b2160r3954q3435
$$ -78942 337685 33063 -230 27385 155361 -143255 -393328 46758 -22160 -116114 -199549
9526a99549j9346H2019K10904a83515f9185A42483E7811b54630O0017A18612d63699
$$ -199549 -218895 82019 292923 -183515 -69185 142483 57811 -254630 -194613 118612 -463699
9514a7294l17644C7934a40598O6738k5699a0554l53911J55557A25956A0297b32984
$$ -17294 -334938 37934 -140598 -73860 -99559 -10554 -364465 -208908 125956 10297 -232984
9502a44952j61389a52248O7373D1226K13981N2840a64756j89746B93417i5281
$$ -144952 -306341 -152248 -84875 41226 255207 308047 -164756 -354502 293417 -95281
9491a49628K9710A26171N0939E3369d3002k0099j40656D13875D4334c03523A9272
$$ -149628 -119918 126171 177110 53369 -43002 -63101 -203757 413875 44334 -303523 19272
9479b07727O1594f7018k70525i706q5953j30892k110b5549k07487P9340a722k02236
$$ -207727 -146133 -67018 -337543 -9706 -95659 -226551 -228661 -25549 -233036 -153696 -1722 -203958
9467b03958M7218A90266a89279d7510n1635b515B0991b79928A22799K99897a71583
$$ -203958 -156740 190266 -189279 -47510 -99145 -2515 20991 -279928 122799 422696 -171583
9455b6131C0865b6206J0277D4365M1851f1210o8156j7790A39543a57074l4329
$$ -26131 30865 -26206 -15929 44365 86216 -61210 -129366 -147156 139543 -157074 -191403
9444a91403C55839b1101j81882d5428C3159e7639p6342C4602d05512a5265r5753
$$ -191403 355839 -21101 -202983 -45428 33159 -57639 -133981 34602 -405512 -15265 -111018
9433a11018d1933A25028N5045f9887n3462N7619K0202F6393B6197b5437l24149
$$ -111018 -41933 125028 180073 -69887 -123349 -65730 -45528 66393 26197 -25437 -349586
9422c49586i2640H4764a73953A79281a941j423B1760d24853I4622f9328F3923
$$ -349586 -92640 84764 -173953 179281 -1941 -3364 21760 -424853 94622 -69328 63923
9410b41305C25880B4046a62318B42723J07255b43660K4776O4638B959a63325d7954
$$ -241305 325880 24046 -162318 242723 349978 -243660 -218884 -154246 2959 -163325 -47954
9398b16839c1285k96853F8826g9993C51258d4768j55863d4764l4952j90125h6934
$$ -216839 -31285 -328138 68826 -79993 351258 -44768 -200631 -44764 -79716 -269841 -86934
9386A16931M7441b81313A2923d960k40642h5717r8329p4254C5558b31084c6087
$$ 116931 164372 -281313 12923 -4960 -245602 -85717 -184046 -258300 35558 -231084 -36087
9374a50651I3927J37120a37922j51863i9049j5620j25129H6994I734c298j12034
$$ -150651 93927 231047 -137922 -289785 -99049 -114669 -239798 86994 9734 -3298 -115332
9363a15332A4946c39481E0812b88921e4481D5252h4977j55756g6519F8093k0316
$$ -115332 14946 -339481 50812 -288921 -54481 45252 -84977 -240733 -76519 68093 47777
9352D7777K88064F2065a4407B1906R9122b24697A13362a36352o3585B18651a64422
$$ 47777 335841 62065 -14407 21906 121028 -224697 113362 -136352 -199937 218651 -164422
9340C58772j36964h128C2852c20402A43863j4449l7377g9300l33190B99198D1348
$$ 358772 221808 -8128 32852 -320402 143863 129414 92037 -79300 -412490 299198 41348
9328G1071A0150J46369b75664J9538J27032k12674A4157a48729B5533J43581b98
$$ 71071 10150 156519 -275664 -256126 -129094 -341768 14157 -148729 25533 169114 -298
9316a9492m3240K7980j62342A91744j6990b62224A6087K19677f8863j35342f885
$$ -19492 -62732 -34752 -197094 191744 174754 -262224 16087 235764 -68863 -204205 -6885
9304b5322o1164j07912A46899i7886A22075f4754A28096h0292k7726j93324A2952
$$ -25322 -86486 -194398 146899 -97886 122075 -64754 128096 -80292 -108018 -301342 12952
9292h5426K0411k60589h4612l20500B5097b15587A92393a26519F1728c17339e9867
$$ -85426 -65015 -325604 -84612 -405112 25097 -215587 192393 -126519 61728 -317339 -59867
9280d86999K17609C3110e7184k30569R5995A08148N4543a18281K8289L5025E6691
$$ -486999 -269390 33110 -57184 -287753 -191758 108148 162691 -118281 -89992 -54967 56691
9268a0901C897a68602I3532a58995h504A42441l4552a79285j33591d7170k53160
$$ -10901 3897 -168602 93532 -158995 -8504 142441 107889 -179285 -312876 -47170 -300330
9257c00330P3675A48024K6381B9266a39213A89562F0857a54467j48047c6932E9495
$$ -300330 -226655 148024 174405 29266 -139213 189562 60857 -154467 -302514 -36932 59495
9245D0998c5545j64354D8610K3173a78963j11333B5407b75523N9116J1967A30116
$$ 40998 -35545 -199899 48610 71783 -178963 -290296 25407 -275523 -216407 -204440 130116
9233A43939L7809d67535A85502f1661p1047A44015L1057p5015Q8739F3014a20695
$$ 143939 181748 -467535 185502 -61661 -132708 144015 175072 100057 188796 63014 -120695
9221B058c15178H584e6063C3027J03627a06082K4168k70878e6945D33683a94117
$$ 2058 -315178 8584 -56063 33027 136654 -106082 -81914 -352792 -56945 433683 -194117
9209a00329p4377A25700Q0627d4298j86145b3992B0441O5700K5199O6465a89442
$$ -100329 -174706 125700 206327 -44298 -230443 -23992 20441 86141 111340 177805 -189442
9197b38581d048n8040D53227B0003a64185O5348F3102a72586M2163j19599a7992
$$ -238581 -4048 -62088 453227 20003 -164185 -98837 63102 -172586 -130423 -250022 -17992
9185a98605D407a33392A0370g2335A57914b12844g9506A38404L7710c24496Q0517
$$ -198605 4407 -133392 10370 -72335 157914 -212844 -79506 138404 176114 -324496 -243979
9174b43979B0035J48490b08733i1250A8746b58193A57347a61005d0078l29869
$$ -243979 20035 168525 -208733 -91250 18746 -258193 157347 -161005 -40078 -369947
9164c69947H1927b49967B0876d0267n9923A9776L68704d9453D17330i7284B78074
$$ -369947 81927 -249967 20876 -40267 -100190 19776 388480 -49453 417330 -97284 278074
9152a23497r4340d4455I1525a28622A43322e7547l30020a90470B9412M0478b5676
$$ -123497 -217837 -44455 91525 -128622 143322 -57547 -387567 -190470 29412 69890 -25676
9140h5318k17288J03865E7183a89077D0876a4110o1340k7389D6447e4117A16688
$$ -85318 -302606 -198741 57183 -189077 40876 -14110 -75450 -102839 46447 -54117 116688
9128C23778I8290b21969G8329a76420C614J83571p4805j7767e08807b06680K4810
$$ 323778 98290 -221969 78329 -176420 3614 187185 112380 94613 -508807 -206680 -181870
9117a81870L8904j16369a3200k19985E7501L06166b3559l11395B302P3742N2513
$$ -181870 -142966 -259335 -13200 -233185 57501 363667 -23559 -334954 2302 76044 128557
9106A28557P600M7577B976c09956F0822a16914F6639K24393a49079j858B43597
$$ 128557 136157 183734 2976 -309956 60822 -116914 66639 291032 -149079 -150937 243597
9094b90253I8901J49668I1469L91689A93617b92572j47500g3719a3134m5218k47123
$$ -290253 98901 248569 91469 483158 193617 -292572 -440072 -73719 -13134 -58352 -305475
9083c05475g7816j39848b3458C5384J27646p1966a05589E1859K32910j09858a72329
$$ -305475 -77816 -217664 -23458 35384 163030 91064 -105589 51859 284769 174911 -172329
9071a39722I2487c26934J16401j01166B5783a63279F404a00470j001j31272P8815
$$ -139722 92487 -326934 -210533 -311699 25783 -163279 6404 -100470 -101471 -232743 -153928
9060a53928A04229f7806p8456M9636r4321l6771k83268a24197A19726k3697k7784
$$ -153928 104229 -67806 -146262 -96626 -190947 -227718 -510986 -124197 119726 96029 68245
9049F8245J46996e9503D8991K10522J40109b77384d3950k53418O1869C40847j02220
$$ 68245 215241 -59503 48991 259513 399622 -277384 -43950 -297368 -235499 340847 238627
9038B38627C8533g6377a2134l32500a50556B31610l7338a27585B66263A06206
$$ 238627 38533 -76377 -12134 -344634 -150556 231610 194272 -127585 266263 106206
9027a62713N5659K2050m7059H382a99850F2278L2362k0241b3868n9325q5408b3809
$$ -162713 -107054 -85004 -132063 8382 -199850 62278 94640 74399 -23868 -83193 -168601 -23809
9014b65865P6149C0890J0283c80804A00274c19149a57346C65042c96827E0865
$$ -265865 -189716 30890 41173 -380804 100274 -319149 -157346 365042 -396827 50865
9003A8286a10048M5342E4917a05623b838l1878k62179L5634Q2346A93433I1055
$$ 18286 -110048 -64706 54917 -105623 -2838 -34716 -296895 -261261 -178915 193433 91055
8991b07365k48571a17308A54856a44633j19955O3205j17108O6111g282k43045
$$ -207365 -455936 -117308 154856 -144633 -264588 -201383 -318491 -252380 -7282 -250327
8981b50327K7442j70410J58067A67402d9675A38491L0282a19715A41443f5128
$$ -250327 -222885 -393295 -235228 167402 -49675 138491 168773 -119715 141443 -65128
8970A72531a44641k99208d7099H5694a1426k0664C03790a34475b741l16205B3072
$$ 172531 -144641 -443849 -47099 85694 -11426 -32090 303790 -134475 -2741 -318946 23072
8958i2518K4886k90910h7882j29834P5432E7557J2638J28537e0050A33958a04052
$$ -92518 -67632 -358542 -87882 -217716 -142284 57557 70195 198732 -50050 133958 -104052
8946A66140c82054c9120r4801J1499n8132B4271a79887l536f4301I6371m0060
$$ 166140 -382054 -39120 -133921 -122422 -180554 24271 -179887 -183423 -64301 96371 56311
8935E6311J87625K2715a46231A63031a91589p6861e4204E5929J26511G6810J76474
$$ 56311 243936 266651 -146231 163031 -191589 -268450 -54204 55929 182440 76810 253284
8924B53284O33917J266477O311126J631947B528120A067606C77917j62448a60407
$$ 253284 887201 2153678 8464804 10096751 2528120 1067606 377917 215469 -160407
8914A93704c1414l1082E17454E7876d8789C30248A04182K6002j6064A0846c2025
$$ 193704 -31414 -62496 517454 57876 -48789 330248 104182 130184 114120 10846 -32025
8902D394N3401N5887J01471f7120j12262B28842E9073Q4084c42802A36915c18041
$$ 4394 57795 113682 215153 -67120 -179382 228842 59073 143157 -342802 136915 -318041
8890b27311r6465H7858b68408A09398c01364j21181a10115A8990a69179b0968
$$ -227311 -323776 87858 -268408 109398 -301364 -422545 -110115 18990 -169179 -20968
8879e16984i8449k63528I859a55515k39562A10962M9582a09940d0548k9623A06270
$$ -516984 -98449 -361977 9859 -155515 -395077 110962 160544 -109940 -40548 -70171 106270
8867C6515a50561I8303c15490A36351b16535D1373g1209B6001c261k80862C65263
$$ 36515 -150561 98303 -315490 136351 -216535 41373 -71209 26001 -3261 -284123 365263
8855C25689A9349c14448G8319J73729A09397h2747k8155j59996I9363A1401f6204
$$ 325689 19349 -314448 78319 252048 109397 -82747 -110902 -270898 99363 11401 -66204
8843F1369d7464k13250O4254A22678b7901l49361f5899k429j64488A77379a97429
$$ 61369 -47464 -260714 -196460 122678 -27901 -377262 -65899 -68328 -232816 177379 -197429
$$ [...]
##END NTUPLES=NMR SPECTRUM
##END=
