
##TITLE=UV1108_M2_1290-1353_7180768_6d9Npm8vV0
##JCAMPDX= 6.0         $$ Bruker NMR JCAMP-DX V2.0
##DATA TYPE= NMR SPECTRUM
##DATA CLASS= NTUPLES
##ORIGIN= BRUKER
##OWNER= Administrator
$$ 1.72 TOPSPIN		Version 2.1
$$ 2012-12-05 04:30:31.998 -0500  Administrator@X
$$ Compression mode = diff/dup
##.OBSERVE FREQUENCY= 400.02188249412
##.OBSERVE NUCLEUS= ^1H
##.ACQUISITION MODE= SIMULTANEOUS (DQD)
##.ACQUISITION SCHEME= undefined
##.AVERAGES= 64
##.DIGITISER RES= 22
##SPECTROMETER/DATA SYSTEM= spect
##.PULSE SEQUENCE= noesygpps1d.comp
##.SOLVENT NAME= COFFEE_meoh
##.SHIFT REFERENCE= INTERNAL, COFFEE_meoh, 1, 14.9609
##AUDIT TRAIL= $$ (NUMBER, WHEN, WHO, WHERE, PROCESS, VERSION, WHAT)
$$ ##TITLE= Audit trail, TOPSPIN		Version 2.1
$$ ##JCAMPDX= 5.01
$$ ##ORIGIN= Bruker BioSpin GmbH
$$ ##OWNER= Administrator
$$ $$ E:\/data/COFFEE/nmr/UV1108_M2_1290-1353_7180768_6d9Npm8vV0/12/pdata/1/auditp.txt
$$ ##AUDIT TRAIL=  $$ (NUMBER, WHEN, WHO, WHERE, PROCESS, VERSION, WHAT)
(   1,<2012-12-05 04:30:26.076 -0500>,<Administrator>,<X>,<go>,<TOPSPIN 2.1>,
      <created by zg
	started at 2012-12-05 04:18:56.325 -0500,
	POWCHK enabled, PULCHK disabled,
       configuration hash MD5:
       86 BA 57 50 F2 9D 5C 9B 26 00 A9 28 5F 66 2E 89
       data hash MD5: 64K
       0D 6E 9B 12 A9 C4 E1 8F 42 8E DB 6B EA 51 87 69>)
(   2,<2012-12-05 04:30:29.155 -0500>,<Administrator>,<X>,<proc1d>,<TOPSPIN 2.1>,
      <Start of raw data processing
       efp LB = 0.3 FT_mod = 6 PKNL = 1 PHC0 = 0 PHC1 = 0 SI = 128K 
       data hash MD5: 128K
       F8 FD A5 7F 3C 7F DF 46 8E FA 2E EA 93 97 47 68>)
(   3,<2012-12-05 04:30:30.186 -0500>,<Administrator>,<X>,<proc1d>,<TOPSPIN 2.1>,
      <pk PHC0 = -79.23889 PHC1 = 0 
       data hash MD5: 128K
       7A 48 D8 9E 0E A2 C6 81 15 48 CF 53 71 64 3B 2B>)
(   4,<2012-12-05 04:30:30.905 -0500>,<Administrator>,<X>,<proc1d>,<TOPSPIN 2.1>,
      <abs ABSG = 1 
       data hash MD5: 128K
       4D DF BD 2C A3 BE 1F A0 FF A5 64 BE 0B 32 89 4C>)
(   5,<2012-12-05 04:30:31.076 -0500>,<Administrator>,<X>,<proc1d>,<TOPSPIN 2.1>,
      <abs ABSG = 2 
       data hash MD5: 128K
       9C AC 6F 36 3A E3 C3 41 89 85 C9 3D BA 06 7B 13>)
(   6,<2012-12-05 04:30:31.264 -0500>,<Administrator>,<X>,<proc1d>,<TOPSPIN 2.1>,
      <abs ABSG = 3 
       data hash MD5: 128K
       80 82 3F 81 87 82 A2 5F 5C 9C 86 0A 84 3C CE AC>)
(   7,<2012-12-05 04:30:31.451 -0500>,<Administrator>,<X>,<proc1d>,<TOPSPIN 2.1>,
      <abs ABSG = 4 
       data hash MD5: 128K
       7F 18 62 B5 D4 4D 21 E1 0F F6 0B 7E 94 10 01 30>)
(   8,<2012-12-05 04:30:31.655 -0500>,<Administrator>,<X>,<proc1d>,<TOPSPIN 2.1>,
      <abs ABSG = 5 
       data hash MD5: 128K
       71 D8 5C 5E 37 FB 04 89 2F FB C5 DA A9 57 D1 62>)
$$ ##END=
$$ 
$$ $$ hash MD5
$$ $$ E7 BE 78 BE 6B 83 C7 25 76 DB 01 22 9A B7 E2 F1
##$RELAX= 
##$RELAX= 
##$RELAX= 
##$RELAX= 
##$RELAX= 
##$RELAX= 
##$RELAX= 
##$RELAX= 
$$ Bruker specific parameters
$$ --------------------------
##$DU= <E:\>
##$EXPNO= 12
$$ [...]
150 150 150 150 150 150 150 150
##$TP07= 0
##$TPNAME0= <>
##$TPNAME1= <>
##$TPNAME2= <>
##$TPNAME3= <>
##$TPNAME4= <>
##$TPNAME5= <>
##$TPNAME6= <>
##$TPNAME7= <>
##$TPOAL= (0..7)
0.5 0.5 0.5 0.5 0.5 0.5 0.5 0.5
##$TPOFFS= (0..7)
0 0 0 0 0 0 0 0
##$TUNHIN= 0
##$TUNHOUT= 0
##$TUNXOUT= 0
##$USERA1= <user>
##$USERA2= <user>
##$USERA3= <user>
##$USERA4= <user>
##$USERA5= <user>
##$V9= 5
##$VALIST= <valist>
##$VCLIST= <CCCCCCCCCCCCCCC>
##$VD= 0
##$VDLIST= <DDDDDDDDDDDDDDD>
##$VPLIST= <PPPPPPPPPPPPPPP>
##$VTLIST= <TTTTTTTTTTTTTTT>
##$WBST= 2048
##$WBSW= 25
##$XGAIN= (0..3)
0 0 0 0
##$XL= 0
##$YL= 0
##$YMAX_a= 5258637
##$YMIN_a= -11488559
##$ZGOPTNS= <>
##$ZL1= 120
##$ZL2= 120
##$ZL3= 120
##$ZL4= 120
##$ABSF1= 14.9609
##$ABSF2= -5.597281
##$ABSG= 5
##$ABSL= 3
##$ALPHA= 0
##$AQORDER= 0
##$ASSFAC= 0
##$ASSFACI= 0
##$ASSFACX= 0
##$ASSWID= 0
##$AUNMP= <proc_prof1d_extract.lims>
##$AXLEFT= 0
##$AXNAME= <>
##$AXNUC= <1H>
##$AXRIGHT= 0
##$AXTYPE= 0
##$AXUNIT= <>
##$AZFE= 0.1
##$AZFW= 0.1
##$BCFW= 0
##$BC_mod= 0
##$BYTORDP= 0
##$COROFFS= 0
##$CY= 15
##$DATMOD= 1
##$DC= 0
##$DFILT= <>
##$DTYPP= 0
##$F1P= 0
##$F2P= 0
##$FCOR= 0.5
##$FTSIZE= 131072
##$FT_mod= 6
##$GAMMA= 0
##$GB= 0
##$INTBC= 1
##$INTSCL= 1
##$ISEN= 128
##$LB= 0.3
##$LEV0= 0
##$LPBIN= 0
##$MAXI= 10000
##$MC2= 0
##$MEAN= 0
##$ME_mod= 0
##$MI= 0
##$NCOEF= 0
##$NC_proc= -2
##$NLEV= 6
##$NOISF1= 0
##$NOISF2= 0
##$NSP= 0
##$NTH_PI= 0
##$NZP= 0
##$OFFSET= 14.9609
##$PC= 1
##$PHC0= -79.23889
##$PHC1= 0
##$PH_mod= 1
##$PKNL= yes
##$PPARMOD= 0
##$PPDIAG= 0
##$PPIPTYP= 0
##$PPMPNUM= 2147483647
##$PPRESOL= 1
##$PSCAL= 4
##$PSIGN= 0
##$PYNMP= <proc.py>
##$REVERSE= no
##$SF= 400.020009676928
##$SI= 131072
##$SIGF1= 0
##$SIGF2= 0
##$SINO= 400
##$SIOLD= 131072
##$SPECTYP= <>
##$SREGLST= <1H.CDCl3>
##$SSB= 0
##$STSI= 131072
##$STSR= 0
##$SW_p= 8223.68421052631
##$SYMM= 0
##$S_DEV= 0
##$TDeff= 65536
##$TDoff= 0
##$TI= <>
##$TILT= no
##$TM1= 0
##$TM2= 0
##$TOPLEV= 0
##$USERP1= <user>
##$USERP2= <user>
##$USERP3= <user>
##$USERP4= <user>
##$USERP5= <user>
##$WDW= 1
##$XDIM= 131072
##$YMAX_p= 426931179
##$YMIN_p= -12563
##$CURPLOT= <Network HP LaserJet P1505>
##$CURPRIN= <$Network HP LaserJet P1505>
##$DFORMAT= <normdp>
##$LAYOUT= <+/1D_H.xwp>
##$LFORMAT= <normlp>
##$PFORMAT= <normpl>
##$SURQMSG= 1
$$ End of Bruker specific parameters
$$ ---------------------------------
##NTUPLES= NMR SPECTRUM
##VAR_NAME=  FREQUENCY,     SPECTRUM/REAL,   SPECTRUM/IMAG
##SYMBOL=    X,             R,               I
##VAR_TYPE=  INDEPENDENT,   DEPENDENT,       DEPENDENT
##VAR_FORM=  AFFN,          ASDF,            ASDF
##VAR_DIM=   131072,        131072,          131072
##UNITS=     HZ,            ARBITRARY UNITS, ARBITRARY UNITS
##FACTOR=    0.0627417313425164, 1,          1
##FIRST=     8223.62146879497, 4036,         -48943
##LAST=      0,             4198,            -48389
##MIN=       0,             -12563,          0
##MAX=       8223.62146879497, 426931179,    0
$$ Real data points
##PAGE= N=1
##DATA TABLE= (X++(R..R)), XYDATA
$$ [...]
61769D52582l67r34q68l70O4L29Q07J606K124J874J292J240J881K637L061L154
61753D70112K833J866M18q07j326j341j287j274j236j291j567j925k225k667l457
61738D54826m192m044k774j192l67m61p15n08q0rk91l19K94J193J684J460Q20
61721D45325L45M03Q63J259J286J090R17P01K34l18n38l28j8J95L74L53l94j955
61703D49794l591m525m830n060n296n138m452l605k956k556k415k669l288l926
61689C95487m166l914l458l160l028k668j828r22o36r63j203j128j437k563l653
61674C60760l485k094o36J36M25N09K82j45k60J8%p47j596j553m70R21J906K262
61656C56233K076J562J032P57P87J000J225J269J057Q58J110J787K234K018J604
$$ y = [452582, 452215, 451281, 450413, 450043, 450107, 450436, 451243, 452849, 454973, 456847, 458139, 459379, 461260, 463897, 466958, 470112, 472945, 474811, 475229, 474422, 473096, 471755, 470468, 469194, 467958, 466667, 465100, 463175, 460950, 458283, 454826, 450634, 446590, 443816, 442624, 442257, 441796, 441081, 440573, 440493, 440484, 440193, 439874, 440168, 441361, 443045, 444505, 445325, 445670, 446073, 446936, 448195, 449481, 450571, 451488, 452189, 452423, 452105, 451567, 451239, 451221, 451416, 451790, 452143, 451749, 449794, 446203, 441678, 436848, 431788, 426492, 421354, 416902, 413297, 410341, 407785, 405370, 402701, 399413, 395487, 391321, 387407, 383949, 380789, 377761, 375093, 373265, 372343, 371707, 370744, 369541, 368413, 366976, 364413, 360760, 357275, 355181, 354545, 354681, 355106, 355615, 355897, 355752, 355492, 355510, 355510, 354763, 353167, 351614, 351144, 352065, 353971, 356233, 358309, 359871, 360903, 361660, 362447, 363447, 364672, 365941, 366998, 367856, 368966, 370753, 372987, 375005, 376609]
61641C76609J772K459K743K146J375J420K167K467J521j97j605k200k316k455
61627C85906k815l362l875l859k945j552p20r73j688j932j521r04m49k85n46j143
61611C57337j565j522j586k478l864m594m208l381k836k608k616l021l606l589
61597C15863k713j847j779k030j690r80r50j746k287j811r18o58j182j827k073
61582B91372j906j448q17k93j48k36q2L88N34k16j437j948j155J76P97L73l07
61565B83647m49j18J08j4j84q9K05M13M56N31Q02J144J343J485J829K267K244
61548B95620J523O88M56P35Q56O20N11Q00J097J035Q28Q18R10Q33O12L26k13j072
61530C06983j713j459l83O97J174J126Q21K39o52j455j593j026m33n21j260j956
$$ y = [376609, 378381, 380840, 383583, 385729, 387104, 388524, 390691, 393158, 394679, 394482, 392877, 390677, 388361, 385906, 383091, 379729, 375854, 371995, 369050, 367498, 366778, 365805, 364117, 362185, 360664, 359760, 359311, 359026, 358480, 357337, 355772, 354250, 352664, 350186, 346322, 341728, 337520, 334139, 331303, 328695, 326079, 323058, 319452, 315863, 313150, 311303, 309524, 307494, 305804, 304824, 303874, 302128, 299841, 298030, 297112, 296454, 295272, 293445, 291372, 289466, 288018, 287201, 286908, 286760, 286524, 286442, 286830, 287364, 287148, 285711, 283763, 282608, 282784, 283581, 283954, 283647, 283198, 283080, 283188, 283174, 282990, 282901, 283106, 283519, 283975, 284506, 285308, 286452, 287795, 289280, 291109, 293376, 295620, 297143, 297831, 298287, 299022, 299878, 300498, 301009, 301809, 302906, 303941, 304769, 305587, 306497, 307330, 307942, 308268, 308055, 306983, 305270, 303811, 303428, 304125, 305299, 306425, 307246, 307485, 306833, 305378, 303785, 302759, 302326, 301805, 300545, 298589]
61514B98589k095j820j463q96J99J523K211J900J226R69J087J038P58O74Q22O32
61498C05354j66r59r23r2O96Q13M70K04J57Q1l1J70Q34J530J715J393J059J067
61480C13372J351J608J489P36n02j461j378l91M85M68k42q90r73m62L96J110J120
61463C15836K93q62j701k049k080j873j358o10J25O41Q82R00Q55Q91R36O97N2
61446C11575p39j287j345q33J86J323J999K018J823J990K607L317L705L527K858
61431C32724K231K205K568K401J337K40J77J044J881K253K531K930L085K757K301
61416C62665K102K007J605P90j30o99o16k4M87M57J19P1L77M45j11r20j331j107
61398C66187m76K33P74J048J128J111Q70J71q41j618j716j224n31M9L27K06j92
$$ y = [298589, 296494, 294674, 293211, 292315, 292514, 294037, 296248, 298148, 299374, 300343, 301430, 302468, 303226, 303900, 304722, 305354, 305188, 304229, 303306, 303214, 303910, 304723, 305193, 305397, 305554, 305635, 305604, 305774, 306608, 308138, 309853, 311246, 312305, 313372, 314723, 316331, 317820, 318556, 318054, 316593, 315215, 314824, 315309, 315777, 315535, 314645, 313672, 313210, 313606, 314716, 315836, 316129, 315267, 313566, 311517, 309437, 307564, 306206, 305596, 305721, 306362, 307244, 308144, 308999, 309890, 310826, 311523, 311575, 310836, 309549, 308204, 307371, 307557, 308880, 310879, 312897, 314720, 316710, 319317, 322634, 326339, 329866, 332724, 334955, 337160, 339728, 342129, 343466, 343706, 343883, 344927, 346808, 349061, 351592, 354522, 357607, 360364, 362665, 364767, 366774, 368379, 369169, 369039, 368340, 367724, 367700, 368187, 368644, 368763, 368834, 369211, 369656, 369545, 368625, 367294, 366187, 365711, 365944, 366718, 367766, 368894, 370005, 370875, 371046, 370205, 368587, 366871, 365647, 365116, 365165, 365492, 365698, 365506]
61381C65506n78p65q41r06q94p07m49l26m22n58l85K99J160J458Q73L3j68K37
61363C62567M03j5l16K10J201J725J535J291J678K704L784M248L858L173L243
61348C91289M594O542P771P591O378M896L608K644K032J765J768J962K238K427
61334D47505K452K504K732K716J720l04k266k927k251j340j044j061o85N7N11
61319D48319M46M27R98K015L026L937M861N614N887N841O028O690P564Q492R712
61304E19857J1313J2766J3365J2918J1704R964P788N379L055R89q22k328l469
61291F02479m339n089n659n933o139o719p666q304q033p085o266o070o244o197
61277E12736n543m273k710j370o16k81J56Q44J262R09J29j94K87J128J973L122
$$ y = [365506, 364928, 364163, 363322, 362416, 361522, 360815, 360366, 360040, 359618, 359060, 358675, 358974, 360134, 361592, 362465, 362498, 362330, 362567, 362970, 362955, 362639, 362849, 364050, 365775, 367310, 368601, 370279, 372983, 376767, 381015, 384873, 388046, 391289, 395883, 402425, 410196, 417787, 424165, 429061, 432669, 435313, 437345, 439110, 440878, 442840, 445078, 447505, 449957, 452461, 455193, 457909, 459629, 459325, 457059, 454132, 451881, 450541, 449497, 448436, 447751, 447808, 448319, 448765, 449192, 450190, 452205, 455231, 459168, 464029, 469643, 475530, 481371, 487399, 494089, 501653, 510145, 519857, 531170, 543936, 557301, 570219, 581923, 591887, 599675, 605054, 608109, 609098, 608276, 605948, 602479, 598140, 593051, 587392, 581459, 575320, 568601, 560935, 552631, 544598, 537513, 531247, 525177, 518933, 512736, 507193, 502920, 500210, 498840, 498224, 497943, 498099, 498943, 500205, 501114, 501243, 501049, 501336, 502464, 504437, 507559]
61261E07559M826O418O866O063N041M742N032N114M545L580K712K169J796J278
61247E67741M94k78o50o26o03q34j139j273j326j480j660j694j726k022k433k396
61231E48095j572k42J040J981K647L269M076N134O211O876O955O788O889P372
61217F05519P930Q293Q526Q744Q819Q565Q067P560P019O153M904L677K947K773
61203F99496K915L173L420L564L839M937P312J0343J2692J3687J3871J4033J4146
61190H07428J3682J2493J0822Q678N912K924O09n77j043j387j780k219k921l995
61176H48626n070n802o486p641r087j0009j0007r550r229r110r067r245r779j0387
61162G28157j0694j0734j0665j0213r028p492o476o127n542l982j899l01N73J433
$$ y = [507559, 512385, 518803, 525669, 531732, 536773, 541515, 546547, 551661, 556206, 559786, 562498, 564667, 566463, 567741, 568235, 567957, 567307, 566681, 566078, 565244, 564105, 562832, 561506, 560026, 558366, 556672, 554946, 552924, 550491, 548095, 546523, 546281, 547321, 549302, 551949, 555218, 559294, 564428, 570639, 577515, 584470, 591258, 598147, 605519, 613449, 621742, 630268, 639012, 647831, 656396, 664463, 672023, 679042, 685195, 690099, 693776, 696723, 699496, 702411, 705584, 709004, 712568, 716407, 721344, 728656, 738999, 751691, 765378, 779249, 793282, 807428, 821110, 833603, 844425, 853103, 859015, 861939, 862548, 861971, 860928, 859541, 857761, 855542, 852621, 848626, 843556, 837754, 831268, 823627, 814540, 804531, 794524, 784974, 775745, 766635, 757568, 748323, 738544, 728157, 717463, 706729, 696064, 685851, 676823, 669331, 662855, 656728, 651186, 647204, 645305, 645004, 645577, 647010]
61148F47010K885M607N629N197L381J029r02k082k781l186l034k068n15J237L087
61133F59494N034O760P897Q500Q934R425J0190J1641J3942J6548J8815K0859K3086
61120H21125K5041K5824K5634K5868K7297K9185L0644L1783L2817L3122L2302
61109A140642L1413L1761L2845L2770L0688K7640K4853K2301J9330J5778J1929
61098A421950P970L962J8l835p575j0956j3764j6325j9102k1774k3423k3929k4288
61085A268929k5174k5968k5820k4939k4081k3342k2409k1489k1013k0578j9256
61074A014860j7069j5212j4541j4579j4385j3717j2870j1901j0634r205q075p502
61062H65170p343p258o843n684l760j832r26j146j379n45J114K537L445M661O663
$$ y = [647010, 649895, 654502, 660131, 665328, 668709, 669738, 668836, 666754, 663973, 660787, 657753, 655685, 655170, 656407, 659494, 664528, 671288, 679185, 687685, 696619, 706044, 716234, 727875, 741817, 758365, 777180, 798039, 821125, 846166, 871990, 897624, 923492, 950789, 979974, 1010618, 1042401, 1075218, 1108340, 1140642, 1172055, 1203816, 1236661, 1269431, 1300119, 1327759, 1352612, 1374913, 1394243, 1410021, 1421950, 1429920, 1433882, 1433900, 1430065, 1422490, 1411534, 1397770, 1381445, 1362343, 1340569, 1317146, 1293217, 1268929, 1243755, 1217787, 1191967, 1167028, 1142947, 1119605, 1097196, 1075707, 1054694, 1034116, 1014860, 997791, 982579, 968038, 953459, 939074, 925357, 912487, 900586, 889952, 880747, 872672, 865170, 857827, 850569, 843726, 838042, 834282, 832450, 831524, 830378, 828999, 828454, 829568, 832105, 835550, 840211, 846874]
61047H46874Q657R693J0113J1014J2699J4570J6325J8184J9917K0878K1348K2576
61035A032848K4984K7365K8719K9788L1764L4353L6283L7027L6885L5943L4497
61024A390456L4057L6412M1667M8526N6306O5219P4817Q3873R2268J01632J13901
61013B139134J30699J54314J87406K31038K84350L46670M18590N01412N98601
61004D992214P18424Q71758J065371J299083J565502J837059K041235K061607
60996A6452253J799106J261811N96053J2281l35060m08913k60539K3652L33282
60987A9473926N24087M53950O9688n36311j169917j649748j894539j924975j809289
60978A1536872j615217j393679j178629r87435q23717o85207n69745m74876l96490
$$ y = [846874, 855531, 865224, 875337, 886351, 899050, 913620, 929945, 948129, 968046, 988924, 1010272, 1032848, 1057832, 1085197, 1113916, 1143704, 1175468, 1209821, 1246104, 1283131, 1320016, 1355959, 1390456, 1424513, 1460925, 1502592, 1551118, 1607424, 1672643, 1747460, 1831333, 1923601, 2025233, 2139134, 2269833, 2424147, 2611553, 2842591, 3126941, 3473611, 3892201, 4393613, 4992214, 5710638, 6582396, 7647767, 8946850, 10512352, 12349411, 14390646, 16452253, 18251359, 19513170, 20109223, 20121504, 19786444, 19377531, 19116992, 19140644, 19473926, 19998013, 20451963, 20521651, 19985340, 18815423, 17165675, 15271136, 13346161, 11536872, 9921655, 8527976, 7349347, 6361912, 5538195, 4852988, 4283243, 3808367, 3411877]
60969C411877l31134k78054k36947k05156j78967j56577j38013j23012j10544
60960A653473r9827r0265q0881p1051o1419n2916m5401l8460l2906k9992k9272
60949A021083k8797k7466k5898k4724k3366k1104j8343j6088j4707j3837j3219
60938G93534j3043j3556j4560j5385j5348j4346j2952j1886j1468j1618j2030
60927F47342j2216j1724j0592r324q289p482o975o966p138o702n569m718m795
60914E44852n049m516l520l005k909k393j408p84p93p96m57k71n75r45r18n66
60898E15947j56J27n6j011k347l248l532l768m182m270l801l377l572m151m688
60883D73915n205n764n969n535m890m602m494l938k838j837j530j805j996j484
$$ y = [3411877, 3080743, 2802689, 2565742, 2360586, 2181619, 2025042, 1887029, 1764017, 1653473, 1553646, 1463381, 1382500, 1311449, 1250030, 1197114, 1151713, 1113253, 1080347, 1050355, 1021083, 992286, 964820, 938922, 914198, 890832, 869728, 851385, 835297, 820590, 806753, 793534, 780491, 766935, 752375, 736990, 721642, 707296, 694344, 682458, 670990, 659372, 647342, 635126, 623402, 612810, 603486, 595197, 587715, 580740, 573774, 566636, 559934, 554365, 549647, 544852, 539803, 535287, 531767, 528762, 525853, 523460, 522052, 521268, 520475, 519679, 519222, 518951, 518376, 517431, 516513, 515947, 515791, 515918, 515862, 514851, 512504, 509256, 505724, 501956, 497774, 493504, 489703, 486326, 482754, 478603, 473915, 468710, 462946, 456977, 451442, 446552, 441950, 437456, 433518, 430680, 428843, 427313, 425508, 423512, 422028]
60869D22028k84R77J765K221K791L409L582L321L286L761M054L382J949P36M22
60854D57400Q67J434J572J234Q98R94J231Q07o32k500l866m241l664k504j392
60839D47638j035j739l242n052o638p329o674n158m074m215m992n189m359l141
60825C84801k428k532l058l294k882k185j897k253k853l274l454l427l125k627
60811C45512k194j843j344q24q94j717k427k006n00J075J910K033J874J663J364
60796C41682R64N90L82L10K35J77L25O86R31Q71P89R18Q96L15m32n30O0N59N20
60777C50248K41n5o03j336j607j101m08k19n02p96q04l68N24J366J396N79k94
60760C46261p68j148j486j122OO86j6j246j486o77l5j37l58j20M35J093J975K985
$$ y = [422028, 421744, 422721, 424486, 426707, 429498, 432907, 436489, 439810, 443096, 446857, 450911, 454293, 456242, 456978, 457400, 458267, 459701, 461273, 462507, 463405, 464399, 465630, 466437, 465805, 463305, 459439, 455198, 451534, 449030, 447638, 446603, 444864, 441622, 436570, 429932, 422603, 415929, 410771, 406697, 402482, 397490, 392301, 387942, 384801, 382373, 379841, 376783, 373489, 370607, 368422, 366525, 364272, 361419, 358145, 354691, 351264, 348139, 345512, 343318, 341475, 340131, 339307, 338413, 336696, 334269, 332263, 331763, 332838, 334748, 336781, 338655, 340318, 341682, 342646, 343236, 343618, 343928, 344163, 344340, 344665, 345351, 346282, 347153, 347942, 348860, 349756, 350071, 349639, 349109, 349169, 349728, 350248, 350489, 350434, 349831, 348495, 346888, 345787, 345379, 345160, 344658, 343862, 343058, 342690, 343214, 344580, 345976, 346555, 346261, 345493, 344345, 342859, 341737, 341743, 342429, 342413, 341167, 339681, 339004, 338969, 338832, 338474, 338354, 338789, 339882, 341857, 344842]
60742C44842L526L054J591l47k071l044l228l060k843k473j967j658j606j346
60728C29370q03o81j339j911j516o47l07k86L71J567K193J913J531J466J207N70
60712C32698K04L66L52k44p08l68K58L02j73n19o39r11j294j363j148j163j562
60695C24088j811j475q97q00j291j671j319n27o2l9J80Q56J318J036O19J009K084
60678C21298K887K961K670K358K058J912K002J807P94m48p65j89l2q85j747j727
60662C34954j424j715k175j803o93J61L88N09Q64J183J289J411J694K021K372
60647C39036K854L272L191K501J533N93k42r02j376j975l021m083m167k961j468
60632C32785r50j475j991j712r00k26J17L91P27R76J081J164J211R84L87k79o55
$$ y = [344842, 348368, 351422, 353013, 352666, 350595, 347551, 344323, 341263, 338420, 335947, 333980, 332322, 330716, 329370, 328567, 327886, 326547, 324636, 323120, 322473, 322166, 321880, 322251, 323818, 326011, 327924, 329455, 330921, 332128, 332698, 332902, 333268, 333620, 333376, 332668, 332300, 332558, 332860, 332687, 332168, 331529, 330618, 329324, 327961, 326813, 325650, 324088, 322277, 320802, 319905, 319105, 317814, 316143, 314824, 314297, 314235, 314196, 314376, 315232, 316550, 317586, 318205, 319214, 321298, 324185, 327146, 329816, 332174, 334232, 336144, 338146, 339953, 340747, 340299, 339534, 339345, 339313, 338428, 336681, 334954, 333530, 331815, 329640, 327837, 327144, 327305, 327693, 328202, 329066, 330249, 331538, 332949, 334643, 336664, 339036, 341890, 345162, 348353, 350854, 352387, 352980, 352738, 351836, 350460, 348485, 345464, 341381, 337214, 334253, 332785, 331835, 330360, 328369, 326657, 325757, 325531, 325648, 326039, 326766, 327742, 328823, 329987, 331198, 332182, 332569, 332290, 331635]
60615C31635p24o89n83k19M52J127J347R44K31l28o45j026j499j499n96O30J046
60598C29604L69n12p06k73K51O22Q37Q31P72J095J892K588K649K157J359K84p35
60581C43084q52K26J557K156K286K722L276L170K539K425L325M779O300P753Q874
60566C93620R397R667J0178J0567J0003Q476O656M591J762j498l956n125n736
60553D48602o216n962m637k964j548k4J904L509M065M022M357N270O326P378Q691
60538D72773J0535J2991J5762J7934J8638J8161J7509J6671J4415J0265N474J332
60526F32460k267n647q044q755q620q912r429r099q009p311p307p084o016m534
60512E31426l195j962o06R46K663M336N562O441P917J0680J4130J7311K0464K4517
$$ y = [331635, 330911, 330222, 329639, 329420, 329872, 330999, 332346, 333290, 333521, 333193, 332548, 331522, 330023, 328524, 327928, 328558, 329604, 329973, 329461, 328755, 328482, 328733, 329355, 330192, 331023, 331795, 332890, 334782, 337370, 340019, 342176, 343535, 343819, 343084, 342232, 342458, 344015, 346171, 348457, 351179, 354455, 357625, 360164, 362589, 365914, 370693, 376993, 384746, 393620, 403017, 412684, 422862, 433429, 443432, 451908, 458564, 463155, 464917, 463419, 459463, 454338, 448602, 442386, 436424, 431787, 428823, 427275, 427251, 429155, 432664, 436729, 440751, 445108, 450378, 456704, 464082, 472773, 483308, 496299, 512061, 529995, 548633, 566794, 584303, 600974, 615389, 625654, 631128, 632460, 630193, 624546, 616502, 607747, 599127, 590215, 580786, 571687, 563678, 556367, 549060, 541976, 535960, 531426, 528231, 526269, 525663, 526609, 529272, 533608, 539170, 545611, 553528, 564208, 578338, 595649, 616113, 640630]
60498F40630K9307L3555L6638L9196M1766M3800M4502M3671M1379L7497L1914
60487A063855K4713J5919N575n707j6845k6946l5518m2138m6598m9296n0672n0344
60475G85998m7684m3255l8659l4693l0741k6313k2179j9260j7317j5581j3980
60464D76336j2903j2135j0969r230p427o000n003m467m435m563m286l536k929
60451C88453k941l263l224k720k274k228k209j741j059q94j367j716j332o41m96
60436C60348r76j379j225p98n89p50j115j439j470j124o32k93r0J95N33P09P28
60419C50633P77Q00O24M71Q05J501J763J197M46L42P94J063Q81P32J026J533J780
60402C67168J667J411J124P76M93N48R47J298J300J162J304J775K267K517K419
$$ y = [640630, 669937, 703492, 740130, 779326, 821092, 864892, 909394, 953065, 994444, 1031941, 1063855, 1088568, 1104487, 1110062, 1104355, 1087510, 1060564, 1025046, 982908, 936310, 887014, 836342, 785998, 738314, 695059, 656400, 621707, 590966, 564653, 542474, 523214, 505897, 490316, 476336, 463433, 451298, 440329, 431099, 423672, 417672, 412669, 408202, 403767, 399204, 394918, 391382, 388453, 385512, 382249, 379025, 376305, 374031, 371803, 369594, 367853, 366794, 365900, 364533, 362817, 361485, 360844, 360348, 359372, 357993, 356768, 355970, 355381, 354631, 353516, 352077, 350607, 349483, 348851, 348558, 348468, 348663, 349196, 349905, 350633, 351410, 352210, 352834, 353305, 354110, 355611, 357374, 358571, 359017, 359359, 360153, 361216, 362097, 362829, 363855, 365388, 367168, 368835, 370246, 371370, 372146, 372639, 373187, 374134, 375432, 376732, 377894, 379198, 380973, 383240, 385757, 388176]
60387C88176J918J198Q21J147J663J561J038J154K166K871K224Q37P9K47N37N14
60371D08151N43Q60J094R39O24N28P49J207J737K047J989J891K171K660K776K437
60355D32403K336L111M618O101O806O390N011L181J308n23k248l523m015l851
60341D57105l417k938k554k525k863l072k717k084j708j491r30n9N17M59p0r11
60325D30742j927k619k467j729j162r09l79O60J705K414L117M106N103N872O648
60310D49175P559Q167Q089P608P264P243P586Q532J0053J1364J1405R832P230
60297E61107M367J438j975o208j0660j3857j4697j3542j1715j0002q308o560n145
60284D64243m189l230k029j124j034j449j741j847k132k652l134l458l724l856
$$ y = [388176, 390094, 391292, 392113, 393260, 394923, 396484, 397522, 398676, 400842, 403713, 405937, 406774, 406853, 407100, 407637, 408151, 408694, 409554, 410648, 411587, 412211, 412739, 413488, 414695, 416432, 418479, 420468, 422359, 424530, 427190, 429966, 432403, 434739, 437850, 442468, 448569, 455375, 461765, 466776, 469957, 471265, 470742, 468494, 464971, 460956, 457105, 453688, 450750, 448196, 445671, 442808, 439736, 437019, 434935, 433227, 431736, 430806, 430747, 431264, 431723, 431653, 430742, 428815, 426196, 423729, 422000, 420838, 419929, 419550, 420210, 421915, 424329, 427446, 431552, 436655, 442527, 449175, 456734, 464901, 472990, 480598, 487862, 495105, 502691, 511223, 521276, 532640, 544045, 553877, 561107, 565474, 566912, 564937, 558729, 548069, 534212, 519515, 505973, 494258, 484256, 475948, 469388, 464243, 460054, 456824, 454795, 453671, 452637, 451188, 449447, 447600, 445468, 442816, 439682, 436224, 432500, 428644]
60270D28644l590k845j939j415j629k410l095l161k751k321j851r59K04Q36M96
60255D02214k30m32J51J075J791K009J857J882K511L401L707L128K191J297K66
60240D26818r09j533j132l44j59n96q40m93k2N5j70j98L49J437K560L062K785
60223D30670K337K423L017L472L361K903K600K697L072L516M044M904O172P428
60209D82616Q119Q173P975P704P234O667O421O493O277N473M700M574M671M104
60195E71201K930K166K297K493J666j20j753k478k744l513m992o416p037o876
60181E46824o380n835n482n720o532o993o156m384l030k729k802k520k048j816
60167D84397j727j545j385j227o01O17J577J378K65o56o95l4P56J119P15k32q92
$$ y = [428644, 425054, 422209, 420270, 418855, 417226, 414816, 411721, 408560, 405809, 403488, 401637, 400678, 400882, 401718, 402214, 401984, 401552, 401703, 402778, 404569, 406578, 408435, 410317, 412828, 416229, 419936, 423064, 425255, 426552, 426818, 425909, 424376, 423244, 422900, 422741, 422145, 421305, 420812, 420790, 420845, 420675, 420477, 420826, 422263, 424823, 427885, 430670, 433007, 435430, 438447, 441919, 445280, 448183, 450783, 453480, 456552, 460068, 464112, 469016, 475188, 482616, 490735, 498908, 506883, 514587, 521821, 528488, 534909, 541402, 547679, 553152, 557852, 562426, 567097, 571201, 574131, 576297, 578594, 581087, 582753, 582633, 580880, 578402, 575658, 572145, 567153, 560737, 553700, 546824, 540444, 534609, 529127, 523407, 516875, 509882, 503726, 499342, 496312, 493583, 490781, 488261, 486213, 484397, 482670, 481125, 479740, 478513, 477912, 478529, 480106, 481484, 481749, 481093, 480398, 480364, 481120, 482239, 482954, 482722, 481830]
60150D81830o53J87Q99J268J548J828J939J889J906K112K563L447M829O340P551
60135E19483Q409Q992R014Q129O590N126M216L809L618L379K945K495K436K775
60121E91416K864K203J257R43J495K341K923L061K674J761O81p4n06j034j792
60106F10213k405k581k455k266k081j985k232k971l983m849n289n331n172m839
60092E61774m040k564r23j62p22j783k059j166J49Q72N72m10j264j327p06j30
60076E46111n3k16l45p76j901l374m461n012n417n798n905n803n938o359o469
60061D88284n843m925m488m626m565l583j972r26j267k375k695j346J087L397
60047D54157M876N421N199M705M663N258N750N393M507M056M359M796M651L764
$$ y = [481830, 481177, 481364, 482263, 483531, 485079, 486907, 488846, 490735, 492641, 494753, 497316, 500763, 505592, 511932, 519483, 527892, 536884, 545898, 554027, 560617, 565743, 569959, 573768, 577386, 580765, 583710, 586205, 588641, 591416, 594280, 596483, 597740, 598683, 600178, 602519, 605442, 608503, 611177, 612938, 613619, 613545, 613039, 612005, 610213, 607808, 605227, 602772, 600506, 598425, 596440, 594208, 591237, 587254, 582405, 577116, 571785, 566613, 561774, 557734, 555170, 554247, 554085, 553363, 551580, 549521, 548355, 548504, 549376, 549948, 549538, 548274, 546947, 546241, 546111, 546058, 545842, 545497, 544721, 542820, 539446, 534985, 529973, 524556, 518758, 512853, 507050, 501112, 494753, 488284, 482441, 477516, 473028, 468402, 463837, 460254, 458282, 457356, 456089, 453714, 451019, 449673, 450760, 454157, 459033, 464454, 469653, 474358, 479021, 484279, 490029, 495422, 499929, 503985, 508344, 513140, 517791, 521555]
60033E21555K435J164L99J52m5n29j151j788k772m319n973p206q179r273j0185
60018D74285j0263r460q252o880n440m448m319m459l871k696k171k824l671l565
60004D01966k542j483j046j302j863k056j435m30N3j57k04O29J963K875K983K695
59988D00646K668L245M191M844M743M075L236K209R09j58l57k7k35j310k442k943
59972D23294l091l303l322k772j889j143n63Q1Q07J524K217K655K425J691J362
59957D19973K000K931L102K424J689J325R98M37l5QM47P47N78R1l26m65m05k92
59939D35227k06k66o67j340j780j565q99k92K41J168K611M021M823M947M578L752
59923D54353K457Q38q20k153k794k745k538k636k726k115q22L76J096J816K921
$$ y = [521555, 523990, 525154, 525553, 525705, 525660, 525131, 523980, 522192, 519420, 515101, 509128, 501922, 493743, 484470, 474285, 464022, 454562, 446310, 439430, 433990, 429542, 425223, 420764, 416893, 414197, 412026, 409202, 405531, 401966, 399424, 397941, 396895, 395593, 393730, 391674, 390239, 389809, 389862, 389705, 389501, 390130, 392093, 394968, 397951, 400646, 403314, 406559, 410750, 415594, 420337, 424412, 427648, 429857, 430766, 430608, 430251, 430224, 429989, 428679, 426237, 423294, 420203, 416900, 413578, 410806, 408917, 407774, 407211, 407292, 408099, 409623, 411840, 414495, 416920, 418611, 419973, 421973, 424904, 428006, 430430, 432119, 433444, 434442, 434879, 434844, 434852, 435299, 436046, 436624, 436715, 436389, 435924, 435519, 435227, 435021, 434755, 434088, 432748, 430968, 429403, 428504, 428212, 428453, 429621, 432232, 436253, 441076, 446023, 450601, 454353, 456810, 457648, 456828, 454675, 451881, 449136, 446598, 443962, 441236, 439121, 438299, 438675, 439771, 441587, 444508]
59908D44508L924M131L600K923K406J950J552J402J505J511J045J50o03n68K22
59893D69658R42R47O66R76J871K496K505K584L292M171M473M205L896L809L888
59878E10379M153M585M894M823M454L883K876J289m20j570k014k190k490k884
59864E29768l032k559j408m5Q64J194J427J917K414K673K985L712M664N454O209
59849E56237P362Q744R431Q558O074K751l02k182k598j863m88J101K391K639J331
59834E99186j178l694n010m817l848l080k734k234j255m70q38k347m061n292o107
59819E52221o664o762o340n759n230m514l514k731k605k802k633j924j044l49
59805D99350L5N0k21m01j34M39P16K49o82j246q99j42o0r19j711j522q79r06j537
$$ y = [444508, 448432, 452563, 456163, 459086, 461492, 463442, 464994, 466396, 467901, 469412, 470457, 470607, 470004, 469436, 469658, 470600, 471547, 472213, 473189, 475060, 477556, 480061, 482645, 485937, 490108, 494581, 498786, 502682, 506491, 510379, 514532, 519117, 524011, 528834, 533288, 537171, 540047, 541336, 540916, 539346, 537332, 535142, 532652, 529768, 526736, 524177, 522769, 522724, 523588, 524782, 526209, 528126, 530540, 533213, 536198, 539910, 544574, 550028, 556237, 563599, 572343, 581774, 590332, 596406, 599157, 598855, 596673, 594075, 592212, 591724, 592825, 595216, 597855, 599186, 598008, 594314, 589304, 584487, 580639, 577559, 574825, 572591, 571336, 570866, 570028, 567681, 563620, 558328, 552221, 545557, 538795, 532455, 526696, 521466, 516952, 513438, 510707, 508102, 505300, 502667, 500743, 499699, 499350, 499385, 499435, 499214, 498813, 498679, 499118, 499834, 500083, 499401, 498155, 497256, 497114, 497054, 496135, 494424, 492902, 492023, 491117, 489580]
59786D89580j687j143r88j870k979l367l225l120k879k081j034l64j04M6N2j38
59770D64699q0O06J457J735J452J112Q13L58M0M62J614K852L681M073M100L882
59754D92856L789M195N033O000O987P892Q325Q079P586P386P332O917O156N515
59740E84048N172M867M379L625K494J128J05k14l37r90k104l054l582l701l126
59725E88710j685k01J39p48j831k440k741k770k104r14k69q10j877k527k696k758
59709E62478k547j629j78J153K018K523K639K182J382R89J516K626L531L905M144
59694E86732M740N573O039N694M524K728O74q83j206m66K56K55r5l15q31k142
59678F11277l521l646k555j829k625m371n768o370o566o658o487n864m890l888
$$ y = [489580, 487893, 486750, 485762, 483892, 480913, 477546, 474321, 471201, 468322, 466241, 465207, 464843, 464739, 464785, 464837, 464699, 464619, 465225, 466682, 468417, 469869, 470981, 471794, 472152, 472192, 472654, 474268, 477120, 480801, 484874, 488974, 492856, 496645, 500840, 505873, 511873, 518860, 526752, 535077, 543156, 550742, 558128, 565460, 572377, 578533, 584048, 589220, 594087, 598466, 602091, 604585, 605713, 605818, 605604, 605267, 604277, 602173, 599119, 595537, 591836, 588710, 587025, 586824, 586963, 586215, 584384, 581944, 579203, 576433, 574329, 573415, 573146, 572336, 570459, 567932, 565236, 562478, 559931, 558302, 558124, 559277, 561295, 563818, 566457, 568639, 570021, 571010, 572526, 575152, 578683, 582588, 586732, 591472, 597045, 603084, 608778, 613302, 616030, 616704, 615821, 614615, 614149, 614405, 614660, 614565, 614250, 613419, 611277, 607756, 604110, 601555, 599726, 597101, 592730, 586962, 580592, 574026, 567368, 560881, 555017, 550127, 546239]
59664E46239l191k862k605k084j417j010r59r10n21K25J190K257L200L803M116
59649E45471M300M205L483K179Q07k99j336k535l707m524m966n159n036m433l464
59634E24986k562k107k093k196k143j953j793j713j755k195l211m192m039k596
59620D90438j247j406k803l986m307m364m569m361l313k075j527j500j104qJ200
59605D55068J916K098J993J707J311J041J082J319J493J599J856K269K462K100
59591D79314J386Q10N19K64r8l71l59j04K61N49M29k70j087j286q31m20m33n17
59573D77756n42j056k205k982k458j149k72o2J99P29R49N57J1k19j50J0Pn32j589
59554D67002k265j614L5J362J675J430J161Q87Q09J528L077M552N277N757O917
$$ y = [546239, 543048, 540186, 537581, 535497, 534080, 533070, 532111, 531201, 530680, 530905, 532095, 534352, 537552, 541355, 545471, 549771, 553976, 557459, 559638, 560445, 560146, 558810, 556275, 552568, 548044, 543078, 537919, 532883, 528450, 524986, 522424, 520317, 518224, 516028, 513885, 511932, 510139, 508426, 506671, 504476, 501265, 497073, 493034, 490438, 489191, 487785, 484982, 480996, 476689, 472325, 467756, 463395, 460082, 458007, 456480, 454980, 453876, 453868, 455068, 456984, 459082, 461075, 462782, 464093, 465134, 466216, 467535, 469028, 470627, 472483, 474752, 477214, 479314, 480700, 481510, 482029, 482293, 482195, 481824, 481465, 481361, 481622, 482171, 482600, 482330, 481243, 479957, 479126, 478706, 478273, 477756, 477214, 476158, 473953, 470971, 468513, 467364, 467092, 467030, 467229, 467958, 468907, 469464, 469475, 469256, 469106, 469116, 469123, 468591, 467002, 464737, 463123, 463158, 464520, 466195, 467625, 468786, 469673, 470482, 472010, 475087, 479639, 484916, 490673, 497590]
59539D97590R007J1769J5102J8655K0919J9612J3571M314m572r927j1176j0001
59527E74863q013n463k319M21J622J675J962K776L009K025O08l91j189k256l304
59512E66026l849m080m477n095n804o611p260p055n852m634m367m682m492l690
59498D94078l237l590l886l021j067Q19J674J587J258J000N18k88p20k0J538K801
59482D89444L090K805K629K705K883L254L986M902N581N761N457M796L911K843
59468E44047J554K03p28q82n69m00n19n94m21J1R33K585M528N924O608P167P846
59451E77293Q098P561O692O099N856N758N625M977L234O28j676k980l887n172
59437F18106o468o852o230n331m602l856k939k043j440j286j637k134j931l95
$$ y = [497590, 506597, 518366, 533468, 552123, 573042, 592654, 606225, 610539, 605967, 596040, 584864, 574863, 566850, 561387, 559068, 559489, 561111, 562786, 564748, 567524, 570533, 572558, 573166, 572775, 571586, 569330, 566026, 562177, 558097, 553620, 548525, 542721, 536110, 528850, 521795, 515943, 511309, 506942, 502260, 497768, 494078, 490841, 487251, 483365, 480344, 479277, 480096, 481770, 483357, 484615, 485615, 486133, 485845, 485125, 485105, 486643, 489444, 492534, 495339, 497968, 500673, 503556, 506810, 510796, 515698, 521279, 527040, 532497, 537293, 541204, 544047, 545601, 545804, 545076, 544194, 543625, 543225, 542706, 542112, 541691, 541702, 542635, 545220, 549748, 555672, 562280, 569447, 577293, 585391, 592952, 599644, 605743, 611599, 617357, 622982, 627959, 631193, 631821, 630145, 627165, 623278, 618106, 611638, 604786, 598556, 593225, 588623, 584767, 581828, 579785, 578345, 577059, 575422, 573288, 571357, 570962]
59423E70962K155M815P137R419J2032J4894J7605J9821K1472K3004K5462K9678
59411G58456L4758L7386L3579K2183O715o913j4975j7917j7885j5594j0456k869
59399H06468N297J2089J5913J4766P180n260j7710k5668k8249k7433k5172k2229
59387G09992j8961j5814j2958j0375q290p048o532o111n166l637k199j773k463
59374F08665l084k450j044m20q62q31P56K785L362K081J10j306j557n28J309L019
59358F10005M142N124O410P678Q517R213J0109J0884J1219J1619J2705J4231J5535
59345G37391J6422J6855J6417J4978J3293J1977J0406P685M171R74j615m093o559
59332H38302q706j0688j2798j4569j5335j5497j5933j6420j5961j4647j3756j3761
$$ y = [570962, 573117, 577932, 585069, 594488, 606520, 621414, 639019, 658840, 680312, 703316, 728778, 758456, 793214, 830600, 864179, 886362, 893077, 886164, 871189, 853272, 835387, 819793, 809337, 806468, 811765, 823854, 839767, 854533, 861713, 856453, 838743, 813075, 784826, 757393, 732221, 709992, 691031, 675217, 662259, 651884, 643594, 636546, 630014, 623903, 618737, 615100, 612901, 611128, 608665, 605581, 603131, 602087, 601667, 600805, 599974, 600730, 603515, 606877, 608958, 609068, 607762, 606205, 605677, 606986, 610005, 614147, 619271, 625681, 633359, 641876, 651089, 661198, 672082, 683301, 694920, 707625, 721856, 737391, 753813, 770668, 787085, 802063, 815356, 827333, 837739, 845424, 849595, 850569, 848954, 844861, 838302, 829596, 818908, 806110, 791541, 776206, 760709, 744776, 728356, 712395, 697748, 683992, 670231]
59320F70231j3624j2446j0649r060p884p104o829o700n838m129k684k335k311
59307E78638j259R39L215M929O646R191J2327J4506J3861R571K570n032j1255
59294F38847j5100j6552j6193j4811j2967j0823q462o268m627l456k339j129k
59281E26118R76J968K978L716L962L920M157N232P220R538J1416J2605J3303J3462
59267F20571J2777J1525J0671J0654J0705R864Q112N953L531R60j127k260k957
59254F98979l947m974n252m783m229l776l148k523k298k082j059N03J243M89q84
59239F62259j691j736j572j648k025k441k414j696o86j2J06l26j557l650n825
59224F35086p128p609q022q485q448p850p254o808o117n243m781m713m319l417
$$ y = [670231, 656607, 644161, 633512, 624452, 616568, 609464, 602635, 595935, 590097, 585968, 583284, 580949, 578638, 577379, 578318, 581533, 586462, 593108, 602299, 614626, 629132, 642993, 652564, 655134, 650102, 638847, 623747, 607195, 591002, 576191, 563224, 552401, 543939, 537671, 533044, 529588, 527249, 526120, 526118, 527094, 529062, 532040, 535756, 539718, 543638, 547795, 553027, 560247, 569785, 581201, 593806, 607109, 620571, 633348, 644873, 655544, 666198, 676903, 686767, 694879, 700832, 704363, 705323, 704196, 701936, 698979, 695032, 690058, 684806, 680023, 675794, 672018, 668870, 666347, 664049, 661967, 660908, 661411, 662654, 663143, 662259, 660568, 658832, 657260, 655612, 653587, 651146, 648732, 647036, 646350, 646338, 646444, 646118, 644561, 640911, 635086, 627958, 620349, 612327, 603842, 595394, 587544, 580290, 573482, 567365, 562122, 557341, 552628, 548309, 544892]
59210E44892k711k540k393j951j657j669j370m46M31O14M41M34M20J00j50J12
59194E32557N67O53N11O38R24P56O4m20j3J080J902J736R37N90J084J449O76o43
59176E45048r31J79J348J362N33p7N0Q44K022L002L143K605K364K904L552L488
59160E71436K739J689L51j292k822l899m675n218n189m682m645n675o926p133
59146E24059o219n145m463m027l850m269n152n727n457m607l823l472l464l448
59132D60936l121k519j957j544r70L7J244K183K673K831K783K713K973L810M975
59117D77047N854O042N784N832O772Q318R445R448Q738Q224Q093P741O781N513
59103E79632M349L449K945K885K812K060O18p91j739k398k798k599j877j340j292
$$ y = [544892, 542181, 539641, 537248, 535297, 533640, 531971, 530601, 530155, 530586, 531200, 531641, 532075, 532495, 532595, 532445, 532557, 533124, 533777, 534288, 534926, 535850, 536606, 536670, 536250, 536237, 537317, 539219, 540955, 541892, 542482, 543566, 545015, 545691, 545048, 544117, 544296, 545644, 547006, 547539, 547462, 547512, 548356, 550378, 553380, 556523, 559128, 561492, 564396, 567948, 571436, 574175, 575864, 576215, 574923, 572101, 568202, 563527, 558309, 553120, 548438, 543793, 538118, 531192, 524059, 517840, 512695, 508232, 504205, 500355, 496086, 490934, 485207, 479750, 475143, 471320, 467848, 464384, 460936, 457815, 455296, 453339, 451795, 450825, 450862, 452106, 454289, 456962, 459793, 462576, 465289, 468262, 472072, 477047, 482901, 488943, 494727, 500559, 507331, 515649, 525094, 534542, 543280, 551504, 559597, 567338, 574119, 579632, 583981, 587430, 590375, 593260, 596072, 598132, 598750, 597959, 596220, 593822, 591024, 588425, 586548, 585208, 583916]
59088E83916j193o78k74n22j099j472j815k574l644m619n399n931n864n168m567
59073E39097m641m898m517l636l031k818k372j523r35j097j695k128k149j796
59059E01861j176n76m23q53j498j857j815j704j858k194k218j565m17P25J538
59044D85970J920J749J018J55k75k16n3O4L26O53O34J65l55o22n87J2J524L554
59026D95636N098N839O603Q050R666J0568J0697J0615J0634J0744J0844J0532
59014F05526R112O436L242K83k390m725o033n849m926m390m215l405j581N45K223
58999E89853L427M366M909M864M429M060L966L905L486K702K069K064K510K767
58985F39377K416J488J97r75j178M2J826K736K565K540L539N072O486Q041J0075
$$ y = [583916, 582723, 582045, 581771, 581249, 580150, 578678, 576863, 574289, 570645, 566026, 560627, 554696, 548832, 543664, 539097, 534456, 529558, 525041, 521405, 518374, 515556, 513184, 511661, 510726, 509629, 507934, 505806, 503657, 501861, 500685, 500109, 499686, 498833, 497335, 495478, 493663, 491959, 490101, 487907, 485689, 484124, 483707, 484432, 485970, 487890, 489639, 490657, 490812, 490537, 490321, 490268, 490332, 490658, 491311, 491945, 492110, 491755, 491133, 490546, 490558, 492082, 495636, 500734, 506573, 513176, 521226, 530892, 541460, 552157, 562772, 573406, 584150, 594994, 605526, 614638, 621074, 624316, 624599, 622209, 617484, 611451, 605602, 600676, 596286, 592071, 588666, 587085, 587630, 589853, 593280, 597646, 602555, 607419, 611848, 615908, 619874, 623779, 627265, 629967, 632036, 634100, 636610, 639377, 641793, 643281, 643478, 642503, 641325, 641367, 643193, 645929, 648494, 651034, 654573, 659645, 666131, 674172, 684247]
58970F84247J1968J2871J2857J2532J2088J1497J1063J0959J0659R654Q350P447
58958H16192O794N714M103K328L26k335n514q398j0401j1627j2498j3323j4171
58945G57190j4763j4689j3962j3103j2324j1139r176o903n075l936l382l340l493
58932F41905l184k229j308q97m74N54J708K108J741J192N99k47j191j942k652
58917F35683l330l229j833j00M90j40p52o65l08O5R49K581M366N821P273R196
58901F56067J1379J3140J4026J4043J3471J2571J1380R928Q703Q523R639J1411
58889G94281J3172J4897J6587J7698J7916J7811J7902J7581J5928J3140J0135
58878I67048P138L761K35k656m784o817r031j0961j2225j2855j2763j1779j0301
$$ y = [684247, 696215, 709086, 721943, 734475, 746563, 758060, 769123, 780082, 790741, 800395, 808745, 816192, 822986, 828700, 832803, 835131, 835457, 833122, 827608, 819210, 808809, 797182, 784684, 771361, 757190, 742427, 727738, 713776, 700673, 688349, 677210, 668034, 661131, 656056, 652120, 648738, 645398, 641905, 638721, 636492, 635184, 634287, 633813, 634367, 636075, 638183, 639924, 641116, 641715, 641468, 640277, 638335, 635683, 632353, 629124, 627291, 627191, 627681, 627541, 626789, 626124, 625816, 625881, 626830, 629411, 633777, 639598, 646871, 656067, 667446, 680586, 694612, 708655, 722126, 734697, 746077, 756005, 764708, 773231, 782870, 794281, 807453, 822350, 838937, 856635, 874551, 892362, 910264, 927845, 943773, 956913, 967048, 974186, 977947, 978182, 975526, 970742, 963925, 954894, 943933, 931708, 918853, 906090, 894311, 884010]
58865H84010r059q209p336o325n476m855m413m631o048q152r690j0204j0324j0499
58851G78789j0456j0076r784r651r117q005p043o862p166p417p687q299r112r642
58837F58472r626r106q219p252o658o692p104p260o563m858k671r15j33p2q0L34
58821E81597J415L093M697N337N017M840N497O181N732M336L146K633K293J788
58807F37602J300Q12l6j295k600l769m853n679n976n948o098o569p067p357p352
58792E75115o998o426n922n368m292k856j946j722j103M26J596J247L95Q10K297
58777E45253L207L170L380M256M655L629J441j322m195o302o861o432o351o818
58763E30710o947o603o544o625n666l572j788j076m72Q15J995K147J697J537J762
$$ y = [884010, 874951, 866742, 859406, 853081, 847605, 842750, 838337, 833706, 827658, 819506, 809816, 799612, 789288, 778789, 768333, 758257, 748473, 738822, 729705, 721700, 714657, 707795, 700629, 693212, 685525, 677226, 668114, 658472, 648846, 639740, 631521, 624269, 617611, 610919, 603815, 596555, 589992, 585134, 582463, 581548, 581415, 581343, 581263, 581597, 583012, 586105, 590802, 596139, 601156, 605996, 611493, 617674, 623406, 627742, 630888, 633521, 635814, 637602, 638902, 639714, 639678, 638383, 635783, 632014, 627161, 621482, 615506, 609558, 603460, 596891, 589824, 582467, 575115, 568117, 561691, 555769, 550401, 546109, 543253, 541307, 539585, 538482, 538908, 540504, 541751, 542146, 542956, 545253, 548460, 551630, 555010, 559266, 563921, 567550, 568991, 567669, 563474, 557172, 550311, 543879, 537528, 530710, 523763, 517160, 510616, 503991, 498325, 494753, 492965, 491889, 491417, 492232, 494227, 496374, 498071, 499608, 501370]
58748E01370K148K759L251K700J033l05q3J157K141K639L278M240N049N345N144
58733E41866M716M557N060N888O222N862N424N283N140M859M894N459O056O275
58719F17561O279O292O301O504P157P831P757P146P106P883Q295P377N498L412
58705G12399J237j108l414n748q537j1582j3907j5046j5604j6086j6255j6112
58693E90237j6222j6455j5572j3016j0080q323p695p066n948m727l831l452l653
58680D74197m089m088l534l063l036k960k325j307k11R73K101K801L283M340O094
58665D69176P657Q502R229J0414J1607J2048J1446R609O267J933k028m753o542
58652E44565p761q171p819p447p314o729n397m156l638l320k642j986j706j341
$$ y = [501370, 503518, 506277, 509528, 512228, 513261, 512956, 512873, 514030, 516171, 518810, 522088, 526328, 531377, 536722, 541866, 546582, 551139, 556199, 562087, 568309, 574171, 579595, 584878, 590018, 594877, 599771, 605230, 611286, 617561, 623840, 630132, 636433, 642937, 650094, 657925, 665682, 672828, 679934, 687817, 696112, 703489, 708987, 712399, 713636, 712528, 709114, 703366, 694829, 683247, 669340, 654294, 638690, 622604, 606349, 590237, 574015, 557560, 541988, 528972, 518892, 510569, 502874, 495808, 489860, 485133, 481302, 477850, 474197, 470108, 466020, 462486, 459423, 456387, 453427, 451102, 449795, 449584, 450557, 452658, 455459, 458742, 463082, 469176, 476833, 485335, 494564, 504978, 516585, 528633, 540079, 549688, 555955, 557888, 555860, 551107, 544565, 536804, 528633, 520814, 513367, 506053, 499324, 493927, 489771, 486133, 482813, 480171, 478185, 476479, 475138]
58638D75138o48l61r07j432j075k96L6l0o7k54q21j339j466j553j625q38J098
58621D63560K926L485L483M342O046P330P488O853N968N302N296N811N992N306
58607E39188M174K960J252j009k678k758j830j247j468k145l053l952m266l871
58593E19297l534l690l537k247l03J336K589L794M717N099N478O388P339P619
58579E50345P448P505P808P984P919P477O361N028M773O045P704Q837J0150J2476
58565F57860J5161J7256J9250K2007K4928K6733K7438K7940K8080K6631K3021
58554I16305J7853J1979O102J057k516m627n526n369m691m446m844n118n091n855
58540I05213q108j1028j3692j6330j9125k1070k1357k0742k0189j9292j7372j4958
$$ y = [475138, 474490, 474129, 473222, 471790, 470715, 470419, 470455, 470425, 470358, 470104, 469283, 467944, 466478, 464925, 463300, 462462, 463560, 466486, 469971, 473454, 477796, 483842, 491172, 498660, 505513, 511481, 516783, 522079, 527890, 533882, 539188, 543362, 546322, 547574, 546565, 543887, 541129, 539299, 538052, 536584, 534439, 531386, 527434, 523168, 519297, 515763, 512073, 508536, 506289, 505986, 507322, 509911, 513705, 518422, 523521, 528999, 535387, 542726, 550345, 557793, 565298, 573106, 581090, 589009, 596486, 602847, 607875, 612648, 618693, 626397, 635234, 645384, 657860, 673021, 690277, 709527, 731534, 756462, 783195, 810633, 838573, 866653, 893284, 916305, 934158, 946137, 952239, 953296, 950780, 946153, 940627, 935258, 930567, 926121, 921277, 916159, 911068, 905213, 897105, 886077, 872385, 856055, 836930, 815860, 794503, 773761, 753572, 734280, 716908, 701950]
58528G01950j2863j0873q802p551p634p768o593m666l277k399j541j396k708m493
58514F19386n218m882m281l300j815j085k064l350l034j680j241j799j836j133
58500E82668q74j221j178o65n32o32o0Q24P46k3K76K276M633O037O413O133N591
58483F10412N589O798Q790J0704J2446J4125J5082J4923J4631J5012J4898J2667
58471G56077Q770M791R84l199o941q779q992r018r000q072o561n573m809l029
58457F96649l60K060M332P324J0415J2088J2452J2779J2832J1083P445L342p09
58444G91732n164r358j1878j2918j3777j4154j2527r227o437n020l877k522j693
58431F83180j284k33J263J979K216L541N785P055O979P189Q087P958N995L607
$$ y = [701950, 689087, 678214, 669412, 661861, 654227, 646459, 639866, 635200, 631923, 629524, 627983, 626587, 623879, 619386, 614168, 609286, 605005, 601705, 599890, 598805, 596741, 593391, 590357, 588677, 587436, 585637, 583801, 582668, 581794, 580573, 579395, 578730, 578198, 577566, 577506, 578330, 579076, 579053, 579329, 581605, 586238, 592275, 598688, 604821, 610412, 616001, 622799, 631589, 642293, 654739, 668864, 683946, 698869, 713500, 728512, 743410, 756077, 764847, 769638, 770622, 767423, 760482, 751703, 742711, 733693, 724693, 716621, 710060, 704487, 699678, 696649, 696289, 698349, 702681, 710005, 720420, 732508, 744960, 757739, 770571, 781654, 789099, 792441, 791732, 786568, 777210, 765332, 752414, 738637, 724483, 711956, 702729, 696292, 691272, 687395, 684873, 683180, 681896, 681663, 682926, 684905, 687121, 690662, 696447, 703502, 710481, 717670, 725757, 733715, 739710, 743317]
58417G43317J927M09j367k763l726n125o851p629p223o736o453n617m541m547
58403F83075n445n537m401l271k395p17J415K074J010L94J458K920L540L842M358
58388F82320M490M013L666L611L282L070L958N246N116L689K995L583L929L533
58374G36501L755N003N862N743N667N881N390M423M568N828O416O102O809R163
58360H17111J1363J2270J2762J3209J2523J0572Q751P391N346K774J384J396J210
58347I18062O06J012K205K186J053J354L648N434N454N507O767P996Q628J0128
58333I80040J2830J4807J5187J5330J5640J4664J2391J0807J0168Q425N406L572
58321A119267L533K951J131M23J627K386J738J889L764N218N473O852J0056J2270
$$ y = [743317, 745244, 745653, 744286, 741523, 737797, 732672, 725821, 718192, 710969, 704233, 697780, 692163, 687622, 683075, 677630, 672093, 667692, 664421, 662026, 661309, 662724, 664798, 665808, 666202, 667660, 670580, 674120, 677962, 682320, 686810, 690823, 694489, 698100, 701382, 704452, 708410, 713656, 718772, 722461, 725456, 729039, 732968, 736501, 740256, 745259, 751121, 756864, 762531, 768412, 773802, 778225, 782793, 788621, 795037, 801139, 807948, 817111, 828474, 840744, 853506, 866715, 879238, 889810, 898561, 905952, 911298, 914072, 915456, 916852, 918062, 918668, 919680, 921885, 924071, 925124, 926478, 930126, 935560, 941014, 946521, 953288, 961284, 969912, 980040, 992870, 1007677, 1022864, 1038194, 1053834, 1068498, 1080889, 1091696, 1101864, 1110289, 1115695, 1119267, 1122800, 1125751, 1126882, 1127305, 1128932, 1131318, 1133056, 1134945, 1138709, 1143927, 1149400, 1156252, 1166308, 1178578]
58307A178578J2061J1798J2995J3776J3046J2756J3697J3689J2227J2204J4519
58296A321346J5902J4643J3648J4953J6207J5545J5115J6559J7838J7697J8451
58285A497904K1138K2801K1937K1643K3953K6063K5771K5522K7327K8749K7906
58274A770714K7423K9460L1672L2083L2896L5638L7655L7414L8011M1294M4033
58263B158293M4072M4707M8561N2782N4794N6899O0667O2772O1311O0038O1426
58252B766322O1918N9199N7542O0404O4360O6119O8752P4973Q1169Q4367Q8214
58241C533339R5752J03314J07933J13361J22220J30099J34323J40280J51710J63372
58231D795703J71137J80224J95032K10141K20669K32109K50207K70515K88047
$$ y = [1178578, 1190639, 1202437, 1215432, 1229208, 1242254, 1255010, 1268707, 1282396, 1294623, 1306827, 1321346, 1337248, 1351891, 1365539, 1380492, 1396699, 1412244, 1427359, 1443918, 1461756, 1479453, 1497904, 1519042, 1541843, 1563780, 1585423, 1609376, 1635439, 1661210, 1686732, 1714059, 1742808, 1770714, 1798137, 1827597, 1859269, 1891352, 1924248, 1959886, 1997541, 2034955, 2072966, 2114260, 2158293, 2202365, 2247072, 2295633, 2348415, 2403209, 2460108, 2520775, 2583547, 2644858, 2704896, 2766322, 2828240, 2887439, 2944981, 3005385, 3069745, 3135864, 3204616, 3279589, 3360758, 3445125, 3533339, 3629091, 3732405, 3840338, 3953699, 4075919, 4206018, 4340341, 4480621, 4632331, 4795703, 4966840, 5147064, 5342096, 5552237, 5772906, 6005015, 6255222, 6525737, 6813784]
58222F813784L07609L34205L63225L90870M23730M66721N12868N56932O07309
58213A0777253O71821P44684Q21203R11599J025347J156269J299255J466633J671393
58204B0545457J911943K193214K545075K998976L566017M261006N126225O204240
58196D9352153P507620R041062J0830525J2913620J5349975J8279584K1915122
58189A45189661K6405136L1697523L7449421M2767519M5797056M3862439L4811395
58182D07980150J8891930o17300j8951489l2387815l9684490m1678765m0030184
58175B53522037l6321068l1765493k7165593k2931359j9205116j6022818j3375961
58168H6734629j1200664r405723p926229o720982n736730m915434m226612l659326
$$ y = [6813784, 7121393, 7455598, 7818823, 8209693, 8633423, 9100144, 9613012, 10169944, 10777253, 11449074, 12193758, 13014961, 13926560, 14951907, 16108176, 17407431, 18874064, 20545457, 22457400, 24650614, 27195689, 30194665, 33760682, 38021688, 43147913, 49352153, 56859773, 65900835, 76731360, 89644980, 104994955, 123274539, 145189661, 171594797, 203292320, 240741741, 283509260, 329306316, 373168755, 407980150, 426872080, 426254780, 407303291, 374915476, 335230986, 293552221, 253522037, 217200969, 185435476, 158269883, 135338524, 116133408, 100110590, 86734629, 75533965, 66128242, 58202013, 51481031, 45744301, 40828867, 36602255, 32942929]
58160C2942929l191195k793084k454073k174706j943056j740074j560296j405938
58152A5680507j268345j135325j009463r00441q05831p16541o34280n66691n11260
58143H132330m59893m13934l79730l54418l30125l07241k90323k75908k57305
58134E063453k36813k20905k07820j91802j75061j63749j56159j46324j35493
58125C429327j28997j25241j18605j10009j04324j00434r3823q6125q2313q1091
58115B398365p7395p1828o8604o6742o2173n6115n2763n1078m7281m2983m2394
58104A759009m3742m2056l8373l7742l9828l9787l7099l5481l5195l3167k9866
58093A346673k8634k9024k7731k5219k4574k4808k2148j7233j4428j4552j4633
$$ y = [32942929, 29751734, 26958650, 24504577, 22329871, 20386815, 18646741, 17086445, 15680507, 14412162, 13276837, 12267374, 11366933, 10561102, 9844561, 9210281, 8643590, 8132330, 7672437, 7258503, 6878773, 6524355, 6194230, 5886989, 5596666, 5320758, 5063453, 4826640, 4605735, 4397915, 4206113, 4031052, 3867303, 3711144, 3564820, 3429327, 3300330, 3175089, 3056484, 2946475, 2842151, 2741717, 2647894, 2561769, 2479456, 2398365, 2320970, 2249142, 2180538, 2113796, 2051623, 1995508, 1942745, 1891667, 1844386, 1801403, 1759009, 1715267, 1673211, 1634838, 1597096, 1557268, 1517481, 1480382, 1444901, 1409706, 1376539, 1346673, 1318039, 1289015, 1261284, 1236065, 1211491, 1186683, 1164535, 1147302, 1132874, 1118322, 1103689]
58082A103689j4047j4778j6271j6060j4916j5615j7428j7476j6476j7338j9116
58071I24168j8299j5291j3639j3647j2641j0822j0863j2213j1658r231p921p868
58059G80075o577m575n017p711r203q886r461j1147j1122r162q325r266r122o922
58045F63579n156m998m674l646l856n659o686n943n212n532n854n841o448p184
58031E86890o424m877n168p506r243r120q538q391q036p634q162q822p790n484
58017D81695l934l171j707j94o97k570l052k002j987l504m188l201k321k153j239
58002D45775M10P16o23j321l36Q19J274J862K388J385p47j736j334j721l446m449
57986D38916l945l683m385m389l069k184k625k892k166j849k803l762l743l441
$$ y = [1103689, 1089642, 1074864, 1058593, 1042533, 1027617, 1012002, 994574, 977098, 960622, 943284, 924168, 905869, 890578, 876939, 863292, 850651, 839829, 828966, 816753, 805095, 795864, 787943, 780075, 773498, 768923, 763906, 756195, 746992, 738106, 728645, 717498, 706376, 697214, 688889, 679623, 670501, 663579, 658423, 653425, 648751, 645105, 641249, 635590, 628904, 622961, 617749, 612217, 606363, 600522, 594074, 586890, 580466, 575589, 570421, 562915, 553672, 544552, 536014, 527623, 519587, 511953, 503791, 494969, 487179, 481695, 477761, 474590, 472883, 472689, 471992, 469422, 466370, 464368, 462381, 458877, 454689, 451488, 449167, 447014, 445775, 446185, 446901, 446278, 444957, 444621, 445440, 446714, 448576, 450964, 452349, 451602, 449866, 448532, 446811, 443365, 438916, 434971, 431288, 426903, 422514, 419445, 417261, 414636, 411744, 409578, 407729, 404926, 401164, 397421, 393980]
57972C93980l195k172n01L28L3l9L31j83j493j676k58R08R47J212K288K705J729
57955C94944O96L51m72k352l993m552m849n250m749l183j936j501p01Q10J779
57940C65042J921K685M516N807N634N148N281N503N679O614P821P300M616J757
57926D35324m2j795m147n926o495p000q021q408p683p155p477p462o502n755n731
57911C45725n133l436k147k104j910m13J415K445K957L034J711q72k797l183l383
57896C31909m152m102k520j122j215j478m64Q59J026N51N73Q18P13Q49J670K289
57880C26204K088J825J851J154m53j263l54P00L81m71n53k57k08L08J710K779
57864C35441K748K757L538L785K761K248L688N446N400M364M333M956M553L267
$$ y = [393980, 390785, 388613, 388112, 388440, 388473, 388434, 388765, 388582, 387089, 385413, 385155, 386063, 387010, 388222, 390510, 393215, 394944, 395640, 395991, 395519, 393167, 389174, 384622, 379773, 374523, 369774, 366591, 364655, 363154, 362453, 363263, 365042, 366963, 369648, 374164, 379971, 385605, 390753, 396034, 401537, 407216, 413830, 421651, 428951, 433567, 435324, 435282, 433487, 429340, 423414, 416919, 409919, 401898, 393490, 385807, 378652, 371175, 363713, 357211, 351456, 345725, 340592, 337156, 335009, 332905, 330995, 330582, 331997, 334442, 337399, 340433, 342144, 341272, 338475, 335292, 331909, 327757, 323655, 321135, 320013, 318798, 317320, 316856, 317715, 318741, 319292, 319865, 320683, 321396, 322245, 323915, 326204, 328292, 330117, 331968, 333122, 332669, 331406, 331052, 331752, 332133, 331662, 331109, 330852, 330644, 330952, 332662, 335441, 338189, 340946, 344484, 348269, 351030, 353278, 356966, 362412, 367812, 372176, 376509, 381465, 386018, 389285]
57850C89285K477K051Q15r74k045k322k670l029k847k631l202m007l992l365k844
57835C60700k099p57N7q30k414k715j596n04m1L48P75Q93J088K025L305M027M250
57818C66512M589M904M710M206L599K186m70l263m868n539o130o301n356m084
57804C54695l865m504m640l945l329l278l424l478l383k914k189j980k550k972
57790C08244k662k522l292l954l297j975j296j003q7J098J521J529K189L135L160
57775C00788K558K719L640L791K575J016r5j040j948k338k180k163k604l190l810
57760B97719m648n424n582n168m667m123l394k826k724k475j212R38L202N285
57746B64901P185Q397Q443P743O992O115M913M007M028M418M265L721L396L079
$$ y = [389285, 391762, 393813, 394628, 393654, 391609, 389287, 386617, 383588, 380741, 378110, 374908, 370901, 366909, 363544, 360700, 358601, 357844, 357901, 357071, 354657, 351942, 350346, 349842, 349801, 350149, 350924, 351817, 352905, 354930, 358235, 362262, 366512, 371101, 376005, 380715, 384921, 388520, 390706, 390236, 386973, 382105, 376566, 370436, 364135, 358779, 354695, 350830, 346326, 341686, 337741, 334412, 331134, 327710, 324232, 320849, 317935, 315746, 313766, 311216, 308244, 305582, 303060, 299768, 295814, 292517, 290542, 289246, 288243, 288156, 289254, 290775, 292304, 294493, 297628, 300788, 303346, 306065, 309705, 313496, 316071, 317087, 316992, 315952, 314004, 311666, 309486, 307323, 304719, 301529, 297719, 293071, 287647, 282065, 276897, 272230, 268107, 264713, 261887, 259163, 256688, 255476, 256414, 259616, 264901, 272086, 280483, 288926, 296669, 303661, 309776, 314689, 318696, 322724, 327142, 331407, 335128, 338524, 341603]
57732C41603K326J699J871K169J519L94J32P46R71L23n02j122j840k527k616k224
57716C42922k089k339k465k403k557k826k806k717l113l802m137m029l715k878
57702C01046j251L90J058J101J561K343K381J457M90R6K1k2r5m37j148j618j259
57685C06114n03n6L24J178K059K136J702J755K499L541N107P629J0512J2832J4947
57670C71776J8005K2132K6638L1558L7119M1617M1596L4666K1235L718j4608l0123
57658F05329m0093m4121m3699m0402l5255k9389k3942j9315j5510j2850j1391
57647B89362j0167q280o198m736l514j891o70r47j966k103j532j708k486k195
57633B40969o09N10K51k32N3N10M24Q5k19p89j478j558j101j049j581j829j537
$$ y = [341603, 343929, 345628, 347499, 349668, 351187, 351581, 351713, 352459, 353430, 353753, 353251, 352129, 350289, 347762, 345146, 342922, 340833, 338494, 336029, 333626, 331069, 328243, 325437, 322720, 319607, 315805, 311668, 307639, 303924, 301046, 299795, 300185, 301243, 302344, 303905, 306248, 308629, 310086, 310576, 310672, 310693, 310671, 310576, 310139, 308991, 307373, 306114, 305611, 305555, 305879, 307057, 309116, 311252, 312954, 314709, 317208, 320749, 325856, 333485, 343997, 356829, 371776, 389781, 411913, 438551, 470109, 507228, 548845, 590441, 625107, 646342, 650060, 635452, 605329, 565236, 521115, 477416, 437014, 401759, 372370, 348428, 329113, 313603, 300753, 289362, 279195, 270915, 264717, 259981, 256467, 254576, 253906, 252959, 250993, 248890, 247358, 245650, 243164, 240969, 240360, 240870, 241121, 240889, 240942, 241452, 241876, 241961, 241742, 240953, 239475, 237917, 236816, 235767, 234186, 232357, 230820]
57616B30820j413j558j236n14l80q28p12nj46j445k172j217J99O89P39J262J662
57599B23745R54l13q41m82j07k36q30j786k771l146k773k258j909j329n19l30
57583B05069j098j842j600p09n3J19q6p05j452j612j076o86r27j187r41o63q64
57566A89687j127r31n48l99l26j92l52q17q45j59L82J29k70l9M02L41K17Q85K046
57547A88084K609K385K232K551K623J690J41o63L19K711M897N547M832L771K719
57532B26448J347j06p15k87J81j00q34j588k606m079n423o037o120o172o254o228
57516A81427o176o114n846n401n041m555l348j505J6O29P30Q00P79P24J040J576
57500A49735J414K53q96j040m59J7J91K77K25K3P1N84J081J063P09M10J74p9j48
$$ y = [230820, 229407, 227849, 226613, 226099, 225719, 224891, 224179, 224174, 224028, 222583, 220411, 219194, 219393, 220082, 220821, 222083, 223745, 224699, 224386, 223545, 223063, 222956, 222720, 221890, 220104, 217333, 214187, 211414, 209156, 207247, 205918, 205399, 205069, 203971, 202129, 200529, 199820, 199767, 199886, 199800, 199095, 197643, 196031, 194955, 194269, 193342, 192155, 191214, 190551, 189687, 188560, 187629, 187081, 186682, 186356, 186164, 185812, 184995, 184150, 183991, 184373, 184502, 184232, 184193, 184595, 184936, 185153, 186038, 188084, 190693, 193078, 195310, 197861, 200484, 202174, 202315, 201652, 201971, 204682, 209579, 215126, 219958, 223729, 226448, 227795, 227689, 226974, 226687, 226868, 226768, 225934, 224346, 221740, 217661, 212238, 206201, 200081, 193909, 187655, 181427, 175251, 169137, 163291, 157890, 152849, 148294, 144946, 143441, 143457, 144086, 144816, 145616, 146395, 147119, 148159, 149735, 151149, 151402, 150506, 149466, 149007, 149024, 149215, 149492, 149717, 149740, 149811, 150395, 151476, 152539, 153248, 153658, 153832, 153753, 153605]
57481A53605P7L89P09J220J737J674R70L80M67R12J090P89J32n39o26J51J071
57464A64208J204Q30Q94J169M36j259k147j206L73J015P30L27m8n46q08n53j52
57447A64467J64P61J545J591O30j95m0K69k83j097r14K38J251J486J045J57o77
57430A70398n51P65K161K511K064J674J458J165J068J330J199Q0j205j385n55
57415A82177J74M17P26J303J649J417P71M7l82j61N20Q93O12K41K25K03o9q9L28
57396A91002L32n41j257p76K10M49J67M42J127J180P01Q96K018K906K806K293
57380B03955K056J949J597J037M11k49p78r22p69m95P1J040J791J557N46k60l77
57363B12160j36R3K33K31J02K39Q89J478J192J94m98l34K32N76O47P41J079J735
$$ y = [153605, 153682, 154071, 154780, 156000, 157737, 159411, 160381, 160761, 161228, 162140, 163230, 164019, 164151, 163612, 162986, 163137, 164208, 165412, 166242, 167136, 168305, 168741, 167482, 165335, 164129, 164502, 165517, 166247, 166574, 166526, 165980, 165172, 164619, 164467, 164631, 165392, 166937, 168528, 169158, 168963, 168923, 169192, 168909, 167812, 166898, 167136, 168387, 169873, 170918, 171075, 170398, 169847, 170612, 172773, 175284, 177348, 179022, 180480, 181645, 182713, 184043, 185242, 185322, 184117, 182732, 182177, 182351, 182768, 183494, 184797, 186446, 187863, 188634, 188681, 188299, 188138, 188658, 189551, 190163, 190404, 190629, 190832, 190763, 190674, 191002, 191334, 190793, 189536, 188760, 188970, 189419, 189586, 190028, 191155, 192335, 193036, 193932, 195950, 198856, 201662, 203955, 206011, 207960, 209557, 210594, 211005, 210756, 209978, 209056, 208287, 207792, 207863, 208903, 210694, 212251, 212797, 212537, 212160, 212024, 212117, 212350, 212581, 212683, 212922, 213811, 215289, 216481, 216675, 216177, 215843, 216075, 216651, 217298, 218039, 219118, 220853]
57345B20853K570L192L186K469J302J08p10j086j426j998k290j594l19L02rj38
57329B24412O12J423J312N89J09kKK20N98M70l84j035p41j52j57l40J51R43J033
57310B29063N40M40R38J375J527J715J814J372O29M17R87J878K733L411L515K727
57294B55081J536P62N95P02R66J335J425J056P63R40J069O21Q4Q6K02k07o29j81
57276B66206P19Q87J63n78q97r26m45Q10K168K737K843L375M037L748K635J978
57260B89460K158K318K205K652L811M468L768K465J691J564J592J631J808K093
57246C23684K420K752K889K671K385K397K484K206J795J862K357K697K747K893
57232C58239L180L291L282L397L352K737K030K211L309M341M679M568M298L819
$$ y = [220853, 223423, 226615, 229801, 232270, 233572, 233680, 232970, 231884, 230458, 228460, 226170, 224576, 224257, 224559, 224550, 224412, 225024, 226447, 227759, 228348, 228457, 228455, 228457, 228677, 229275, 229745, 229361, 228326, 227585, 227433, 227276, 226936, 227087, 228030, 229063, 229603, 230043, 230981, 232356, 233883, 235598, 237412, 238784, 239413, 239830, 240817, 242695, 245428, 248839, 252354, 255081, 256617, 257379, 257974, 258676, 259642, 260977, 262402, 263458, 264221, 265161, 266230, 266851, 266935, 267021, 267223, 267016, 266387, 266206, 266925, 267812, 267975, 267397, 266500, 265574, 265129, 265939, 268107, 270844, 273687, 277062, 281099, 284847, 287482, 289460, 291618, 293936, 296141, 298793, 302604, 307072, 310840, 313305, 314996, 316560, 318152, 319783, 321591, 323684, 326104, 328856, 331745, 334416, 336801, 339198, 341682, 343888, 345683, 347545, 349902, 352599, 355346, 358239, 361419, 364710, 367992, 371389, 374741, 377478, 379508, 381719, 385028, 389369, 394048, 398616, 402914, 406733]
57218D06733L248K880K668K404K389L041M014M573M722M988N334N267M998N266
57204D62525O006O239N515M525M087M300M884N594O134O269O121N932N712N490
57190E39333N535N775N616N028N102O600Q567R515R438R489J0231J1403J2882
57177F44514J4535J5464J4871J3412J2489J2396J2427J2334J2408J2498J2338
57166G89686J2515J3663J5090J5677J5740J6439J7679J8430J8818J9975K1855
57155I75567K3134K3446K3951K5314K6835K7954K9110L0621L2079L3213L4278
57144A285502L5312L6052L6638L7347L7833L7779L7930L9196M1040M2301M3172
57133A710102M4716M6783M8352M9749N2496N6733O0726O3244O4840O6461O8345
$$ y = [406733, 409981, 412861, 415529, 417933, 420322, 423363, 427377, 431950, 436672, 441660, 446994, 452261, 457259, 462525, 468531, 474770, 480285, 484810, 488897, 493197, 498081, 503675, 509809, 516078, 522199, 528131, 533843, 539333, 544868, 550643, 556259, 561287, 566389, 572989, 581556, 591071, 600509, 609998, 620229, 631632, 644514, 659049, 674513, 689384, 702796, 715285, 727681, 740108, 752442, 764850, 777348, 789686, 802201, 815864, 830954, 846631, 862371, 878810, 896489, 914919, 933737, 953712, 975567, 998701, 1022147, 1046098, 1071412, 1098247, 1126201, 1155311, 1185932, 1218011, 1251224, 1285502, 1320814, 1356866, 1393504, 1430851, 1468684, 1506463, 1544393, 1583589, 1624629, 1666930, 1710102, 1754818, 1801601, 1849953, 1899702, 1952198, 2008931, 2069657, 2132901, 2197741, 2264202, 2332547]
57122B332547P0540P3135P5797P8294Q1345Q5774R1239R7105J04053J13233J24488
57111C327550J37106J51650J69219J89627K12222K37817K67897L02969L43868
57102E339925L93682M56118N33219O27195P43129Q87215J063884J277281J533106
57093A2854754J834829K179273K558510K962864L378379L785621M165686M501228
57085C8221144M765585M923421M960769M907801M802450M619091M254563L607277
57077G5062101K667184J520638K83049r52927k115387l137598l965021m569571
57069F4792468m947779n111299n085199m907926m622748m267862l875058l471797
57061B8502800l079012k708879k368095k061764j792365j558372j357420j189592
$$ y = [2332547, 2403087, 2476222, 2552019, 2630313, 2711658, 2797432, 2888671, 2985776, 3089829, 3203062, 3327550, 3464656, 3616306, 3785525, 3975152, 4187374, 4425191, 4693088, 4996057, 5339925, 5733607, 6189725, 6722944, 7350139, 8093268, 8980483, 10044367, 11321648, 12854754, 14689583, 16868856, 19427366, 22390230, 25768609, 29554230, 33719916, 38221144, 42986729, 47910150, 52870919, 57778720, 62581170, 67200261, 71454824, 75062101, 77729285, 79249923, 79532972, 78580045, 76464658, 73327060, 69362039, 64792468, 59844689, 54733390, 49648191, 44740265, 40117517, 35849655, 31974597, 28502800, 25423788, 22714909, 20346814, 18285050, 16492685, 14934313, 13576893, 12387301]
57053A2387301j055471r52333q73793q11978p59177p09348o59506o08794n56052
57044E400849n00087m42268l86374l35180k89103k48246k13128j82935j55727
57035B647801j31068j09982r1802p3914n5265l7240k0392m115Q607R961n557l4167
57023B102867o5299q9940j04784j10336j08325j01063r1200q1100p2576o6508
57013A211736o2193n8012n3353m9163m6180m3729m0844l7534l4364l1769l0174
57002G24421k9683k9309k7746k5256k3476k2996k2655k1677k0832k0716k0500
56991D59575j9369j7800j6337j4426j1409p624l453J543P400J2427J4232J1705
56979D16464N568k366r983j5853j9906k2664k3804k2654k0034j7993j7198j6112
$$ y = [12387301, 11331830, 10379497, 9505704, 8693726, 7934549, 7225201, 6565695, 5956901, 5400849, 4900762, 4458494, 4072120, 3736940, 3447837, 3199591, 2986463, 2803528, 2647801, 2516733, 2406751, 2314949, 2241035, 2185770, 2148530, 2128138, 2124023, 2132630, 2142591, 2137034, 2102867, 2037568, 1947628, 1842844, 1732508, 1624183, 1523120, 1431920, 1350820, 1278244, 1211736, 1149543, 1091531, 1038178, 989015, 942835, 899106, 858262, 820728, 786364, 754595, 724421, 694738, 665429, 637683, 612427, 588951, 565955, 543300, 521623, 500791, 480075, 459575, 440206, 422406, 406069, 391643, 380234, 372610, 369157, 370700, 378100, 390527, 404759, 416464, 422032, 419666, 409683, 393830, 373924, 351260, 327456, 304802, 284768, 266775, 249577, 233465]
56967B33465j3413r789o569l931j403J133L988Q026J3394J8804K3006K5990K7721
56954C20422K6642K0782J0098l046j5309k3942k7913k8362k7397k5933k3221j8815
56942A84006j3860r759o531l384n9L319P065J1588J6661K1791K7014L2525L7639
56929C08015M0490L8684L0409J5791k273j9257l1616l8293l9986l7948l3737k9057
56917B01222k4962k1441j8109j4949j2210j0097q691p789o786n303l821l015k670
56904F1379k007r33j9O19J339K039K392K977M831P752J0286J1668J2523J3547
56890A28393J4816J6646J9637K3391K6502K8251K8917K7905K3262J4063K223r066
56878C44940j7695k2962k4779k3746k1186j8096j4507j0322n996j813K676P873
$$ y = [233465, 220052, 210263, 203694, 199763, 198360, 199493, 203481, 211507, 224901, 243705, 266711, 292701, 320422, 347064, 367846, 377944, 374898, 359589, 335647, 307734, 279372, 251975, 226042, 202821, 184006, 170146, 160387, 153856, 150472, 150413, 153732, 160797, 172385, 189046, 210837, 237851, 270376, 308015, 348505, 387189, 417598, 433389, 431116, 411859, 380243, 341950, 301964, 264016, 230279, 201222, 176260, 154819, 136710, 121761, 109551, 99454, 90763, 82974, 76188, 70885, 67064, 64049, 61379, 59372, 58439, 58420, 59039, 60378, 62417, 64809, 67786, 72617, 80369, 90655, 102323, 114846, 128393, 143209, 159855, 179492, 202883, 229385, 257636, 286553, 314458, 337720, 351783, 354006, 344940, 327245, 304283, 279504, 255758, 234572, 216476, 201969, 191647, 185651, 183838, 186514, 194387]
56866A94387J3486J9175K5172L1845L9335M7940N7913O8133P5447P5807O6099
56855G14739M5764J8027j0529l3335m7535n4010n4388m9792m2126l4099k6832
56844D25884j9125r931j32Q988J7531K6300L5655M5988N8118P2254Q7467J02433
56832H51430J14899J19705J09751Q1387L8632q828n1131q1725r8139j01917r7390
56821H76674q8699p7790o5412n2767m1001l0114j9650r752n53Q745J9102L0513
56809E49296M2525N5084O7876P9173Q5685Q3043O7051L6941j464l7686o3504p7477
56797H86543q2483q1117p5064o6626n7919m9130l9644l0323k2752j6767j0668
56786C54050l671L505J0332J7166K4312L1569L8454M3546M3885L6610K1628K047
$$ y = [194387, 207873, 227048, 252220, 284065, 323400, 371340, 429253, 497386, 572833, 648640, 714739, 760503, 778530, 768001, 734666, 687131, 633121, 578733, 528941, 486815, 452716, 425884, 406759, 396828, 396696, 405684, 423215, 449515, 485170, 531158, 589276, 661530, 748997, 851430, 966329, 1086034, 1195785, 1277172, 1315804, 1306976, 1255845, 1174120, 1075981, 974064, 876674, 787975, 710185, 644773, 592006, 551005, 520891, 501241, 491489, 490936, 499681, 518783, 549296, 591821, 646905, 714781, 793954, 879639, 962682, 1029733, 1066674, 1065210, 1027524, 964020, 886543, 804060, 722943, 647879, 581253, 523334, 474204, 434560, 404237, 381485, 364718, 354050, 350379, 353884, 364216, 381382, 405694, 437263, 475717, 519263, 563148, 599758, 621386, 623433]
56774F23433j7789l4203m4973m9810n0184m7932m4055l9144l4100k9585k5450
56763B06208k1558j8458j6318j4161j1268q581p501p826q116p569o466n298m491
56750F8597m497n088n125l931k286j225o78k06o6m12m34L63J002M42o57j078r42
56733D3779r93q90J7J030J051N58P66J342Q83n81j549j376q82o16k19M70J144
56716D3934J836K633K782J615J11j54N94P07j55n49K86J367J823K125K770L204
56700F4929K797J835R03K17n6L69J285J999K208K240K389K677L167L722L694K681
56684I7056J439R80J066O65k90q57o65m08o86j399k285l027k942j634J03J011
56668H8127R16N94M16J69j1J58K30m05j238j206m51j11m50n22J77J010J265Q40
$$ y = [623433, 605644, 571441, 526468, 476658, 426474, 378542, 334487, 295343, 261243, 231658, 206208, 184650, 166192, 149874, 135713, 124445, 115864, 108363, 100537, 92421, 84852, 78386, 73088, 68597, 64100, 59012, 53887, 49956, 47670, 46445, 45767, 45561, 45495, 45083, 44649, 45012, 46014, 46456, 45799, 44721, 43779, 42786, 41896, 41913, 42943, 43994, 44552, 45318, 46660, 47543, 46962, 45413, 44037, 43155, 42539, 42320, 42790, 43934, 45770, 48403, 51185, 52800, 52911, 52757, 53351, 54058, 53903, 53354, 53640, 55007, 56830, 58955, 61725, 64929, 67726, 69561, 70464, 70681, 70625, 70994, 72279, 74278, 76486, 78726, 81115, 83792, 86959, 90681, 94375, 97056, 98495, 99475, 100541, 101206, 100916, 100059, 99394, 98986, 98300, 96901, 94616, 91589, 88647, 87013, 87116, 88127, 89043, 89637, 90053, 90222, 90211, 90369, 90599, 90194, 88956, 87750, 87299, 87188, 86738, 86216, 86393, 87403, 88668, 89508]
56650H9508j23j173j304oJ558J678L63q67j289j593k190k520k241j742j184k62
56634G6613P99J270J065Q31P75O33O77J458K503K690K006J459J242N53n78j027
56618I2969m86l4k64l97J08N44K87j62k16r3m6K62Q27R04J29p50r08m09K29O42
56598I3136M71l85j141p61M90J139M76o19j112r48m66K39Q92J039R25J342K266
56581I6983K671K087J303J057J057P98M22K11R5N2L22Q86J403J816K301K710K857
56564A19031L177M120N128N359N170N545O284O324N673N232M715K738o01l196
56550A74699l690l043k634k436j950j451j303j241j222j792k900l488k954j955
56536A42640j164m43K38L11k41n60l16j94m29j96Q95J999K420K450K255J384P7
$$ y = [89508, 89385, 88212, 86908, 86902, 88460, 90138, 90501, 89634, 88345, 86752, 84562, 82042, 79801, 78059, 76875, 76613, 77412, 78682, 79747, 80578, 81353, 81986, 82663, 84121, 86624, 89314, 91320, 92779, 94021, 94574, 93996, 92969, 92483, 92449, 92185, 91788, 91896, 92440, 92727, 92565, 92349, 92256, 92210, 92472, 93299, 94203, 94332, 93582, 92674, 92265, 92494, 93136, 93607, 93222, 92081, 91320, 91810, 92949, 93425, 92806, 91694, 90746, 90280, 90519, 91411, 92450, 93375, 94717, 96983, 99654, 101741, 103044, 104101, 105158, 105956, 106378, 106589, 106684, 106736, 107058, 107944, 109347, 111163, 113464, 116174, 119031, 122208, 126328, 131456, 136815, 141985, 147530, 153814, 160138, 165811, 171043, 175758, 178496, 177895, 174699, 171009, 167966, 165332, 162896, 160946, 159495, 158192, 156951, 155729, 153937, 151037, 147549, 144595, 142640, 141476, 141033, 141271, 141582, 141341, 140781, 140465, 140271, 139842, 139646, 140541, 142540, 144960, 147410, 149665, 151049, 151126]
56519A51126n49l51n77j646k211j591j263k456l853l481j659k72l4j73k43m73
56503A30294p24m85J57O01N87K47l33r52j136p87m27l01j2N30P20L83K78P69J055
56484A30464N29j22j27O9k96r48j194j078r66o55J05Q97J314J681K338K839K719
56467A37569K307K074J786J138N03K42Jo04j166j087l78O37J716K300J716L26
56451A49080m68j4P31P84M88N23O40L06k71o49r10j146j007n03l15o34o43P2O93
56432A46757M82mM7M01M23J83N0l0j48j06m6m18q91m13R76J787J202L00K66P53
56412A51571R43R49J066Q41L4o20n62k99k54O8Q59J216O75J62M05O73K05m06l78
56393A57148l9K15Q33J863K222J470Q92J530K563L024L597N115O846P822Q485
$$ y = [151126, 150577, 150226, 149649, 148003, 145792, 144201, 142938, 140482, 136629, 133148, 131489, 131217, 131183, 131010, 130767, 130294, 129570, 129085, 129242, 129843, 130430, 130677, 130344, 129392, 128256, 127469, 127042, 126741, 126729, 127259, 127979, 128362, 128640, 129409, 130464, 130993, 130871, 130744, 130813, 130517, 129569, 128375, 127297, 126331, 125676, 125781, 126678, 127992, 129673, 132011, 134850, 137569, 139876, 141950, 143736, 144874, 145377, 145619, 145620, 145016, 143850, 142763, 142385, 143022, 144738, 147038, 148754, 149080, 148612, 148598, 149329, 150113, 150601, 151124, 151764, 152070, 151799, 151150, 150240, 149094, 148087, 147584, 147269, 146635, 145992, 146064, 146757, 147239, 147235, 147282, 147683, 148106, 148289, 148339, 148309, 148161, 148055, 148009, 147591, 146700, 146287, 147263, 149050, 150252, 150552, 150818, 151571, 152514, 153463, 154529, 155370, 155404, 154784, 154222, 153923, 153669, 153737, 154596, 155812, 156487, 156649, 157054, 157727, 157932, 157526, 157148, 157109, 157324, 158157, 160020, 162242, 163712, 164604, 166134, 168697, 171721, 175318, 180433, 187279, 195101, 203586]
56378B03586R296R203P293M681K815J273q69k803l273k878k951l159k400j123
56364B18691m88j34R25J946J432j00p31j23L37J72L21R84J112K95n95q68o89k43
56346B22244M52R61Q89P02R94J326R82K72j9R3K66P65J649K014J470J324K683
56329B39067M375M529L321K343K091K048K409L584M600M093K473J259P14P8m76
56314B76508r6Q85J312J173J411K137K670K927L189L084K446K387L736N226N207
56299C14202M304M302N158N405M884M727N065N059M840N226N833N647N099N416
56285C85167O329O608O417O928P952Q301Q147Q669R741J0282J0569J1808J3613
56272E00531J4447J4374J4962J6559J8062J9282K1096K3370K5097K6511K8775
$$ y = [203586, 212882, 222085, 229378, 234059, 236874, 238147, 237278, 234475, 231202, 228324, 225373, 222214, 219814, 218691, 218203, 218069, 218994, 220940, 222372, 222272, 221541, 221418, 221755, 221927, 222248, 223232, 224344, 224639, 224044, 223176, 222487, 222244, 222696, 223657, 224546, 225248, 226242, 227568, 228550, 228822, 228803, 228896, 229162, 229927, 231576, 233590, 235060, 236384, 239067, 243442, 247971, 251292, 253635, 255726, 257774, 260183, 263767, 268367, 272460, 274933, 276192, 276906, 276984, 276508, 276412, 277297, 278609, 279782, 281193, 283330, 286000, 288927, 292116, 295200, 297646, 300033, 303769, 308995, 314202, 318506, 322808, 327966, 333371, 338255, 342982, 348047, 353106, 357946, 363172, 369005, 374652, 379751, 385167, 391496, 398104, 404521, 411449, 419401, 427702, 435849, 444518, 454259, 464541, 475110, 486918, 500531, 514978, 529352, 544314, 560873, 578935, 598217, 619313, 642683, 667780, 694291, 723066]
56261G23066L1707L4258L7039M1819M8582N5570O2217O9633P8300Q7765R8363
56250A368319J10584J23018J33682J43227J53807J64924J73525J78335J80790
56241B730211J81293J77920J69518J56989J40677J19504R3649O5295L5807M885
56231C875748k6649n6017q1378j03067j21236j34959j44542j51809j57128j58843
56221B740120j56599j52512j47975j42048j34243j26054j18393j10098j00582
56212A551616r1545q4518p8769p3017o7229o1604n5750n0015m5583m2335l8689
56201H62562l4352l0883k8760k6394k3086k0397j9348j8720j7358j5874j4745
56190F12645j3062j0460q219p121o347n477n353n973n909m892m445m900m380k142
$$ y = [723066, 754773, 789031, 826070, 867889, 916471, 972041, 1034258, 1103891, 1182191, 1269956, 1368319, 1478903, 1601921, 1735603, 1878830, 2032637, 2197561, 2371086, 2549421, 2730211, 2911504, 3089424, 3258942, 3415931, 3556608, 3676112, 3769761, 3835056, 3870863, 3875748, 3849099, 3793082, 3711704, 3608637, 3487401, 3352442, 3207900, 3056091, 2898963, 2740120, 2583521, 2431009, 2283034, 2140986, 2006743, 1880689, 1762296, 1652198, 1551616, 1460071, 1375553, 1296784, 1223767, 1156538, 1094934, 1039184, 989169, 943586, 901251, 862562, 828210, 797327, 768567, 742173, 719087, 698690, 679342, 660622, 643264, 627390, 612645, 599583, 589123, 580904, 573783, 567436, 561959, 556606, 550633, 544724, 539832, 535387, 530487, 526107, 523965]
56176E23965k28k22q48m92K78M61O44J483K150K002J947K667L332L440L992N449
56160E50020O587O673O832P865Q823R060R681J1456J3333J4399J5525J7655K0301
56147F98210K2921K6004K9851L4094L9300M6867N6464O5738P3431Q0433Q6913
56136A260226R0879R0544Q5825P6929O4363N1148M1857L8023L7076L6511L5958
56125A909339L4226K8365J7765O057l171r832j4987j8372k0505k4385l2611m4669
56113A827220n8492p2197q3134q8304q7575q3879p8926p1635o1860n2146m4120
56102A044952l6632k9207k3764k1040j8754j5410j2415j0556q068m353j811j690
56090H61252j730k57J123J270J990M193N555M754M229N786P420P315P177Q507
$$ y = [523965, 523737, 523515, 522667, 522175, 522453, 522914, 523558, 525041, 527191, 529193, 531140, 533807, 537139, 540579, 544571, 550020, 556607, 563280, 570112, 577977, 586800, 595860, 605541, 616997, 630330, 644729, 660254, 677909, 698210, 721131, 747135, 776986, 811080, 850380, 897247, 953711, 1019449, 1092880, 1173313, 1260226, 1351105, 1441649, 1527474, 1604403, 1668766, 1719914, 1761771, 1799794, 1836870, 1873381, 1909339, 1943565, 1971930, 1989695, 1995752, 1992581, 1982749, 1967762, 1949390, 1928885, 1904500, 1871889, 1827220, 1768728, 1696531, 1613397, 1525093, 1437518, 1353639, 1274713, 1203078, 1141218, 1089072, 1044952, 1008320, 979113, 955349, 934309, 915555, 900145, 887730, 877174, 869106, 864753, 862942, 861252, 859522, 859265, 860388, 861658, 863648, 867841, 873396, 878150, 882379, 888165, 895585, 902900, 910077, 918584]
56076I18584R472Q671Q170R519J0657J0032R939J2261J4764J5199J5240J6769
56064A059277J8088J7470J6678J7319J7537J6000J5125J6566J7676J6309J4972
56053A243017J6021J7162J5937J4423J4948J5537J4211J3493J5778J8558J9142
56042A418227J9804K3048K6232K6226K5152K6047K7086K5744K4406K6065K8609
56031A696646K9148K9802L3210L6675L6928L6454L8743M1578M1574M1012M3472
56020B105242M6912M7954M8784N2787N7479N8973N9286O2023O5097O5197O5081
56009B734815O8871P4267P7117P9349Q4598R0526R3459R6130J02664J10531J15685
55998C728012J20668J29199J38017J42829J46958J55142J64631J71546J79689
$$ y = [918584, 928056, 936727, 944897, 954416, 965073, 975105, 985044, 997305, 1012069, 1027268, 1042508, 1059277, 1077365, 1094835, 1111513, 1128832, 1146369, 1162369, 1177494, 1194060, 1211736, 1228045, 1243017, 1259038, 1276200, 1292137, 1306560, 1321508, 1337045, 1351256, 1364749, 1380527, 1399085, 1418227, 1438031, 1461079, 1487311, 1513537, 1538689, 1564736, 1591822, 1617566, 1641972, 1668037, 1696646, 1725794, 1755596, 1788806, 1825481, 1862409, 1898863, 1937606, 1979184, 2020758, 2061770, 2105242, 2152154, 2200108, 2248892, 2301679, 2359158, 2418131, 2477417, 2539440, 2604537, 2669734, 2734815, 2803686, 2877953, 2955070, 3034419, 3119017, 3209543, 3303002, 3399132, 3501796, 3612327, 3728012, 3848680, 3977879, 4115896, 4258725, 4405683, 4560825, 4725456, 4897002, 5076691]
55989E076691J93321K08029K19039K31288K50349K71179K87793L05884L32937
55980G376510L64147L92081M21707M60983N05233N46885N92111O51004P20101
55971A2030762P92376Q75338R80552J104904J242303J403728J604962J846455
55963B1881380K128959K476852K920813L471330M137706M958551N981513P226258
55955E5183362Q698089J0421009J2431244J4777978J7580440K1041820K5328764
55948A65462706L0430146L6084698M1572286M5276015M4622306L7192845K2634184
55941D23275186L655993j5126234k9673639l8252022m1334934m0438373l7150583
55934B24955394l2759066k8161618k3851067k0017364j6717559j3957994j1685752
$$ y = [5076691, 5270012, 5478041, 5697080, 5928368, 6178717, 6449896, 6737689, 7043573, 7376510, 7740657, 8132738, 8554445, 9015428, 9520661, 10067546, 10659657, 11310661, 12030762, 12823138, 13698476, 14679028, 15783932, 17026235, 18429963, 20034925, 21881380, 24010339, 26487191, 29408004, 32879334, 37017040, 41975591, 47957104, 55183362, 63881451, 74302460, 86733704, 101511682, 119092122, 140133942, 165462706, 195892852, 231977550, 273549836, 318825851, 363448157, 400641002, 423275186, 426931179, 411804945, 382131306, 343879284, 302544350, 262105977, 224955394, 192196328, 164034710, 140183643, 120166279, 103448720, 89490726, 77804974]
55927G7804974r809935q260903o997765n969464n114418m396496l804185l316400
55919C0135408k901097k543791k246402j999412j781751j585550j416002j268902
55911A4392501j131455j003166q94020q03354p20374o43655n80937n31021m84058
55902G600461m38716m02043l73305l44128l13784k89037k69669k48787k26633
55893D694359k09844j97698j82750j64767j50795j41577j30715j17392j07678
55884C291143j02867r8145r3169r2623r5640r5411r0346q5629q3111p9257p3846
55873B301099p1196p1767p1225o8593o7091o6545o3261n7738n4317n2860m8863
55862A607643m2309l8359l8580l9106l8200l8163l9068l7828l4393l2137l1439
$$ y = [77804974, 67995039, 59734136, 52736371, 46766907, 41652489, 37255993, 33451808, 30135408, 27234311, 24690520, 22444118, 20444706, 18662955, 17077405, 15661403, 14392501, 13261046, 12257880, 11363860, 10560506, 9840132, 9196477, 8615540, 8084519, 7600461, 7161745, 6759702, 6386397, 6042269, 5728485, 5439448, 5169779, 4920992, 4694359, 4484515, 4286817, 4104067, 3939300, 3788505, 3646928, 3516213, 3398821, 3291143, 3188276, 3090131, 2996962, 2904339, 2808699, 2713288, 2622942, 2537313, 2454202, 2374945, 2301099, 2229903, 2158136, 2086911, 2018318, 1951227, 1884682, 1821421, 1763683, 1709366, 1656506, 1607643, 1565334, 1526975, 1488395, 1449289, 1411089, 1372926, 1333858, 1296030, 1261637, 1229500, 1198061]
55851A198061k9430k6392k5702k7108k6765k4316k3288k4086k3324k0646j9484
55840I27520k0322j9795j7344j6310j7424j7551j5949j5530j6771j6478j3965
55829G40081j2463j2967j2440r733p709p824p867o758o572q083r106q855r357
55816F20347j1107j1805j0747j0067j0401r724p641o384o442n557l214j643j306
55803E24309J45L188N233N365N873P633Q373P032N578M924L238j12k922m131n461
55788E68265p552q351p100o031o387o528n698n920q123r980r579p961o114k759
55774D70182K864R166J4963K1026K6838K8753K3619J2166k456j6976k7813l1967
55762E30365l0120k6418k3634k0844j6907j3085j0714r072p434o715p408q249
$$ y = [1198061, 1168631, 1142239, 1116537, 1089429, 1062664, 1038348, 1015060, 990974, 967650, 947004, 927520, 907198, 887403, 870059, 853749, 836325, 818774, 802825, 787295, 770524, 754046, 740081, 727618, 714651, 702211, 692478, 684769, 676945, 669078, 662320, 655748, 647665, 638559, 629704, 620347, 609240, 597435, 586688, 576621, 566220, 556496, 548855, 542471, 536029, 530472, 527258, 525615, 524309, 524454, 527642, 532875, 538240, 544113, 551746, 560119, 567151, 572729, 577653, 580891, 580779, 577857, 573726, 568265, 560713, 552362, 545262, 539231, 532844, 526316, 520618, 514698, 506575, 496595, 487016, 479055, 472941, 470182, 473046, 482212, 497175, 518201, 545039, 573792, 597411, 609577, 607121, 590145, 562332, 530365, 500245, 473827, 450193, 429349, 412442, 399357, 388643, 379571, 372137, 365422, 358014, 349765]
55750C49765q425q829r737r678p975o080n008l829j926l82J91Q29J889J937K14
55735B92956k013l737n488p180p263n302l165k254j866j417j808l319m523m649
55721B38972m711n106m535k548o87K88J804M675P385Q685R437J0279R882P293
55707B81113L834R63j597m128n557n515n589o753p691p313o781p276p856p378
55693B12476o606o498o233m862l177k179j401m32k42j238j821p13R43J623J859
55678A81499K722L651L679L303L202K510L78k055l137k985k607k081j283j053
55664A85743j858k457j684m07o2l20O1J120K020K535K769K411J609J493K523L504
55648A99000L512L395L956M117K646M12q77j180j725k987m636o520q285q881p881
$$ y = [349765, 341340, 332511, 322774, 313096, 305121, 299041, 294033, 290204, 288278, 287896, 288087, 288916, 290805, 292742, 292956, 290943, 287206, 281718, 274538, 267275, 261973, 258808, 256554, 254688, 253271, 251463, 248144, 243621, 238972, 234261, 229155, 224620, 222072, 221385, 221673, 223477, 228152, 235537, 244222, 253659, 263938, 273820, 281113, 284947, 285910, 284313, 280185, 274628, 269113, 263524, 256771, 249080, 241767, 234986, 227710, 219854, 212476, 205870, 199372, 193139, 188277, 185100, 182921, 181520, 181088, 180846, 179608, 177787, 177074, 178017, 179640, 181499, 184221, 187872, 191551, 194854, 198056, 200566, 200944, 198889, 195752, 192767, 190160, 188079, 186796, 185743, 183885, 181428, 179744, 179337, 179275, 178955, 179016, 180136, 182156, 184691, 187460, 189871, 191480, 192973, 195496, 199000, 202512, 205907, 209863, 213980, 216626, 217038, 216161, 214981, 213256, 210269, 205633, 199113, 190828, 181947, 174066]
55633A74066o448n765n497m884m161l689k957j800j277j910k459j864j007r38
55619A29410q70K14J315Q54p37j851k248k708l050k531j590j235j197n21N13P88
55603A14556L09N9J72j03q71j457j629j673j520r71n25q53j735k380k418j841
55587I7120o46O83J173P26N50J327K083J871J412J766K480K521K048J870J986
55572A18970K080K568L772M888N078M755M469L634J752j59r83j312k218l258l429
55557A40607l162l463l907l504k743k817l290k762j488j206k391l563l430k232
55543A00649q42R4K22j81j27O99J069o1j618j802o69L00O81J194J761J443L12
55526A03124n26p48j054j527j485j081j338k355l045k927k690k699k333j296k69
$$ y = [174066, 167618, 161853, 156356, 151472, 147311, 143622, 140665, 138865, 137588, 135678, 133219, 131355, 130348, 129410, 128540, 128754, 130069, 130923, 130186, 128335, 126087, 123379, 120329, 117798, 116208, 114973, 113776, 113255, 113768, 114556, 114865, 114924, 115096, 114993, 114122, 112665, 111036, 109363, 107843, 106872, 106347, 105494, 103759, 101379, 98961, 97120, 96474, 97157, 98330, 99056, 99606, 100933, 103016, 104887, 106299, 108065, 110545, 113066, 115114, 116984, 118970, 121050, 123618, 127390, 132278, 137356, 142111, 146580, 150214, 151966, 151807, 150824, 149512, 147294, 144036, 140607, 137445, 133982, 130075, 126571, 123828, 121011, 117721, 114959, 113471, 112265, 109874, 106311, 102881, 100649, 99807, 99901, 100123, 99942, 99815, 100514, 101583, 101522, 99904, 98102, 97433, 97733, 98414, 99608, 101369, 102812, 103124, 102598, 101850, 100796, 99269, 97784, 96703, 95365, 93010, 89965, 87038, 84348, 81649, 79316, 78020, 77751]
55511G7751K14M24O16N53K33J75N73R19P81L87K04L98P19O56r0j016j155m08J64
55492H2098j23o16n41j97r2J13O71Q38J00o22l57L04L73K27O24R69M22j97L59
55473H4353J337J023l15q12j38J39o39j335j290j330j918k173j470m51J75N58
55457G5714R15J001Q48Q51R11N53Ol9K49L0o88j074r75r89j049n30K25J94l63
55438G5790j9J359K097J245k0l24P5K09p4l96o12n90j18M47L47l44o40j33M95
55419G8794Q27J395K517L509L673L148K298J114k83j314j589j296p98m62p77j776
55403H8980k509k094j132r09j356j266m17P1k89o80n42k87q9N00J232J130K75
55386H0618K1P88J218M64l60p0O67N20n00j475k046k242j709l07J065J350O96
$$ y = [77751, 77965, 78389, 79005, 79558, 79791, 79966, 80539, 81458, 82239, 82626, 82830, 83228, 83947, 84603, 84513, 83497, 82342, 81934, 82098, 81975, 81359, 80818, 80621, 80529, 80642, 81313, 82151, 82251, 81629, 81272, 81576, 81949, 82176, 82800, 83769, 84191, 83994, 84353, 85690, 86713, 86398, 85586, 85448, 85587, 84948, 83613, 82323, 80993, 79075, 76902, 75432, 74981, 75156, 75714, 76629, 77630, 78478, 79329, 80240, 80793, 80799, 80760, 81009, 81039, 80351, 79277, 78302, 77313, 76264, 75734, 75959, 76153, 75790, 75771, 77130, 79227, 80472, 80452, 80128, 80203, 80412, 80338, 79942, 79330, 78740, 78622, 79069, 79416, 79072, 78432, 78299, 78794, 79621, 81016, 83533, 87042, 90715, 93863, 96161, 97275, 96992, 95678, 94089, 92793, 91995, 91533, 90756, 88980, 86471, 84377, 83245, 82336, 80980, 79714, 79297, 79368, 79079, 78399, 77857, 77570, 77481, 77981, 79213, 80343, 80618, 80639, 81427, 82645, 83109, 82749, 82679, 83346, 83866, 83366, 81891, 79845, 77603, 75894, 75587, 76652, 78002, 78698]
55369G8698J26J75N41P06M39n1k09J74M10k46j262j405o83m12j063j494q64R7
55351G3677M55M49N84N13j19p06n33P6L77K80N5k60n06k32L77L59n45j200p14
55332G2387J71L09j20j95J91M82O24R02J053N60l52q88o96p1N53Q13N12RoM11
55312G6649L28n55j160o08K75J17r28j444q29R3M42L14K25L22M00L42K96N02Q81
55293G5662Q90J67p01p22R6O33K39l55k13M19O27J68l43l16K79R48R99J86q32
55274G7831j094o31l89p44q93j44J050J816J902J530Q55J72l2K85N65M47J08m07
55256H2227j278k051j777n04M41K80j97j22J18r9l63p1L65K71p7o6J46J44J62
55237G7549N04O52Q1p00q99o39m50k34K33M13j47p11l35N72Q76M52L6k02o52j089
$$ y = [78698, 78824, 78999, 79540, 80246, 80685, 80634, 80425, 80599, 81009, 80763, 79501, 78096, 77413, 77001, 75938, 74444, 73580, 73677, 74132, 74581, 75165, 75678, 75559, 74853, 74320, 74396, 74773, 75053, 75108, 74848, 74342, 74110, 74487, 74846, 74301, 73101, 72387, 72558, 72867, 72747, 72552, 72743, 73225, 73849, 74751, 75804, 76364, 76012, 75124, 74428, 74357, 74910, 75723, 76235, 76244, 76238, 76649, 76977, 76422, 75262, 74654, 74929, 75046, 74118, 72674, 71845, 71938, 72380, 72694, 72919, 73241, 73641, 73983, 74279, 74781, 75662, 76552, 76719, 76018, 75296, 75392, 76025, 76264, 75909, 75696, 76115, 76742, 76910, 76567, 76251, 76530, 77478, 78477, 78663, 77831, 76737, 76106, 75717, 74973, 74080, 73936, 74986, 76802, 78704, 80234, 81089, 81261, 81229, 81514, 82079, 82526, 82634, 82227, 80949, 78898, 77121, 76617, 77058, 77338, 77141, 77019, 77137, 77038, 76675, 76604, 76969, 77240, 77163, 77097, 77243, 77387, 77549, 78053, 78705, 78786, 78086, 77187, 76548, 76098, 75864, 76097, 76510, 76363, 75652, 75317, 75889, 76765, 77217, 77253, 77051, 76399, 75310]
55217G5310q63r0N16Q06J056J006K39o41n49M26J137J091P98M75k32j105j277
55200G8103n96P3K08K63N48N71o0r00j293j076m11L99P75L58k57q1P32R29j8j071
55180G7196j071j52Q59J600K051J914R47l43j020p12N5M74K52j18J81J320K424
55163H5857K477J539N65J60J01J11K65M07l8j157k040j812p92k1Q6K0K08M06K39
55144H6581j73m31n03p55j304j681j368m99K33L63L9l81o98p55l32N37J376J669
55126H1918J385R06O13N97O62M96K2l93l67q0p8m61p45o05k36J28N15Q21P25K47
55106H6070j71l45n24o58k62O03J064P12L82R38J924K273J804J157O94L41K13
55089I6215M98Q57P06O6n07o56l97K26J032J469J045or55j340j171p45n35q71
$$ y = [75310, 74447, 74357, 74873, 75679, 76735, 77741, 77980, 77339, 76790, 77216, 78353, 79444, 80242, 80717, 80485, 79380, 78103, 77507, 77580, 77788, 78051, 78599, 79170, 79110, 78210, 76917, 75841, 75430, 75829, 76604, 76962, 76705, 76624, 77356, 78285, 78267, 77196, 76125, 75973, 76832, 78432, 80483, 82397, 83344, 83001, 81981, 81269, 81324, 81798, 82050, 81932, 82113, 83433, 85857, 88334, 89873, 90438, 90598, 90699, 90810, 91075, 91482, 91444, 90287, 88247, 86435, 85643, 85622, 85708, 85728, 85936, 86342, 86581, 86408, 85977, 85474, 84719, 83415, 81734, 80366, 79867, 80100, 80463, 80502, 80121, 79423, 78668, 78336, 78873, 80249, 81918, 83303, 84209, 84822, 85419, 86081, 86577, 86599, 86206, 85839, 85759, 85681, 85220, 84475, 83870, 83634, 83762, 84277, 85098, 85823, 86070, 85899, 85554, 85030, 84372, 84110, 84713, 85777, 86489, 86871, 87809, 89733, 92006, 93810, 94967, 95661, 96002, 96215, 96713, 97570, 98276, 98342, 97835, 97179, 96782, 97008, 98040, 99509, 100554, 100548, 99593, 98253, 97082, 96337, 95802, 94931]
55071I4931j355j107J1J030J205J008J111J189O00l32p63n76k98j30N9J14j21
55054I6576l11k12l25j027j621j245k78K63L18N05P66N42R3K11P40O96j02q07
55036I4782r35p92n36j08l8q97j881j473K18J334R21J48K56Q24R13O78O60O16
55018I4690J36l03k7N68N19k79r64r37m96l08o28j048q59J11J076J086K15o36
55000I1916j015j251j477j245m50L10O77J054J674J933J296J89n72p65n77n4O74
54983I2317R93M41n09q51k20P53J163P41O1m1N90J211J123O32N33Q96J066Q07
54965A01706O02P02P14L87O5J6J4p2L8M39P17N87K85O2k03n78q74j021j114r12
54945A01560k6J222J926J782J307P00m30j811k235j268j72k02q42q08o3L70J99
$$ y = [94931, 93576, 92469, 92480, 93510, 94715, 95723, 96834, 98023, 98623, 98291, 97528, 96952, 96654, 96524, 96583, 96697, 96576, 96265, 96053, 95728, 94701, 93080, 91835, 91557, 91820, 92138, 92643, 93409, 93951, 94044, 94255, 94995, 95691, 95589, 94782, 93847, 93055, 92519, 92411, 92373, 91476, 89595, 88122, 88340, 89674, 90595, 90743, 90999, 91823, 92736, 93414, 94074, 94690, 94826, 94523, 94496, 95064, 95583, 95304, 94340, 93403, 92907, 92599, 91971, 90923, 90064, 90175, 91251, 92337, 92552, 91916, 90901, 89650, 88173, 86928, 86478, 86788, 87465, 88519, 90193, 92126, 93422, 93611, 93039, 92274, 91697, 91643, 92317, 93310, 93751, 93242, 92391, 92171, 92924, 94087, 94828, 94889, 94848, 95438, 96649, 97772, 98404, 98937, 99833, 100899, 101706, 102308, 103010, 103724, 104111, 104176, 104192, 104206, 104134, 104172, 104611, 105328, 105915, 106200, 106262, 106059, 105481, 104607, 103586, 102472, 101560, 101534, 102756, 104682, 106464, 107771, 108471, 108041, 106230, 103995, 102727, 102555, 102353, 101511, 100703, 100640, 101010, 101209]
54928A01209K33J016K078K668K598K299K384L154M127M382L704L029L255L989
54914A40125M106L228J964Q28l45j847l522m939n772n906n386m359l063j856j172
54899A12084j154j374j241o97j63J31L55O02P91J004J365J534J071K93KK57L14
54882A15174K0J57R96J684J724J957L118M421M710M308M388M971M843L357J183
54867A57011p80k241l207l659l774l874m050m185m318m510m477l892k928k042
54853A09074j380q71o60q55j014n69L14Q35N57k27j034j608j742j280l99L85O64
54836A00190L70k15n60k51M77Q34M82L7J21L75N8o72r14l68K77L83J41N2K56N73
54816A01646Q13Q33N32K6l96n35m07m5N46J209J551J162K2j300j869j209J18J048
$$ y = [101209, 101442, 102458, 104536, 107204, 109802, 112101, 114485, 117639, 121766, 126148, 129852, 132881, 136136, 140125, 144231, 147459, 149423, 150251, 149906, 148059, 144537, 139598, 133826, 127920, 122534, 118175, 115112, 113256, 112084, 110930, 109556, 108315, 107618, 107455, 107586, 107941, 108543, 109334, 110338, 111703, 113237, 114308, 114601, 114603, 114860, 115174, 115194, 115351, 116347, 118031, 119755, 121712, 124830, 129251, 133961, 138269, 142657, 147628, 152471, 155828, 157011, 156231, 153990, 150783, 147124, 143350, 139476, 135426, 131241, 126923, 122413, 117936, 114044, 111116, 109074, 107694, 106823, 106163, 105308, 104294, 103725, 104039, 104874, 105431, 105204, 104170, 102562, 100820, 99540, 99141, 99526, 100190, 100560, 100345, 99785, 99534, 100011, 100845, 101327, 101364, 101485, 101860, 101918, 101246, 100332, 99964, 100241, 100624, 100765, 100817, 101073, 101646, 102459, 103292, 103824, 103850, 103454, 102919, 102512, 102467, 103013, 104222, 105773, 106935, 106957, 105657, 103788, 102579, 102697, 103745]
54798A03745J188J050J032P80r1j189j758j524p54J95R31J041N78K02L29N07J60
54781A06422l96l81K77Q86J016Q96Q97J163J741K530L131L222L072L217L706M107
54765A35506M200M170M157M143M202M387M376L691K295N87j166k926m486n485
54751A57651n918o151o260n793m442k654j304q20q49q10o29o97j101j250o59J48
54735A18462J73o50j339j197n51J28R38J892K404K164J825K072K567K670K681
54720A34239L321M350M711M001K891K059J457O41p09k577m417n352n046m132l299
54705A32138k482j535j078j655k509k343j109J15P54J067R79K0j414k122j785
54690A17041j400j579j668j113n34n97q28m90R7J08m48r00j015j067j011m94L60
$$ y = [103745, 104933, 105983, 107015, 107795, 107704, 106515, 104757, 103233, 102479, 102674, 103605, 104646, 105224, 105426, 105755, 106262, 106422, 106026, 105645, 105922, 106808, 107824, 108720, 109617, 110780, 112521, 115051, 118182, 121404, 124476, 127693, 131399, 135506, 139706, 143876, 148033, 152176, 156378, 160765, 165141, 168832, 171127, 171714, 170548, 167622, 163136, 157651, 151733, 145582, 139322, 133529, 129087, 126433, 125129, 124309, 123460, 122650, 122021, 121324, 120223, 118973, 118314, 118462, 118635, 117985, 116646, 115449, 114898, 115026, 115964, 117856, 120260, 122424, 124249, 126321, 128888, 131558, 134239, 137560, 141910, 146621, 150622, 153513, 155572, 157029, 157670, 156961, 154384, 149967, 144615, 139569, 135437, 132138, 129656, 128121, 127043, 125388, 122879, 120536, 119427, 119542, 120296, 121363, 122342, 122362, 120948, 118826, 117041, 115641, 114062, 112394, 111281, 110747, 110150, 109322, 108832, 108929, 109037, 108589, 107689, 106674, 105607, 104596, 104102, 104462]
54673A04462Q88P42L32K27M32M33j19q73j060l96M57O15M2n13n71l35p2K67O10
54654A05568N60L5l79j49M81Q69Q13O13N63O50P15N89K38j12k00j35l40r21j388
54635A08070j202m18M12P34L38n38j296j378p62Q5P24J022R66N59Ll75n06n97
54617A05841o79m89N1N48N53Q5m03m72p2M23N29J70k98n84p41p12j37R00J437
54598A05950P22n28q94j32O76Q94J050J532J652P60o02j393j359r41m54o9j43
54581A06721p32j085m56P65J405R98J85l43o19q46p61J0J231K154K327J935J340
54564A14229N50n55j671k139j700q39k13K0O5Lj48j89K8K94M09N92J031J345J119
54545A12231P74J034J670J720J003M11M12L38l15q31l35P78J311P76l01j303j989
$$ y = [104462, 105350, 106092, 106424, 106651, 107083, 107516, 107397, 106524, 105464, 105068, 105525, 106140, 106182, 105669, 105098, 104763, 104691, 104958, 105568, 106128, 106163, 105784, 105635, 106116, 106985, 107798, 108411, 108974, 109624, 110339, 110928, 111166, 111054, 110854, 110719, 110379, 109458, 108070, 106868, 106450, 106862, 107596, 107934, 107396, 106100, 104722, 103960, 104045, 104769, 105791, 106757, 107316, 107319, 106944, 106438, 105841, 105162, 104673, 104724, 105272, 105825, 105910, 105507, 105035, 104963, 105386, 105915, 106085, 105787, 105203, 104462, 103750, 103613, 104513, 105950, 106672, 106144, 105250, 105118, 105794, 106688, 107738, 109270, 110922, 111682, 111080, 109687, 108328, 107387, 106933, 106864, 106721, 105989, 104904, 104448, 105213, 106618, 107616, 107801, 107458, 106839, 105993, 105232, 105242, 106473, 108627, 110954, 112889, 114229, 114779, 114224, 112553, 110414, 108714, 107875, 107662, 107682, 107747, 107750, 107602, 107413, 107441, 107735, 108144, 108736, 109767, 111112, 112231, 113005, 114039, 115709, 117429, 118432, 118843, 119255, 119593, 119278, 118447, 118112, 118890, 120201, 120977, 120676, 119373, 117384]
54528A17384k175j707q18p6J30j19m27l57K61J068J415J029K55m18p66o64k4Q83
54510A14874J407J204O21J45j21k09M0O17J078J084Q81Q68R53P83L24k40q39j314
54492A22156j259n20L16N54K35m3J3K34M73O89O80K94j13k1N37R90J005P70N09
54473A27499K37L3J33N68J071J419J578J485J063N33L43N54O54K08n24q78n97
54456A35379r4J17m2k69l58m46p40j191j547j617j378r07l93j06j49k88k49j66
54438A25556m02r58j325j038j74P16J045O79J21O3N01O25k0p17n71N5R2m30l80
54419A23438N80J300R14J07j27J6j52m77l99j11j95m55k28M33R07J142J561J962
54401A30216J689R26O67J160J422Q14L7j7L81M27J19J11M92O06P1o54r35o66j54
$$ y = [117384, 115209, 113502, 112684, 112608, 112738, 112619, 112192, 111835, 112096, 113164, 114579, 115608, 115863, 115445, 114679, 114015, 113991, 114874, 116281, 117485, 118106, 118251, 118130, 117921, 117961, 118578, 119656, 120740, 121621, 122489, 123442, 124225, 124549, 124309, 123470, 122156, 120897, 120377, 120693, 121247, 121482, 121439, 121452, 121686, 122159, 122848, 123528, 123822, 123709, 123688, 124225, 125215, 126220, 126990, 127499, 127736, 127769, 127902, 128470, 129541, 130960, 132538, 134023, 135086, 135619, 135962, 136516, 137170, 137378, 136854, 135976, 135379, 135285, 135402, 135360, 135091, 134733, 134287, 133547, 132356, 130809, 129192, 127814, 126907, 126514, 126408, 126259, 125971, 125722, 125556, 125154, 124196, 122871, 121833, 121659, 122375, 123420, 124099, 124220, 124283, 124784, 125409, 125389, 124672, 124101, 124156, 124248, 123818, 123438, 124018, 125318, 126232, 126339, 126212, 126228, 126076, 125599, 125200, 125089, 124894, 124439, 124211, 124644, 125551, 126693, 128254, 130216, 131905, 132831, 133498, 134658, 136080, 136894, 136931, 136914, 137295, 137722, 137841, 137952, 138444, 139050, 139121, 138467, 137532, 136866, 136712]
54382A36712L91Q94J215J225J045R63J042J020P38M84P35J668L058M457N307N140
54366A66094M092L011K543K218J153m90j551j592j554k238l038k930k057j424
54352A62237j404j575j728k077k465k348j686j172j281j691j827j578j219j038
54338A39148j159j402j310o34J46K39m74j230j283o21K14P05O66L22J66M25P02
54321A34620M65j26l98j01K91L36J40j7q7o5J61M99N95L60K05M23O95N99L09L55
54301A39259P89J053O51l17j314j772j442n85J10J16l78o29j89O03J059R05M04
54284A38323q1l88l83J00R26J494J234K27q67j495j608j448j288j259j225p86
54268A31476J67J033J054L80LM63J196J481J471J720K103K013J422J064J406K025
$$ y = [136712, 137103, 137997, 139212, 140437, 141482, 142445, 143487, 144507, 145245, 145729, 146464, 148132, 151190, 155647, 160954, 166094, 170186, 173197, 175740, 177958, 179111, 178621, 177070, 175478, 173924, 171686, 168648, 165718, 163661, 162237, 160833, 159258, 157530, 155453, 152988, 150640, 148954, 147782, 146501, 144810, 142983, 141405, 140186, 139148, 137989, 136587, 135277, 134643, 134789, 135028, 134554, 133324, 132041, 131420, 131634, 132339, 133005, 133327, 133493, 133918, 134620, 135085, 134959, 134561, 134460, 134751, 135087, 135227, 135210, 135123, 135058, 135219, 135718, 136313, 136673, 136878, 137301, 137996, 138595, 138904, 139259, 140048, 141101, 141752, 141435, 140121, 138349, 136907, 136322, 136432, 136548, 136170, 135541, 135352, 135955, 137014, 137919, 138323, 138242, 137854, 137471, 137571, 138497, 139991, 141225, 141452, 140585, 139090, 137482, 136034, 134746, 133487, 132262, 131476, 131643, 132676, 133730, 134110, 134113, 134576, 135772, 137253, 138724, 140444, 142547, 144560, 145982, 147046, 148452, 150477]
54252A50477K215J841J287Q55N05J16l10p80j426k260k917k920k313j636j100
54237A41634k92R52J845J607P97O71J277J305Q4j278j508q82n82r29j281j260
54221A42160j059p24KR87J540J151J07p74q21j05N89N16j99p49p07l30J50P67
54203A42501J074K76j348k185j285K28P66M61M71Q65P47R7j05L42N26M8l48j81
54185A42950l2l99p88n55J63R27J629K164K073J212J99k53j63p1l83j105j851
54168A45717j965j117M3L76l84j278j331o46JJ24j78n25n98l91j90j19J09O37
54150A38285R59O15O0O4L96J56o60j061o57k37l68n39j76M12P41R66J270J237
54132A41463N87p8l9M68O49L00p6n6L27P91J049J044J196K015L336M379M749M811
$$ y = [150477, 152692, 154533, 155820, 156675, 157180, 157296, 156986, 156206, 154780, 152520, 149603, 146683, 144370, 142734, 141634, 141342, 142294, 144139, 145746, 146543, 147214, 148491, 149796, 149880, 148602, 147094, 146212, 145630, 144701, 143420, 142160, 141101, 140377, 140379, 141366, 142906, 144057, 144164, 143390, 142569, 142464, 143053, 143569, 143370, 142621, 141914, 141584, 141734, 142501, 143575, 143851, 142503, 140318, 139033, 139261, 140027, 140488, 140959, 141824, 142571, 142668, 142563, 142905, 143431, 143479, 143131, 142950, 142918, 142519, 141731, 141176, 141339, 142266, 143895, 146059, 148132, 149344, 149543, 149290, 149127, 149056, 148673, 147568, 145717, 143752, 142635, 142678, 143054, 142670, 141392, 140061, 139415, 139416, 139540, 139362, 138837, 138239, 137848, 137658, 137539, 137648, 138285, 139244, 139859, 139919, 139983, 140379, 140535, 139875, 138814, 138157, 137920, 137552, 137013, 136837, 137249, 137990, 138956, 140226, 141463, 142050, 141972, 141933, 142401, 143050, 143350, 143274, 143218, 143545, 144336, 145385, 146429, 147625, 149640, 152976, 157355, 162104, 166915]
54114A66915M863M734M489M741N755O822P140O559N083K426j163m348n980o385
54100B01651o590o723o122m716l345k751k953l504l761l141j772o69o34j226j472
54085A52272j257j151j108m50P92J587J324P19P57J363J676J352R63J130J718
54070A61687K033J666Q75J79k55n93q84r75q77q00p27l95N9L9n70q89q7J307J838
54051A62631R77j31k7J330K563K630K080K216L285M113L813L107L295M394N193
54036B01469M933M020L187K870L397M704N781N493M182L270L023K213N11m12O67
54021B49308K420K760J690P11J95p79k363l488l639l474l466l230k601k260k704
54006B29080l509m026m181m190m059l702l082k121r39j72m11j333k000k067j972
$$ y = [166915, 171778, 176512, 181001, 185742, 191497, 198319, 205459, 212018, 217101, 219527, 218364, 214016, 208036, 201651, 195061, 188338, 182216, 177500, 174155, 171404, 168451, 164947, 161186, 158045, 156273, 155604, 154970, 153744, 152272, 151015, 149864, 148756, 148306, 149098, 150685, 152009, 152728, 153485, 154848, 156524, 157876, 158839, 159969, 161687, 163720, 165386, 166261, 166440, 166185, 165592, 164708, 163733, 162856, 162056, 161329, 160934, 160993, 161032, 160462, 159573, 159486, 160793, 162631, 163608, 163477, 163450, 164780, 167343, 169973, 172053, 174269, 177554, 181667, 185480, 188587, 191882, 196276, 201469, 206402, 210422, 213609, 216479, 219876, 224580, 230361, 235854, 240036, 243306, 246329, 248542, 249053, 248641, 249308, 251728, 254488, 256178, 256889, 257084, 256305, 253942, 250454, 246815, 243341, 239875, 236645, 234044, 231784, 229080, 225571, 221545, 217364, 213174, 209115, 205413, 202331, 200210, 199271, 199099, 198688, 197355, 195355, 193288, 191316]
53991A91316j923j531p17j99n81j394j590p34N91J479J653J713K392L584M458
53976A98517M687M999O040P197P188N497K660n31l348n105n642n636n648n191
53962B05684l687j866j105j479j779j435j088j049o40L97J108P07j87m75J3P45
53946A93864J411J962K262K344K561K974L076K634K196K289K629K714K684K919
53932B28519L205L027K456K159K583L572M644N325N338M788M045L402L035L266
53918B79364M326N747O610O618O416O565O795O619O058N283M129K486P28o98j681
53903C45365k076j625p01m28j374k690l314l424l847m552m860m846n276o194o691
53888B93467o337n895o140o743o828o138n212m618m413m227l691k877k237k019
$$ y = [191316, 189393, 187862, 187145, 186946, 186365, 184971, 183381, 182647, 183238, 184717, 186370, 188083, 190475, 194059, 198517, 203204, 208203, 214243, 221440, 228628, 234125, 236785, 236254, 232906, 227801, 222159, 216523, 210875, 205684, 201997, 200131, 199026, 197547, 195768, 194333, 193245, 192196, 191556, 191953, 193061, 193768, 193581, 193106, 193119, 193864, 195275, 197237, 199499, 201843, 204404, 207378, 210454, 213088, 215284, 217573, 220202, 222916, 225600, 228519, 231724, 234751, 237207, 239366, 241949, 245521, 250165, 255490, 260828, 265616, 269661, 273063, 276098, 279364, 283690, 289437, 296047, 302665, 309081, 315646, 322441, 329060, 335118, 340401, 344530, 347016, 347744, 347046, 345365, 343289, 341664, 340963, 340535, 339161, 336471, 333157, 329733, 325886, 321334, 316474, 311628, 306352, 300158, 293467, 287130, 281235, 275095, 268352, 261524, 255386, 250174, 245556, 241143, 236916, 233225, 230348, 228111, 226092]
53874B26092j924j665j575k144l070l499l172k743k775l039l079k906k740k456
53860A89305j764p65N4K54k02r54j409j192n57j46j94k72J2L82K41m83j210j327
53842A79773p38J02N52L28j33n6P62J638J795J284O93K87j11m84n08j80N4l5j32
53823A84891J9J88K07M26J113J793J816J391J375K007K546K278J375N96N10J170
53807B03701K108K567K233J822K458M222N874O289N635M750M037L493L307L653
53793B56149M143M153L608K895K186J382O74L93L35j80j339k454k847k713k773
53778B63612l315l901m052l959m244m987n334m506l034k260k573k880k182r51
53764B15434l47p11j503k272k871l126l032k983l081k639j255J01J30r48j679
$$ y = [226092, 224168, 222503, 220928, 218784, 215714, 212215, 209043, 206300, 203525, 200486, 197407, 194501, 191761, 189305, 187541, 186776, 186830, 187084, 186882, 185928, 184519, 183327, 182770, 182624, 182430, 182158, 182170, 182552, 182793, 182310, 181100, 179773, 179035, 179137, 179689, 180017, 179884, 179828, 180590, 182228, 184023, 185307, 186000, 186287, 186176, 185692, 185184, 185004, 185058, 185023, 184891, 184910, 185098, 185305, 185731, 186844, 188637, 190453, 191844, 193219, 195226, 197772, 200050, 201425, 202021, 202531, 203701, 205809, 208376, 210609, 212431, 214889, 219111, 224985, 231274, 236909, 241659, 245696, 249189, 252496, 256149, 260292, 264445, 268053, 270948, 273134, 274516, 275190, 275583, 275918, 275738, 274399, 271945, 269098, 266385, 263612, 260297, 256396, 252344, 248385, 244141, 239154, 233820, 229314, 226280, 224020, 221447, 218567, 216385, 215434, 215087, 214376, 212873, 210601, 207730, 204604, 201572, 198589, 195508, 192869, 191614, 191715, 191845, 190897, 189218]
53749A89218j385o93j44M49J084J274R80P96Q55O00j7k19L01Q11P83P00J003J228
53731A97624R29N40O14J025J479J969K149J302l02j064m5J601K296K159K232K492
53715B17000K199J612J681K248K175J334R57J745K877L311L015K435J728R89N41
53700B45847N54R07J624K867M282N053M867M244L681L053K130J056O0q37j489
53685B77899j545j010m90n23r84j389j422j024l50J76R6m84q71n51K40Q78R82
53668B69628N58j81q84j219j165j053j122j185q51o0P09P72q9j204j520o54P28
53651B61208J706J936J559P22j98m18N30K043K992K938K304J548Q74N31O64R41
53635B81880J016J223K026K951L109K703K829L567L643K441J058N68M43k41j011
$$ y = [189218, 187833, 187140, 186996, 187445, 188529, 189803, 190783, 191579, 192434, 193034, 193017, 192798, 193099, 193910, 194693, 195393, 196396, 197624, 198553, 199093, 199707, 200732, 202211, 204180, 206329, 207631, 207329, 206265, 206220, 207821, 210117, 212276, 214508, 217000, 219199, 220811, 222492, 224740, 226915, 228249, 229206, 230951, 233828, 237139, 240154, 242589, 244317, 245306, 245847, 246401, 247308, 248932, 251799, 256081, 261134, 266001, 270245, 273926, 276979, 279109, 280165, 280225, 279388, 277899, 276354, 275344, 274854, 274331, 273347, 271958, 270536, 269512, 269162, 269338, 269434, 268950, 268079, 267528, 267768, 268646, 269628, 270186, 270005, 269121, 267902, 266737, 265684, 264562, 263377, 262526, 262466, 263175, 263947, 263858, 262654, 261134, 260480, 261208, 262914, 264850, 266409, 267131, 266933, 266515, 267045, 269088, 272080, 275018, 277322, 278870, 279744, 280275, 280939, 281880, 282896, 284119, 286145, 289096, 292205, 294908, 297737, 301304, 304947, 307388, 308446, 309014, 309457, 309216, 308205]
53620C08205p24N02J521J972K597L651M346M144L620L556L907M088L822L281K745
53605C51233K454K489K659K719K699K699K391J345o5p49k40N93O54l1o40q13q47
53588C68550q88p30m62o67j612k755l368l286k792k102j391j040j350k108k733
53573C41266k881k581j945j081k45K54L34J00l40p90q51m06pk41p54n97M11J413
53555C31059J731J557J129K17j049j701j125J0Q30J569K714L499K740R66J60J202
53539C45508K908L974M561N300N933N920N542N445N692O048O731P976R315J0059
53525D30912J0256J0396J0499J0369J0454J1458J3131J4389J4776J4897J5286
53514E66823J5745J6176J7183J9092K1068K2075K2349K3058K4479K5361K4483
$$ y = [308205, 307481, 307983, 309504, 311476, 314073, 317724, 322070, 326214, 329834, 333390, 337297, 341385, 345207, 348488, 351233, 353687, 356176, 358835, 361554, 364253, 366952, 369343, 370688, 370623, 369874, 369634, 370227, 370881, 370850, 370210, 369397, 368550, 367662, 366932, 366470, 365803, 364191, 361436, 358068, 354782, 351990, 349888, 348497, 347457, 346107, 343999, 341266, 338385, 335804, 333859, 332778, 332533, 332787, 333121, 333221, 332881, 332091, 331240, 330834, 330827, 330586, 329832, 329235, 329646, 331059, 332790, 334347, 335476, 335693, 334644, 332943, 331818, 331828, 332658, 334227, 336941, 340440, 343180, 344146, 344306, 345508, 348416, 352390, 356951, 362251, 368184, 374104, 379646, 385091, 390783, 396831, 403562, 411538, 420853, 430912, 441168, 451564, 462063, 472432, 482886, 494344, 507475, 521864, 536640, 551537, 566823, 582568, 598744, 615927, 635019, 656087, 678162, 700511, 723569, 748048, 773409, 797892]
53503G97892K2264K0339J9670J9687J9328J8420J7638J7324J7010J6305J5680
53492A001557J5861J6701J7273J7115J6777J6872J7113J6806J5941J5247J5171
53481A182434J5394J5478J5433J5343J4827J3396J1248R182P644O212M226J585
53469A312402j230l807o154q471j0773j2750j3966j4325j4379j4924j6057j6991
53457A178575j7073j6799j7251j8586j9718j9711j8883j8198j7979j7882j7830
53446I78665j8211j9008j9332j8251j5833j3030j0587q501o502m693l487k955
53434H38275k649k146j570j236q41N36L260O301Q130Q441Q477R418J1038J2403
53420H97837J3386J4704J6604J8349J9292J9723K0318K1279K2485K3963K5684
$$ y = [797892, 820156, 840495, 860165, 879852, 899180, 917600, 935238, 952562, 969572, 985877, 1001557, 1017418, 1034119, 1051392, 1068507, 1085284, 1102156, 1119269, 1136075, 1152016, 1167263, 1182434, 1197828, 1213306, 1228739, 1244082, 1258909, 1272305, 1283553, 1292735, 1300379, 1306591, 1310817, 1312402, 1311172, 1307365, 1301211, 1292740, 1281967, 1269217, 1255251, 1240926, 1226547, 1211623, 1195566, 1178575, 1161502, 1144703, 1127452, 1108866, 1089148, 1069437, 1050554, 1032356, 1014377, 996495, 978665, 960454, 941446, 922114, 903863, 888030, 875000, 864413, 855912, 849410, 844717, 841230, 838275, 835626, 833480, 831910, 830674, 829833, 830369, 833629, 839930, 848060, 856501, 864978, 874396, 885434, 897837, 911223, 925927, 942531, 960880, 980172, 999895, 1020213, 1041492, 1063977, 1087940, 1113624]
53409A113624K7201K8100K8618K9321L0419L1829L3622L5753L7688L9094M0644
53398A475913M3200M6269M8406M9189M9635N0369N0672N0072M9602N0337N1555
53387B015219N1575M9987M7832M5942M4220M2489M0871L9147L6716L3419K9713
53376B477130K5826K1427J6356J1080O184J846k143o303j1453j8119k5754l3002
53364B463075l8857m3237m6477m8833n0539n1816n2650n2953n2852n2422n1368
53353A921071m9629m8061m7506m7339m5983m3167m0505l9406l9363l9008l7882
53342A443222l6413l4846l3103l1224k9135k6471k3308k0645j9284j8600j7279
53331A152914j5089j3011j1709j0807r826r060r066r825j0713j1118j0862j0195
$$ y = [1113624, 1140825, 1168925, 1197543, 1226864, 1257283, 1289112, 1322734, 1358487, 1396175, 1435269, 1475913, 1519113, 1565382, 1613788, 1662977, 1712612, 1762981, 1813653, 1863725, 1913327, 1963664, 2015219, 2066794, 2116781, 2164613, 2210555, 2254775, 2297264, 2338135, 2377282, 2413998, 2447417, 2477130, 2502956, 2524383, 2540739, 2551819, 2558003, 2559849, 2557706, 2551403, 2539950, 2521831, 2496077, 2463075, 2424218, 2380981, 2334504, 2285671, 2235132, 2183316, 2130666, 2077713, 2024861, 1972439, 1921071, 1871442, 1823381, 1775875, 1728536, 1682553, 1639386, 1598881, 1559475, 1520112, 1481104, 1443222, 1406809, 1371963, 1338860, 1307636, 1278501, 1252030, 1228722, 1208077, 1188793, 1170193, 1152914, 1137825, 1124814, 1113105, 1102298, 1092472, 1083412, 1074346, 1064521, 1053808, 1042690, 1031828, 1021633]
53319A021633r507q886q014o636n063l931l467l218k517j136N62K042L194M466
53305I79522O214Q034R172R615J0214J1559J3232J4576J5639J6858J8320J9904
53293A132859K1788K4065K6057K6789K6157K5044K4214K3636K2918K1841K0311
53282A395679J8258J5841J3374J0978Q459N622K487q14m014o718q757j0492j2406
53269A427497j4486j6364j8000j9692k1469k2997k4250k5620k7214k8506k9031
53258A179868k8935k8568k7963k7168k6610k6632k6856k6560k5630k4663k4152
53247H86131k3991k3857k3672k3494k3197k2576k1603k0470j9374j8335j7198
53236F48364j5759j4080j2594j1728j1293j0494q867o984n917n961o359o307n895
$$ y = [1021633, 1012126, 1003240, 995226, 988590, 983527, 979596, 976129, 972911, 970394, 969258, 969820, 971862, 975056, 979522, 985736, 993770, 1002942, 1012557, 1022771, 1034330, 1047562, 1062138, 1077777, 1094635, 1112955, 1132859, 1154647, 1178712, 1204769, 1231558, 1257715, 1282759, 1306973, 1330609, 1353527, 1375368, 1395679, 1413937, 1429778, 1443152, 1454130, 1462589, 1468211, 1470698, 1469884, 1465870, 1459152, 1450395, 1439903, 1427497, 1413011, 1396647, 1378647, 1358955, 1337486, 1314489, 1290239, 1264619, 1237405, 1208899, 1179868, 1150933, 1122365, 1094402, 1067234, 1040624, 1013992, 987136, 960576, 934946, 910283, 886131, 862140, 838283, 814611, 791117, 767920, 745344, 723741, 703271, 683897, 665562, 648364, 632605, 618525, 605931, 594203, 582910, 572416, 563549, 556565, 550648, 544687, 538328, 532021, 526126]
53223E26126n760o214p034p893q607r075r352r715j0311j0796j0686j0016r286
53210D11381q764q237p494o612n732m928m354m142m106l967l948m573n808o847
53196C31869p076o708o282n968n683n398n035m449l868l805m280m604m311l768
53182B60634l419l078k502k049k076k202j950j604j634j631r94k60n69j819k517
53167B32330j837o96l77r36j567j804j684j210l93M07P28N31J85J5J2p1m76j119
53149B22038j559j472j093q80q07n11pK56J70J40L70N70O20Q77J432J688J188
53132B23020L70n3r1j93l18m0N61Q38N74M03R50J942K560K396J796J339J256J406
53114B38716J565J522J035J8j121j608j104k06J22l77j121j526j578j510j338
$$ y = [526126, 520366, 514152, 507118, 499225, 490618, 481543, 472191, 462476, 452165, 441369, 430683, 420667, 411381, 402617, 394380, 386886, 380274, 374542, 369614, 365260, 361118, 357012, 353045, 349097, 344524, 338716, 331869, 324793, 318085, 311803, 305835, 300152, 294754, 289719, 285270, 281402, 277597, 273317, 268713, 264402, 260634, 257215, 254137, 251635, 249586, 247510, 245308, 243358, 241754, 240120, 238489, 237495, 237235, 236666, 234847, 232330, 230493, 229797, 229420, 228484, 226917, 225113, 223429, 222219, 221826, 222233, 222961, 223492, 223677, 223692, 223704, 223633, 223157, 222038, 220479, 219007, 217914, 217034, 216227, 215716, 215709, 215965, 216135, 216275, 216645, 217215, 217835, 218712, 220144, 221832, 223020, 223390, 223337, 223246, 223053, 222735, 222695, 223256, 224094, 224668, 225071, 226021, 227963, 230523, 232919, 234715, 236054, 237310, 238716, 240281, 241803, 242838, 242856, 241735, 240127, 239023, 238817, 238939, 238562, 237441, 235915, 234337, 232827, 231489]
53099B31489j049q91j120j560j709j255l96K68J44q39j968k261j460l21K86L65
53083B17723N36R61J009J64j079j636j073l1O28P98Q61P75P1j200k122k004j340
53066B13041j144j564j798j319n41j03l9J1K08M26N33M88K35k17o40o30O4J200
53048B08211J987J718O26k04l6N88N64l61j439j978j917j379m37N51R95P78L32
53031B08599j10p10j270j087qJ031J155P06N94R38J139R75Q44R17Q35L96KJ04
53013B15050N31O53J46n63p19j27M94L27n37j227j242r29p09m51M0M88N45L55
52995B12125K37K14K58O10J293J715J312L92k67l11J39R54J844K158J603Q05M54
52978B25535K61l11p40j67Q32P21n49j183k09R77P77j80j48J019J817J424O58
$$ y = [231489, 230440, 229549, 228429, 226869, 225160, 223905, 223509, 223777, 223921, 223082, 221114, 218853, 217393, 217072, 217358, 217723, 218259, 219220, 220229, 220393, 219314, 217678, 216605, 216574, 217202, 218000, 218861, 219636, 219707, 218507, 216385, 214381, 213041, 211897, 210333, 208535, 207216, 206675, 206572, 206533, 206544, 206752, 207178, 207711, 208199, 208434, 208217, 207577, 206947, 207011, 208211, 210198, 211916, 212542, 212338, 212302, 212890, 213454, 213093, 211654, 209676, 207759, 206380, 205943, 206494, 207489, 208267, 208599, 208489, 207779, 206509, 205422, 205414, 206445, 207600, 208306, 208900, 209838, 210977, 211952, 212796, 213713, 214548, 214944, 214946, 215050, 215581, 216234, 216380, 215817, 215098, 214971, 215465, 215792, 215255, 214028, 212786, 211857, 211148, 210697, 210737, 211225, 211770, 212125, 212362, 212576, 212834, 213444, 214737, 216452, 217764, 218156, 217889, 217578, 217717, 218671, 220515, 222673, 224276, 225081, 225535, 225796, 225485, 224745, 224578, 225410, 226131, 225582, 224399, 224190, 225167, 225944, 225764, 225616, 226635, 228452, 229876, 230534]
52961B30534M65P08P62M52k3n69j138j576j809j919j905j705j410j161q49l21
52945B18536R3j97j132j845j657q15k2L80M54K29k65p68r38p42m30k25j81k02
52927B10273k8N33J240J514J150O75O27P93O32J96Q5N14J063J341J340J017J17
52910B23082j221k265k458k043j527r74l01J13j78q70j100n33K90P83R77J161
52894B12936J253R65L36j99k31K36Q46J197J157Q81N39J00m83r93j053n27L20
52877B17280J065J417J330J036R22J194J706K203K609K877K757K096J211N91K74
52862B40568r1n90r29j032j172j421j431j041o56o98j074j536k208l250m229m368
52846B14842l465k142j174p63n43r4N86J077J013N12N5o9K8J45K66M31O06Q08
$$ y = [230534, 230999, 231707, 232469, 232921, 232898, 232329, 231191, 229615, 227806, 225887, 223982, 222277, 220867, 219706, 218857, 218536, 218629, 218432, 217300, 215455, 213798, 212983, 212961, 213341, 213795, 214024, 213759, 212991, 212053, 211311, 210881, 210656, 210475, 210273, 210245, 210778, 212018, 213532, 214682, 215357, 215984, 216777, 217409, 217605, 217690, 218204, 219267, 220608, 221948, 222965, 223082, 221861, 219596, 217138, 215095, 213568, 212594, 212293, 212406, 212228, 211358, 210258, 209725, 210015, 210798, 211775, 212936, 214189, 215154, 215490, 215291, 215060, 215296, 216142, 217339, 218496, 219377, 219916, 220016, 219533, 218540, 217487, 216960, 217280, 218345, 219762, 221092, 222128, 223050, 224244, 225950, 228153, 230762, 233639, 236396, 238492, 239703, 240294, 240568, 240477, 239887, 238958, 237926, 236754, 235333, 233902, 232861, 232205, 231507, 230433, 228897, 226689, 223439, 219210, 214842, 211377, 209235, 208061, 207298, 206755, 206661, 207247, 208324, 209337, 209849, 209904, 209835, 209863, 210008, 210274, 210705, 211311, 212119]
52828B12119R79P68j46j361j932j564j067j177j500j212m30j6k45m79k11L44Q69
52811B03739J508K426L271L477K808J430l07j949l037l420l320l034k707k371
52797A98514j996j461p43j29P1mO7L21L85K17L20R57J590J573J011N44M31L86
52779B02054J37k07l69j19N78J305J271J39j254j561n07P15Q67P8n40m29j14k64
52761B01780p74j021p53l22j31j27j7K59M63M66M78P46J160J372J298J226J403
52744B07506J650J621J306J065J193J587J838J587Q29K3k20K39P78O65m8n65l42
52727B20712K63N07J01p25j669k450k635j904n39O63J097P82Q6p15j428j749j376
52710B09021m03N22O87J13k81L59J660K315J685O05K12M67N12P9k67k11o7j5K39
$$ y = [212119, 213098, 213866, 213720, 212359, 210427, 208863, 207796, 206619, 205119, 203907, 203477, 203461, 203216, 202737, 202526, 202870, 203739, 205247, 207673, 210944, 214421, 217229, 218659, 218352, 216403, 213366, 209946, 206626, 203592, 200885, 198514, 196518, 195057, 194314, 194185, 194256, 194252, 194319, 194640, 195025, 195242, 195562, 196519, 198109, 199682, 200693, 201237, 201668, 202054, 202191, 201984, 201615, 201496, 202074, 203379, 204650, 204789, 203535, 201974, 201467, 202182, 203049, 203127, 202587, 202158, 202044, 201780, 201006, 199985, 199232, 198910, 198779, 198652, 198635, 198894, 199357, 199823, 200301, 201047, 202207, 203579, 204877, 206103, 207506, 209156, 210777, 212083, 213148, 214341, 215928, 217766, 219353, 220182, 220205, 219985, 220224, 221002, 221667, 221619, 221054, 220712, 220975, 221482, 221583, 220858, 219189, 216739, 214104, 212200, 211661, 212324, 213421, 214203, 214289, 213574, 212146, 210397, 209021, 208618, 209140, 209827, 209940, 209659, 210018, 211678, 213993, 215678, 216283, 216495, 216962, 217474, 217553, 217286, 217075, 217008, 216993, 217232]
52691B17232O90P27J11m24j19O66R32L48m77q95q16m61q2R4j7j47J09P75J402
52672B19648J583J353J034P86N08J06k51l19j80k02m21k99N40J616K150K146K279
52655B32077K669K604J719P26M80Q25Q88J59j129k412l176l204k759k277j765
52640B25425r32o7N4o09r94m30L20L09qM43J504J955J388P00N82O13K10m13o66
52621B29384l93J05M62M50J71N4L79Q07Q38N49L07p7j036k160k376j371j14M06
52603B26385K58Q4J81M92R01J197J148Q99Q63J007Q40K78j46j81k52n42m34M65
52585B33443J447J579J048P75R76R66L68l22n47m56n26p88p95l33K06K45k44o39
52567B36403m60j6k2p00j543j888j420l14P29P92l00j439j356k26O00M91J86L87
$$ y = [217232, 217922, 218649, 218760, 218336, 218217, 218883, 219815, 220163, 219686, 218791, 217975, 217514, 217432, 217526, 217509, 217362, 217471, 218246, 219648, 221231, 222584, 223618, 224404, 224912, 225018, 224767, 224448, 224268, 224066, 223645, 223346, 223886, 225502, 227652, 229798, 232077, 234746, 237350, 239069, 239795, 240275, 241100, 241988, 242147, 241018, 238606, 235430, 232226, 229467, 227190, 225425, 224493, 224426, 224480, 223871, 222877, 222447, 222767, 223076, 223068, 223511, 225015, 226970, 228358, 229058, 229640, 230253, 230463, 230050, 229384, 228991, 229096, 229558, 230008, 230179, 230233, 230612, 231419, 232257, 232806, 233113, 233036, 232000, 229840, 227464, 226093, 225979, 226385, 226643, 226727, 226908, 227400, 228301, 229498, 230646, 231545, 232408, 233415, 234255, 234533, 234387, 234206, 233954, 233412, 232978, 233443, 234890, 236469, 237517, 238292, 239268, 240234, 240602, 240280, 239733, 239277, 238751, 237963, 237168, 236835, 237041, 237286, 237042, 236403, 235943, 235927, 235905, 235205, 233662, 231774, 230354, 230040, 230769, 231561, 231261, 229822, 228466, 228240, 228840, 229331, 229517, 229904]
52549B29904P29O88N61P98J125J078Q25O26J16r90j918j702o73r6l47n05J61J212
52531B31592J796J634R89K56j28O7M66M07j21l10L88J499K104J885J220N88K60
52514B44592M00J003J702J947J620J339J877L172M163L879K505R96k03j435k744
52499B64813l372k854k001k010k909l626l426k540j445l06O84J133Q72K04n15
52484B42702j164j574j444p20K33J053J710K249K565K546K188J474M56m83p90
52469B51001l71L30R43J518K096K365K102J656J604K101K801L248L038J911J9
52454B76362j907l085l394l323l265l128k695k118j843k154k787l102k592j438
52440B39531m36k71q06j258j063m18J38L79M14K77j19n87o24j8Q27J395J651J800
$$ y = [229904, 230633, 231321, 231882, 232680, 233805, 234883, 235708, 236334, 236450, 235460, 233542, 231840, 231167, 231071, 230724, 230219, 230380, 231592, 233388, 235022, 236011, 236267, 236139, 236206, 236672, 237079, 236958, 236648, 237036, 238535, 240639, 242524, 243744, 244332, 244592, 244992, 245995, 247697, 249644, 251264, 252603, 254480, 257652, 261815, 265694, 268199, 269195, 268992, 267557, 264813, 261441, 258587, 256586, 254576, 251667, 248041, 244615, 242075, 240630, 240324, 241008, 242141, 243013, 243217, 242702, 241538, 239964, 238520, 237800, 238033, 239086, 240796, 243045, 245610, 248156, 250344, 251818, 252274, 251791, 251001, 250630, 250960, 251903, 253421, 255517, 257882, 259984, 261640, 263244, 265345, 268146, 271394, 274432, 276343, 276362, 274455, 271370, 267976, 264653, 261388, 258260, 255565, 253447, 251604, 249450, 246663, 243561, 240969, 239531, 239095, 238824, 238018, 236760, 235697, 235279, 235417, 235796, 236210, 236487, 236368, 235781, 235157, 235139, 235966, 237361, 239012, 240812]
52422B40812J768J371Q36O01O29N00K29L56J033J727K136K733L917N273O306P371
52406B77598Q985J0568J0806R230O555L452p5l832o872q347q449q023p562o969
52392B77065o029m682l064j487l05L80O60N40M1l99j91N19Q75N37L03R81K121
52375B67865K632K369K226K686L169L073K749K943L656M107L662K447J083J21
52361C04788k34j00K19M29L74J34n5j1J80K19pj67J30P79J266J315J171J089R76
52342C12495P83R20J800L124M130M505M638M918N300N685O208O922P604Q276R396
52327C86704J1072J2494J2824J2437J2555J3672J5048J5861J6148J6295J6203
52316E41313J5521J4387J3481J3303J3672J3896J3479J2732J2578J3450J4512
$$ y = [240812, 242580, 243951, 244787, 245388, 246017, 246517, 246746, 247102, 248135, 249862, 251998, 254731, 258648, 263921, 270227, 277598, 286583, 297151, 307957, 317187, 323742, 327194, 327119, 323287, 316415, 308068, 299619, 291596, 284034, 277065, 271036, 266354, 263290, 261803, 261498, 261878, 262538, 263078, 263119, 262720, 262529, 263048, 263923, 264460, 264763, 265744, 267865, 270497, 272866, 275092, 277778, 280947, 284020, 286769, 289712, 293368, 297475, 301137, 303584, 304667, 304788, 304554, 304454, 304673, 305102, 305476, 305610, 305555, 305544, 305724, 305943, 305936, 305769, 305899, 306678, 307944, 309259, 310430, 311519, 312495, 313278, 314198, 315998, 319122, 323252, 327757, 332395, 337313, 342613, 348298, 354506, 361428, 369032, 377308, 386704, 397776, 410270, 423094, 435531, 448086, 461758, 476806, 492667, 508815, 525110, 541313, 556834, 571221, 584702, 598005, 611677, 625573, 639052, 651784, 664362, 677812, 692324]
52305F92324J4453J3020J1236J0054R454R016Q595Q069P085N630M208K969J264
52292G97377j256l759n304o205p370q636q973q247p553p607p834p375o125m374
52278G06759k222R9J996L082L639M158M874N986P693R615J0782J0712J0081R819
52264G87073J0002J0128J0065J0117J0409J0798J1168J1316J0844R720Q723Q621
52252I08984R068Q932P698N860L883J574j192l859n794p163q616j0348j1936j3002
52238H84089j3590j3842j3702j3173j2580j2271j2141j1700j0725r686r278r546
52226G41855r647q678o711m798l911m025m313m069l215k016p13M56J195J460J683
52211F94553K305L152L564L220K501J988J862J909J851J555J149J043J573K502
$$ y = [692324, 706777, 719797, 731033, 741087, 750541, 759557, 768152, 776221, 783306, 788936, 793144, 796113, 797377, 796121, 792362, 787058, 780853, 773483, 764847, 755874, 747627, 740074, 732467, 724633, 717258, 711133, 706759, 704537, 704636, 706632, 709714, 713353, 717511, 722385, 728371, 736064, 745679, 756461, 767173, 777254, 787073, 797075, 807203, 817268, 827385, 837794, 848592, 859760, 871076, 881920, 891640, 900363, 908984, 918052, 926984, 934682, 940542, 944425, 945999, 944807, 940948, 935154, 927991, 919375, 909027, 897091, 884089, 870499, 856657, 842955, 829782, 817202, 804931, 792790, 781090, 770365, 760679, 751401, 741855, 732208, 723530, 716819, 712021, 708110, 704085, 699772, 695703, 692488, 690472, 689759, 690215, 691410, 692870, 694553, 696858, 700010, 703574, 706794, 709295, 711283, 713145, 715054, 716905, 718460, 719609, 720652, 722225, 724727]
52197G24727L162L212K927K681K547K611L157M146M986N168M771L912K296q0k326
52182G67897l596m262n257o545p259p186o982o865o306n215m333l956l389k260
52168F94486j312j102q24N32K513L797L993L812L712L510L264L451M098M496M108
52153G32534L134K019R60J11l05l27l02l34p0P20J737K512K865K809K329J602
52137G51994J108J209J736K347L135M480O332Q084R325J0392J1879J3884J6095
52124H42000J8378K0709K2566K3176K2753K2719K3933K5253K4831K2627K0442
52113A089387J9420J8792J7493J5777J4340J2862J0599P863N656M117K559R01
52101A219766r4k26l90j349k837m294n764p522r486j1494j3687j6059j8043j9042
$$ y = [724727, 727889, 731101, 734028, 736709, 739256, 741867, 745024, 749170, 754156, 759324, 764095, 768007, 770303, 770223, 767897, 764301, 760039, 754782, 748237, 740978, 733792, 726810, 719945, 713639, 708424, 704091, 700135, 696746, 694486, 693174, 692072, 691248, 691780, 694293, 698090, 702083, 705895, 709607, 713117, 716381, 719832, 723930, 728426, 732534, 735668, 737687, 738647, 738758, 738453, 738126, 737824, 737490, 737420, 738140, 739877, 742389, 745254, 748063, 750392, 751994, 753102, 754311, 756047, 758394, 761529, 766009, 772341, 780425, 789750, 800142, 812021, 825905, 842000, 860378, 881087, 903653, 926829, 949582, 972301, 996234, 1021487, 1046318, 1068945, 1089387, 1108807, 1127599, 1145092, 1160869, 1175209, 1188071, 1198670, 1206533, 1212189, 1216306, 1218865, 1219766, 1219672, 1219446, 1219056, 1217707, 1214870, 1210576, 1204812, 1197290, 1187804, 1176310, 1162623, 1146564, 1128521, 1109479]
52087A109479j9059j8400j7137j5407j3788j2709j1653r734p042m669l282k278
52075I74321p49J334L346N079O830Q591R752R939R671R777J0437J1139J1498J1650
52061A082615J1778J1698J1148J0230R339Q811Q746Q953Q864P750N410K464l09
52048A187497k784n322p995j0439j2431j4098j5498j6415j6737j6650j6321j5764
52036A037043j5141j4746j4405j3407j1503r596q836r193r619r556r577j0321
52024I01143j1404j1902j1537j0782r995r059p961p120o839o757o295n448m817
52011G91227m821n299n913o657p670q772r481r575r435r683j0521j1496j1981
51998F79923j1767j1055j0002q541o773n202m241l732l319l155l712m918o073
$$ y = [1109479, 1090420, 1072020, 1054883, 1039476, 1025688, 1012979, 1001326, 991592, 984550, 979881, 976599, 974321, 973572, 974906, 978252, 983331, 990161, 998752, 1008504, 1018443, 1028114, 1037891, 1048328, 1059467, 1070965, 1082615, 1094393, 1106091, 1117239, 1127469, 1136808, 1145619, 1154365, 1163318, 1172182, 1179932, 1185342, 1187806, 1187497, 1184713, 1179391, 1171396, 1160957, 1148526, 1134428, 1118930, 1102515, 1085778, 1069128, 1052807, 1037043, 1021902, 1007156, 992751, 979344, 967841, 958245, 949409, 940216, 930597, 921041, 911464, 901143, 889739, 877837, 866300, 855518, 845523, 836464, 828503, 821383, 814544, 807787, 801492, 796044, 791227, 786406, 781107, 775194, 768537, 760867, 752095, 742614, 733039, 723604, 713921, 703400, 691904, 679923, 668156, 657101, 647099, 638558, 631785, 626583, 622342, 618610, 615291, 612136, 608424, 603506, 597433]
51985E97433o748p305q164r125r851j0569j1675j2863j3354j2900j1986j0954
51973D71939r588p765n902m384k906q72J708M165N945P132Q097Q909R236Q829
51959D94543P911O949O043M759K703K27j735k513k232j408k55J481M136P745J1901
51944E40255J5896J9099K1389K3060K4139K3860K1172J5925R357L218j524n031
51932G10815p899j0384j2305j3456j3933j4205j4831j5974j7144j7703j7671j7627
51920E37683j7732j7263j5658j3566j2168j1613j0915r476p840o600n378l506
51908D05968j208O95J926K919L927M712N130N406N655N612M950L574J465j302
51894D49429m246o570p797q135q075p895p583o931n591l429j061L96N46M19J516
$$ y = [597433, 590685, 583380, 575216, 566091, 556240, 545671, 533996, 521133, 507779, 494879, 482893, 471939, 462351, 454586, 448684, 444300, 441394, 440522, 442230, 446395, 452340, 459472, 467569, 476478, 485714, 494543, 502454, 509403, 515446, 520205, 522908, 523135, 521400, 518887, 516655, 515247, 514992, 516473, 520609, 528354, 540255, 556151, 575250, 596639, 619699, 643838, 667698, 688870, 704795, 714152, 717370, 715846, 710815, 702916, 692532, 680227, 666771, 652838, 638633, 623802, 607828, 590684, 572981, 555310, 537683, 519951, 502688, 487030, 473464, 461296, 449683, 438768, 429292, 421452, 414852, 409474, 405968, 404760, 405455, 407381, 410300, 414227, 418939, 424069, 429475, 435130, 440742, 445692, 449266, 450731, 449429, 445183, 438613, 430816, 422681, 414606, 406711, 399128, 392197, 386606, 383177, 382116, 382512, 383058, 383477, 384993]
51879C84993M125P025Q867R459R438R128Q205O518M694L505K834J759j96k382
51865D57972l892m703n436o174o248n339m106l231k371p11J625L505M186M045
51851D29122L631K672O57j975m126n406o451p641q317p786o507n529n127m651
51837C72566l626k305j104k05K79K63N8J68N57O62L04j1Pj31q51j747k148k057
51819C60679j863j533p09N41J715K477K779K578J986J494J465J496Q79l41j381
51804C72262j770j766j680j424q98l09J39M22M38l4r29j801k296k389k139j511
51788C54315o56J03O43J096J446J435J073P72P83P58K30p48j666k053j761q83
51772C54887L74J912L808O029Q082R279R461R130Q751Q207P104N324L085O28j923
$$ y = [384993, 389118, 396143, 405010, 414469, 423907, 433035, 441240, 447758, 452452, 455957, 458791, 460550, 460354, 457972, 454080, 449377, 443941, 437767, 431519, 426180, 422074, 418843, 416472, 415761, 417386, 420891, 425077, 429122, 432753, 435425, 436082, 434107, 429981, 424575, 418124, 410483, 402166, 394380, 387873, 382344, 377217, 372566, 368940, 366635, 365531, 365326, 365605, 365868, 365926, 366094, 366651, 367313, 367617, 367606, 367613, 367482, 366631, 364884, 362736, 360679, 358816, 357283, 356574, 357115, 358830, 361307, 364086, 366664, 368650, 370144, 371609, 373105, 373984, 373643, 372262, 370492, 368726, 367046, 365622, 364724, 364415, 364554, 364976, 365414, 365380, 364451, 362650, 360354, 357965, 355826, 354315, 353659, 353762, 354405, 355501, 356947, 358382, 359455, 360227, 361010, 361768, 361998, 361250, 359584, 357531, 355770, 354887, 355261, 357173, 360981, 367010, 375092, 384371, 393832, 402962, 411713, 419920, 427024, 432348, 435433, 436061, 434138]
51757D34138m455o716q315q970q841q486q299q063p380o257m979l675k429j611
51743C45662j432j321m59J084K488L486M681O318P612P793P054N947M551K866
51729C96330J525J246J853K609L266M015M492L710J263j957m570n928o294o033
51715C95527n075l318j299q5k31j125j727j771j779j916j592l86J210K330K584
51700C81347J990O59r22j765j220J99J412K017K398K716K454J169q15k631l617
51685C85391l682l193k567j969j308n23L21J257K428L714M571M565L895L154K712
51670C98766K515K422K561L378N237P745R572R443P367M439J398j927n475q201
51656D39240r118q411o814m353p25L388O455P499O671M462J259k221m897o222
$$ y = [434138, 429683, 422967, 414652, 405682, 396841, 388355, 380056, 371993, 364613, 358356, 353377, 349702, 347273, 345662, 344230, 342909, 342450, 343534, 346022, 349508, 354189, 360507, 368119, 375912, 382966, 388913, 393464, 396330, 397855, 399101, 400954, 403563, 406829, 410844, 415336, 419046, 420309, 418352, 413782, 407854, 401560, 395527, 390452, 387134, 385835, 385750, 385519, 384394, 382667, 380896, 379117, 377201, 375609, 375223, 376433, 378763, 381347, 383337, 383996, 383074, 381309, 380089, 380288, 381700, 383717, 386115, 388831, 391285, 392454, 391639, 389008, 385391, 381709, 378516, 375949, 373980, 372672, 372149, 372470, 373727, 376155, 379869, 384440, 389005, 392900, 396054, 398766, 401281, 403703, 406264, 409642, 414879, 422624, 432196, 441639, 449006, 453445, 454843, 452916, 447441, 439240, 430122, 421711, 414897, 410544, 409819, 413207, 419662, 427161, 433832, 438294, 439553, 437332, 432435, 426213]
51642D26213o589o602o431o094n801n688n594n429n419n637n654n017l907k953
51628C49398k451k090j458o64l44r56k157k965k744j907j375j543j995k274k464
51613C22011k866l348l356k533j220k06J6k77m11o1N71J324K383L898N674P539
51597C29138R598J1795J3482J3847J2641J0024O122J244l574o951q242p867o641
51584C74616n094l425j651K81K225L803M968O313Q319J0463J1677J1666J1153
51571D35314J0899J1107J1713J2408J2260J0325P057M406M004N870R275J4039
51559E48677K0126K6511L1568L4466L5475L4855L2285K7684K1926J6238J1069
51548H40880N919K42n734j1170j5435j8635k1346k3946k6278k7855k8281k7591
$$ y = [426213, 419624, 413022, 406591, 400497, 394696, 389008, 383414, 377985, 372566, 366929, 361275, 356258, 352351, 349398, 346947, 344857, 343399, 342735, 342391, 341435, 339278, 336313, 333569, 331662, 330287, 328744, 326749, 324475, 322011, 319145, 315797, 312441, 309908, 308688, 308482, 308498, 308221, 307810, 307749, 308320, 309644, 312027, 315925, 321599, 329138, 338736, 350531, 364013, 377860, 390501, 400525, 406647, 407891, 404317, 397366, 389124, 381257, 374616, 369522, 366097, 364446, 364727, 366952, 370755, 375723, 382036, 390355, 400818, 412495, 424161, 435314, 446213, 457320, 469033, 481441, 493701, 504026, 511083, 515489, 519493, 525363, 534638, 548677, 568803, 595314, 626882, 661348, 696823, 731678, 763963, 791647, 813573, 829811, 840880, 846799, 847041, 841307, 830137, 814702, 796067, 774721, 750775, 724497, 696642, 668361, 640770]
51536F40770k6343k5216k4369k3269k1460j9316j7619j6424j4921j2621j0130
51525D29082q402p588p046o344n701n467n514n389m859m130l536l138k718k113
51511C57137j437r28p16p78r80j083r44p85r69j334j153o3J284K009K131K269
51495C53660K463K096J053J25n0K23L18J79J36J96P0l79j052j793k437k796k903
51478C49109l047l408l792l971m006m004l855l480l145l162l365l202k359j118
51464C03195q2L13Q6m26q92j104q00K65J806K913K962K473K484L159L771M043
51448C24166M652O101P961R757J1829J4555J7139J8052J6516J2988Q384L562o26
51435D55036l481m928n427n392n073n047o102q368j0779j1843j0994r058p392
$$ y = [640770, 614427, 589211, 564842, 541573, 520113, 500797, 483178, 466754, 451833, 439212, 429082, 420680, 413092, 406046, 399702, 394001, 388534, 383020, 377631, 372772, 368642, 365106, 361968, 359250, 357137, 355700, 354772, 354056, 353278, 352298, 351215, 350271, 349486, 348517, 347183, 346030, 345967, 347251, 349260, 351391, 353660, 356123, 358219, 359272, 359397, 359347, 359570, 359888, 360067, 360203, 360399, 360469, 360090, 359038, 357245, 354808, 352012, 349109, 346062, 342654, 338862, 334891, 330885, 326881, 323026, 319546, 316401, 313239, 309874, 306672, 304313, 303195, 303113, 303426, 303512, 303086, 302194, 301090, 300290, 300555, 302361, 305274, 308236, 310709, 313193, 316352, 320123, 324166, 328818, 334919, 342880, 352637, 364466, 379021, 396160, 414212, 430728, 443716, 452100, 455662, 455036, 451555, 446627, 441200, 435808, 430735, 425688, 419586, 411218, 400439, 388596, 377602, 368544, 361152]
51422C61152o598o199n437m209k967j968j042r7O56J032J087R17O27O06J229K195
51406C40984K691K485K208K290K365K175K260L023L827L922L707M065M810M992
51392C85804M540M407N058N972O849Q178J0176J2198J3801J5619J8466K2166K5923
51379E39157K9359L2621L5934L9622M3900M7884M9165M5602L7671K8222J9666
51368I48803J2043M075m599j3001k0182k6221l1641l6447m0088m2161m2756m2166
51356F65659m0548l8035l4897l1372k7485k3219j8879j5008j1974r702p894o422
51344D00224n396m953m963n049m878m464m116m105m423m832m984m564l558k467
51330C37472j926k048k319k264j932j640j507j480j518j529j307p99k15L23R52
$$ y = [361152, 354554, 348355, 342918, 338709, 335742, 333774, 332732, 332635, 333291, 334323, 335410, 336327, 336954, 337560, 338789, 340984, 343675, 346160, 348368, 350658, 353023, 355198, 357458, 360481, 364308, 368230, 371937, 376002, 380812, 385804, 390344, 394751, 399809, 405781, 412630, 420808, 430984, 443182, 456983, 472602, 491068, 513234, 539157, 568516, 601137, 637071, 676693, 720593, 768477, 817642, 863244, 900915, 929137, 948803, 960846, 964921, 960322, 947321, 927139, 900918, 869277, 832830, 792742, 750581, 707825, 665659, 625111, 587076, 552179, 520807, 493322, 470103, 451224, 436216, 424242, 414540, 406646, 400224, 394828, 389875, 384912, 379863, 374985, 370521, 366405, 362300, 357877, 353045, 348061, 343497, 339939, 337472, 335546, 333498, 331179, 328915, 326983, 325343, 323836, 322356, 320838, 319309, 318002, 317203, 316988, 317311, 318263]
51315C18263J655K085K077K045K377K828K884K479J854J009j02j079j393j103
51301C35879p03l94j10q1n67j191j297j044j311k278k953k387p82R34K042K296
51285C26053J942J805K743M630O348P069O933O222M743K552M67q58j743k635l066
51270C63205k356q60M40J269K024K682K784K399K042J584L08j735l452m113m180
51255C62041m220l932k956j844j428j606j632j347j230j324r57J60J289J481P32
51240C43227j74p50j297k194l092l160k186j017o43j051j401j261j073j187j074
51225C21667o7J421K170J662O97K81M31M66J63M3N75J511K190K271K012J913K231
51208C41637K855L542M156M591M587L920K799J827J350J068N36k35r76j689k470
$$ y = [318263, 319918, 322003, 324080, 326125, 328502, 331330, 334214, 336693, 338547, 339556, 339454, 338375, 336982, 335879, 335176, 334782, 334672, 334591, 334024, 332833, 331536, 330492, 329181, 326903, 323950, 321563, 320781, 321715, 323757, 326053, 327995, 329800, 332543, 337173, 343521, 350590, 357523, 363745, 368488, 371040, 371507, 370649, 368906, 366271, 363205, 360849, 359989, 360429, 361698, 363722, 366404, 369188, 371587, 373629, 375213, 375521, 373786, 370334, 366221, 362041, 357821, 353889, 350933, 349089, 347661, 346055, 344423, 343076, 341846, 340522, 339565, 339725, 341014, 342495, 343227, 343053, 342303, 341006, 338812, 335720, 332560, 330374, 329357, 328714, 327663, 326262, 325001, 323928, 322741, 321667, 321600, 323021, 325191, 326853, 327550, 327831, 328262, 328728, 328891, 328934, 329509, 331020, 333210, 335481, 337493, 339406, 341637, 344492, 348034, 352190, 356781, 361368, 365288, 368087, 369914, 371264, 372332, 372868, 372633, 371657, 369968, 367498]
51193C67498k934k533j512q57j007j268r12k09K66O63J321J708J051j50m84L19
51177C60960Q57R4j216j805j670j639j824j648j061o48o20o04m52l58j20Q08K293
51160C51347L350L335K623J812R09k51j403k185k656k926k676j589k6J255J839
51145C52758J697Q39n44j768k160j824j444j373j356j132p47k71K64O08M38n4
51129C43931k57O9N88J115J994L375M593M818M033K902J886J020M04L64Q77J300
51113C73012R48j30j135j276n43K77M49N3j69L13J337K462L380L779L238J784
51097C87779K79l20k3L41K79N9K6M1l6R4P19J486J685J100J79n72j058j407j606
51078C89045j503j048l53N02J518K580L318L489L460L985N244O455O885P008Q054
$$ y = [367498, 364564, 362031, 360519, 359662, 358655, 357387, 356475, 356266, 356532, 357195, 358516, 360224, 361275, 361125, 360641, 360960, 361817, 361911, 360695, 358890, 357220, 355581, 353757, 352109, 351048, 350400, 349780, 349176, 348724, 348366, 348246, 349054, 351347, 354697, 358032, 360655, 362467, 363376, 363125, 361722, 359537, 356881, 353955, 351279, 349690, 349664, 350919, 352758, 354455, 355294, 354750, 352982, 350822, 348998, 347554, 346181, 344825, 343693, 342946, 342675, 342939, 343547, 343985, 343931, 343674, 343743, 344331, 345446, 347440, 350815, 355408, 360226, 364259, 367161, 369047, 370067, 370471, 370835, 371712, 373012, 373960, 373830, 372695, 371419, 370876, 371153, 371602, 371655, 371486, 371799, 373136, 375598, 378978, 382757, 385995, 387779, 388058, 387738, 387715, 388056, 388335, 388394, 388420, 388461, 388425, 388519, 389238, 390724, 392409, 393509, 393688, 393116, 392058, 390651, 389045, 387542, 386494, 386141, 386643, 388161, 390741, 394059, 397548, 401008, 404993, 410237, 416692, 423577, 430585, 438639]
51063D38639J0460J3444J6256J9085K2171K4546K4546K1555J6642J1498P238M384
51051F30464L327M113N861O863N696K399j530m424n933p144r255j2224j4788j5552
51037E87873j3859j0038n411k027j634m357q550j2167j4195j4644j3737j1642
51025D75612q923o440m494k548m3K738N083O793Q230R539J0457J0983J1552J2186
51011E30725J2075J0529Q092O003M723L637K284J102O70O68J92j164k890m156
50997E72490m525m091l186k043p41N54J431J609J465J853L188M992O559P867R483
50982E96905J1680J3831J4780J3803J1405R168Q523R608J1460J3419J5880J9448
50970G49910K3859K8155L1724L4657L7325M0025M3013M6417M9980N3215N5782
$$ y = [438639, 449099, 462543, 478799, 497884, 520055, 544601, 569147, 590702, 607344, 618842, 626080, 630464, 633791, 637904, 643765, 650628, 656324, 658723, 657193, 652769, 646836, 639692, 630437, 618213, 603425, 587873, 574014, 563976, 558565, 556538, 554904, 550547, 541997, 529830, 515635, 500991, 487254, 475612, 466689, 460249, 455755, 453207, 453164, 455902, 460985, 467778, 476008, 485547, 496004, 506987, 518539, 530725, 542800, 553329, 561421, 567424, 572147, 575784, 578068, 579170, 579840, 580508, 580700, 579536, 576646, 572490, 567965, 563874, 560688, 558645, 557904, 558458, 559889, 561498, 562963, 564816, 568004, 572996, 579555, 587422, 596905, 608585, 622416, 637196, 650999, 662404, 671572, 680095, 689703, 701163, 714582, 730462, 749910, 773769, 801924, 833648, 868305, 905630, 945655, 988668, 1035085, 1085065, 1138280, 1194062]
50959A194062N7483N7944N6691N3669M9466M4838M0067L4777K8387K0876J3186
50948A651446O638J740k136n661q447r570r028q196q697j1112j4757j8332k0779
50935A543109k1867k2187k2343k2303k1745k0939k0762k1764k3643k5777k7845
50924A291934k9785l1457l2726l3646l4299l4574l4272l3399l2133l0589k8661
50913I36393k6198k3348k0721j8939j7858j6531j4265j1607r860r648j0364j1011
50901G46043j1075j0503r347p784o221n003m166l567l088k593j916j053k01M91
50887F80017J056J444J422R62N47Q37K022L659N065N837O034N987O010O327P179
50872G34405Q716J0675J2380J3391J3953J4575J5419J6419J7738J9494K1288K2669
$$ y = [1194062, 1251545, 1309489, 1366180, 1419849, 1469315, 1514153, 1554220, 1588997, 1617384, 1638260, 1651446, 1658084, 1659824, 1657688, 1652027, 1643580, 1634010, 1624982, 1616786, 1608089, 1596977, 1582220, 1563888, 1543109, 1521242, 1499055, 1476712, 1454409, 1432664, 1411725, 1390963, 1369199, 1345556, 1319779, 1291934, 1262149, 1230692, 1197966, 1164320, 1130021, 1095447, 1061175, 1027776, 995643, 965054, 936393, 910195, 886847, 866126, 847187, 829329, 812798, 798533, 786926, 777066, 767418, 757054, 746043, 734968, 724465, 715118, 707334, 701113, 696110, 691944, 688377, 685289, 682696, 680780, 679727, 679526, 680017, 681073, 682517, 683939, 684901, 685448, 686285, 688307, 691966, 697031, 702868, 708902, 714889, 720899, 727226, 734405, 743121, 753796, 766176, 779567, 793520, 808095, 823514, 839933, 857671, 877165, 898453, 921122]
50860I21122K4057K6459L0123L4269L8423M3208M9295N6256O3179P0001P7394
50849A433786Q5513R3611J00927J07386J13277J18671J23358J26982J29051J28873
50839B561435J25575J18353J06939R1983P4808N6483L7326J7495k092j9890l4754
50828C133661m6459n5203o0889o3214o2170n8227n2035m4217l5541k7186k0573
50817B607947j6761j6057j8226k2880k9582l7641m6163n4400o1971o8783p4839
50806B160644q0055q4060q6219q6076q3770p9893p5020o9569o3902n8181n2189
50795A341710m5669l8840l2309k6470k1327j6837j2909r159n240j566Q80J681
50783A133945J443R16J82q87j966k604k927l475m455n580o557p372q164r065j0133
$$ y = [921122, 945179, 971638, 1001761, 1036030, 1074453, 1117661, 1166956, 1223212, 1286391, 1356392, 1433786, 1519299, 1612910, 1713837, 1821223, 1934500, 2053171, 2176529, 2303511, 2432562, 2561435, 2687010, 2805363, 2912302, 3004285, 3079093, 3135576, 3172902, 3190397, 3188305, 3168415, 3133661, 3087202, 3031999, 2971110, 2907896, 2845726, 2787499, 2735464, 2691247, 2655706, 2628520, 2607947, 2591186, 2575129, 2556903, 2534023, 2504441, 2466800, 2420637, 2366237, 2304266, 2235483, 2160644, 2080589, 1996529, 1910310, 1824234, 1740464, 1660571, 1585551, 1515982, 1452080, 1393899, 1341710, 1296041, 1257201, 1224892, 1198422, 1177095, 1160258, 1147349, 1138190, 1132950, 1131384, 1132264, 1133945, 1135388, 1136304, 1136486, 1135599, 1133633, 1131029, 1128102, 1124627, 1120172, 1114592, 1108035, 1100663, 1092499, 1083434, 1073301]
50768A073301j1267j2254j3056j3923j5175j6802j8341j8969j8018j5670j3060
50757I06766j1213r926q192n647k887l35K399N628Q860J1429J3409J5322J7406
50744I43019J9613K1963K4471K7017K9622L2498L5567L8504M1471M5117M9440
50733A308302N3398N6249N8516O0901O2971O3859O3638O2958O1810N9783N7185
50722A969570N4590N1397M6072L7983K7876J6347L072j1855k6750l9249m7989
50711B081064n2917n4561n3528n0470m5978m0417l4009k7024j9925j3513q713
50700A680009n910m702m645o044r500j4864k1264k7983l4598m0323m4107m5592
50688A420477m5377m4111m1989l9148l5872l2030k7015k0739j4241q883n099k134
$$ y = [1073301, 1062034, 1049780, 1036724, 1022801, 1007626, 990824, 972483, 953514, 935496, 919826, 906766, 895553, 885627, 877435, 871788, 868901, 868566, 870965, 876593, 885453, 896882, 910291, 925613, 943019, 962632, 984595, 1009066, 1036083, 1065705, 1098203, 1133770, 1172274, 1213745, 1258862, 1308302, 1361700, 1417949, 1476465, 1537366, 1600337, 1664196, 1727834, 1790792, 1852602, 1912385, 1969570, 2024160, 2075557, 2121629, 2159612, 2187488, 2203835, 2206907, 2195052, 2168302, 2129053, 2081064, 2028147, 1973586, 1920058, 1869588, 1823610, 1783193, 1749184, 1722160, 1702235, 1688722, 1680009, 1674099, 1669397, 1664752, 1658708, 1649208, 1634344, 1613080, 1585097, 1550499, 1510176, 1466069, 1420477, 1375100, 1330989, 1289000, 1249852, 1213980, 1181950, 1154935, 1134196, 1119955, 1111072, 1105973, 1103839]
50676A103839J222N698J0993J6000J9830K2632K5046K7117K8221K7972K6492K3913
50664A338975K0454J7042J4906J4272J4203J4051J4177J4854J5469J5551J5795
50653A509749J7110J9076K0391K0638K0829K2142K4743K7906L0798L3017L4729
50642A781128L6443L8495M0749M2862M4655M6079M6956M6966M5796M3361M0042
50631B253532L6738L4343L3078L2503L1989L0501K6014J6234Q13j7358l3693m4726
50619B399968m9496m8832m4127l6728k7892j8885j0839m258J213O081R927J1609
50607B187741J0648P768L629k286j0830k1598l2841m2880n1076n7605o2839o6978
50595A860853o9846p1118p0884o9763o8136o5609o1729n6931n2163m7717m3174
$$ y = [1103839, 1105061, 1110759, 1121752, 1137752, 1157582, 1180214, 1205260, 1232377, 1260598, 1288570, 1315062, 1338975, 1359429, 1376471, 1391377, 1405649, 1419852, 1433903, 1448080, 1462934, 1478403, 1493954, 1509749, 1526859, 1545935, 1566326, 1586964, 1607793, 1629935, 1654678, 1682584, 1713382, 1746399, 1781128, 1817571, 1856066, 1896815, 1939677, 1984332, 2030411, 2077367, 2124333, 2170129, 2213490, 2253532, 2290270, 2324613, 2357691, 2390194, 2422183, 2452684, 2478698, 2494932, 2495745, 2478387, 2444694, 2399968, 2350472, 2301640, 2257513, 2220785, 2192893, 2174008, 2163169, 2158911, 2160124, 2166205, 2176132, 2187741, 2198389, 2206157, 2209786, 2207500, 2196670, 2175072, 2142231, 2099351, 2048275, 1990670, 1927831, 1860853, 1791007, 1719889, 1649005, 1579242, 1511106, 1445497, 1383768, 1326837, 1274674, 1226957, 1183783]
50584A183783l8398l3921l0070k6426k2461j8292j4373j0808p414m290j754K90
50572I75866K454N073P596R228J0022J0891J2469J4466J6338J8074J9855K1339
50560A123671K2004K2046K2251K2972K3914K4855K5949K7118K7873K7967K7696
50549A398316K7295K6630K5669K4669K3655K2510K1845K2960K6308L0705L4736
50538A685298L8372M2553M7742N3675O0068O6753P3362P9741Q6386R3774J01409
50527B429133J08228J13776J18273J21710J23664J23895J22352J18584J11846
50518C491461J01876Q8961P3320N5102L5058J4471n786k5605m4894o3057p9302
50507C641605r3000j03516j10148j12411j10140j03323r2326p8186o2223m5264
$$ y = [1183783, 1145385, 1111464, 1081394, 1054968, 1032507, 1014215, 999842, 989034, 981620, 977330, 975576, 975866, 978320, 983393, 990989, 1000217, 1010239, 1021130, 1033599, 1048065, 1064403, 1082477, 1102332, 1123671, 1145675, 1167721, 1189972, 1212944, 1236858, 1261713, 1287662, 1314780, 1342653, 1370620, 1398316, 1425611, 1452241, 1477910, 1502579, 1526234, 1548744, 1570589, 1593549, 1619857, 1650562, 1685298, 1723670, 1766223, 1813965, 1867640, 1927708, 1994461, 2067823, 2147564, 2233950, 2327724, 2429133, 2537361, 2651137, 2769410, 2891120, 3014784, 3138679, 3261031, 3379615, 3491461, 3593337, 3682298, 3755618, 3810720, 3845778, 3860249, 3854463, 3828858, 3783964, 3720907, 3641605, 3548605, 3445089, 3334941, 3222530, 3112390, 3009067, 2916741, 2838555, 2776332, 2731068]
50497B731068k7702j0181O384K1487L5031M6402N4092N6589N3188M3892K9038
50486C039288R398j3673l8385o2598q3910j00345j11307j17504j19925j19334
50476B281705j16690j13142j09118j04020r7380q9825q2379p5270o8054o0653
50466A365174n3584m7266m1612l6343l1299k6363k1489j6815j2488q390m209J07
50454A065423M229P819J0885J3664J6277J8543K0224K1424K2732K4708K7186K9174
50442A282288K9473K7352K2742J6169Q759J957l200o601q753r980j0204r436q098
50429A332468o673n276l785k303j093k0J591M293P947J1975J6018K0027K4009
50416A399178K8124L2908L8797M5321N1328N6175O0175O3663O6171O6991O6049
$$ y = [2731068, 2703366, 2693185, 2699569, 2721056, 2756087, 2802489, 2856581, 2913170, 2966358, 3010250, 3039288, 3048686, 3035013, 2996628, 2934030, 2850120, 2749775, 2638468, 2520964, 2401039, 2281705, 2165015, 2051873, 1942755, 1838735, 1741355, 1651530, 1569151, 1493881, 1425827, 1365174, 1311590, 1264324, 1222712, 1186369, 1155070, 1128707, 1107218, 1090403, 1077915, 1069525, 1065316, 1065423, 1069652, 1077471, 1088356, 1102020, 1118297, 1136840, 1157064, 1178488, 1201220, 1225928, 1253114, 1282288, 1311761, 1339113, 1361855, 1378024, 1386783, 1388740, 1385540, 1378939, 1370186, 1360206, 1350002, 1340566, 1332468, 1325795, 1320519, 1316734, 1314431, 1313338, 1313318, 1314909, 1319202, 1327149, 1339124, 1355142, 1375169, 1399178, 1427302, 1460210, 1499007, 1544328, 1595656, 1651831, 1712006, 1775669, 1841840, 1908831, 1974880]
50405A974880O3767O0396N6014N0871M5171L8733L1254K2677J2870J360j1983
50394B346010k6237l9963n2235o2537p0110p4313p5510p4670p2032o7010n9560
50383A671833n0737m1595l2307k2731j3181m101M464J2535J9582K4644K6848K5715
50371A620969K1357J4579O437k513j2171k2040l0904l7618m1774m3482m2976m0682
50359A389182l7200l3038k8927k6441k7444l2187l8566m3859m6802m7509m6139
50348I81070m2668l7708l2445k7545k2890j8473j4777j1934r199n850k293M15
50336G55703J963L071M216M838M341L404L418M641N766N710M948M562M728N039
50322H16348N671P045Q519Q716P287N290L589J971J41j420k216k485k634k611
$$ y = [1974880, 2038647, 2099043, 2155057, 2205928, 2251099, 2289832, 2321086, 2343763, 2356633, 2357993, 2346010, 2319773, 2279810, 2227575, 2165038, 2094928, 2020615, 1945105, 1870435, 1798403, 1731393, 1671833, 1621096, 1579501, 1547194, 1524463, 1511282, 1507181, 1511645, 1524180, 1543762, 1568406, 1595254, 1620969, 1642326, 1656905, 1663342, 1660829, 1648658, 1626618, 1595714, 1558096, 1516322, 1472840, 1429864, 1389182, 1351982, 1318944, 1290017, 1263576, 1236132, 1203945, 1165379, 1121520, 1074718, 1027209, 981070, 938402, 900694, 868249, 840704, 817814, 799341, 784564, 772630, 763431, 757581, 755288, 755703, 757666, 760737, 764953, 769791, 774132, 777536, 780954, 785595, 791361, 797071, 802019, 806581, 811309, 816348, 822019, 829064, 837583, 846299, 853586, 858876, 862465, 864436, 864577, 863157, 860941, 858456, 855822, 853211]
50308H53211k351k074j676o35R19J928J965K117L404N212O438P401R205J1659
50294H96723J3373J3837J3876J3814J2525Q911L392k638q084j2404j5226j6313
50282I21786j5773j4020j1696r518p781o104m117k217j066m31N82K249L990N467
50268H61351O957Q465R503J0099J1024J2406J3153J2522J1436J1224J1759J1912
50256I91811J1448J1195J1426J1311J0238Q672P221N562K906q44m918q447j0995
50243A046586j2432j2629j1414q743m940p98K640M386L673L9o323j4266k1964
50230I63815k7753l0798l1171k9656k7412k5355k3577k1482j8696j5601j2922
50219F99392j1040r908r347r075q678p971p228o714o129n033l734l046l029k721
$$ y = [853211, 850860, 848786, 847110, 846475, 847394, 849322, 851287, 853404, 856808, 862020, 868458, 875859, 885064, 896723, 910096, 923933, 937809, 951623, 964148, 973059, 976451, 973813, 965729, 953325, 938099, 921786, 906013, 891993, 880297, 870779, 862998, 856894, 852777, 850560, 849494, 849063, 849645, 851894, 855884, 861351, 868308, 876773, 886276, 896375, 907399, 919805, 932958, 945480, 956916, 968140, 979899, 991811, 1003259, 1014454, 1025880, 1037191, 1047429, 1056101, 1063322, 1068884, 1071790, 1070946, 1066028, 1057581, 1046586, 1034154, 1021525, 1010111, 1001368, 996428, 995630, 998270, 1002656, 1006329, 1006368, 1000045, 985779, 963815, 936062, 905264, 874093, 844437, 817025, 791670, 768093, 746611, 727915, 712314, 699392, 688352, 678444, 669097, 660022, 651344, 643373, 636145, 629431, 623302, 618269, 614535, 611489, 608460, 605739]
50205F05739j490j01K25n64j357j325q02o63j336k534l565l875l513l103l058
50190E78678l060k608j929j715k044k259j998j640j554j496j097m83Q4O15J149
50175E58643J403J175P71O30P64Q89R36J081J512K370L653M978N769N948O063
50160E96585O551P263Q081R322J1192J3320J5403J7756K0619K3490K5844K8013
50148G83439L0378L2188L2253L0643K8492K6316K3734K1037J9590K0084K1490
50137A069644K2470K2897K3078K2265J9064J3133N549k434j0189j7307k3203k7507
50125A117460l0450l2460l3515l3207l1378k8533k5484k2651j9918j7161j4715
50114H27988j3103j2515j2769j3583j4586j5186j4912j3868j2524j1105r557q005
$$ y = [605739, 604249, 604148, 604373, 603809, 602452, 601127, 600325, 599662, 598326, 595792, 592227, 588352, 584839, 581736, 578678, 575618, 573010, 571081, 569366, 567322, 565063, 563065, 561425, 559871, 558375, 557278, 556795, 556879, 557494, 558643, 560046, 561221, 561992, 562622, 563386, 564275, 565211, 566292, 567804, 570174, 573827, 578805, 584574, 590522, 596585, 603136, 610399, 618480, 627802, 638994, 652314, 667717, 685473, 706092, 729582, 755426, 783439, 813817, 846005, 878258, 908901, 937393, 963709, 987443, 1008480, 1028070, 1048154, 1069644, 1092114, 1115011, 1138089, 1160354, 1179418, 1192551, 1198100, 1195666, 1185477, 1168170, 1144967, 1117460, 1087010, 1054550, 1021035, 987828, 956450, 927917, 902433, 879782, 859864, 842703, 827988, 814885, 802370, 789601, 776018, 761432, 746246, 731334, 717466, 704942, 693837, 684280, 676275]
50102F76275o777n957n347m911m715m496l826k849k183j950j490m36O57J136J214
50087F34345J554K292L052L588L977M257M342M194L819L254K717K509K558K379
50073F78837J755J028M38k97j324k116k212k131k757m028m956m897m129l192k284
50058F47735j428p03j67J21K2l73n23%Q89J604K344L791N839P513Q320Q851R673
50041F93508J0448J0728J0847J1288J1730J1638J1457J2212J4040J5986J7365
50030H31247J8484J9755K0850K1256K1037K0523J9503J7449J4368J1008Q179O225
50018A029884N142M761M681M290L016N19l298q205j3632j8965k3954k8494l2002
50005I23743l3497l2528k9743k6166k2222j7879j3432r543o522m139k289j304
$$ y = [676275, 669498, 663541, 658194, 653283, 648568, 644072, 640246, 637397, 635214, 633264, 631774, 631338, 631995, 633131, 634345, 635899, 638191, 641243, 644831, 648808, 653065, 657407, 661601, 665420, 668674, 671391, 673900, 676458, 678837, 680592, 681620, 682058, 681761, 680437, 678321, 676109, 673978, 671221, 667193, 662237, 657340, 653211, 650019, 647735, 646307, 645604, 645437, 645558, 645580, 645207, 644684, 644684, 645573, 647177, 649521, 653312, 659151, 666664, 674984, 683835, 693508, 703956, 714684, 725531, 736819, 748549, 760187, 771644, 783856, 797896, 813882, 831247, 849731, 869486, 890336, 911592, 932629, 953152, 972655, 990104, 1004472, 1015480, 1023659, 1029884, 1035026, 1039787, 1044468, 1048758, 1051774, 1052293, 1048995, 1040790, 1027158, 1008193, 984239, 955745, 923743, 890246, 857718, 827975, 801809, 779587, 761708, 748276, 738733, 732211, 728072, 725783, 724479]
49993G24479j424k253l052l316k958k292k058l083n528q589j1218j2938j3762
49980F52008j3736j2975j1960j1199j0670j0000r140q305p272n440k899q83n70
49967E46959j647k656k698k287k331k772k661j443M06K082L410M730O139P383
49953E52614Q437R662J1137J2303J2636J2322J1749J0674Q594N845L678K870K842
49940F65363K426J181m54j997l450n135p312r924j2460j4112j4359j3392j1859
49927E74516j0290q970q011p252o128m190j769J61R52Q01L84K68P50J762K780
49912E35764L220L192L493M516N624O015N858O007O774P716Q555R594J1060J2529
49898F29917J3277J2785J0828P619M104J484M2j146k899m836o149o987q202r944
$$ y = [724479, 723055, 720802, 717750, 714434, 711476, 709184, 707126, 704043, 698515, 689926, 678708, 665770, 652008, 638272, 625297, 613337, 602138, 591468, 581468, 572328, 564023, 556751, 551311, 548412, 547529, 546959, 545312, 542656, 539958, 537671, 535340, 532568, 529907, 528464, 528870, 530952, 534362, 539092, 545231, 552614, 561051, 570713, 581850, 594153, 606789, 619111, 630860, 641534, 650128, 655973, 659651, 662521, 665363, 667789, 668970, 668516, 666519, 663069, 657934, 650622, 640698, 628238, 614126, 599767, 586375, 574516, 564226, 555256, 547245, 539993, 533865, 529675, 527906, 528067, 529019, 529820, 530204, 530472, 531222, 532984, 535764, 538984, 542176, 545669, 550185, 555809, 561824, 567682, 573689, 580463, 588179, 596734, 606328, 617388, 629917, 643194, 655979, 666807, 674426, 678530, 680014, 680056, 678910, 676011, 671175, 665026, 658039, 649837, 639893]
49884F39893j1306j1518j0806r914r298r097r258r397q913p603o002m837m289
49871E27655l953l307k112n58Q76J907K806L941N015N334N011N197O640Q566R630
49856E72648R678R762J0563J1514J1629J0590Q803O838N108L839L015K411J719
49843F68117N67j371l971o419p804q132q324r082j0028j0196r122p291n675m936
49829E76333m850m414k830n28J140J435J108J438K734M261N413O413P780R511
49815F04944J0935J1208J0022P988O237N320M734L747K405J179p7j967m392o419
$$ y = [639893, 628587, 617069, 606263, 596349, 587051, 577954, 568696, 559299, 550386, 542783, 536781, 531944, 527655, 523702, 520395, 518283, 517725, 518601, 520508, 523314, 527255, 532270, 537604, 542615, 547812, 554452, 563018, 572648, 582326, 592088, 602651, 614165, 625794, 636384, 645187, 652025, 657133, 660972, 663987, 666398, 668117, 668684, 667313, 663342, 656923, 649119, 640987, 632663, 623581, 613553, 603357, 594235, 586944, 581269, 576333, 571483, 567069, 564239, 563711, 564851, 566286, 567394, 568832, 571566, 575827, 581240, 587653, 595433, 604944, 615879, 627087, 637109, 645097, 651334, 656654, 661388, 665135, 667540, 668719, 668642, 666675, 662283, 655864]
$$ [...]
##END NTUPLES=NMR SPECTRUM
##END=
