
##TITLE=UV1109_M2_1290-1353_7185017_J2KtF1rInP
##JCAMPDX= 6.0         $$ Bruker NMR JCAMP-DX V2.0
##DATA TYPE= NMR SPECTRUM
##DATA CLASS= NTUPLES
##ORIGIN= BRUKER
##OWNER= Administrator
$$ 1.72 TOPSPIN		Version 2.1
$$ 2012-12-05 19:38:14.265 -0500  Administrator@X
$$ Compression mode = diff/dup
##.OBSERVE FREQUENCY= 400.02188249412
##.OBSERVE NUCLEUS= ^1H
##.ACQUISITION MODE= SIMULTANEOUS (DQD)
##.ACQUISITION SCHEME= undefined
##.AVERAGES= 8
##.DIGITISER RES= 22
##SPECTROMETER/DATA SYSTEM= spect
##.PULSE SEQUENCE= zg30
##.SOLVENT NAME= COFFEE_meoh
##.SHIFT REFERENCE= INTERNAL, COFFEE_meoh, 1, 14.98509
##AUDIT TRAIL= $$ (NUMBER, WHEN, WHO, WHERE, PROCESS, VERSION, WHAT)
$$ ##TITLE= Audit trail, TOPSPIN		Version 2.1
$$ ##JCAMPDX= 5.01
$$ ##ORIGIN= Bruker BioSpin GmbH
$$ ##OWNER= Administrator
$$ $$ E:\/data/COFFEE/nmr/UV1109_M2_1290-1353_7185017_J2KtF1rInP/10/pdata/1/auditp.txt
$$ ##AUDIT TRAIL=  $$ (NUMBER, WHEN, WHO, WHERE, PROCESS, VERSION, WHAT)
(   1,<2012-12-05 19:38:06.046 -0500>,<Administrator>,<X>,<go>,<TOPSPIN 2.1>,
      <created by zg
	started at 2012-12-05 19:37:00.062 -0500,
	POWCHK enabled, PULCHK disabled,
       configuration hash MD5:
       86 BA 57 50 F2 9D 5C 9B 26 00 A9 28 5F 66 2E 89
       data hash MD5: 64K
       19 08 32 44 99 87 40 59 E4 A1 8D C4 44 F0 01 ED>)
(   2,<2012-12-05 19:38:09.124 -0500>,<Administrator>,<X>,<proc1d>,<TOPSPIN 2.1>,
      <Start of raw data processing
       efp LB = 0 FT_mod = 6 PKNL = 1 PHC0 = 0 PHC1 = 0 SI = 32K 
       data hash MD5: 32K
       56 88 62 6B CF 33 9E 22 43 98 3F 5C 62 18 17 2A>)
(   3,<2012-12-05 19:38:09.577 -0500>,<Administrator>,<X>,<proc1d>,<TOPSPIN 2.1>,
      <pk PHC0 = 101.2939 PHC1 = 0 
       data hash MD5: 32K
       A2 0B 01 D3 29 AA A4 4D 84 AD 88 C1 E8 FE 54 B7>)
(   4,<2012-12-05 19:38:09.812 -0500>,<Administrator>,<X>,<proc1d>,<TOPSPIN 2.1>,
      <abs ABSG = 1 
       data hash MD5: 32K
       10 52 4A 91 A9 70 C6 A5 76 BB 75 EB 87 6E 64 27>)
(   5,<2012-12-05 19:38:09.968 -0500>,<Administrator>,<X>,<proc1d>,<TOPSPIN 2.1>,
      <abs ABSG = 2 
       data hash MD5: 32K
       5A 27 7B 81 EB 65 73 75 46 F1 1E 6C 52 35 83 CB>)
(   6,<2012-12-05 19:38:10.109 -0500>,<Administrator>,<X>,<proc1d>,<TOPSPIN 2.1>,
      <abs ABSG = 3 
       data hash MD5: 32K
       82 8D AB 07 DB 4B A6 83 0B 89 A9 82 A5 89 51 18>)
(   7,<2012-12-05 19:38:10.249 -0500>,<Administrator>,<X>,<proc1d>,<TOPSPIN 2.1>,
      <abs ABSG = 4 
       data hash MD5: 32K
       6B 61 E9 FF 1C 62 DD 85 21 4E 2C E7 15 45 40 8F>)
(   8,<2012-12-05 19:38:10.406 -0500>,<Administrator>,<X>,<proc1d>,<TOPSPIN 2.1>,
      <abs ABSG = 5 
       data hash MD5: 32K
       7A 1B 1D 96 35 0D 88 7C 3D 3B 47 8B 87 04 FC 85>)
$$ ##END=
$$ 
$$ $$ hash MD5
$$ $$ 19 AD C6 07 39 03 FC 6C FA FB B9 09 CD 25 C3 22
##$RELAX= 
##$RELAX= 
##$RELAX= 
##$RELAX= 
##$RELAX= 
##$RELAX= 
##$RELAX= 
$$ Bruker specific parameters
$$ --------------------------
##$DU= <E:\>
##$EXPNO= 10
$$ [...]
150 150 150 150 150 150 150 150
##$TP07= 0
##$TPNAME0= <>
##$TPNAME1= <>
##$TPNAME2= <>
##$TPNAME3= <>
##$TPNAME4= <>
##$TPNAME5= <>
##$TPNAME6= <>
##$TPNAME7= <>
##$TPOAL= (0..7)
0.5 0.5 0.5 0.5 0.5 0.5 0.5 0.5
##$TPOFFS= (0..7)
0 0 0 0 0 0 0 0
##$TUNHIN= 0
##$TUNHOUT= 0
##$TUNXOUT= 0
##$USERA1= <user>
##$USERA2= <user>
##$USERA3= <user>
##$USERA4= <user>
##$USERA5= <user>
##$V9= 5
##$VALIST= <valist>
##$VCLIST= <CCCCCCCCCCCCCCC>
##$VD= 0
##$VDLIST= <DDDDDDDDDDDDDDD>
##$VPLIST= <PPPPPPPPPPPPPPP>
##$VTLIST= <TTTTTTTTTTTTTTT>
##$WBST= 1024
##$WBSW= 4
##$XGAIN= (0..3)
0 0 0 0
##$XL= 0
##$YL= 0
##$YMAX_a= 680367
##$YMIN_a= -580918
##$ZGOPTNS= <>
##$ZL1= 120
##$ZL2= 120
##$ZL3= 120
##$ZL4= 120
##$ABSF1= 14.98509
##$ABSF2= -5.573092
##$ABSG= 5
##$ABSL= 3
##$ALPHA= 0
##$AQORDER= 0
##$ASSFAC= 0
##$ASSFACI= 0
##$ASSFACX= 0
##$ASSWID= 0
##$AUNMP= <proc_prof1d_extract_pilot.lims>
##$AXLEFT= 0
##$AXNAME= <>
##$AXNUC= <1H>
##$AXRIGHT= 0
##$AXTYPE= 0
##$AXUNIT= <>
##$AZFE= 0.1
##$AZFW= 0.1
##$BCFW= 0
##$BC_mod= 0
##$BYTORDP= 0
##$COROFFS= 0
##$CY= 15
##$DATMOD= 1
##$DC= 0
##$DFILT= <>
##$DTYPP= 0
##$F1P= 0
##$F2P= 0
##$FCOR= 0.5
##$FTSIZE= 32768
##$FT_mod= 6
##$GAMMA= 0
##$GB= 0
##$INTBC= 1
##$INTSCL= 1
##$ISEN= 128
##$LB= 0
##$LEV0= 0
##$LPBIN= 0
##$MAXI= 10000
##$MC2= 0
##$MEAN= 0
##$ME_mod= 0
##$MI= 0
##$NCOEF= 0
##$NC_proc= -8
##$NLEV= 6
##$NOISF1= 0
##$NOISF2= 0
##$NSP= 0
##$NTH_PI= 0
##$NZP= 0
##$OFFSET= 14.98509
##$PC= 1
##$PHC0= 101.2939
##$PHC1= 0
##$PH_mod= 1
##$PKNL= yes
##$PPARMOD= 0
##$PPDIAG= 0
##$PPIPTYP= 0
##$PPMPNUM= 2147483647
##$PPRESOL= 1
##$PSCAL= 4
##$PSIGN= 0
##$PYNMP= <proc.py>
##$REVERSE= no
##$SF= 400.02
##$SI= 32768
##$SIGF1= 0
##$SIGF2= 0
##$SINO= 400
##$SIOLD= 32768
##$SPECTYP= <>
##$SREGLST= <1H.CDCl3>
##$SSB= 0
##$STSI= 32768
##$STSR= 0
##$SW_p= 8223.68421052631
##$SYMM= 0
##$S_DEV= 0
##$TDeff= 65536
##$TDoff= 0
##$TI= <>
##$TILT= no
##$TM1= 0
##$TM2= 0
##$TOPLEV= 0
##$USERP1= <user>
##$USERP2= <user>
##$USERP3= <user>
##$USERP4= <user>
##$USERP5= <user>
##$WDW= 1
##$XDIM= 32768
##$YMAX_p= 471128738
##$YMIN_p= -736468
##$CURPLOT= <Network HP LaserJet P1505>
##$CURPRIN= <$Network HP LaserJet P1505>
##$DFORMAT= <normdp>
##$LAYOUT= <+/1D_H.xwp>
##$LFORMAT= <normlp>
##$PFORMAT= <normpl>
##$SURQMSG= 1
$$ End of Bruker specific parameters
$$ ---------------------------------
##NTUPLES= NMR SPECTRUM
##VAR_NAME=  FREQUENCY,     SPECTRUM/REAL,   SPECTRUM/IMAG
##SYMBOL=    X,             R,               I
##VAR_TYPE=  INDEPENDENT,   DEPENDENT,       DEPENDENT
##VAR_FORM=  AFFN,          ASDF,            ASDF
##VAR_DIM=   32768,         32768,           32768
##UNITS=     HZ,            ARBITRARY UNITS, ARBITRARY UNITS
##FACTOR=    0.250966925370066, 1,           1
##FIRST=     8223.43324360094, -118527,      -93628
##LAST=      0,             -95509,          -155463
##MIN=       0,             -736468,         0
##MAX=       8223.43324360094, 471128738,    0
$$ Real data points
##PAGE= N=1
##DATA TABLE= (X++(R..R)), XYDATA
$$ [...]
19533C2222b90284A76905a74471j5734r689A03205b48203g2572k62305o5553a70109
19521H5358c4281A37924b01372j0662O2196G2261J74001n4050g4798q8501F3019
19509A44042c4561Q058B61632i2177A48172d01703J01973J43407l8309B864b40421
19497d9189r9452m3812H8824l5947a00095j42031A25934b6073A07703a30953k4704
19486a55657A37424h3570j02884f4463j3035I6939c6849n1087j4570j72589I3923
19474D3177j3843b5752A30820a52255A75220a44001L7376B65578d75401A71145
19463a34803N8050k33442B3853a33803B68809a40900q7172H8594b76065A7885
19452G3420b22994L0919G2186a18474j17347a5034q797A7562K0313l127b19096
$$ y = [32222, -290284, 176905, -174471, -190205, -199894, 103205, -248203, -72572, -334877, -400430, -170109, 85358, -34281, 137924, -201372, -212034, -149838, 72261, 246262, 192212, -74798, -163299, 63019, 144042, -34561, -26503, 261632, -92177, 148172, -401703, -299730, -156323, -194632, 2864, -240421, -49189, -148641, -192453, 88824, 52877, -100095, -242126, 125934, -26073, 107703, -130953, -155657, 137424, -83570, -186454, -64463, -77498, 96939, -36849, -87936, -102506, -275095, 93923, 43177, 29334, -25752, 130820, -152255, 175220, -144001, -106625, 265578, -475401, 171145, -134803, -76753, -310195, 23853, -133803, 268809, -140900, -228072, 88594, -276065, 17885, 73420, -222994, -192075, 72186, -118474, -235821, -15034, -23831, 17562, 37875, 34748, -219096]
19440a18501H620g6056q142j67261f7217L1157j13470N5065n8937q0982j20389
19429c54773a26197a3672I2719l3590a45554g1120k26685J47252j53686j0862
19419c15101B25861A4130P8098a82980A20906a32586B97232j23322D5530Q1301
19409A26831j4114e1790A52439M4928b05026C0591c27868D4861d1465D12427B334
19397G8421o746H044d8296B0754d7206j68409Q5286o9555f5824B13074b186j69328
19385a71514G1717a97137A09469m8183i1484G4408f3126n8883r4480A24481n8741
19374F5740P1567A8288b1330o5837D8940a34380f1847K1250D50878a03708I3274
19362b15456e8842G7831d5389k28496B4037a46201A66937b41544a13251E5858
$$ y = [-118501, 8620, -76056, -84198, -251459, -67217, -36060, -149530, -94465, -153402, -234384, -354773, -126197, -13672, 92719, 59129, -145554, -71120, -297805, -150553, -304239, -315101, 225861, 14130, 92228, -182980, 120906, -132586, 297232, 173910, 45530, 126831, 112717, -51790, 152439, 197367, -205026, 30591, -327868, 44861, -41465, 412427, 2334, 78421, 71675, 8044, -48296, 20754, -47206, -215615, -130329, -199884, -65824, 213074, -2186, -171514, 71717, -197137, 109469, 61286, -91484, 74408, -63126, -122009, -216489, 124481, 65740, 137307, 18288, -21330, -87167, 48940, -134380, -61847, -40597, 450878, -103708, 93274, -215456, -58842, 77831, -45389, -273885, 24037, -146201, 166937, -241544, -113251, 55858]
19351a95008A29908e8912m7675A67544d6863A72992K5175c76146C76358c1761
19340a62469J531j74101a2068A60787G8520d27540a6054k84535R4923M4181G1192
19328a36155A8026K06639a09797d384n6901j71052g3454p3453f3700b8239j81033
19317b09272h4240k3958j42336k50340h3991e270p8418F5311h3946A10024d11995
19305i1149a7657k91372B66543b48350k53468H101b69163I123a97288l8962A82807
19293C50201b52668A27817a26030J9920B54888a39869D1834J58666e1838B70478
19282b41337c7388k9681j1799l84396d3835J3896g029k58668I8820m0216b65180
19270b47471n3954c5649k96785f8148k26635k70914D34114a94643I363e88268
$$ y = [-195008, 129908, -58912, -106587, 167544, -46863, 172992, 198167, -376146, 376358, -31761, -162469, -160938, -335039, -12068, 160787, 78520, -427540, -16054, -300589, -205666, -161485, 71192, -136155, 18026, 224665, -109797, -4384, -61285, -232337, -73454, -146907, -63700, -28239, -209272, -84240, -108198, -250534, -500874, -83991, -5270, -83688, 65311, -83946, 110024, -411995, -91149, -17657, -309029, 266543, -248350, -501818, 8101, -269163, 9123, -197288, -236250, 182807, 350201, -252668, 127817, -126030, -106110, 254888, -139869, 41834, 200500, -51838, 270478, -241337, -37388, -67069, -78868, -463264, -43835, -29939, -7029, -265697, 98820, 58604, -265180, -247471, -301425, -35649, -332434, -68148, -294783, -565697, 434114, -194643, 9363, -588268]
19259b36542j21018g5916k867B22954d52358D5049J06651C0451j0003b5276k63038
19248b88314l2429a07844k23077a518k02394J5743B88307o2502a23897B09822
19237h195l57504h0994K7621B9184g761A68932h0350j55744b5853A97938g7112
19225h5479j59912E0591c7195A1484a15187a6898p6278C7940h3935B12027a46139
19213b6807k82763G0216a01882O670k35294G4755f2560A34761a58742B43904a038
19201a1792m5391f43l9482r4856l76835a52694k33061J25715j44151A40786A2987
19189A59593a90805h2654k16805A2346h4036I1604b56076a6084n3534j05405m33060
19178f08083a10055B244J1688P9247c40067f8341H5687o174M7600a5192C80869
$$ y = [-236542, -357560, -75916, -78783, 222954, -452358, 45049, 151700, 30451, 20448, -25276, -288314, -320743, -107844, -330921, -1518, -203912, -188169, 288307, 225805, -123897, 209822, -8195, -365699, -80994, -53373, 29184, -7761, 168932, -80350, -236094, -25853, 197938, -77112, -85479, -245391, 50591, -37195, 11484, -115187, -16898, -93176, 37940, -83935, 212027, -146139, -26807, -309570, 70216, -101882, -95212, -330506, 74755, -62560, 134761, -158742, 243904, -1038, -11792, -57183, -643, -40125, -134981, -511816, -152694, -385755, -260040, -404191, 140786, 12987, 159593, -190805, -82654, -299459, 12346, -84036, 91604, -256076, -16084, -69618, -175023, -608083, -110055, 2244, 13932, 93179, -340067, -68341, 85687, 79513, 127113, -15192, 380869]
19166a24110B75628j36244D6722a18817c2426B0915P7878a4234j85236N7902l219
19155a44787j21053a9525r1020L2489b404A22732E5791a13626j18005M9290G2683
19143a87860A06987D7273b78032c7048l1485h451B85005C6814b50478B1795a05259
19131b94880E8800J31130b00334D4486a93938r6740P1497m8038Q8902e1939a8823
19119a8608j61345l7680J02720a0755B58391o5349C5546L3052d3846m44701b07186
19107d8260A61575J99410A53537F568e6865C28390a2124I7269a5633l1812o2343
19096a09788L5306C5160b82034F784b02367D7417a353A59289k4099j1607b8787
19084c49738c2907E4008a74289n0771n6757e6895C5921a76610d1491D4189M566
$$ y = [-124110, 275628, 139384, 46722, -118817, -32426, 20915, 98793, -14234, -199470, -141568, -144787, -265840, -19525, -110545, -78056, -2404, 122732, 55791, -113626, -231631, -182341, 72683, -187860, 106987, 47273, -278032, -37048, -68533, -8451, 285005, 36814, -250478, 21795, -105259, -294880, 58800, 189930, -200334, 44486, -193938, -290678, -219181, -267219, -178317, -51939, -18823, -18608, -179953, -217633, -114913, -10755, 258391, 193042, 35546, 68598, -43846, -488547, -207186, -48260, 161575, 360985, 153537, 6568, -56865, 328390, -12124, 97269, -15633, -47445, -109788, -74482, 35160, -282034, 6784, -202367, 47417, -1353, 159289, 135190, 123583, -28787, -349738, -32907, 54008, -174289, -225060, -281817, -56895, 35921, -176610, -41491, 44189, 48755]
19073D8755J86191A16678i7285J6550r5922K9122j45128R6112J8858l27812b51325
19061d1394k37020A2911R8210P3276a85721B6216a21996m9409b7874E4194h3344
19049a16365o7j64668B1823K36668a17512A52846a02378n2021j26909C42120a16479
19037a28298B5784c08627D0451J26777a27764O2277A96206J08808o1005j14983
19027A29026l553J17788o9367e3344k28747a00762B01643p0072l173a05559C1068
19015a22982l51730A21205b14426D9323b60192e9926l2608b7026I075J7298L0223
19004E6596K58230b14564a05148k10462A15604J8923J639a77813N891j44154A01308
18992A0966O5402a70013B71687a013j83076O3145j08056N0942l796A35574J97521
$$ y = [48755, 234946, 116678, -97285, -80735, -176657, -147535, -292663, -196551, -177693, -505505, -251325, -41394, -278414, 12911, 111121, 184397, -185721, 26216, -121996, -171405, -27874, 54194, -83344, -116365, -116432, -281100, 21823, 258491, -117512, 152846, -102378, -154399, -281308, 342120, -116479, -128298, 25784, -308627, 40451, 167228, -127764, -65487, 196206, 305014, 244009, 129026, 125473, 243261, 173894, -53344, -282091, -100762, 201643, 131571, 128398, -105559, 31068, -122982, -474712, 121205, -214426, 49323, -260192, -59926, -92534, -27026, 9075, 26373, 56596, 314826, -214564, -105148, -315610, 115604, 134527, 136166, -177813, -171922, -316076, 101308, 10966, 76368, -170013, 271687, -1013, -184089, -120944, -229000, -178058, -181854, 135574, 333095]
18981C33095j54406e4177A40715k4884g36468i6241j62147l04986b22951A71274
18970b29441L5902c0698B4272g3914E610a94663k23622a33995B6393b45555B2664
18958a77064D2515a44613A814L7372J63199m4384a34425D6448J35471a71426B88331
18946e6938K7740k18052B85271A33383J75363b29645B20966P9692c1889j08663
18936a40552A06745k7723a18847E7422J5927i8289E7714b89844i1111a3852p8678
18925i2530L4833p6944j59683a01452l4535G4193c1153H2336K1346C8599J95088
18914B33687g2572l59350a04339n27501A63d3879B75504n5342b77328o9831d4306
18902G2096a14450M5417j32362g6168k38477d8821o5813l1837m4847M4879A33185
$$ y = [333095, 178689, -54177, 140715, 115831, -736468, -96241, -258388, -563374, -222951, 171274, -229441, -193539, -30698, 24272, -73914, 5610, -194663, -418285, -133995, 26393, -245555, 22664, -177064, 42515, -144613, 1814, 39186, 202385, 158001, -134425, 46448, 181919, -171426, 288331, -56938, -29198, -247250, 285271, 133383, 308746, -229645, 220966, 300658, -31889, -140552, 106745, 79022, -118847, 57422, 73349, -98289, 57714, -289844, -91111, -13852, -92530, -57697, -134641, -294324, -101452, -135987, 74193, -31153, 82336, 103682, 38599, 233687, -72572, -431922, -104339, -631840, 163, -43879, 275504, 220162, -277328, -347159, -44306, 72096, -114450, -69033, -201395, -76168, -314645, -48821, -114634, -146471, -191318, -146439, 133185]
18890b15760J06553C0112R1663c49208a40718j00370A28101k5670a54913a3864
18879B66578e6946d207k150A23668b81608A81036c61893g8992l10686B75836a52833
18867c0317n3244q0747G317a44100f5243F0336h6127C20660a58403A8708K10424
18856B29132b67429a11765j00289N534A9386L37920j78350k7545G2053a72996
18845a51151r2129l1518N9040a3414k79371A21694n9564a02037C0123c01342J13495
18834a87847j25718f2671B75746a8293p6096C69338c63305f0047k4826C78578
18823a23697L5759G596a76185j65230B03032b58279B24893b17772g6290A06938
18812B10439E6103L37776a82780b4643I7841a16331F9000a93848B5653Q8511J00176
$$ y = [-215760, -109207, 30112, 121775, -349208, -140718, -241088, 128101, 102431, -154913, -13864, 266578, -56946, -4207, -6357, 123668, -281608, 181036, -361893, -78992, -389678, 275836, -152833, -30317, -83561, -164308, 7317, -144100, -65243, 60336, -86127, 320660, -158403, 18708, 229132, -267429, -111765, -212054, -206520, 19386, 357306, 178956, 151411, 72053, -172996, -151151, -243280, -274798, -215758, -13414, -292785, 121694, 62130, -102037, 30123, -301342, -187847, -313565, -62671, 275746, -18293, -94389, 369338, -363305, -60047, -84873, 378578, -123697, -87938, 7596, -176185, -341415, 203032, -258279, 224893, -217772, -76290, 106938, 210439, 56103, 393879, -182780, -24643, 97841, -116331, 69000, -193848, 25653, 114164, 214340]
18801B14340C0499b2993l139j21102O67L0289j2098H0270c4258J4314k64123b8829
18788a72898A84734a647A65491b5493j3519f18A01364b17389C53293i7265M5876
18777e1389b274j91153L2294P8750l16069g7441E1004c03802a24498k06812A77133
18765D4968J7515M5730D2407f7511j09160j26457g8638j73839p5328J01945A13345
18753g9278k80688A50439G2032K05241g0521k00104A3113a99611A99496a31746
18742b9599A42021h8972D8607b25222A50964a26976e4995j28017A34282a6485
18731b04087j87974D4760J40687c64837J62902Q5870j81570J42031B32954j15854
18721A17100a4121j52345N9919A6293P0629a38909e1615F607a72785f6576j06558
$$ y = [214340, 30499, -22993, -26132, -147234, -146567, -116278, -128376, 80270, -34258, -19944, -284067, -28829, -172898, 184734, -1647, 165491, -25493, -39012, -618, 101364, -217389, 353293, -97265, -51389, -2274, -193427, -161133, -82383, -398452, -77441, 51004, -303802, -124498, -331310, 177133, 44968, 62483, 108213, 42407, -67511, -176671, -303128, -78638, -252477, -327805, -225860, 113345, -79278, -359966, 150439, 72032, 277273, -70521, -270625, 13113, -199611, 199496, -131746, -29599, 142021, -88972, 48607, -225222, 150964, -126976, -54995, -183012, 134282, -16485, -204087, -392061, 44760, 185447, -364837, -201935, -116065, -297635, -155604, 232954, 117100, -14121, -166466, -106547, 16293, 86922, -138909, -51615, 6607, -172785, -66576, -173134]
18710a73134I0772c27742A44083e8739k58469D8825J4938g8245B48533a97411
18699A3727K58274a37474J0440e2825A16115a11625A06961l6973J53348a26858
18688b19481o8365J19112h4093n9340k3100e7016n5709H672J56604P6581j6456
18677B25401h5669k56945C55062G514c1492j29561A82749k362b1835l44681D8110
18665D1218J33140a9946j48284B2345K19017d30159b06137A57566d4484A66641
18654b88333e517A77634b16103Q8126C5053a31633A5372a19896N9230m1595k59210
18643c61471e5881h315B41674a89859P9550N3297b3449n3114A10926K48041b2388
18631a36421L3817j84838A09242b34528A94095f7061B23556C3207m137a68714
$$ y = [-173134, 90772, -327742, 144083, -58739, -317208, 48825, 63763, -78245, 248533, -197411, 13727, 272001, -137474, -127034, -52825, 116115, -111625, 106961, 69988, 223336, -126858, -219481, -287846, -168734, -84093, -143433, -166533, -57016, -112725, 8672, 165276, 241857, 225401, -85669, -342614, 355062, 7514, -31492, -161053, 182749, 180387, -21835, -366516, 48110, 41218, 174358, -19946, -168230, 22345, 241362, -430159, -206137, 157566, -44484, 166641, -288333, -5517, 177634, -216103, -127977, 35053, -131633, 15372, -119896, -60666, -102261, -361471, -55881, -8315, 241674, -189859, -110309, -57012, -23449, -76563, 110926, 358967, -22388, -136421, -102604, -287442, 109242, -234528, 194095, -67061, 223556, 33207, 29070, -168714]
18620h3344c6093k89567c6565G3633J76976B1907J02152M2837d105C77144a31406
18608a64327j77271a0116H8525c35930J61138r2845j2539h9991E5267h5830j10934
18597a96764p8198E929b40586E9317d92746h24j6931B57537b69019a7675H509
18585C8599O1916g7944L6271k02338Q0512j39205A57529a64185m02826b06304
18574A16561a29261L1910l77746c3183A68171b03476H8276K1916d2807H0760d67533
18562A62067a48249B44682A4781L5418a40663q7802J10414a1572k59398B47443
18551A5716b5447j74526A44972a48763O9896A44545m0628N77609b20838M7343
18541a73495A541K28421Q4736i472k693B83986g0290A4208K07038A00843a29995
$$ y = [-83344, -36093, -325660, -36565, 73633, 250609, 21907, 124059, 166896, -4105, 377144, -131406, -164327, -341598, -10116, 88525, -335930, -174792, -267637, -280176, -89991, 55267, -85830, -196764, -274962, 5929, -240586, 59317, -492746, -824, -17755, 257537, -269019, -17675, 8509, 38599, 100515, -77944, -41673, -244011, -163499, -302704, 157529, -164185, -567011, -206304, 116561, -129261, -97351, -475097, -33183, 168171, -203476, 88276, 110192, -42807, 80760, -467533, 162067, -148249, 244682, 14781, 50199, -140663, -228465, -118051, -11572, -270970, 247443, 15716, -25447, -199973, 144972, -148763, -78867, 144545, 103917, 681526, -220838, -173495, 1541, 229962, 314698, -9472, -12165, 283986, -70290, 14208, 221246, 100843, -129995]
18529f3695p6905m8485A21170h2826L4046l14131A251e0547C7660b27039D9476
18517A11291a56237I4411g7504A08683b75069A29950J4061b52616Q7501F283K06943
18506B13226a64712r8438r0324h2007F2893f0488j76564g2510k63411D8896K40088
18495B88984a01264k1138B10894a25200j5291L6260j60213j8538B1989K69483
18485B91472a31094j12402G3693c97797d9640j30490B27994a95619J8069J1701
18475a65849b8975A95874g8816a8497M754j24443c0619E430d44827a39660j79792
18464c19452h7875H353a05296k42016D52044b27704e912A86736a71942Q4210B50248
18452h2393A80256e5708j02090B69382f105q1336A02086O4876n5088a43810l7597
$$ y = [-63695, -140600, -189085, 121170, -82826, -48780, -362911, 1251, -50547, 37660, -227039, 49476, 111291, -156237, 94411, -77504, 108683, -275069, 129950, 144011, -252616, -165115, 6283, 213226, -164712, -263150, -353474, -82007, 62893, -60488, -237052, -72510, -335921, 48896, 288984, -101264, -122402, 210894, -125200, -140491, -104231, -264444, -282982, 21989, 291472, -131094, -243496, 73693, -397797, -49640, -180130, 227994, -195619, -177550, -165849, -28975, 195874, -78816, -18497, -13743, -138186, -30619, 5430, -444827, -139660, -319452, -87875, 8353, -105296, -347312, 452044, -227704, -5912, 186736, -171942, -87732, 250248, -82393, 180256, -55708, -157798, 269382, -6105, -87441, 102086, 166962, 111874, -143810, -181407]
18441a81407B16816a21263A68264A9921e04104a53493P0114m0714C2328f8939
18430b49164B64237a97855A55890a34734b7508j71219Q3127c5233A6802K9538
18420D6340a61077A8142g3185D4204e2437l9108B22295a75987Q1535C3203K29327
18409B62530c8264B41960b97466A02458K92084o3135C3643Q6099L4546k172d0902
18397e0058k99853a6263l5680j60618L6025n6049A53871K40043b932E2597b32388
18385e5766k11221A21258l6213b9595j80074I0589a54459D092a73744e2407o6816
18374a19223n5956f9820A40314C0999a02560b2806A89206r4398b59360b6075A983
18362c46701a12985k70885a2580B44879e602k586A36140m7211l4516e6185l67801
$$ y = [-181407, 216816, -121263, 168264, 19921, -504104, -153493, -83379, -124093, 32328, -68939, -249164, 264237, -197855, 155890, -134734, -27508, -198727, -115600, -35233, 16802, 46340, -161077, 18142, -73185, 44204, -52437, -91545, 222295, -175987, -94452, 33203, 262530, -38264, 241960, -297466, 102458, 394542, 331407, 33643, 119742, 154288, 152116, -40902, -50058, -349911, -16263, -51943, -212561, -176536, -232585, 153871, 393914, -2932, 52597, -232388, -55766, -266987, 121258, 85045, -29595, -209669, 90589, -154459, 4092, -173744, -52407, -119223, -175179, -69820, 140314, 30999, -102560, -22806, 189206, 94808, -259360, -26075, 1983, -346701, -112985, -383870, -12580, 244879, -5602, -8188, 136140, 88929, 54413, -56185, -423986]
18351d23986e7754A10316a74449A42283B0743h9432k2834E6194a92950d0487K535
18340c7952j52066e1912j09132A65134R754C1204b26392B53236J6183d5144n9256
18329a04400j07508P5003m6375e9994B0915a82639I0998a27771D8732I654d3406
18317H2260B3146A0055c25910A58197C5583g6417k17473h1892C49120G2962f1449
18305A40584N5873K7830a42700b5321C0a11221j13901N2796f8109B70759q1971
18294A88788N4879A05704c9080j48143l11405G0296C0532a41672c1696B87984
18283B22739B6430K91841b96418c52o0608a0994A87707b31605J02680B08700b03604
18271B17284F1502b41703B66714a52251O8446q9885h3049q0952L3915c849j53747
$$ y = [-423986, -57754, 110316, -174449, 142283, 20743, -89432, -112266, 56194, -192950, -40487, -37952, -190018, -51912, -161044, 165134, 174888, 31204, -226392, 253236, 269419, -45144, -104400, -211908, -136905, -183280, -59994, 20915, -182639, 90998, -127771, 48732, 9654, -43406, 82260, 23146, 10055, -325910, 158197, 35583, -76417, -293890, -81892, 349120, 72962, -61449, 140584, 196457, 224287, -142700, -25321, 30, -111221, -225122, -172326, -68109, 270759, 188788, 243667, 105704, -39080, -187223, -498628, 70296, 30532, -141672, -31696, 287984, 222739, 26430, 318271, -296418, -352, -60960, -10994, 187707, -231605, -128925, 208700, -203604, 217284, 61502, -241703, 266714, -152251, -83805, -173690, -83049, -164001, -130086, -3849, -157596]
18260a57596g3327j0551J1222A3023b96425a3640I5350O7352a38468g967j45181
18249a53148I3915R4266o7729h7679C55647g7847n404l4914K6392j41949E1256
18237a80642G9326e2639A66622A3997i782o2360B73157a05634j14984k503n9451
18226b82572B59874a22300B09835B4983a38186B85143j35967d8173j03362e5073
18215A03472b98828G256R6401J44283P540b63366P6879A03612c09583d2304k00938
18204b43242l51790B2087c04635C21810A40337C9696c95552e8184r789A14718
18193a97570e3305A34603j7177l8127b3113k25293Q9275g9119A39227a67307I2511
18181h1328l06656a52271g362A48620l318o8251b21153P0610B4040J13287D873
$$ y = [-157596, -73327, -83878, -72656, 13023, -296425, -13640, 95350, 162702, -138468, -7967, -153148, 93915, 188181, 120452, -87679, 355647, -77847, -83251, -118165, -91773, -233722, 51256, -180642, 79326, -52639, 166622, 13997, -9782, -72142, 273157, -105634, -220618, -223121, -282572, 259874, -122300, 209835, 24983, -138186, 285143, 149176, -48173, -151535, -55073, 103472, -298828, 7256, 103657, 247940, 255480, -263366, -186487, 103612, -309583, -42304, -243242, -595032, 22087, -304635, 321810, 140337, 39696, -395552, -58184, -67973, 114718, -197570, -53305, 134603, 117426, 79299, -23113, -248406, -159131, -79119, 139227, -167307, 92511, -81328, -387984, -152271, -7362, 148620, 145302, 77051, -221153, -150543, 24040, 137327, 4873]
18169B9548g7961o7070d523F1954b74841Q384d9292J9520l70105O1148J29339
18158b09390C46358a71422H9494a27972B80539a77858b5457a2379o0207c3529
18147g6755l17208E5545b51988B10791B3234J10365K77911e4305E356K18018L8497
18136B61871f58350e6044o9647j53606J3906i9147G9197e8883A12865i2158F6013
18124i9649K339B13187q55j03125a74338F3197c51324F0170J61725k6898b68909
18112g5694k3732d6522m23223d3759q3269A92403F813P0266a31101A25327a15426
18100a70001b1823j56576B08224f0147l2372A79228a33147e5076B3534J2515c16012
18088F2047a3929H2124c20522f608A7317J25842g2471k52253g0787B02413o4685
$$ y = [29548, -77961, -145031, -4523, 61954, -274841, -266457, -49292, -29772, -399877, -338729, -209390, 346358, -171422, 89494, -127972, 280539, -177858, -25457, -12379, -72586, -33529, -76755, -393963, 55545, -251988, 210791, 23234, 133599, 411510, -54305, 5356, 223374, 261871, -658350, -56044, -125691, -279297, -265391, -99147, 79197, -58883, 112865, -92158, 66013, -99649, -97310, 213187, 212332, 109207, -174338, 63197, -351324, 60170, 221895, 194997, -268909, -75694, -99426, -46522, -469745, -43759, -127028, 192403, 6813, 77079, -131101, 125327, -115426, -170001, -21823, -178399, 208224, -60147, -92519, 179228, -133147, -55076, 23534, 36049, -316012, 62047, -13929, 82124, -320522, -6608, 17317, 143159, -72471, -324724, -70787, 202413, 137728]
18077A37728c9616j54680G6574b38480C0466a64558A52170c03362g8091k60122
18067c38213D83019a08781B04175n1942a21278B6770c8053a6563p9418q3065P1581
18056a07465p4964B81856h0550A3802f9201A67195a41906i963A36757b5275k66440
18045b91715B33552r1159a2905k19719B04806a54169d1102A20980a0445k68303
18035b78748a18738D1380d7775B922d5569F6749d68071c2506j16685j15115k312
18024b66618a1920c857j68535A64587C6911j7129R6822c3701C49993j17782b30747
18012f7749k79992A36217d6234C250b08036f8623j16498h8417r6206B19955H6388
18000A50271i8041n5632E0157c08690P7181M3447A56185b41490j55403b2975H0435
$$ y = [137728, -39616, -194296, 76574, -238480, 30466, -164558, 152170, -303362, -78091, -338213, 483019, -108781, 204175, 152233, -121278, 26770, -38053, -16563, -95981, -179046, -107465, -182429, 281856, -80550, 13802, -69201, 167195, -141906, -9963, 136757, -25275, -291715, 233552, 142393, -12905, -232624, 204806, -154169, -41102, 120980, -10445, -278748, -118738, 41380, -47775, 2922, -45569, 66749, -468071, -32506, -149191, -264306, -266618, -11920, -3857, -172392, 164587, 36911, 19782, 116604, -33701, 349993, 232211, -230747, -67749, -347741, 136217, -46234, 3250, -208036, -68623, -185121, -88417, -184623, 219955, 86388, 150271, -98041, -153673, 50157, -308690, -231509, -188062, 156185, -241490, -396893, -22975, 80435]
17988A28100e7188b5140k8263k525e785j52581A51131j0385j3226k787m0094a45073
17975A9889b20592m3640C8339g1692A29866J17128a32010B5974c11644A96472
17964A37799a082p1309j05888F3761L03305G3224a38497A32191g3191a7876D362
17952B16915a79984d317A51319C647a02291c2410j63621c9875H1886K4549a25371
17940C20484d90313a77305B97891b1156B11493a83375l0247C8623g701j99272
17930b06973D9831b19262B05190a96741b2303n2065j52929H9610A4765b8749j03198
17919a31947B50810n8942a99236F354M6374b04539F4013d57187D05902F7175a20495
17907B8694J00280n4030d8131j71420h2818o3097n4121A50271L3496q9295c13892
$$ y = [128100, -57188, -25140, -53403, -55928, -5785, -158366, 151131, 140746, 127520, 124733, 84639, -145073, 19889, -220592, -264232, 38339, -71692, 129866, 246994, -132010, 25974, -311644, 196472, 137799, -1082, -72391, -178279, 63761, 367066, 73224, -138497, 132191, -73191, -17876, 4362, 216915, -179984, -4317, 151319, 3647, -102291, -32410, -196031, -39875, 81886, 106435, -125371, 320484, -490313, -177305, 297891, -21156, 211493, -183375, -213622, 38623, -7701, -206973, 49831, -219262, 205190, -196741, -22303, -74368, -227297, 89610, 14765, -28749, -131947, 250810, 191868, -199236, 6354, 52728, -204539, 64013, -457187, 405902, 67175, -120495, 28694, 128974, 74944, -48131, -219551, -82818, -145915, -200036, 150271, 183767, 94472, -313892]
17895A54979g5125k45964a22924D466a78030I217L87863j44274e5022J9997A04273
17883g8039l34166B59968a47666D1017j5984a8568k5951H2445l9336a05947d9900
17871A93498c24633A10233c49209a05695E01516F8560J57637f7191b0868C06171
17860a4728l68276J88684A24923c2246k11226C95797g6286K3996A03722i2057
17849a92527A10091b08426c2643o5827j21858A4529c578C016b11774Q6509j63910
17838b89175A71884K26066A55589F38b49054B14232f9256B26404a58627A72243
17827a6914l6655A5698b4249F212b2604A04769A2288b6466j14120A82557g0510
17815i8281A6115J75241Q148e3306A64428d136j63007c0823j19296E2205J5403
$$ y = [154979, -75125, -321089, -122924, 4466, -178030, 9217, 397080, 252806, -55022, -35025, 104273, -78039, -412205, 259968, -147666, 41017, 25033, -18568, -44519, 82445, 43109, -105947, -49900, 193498, -324633, 110233, -349209, -105695, 501516, 68560, 226197, -67191, -20868, 306171, -14728, -383004, -194320, 124923, -32246, -243472, 395797, -76286, -52290, 103722, -92057, -192527, 110091, -208426, -32643, -98470, -220328, 14529, -3578, 3016, -211774, -125265, -289175, 171884, 397950, 155589, 638, -249054, 214232, -69256, 226404, -158627, 172243, -16914, -53569, 15698, -24249, 6212, -22604, 104769, 12288, -26466, -140586, 182557, -70510, -98281, 16115, 191356, 199504, -53306, 164428, -4136, -167143, -30823, -150119, 52205, 67608]
17804F7608a90246A52315h948D0736Q9799a73045k5687j90739b1503A86358b82075
17792G1110c34544c8624j19142F6049B3765F284a11854j32103B04542c19812A27111
17780C24705j03249b116F5146f0330N715A09434k5691e0690A22657q409e1679
17768b25796A97646d45901c5901B49445c3726q8881A72927B5659J70606c80867
17757b63377B29486a51091b9474a0889A0845P8513c2933q4331o4666A68337K7637
17746A95974a27428d3925A14592B0402b86412G9197a31983b1473A42805e1831
17735A8088L8352f284B02761p0438e3559A97503a87830B00222l0840A438f8779
17723b11439a3712B4417a75548g4251A38931b49436B38812a14097K2432q0360
$$ y = [67608, -190246, 152315, -8948, 40736, 130535, -173045, -198732, -389471, -21503, 186358, -282075, 71110, -334544, -38624, -157766, 66049, 23765, 6284, -111854, -243957, 204542, -319812, 127111, 324705, 221456, -2116, 65146, -60330, -54615, 109434, 83743, -50690, 122657, 114248, -51679, -225796, 197646, -445901, -35901, 249445, -33726, -122607, 172927, 25659, 196265, -380867, -263377, 229486, -151091, -29474, -10889, 10845, 89358, -32933, -117264, -181930, 168337, 195974, -127428, -43925, 114592, 20402, -286412, 79197, -131983, -21473, 142805, -51831, 18088, 56440, -6284, 202761, 132323, -53559, 197503, -187830, 200222, 169382, 1438, -68779, -211439, -13712, 24417, -175548, -74251, 138931, -249436, 238812, -114097, -91665, -172025]
17713a72025A60188b5699B72904c45633a54864B49598D3407k0296P5586d3086
17702b2913B5835m711J35239c972k36528g2954i734C02774I3497k5159a37109
17690g2746A01796b75224f895j01253H0499O2558D5720B0490L41450B0973J14450
17679A35423n4313J9906c55647e7653A24611a71283j9000F9834J69762j4245A2894
17667g9324A31516c51107C7852M3607J5858b75191A07578K4855M8998d798A21182
17655C73904M9115A43456k5036b1248k7612q6770F36e2535A87426O021c5520j44374
17643a79894B15227M6101r1761C4195j5779N859L04106A082e001B70362E6959
17631F3416b60031B6745L1455e3745I6167h2279I7405k9912c1657j25398B45227
$$ y = [-172025, 160188, -25699, 272904, -345633, -154864, 249598, 43407, 23111, 98697, -43086, -22913, 25835, 21124, 156363, -3972, -240500, -72954, -9734, 302774, 93497, 68338, -137109, -72746, 101796, -275224, -6895, -108148, 80499, 143057, 45720, 20490, 361940, 20973, 135423, 81110, 101016, -355647, -57653, 124611, -171283, -190283, 69834, 239596, 225351, 12894, -79324, 131516, -351107, 37852, 81459, 97317, -275191, 107578, 132433, 181431, -4798, 121182, 373904, 423019, 143456, 118420, -21248, -48860, -135630, 636, -52535, 187426, 193447, -35520, -179894, 215227, 261328, 169567, 34195, 18416, 24275, 328381, 1082, -5001, 270362, 56959, 63416, -260031, 26745, 58200, -53745, 96167, -82279, 97405, 67493, -31657, -157055, 245227]
17619c75959a81807b6080K634r7563n754B14804n3885c18082b868k42987a22032
17607A3726Q27M3201f1780B1515K51189i4807d7190K3142n6979A16636L05655
17596D22291a6830l82453a70739B70933b11914A4695d9497G7351a16291O175j73989
17585b84105G1714l5491b85482H40e1896A42525Q1049a62906B00858K763h6475
17573a44533A97371q3829K30766g265k58766J04340F2546P794a83249B51782a22867
17561A99224a06634B7276L2741L09838j51909j04608P2793a87752h1388A00243
17550a15030l02242G2305j7575J61236a7193g666r8043q0144A7428K7840L5153
17539H0421J18641e8102C12944a6574B13305b97047I8219c74158P0644H0580k8308
$$ y = [-375959, -181807, -26080, -23446, -121009, -126763, 214804, 160919, -318082, -2868, -245855, -122032, 13726, 14553, 57754, -61780, 21515, 272704, -94807, -47190, -24048, -81027, 116636, 422291, -16830, -399283, -170739, 270933, -211914, 14695, -49497, 77351, -116291, -110116, -284105, 71714, 36223, -285482, 840, -51896, 142525, 223574, -162906, 200858, 203621, -86475, -144533, 197371, 113542, 344308, -7265, -266031, -161691, 62546, 70340, -183249, 251782, -122867, 199224, -106634, 27276, 60017, 369855, 217946, 113338, 186131, -187752, -81388, 100243, -115030, -417272, 72305, 54730, 215966, -17193, -7666, -105709, -185853, 17428, 45268, 80421, 199062, -58102, 312944, -16574, 213305, -297047, 98219, -374158, -303514, 80580, 52272]
17528E2272c5023B55737k7599k967F4685J21184n5518D4377k936L65878b05036
17516C70637j53213L55802h5411C61064j77359d5623B89641j21698G7144a79228
17505a88787Q2885B93639O3490j73992M4166b46920H0680J15463E7599J40910
17495A98509e3715n4519B94405F1630a55053A49127G0023O7816m673P0163B6728
17483e1620F2677c02568f703k33663B04077f2097B55816f6434E5411J33522J19478
17472C08411O5319j42297j14730m4675J80232N4072E0362K18115c911C72991r8871
17461B74120k7525h1288A12511J5561e2534B62444J3894g8901o9786C54725B9047
17449A05376f8265B26628L05934k17840j4989l9991h2492C1761J68537F8876J9483
$$ y = [52272, -35023, 255737, 228138, 225171, 64685, 185869, 130351, 44377, 41441, 407319, -205036, 370637, 217424, 573226, -85411, 361064, 183705, -45623, 289641, 167943, 77144, -179228, -188787, -105902, 293639, 357129, 183137, 227303, -246920, 80680, 196143, 57599, 198509, -53715, -108234, 294405, 61630, -155053, 149127, 70023, 137839, 133166, 203329, 26728, -51620, 62677, -302568, -6703, -240366, 204077, -62097, 255816, -66434, 55411, 188933, 308411, 373730, 231433, 116703, 72028, 252260, 306332, 50362, 268477, -3911, 372991, 274120, 246595, -81288, 112511, 128072, -52534, 262444, 276338, -78901, -148687, 354725, 29047, 105376, -68265, 226628, 532562, 314722, 299733, 259742, -82492, 31761, 200298, 68876, 88359]
17438H8359Q732J38183a01146B26582J7502J15780j22043G9280J15633m5740o6716
17427H2457a2990D74774A09739J29196J75638A12670a0104I7197J30801P2559
17417C00557m1395j126N8965C0246K35028J67339k11135n0794J84634j75660f5476
17405B79687G0633K86006j46399b6905A21812K19477A8986L7866q95J18202K08874
17394C83033j25809L09961a31671c3384A51324B7442P596N3627J76533m1509N6721
17383B80410i6009C3277K26870R1326D2119L06951L1048j36518E6360b21954D29309
17371a3272A09651A4761K60242A16229J6567J85067A15863b4599j36521B72345
17360b32319A55827J58144a58369C30173m7495k0356a22187B23651o1391J42722
$$ y = [88359, 97091, 235274, -101146, 226582, 244084, 359864, 237821, 79280, 194913, 149173, 82457, -12990, 474774, 109739, 238935, 414573, 112670, -10104, 97197, 227998, 300557, 259162, 258036, 317001, 30246, 265274, 432613, 221478, 170684, 355318, 179658, -65476, 279687, 70633, 356639, 210240, -26905, 121812, 341289, 18986, 56852, 55957, 174159, 383033, 257224, 567185, -131671, -33384, 151324, 27442, 35038, 88665, 265198, 223689, 280410, -96009, 33277, 260147, 351473, 42119, 349070, 380118, 243600, 56360, -221954, 429309, -13272, 109651, 14761, 275003, 116229, 132796, 317863, 115863, -24599, -161120, 272345, -232319, 155827, 313971, -158369, 330173, 282678, 262322, -122187, 223651, 162260, 304982]
17350C04982H450J06428J69223D3335e6353B02897o2018c2076C41315A24627c19165
17338h2394A24673m8280J9470O3050m7160P800J66285o7689l4272q9530l7925
17327E6422M3859L2844J59877l9468J11476a53657A21621a51488H3333m1165R2364
17316A34532B4524L76677B0783L61066A88505n8491Q3426q9224J18003K1623r550
17305B54292k7665k8354c0212C86231j84531a21707B65360n304O7840A00477a27833
17293B30362A08219P3393J27487J63778A35857R0213m0279R4961n6660F4712J9785
17282H4497J67884I5991M3160j1391e0743B01388q3609A4967J72524a30932I5927
17270B12292q9461A8054O4476N4042h3565E8787Q3605K02563b29921B07739Q6838
$$ y = [304982, 8450, 114878, 284101, 43335, -56353, 202897, 140879, -32076, 341315, 124627, -319165, -82394, 124673, 76393, 95863, 158913, 111753, 119553, 285838, 218149, 183877, 94347, 56422, 100281, 133125, 293002, 253534, 365010, -153657, 121621, -151488, 83333, 42168, 134532, 24524, 401201, 20783, 381849, 188505, 130014, 213440, 124216, 242219, 263842, 254292, 226627, 198273, -30212, 386231, 201700, -121707, 265360, 260056, 327896, 100477, -127833, 230362, 108219, 181612, 309099, 472877, 135857, 226070, 185791, 280752, 224092, 64712, 84497, 252381, 95991, 139151, 127760, -50743, 201388, 117779, 14967, 187491, -130932, 95927, 212292, 122831, 18054, 82530, 136572, -83565, 58787, 142392, 344955, -229921, 207739, 294577]
17259B94577A7919M0271K38978C6031P2761M00129I3035N3544E1890M5968K3412
17248A21270D6297i3054F9043M12846a26510D21886A15326K16307k9420A36888
17237D99070B04902q297J26485o2988J95275B22316C3793J43644q411d7903a6022
17225B28340n6144E6734M47685A7712L25312a8795A21520K59171J52038k01757
17215C30972J9889k5655j17242a0550C3064K19952J6022J91146j78275r1902M5029
17204B35036k813l0832O008J01200Q502j0499K09369k46521K55308B07335J25704
17193C33039I3185A5372N15526h3791B14193I4101J94385J30417o4441e4339B9248
17181C0110M8962R2688Q9793J88017B19419M4982C2637L0537L10512K09214B52794
$$ y = [294577, 17919, 58190, 297168, 36031, 108792, 508921, 93035, 146579, 51890, 97858, 121270, 46297, -93054, 69043, 481889, -126510, 421886, 115326, 331633, 302213, 136888, 499070, 204902, 196605, 323090, 260102, 455377, 222316, 33793, 177437, 169026, -47903, -16022, 228340, 172196, 56734, 504419, 17712, 343024, -18795, 121520, 380691, 532729, 330972, 350861, 325206, 207964, -10550, 33064, 253016, 269038, 460184, 281909, 190007, 235036, 232223, 201391, 207399, 308599, 317101, 306602, 515971, 269450, 524758, 207335, 333039, 93185, 15372, 530898, -83791, 214193, 94101, 288486, 418903, 354462, -54339, 29248, 30110, 79072, 171760, 261553, 449570, 219419, 264401, 32637, 63174, 373686, 582900, 252794]
17169G0751J92324a3571C61063K0819O209A92249J68499p2189J35920q1202N7048
17158D00325j14249C4424K32108r8321l0341L09229j83787A20340J26615C3321
17147D49748k2087k00110n3712m7598L60518j49067O2236m1794A47927e6164B51943
17135B20305M90799k54312a5271A28998L4693L38958j80208J58931j07167o6776
17125C07429o3933M0162j5316n6707M52625k80371J70461A76375K13187p5164
17115C14398I8446K65701A56914R9542n7710P8961K27154A20886K13877J56902
17105D91665p6958j85065J93932K20668A1301L50972n5566J54290A87390M50041
17095F37431k10461A32538J71263f1961C64918A31358R3500J17135L44647B75273
$$ y = [70751, 263075, -13571, 361063, 381882, 388091, 192249, 360748, 288559, 424479, 343277, 400325, 286076, 34424, 266532, 168211, 137870, 447099, 263312, 120340, 246955, 33321, 449748, 427661, 227551, 173839, 126241, 486759, 337692, 399928, 358134, 147927, -56164, 251943, 220305, 711104, 456792, -15271, 128998, 163691, 502649, 322441, 481372, 374205, 307429, 243496, 283658, 268342, 211635, 664260, 383889, 554350, 176375, 389562, 314398, 98446, 364147, 156914, 256456, 198746, 277707, 504861, 120886, 334763, 491665, 414707, 229642, 423574, 644242, 11301, 362273, 306707, 460997, 187390, 637431, 426970, 132538, 303801, -61961, 364918, 131358, 224858, 341993, 686640, 275273]
17084E84578Q445J20251F2802L98072j94832K16386j47805o5876m5658J88931
17074D12020j02473K21468j56230K37659k57838K13790k4823j7745L2721j18198
17064D40351K65092C17321J04593L59163j58894j43729M0752A66801J58453K1454
17054C46708J77721k36706j6143K73378O2412k4454B31919M06672K76082C86027
17043F47241j54502q099M9894q9784P6588a14657B15637L76862J64002B93109
17032H38646C33611J02182L30017C10227O12183k84100o9280K602J64350Q5981
17022H21963k19940J043J9816n9440J88641m0411k12759K93092K8436O1988j43960
17011G38469k4939J7779p7761L9866j22468K76304K407l19951J63152K07588l36795
$$ y = [584578, 593023, 713274, 62802, 460874, 266042, 482428, 334623, 268747, 223089, 412020, 309547, 531015, 374785, 612444, 354606, 568396, 543573, 525828, 558549, 440351, 705443, 317321, 421914, 781077, 622183, 478454, 519206, 166801, 325254, 346708, 524429, 287723, 271580, 544958, 607370, 582916, 231919, 638591, 914673, 386027, 647241, 492739, 484640, 534534, 444750, 521338, -114657, 215637, 592499, 756501, 293109, 838646, 333611, 435793, 765810, 310227, 922410, 638310, 569030, 571632, 735982, 821963, 602023, 603066, 622882, 563442, 752083, 711672, 498913, 792005, 820441, 882429, 738469, 713530, 731309, 653548, 693414, 570946, 847250, 849657, 529706, 692858, 900446, 563651]
17000E63651K08427k9072k3930J07190k36994L68215D53919O40081j68175O9916
16990I95741k72501k63987J41618M8599J15181j33958n992J0332K6178L07786
16980I68997j53271l6282J89345N2344q4393j81190m7924M44907j19356l6972
16970I96205j68679M34465m90997J38102M2222J07197n733J12471m62648J25202
16960H27807J60319K0260k17244L18871j07462K768Q5391j77575K34789k00985
16950I46939K44947K70408j68010l00565j24254L53646m27039K49817p390J10060
16940A148559P6934j17439L94173m20944N20076n84980J16031L83418j01346l36485
16930A077997J81497Q3661J20587L6042m66283O12272k97480L69147k10226k30631
$$ y = [563651, 772078, 743006, 719076, 826266, 589272, 957487, 453919, 1094000, 925825, 995741, 723240, 459253, 600871, 649470, 764651, 630693, 624701, 635033, 661211, 968997, 815726, 779444, 968789, 1021133, 936740, 755550, 707626, 1152533, 1033177, 996205, 827526, 1261991, 770994, 909096, 951318, 1058515, 1052782, 1165253, 702605, 827807, 988126, 1008386, 791142, 1110013, 1002551, 1005319, 1090710, 913135, 1147924, 946939, 1191886, 1462294, 1294284, 993719, 869465, 1223111, 796072, 1045889, 1038499, 1148559, 1225493, 1108054, 1502227, 1081283, 1601359, 1016379, 1132410, 1515828, 1414482, 1077997, 1259494, 1343155, 1463742, 1499784, 1033501, 1645773, 1348293, 1717440, 1507214, 1276583]
16920A276583K78227j00763q1070L56544k04485J21590l8687o8142q7391J35221
16910A587627r9947J43231k16815J91466l2706J80369j49799l4420j98791L96984
16900A767199l967J00796L2743L24194k36386j79892J75502l17672J38461N9547
16890A860525K30646j67001L5711K92005J68309o47982J73840M23262j8245r7432
16880B253638k07701j53116M12170k37728j74053O33993j63976J3168N26000l36546
16870B565849R1415m9843L6534k95282M91859l51195K07646l7544J60145r0314
16860B729270L53312k5631J74920j24349m70610q6221O26866J63794k63306j01584
16850B976461M65631l2416j70902J56734K69781M2767j09991m9926Q581M76277
$$ y = [1276583, 1554810, 1454047, 1372977, 1729521, 1525036, 1646626, 1607939, 1539797, 1452406, 1587627, 1487680, 1630911, 1414096, 1605562, 1572856, 1753225, 1603426, 1569006, 1370215, 1767199, 1763232, 1864028, 1896771, 2220965, 1984579, 1804687, 1980189, 1662517, 1800978, 1860525, 2091171, 1924170, 1959881, 2251886, 2420195, 1772213, 1946053, 2369315, 2351070, 2253638, 2045937, 1892821, 2304991, 2067263, 1893210, 2527203, 2363227, 2376395, 2902395, 2565849, 2657264, 2607421, 2643955, 2348673, 2840532, 2489337, 2696983, 2659439, 2819584, 2729270, 3082582, 3056951, 3231871, 3107522, 2636912, 2550691, 3177557, 3341351, 3078045, 2976461, 3442092, 3409676, 3238774, 3395508, 3665289, 3708056, 3598065, 3548139, 3556720, 4032997]
16840D032997k63222N9704L02702j54987M1447J4501N37010j32991j56492P2897
16830D353566m5452J13411J54368R1248J90392J29778K69822K632M6241o5555
16820E240451L09931k27282L53176R2490J9297K9282J42036P3954P1007O4165
16810F168507q8216O81180q0852L20624K97185l06409N96927J68246l31086L34354
16800G760460J79219K47719O40925m61749M47392q484L65996L73278l9353N88379
16790A0093782J03359K04261L61938K27987M6773N96986Q1921M28566K08047L76610
16780A2730230P54081M47008L15524L40417K67237P02340L03030L08108J106863
16771A7274838K56949O59135N05815N77945R20329L88289Q42543Q75572P86729
$$ y = [4032997, 3769775, 3829479, 4132181, 3977194, 4018641, 4033142, 4570152, 4437161, 4280669, 4353566, 4308114, 4421525, 4575893, 4667141, 4857533, 4987311, 5257133, 5259765, 5306006, 5240451, 5550382, 5323100, 5676276, 5768766, 5788063, 5817345, 5959381, 6033335, 6104342, 6168507, 6080291, 6761471, 6680619, 7001243, 7298428, 6992019, 7588946, 7757192, 7426106, 7760460, 7939679, 8187398, 8828323, 8366574, 8813966, 8805482, 9171478, 9544756, 9505403, 10093782, 10197141, 10401402, 10763340, 10991327, 11038100, 11635086, 11717007, 12145573, 12353620, 12730230, 13484311, 13931319, 14246843, 14587260, 14854497, 15556837, 15859867, 16167975, 17274838, 17531787, 18190922, 18696737, 19274682, 20195011, 20583300, 21425843, 22301415, 23088144]
16762B3088144J147887P55408Q93835R07328J317385Q42997J533072R10164J642172
16753C3038392J255357J846876J703852J828139J451424J816118K312945K326897
16745D7580000K261106K276299K927371K940708L335481L095680L549570M017697
16737G1983912L847867M553637M365342N046323N756938N680946N882127N796567
16729A12913659O676161O722236P159647P191373P078345P700979P137206P017993
16721A69597599O370975N854262M967885M533019K819524K173547R76916o41039
16713A96652688j127282k947037l985777m569898o093345n782193p256307p086743
16705A57804106p400982p188499p165783p519476p088240o592483o567994o214099
$$ y = [23088144, 24236031, 24991439, 25885274, 26792602, 28109987, 28952984, 30486056, 31396220, 33038392, 34293749, 36140625, 37844477, 39672616, 41124040, 42940158, 45253103, 47580000, 49841106, 52117405, 55044776, 57985484, 61320965, 64416645, 67966215, 71983912, 75831779, 80385416, 84750758, 89797081, 95554019, 101234965, 107117092, 112913659, 119589820, 126312056, 133471703, 140663076, 147741421, 155442400, 162579606, 169597599, 175968574, 181822836, 186790721, 191323740, 194143264, 196316811, 197293727, 196652688, 195525406, 192578369, 188592592, 184022694, 177929349, 172147156, 164890849, 157804106, 150403124, 143214625, 136048842, 128529366, 121441126, 114848643, 108280649, 102066550]
16697A02066550n929882n407968n005608m980013m431217m127042m383869l302552
16689F4498399l387853l647392k711508k607064k978111k513529k135278k029128
16681D2488536k090815j850457k067186j646883j411102j069927j532831j558582
16673B9260753j154474j368888p54941j163976o85471j397776o62385j169950
16665B0902892l44045o77555o14162j032273n4279r46959r27060k01051k98320
16656A5807188p47594l42576r24049l0909m32023n35294l98340o01154P0535m19948
16646A1445836l84933j16984l63492k73891n13721l37590o7203j88245j48962
16637I050815k61012j3662p24157K05380l72944K6166m22301K1434k89906j40632
$$ y = [102066550, 96136668, 90728700, 85723092, 80743079, 76311862, 72184820, 67800951, 64498399, 61110546, 57463154, 54751646, 52144582, 49166471, 46652942, 44517664, 42488536, 40397721, 38547264, 36480078, 34833195, 33422093, 32352166, 30819335, 29260753, 28106279, 26737391, 25982450, 24818474, 24133003, 22735227, 22072842, 20902892, 20558847, 19881292, 19267130, 18234857, 18180578, 17233619, 16306559, 16105508, 15807188, 15059594, 14717018, 13792969, 13762060, 13330037, 12794743, 12396403, 11795249, 11865784, 11445836, 11060903, 10943919, 10580427, 10306536, 9792815, 9455225, 9388022, 9199777, 9050815, 8789803, 8776141, 8051984, 8257364, 7884420, 7910586, 7488285, 7509719, 7219813, 7079181]
16627G079181o3067j21746j57077k59430k36181j52688J09432j25805j29351j9330
16617E923938m01086k91496J27227m46616M04217k42007J15302m77486J58551
16608D870544m75142J14714J99457k11840j53677m44073K71712J34515k38120
16599D068090j5981q8054Q5775l92507k26168K12950Q281J5013m63025P3851l3667
16588C244558K8793J68521n79892q8836J66199L326K01015p5452k88575j86060
16578B593597J8509O0894R4128m22332K99324J34827j39421j61800n7859l07930
16568B111937M57627n45000M63288l94381M30392p8221m26246L7809k25125L75385
16558B207465k51290K22508j50378R7768l42539N85843m48966o2127N6879n805
$$ y = [7079181, 7016114, 6894368, 6737291, 6477861, 6241680, 6088992, 6198424, 6072619, 5943268, 5923938, 5522852, 5231356, 5358583, 4911967, 5316184, 5074177, 5189479, 4711993, 4870544, 4395402, 4510116, 4709573, 4497733, 4344056, 3899983, 4171695, 4306210, 4068090, 4052109, 3964055, 4049830, 3657323, 3431155, 3644105, 3652386, 3667399, 3204374, 3278225, 3244558, 3273351, 3441872, 2861980, 2773144, 2939343, 2942669, 3143684, 3068232, 2779657, 2593597, 2612106, 2673000, 2767128, 2344796, 2644120, 2778947, 2639526, 2477726, 2419867, 2111937, 2569564, 2024564, 2487852, 2093471, 2523863, 2445642, 2019396, 2057205, 1832080, 2207465, 1956175, 2178683, 2028305, 2126073, 1783534, 2369377, 1920411, 1858284, 1915163, 1909358]
16548A909358j45212N65698o09880r2784N72964m64236k07779K25951r5419K9046
16538A687707n26858K14489J68394L19812o24674K52052l16720K02671K71447
16529A648320o6065o8040P5186K7055n15701K69980k00528l02601L66436j06892
16519A127150M54981o73035O20544k48279k55571J48701j88196K32537n9049j44185
16509A015598J81491l72382L95935J12327R2111j47934j88781n7314J75887m97109
16499G09829J41062J14001k5740j39561m5699p6270L01223j07970M27298j45838
16489A152335j31401m6100j73453O4151k89742L23067M59174m40529j56854P2042
16479H32690j25640j92657K19973K74893j22442n5374j30859K35176r1074k70896
$$ y = [1909358, 1764146, 2329844, 1719964, 1627180, 2200144, 1735908, 1528129, 1754080, 1658661, 1687707, 1160849, 1375338, 1543732, 1863544, 1238870, 1490922, 1174202, 1376873, 1648320, 1582255, 1514215, 1589401, 1616456, 1100755, 1370735, 1170207, 867606, 1234042, 1127150, 1582131, 909096, 1529640, 1281361, 1025790, 1174491, 986295, 1218832, 1159783, 1015598, 1197089, 824707, 1220642, 1332969, 1425080, 1277146, 1088365, 1031051, 1206938, 709829, 850891, 964892, 939152, 799591, 753892, 677622, 978845, 870875, 1298173, 1152335, 1020934, 974834, 801381, 865532, 575790, 898857, 1358031, 917502, 760648, 832690, 707050, 514393, 734366, 1009259, 886817, 831443, 700584, 935760, 844686, 573790]
16469E73790L05839M572j42703q7747J08386K26842k2636j85967j08818j77094
16459D94464J26871n5333j56971J34924j51225L98141o9446n7771r1903J22620
16449F94371J7404j21015k14461M03165K57298m95497J73505C35365M61864j97407
16439E99822o8312L05152l17019N3198j82152j74456K19439N92571B72455L91062
16429F63517J04998r2841J03651j03919l25401P7402O5234j27150O3498j98068
16419B30921M20392j39417J59256k39987n2898M10461k67315J55612k38816j3236
16409D24973J862K4189n0444c4222B99940D3709K07131K01506Q5182r3854j34177
16398C09497L12015j15810j88844K97474k4785A50207L54597A99244L59631r0147
$$ y = [573790, 879629, 884201, 741498, 653751, 762137, 988979, 966343, 780376, 671558, 494464, 621335, 566002, 409031, 543955, 392730, 790871, 721425, 663654, 571751, 694371, 711775, 590760, 376299, 779464, 1036762, 541265, 714770, 335365, 797229, 599822, 531510, 836662, 519643, 572841, 390689, 216233, 435672, 1028243, 272455, 663517, 768515, 675674, 779325, 675406, 350005, 427407, 492641, 365491, 428989, 230921, 651313, 511896, 671152, 431165, 378267, 788728, 521413, 677025, 438209, 424973, 426835, 451024, 400580, -34222, 299940, 43709, 250840, 452346, 537528, 443674, 309497, 621512, 505702, 316858, 614332, 589547, 150207, 504804, 199244, 558875, 468728]
16388D68728N1579j36570L1364N68661A02710K87297M7593j09464j15174K29984
16378D42946L4452L2337j95007K19214r7928L4962B25328K55754j55355H1692
16367C95823M903M6874J69498r7055q6009k05254K03256j3112A56708B0554K35955
16356B56509N01o6235k3069R8648K46124g313k8516B20793L2933r6534j9859M6873
16344A84206H8082K97456O6742C2746a83344E78711B60709A14953K68741F0668
16333C26808k452b2465A73520p9642L58867c4800C0294L50179N1340A73435o9334
16322A04101k1678k1987J96971A20004K4488K84564j49900J03108a58903A77483
16311A17737A3507K3863M97429H3095P0605c0477i929B57302N4632Q1070C9124
$$ y = [468728, 520307, 383737, 415101, 983762, 102710, 390007, 437600, 328136, 212962, 442946, 477398, 509735, 314728, 533942, 436014, 470976, 225328, 481082, 325727, 81692, 395823, 400726, 447600, 617098, 520043, 434034, 228780, 432036, 418924, 156708, 20554, 256509, 257010, 190775, 167706, 266354, 512478, -7313, -35829, 220793, 253726, 157192, 137333, 184206, 88082, 385538, 452280, 32746, -183344, 578711, 260709, 114953, 383694, 60668, 326808, 324356, -22465, 173520, 93878, 452745, -34800, 30294, 380473, 431813, 173435, 104101, 82423, 60436, 257407, 120004, 144492, 429056, 279156, 382264, -158903, 177483, 117737, 13507, 37370, 534799, 83095, 153700, -30477, -9929, 257302, 311934, 393004, 39124]
16299D81878k05049j32880L4429O0670R235I215K35510M8848I8755K883K00071
16288C01709j06019b3301D60144b6753D07571A7883J74606K75114a9506B12352
16277A27193K72915b05339C13991R158c7357B41925J408j00026a43645A04657
16266d05308B23116a66115A75442J93928H3213J05461M0443p9617L2935a14044
16255B25110C0369i1949o3773H645L62901A63626b22428f750A84161I849b4420
16243C01002J49119h1024E27349E9196K07148j20139R5834B695a50810G8523a28806
16231E3887O5527a8115C04565e2002J183k1045C77834E8604J96072i1399b3188
16219I4601j2323J2209a18032D6890a17909B6028J44008D9728P8334a37568E11065
$$ y = [481878, 276829, 143949, 178378, 239048, 248283, 9215, 244725, 293573, 98755, 101638, 301709, 195690, -23301, 460144, -26753, 407571, 17883, 192489, 467603, -19506, 212352, 127193, 400108, -205339, 313991, 323149, -37357, 241925, 243333, 143307, -143645, 104657, -405308, 223116, -166115, 175442, 369370, 83213, 188674, 229117, 149500, 182435, -114044, 225110, 30369, -91949, -155722, 8645, 371546, 163626, -222428, -6750, 184161, 9849, -24420, 301002, 450121, -81024, 527349, 59196, 266344, 146205, 242039, 2695, -150810, 78523, -128806, 53887, 119414, -18115, 304565, -52002, -50819, -71864, 377834, 58604, 254676, -91399, -23188, 94601, 82278, 94487, -118032, 46890, -117909, 26028, 170036, 49728, 128062, -137568, 511065]
16207A56548g2131A54208K67302g6082r9913C34232m9158D6176M5392N8567O9876
16196B20011a4655A45689O3002E4868i6975L4774A20032n4047a32652C26354A11913
16184B20703b02129J6032A51979c9476k3641C4124J16026o9526R589K28758l4473
16173B84498c17221A61991Q4331j11893a75174H8538M02018a32302k859j2232
16163a47393H3959h0718J8471A18953a37596A64258b5664j50520d1290C76052
16152h6878B16396c8598B30503J33696A60507a78648A13956n4236c2249A317a49336
16140b162C12913a64700F5282b0078H4998n457a43398d7364k2870g136j10332
16129a17468A31707O4572a44605A75904l8094a74181H3216O3759a12813H8768
$$ y = [156548, -72131, 154208, 421510, -76082, -175995, 334232, 285074, 46176, 91568, 150135, 220011, -14655, 145689, 208691, 54868, -96975, -62201, 120032, 65985, -132652, 326354, 111913, 220703, -202129, -186097, 151979, -39476, -63117, 34124, 150150, 80624, 90213, 318971, 284498, -317221, 161991, 246322, 134429, -175174, 88538, 490556, -132302, -135161, -147393, 83959, -80718, -62247, 118953, -137596, 164258, -25664, -176184, -41290, 376052, -86878, 216396, -38598, 230503, 364199, 160507, -178648, 113956, 59720, -32249, 1317, -149336, -2162, 312913, -164700, 65282, -20078, 84998, 79541, -143398, -47364, -70234, -7136, -117468, 131707, 196279, -144605, 175904, 137810, -174181, 83216, 146975, -112813, 88768]
16118D8829J88225E0733e1104C97537O7438A11262R8203J3404q0587k4210d37765
16106b59467H8246a66342k05454C1263L120Q9809D7064b9013j76532A28760J10464
16095B39224L6874J21792e5361A20914a30726e7097G3095b03599a1540r5036J8482
16084h8094b7731n9562B18300c24804d8795A41367a28525e8942C28712a15948
16073c749j14166F575K7721R6924b55120i5431D6725K94900b44612a05277D0931
16061A91333a19639B25551C9524g4090K1398B3393c1929i91G9619L290b20696
16049c5143C54244h1839C70012A22607a4003F4890K1969J7530c14805k0547B38615
16037B98473o9884M9870C4684N8950j714h9717B50776A5316P1539l7449J65816
$$ y = [48829, 237054, 50733, -51104, 397537, 464975, 111262, 209465, 222869, 142282, 118072, -437765, -259467, 88246, -166342, -371796, 31263, 34383, 124192, 47064, -29013, -205545, 128760, 239224, 276098, 397890, -55361, 120914, -130726, -57097, 73095, -203599, -11540, -106576, -88094, -27731, -87293, 218300, -324804, -48795, 141367, -128525, -58942, 328712, -115948, -3749, -117915, 6575, 34296, 131220, -255120, -95431, 46725, 341625, -244612, -105277, 40931, 191333, -119639, 225551, 39524, -74090, -52692, 23393, -31929, -991, 79619, 82909, -220696, -35143, 354244, -81839, 370012, 122607, -14003, 64890, 86859, 104389, -314805, -335352, 238615, 298473, 228589, 278459, 34684, 93634, 91920, -89717, 250776, 15316, 86855, 49406, 215222]
16026B15222b0259A50793E5239b2933p1600A32839a02209N722C84931j77942k6367
16015A80622F1715j7319a43058D3096L3397a97669A73552g1179A45025d57751
16004b91434B29239c68257B29156g9836j06870A1820J06291c90163f109B99256
15993g5667k1697H1672d4525C05345b42055B75560e5404A05808a83328E7451L854
15982F1305M5957J14587J33144A13582i7416c9732A20165a84723E9032c33070
15971A80834o8505c9969F2320J9154b42063I8638c9539j54691E2519b57101g9065
15959B44978j3391F3873Q8590b9160A124J05241e294j83119o2359B9108b548l78448
15947c80996I6022a60439r8247q4622f1303l55591b7787n0503C0936b11019k05046
$$ y = [215222, -20259, 150793, 55239, -22933, -94533, 132839, -102209, -96487, 384931, 206989, 180622, 61715, 44396, -143058, 43096, 76493, -197669, 173552, -71179, 145025, -457751, -291434, 229239, -368257, 229156, -79836, -186706, 11820, 118111, -390163, -6109, 299256, -75667, -97364, 81672, -44525, 305345, -242055, 275560, -55404, 105808, -183328, 57451, 61305, 107262, 221849, 354993, 113582, -97416, -39732, 120165, -184723, 59032, -333070, 180834, 112329, -39969, 62320, 81474, -242063, 98638, -39539, -194230, 52519, -257101, -79065, 244978, 231587, 63873, 152463, -29160, 1124, 106365, -5294, -188413, -250772, 29108, -2548, -380996, 96022, -160439, -258686, -343308, -61303, -416894, -27787, -78290, 30936, -211019, -416065]
15936d16065A10656m8678c6923B83454H0524i8664k6564o9417L3891O4476j80002
15925b76280A3240a6141B3782J24471a67620A53087f18451K25664e6270B7811
15914a35995f925k36002e3759M133o0363e3779C49004e9402C2756a96905f516
15902b0324P412j56285f9602B65976h363k1467j23887G4813a07443l0971B7230
15890F5776b60167b0967R011j80428F8099a73779C52230b00349N778E3944k3547
15879C0397K2969b78615j69290A63085e13667a36581I157b88052k08534p5203
15869e71789D35689A41480c80354e1533C4904L62574A38816F3339L03811A26848
15858b10434e9793b7261G5716B2294b03729J8170d7636b215q1503a8543l251A87396
$$ y = [-416065, 110656, 61978, -36923, 283454, 80524, -98664, -125228, -194645, -160754, -96278, -276280, 13240, -16141, 23782, 148253, -167620, 153087, -618451, -392787, -56270, 27811, -135995, -6925, -242927, -53759, -49626, -109989, -53779, 349004, -59402, 32756, -196905, -6516, -20324, -12912, -169197, -69602, 265976, -8363, -29830, -153717, 74813, -107443, -138414, 27230, 65776, -260167, -20967, -11956, -192384, 68099, -173779, 352230, -200349, -194571, 53944, 30397, 53366, -278615, -447905, 163085, -513667, -136581, 9157, -288052, -496586, -571789, 435689, 141480, -380354, -51533, 34904, 397478, 138816, 63339, 367150, 126848, -210434, -59793, -27261, 75716, 22294, -203729, -185559, -47636, -2215, -83718, -18543, -21794, 187396]
15845a42954B53756d26347h5147o3976k88253a62230A51838E6277J03362D4625
15834b16912f4241j12840A48453a33882F6573a27424A76697d13784C3401L05130
15824C38531D5021J7309i5403P399L9431C3687J21252D5961c88912B6498a99081
15812a25074L9652A05924a23233E39156A32327f3482A8982J81211f8936A04340
15801A62189F2178a19738B49875j24087a953D0230M832a43735A99324b03713A38278
15789D01571b51443A55538a0557k4856p7437B050c32043H573M50900G1508j0852
15778F0656q63c84553G493a41407D9207J0738K29134A17745N6228B7925K20863
15767B48788b08983O1018A68988B3552K18939l0563C3790J09889E7256J83536
$$ y = [-142954, 253756, -426347, -85147, -149123, -437376, -162230, 151838, 56277, 159639, 44625, -216912, -64241, -177081, 148453, -133882, 66573, -127424, 176697, -413784, 33401, 338531, 45021, 62330, -95403, -88004, -48573, 33687, 154939, 45961, -388912, 26498, -199081, -125074, -85422, 105924, -123233, 539156, 132327, -63482, 18982, 200193, -68936, 104340, 162189, 62178, -119738, 249875, 125788, -1953, 40230, 45062, -143735, 199324, -203713, 138278, 401571, -251443, 155538, -10557, -35413, -112850, 2050, -332043, 8573, 459473, 71508, 60656, 59793, -384553, 7493, -141407, 49207, 59945, 289079, 117745, 173973, 27925, 248788, -208983, -147965, 168988, 23552, 242491, 211928, 33790, 143679, 57256, 240792]
15757B40792A8878e2970B71749E1208b72715B14975g9414A41969K5630D7675b90127
15745c45100a62425B19323J6649P8157c7973O778A46254b26552j11191d0528k01373
15734b41901i7751A78336b05935G1793P7896p0718h6832G1038b17357A6547a99844
15722a79336A92643E8383f9309b7012G0092e0783l29588o5244F1409P8525f1633
15710A14240e16693K37813A6959a39593c8590p6728I9026B8985c99784J19241
15700b80543B7837J39963D0621a13955a0278j10966A20538h433n9511B8991b53325
15688b80945j23741a06908b2335l11519a24445j44435O1724F5899C2040d0840
15677B49637a53069r4605A28237a82311B63170a71303D7201a32633A67097L5214
$$ y = [240792, 18878, -52970, 271749, 51208, -272715, 214975, -79414, 141969, 167599, 47675, -290127, -345100, -162425, 219323, 235972, 314129, -37973, -31195, 146254, -226552, -337743, -40528, -241901, -97751, 178336, -205935, 71793, 149689, 78971, -86832, 71038, -217357, 16547, -199844, -179336, 192643, 58383, -69309, -27012, 70092, -50783, -380371, -445615, 61409, 139934, -61633, 114240, -516693, -278880, 16959, -139593, -38590, -115318, 99026, 28985, -399784, -280543, 27837, 167800, 40621, -113955, -10278, -121244, 120538, -8433, -67944, 28991, -253325, -280945, -404686, -106908, -22335, -333854, -124445, -268880, -207156, 65899, 32040, -40840, 249637, -153069, -247674, 128237, -182311, 263170, -171303, 47201, -132633, 167097, 202311]
15667B02311f6359C70392b48789e5235l945a0463p2434F6779a69779q0822g0080
15655C0834K5337R1936B9281K87035c57397a74003e2473K2842C6636M1738a51903
15643A031P7014K2707f0837D726R0818a06226F6677k6441b16133F0957c41629
15631h0202D3016a07602A6681K1437a00735k5620G2029h2760A8413J08193c66368
15619d5176j40239e9836D9950c27485f8081H2144B3321N8394h345j12153j74744
15608b95242b5961j77111J0820a6610j03249l92667f8757b9706A50152A5385R8980
15597A14365P6161b8155k38675I0587f9785g922A16543D5932d1017k37947A07635
15585A55170C5620M446j6018K68362a64337A01301c2536G8853h5776B75801B5051
$$ y = [202311, -66359, 370392, -248789, -55235, -59180, -10463, -82897, 66779, -169779, -250601, -70080, 30834, 56171, 148107, 29281, 316316, -357397, -174003, -52473, -29631, 36636, 78374, -151903, 1031, 78045, 100752, -60837, 4726, 95544, -106226, 66677, 40236, -216133, 60957, -341629, -80202, 43016, -107602, 16681, 38118, -100735, -126355, 72029, -82760, 18413, 126606, -366368, -45176, -185415, -59836, 49950, -327485, -68081, 82144, 23321, 81715, -8345, -120498, -295242, -25961, -203072, -192252, -16610, -119859, -512526, -68757, -29706, 150152, 15385, 114365, 190526, -28155, -266830, 90587, -69785, -7922, 116543, 45932, -41017, -278964, 107635, 155170, 35620, 40066, 24048, 292410, -164337, 101301, -32536, 78853, -85776, 275801, 25051]
15573c11287d0977n4339A43440g0490p3726A61718b8101j1491A37012b422A77281
15561b97854B19674D3780a50765B07957e0626i151H8335J1124b29801A75087c1790
15549i306k30376M0648B35054A6227a24050M3935j56571C8048d883p0179j21524
15538a96586C76934j70839b2484H4224b2758C1350M86960b41088J02366D2880
15527A35594Q0902J38067j15187G586a08558D16624c70641I9580h540l54772a25156
15515E1351J1318c3765B6822J06745A7556J5146c70964a75329A12833K18800d1714
15503d89711a39528A2979a39455A96353a08009A61463m2568p277a80834P3840
15493a06994c4996k39832Q5093F5793c20I3566b04521B48201e4408l18417a0602
$$ y = [-311287, -40977, -95316, 143440, -70490, -144216, 161718, -28101, -39592, 137012, -2422, 177281, -297854, 219674, 43780, -150765, 207957, -50626, -9151, 88335, 99459, -229801, 175087, -31790, -9306, -239682, -199034, 235054, 16227, -124050, -80115, -236686, 38048, -4883, -75062, -196586, 376934, 206095, -22484, 84224, -22758, 31350, 518310, -241088, -138722, 42880, 135594, 216496, 354563, 239376, 7586, -108558, 416624, -370641, 99580, -8540, -363312, -125156, 51351, 62669, -33765, 26822, 133567, 17556, 32702, -370964, -175329, 112833, 331633, -41714, -489711, -139528, 12979, -139455, 196353, -108009, 161463, 118895, 111618, -180834, -106994, -34996, -274828, -189735, 65793, -320, 93566, -204521, 248201, -54408, -372825, -10602]
15481f0594k29793d1147D2213L1743e6706C07383C0809O3179Q605a75277l6438
15470b11715R9314C97848b25584b3732k54411G0260a69611n8243j44241A3866
15459b893B30900p1985i0074j0417c2906C17738C5742P2979N0656b87066A56355
15447d02170a56689E0288a36629d1155k03467Q9909a7762A29669c7554j07398
15437a44952d3955a4184E08904A99564r6789c3634k48506f5411A7741J23635a4158
15425a93120g1106C28869H4992k3868J23606l4292J04178i5364C1673K35895a17737
15413a34847n4371j44981A21924a94094A22052K20898a29481A16038C5064M9260
15403H4324a35024F0161b84225A39873k363a57796n4630R0164A86769i5883E1544
$$ y = [-60594, -290387, -41147, 42213, 73956, -56706, 307383, 30809, 93988, 102593, -175277, -211715, -112401, 397848, -225584, -23732, -278143, 70260, -169611, -227854, -372095, 13866, -2893, 230900, 158915, -90074, -100491, -32906, 317738, 35742, 108721, 159377, -287066, 156355, -402170, -156689, 50288, -136629, -41155, -244622, -154713, -17762, 129669, -37554, -144952, -43955, -14184, 508904, 199564, 102775, -33634, -282140, -65411, 17741, 141376, -14158, -193120, -71106, 328869, 84992, 61124, 184730, 150438, 254616, -95364, 31673, 267568, -117737, -134847, -189218, -334199, 121924, -194094, 122052, 342950, -129481, 116038, 35064, 84324, -135024, 60161, -284225, 139873, 137510, -157796, -212426, -122262, 186769, -95883, 51544]
15391A08902i5216o0844B9058P4682c85794A48906E0620a12014G2766a87035k7546
15380b14581O1299k35840a26388R179d9452D3407a24639B40129k4869a64887F720
15368f8909b4296H4040a68113f2317B81597c6654p2839E7875b64036f4904j04363
15357a69267h1119A15502d06785h3741A38085a28570N3402B54050e9114B47005
15346F7159J41276q8878J37155b56136C05234A23228O5369o7743J3736C0483b7709
15334F3399J7363i0204A31758b61671G6057q777K0048N27114A59164I292J80019
15323A89311a37585A31982f0522A66585o7811l4438h1840B9063d0385j16653N6799
15312a00239C20099q8811c45164A71501b27759e7561N250n7539B08565B7854d9295
$$ y = [108902, -95216, -156060, 29058, 103740, -385794, 148906, 50620, -112014, 72766, -187035, -214581, -153282, -389122, -126388, -117209, -49452, 43407, -124639, 240129, 215260, -164887, 6720, -68909, -24296, 84040, -168113, -62317, 281597, -36654, -109493, 57875, -264036, -64904, -169267, -81119, 115502, -406785, -83741, 138085, -128570, -75168, 254050, -59114, 247005, 67159, 208435, 119557, 256712, -256136, 305234, 123228, 188597, 120854, 134590, 30483, -27709, 63399, 80762, -90204, 131758, -261671, 76057, 67280, 87328, 614442, 159164, 9292, 189311, -137585, 131982, -60522, 166585, 98774, 64336, -81840, 29063, -40385, -157038, -100239, 320099, 231288, -345164, 171501, -227759, -57561, -52311, -109850, 208565, 27854, -49295]
15300A90477G4758O1557Q0094b25233R900A52558b02839A89608l0367b5191A6230
15288D2174e2867D61712E9200B5423N10872g403n786D697K39631j22025n7484
15277F4819l1836K31213a47653k7598A14293D7124c16562a56520I7488C2424J53919
15266A86343q1100a48253M0496B26995A07686a34577A76923J10762h0102l75351
15256d55453I1764L33835k06442J6800L34282G6724L70458K44114Q71791l95280
15246A167807L5074j1083n69074A42520k0758a72180C7577i1989J0027B18984
15235A31120e201j09996A24611n1756L376a43793B16533a40472a6165C70194b1473
15223B41192J64743c00124F0615a06880k3756H5698a53963B75258A00724K9605
$$ y = [190477, 74758, 136315, 216409, -225233, -215333, 152558, -202839, 189608, 159241, -25191, 16230, 42174, -52867, 461712, 59200, 25423, 536295, -7403, -13189, 4697, 244328, 122303, 64819, 32983, 264196, -147653, -175251, 114293, 47124, -316562, -156520, 97488, 32424, 186343, 105243, -148253, -107757, 226995, 107686, -134577, 176923, 287685, -80102, -455453, 91764, 425599, 219157, 235957, 570239, 76724, 447182, 691296, 1563087, 1167807, 1202881, 1191798, 622724, 142520, 121762, -172180, 37577, -91989, -81962, 218984, 131120, -5201, -115197, 124611, 72855, 76231, -143793, 216533, -140472, -16165, 370194, -21473, 241192, 405935, -300124, 60615, -106880, -130636, 85698, -153963, 275258, 100724, 130329]
15213A30329e1235a4918C8414J61701G8387J6183k3825K0730a07454A0529J63329
15202A73858G7892e6345J6107B75316b20183f2025A30933e4748k4746F3892J83835
15191B47727A07616o600J30116A2455K52722A03156A4311C005b29881b7352C0126
15179b33410J09669C1735J5571a79810B06662H449K24203Q598D9176P3694n5379
15168F7491Q1432J73436A24562C7324R0326K84991a95158r6073A96331a65199
15157A55786A3129J8361L43527Q984a1556B20535l0619K8833J28361B4379a20332
15145c6490A37368M03531a5699B13667k7177J55594j10707E6441c3249M687I951
15133g6390B73218j21190N6616m5836F8029a19233H4216L63989d3510C5913K88889
$$ y = [130329, -51235, -14918, 38414, 200115, 78387, 94570, 70745, 91475, -107454, 10529, 173858, 77892, -56345, -40238, 275316, -220183, -62025, 130933, -54748, -79494, 63892, 247727, 107616, 101016, 231132, 12455, 265177, 103156, 14311, 3005, -229881, -27352, 30126, -233410, -123741, 31735, 47306, -179810, 206662, 8449, 232652, 241250, 49176, 122870, 67491, 148923, 322359, 124562, 37324, 127650, 412641, -195158, -291231, 196331, -165199, 155786, 13129, 31490, 375017, 384001, -11556, 220535, 189916, 218749, 347110, 24379, -120332, -36490, 137368, 540899, -15699, 213667, 186490, 342084, 231377, 56441, -33249, -28562, 9951, -76390, 273218, 152028, 208644, 162808, 68029, -119233, 84216, 448205, -43510, 35913, 324802]
15122C24802j03934b65251A39910c14975C70873O8816o8525A16785a5755j88587
15112b04342A24043J71635p3520J25728C3727a43353D28788c02567C32450r0839
15102B41611F8182A9129f2035j0076f481B49721J5270R2159a1843m5695b8215
15090B81285q2366J84664H0553k0684L05397B4315K11538N9026P1939o7481b62393
15078B61713r5656J8044a17388G1973J39804B3543K82019Q3580a07638B9822J65601
15067A95423a22027C79365A23720L5103B4689K54296b8305A89798n7422f6395
15056A68380J37177a03223I9594m1945i3805B32234l3374J58600j62588R4785
15046B89657j34480m0457J97008j25781Q8247I7710e6453E4799K752L61499A08635
$$ y = [324802, 220868, -265251, 139910, -314975, 370873, 439689, 371164, 116785, -15755, -204342, 124043, 295678, 222158, 347886, 33727, -143353, 428788, -302567, 332450, 241611, 68182, 19129, -62035, -72111, -6481, 249721, 264991, 357150, -11843, -57538, -28215, 281285, 198919, 383583, 80553, 59869, 365266, 24315, 235853, 294879, 366818, 299337, -262393, 261713, 166057, 184101, -117388, 71973, 211777, 23543, 305562, 389142, -107638, 29822, 195423, -122027, 379365, 123720, 158823, 24689, 278985, -28305, 189798, 132376, -66395, 168380, 305557, -103223, 99594, 57649, -93805, 232234, 198860, 357460, 194872, 289657, 155177, 114720, 311728, 185947, 274194, 97710, -56453, 54799, 57551, 419050, 108635]
15034F1712i6583C6838J20899J65225k6977A27342b13923A76266J29963q7611
15024B18618p609c78696D81913A76326K34055k9992j3123j76068L79578k29308
15014C41468p0486J36883i7148b3739A03763N8353C1583J44532M49476l08955
15004C16636a05541A71257L631h0771B44998e4188A00539J15996J12562e6566
14993A97397a41191B09473J43214A13040a64891P9280C97316p7792K9267j14024
14983B34767k4425b51587g9464C8793K73709H3224L64452k13112K81416B17378
14972A03241J47421L1190r9425P1302A2007J14280J07849K73216A40379M84115
14962F24494k30642o9739O5246A17360d8017B77877M7280A437c9418a3573A95799
$$ y = [61712, -96583, 36838, 157737, 322962, 295985, 127342, -213923, 176266, 306229, 218618, 211009, -378696, 481913, 176326, 410381, 380389, 367266, 191198, 570776, 341468, 270982, 407865, -97148, -23739, 103763, 162116, 31583, 176115, 625591, 316636, -105541, 171257, 174888, -80771, 244998, -54188, 100539, 216535, 329097, -56566, 197397, -141191, 209473, 352687, 113040, -164891, -85611, 397316, 319524, 348791, 234767, 210342, -251587, -79464, 38793, 312502, 83224, 447676, 234564, 515980, 217378, 103241, 250662, 281852, 182427, 253729, 12007, 126287, 234136, 507352, 140379, 624494, 393852, 324113, 389359, 117360, -48017, 277877, 325157, 1437, -39418, -13573, 195799]
14950B70274J77307L4048o7241A46127K90973p6970j55402M04490A59652P9859
14940B39511L48462B85288K5565R9536P9078G0569O5994a8054A30245K70396j40573
14929B60068J18749k3144m7810A31587J49496I0973L57362j47788j9615K48520
14919E29452I4291J06421J80678m5682m7719p5242O0073c61238C78164A13515
14908C29257K601R6241I6820K87421A25677J69883E2550K74818J3623J35606B5031
14896G9978M36172m6258n1940L2190A66126M03206A83159Q6402J23990Q4411A35866
14884H0061K65581M20184l50475k03935G1008J59266K35062A18014j8087j9086
14874H0841J33594N5204K81483B42475K55488k06595L21083j85911R310M0207
$$ y = [270274, 447581, 481629, 414388, 146127, 437100, 360130, 204728, 609218, 159652, 239511, 587973, 285288, 310853, 410389, 489467, 70569, 136563, -18054, 130245, 400641, 260068, 378817, 355673, 307863, 131587, 281083, 90973, 448335, 300547, 280932, 529452, 94291, 200712, 381390, 335708, 287989, 212747, 272820, -361238, 378164, 113515, 329257, 331858, 428099, 96820, 384241, 125677, 295560, 52550, 327368, 340991, 476597, 25031, 79978, 516150, 469892, 417952, 450142, 166126, 569332, 183159, 269561, 393551, 477962, 135866, 80061, 345642, 765826, 415351, 211416, 71008, 230274, 465336, 118014, 99927, 80841, 214435, 269639, 551122, 242475, 497963, 291368, 612451, 426540, 435850, 476057]
14864D76057j60273A55647L68304A48814m3064Q0334l7025M16294k67964P6933
14854C74322J39698o0243M7342J67420j31437o1159L86935C64516K50643B4779
14843I74600A38370L74906j77536O8671O2717K06821B87299P4077o797J3282J5769
14832C83630q1609M00577B52662E9308L25836n1239M40476k99818n8354l6307
14822C79902J1690j79182J71584J94263R5443k08827J55002M2077k25415J66994
14812F03531B39942L80552L8427j56085J42247q5946o4921l824k28927Q0571r3520
14801B48516O7955Q6683r88J85563o9548L2466R2492A20502L88322P9900P4039
14790F62763j23395B08665L57554j94462K41591k3151k41874Q2237o3667K59018
$$ y = [476057, 315784, 155647, 523951, 148814, 105750, 186084, 149059, 565353, 297389, 374322, 514020, 453777, 501119, 668539, 537102, 475943, 862878, 364516, 615159, 24779, 974600, 138370, 513276, 335740, 404411, 467128, 673949, 287299, 361376, 354579, 367861, 383630, 302021, 702598, 252662, 59308, 385144, 333905, 774381, 474563, 416209, 379902, 391592, 212410, 383994, 578257, 673700, 464873, 619875, 661952, 436537, 603531, 239942, 620494, 658921, 502836, 645083, 559137, 494216, 490392, 261465, 342036, 248516, 316471, 403154, 402166, 587729, 518181, 550647, 643139, 120502, 508824, 588724, 662763, 539368, 208665, 566219, 371757, 613348, 590197, 348323, 430560, 366893, 625911]
14780F25911j03675J33662J48186L5275l29743O8490J08964j62694n6320J92672
14770F60728m644q1494m011J17952L5793K19702C33531N37624l41945j8568j77594
14759C33048J87750L20316j35262j78821K50220k20464q850M11683k69091K1640
14749G12169j76721m0369J11956L25580j67478O1330n3299k11100o4989J65751
14739F62830j2100L08908k62006o6459J00328j9545K18369m8723C09285L43430
14729F52715J94159j88499J70778p6712R0787o5694J98849j60087k62538M06819
14719I60577j44814j27507j51322q835M42033P943j35796k74896K58534k84014
14709E41903N64051R1356k30684j73923k00109K93803k66056K62552j04880J28710
$$ y = [625911, 522236, 655898, 804084, 839359, 509616, 578106, 687070, 524376, 468056, 660728, 656084, 574590, 570579, 688531, 724324, 944026, 333531, 871155, 529210, 510642, 333048, 520798, 841114, 705852, 527031, 777251, 556787, 547937, 959620, 690529, 712169, 535448, 495079, 607035, 932615, 765137, 826467, 773168, 562068, 497079, 662830, 650730, 959638, 697632, 631173, 731501, 711956, 930325, 881602, 309285, 652715, 846874, 658375, 829153, 752441, 843228, 777534, 976383, 816296, 553758, 960577, 815763, 688256, 536934, 528099, 970132, 978075, 842279, 567383, 825917, 541903, 1105954, 1197310, 966626, 792703, 592594, 886397, 620341, 882893, 778013, 906723]
14699I06723J60036p8214O0716J39950j42926m98140N37293L0366j00059j57249
14689H58496K86873k38467K53851k83431K11263j35182k70426L33705r6805J12426
14679A032303k25709K22455L49076n75768N69865m05760K86513k62991J67669
14670A157653k19093Q6275K72940j81873j06186J16788m3421k19132K67304J98284
14660A329539n75705M26264N4822j41334m3523J11205r9338R8131k38506K73438
14650A194993L19848n85626K46384j55921J9633K52674J29229n16356L58638l21234
14640I42262L10879L243K20983j69679j59667J30779L2270m8680j22102L68343
14630A508631r3412k39529L4070J64621p4161m2919N9799N5087j79980M62388
$$ y = [906723, 1066759, 988545, 1049261, 1189211, 1046285, 548145, 1085438, 1115804, 1015745, 858496, 1145369, 906902, 1160753, 877322, 1088585, 953403, 682977, 1016682, 919877, 1032303, 806594, 1029049, 1378125, 802357, 1372222, 966462, 1252975, 989984, 1157653, 938560, 1024835, 1297775, 1115902, 1009716, 1126504, 1083083, 863951, 1131255, 1329539, 753834, 1180098, 1234920, 1093586, 1050063, 1161268, 1061930, 1160061, 921555, 1194993, 1514841, 929215, 1175599, 1019678, 1039311, 1291985, 1421214, 904858, 1263496, 942262, 1253141, 1256384, 1477367, 1307688, 1148021, 1278800, 1311070, 1262390, 1140288, 1508631, 1415219, 1175690, 1209760, 1374381, 1300220, 1257301, 1317100, 1372187, 1192207, 1654595]
14620A654595l10479L43403o2407k61112J1065K0911j31443l6606L36889O5858
14610A630674J06966r067l73333L84985l19494J66319J5027L49408q1049n70458
14600A299978M09861k5812O8177P3578j33383N6688k18166M19117j75934K5900
14590A800004O5963R0307j01561r2116J82220k04461L92241n86480N13297M6304
14580B105718Q031o48143Q38812l28393k99138N66633k19442p8222M20254l23030
14570B043080K64048J18196N8708j50810J96881J22876o04407M26591j08256J41374
14560B508281J49645K00450P224J38956k08007N10659K50720J95767N60075L24805
14550D638575M51563K051401L359806Q061463J5027605J3015112j4406636A3587047
$$ y = [1654595, 1344116, 1687519, 1625112, 1364000, 1375065, 1395976, 1264533, 1227927, 1564816, 1630674, 1737640, 1728573, 1355240, 1740225, 1420731, 1587050, 1602077, 1951485, 1870436, 1299978, 1709839, 1684027, 1752204, 1825782, 1692399, 1749087, 1530921, 1950038, 1774104, 1800004, 1865967, 1956274, 1854713, 1762597, 1944817, 1740356, 2132597, 1546117, 2059414, 2105718, 2113749, 1465606, 2304418, 1976025, 1676887, 2243520, 2024078, 1945856, 2366110, 2043080, 2307128, 2425324, 2484032, 2333222, 2530103, 2652979, 2048572, 2475163, 2366907, 2508281, 2657926, 2858376, 2865600, 3004556, 2796549, 3307208, 3557928, 3753695, 4313770, 4638575, 5090138, 7141539, 10501345, 18562808, 33590413, 46605525, 32198889, 13587047]
14541F406539k451960j309415r58l02664j50990M9094l20422J00954k4812o9295
14531A926071K4206J73668K61858l10582J15279j45625K38457O6424J41918k07781
14521B283893M97206m93492M41805K04632m09234j39914M91464l60251Q39603
14512C355712j83389l42622m5442K56748l19527L34551k04765J91085M43216m38257
14502C047310O9623J3148Q0048j10637L89927k61970J39221O4311j76950L05496
14492C559527J46757L1197j38266q2062J74253K56367k06414J87613k09260O37
14482C720349M14843j26218o0860R2143J84505R8356k60131K40414l34697P0175
14472D038879M09942J9136Q5184l11190O55230k07868m38889M27108K8135L42702
$$ y = [6406539, 3954579, 2645164, 2644206, 2341542, 2190552, 2239646, 1919224, 2020178, 1995366, 1926071, 1950277, 2123945, 2385803, 2075221, 2190500, 2044875, 2283332, 2349756, 2491674, 2283893, 2781099, 2287607, 2729412, 2934044, 2524810, 2384896, 2876360, 2516109, 3355712, 3172323, 2829701, 2784259, 3041007, 2721480, 3056031, 2851266, 3042351, 3485567, 3047310, 3116933, 3130081, 3210129, 3099492, 3489419, 3227449, 3366670, 3430981, 3254031, 3559527, 3706284, 3737481, 3599215, 3517153, 3691406, 3947773, 3741359, 3928972, 3719712, 3720349, 4135192, 4008974, 3948114, 4040257, 4224762, 4323118, 4062987, 4303401, 3968704, 4038879, 4448821, 4467957, 4553141, 4241951, 4897181, 4689313, 4250424, 4677532, 4705667, 5048369]
14462E048369l70315K87820m2208l20668O06843m48090M96173O5383M8862j9922
14452E352247O7797q396K25731J96183j46998J30754k4035l0985P6335K01639
14442F040272k1356K80529Q7291J46133j75272K34337J89676k15593K65425N6282
14432F887724k21719M62718M3024j8770N45634J12846k50029J99379k17806N60265
14422H103266K8286l6582L50596l47369K49501M24006l0687K20712J88307k43891
14412H906145j3402O92340K37530k66960M33417j89651L32418Q4458K93618l26785
14402A0183128K68379M87939J3565L28426K45504l12827M47060K14034j31043
14393A1744165P12119k83045M37308J63077J34402L92061J13994M35304J62441
$$ y = [5048369, 4678054, 4965874, 4923666, 4602998, 5209841, 4761751, 5257924, 5323307, 5372169, 5352247, 5420044, 5411648, 5637379, 5833562, 5686564, 5817318, 5793283, 5762298, 5838633, 6040272, 6018916, 6299445, 6386736, 6532869, 6357597, 6591934, 6781610, 6566017, 6831442, 6887724, 6666005, 7128723, 7171747, 7152977, 7698611, 7811457, 7561428, 7760807, 7543001, 8103266, 8131552, 8094970, 8445566, 8098197, 8347698, 8771704, 8741017, 8961729, 9150036, 8906145, 8892743, 9585083, 9822613, 9555653, 9989070, 9799419, 10131837, 10216295, 10509913, 10183128, 10451507, 10939446, 10953011, 11281437, 11526941, 11214114, 11661174, 11875208, 11744165, 12456284, 12173239, 12610547, 12773624, 12908026, 13300087, 13414081, 13849385, 14011826]
14384A4011826J39766N07108L83005k3015K62434K85595L04853M95401K74323
14375A6641296K26240N8572N88656N1582L44308N11679K18179K59063O44846M05973
14365A9950394J34728L87435O33963N64028M02677M87432M57988Q96302j26214
14356B3788733J043093L93071O86518M92048M42121Q14431O25121R54822O67294
14347B9907252l9636R20391Q45134J030527J145376N08453Q66197J122434J165568
14338C7471696O58168J608777P12923J522927J083651J098977J577309J229425
14330D6963853J579693J228845J813185J535077J607356J769150J879388J815625
14322F0192172J896178K565263J935154K494785K206724K855535K844019K881218
$$ y = [14011826, 14151592, 14658700, 15041705, 15018690, 15281124, 15566719, 15871572, 16366973, 16641296, 16867536, 16926108, 17514764, 17566346, 17910654, 18422333, 18640512, 18899575, 19544421, 19950394, 20085122, 20472557, 21106520, 21670548, 22073225, 22560657, 23018645, 23914947, 23788733, 24831826, 25224897, 25911415, 26403463, 26845584, 27660015, 28285136, 29239958, 29907252, 29867616, 30788007, 31633141, 32663668, 33809044, 34317497, 35183694, 36306128, 37471696, 38129864, 39738641, 40451564, 41974491, 43058142, 44157119, 45734428, 46963853, 48543546, 49772391, 51585576, 53120653, 54728009, 56497159, 58376547, 60192172, 62088350, 64653613, 66588767, 69083552, 71290276, 74145811, 76989830, 79871048]
14314G9871048L014454L225857L019083L961302L644596L714380M324221M603025
14306A09377966M352963N184436N145510N795433N730267O278389O628307P043818
14298A55537089P150878P848487Q476249Q681100R465081R610412J0477064J1137344
14290B28383704J1728310J1949999J2608566J3291693J3813005J4631497J4724078
14283C21130852J4822411J5318470J5330019J5363107J4928170J4520371J3769115
14276D25182515J2955331J1392500J0219321P559504L819567j74468k881308J346875
14268D69419837J436911l221893m138097o732789q799888r869167j1734840j2950711
14260D13409363j4401354j5331518j5549225j5831268j5740978j4483460j5148572
$$ y = [79871048, 82885502, 86111359, 89130442, 93091744, 96736340, 100450720, 104774941, 109377966, 113730929, 118915365, 124060875, 129856308, 135586575, 141864964, 148493271, 155537089, 162687967, 170536454, 179012703, 187693803, 197158884, 206769296, 217246360, 228383704, 240112014, 252062013, 264670579, 277962272, 291775277, 306406774, 321130852, 335953263, 351271733, 366601752, 381964859, 396893029, 411413400, 425182515, 438137846, 449530346, 459749667, 467309171, 471128738, 470954270, 468072962, 469419837, 470856748, 467634855, 463496758, 456763969, 447964081, 438094914, 426360074, 413409363, 399008009, 383676491, 368127266, 352295998, 336555020, 322071560, 306922988]
14253C06922988j4629315j4233887j3488153j2667949j2338018j1632237j0901257
14246B17032172j0501686j0322112q459975r128471q325203p748701p773208o759886
14238A48012930o544269n734852o284469n293061n549379m866833m708025m310455
14230A04721587l726560m282220l571210l685689l464099l481069k894780k748083
14222G6867877k949069k541003k414404k078870k477796k065799k092094j918038
14214E8330804j365137j669701j493634k239298j617625j470555j394137o65826
14206D6414891r64279j658467j356713j166958q88739j611480l38337n50332j829140
14197C6050446r60301r24378r05969m54154p43301q75260j025317n42146o38979
$$ y = [306922988, 292293673, 278059786, 264571633, 251903684, 239565666, 227933429, 217032172, 206530486, 196208374, 187748399, 178619928, 170294725, 162546024, 154772816, 148012930, 141468661, 135733809, 129449340, 124156279, 118606900, 113740067, 109032042, 104721587, 100995027, 96712807, 93141597, 89455908, 85991809, 82510740, 79615960, 76867877, 73918808, 71377805, 68963401, 66884531, 64406735, 62340936, 60248842, 58330804, 56965667, 55295966, 53802332, 51563034, 49945409, 48474854, 47080717, 46414891, 45450612, 43792145, 42435432, 41268474, 40379735, 38768255, 38429918, 37879586, 36050446, 35090145, 34165767, 33259798, 32805644, 32062343, 31187083, 30161766, 29619620, 28980641]
14188B8980641j005421j56482p05724p03522k94786j180362n27284n15522m98498
14179B3393040k16741m65001n11342o39138k65206p88169k39201m48303m15966
14170A9403973m76381J6773m05326l90854o82493j66625K1775n50362k82576k24814
14160A6263090l85019N0931p17300k10964o1497m58187O1548m72254m08137j59298
14150A3502913j70388l7592m41714k71339O2667j55710j38999k02259o21328k11493
14140A1314758J18700k46048N4674l97772n13116J26011N7186l13375k5308j72265
14130A0003445k58156J66713k12306k95411J60461l22869j36965l13648L55057
14121I146321j32079j94988m45928N1320m06194k70351O01058n49767J6628n1907
$$ y = [28980641, 27975220, 27818738, 27113014, 26409492, 26114706, 24934344, 24407060, 23891538, 23393040, 23176299, 22711298, 22199956, 21560818, 21295612, 20507443, 20268242, 19819939, 19403973, 18927592, 18944365, 18539039, 18148185, 17465692, 17299067, 17320842, 16770480, 16487904, 16263090, 15878071, 15929002, 15211702, 15000738, 14939241, 14481054, 14542602, 14070348, 13662211, 13502913, 13332525, 13294933, 12853219, 12581880, 12644547, 12488837, 12349838, 12147579, 11526251, 11314758, 11433458, 11187410, 11242084, 10844312, 10331196, 10457207, 10514393, 10201018, 10175710, 10003445, 9745289, 9912002, 9699696, 9404285, 9564746, 9241877, 9104912, 8791264, 9146321, 9014242, 8819254, 8373326, 8424646, 8018452, 7748101, 8349159, 7799392, 7816020, 7764113]
14111G764113r0698k1556L2887l36358j25153j94805Q9962j78400K22600j71804
14101F990788l60529J60506j62135J8410l97919O8754l8699K2360j41684j8531
14091F141321R47N7078k3621l07676J8096p1335j83955k98557L52504k06844j83167
14080E294791m4088Q6396k95000M1897m7682l0601P1425L5590j73664j21348K90273
14069E107989l95192q4633K67008Q1826m78194J25314K48401j55640n41890K60178
14059D435167L12479j52413L0039m33015j97550L17325j83887K73396k66479k41164
14049C893898K39337l34717K00588j70293J70287l87603N80731l79295l11520
14040C501413J2991R6875j38743M0360L1576j19344J90913q4650n3487J35046
$$ y = [7764113, 7673415, 7651859, 7684746, 7348388, 7223235, 7028430, 7118392, 6939992, 7162592, 6990788, 6630259, 6790765, 6628630, 6647040, 6249121, 6317875, 6279176, 6301536, 6159852, 6141321, 6142268, 6199346, 6175725, 5868049, 5886145, 5814810, 5630855, 5332298, 5684802, 5477958, 5294791, 5250703, 5337099, 5042099, 5083996, 5036314, 5005713, 5077138, 5112728, 4939064, 4817716, 5107989, 4712797, 4628164, 4895172, 4976998, 4498804, 4624118, 4872519, 4716879, 4174989, 4435167, 4747646, 4595233, 4625272, 4192257, 3994707, 4312032, 4128145, 4401541, 4135062, 3893898, 4133235, 3798518, 3999106, 3828813, 3999100, 3611497, 4192228, 3812933, 3501413, 3514404, 3611279, 3472536, 3512896, 3544472, 3425128, 3616041, 3531391, 3477904, 3612950]
14030C612950l27770Q4949L9181K44385o71835J95427j67042k11597K40338N3496
14020C092482l80578R7830l6452L62683p7331k45301J16816r2721j38683l2915
14010B665830N5539K36349k00583J05261l29290J4062R6500j50661J90870n48750
14000B135127O25306j76564k92190j0251j19031J71838l03085N9872k33780M00340
13990B257582N79819K48904K444305O578165J3849983J6881731o135714j7573489
13982A9131286p939430l802741j573061r65863n34829p99874K23517n24512L0751
13973C245244j35230p966J85903p23904Q8231P2461j86325j70507P3658K40300
13963B681865k49245l20631M40317P645k40449K01081m93047M26806n3506M9289
$$ y = [3612950, 3285180, 3370129, 3409310, 3653695, 2981860, 3177287, 3010245, 2798648, 3038986, 3092482, 2711904, 2809734, 2773282, 3135965, 3058634, 2813333, 2930149, 2837428, 2698745, 2665830, 2721369, 2957718, 2757135, 2862396, 2533106, 2547168, 2643668, 2493007, 2683877, 2135127, 2760433, 2583869, 2291679, 2281428, 2162397, 2334235, 2031150, 2091022, 1857242, 2257582, 2837401, 3086305, 5530610, 12108775, 25958758, 42840489, 36704775, 19131286, 11191856, 7389115, 5816054, 4850191, 4315362, 3515488, 3739005, 3214493, 3245244, 3110014, 3102048, 3287951, 2564047, 2652278, 2724739, 2538414, 2367907, 2441565, 2681865, 2432620, 2111989, 2552306, 2559951, 2319502, 2520583, 2027536, 2454342, 2400836, 2450125]
13953B450125j49648m1083o7511K6999j89896K40939j54553r7457p794q7966M35842
13942B357997l91632N53375k84423j53240l83217K15165k32328j61032M30387
13933A951052L3066j93819L91992j38907r3901n21299K6726M53732K52025j79766
13923A980901l42600Q7469k79185N55817j71286R062j75605k2302k2500K09165
13913A828936j31553R9756k07684l6626k54397O60678p38478L48913O8803k97128
13903A341220N11527o72921L02573m0030J75067j21397j99276P5087J27519J55748
13893A655117J7604n27118l9055K97347q0610L1631K17042P4269k18001l28790
13883A099436K71730k5711K83344j24548m9589Q9407j52348o124R6110j02318
$$ y = [2450125, 2300477, 2259394, 2191883, 2218882, 2028986, 2269925, 2115372, 2017915, 2010121, 1922155, 2357997, 1966365, 2519740, 2235317, 2082077, 1698860, 1914025, 1681697, 1520665, 1951052, 1984118, 1790299, 2182291, 2043384, 1949483, 1428184, 1454910, 1908642, 2160667, 1980901, 1638301, 1725770, 1446585, 2002402, 1831116, 1840178, 1664573, 1642271, 1619771, 1828936, 1697383, 1797139, 1589455, 1552829, 1298432, 1959110, 1220632, 1569545, 1638348, 1341220, 1852747, 1179826, 1482399, 1442369, 1617436, 1496039, 1296763, 1371850, 1499369, 1655117, 1672721, 1145603, 1106548, 1403895, 1323285, 1354916, 1571958, 1646227, 1428226, 1099436, 1371166, 1345455, 1628799, 1504251, 1454662, 1544069, 1391721, 1385597, 1481707, 1379389]
13873A379389m78734N48393m95928J14220K79503p9082j82578J47162J60721l91559
13863A001507K64751k26134L37590O4292j64692j87332K7919M0115J68616m14243
13853I12389L83586l49313J40891J31819l75452L79050p6832j8568k73130L40049
13843A194489j84486n6800L10443R630j33048j48741J25196j4653k36778P9486
13833I44738M07010l84825k09790K46632p573J12022o0519j96985P3721K48919
13823A173350m0302P9261k26891k26524L28400L45284m41475j37507J24543K71557
13813A249696m09325K49156m79496M32094j24082o5879j80400L82822n3633j79467
13803H21486j91761P05048l97746m684j22216k15824N54097j63044K7537j43322
$$ y = [1379389, 900655, 1449048, 953120, 1067340, 1346843, 1267761, 1085183, 1232345, 1393066, 1001507, 1266258, 1040124, 1377714, 1442006, 1277314, 1089982, 1117901, 1158016, 1326632, 912389, 1295975, 946662, 1087553, 1219372, 843920, 1222970, 1146138, 1127570, 854440, 1194489, 1010003, 953203, 1263646, 1273276, 1140228, 991487, 1116683, 1102030, 865252, 944738, 1351748, 966923, 757133, 1003765, 996192, 1108214, 1047695, 850710, 924431, 1173350, 1133048, 1212309, 985418, 758894, 1087294, 1432578, 991103, 853596, 978139, 1249696, 840371, 1089527, 610031, 1042125, 918043, 852164, 671764, 1054586, 1000953, 821486, 629725, 1334773, 937027, 932343, 810127, 594303, 1148400, 985356, 1012893, 869571]
13793H69571J09843Q3863E05087J22240J01909K69160k14774K39752k22617K05704
13783A006461n7824j44059K73170k49212o9448J27572M9699k44743j7302j07179
13773E67135K72695K46324j84041r6192J19033n4720k45519L53554l89040J88919
13763G78148l5098j59885L68983j1991j98482j41471P89560n79588l18970L21892
13753H13098m8000p552M36755E76921K94570l44207k3577K16142O9353j54284
13743F34918K67142k40483m5078K73868q6500k18200o0900J30332J33224l05581
13733D82742O46651D11982K20523J22426l7256n2780k82885Q1801K43146K70686
13723I77643j23723l87743L84786l26559J47751J0850L06259l70297M7351J47187
$$ y = [869571, 979414, 1063277, 505087, 627327, 729236, 998396, 783622, 1023374, 800757, 1006461, 948637, 804578, 1077748, 828536, 759088, 886660, 936359, 691616, 674314, 567135, 839830, 1086154, 902113, 805921, 924954, 870234, 624715, 978269, 589229, 778148, 743050, 583165, 952148, 940157, 741675, 600204, 1389764, 810176, 491206, 813098, 765098, 757546, 1194301, 576921, 871491, 527284, 503707, 719849, 789202, 634918, 902060, 661577, 616499, 890367, 803867, 585667, 524767, 655099, 788323, 482742, 1129393, 411982, 632505, 754931, 717675, 664895, 382010, 463811, 706957, 977643, 853920, 466177, 850963, 524404, 672155, 683005, 989264, 618967, 666318, 813505]
13713H13505q1366j19699j4593l1142l0804k40497M73877j72957j04313N00769
13703I92780D17619J0934J98606J69478B90426J82883m0869M07318j49777j1995
13693F77986J82310j76879j30295j24346K19078k06497M9374R0257J3831j53022
13683D41797K61041j35333j40424L62305l59675K94227l26842K28557k61308j03561
13673B60784L86675k29024L7095M9530J30289L13082B44801K06432N6814J91802
13663F99849j34477Q5255n9082k89769J23058K09067j36763B21915K93150K37472
13653G52537q5270j30411H6127L91051j40418K10793O4101A94764J96301A91460
13642C78880M8080J52700j30476J5914j65397O45691C54435P0906j70594K97291
$$ y = [813505, 732139, 612440, 597847, 566705, 535901, 295404, 769281, 596324, 492011, 992780, 417619, 428553, 627159, 796637, 290426, 473309, 432440, 839758, 689981, 677986, 860296, 683417, 553122, 428776, 647854, 441357, 490731, 580988, 594819, 441797, 702838, 567505, 427081, 789386, 429711, 723938, 397096, 625653, 364345, 260784, 647459, 418435, 455530, 505060, 635349, 948431, 244801, 451233, 508047, 699849, 565372, 650627, 591545, 301776, 424834, 633901, 497138, 221915, 515065, 752537, 667267, 536856, 86127, 477178, 336760, 547553, 611654, 194764, 391065, 191460, 378880, 426960, 579660, 449184, 465098, 299701, 945392, 354435, 425341, 254747, 552038]
13632E52038l8594r1408r7073J16811m2871A74670J09110J54435J9269K92516
13622G50000l17775p4845K48465B82341R3482J67855k59977L79398A37897l5984
13612A01913L74608q4234M3467j04297K23075m2774o1314J6369K70309C26305
13601F29198B91949R8037J13557B26560J87200A79417L51516j44137r6272J75806
13591D66330O846j02429K47469j31476P2055k27050K8790R0242P4644j28390K39624
13580F36655k11618L6978A54078p3368N25039k53732A63727K30367J50731l8713
13570E06112J59967C21234K45207k41811A24293K87662J35869j98211A06067K75710
13560C81777L25671e3723C93870q6189A06956J24573J61282J62203j48666K40167
$$ y = [552038, 513444, 422036, 324963, 441774, 398903, 174670, 283780, 438215, 457484, 750000, 432225, 357380, 605845, 282341, 375823, 543678, 283701, 663099, 137897, 101913, 476521, 392287, 435754, 331457, 554532, 511758, 450444, 466813, 737122, 326305, 629198, 291949, 389986, 503543, 226560, 413760, 179417, 530933, 386796, 290524, 466330, 473176, 370747, 618216, 486740, 558795, 331745, 360535, 450777, 525421, 397031, 636655, 425037, 462015, 154078, 80710, 605749, 352017, 163727, 394094, 544825, 506112, 666079, 321234, 566441, 324630, 124293, 411955, 547824, 349613, 106067, 381777, 707448, -53723, 393870, 307681, 106956, 231529, 392811, 555014, 406348, 646515]
13550F46515j84858A50635n2125B1689M78640j94204j33131J77391K01441A64270
13539F81448B70825J74235j52076R5279K13768j23394j50399L7226K52753j38751
13529D79466p872k14904Q35M2937L3828q6972L8483L4964q2685J67400n3225j00875
13517B51380o6282J66340n7696J9253j38678l8918Q7308J08101J21181A70219
13506D02235M4678r5679n5024J33704O740A74744K65995B03858O7226M547J02074
13495C77705j20328O2999O2680j53490M2559J6110m9199j17322M87689A21541
13484I4823N8967f4812A04079J81442m4417k7568O7028j00849K59985p8365A08690
13472C34949M66245C54014D0246P8420l6804N37321B77952E0586N15514a1032
$$ y = [646515, 461657, 150635, 98510, 21689, 500329, 306125, 172994, 350385, 551826, 164270, 681448, 270825, 445060, 292984, 388263, 602031, 478637, 328238, 365464, 618217, 479466, 471594, 256690, 257525, 300462, 334290, 247318, 285801, 320765, 238080, 405480, 352255, 251380, 185098, 351438, 293742, 312995, 174317, 135399, 222707, 330808, 451989, 170219, 402235, 446913, 351234, 296210, 429914, 436654, 174744, 440739, 203858, 271084, 275631, 377705, 257377, 320376, 383056, 229566, 272125, 288235, 239036, 121714, 609403, 121541, 94823, 153790, -64812, 104079, 285521, 241104, 213536, 280564, 179715, 439700, 361335, 108690, 334949, 801194, 354014, 40246, 118666, 81862, 619183, 277952, 50586, 566100, -11032]
13461E45587B36202D3871N8318P7645R9589J74792g6979F08732k99191A36263
13450D85398B22177J91619k03370J32400R8147C8831N62776A51536R4211R3071
13440C38818j14469L11542L0809k17939q4465o5928P6939P063K22318A39095l7007
13429A02088N41884k90464j58854J8198O5282A31255K40931q1437J01935j14601
13419B78083J77556j68899A30981O526J79081K70630a0837E32899j06729g6394
13408C01735k9647A04257K62932r3673c1143a0914j95115B90538R713r6424a77665
13396C11575N868j20638J45731a02549C52802J71009j34417C0290K79944j13816
13386A96418J1607l9906b10658A87683o1373J13660q9098d8362D8428L7053g4821
$$ y = [545587, 236202, 43871, 102189, 179834, 279423, 454215, -76979, 608732, 309541, 136263, 485398, 222177, 413796, 210426, 342826, 440973, 38831, 601607, 151536, 245747, 338818, 224349, 535891, 566700, 348761, 264296, 198368, 275307, 282370, 504688, 139095, 102088, 643972, 353508, 194654, 212852, 278134, 131255, 372186, 290749, 392684, 278083, 455639, 286740, 130981, 137507, 316588, 587218, -10837, 532899, 426170, -76394, 301735, 272088, 104257, 367189, 273516, -31143, -10914, -206029, 290538, 300251, 203827, -177665, 311575, 317443, 196805, 342536, -102549, 352802, 523811, 389394, 30290, 310234, 196418, 208025, 168119, -210658, 187683, 126310, 239970, 150872, -48362, 48428, 85481, -74821]
13374D01184D7087L8684j9695K9206Q904K24675I7218L15279C4456K77149J62084
13363D73689H2369J4849K90585j57095C3003L43033P33l4652j8655n8661J70189
13352D34990j92905e8663A27860j138J51101A17573K75491j5397J45925A55399
13341I1727L7789P5745q3906Q5573l5270K2563K29185A56423K08719j24334D2607
13329A32739c7937A06184J60137J11619j32259J76503I9694R6895N8682J60761
13319D16032l2377A82956m0412M60089A73828J02792J84420P1790C9941K27537
13309B67478a0075B48626k8838L2400n5091J80970J3810P4254k22233j10589l1904
13298A01405a54970f2788C09009N0086G7993K03557a6119C75759L0685a01659
$$ y = [401184, 47087, 85771, 66076, 95282, 104186, 328861, 97218, 412497, 34456, 311605, 473689, 82369, 97218, 387803, 230708, 33003, 376036, 376769, 342117, 323462, 264801, 434990, 242085, -58663, 127860, 126722, 277823, 117573, 393064, 377667, 523592, 155399, 91727, 129516, 205261, 121355, 206928, 171658, 194221, 423406, 156423, 365142, 240808, 42607, 132739, -37937, 106184, 266321, 377940, 245681, 422184, 99694, 196589, 255271, 416032, 383655, 182956, 142544, 602633, 173828, 276620, 461040, 532830, 39941, 267478, -10075, 248626, 219788, 252188, 197097, 378067, 391877, 466131, 243898, 133309, 101405, -154970, -62788, 309009, 359095, 77993, 281550, -16119, 375759, 406444, -101659]
13287A54324J38414I0918J84533k5692A3085P648L1872L17632E0721r769a41896
13275D19847j30586A17150J61458k3614j10277O6829N6761j18943L34287j95351
13265B88300C1448J72600J28524j00758o2604J07959j14964o002B0309L12231
13255C32540C3064c90628A79627K4644E5655J06843J83474j71724J63538A58443
13244E4665J54423I9361J61702H4607N14135B09893R991A3906K0686K20867l1010
13233B24449m496K6778a9498q4048A44583O085K09316A77651K23209A77008m1993
13222A35015N306O6031p0415J8821n7525J25841i8681L5963d768C95938G146c8460
13209C24882a13727C7876b70293M4428O002b7575B72283L540m7380M7391a15719
$$ y = [154324, 292738, 90918, 275451, 249759, 13085, 20733, 52605, 370237, 50721, 40952, -141896, 419847, 289261, 117150, 278608, 254994, 144717, 211546, 268307, 149364, 483651, 288300, 31448, 204048, 332572, 231814, 169210, 277169, 162205, 156203, 20309, 332540, 33064, -390628, 179627, 204271, 55655, 162498, 345972, 174248, 337786, 158443, 54665, 209088, 99361, 261063, 84607, 598742, 209893, 219884, 13906, 34592, 255459, 224449, 219953, 246731, -19498, -103546, 144583, 150668, 359984, 177651, 400860, 177008, 135015, 140321, 206352, 135937, 154758, 97233, 223074, -98681, -62718, -4768, 395938, 7146, -38460, 324882, -113727, 37876, -270293, -225865, -219863, -27575, 272283, 275823, 228443, 275834, -115719]
13197c1268n4475C8550a46570D62576c60903F139J685K41503G1481A3180j908
13186A1272J7475H973K80570m9505Q162c50921b6720l6412q1783d6869a5815G1276
13173A04800a37918A60682m7252N7017d9508B43721F7744K02933G5808g0929B25882
13161A37270k4138J6101L42462A40947k9586L6942P1057b32466B21988B251a03417
13149G203K67557m7628P267a66539F1764g8222G7428L605J45233a10564B21828
13137a81131I4389L0587A3396f2395A58844K17339c9919A64258G4736J21049H4984
13125b94595A2803K55876F4392c4361D2290K14557a59279o6483B71717q9668O7484
13114B49533D8344J09582F7314h103I8581J06030H0779a0016q4660B80962I6917
$$ y = [-31268, -85743, 38550, -146570, 462576, -360903, 6139, 7824, 249327, 71481, 13180, 11272, 28747, 8973, 289543, 240038, 248200, -350921, -26720, -63132, -144915, -46869, -15815, 71276, 104800, -137918, 160682, 113430, 170447, -49508, 243721, 67744, 270677, 75808, -70929, 225882, 137270, 113132, 129233, 471695, 140947, 111361, 148303, 219360, -232466, 221988, 2251, -103417, 7203, 274760, 227132, 234399, -166539, 61764, -78222, 77428, 81033, 226266, -110564, 221828, -181131, 94389, 124976, 13396, -62395, 158844, 376183, -39919, 164258, 74736, 195785, 84984, -294595, 12803, 268679, 64392, -34361, 42290, 256847, -159279, -225762, 271717, 182049, 249533, 48344, 157926, 67314, -8103, 98581, 204611, 80779, -10016, -94676, 280962, 96917]
13102A47464C5685Q6327a64369d1623D4036b80809f3756D0310J97466A09609g6461
13090b45449C28579h481A01472P216F482e9383I7374J08796C4250i0990F0378
13078b6253H2652j3899M27384j96460h9265A38119m6786J13768f0126J6474C13955
13066A19163a5545A15098K72391g6464A09170L00217A05312Q7637e154B07290
13055A81884A2733P7117a23895k18792D1678K41062A02913P8980K8363c0460J5086
13044a5374F232a37925j18435a2873j4817D57680A02788L1874b0774l9356D04470
13032b27232A72647p7868L13952a76580A36520M60921B50429n4069L98442a71512
13021C10090a07839D47257j56642K6380I1197m1826M36720A99357p4707C0380
$$ y = [147464, 35685, 122012, -164369, -41623, 44036, -280809, -63756, 40310, 237776, 109609, -76461, -245449, 328579, -8481, 101472, 108688, 6482, -59383, 97374, 206170, 34250, -90990, 60378, -26253, 82652, 68753, 496137, 299677, -89265, 138119, 91333, 205101, -60126, -43652, 313955, 119163, -15545, 115098, 387489, -76464, 109170, 409387, 105312, 192949, -5154, 207290, 181884, 12733, 89850, -123895, -342687, 41678, 282740, 102913, 181893, 210256, -30460, -15374, 6232, -137925, -256360, -12873, -27690, 457680, 102788, 134662, -20774, -60130, 404470, -227232, 172647, 94779, 408731, -176580, 136520, 597441, 250429, 196360, 594802, -171512, 310090, -107839, 447257, 290615, 316995, 91197, 49371, 486091, 199357, 124650, 30380]
13010A93692I1378c6292C5915K91089A61521J11047Q0953A27482a56468C90817
12999D05221A28745J46311A22266L1058c32013B75153l8570G3130K69157b17840
12988A6585K9723f3875I3834O9713D1156M0283K5071J74846b56665g2756A05317
12976B67790J4873P5902i0685A74956P6631Q1821a22092d3378A19593C4012M7097
12965H1109l1568g713B98721n6054G083a90796a0868r4025l1951F8760a7571B03365
12952a31722d6389A80923c8083A66958a28226O2336D59592A39988O1503c39258
12941e7555q6588D150O1596P2600N2826e0564A62973j6049J38174c49957e2702
12929f5946A07613a38362k351d801B4359L7659K05633j30617L82779A58574a63130
$$ y = [193692, 91378, -36292, 35915, 327004, 161521, 272568, 353521, 127482, -156468, 390817, 405221, 128745, 275056, 122266, 153324, -332013, 275153, 236583, 73130, 342287, -217840, 16585, 46308, -63875, 93834, 163547, 41156, 81439, 106510, 281356, -256665, -72756, 105317, 267790, 282663, 358565, -90685, 174956, 251587, 333408, -122092, -43378, 119593, 34012, 81109, 49541, -7713, 298721, 242667, 7083, -190796, -10868, -104893, -136844, 68760, -17571, 203365, -131722, -46389, 180923, -38083, 166958, -128226, -65890, 459592, 139988, 201491, -339258, -57555, -144143, 4150, 65746, 138346, 191172, -50564, 162973, 146924, 285098, -349957, -52702, -65946, 107613, -138362, -140713, -4801, 24359, 62018, 267651, 137034, 519813, 158574, -163130]
12917A12260m9370b1909B02460J78849B6332L89936a95080A48947g2451b4764
12906a24020B31549C1518a4158A89176I0152R8681O481c0112G3875M6223J09979
12895B30077F7295f408C6992J33914a1423A74410Q429r0403l2904c7000D6074
12883D7912k3217K7358k3403b1214E4889b59476A11468F584L19600j07051d36299
12871H3409J84813F571R4992m174J6091R3781J75722c0551B42579E359Q3297D3253
12858f7923B10549c19055A54131F6426a97396B01133o891i0690b572D1979L78504
12847D20483A51978L14438F0543a01411D58950a15084l2709O3555i880k17685
12837b27565H3930b5448B06187d87188B09573b16793E495J96838a59398A35581
$$ y = [112260, 62890, -21909, 202460, 381309, 26332, 416268, -195080, 148947, -72451, -24764, -124020, 231549, 31518, -14158, 189176, 90152, 188833, 195314, -30112, 73875, 120098, 230077, 67295, -6408, 36992, 170906, -11423, 174410, 182839, 92436, 59532, -37000, 46074, 47912, 24695, 52053, 28650, -21214, 54889, -259476, 111468, 6584, 326184, 219133, -436299, 83409, 268222, 6571, 101563, 97389, 113480, 207261, 382983, -30551, 242579, 5359, 88656, 43253, -67923, 210549, -319055, 154131, 66426, -197396, 201133, 194242, -90690, -2572, 41979, 420483, 151978, 466416, 60543, -101411, 458950, -115084, -147793, -84238, -9880, -227565, 83930, -25448, 206187, -487188, 209573, -216793, 5495, 202333, -159398, 135581]
12826I514a36184C31581o0167e5500G7865K51274b32671K3909P0830B12621E3188
12814a00853A13744b12178Q0935m5555f471j01801l2424A15315R4971b515A87198
12802B64348G1606J19378b59864j5994B46740H9068J5469O1242b48664A83205
12791b7094A20497c03879d9171B0355H264g8594B92183b12905a6222H2238a07192
12779B77839J04334a67471H4311J73259K57221b42767C65950B544J18075f4977
12768f086l17882a51602F0316L7352b79572D37041b28656O7955A5179L07463a33777
12756c0177i62n2407l6884l2503A43839B0405F775g3165D7770J01426c77837a33479
12743A91471e7125l6087B25133p2522R1388l0754M9216g6351A20273g2933B48310
$$ y = [9514, -136184, 331581, 271414, -55500, 77865, 329139, -232671, -208762, -137932, 212621, 53188, -100853, 113744, -212178, -131243, -176798, -6471, -108272, -140696, 115315, 210286, -2515, 187198, 264348, 71606, 190984, -259864, -275858, 246740, 89068, 104537, 165779, -248664, 183205, -27094, 120497, -303879, -49171, 20355, 8264, -78594, 292183, -212905, -16222, 82238, -107192, 277839, 382173, -167471, 84311, 257570, 514791, -242767, 365950, 2544, 120619, -64977, -6086, -323968, -151602, 60316, 97668, -279572, 437041, -228656, -160701, 15179, 322642, -133777, -30177, -962, -53369, -90253, -122756, 143839, 20405, 6775, -73165, 47770, 149196, -377837, -133479, 191471, -57125, -93212, 225133, 152611, 243999, 213245, 262461, -76351, 120273, -72933, 248310]
12731B12786E2972L44335L0821j88858d4462A32719a78765n6425F0548k3057f8514
12719A79395A180R8198O014h6060A78742b76658l787h3139B54195a38752F33574
12707D46390A69575J72697b90306B82732D8557a29485B1015a71389A75807b0488
12696a62464P2200r2158D1418k0362b18939e1353B15742a63998N5094B18117E3179
12684A13163L0252J9335L6668q2211N7379a12252e5585A18451J13369J08899O3778
12673D04497A46395G171J10618K79140e4121j55753A3101L57316A07002N6392
12663A63394g3031j27633B48671d0286C09281A01803K5377Q6813q0493J4114J18359
12652B65973H0071J84186l3272I1391J80965l9822d0307m1980K4495B0390a63679
$$ y = [212786, 52972, 397307, 428128, 239270, -44462, 132719, -178765, -235190, 60548, 37491, -68514, 179395, 1180, 99378, 105392, -86060, 178742, -276658, -280445, -83139, 254195, -138752, 633574, 446390, 169575, 342272, -290306, 282732, 48557, -129485, 21015, -171389, 175807, -20488, -162464, -90264, -182422, 41418, 21056, -218939, -51353, 215742, -163998, -108904, 218117, 53179, 113163, 143415, 162750, 199418, 117207, 174586, -112252, -55585, 118451, 231820, 340719, 404497, 146395, 7171, 117789, 396929, -54121, -209874, 13101, 370417, 107002, 163394, -73031, -200664, 248671, -40286, 309281, 101803, 127180, 213993, 133500, 147614, 265973, 80071, 264257, 230985, 91391, 272356, 232534, -40307, -82287, -57792, 20390, -163679]
12640B15522G9529K77928G4561k8180M61821B4998d1221a8011o38A38628Q2795
12629B21423b43747D98000m1708A94763L5899b11392E32L46265a2441F09184a33943
12617B3142c89884A77680J53632A35043K24768A24374d9397A01719k6757b9855
12606f1772B39618a57776H8196C684L90981b7371A78777B0701a87209B05256K4902
12595B30158a80993D93587A23892a46750B1395J46428E0712J51423B3110e2627
12584B68944a92984B75376A22026J47655G1545b6241A10288c76j09490A07427
12573G5271J56320J20128F3241K34406a64983L3879N7691A97357L9569b8347H5523
12561F9553a44579j2004B2943f6148r9916M2791a0223m98214a64582I9801j6621
$$ y = [215522, 79529, 357457, 74561, 46381, 508202, 24998, -41221, -18011, -18649, 138628, 221423, -243747, 498000, 456292, 194763, 230662, -211392, 532, 346797, -12441, 609184, -133943, 23142, -389884, 177680, 331312, 135043, 359811, 124374, -49397, 101719, 74962, -29855, -61772, 239618, -157776, 88196, 3684, 394665, -27371, 178777, 20701, -187209, 205256, 230158, -180993, 493587, 123892, -146750, 21395, 167823, 50712, 202135, 23110, -52627, 268944, -192984, 275376, 122026, 269681, 71545, -26241, 110288, -376, -109866, 107427, 75271, 231591, 351719, 63241, 297647, -164983, -131104, -73413, 197357, 236926, -28347, 85523, 69553, -144579, -156583, 22943, -66148, -166064, -123273, -10223, -508437, -164582, 99801, 83180]
12550H3180b4326A7653J94271B9308L52972m8689d3837E457b05592H0166J6116
12539I6282b49872f1391l6042j47422B1196d19339H7415M13978g5951D3399a62154
12527B09638q8729g9951k01939g5486l00813i703k84456H8689A9992N27593j77847
12516C69738B8939J33117b34449B29055I212c75410G4537c22041D95193a95314
12505f7456D3469j4317J17581l9264M9515a21668j7338B86130I600K17032G2375
12493H5564R1381J7503i3304D0517b12290G5427A7625a15105A01166a31851d5162
12481A97748c56902b0673B7528J63631i5379E0024a01389B34942E362a12451j09478
12470b21929A94000d4527p6720B49445J08583g6780j61835F9728J20197D2100
$$ y = [83180, -24326, 17653, 211924, 29308, 382280, 333591, -43837, 5457, -205592, 80166, 96282, -249872, -61391, -97433, -244855, 21196, -419339, 87415, 501393, -75951, 43399, -162154, 209638, 120909, -79951, -281890, -75486, -376299, -9703, -294159, 88689, 19992, 547585, 369738, 28939, 162056, -234449, 229055, 9212, -375410, 74537, -322041, 495193, -195314, -67456, 43469, 29152, 146733, 107469, 156984, -121668, -139006, 286130, 9600, 226632, 72375, 85564, 176945, 194448, -93304, 40517, -212290, 75427, 17625, -115105, 101166, -131851, -45162, 197748, -356902, -20673, 27528, 191159, -95379, 50024, -101389, 234942, 5362, -112451, -221929, 194000, -44527, -121247, 249445, 358028, -76780, -238615, 69728, 189925, 42100]
12459e7853A40869b11604H837i0526D9860b25864g896k3575j20895C3797J46515
12448A80312b18771B15097a0536E4258O1756m2702g262j14047j00625j51619a04645
12436b9690i093j77470d5888I6998J263M41529k37225M2769a4268E5771J64414
12425B20185A03053J22372d0839D18752A25263f6278D2703a93491A4805P9284
12415I4089a0802j63504B93483b92898a20252k4935l5422b1954l04191J18322
12405b07823j70634h9848A39659c32367B29315j13448B4462M12321C898j619O2656
12394F4935h163B0139e7860k02648B6539e0737A17708Q2789I602a64814k1387
12383a86201k18548A34785b16519J03538C0419e227n2037j4979j1054o2625m4780
$$ y = [-57853, 140869, -211604, 8837, -90526, 49860, -225864, -7896, -31471, -152366, 33797, 180312, -218771, 215097, -10536, 54258, 116014, 73312, -7262, -121309, -221934, -373553, -104645, -29690, -9093, -186563, -45888, 96998, 98261, 539790, 302565, 345334, -14268, 55771, 220185, 103053, 225425, -40839, 418752, 125263, -66278, 42703, -193491, 14805, 94089, -10802, -174306, 293483, -292898, -120252, -145187, -180609, -21954, -326145, -207823, -378457, -89848, 139659, -332367, 229315, 115867, 24462, 436783, 3898, 2279, 64935, -8163, 20139, -57860, -260508, 26539, -50737, 117708, 200497, 9602, -164814, -186201, -404749, 134785, -216519, -112981, 30419, -5227, -57264, -72243, -83297, -145922, -190702]
12372a90702A06374J95788b20928E5837J33308L8908o2388b44721a19376k27975
12362c47351J08384e4464B50827a25240C07820j7728a23704D3230l162L9590c90535
12350b10860a04316I1967d1190o5524K4213B13086k3466M929b4932m329j43034
12339a72295B58777D0040i0300c229p4335A11354B8695J42630b5621m1511A3203
12327G8764f9196K7178C00611d1936C27884A2742D577a94761i3486j8673A37602
12315A83390a83509q5276g8932j83726i6272G4963e6896B51053Q5456d6412A60877
12303D03949G8479l8081J3186a58999d338I1799J93447j08398a74129A33399m0343
12292I3056R34j5186J83945g927k8121j37412e9001E31850c1874B33768l5549
$$ y = [-190702, 106374, 302162, -220928, 55837, 189145, 228053, 165665, -244721, -119376, -347351, -238967, -54464, 250827, -125240, 307820, 290092, -123704, 43230, 40068, 79658, -390535, -210860, -104316, 91967, -41190, -106714, -82501, 213086, 189620, 194549, -24932, -29261, -172295, 258777, 40040, -90300, -3229, -77564, 111354, 28695, 171325, -25621, -67132, 13203, 78764, -69196, -42018, 300611, -41936, 327884, 12742, 4577, -194761, -93486, -112159, 137602, 183390, -183509, -268785, -78932, -262658, -96272, 74963, -56896, 251053, 336509, -46412, 160877, 403949, 78479, 40398, 53584, -158999, -4338, 91799, 285246, 176848, -174129, 133399, 93056, 93990, 78804, 262749, -7927, -36048, -173460, -59001, 531850, -31874, 233768, 198219]
12281A98219a06271j8859e104B9820J39029L12355B05812K3344q3730K47905a07714
12269a58369B21453O5443a8689I5502L0712f7830H8116L8590i3816d0481A14604
12257C13758G7131a6637F6622a13525B95473g2754j28055A30898k3373J17490
12247B25015J517a31603A22327c29874B23909H6874O0145b9983A85947M7052I9397
12235G1715L07487j34244D2116J34152k6074M9272J71930m5169d2128B70387G2278
12223C28202N7621C1522P8131f5402A54963L4152J4658L8813J23052a52355B16681
12211a61203J7119B98168H4088k672a7218A34064E6014K09753j9526J43894J12151
12200E02286B02442r8696p507J12978q9331O0483a54058G9529A3223L29799A51226
$$ y = [198219, -106271, -125130, -5104, 29820, 168849, 481204, 205812, 229156, 145426, 393331, -107714, -158369, 221453, 286896, -18689, 95502, 126214, -67830, 88116, 126706, -93816, -40481, 114604, 313758, 77131, -16637, 66622, -113525, 295473, -72754, -200809, 130898, 107525, 225015, 226532, -131603, 122327, -329874, 223909, 86874, 147019, -29983, 185947, 232999, 99397, 71715, 379202, 244958, 42116, 176268, 150194, 199466, 371396, 326227, -42128, 270387, 72278, 328202, 385823, 31522, 109653, -65402, 154963, 189115, 203773, 242586, 365638, -152355, 216681, -161203, -144084, 298168, 84088, 81416, -17218, 134064, 56014, 265767, 246241, 390135, 502286, 202442, 103746, 96239, 209217, 119886, 180369, -154058, 79529, 13223, 343022, 151226]
12188B37282I6282J81168b5957D38260i0997k49594a13744A0095g7134b0473A3787
12176C2126J5434b28258A05962c0300o3613C34092e9706e866A12108K066P5251
12165A89425d1657B5198J09787b2095q4324A92758a89404B0076K33219b33389
12154B86542B6110o426K02530E1977k4094J82891d945j16186B56360F3139J48506
12143B11645j04076L19421b75197D9541O6250J72840I0677J6084a91639A59285
12132B1326J26333a8552l2555k0731C43082d0760j19302A4004J9174h0544K2380
12121e8164H026J8116a22905A95072b45495f7602H7069b03457k98B7539M4170
12110G1709b59825a05712m845A69878a65441B448Q1298A054N61893E0366J36676
$$ y = [237282, 96282, 277450, -25957, 438260, -90997, -340591, -113744, 10095, -77134, -20473, 13787, 32126, 47560, -228258, 105962, -30300, -93913, 334092, -59706, -5866, 112108, 114174, 189425, -41657, 25198, 134985, -22095, -106419, 192758, -189404, 20076, 253295, -233389, 286542, 26110, 19684, 222214, 51977, 27883, 210774, -4945, -121131, 256360, 63139, 211645, 107569, 426990, -275197, 49541, 115791, 288631, 90677, 106761, -191639, 159285, 21326, 147659, -18552, -51107, -71838, 343082, -40760, -160062, 14004, 33178, -80544, -58164, 8026, 26142, -122905, 195072, -245495, -67602, 87069, -203457, -203755, 27539, 71709, -259825, -105712, -110557, 169878, -165441, 2448, 83746, 1054, 562947, 50366, 187042]
12099A87042a65636A79251f3992A49524p0444J76565a36080A4901c1249B19971
12088A07330l4691a88449j5396Q0888F502N56770a52041E5114K51192e4151C85234
12076D68788P01457N75437F38373B08409b9907E4799a73008a0535C06819c4500
12065I8967K51937b37255G5142b3177D5908c2649n8183E4388A0333R3225j3712
12054H9846j6124L3054C82c4094j10299j28434A40294o1468K603b41506B36046
12042b18200K1471G3133h759k01270f9483m4916q0101d1051n4874A55333a32119
12030d18902J80595M7792i619B7362j0869K4721a05383A9304J05904C5275e634
12018A06790O8605b18427a5078l88894a1340p8364B31963E007J95479A7407K28866
$$ y = [187042, -165636, 179251, -63992, 149524, 79080, 255645, -136080, 14901, -31249, 219971, 107330, 72639, -188449, -203845, -122957, 6502, 563272, -152041, 55114, 306306, -54151, 385234, 468788, 1170245, 1745682, 638373, 208409, -29907, 54799, -173008, -10535, 306819, -34500, 98967, 350904, -237255, 75142, -23177, 45908, -32649, -90832, 54388, 10333, 103558, 89846, 73722, 106776, 382, -34094, -144393, -272827, 140294, 78826, 81429, -241506, 236046, -218200, -196729, 73133, -8759, -210029, -69483, -114399, -194500, -41051, -95925, 155333, -132119, -418902, -238307, -190515, -9619, 27362, 16493, 41214, -105383, 19304, 125208, 35275, -5634, 106790, 175395, -218427, -15078, -403972, -11340, -89704, 231963, 5007, 200486, 17407, 246273]
12007B46273o2000a74181F5843a86809j0560L9072q0250f881j27680B41447i1255
11995C97527a84214n3650O3587d2827a2604A47290j3817j525a36543a320j76663
11984a77983a6516r8541B44397a0665r0049L7046G0521B6409h7369E5223j8759
11973C6464j3829b35579F526K49616b9376A01202M0670B7005D380a03437A35895
11961A41850J4054N6756a20894A28573D0993f0290k79209a7467H227a99945A34342
11949h1080A23990M7966b77947J22899B17774b4005A47232C6898g646q5910A36733
11937B51322g6245A07481j3795l6124Q4323Q5852A2371f9823A1161O7a10903B50020
11924b54307D07414b0768k44886c9890p9062j13906J04528A94569h4070A58558
$$ y = [246273, 184273, -174181, 65843, -186809, -197369, -158297, -238547, -6881, -134561, 241447, -91255, 397527, -184214, -237864, -174277, -42827, -12604, 147290, 133473, 131948, -136543, -1320, -177983, -16516, -115057, 244397, -10665, -100714, -63668, 70521, 26409, -87369, 55223, 36464, 22635, -235579, 6526, 256142, -29376, 101202, 141872, 27005, 4380, -103437, 135895, 141850, 155904, 212660, -120894, 128573, 40993, -60290, -339499, -17467, 8227, -199945, 134342, -81080, 123990, 171956, -277947, -155048, 217774, -24005, 147232, 36898, -7646, -93556, 136733, 251322, -76245, 107481, 93686, 57562, 141885, 227737, 12371, -69823, 11161, 11228, -110903, 250020, -254307, 407414, -20768, -265654, -39890, -118952, -232858, -128330, 194569, -84070, 158558]
11913D3207J03449f9357L0958B01493k4636b95618A87423e4581A34433F4858j8367
11902D6491c6782l06261a30359o7563C2439j1439a33372B06820e9925b2719A85415
11890B45777b01670L5834b0208I1186K24282j2713A06250K314l2602J17741I1869
11878a93562A3356J75668a62257a0843j08053j46208R3703A9514N9856J80585
11868B59955I3649a16293B11247G2223b18882A25042c54532R9318E5212N5305
11858A10517J72226F625K57211a44115A99840l9398g8992l354a4598j77232d173
11846b10494B9527a26710k06660J61128j3548k9418P966k55961f5366D1316M4541
11835H5857A3332J74712d0427C96336b46851A45458J75894b57210g056j70035
$$ y = [43207, 146656, -69357, -38399, 201493, 176857, -295618, 187423, -54581, 134433, 64858, 46491, -36782, -343043, -130359, -197922, 32439, 21000, -133372, 206820, -59925, -22719, 185415, 245777, -201670, -165836, -20208, 91186, 315468, 302755, 106250, 108564, 75962, 193703, 91869, -193562, 13356, 189024, -162257, -10843, -118896, -265104, -171401, 19514, 79370, 259955, 93649, -116293, 211247, 72223, -218882, 125042, -354532, -255214, 55212, 110517, 282743, 6625, 263836, -144115, 199840, 160442, -78992, -82346, -14598, -191830, -4173, -210494, 29527, -126710, -333370, -172242, -185790, -215208, -207242, -463203, -65366, 41316, 85857, 13332, 188044, -40427, 396336, -246851, 145458, 321352, -257210, -7056, -177091]
11825a77091M4009C6967a7279A26039A5544a08170M3899j6510j06936E9821a65137
11813a1781A84011J06312r3720a40454G2788N9595a90370r0417N8318J8204A27386
11801B01284b76018C7411A5379e2002n8061E18234A36664b26997A47797A2365
11790A42264D9748b98438a07662B52660A18360J82465E3797b473p6177B21203
11779a57759q2186C70511j43192m7993n7926b10679R5393p6196I0976e2380j22247
11768a74627g6587B29103d984j21496B44308e5512m4595A35075a79050l7446C01759
11756c26308D5546b14860D0696b7753B83603a58752j8518C23368j27731f7511
11745b56900j2385r4956B9163a06654L1874j23197F1826J69253D4711K74416j36989
$$ y = [-177091, -133082, 36967, -17279, 126039, 15544, -108170, -64271, -80781, -187717, 59821, -165137, -11781, 184011, 290323, 196603, -140454, 72788, 132383, -190370, -280787, -222469, -204265, 127386, 201284, -276018, 37411, 15379, -52002, -110063, 518234, 136664, -226997, 147797, 12365, 142264, 49748, -298438, -107662, 252660, 118360, 300825, 53797, -2473, -78650, 221203, -157759, -239945, 370511, 227319, 179326, 121400, -210679, -115286, -191482, 90976, -52380, -174627, -76587, 229103, -4984, -126480, 244308, -55512, -100107, 135075, -179050, -216496, 301759, -326308, 45546, -214860, 40696, -27753, 283603, -158752, -177270, 323368, 195637, -67511, -256900, -269285, -364241, 29163, -106654, -74780, -197977, 61826, 231079, 44711, 319127, 182138]
11734A82138e1208A22316J10609b60292c9356J8320j74477I3735d955B41590d39695
11722H1763a85617d7825K2980j69086A62235a81415A07169a26921B04679G7006
11711F01565b90295A85874J77430f7896m4400A1004m195g1702A59991F8725K05640
11700B74365A8508J6311J7443k2256R560f979k4181A51329m9723L11714r7972
11689C15348e3213A57731a6917q1765j8383L9341j36305B69622j07517n3875J60342
11678B68572d6590C3790K4556d736B0743J83893p5089m0073e53581I9720c54635
11666i0662j47829B09843f4158C2384q962c456j0297A46140a50033C9905J715
11655D1620B0776O3532b73569E5197M5546J51266J41706a08333j92140j29138
$$ y = [182138, -51208, 122316, 232925, -260292, -39356, -21036, -195513, 93735, -4955, 241590, -439695, 81763, -185617, -47825, -24845, -193931, 162235, -181415, 107169, -126921, 204679, 77006, 601565, -290295, 185874, 363304, -67896, -112296, 11004, 6809, -71702, 159991, 68725, 274365, 18508, 34819, 52262, 30006, 39566, -6979, -31160, 151329, 101606, 413320, 315348, -53213, 157731, -16917, -98682, -117065, -77724, -214029, 269622, 162105, 108230, 268572, -46590, 33790, 58346, -4736, 20743, 204636, 129547, 89474, -553581, 99720, -354635, -90662, -238491, 209843, -64158, 32384, 23422, -3456, -13753, 146140, -150033, 39905, 41620, 20776, 84308, -273569, 55197, 100743, 252009, 393715, -108333, -300473, -429611]
11645d29611a27849q058A25430A2279b22068B51818H0509M2866B6278a00735b5330
11633A25016a1975k6956D34388a43603A52895k8986C2273e3999l6316L2393O786
11622e1136j62438A99782M9266b10530A97056a13952B02535H2740J27242e8228
11611d3667k77336g4761j15971i375l51727J76905a8064l4205m1976d851A55504
11599a44762B26104H9739L7073h4674E2216J53436e0529A89892L2225b4329H6915
11587a5874r8374D35424j08740a35211A28988M6437J17002G1193R2199a91029
11576I9494b00819i5993b8911C83014D8732g7634m732H3935C5054N375h8368M0252
11564d8116k3509n7235l7704C72792A51546G3485e8509D00267f1113G0415c8448
$$ y = [-429611, -127849, -135907, 125430, 12279, -222068, 251818, 80509, 123375, 26278, -100735, -25330, 125016, -11975, -38931, 434388, -143603, 152895, 123909, 32273, -53999, -90315, -57922, -51136, -213574, 199782, 249048, -210530, 197056, -113952, 202535, 82740, 209982, -58228, -43667, -321003, -74761, -190732, -9375, -361102, -184197, -18064, -52269, -94245, -4851, 155504, -144762, 226104, 89739, 126812, -84674, 52216, 205652, -50529, 189892, 222117, -24329, 86915, -15874, -114248, 435424, 326684, -135211, 128988, 175425, 292427, 71193, 163392, -191029, 99494, -200819, -95993, -28911, 383014, 48732, -77634, -82366, 83935, 35054, 40429, -88368, -48116, -71625, -128860, -166564, 372792, 151546, 73485, -58509, 400267, -61113, 70415, -38448]
11552a11734p5948A07390K8837B4090a2599A20742A1883R5484a10809B1376c9984
11540a78080l2412O2708N8201F549E51R5814B8735J49024m7293a03284K4665F6761
11527d6355j8706j40061A91166a52381E694M55445a45754d1539k89705A83610
11516E4020c1311f165A38434f2826A05670e6563C56999F509J82009P4357J9227
11505B82102K21719a1379J268G3135a9407A80271G7762b4181N216n3405C29420
11493B47121P2043b69789A9332J58113n1970a5870j33248C8740O5459L043a40979
11481A21937J99039a9430E07137F4242J37768h4329C43814j088A4334N9612J52500
11470B26446p6699C6912Q8560j8454b37426B17566a65158d30n6765E14017h474
$$ y = [-111734, -187682, 107390, 136227, 24090, -12599, 120742, 11883, 107367, -110809, 21376, -39984, -178080, -210492, -147784, -89583, 6549, 551, 96365, 28735, 177759, 130466, -103284, -78619, 66761, -46355, -65061, -205122, 191166, -152381, 5694, 461139, -145754, -41539, -331244, 183610, 54020, -31311, -6165, 138434, -62826, 105670, -56563, 356999, 6509, 188518, 262875, 282102, 503821, -11379, -10111, 73135, -19407, 180271, 77762, -24181, -18965, -72370, 329420, 247121, 319164, -269789, 19332, 177445, 125475, -15870, -149118, 38740, 104199, 107242, -140979, 121937, 320976, -19430, 507137, 64242, 202010, -84329, 343814, 342726, 14334, 73946, 226446, 149747, 36912, 125472, 107018, -237426, 217566, -165158, -430, -57195, 514017, -8474]
11458a79486B40384l7226b85374E28068c51851A52357i0302A14255l4065a79172
11447A97722d9824a2807M183C90938j63025c6450a1314B31470a08702q9931i7853
11435B4229a13640F0897d5774B95341a27039l5370d3198A37165a927j1021k2805
11424c5753q3433B9492a68506E8195b08853B32094e002j62653B36554c7647H7710
11412b0733C66089o827j29533a95552A32953h4908H6218K7100n193B7221b83289
11400H1478L1018b45850B08339l3911D127J61696b8550A11017b60324i2791C57229
11388B30032c8324K287n3444k9301C16085a45806I0157C8724L5850J24375h4222
11376F7322b43168C20865D0088a07443K9070B03431o3230a98819k49027A58665
$$ y = [-179486, 240384, 203158, -285374, 528068, -351851, 152357, -90302, 114255, 80190, -179172, 197722, -49824, -12807, -8624, 390938, 227913, -36450, -11314, 231470, -108702, -198633, -97853, 24229, -113640, 60897, -45774, 295341, -127039, -162409, -43198, 137165, -1927, -12948, -35753, -119186, 29492, -168506, 58195, -208853, 232094, -5002, -167655, 236554, -37647, 87710, -20733, 366089, 359262, 229729, -195552, 132953, -84908, 86218, 113318, 108125, 27221, -283289, 81478, 112496, -245850, 208339, 174428, 4127, 165823, -28550, 111017, -260324, -92791, 357229, 230032, -38324, -36037, -89481, -118782, 316085, -145806, 90157, 38724, 74574, 198949, -84222, 67322, -243168, 320865, 40088, -107443, -78373, 203431, 140201, -198819, -447846, 158665]
11365A917N2676a66421O8029j16078B28150I2283b5773B32113q8134c47592C5853
11353B3175b39893m442A15451B9142c3941j58980a4619j07068B13248K6296I7408
11341a43558F1708M8131A7076J36630J05026i0720A07295J58290b3407i01k43343
11330b44244f5334a0164j14428F5647l722b62278E3328b49929h722j63347q3412
11319b55481F2743a54081l55079A46903b34290n6878B83259n0420p6939k5813
11309A30087k9061b16358A16086j3950b28168J02671A89021f0104j49616O6013
11299a43707d9682A39001f6331H5927M4967b1571A62785a54543O9341A64374c3746
11287a01216A18700i0991j51144B11834e8590j99328I0144Q6752a81220A8651
$$ y = [1917, 54593, -166421, -98392, -214470, 228150, 92283, -25773, 232113, 143979, -347592, 35853, 23175, -239893, -244335, 115451, 29142, -33941, -192921, -14619, -121687, 213248, 239544, 97408, -143558, 61708, 109839, 17076, 153706, 258732, -90720, 107295, 265585, -23407, -901, -244244, -65334, -10164, -124592, 65647, 61925, -262278, 53328, -249929, -8722, -172069, -255481, 62743, -154081, -509160, 146903, -234290, -291168, 283259, 232839, 155900, 130087, 101026, -216358, 116086, 102136, -228168, -125497, 189021, -60104, -209720, -143707, -49682, 139001, -66331, 85927, 130894, -21571, 162785, -154543, -85202, 164374, -33746, -101216, 118700, -90991, -242135, 211834, -58590, -257918, 90144, 176896, -181220, 18651]
11276c60358J78556d0653B55522j6048G3102J11409J1439c3284A07896K42185
11266C50081m3919d3429q8481K1313n7257O3622K9453C31830j34323g174p1660
11255g8834k4491L3402C42299e5801A9787b44700A33310L4810K07781b6517o6913
11244i3430C5924h5375n8528A24342J52168K8727j34145a40247q183B81582g3109
11232A14616b92400A61288c30475e041j22664j17415L8159A17467J23084m6310
11222A94241a07032B19838H9492a37388K2870H5338a59837A0213a4004l09678
11212c23682C1486a01603p7681j61649H4147c68198J45969A81253p4053c34780
11201g1787k52577G3006M5975j6396b9607l8714J3356j05821H9947a71161h1035
$$ y = [-360358, -181802, -40653, 255522, 239474, 73102, 184511, 195950, -33284, 107896, 350081, 306162, -43429, -131910, -110597, -167854, -104232, -74779, 331830, 197507, -7174, -78834, -103325, -69923, 342299, -55801, 19787, -244700, 133310, 168120, 375901, -26517, -93430, 35924, -85375, -143903, 124342, 276510, 305237, 171092, -140247, -148430, 281582, -73109, 114616, -292400, 161288, -330475, -5041, -127705, -245120, -206961, 117467, 240551, 194241, -107032, 219838, 89492, -137388, -114518, 85338, -159837, 10213, -14004, -323682, 31486, -101603, -179284, -340933, 84147, -368198, -222229, 181253, 107200, -334780, -71787, -324364, 73006, 118981, 102585, -29607, -68321, -54965, -160786, 89947, -171161, -81035]
11189b77663E3829L14047a04202q3873A2231b38896h5022B46250C6492c06093
11178a95221j5035i6110J8509C68407a00666A52920a94101D51532b30127B98260
11167E7340b1953A21540e1260k95320C54964a32506a3543k02922o9084a03507
11156a07420A7734b39096K9502g1769A20509a9462q9836A3167P7695C8582b42088
11144c4410B17464b75644B12742b95899C5718J04579E7642c0340B71868d0809
11133b80756A98336F8740R1140A2748L16346i5251A13209b32828C26205b49661
11122A28359c901B29752a89332A43111a0917D8796c1779l34444A02173d42935
11111B01752C7503P7168N041L61613C2456b88764B06018J6360M6816K64532k53051
$$ y = [-277663, 53829, 367876, -104202, -188075, 12231, -238896, -85022, 246250, 36492, -306093, -195221, -210256, -96110, -77601, 368407, -100666, 152920, -194101, 451532, -230127, 298260, 57340, -21953, 121540, -51260, -346580, 354964, -132506, -13543, -216465, -285549, -103507, -107420, 17734, -239096, -209594, -71769, 120509, -19462, -109298, 13167, 90862, 38582, -242088, -34410, 217464, -275644, 212742, -295899, 35718, 140297, 57642, -30340, 271868, -40809, -280756, 198336, 68740, 159880, 12748, 329094, -95251, 113209, -232828, 326205, -249661, 128359, -3901, 229752, -189332, 143111, -10917, 48796, -31779, -366223, 102173, -442935, 201752, 37503, 114671, 119712, 481325, 32456, -288764, 206018, 222378, 269194, 533726, 280675]
11100B80675j19163a34518A19174J54542k4192J37021q0659A9183a29818A41603
11089A75185a3130E2685J87243G3804A4352L34792P8768a09331d9955C23509k1956
11078C01553J16012H5090e3532A72123C7662K90711J70788A04968K01864D424
11067C69500j22500K66912j33417K52729j77974q7887Q5460J87000B44654J29341
11057C73995A73106L54246B19042L23427j34845L73359L6816l24478M00450k39879
11047F53892q013j7158M2814J91914l87460k0938L46678l61530K76904j35657
11037E81446L318p3882L7557L54541k83051m7652Q1778R7854l58222J64092K00358
11026G58137n5688l46434J90695j61291J03736J23035R4838j16790k53836k3915
$$ y = [280675, 161512, -134518, 119174, 273716, 249524, 386545, 305886, 19183, -129818, 141603, 175185, -13130, 52685, 239928, 73804, 14352, 349144, 427912, -109331, -49955, 323509, 301553, 417565, 85090, -53532, 172123, 37662, 328373, 499161, 104968, 306832, 4424, 369500, 247000, 513912, 380495, 633224, 455250, 367363, 452823, 639823, 244654, 373995, 173106, 527352, 219042, 542469, 407624, 780983, 817799, 493321, 893771, 653892, 645879, 628721, 671535, 863449, 475989, 455051, 801729, 440199, 717103, 581446, 584764, 510882, 548439, 902980, 619929, 572277, 654055, 751909, 393687, 557779, 758137, 702449, 356015, 546710, 385419, 489155, 612190, 707028, 590238, 336402, 312487]
11016C12487N0833N47927l63908K40290k99681J3955J44970l13747P2340L66181
11006G71647l49609P2499d4763F41063M6809l09238L78433k30617j66354R3593
10996D53689K82088o2322A72082M18479j02421K55570j3485j9999k03502m9776
10986D56948R7808K8133J95598K0441N0238Q9594k06748K63549L52475P2449J06720
10975A527205L52205J35375L93181j19656K18867l825k69082j35532j51363m28240
10965A519135k70133J14808q7829K38372r0320L28034j90343j16418k13095K6498
10955A258709j12964L62227j31867m71283N4720r5077l39516j7159j1415j9544
10945D76831b00337a7175A29987K01646j02634m2421a10016A92726a56329b7778
$$ y = [312487, 363320, 911247, 547339, 787629, 487948, 501903, 646873, 333126, 405466, 771647, 422038, 494537, -44763, 641063, 687872, 378634, 757067, 526450, 360096, 453689, 735777, 673455, 172082, 590561, 488140, 743710, 730225, 710226, 506724, 456948, 554756, 582889, 778487, 798928, 849166, 938760, 732012, 995561, 1348036, 1420485, 1527205, 1879410, 2014785, 2407966, 2288310, 2507177, 2503352, 2234270, 2098738, 1947375, 1519135, 1249002, 1363810, 1275981, 1514353, 1424033, 1752067, 1561724, 1445306, 1232211, 1258709, 1145745, 1507972, 1376105, 904822, 959542, 864465, 524949, 507790, 496375, 476831, -200337, -17175, 129987, 331633, 228999, 186578, -110016, 192726, -156329, -27778]
10934F1468P6630N7347J65266A50844F0252P0297i3119f383j89990k69587a1961
10922i8885L6266I0350d8298m3850A97794e5280k0898I3359c2616C0680F892K38536
10910B45428d9510q4663B08738a63464a6916j81034B1968a31559j92458J11621
10900b12396F2664b6178B56343J5964G3506b59288P4848n6682d1440B69361b17517
10888E8732e8982J3191A22762c9571B1192b20671A59303O0638B8998J48371b03406
10876b00564C5771i8962A88407e5960j68810Q7758M4367A00987D2142e6939o2098
10865a19037A38339J44911b05773E510b34450H6970j0172a16292j16122B216Q8210
10854I0426b5922B21622a74098I1172L0878a57445f0464l4187A41376J66932i2644
$$ y = [61468, 138098, 195445, 360711, 150844, 60252, 130549, -93119, -6383, -196373, -465960, -11961, -98885, -62619, 90350, -48298, -92148, 197794, -55280, -76178, 93359, -32616, 30680, 6892, 245428, -49510, -134173, 208738, -163464, -16916, -197950, 21968, -131559, -324017, -212396, 62664, -26178, 256343, 272307, 73506, -259288, -184440, -241122, -41440, 269361, -217517, 58732, -58982, -45791, 122762, -39571, 21192, -220671, 159303, 219941, 28998, 177369, -203406, -200564, 35771, -98962, 188407, -55960, -224770, -137012, -92645, 100987, 42142, -56939, -119037, 138339, 283250, -205773, 5510, -234450, 86970, 76798, -116292, -232414, 2216, 90426, -25922, 221622, -174098, 91172, 122050, -157445, -60464, -94651, 141376, 308308, -92644]
10842a04865B85086F4250a76842c1379B26855k1132b76359H736a65296k3699F2310
10830D1133g2094C526b95420f2480j52348i4754C7174b353j50746k15020B6699
10818b09388D0073J39073o5178e4880j72221B651c95222a27964j92831B15864
10807a98021O0267j77342B4019i5736a209j00754A35494b25277g584k8359E0864
10795e2503A09932e1891j05240c7557D2517b1554p1141B14072a74582L8793k5132
10784a60921G706K62344g1279o018J6125A57764g7550A38106e0591C2566J17632
10773A50198c03431a2112k39178J15518A5749h3669A32241b82914B9930a60243
10762e1573B7159a2590G8509a39737O2235q5092A13864b4637B39652G9987h3997
$$ y = [-104865, 285086, 64250, -176842, -31379, 226855, 205723, -276359, 8736, -165296, -188995, 62310, 41133, -72094, 3526, -295420, -62480, -214828, -94754, 37174, -2353, -153099, -368119, 26699, -209388, 40073, 179146, 113968, -54880, -227101, 2651, -395222, -127964, -320795, 215864, -198021, -137754, -315096, 24019, -95736, -1209, -101963, 135494, -225277, -7584, -35943, 50864, -52503, 109932, -51891, -157131, -37557, 42517, -21554, -92695, 214072, -174582, -135789, -160921, 7706, 270050, -71279, -77297, -61172, 157764, -77550, 138106, -50591, 32566, 150198, -303431, -12112, -251290, -135772, 15749, -83669, 132241, -282914, 29930, -160243, -51573, 27159, -12590, 78509, -139737, -77502, -162594, 113864, -24637, 239652, 79987, -83997]
10750A60756D1523e3364n49H1656b75684a8108A95855b46663F7944b38448f6886
10738G8329J0534A9285K0016N0421g8686c1884A68958a71497J1323B89473a1518
10726D86137a79323M7020G2341a32977d0864k54195A24428f1474m7580a3564p6912
10715i0476C482a0852D0582f6352k8887L2177B35445m1528c2043B28762p9023
10704A49739h4557d655B14591a42264l3563A55484g3702k10952a37942D4262b54141
10692a8765j53006j2788A78183L69179E0229N09j748d81061a61272o6439a11031
10680a10672H1485a91586P9039j1135n6824A12115a2795p0734j21336f0761l6080
10669i6841C31494m1759D1213g2147K0699j01468L0558l3488b379j27831b06k82460
$$ y = [160756, 41523, -53364, -53913, 81656, -275684, -18108, 195855, -246663, 67944, -238448, -66886, 78329, 88863, 19285, 39301, 89722, -78686, -31884, 168958, -171497, -160174, 289473, -11518, 486137, -179323, -132303, 72341, -132977, -40864, -295059, 124428, -61474, -109054, -13564, -90476, 3482, -10852, 40582, -66352, -95239, -63062, 235445, 193917, -32043, 228762, 149739, -84557, -4655, 214591, -142264, -175827, 155484, -73702, -284654, -137942, 44262, -254141, -18765, -171771, -184559, 178183, 547362, 50229, 50738, 48990, -481061, -161272, -227711, -111031, -110672, 81485, -191586, -112547, -123682, -180506, 112115, -12795, -83529, -204865, -60761, -96841, 331494, 289735, 41213, -72147, -51448, -152916, -122358, -155846, -2379, -130210, -206, -282666]
10657b82666a33520N1859c5078o7907l6142B1572H763g3323k7409r5623l3230
10646b29585N3242f7014r6442C7248b69851i4492B80769C6825O4386d2391g073
10634B38490c30848K5143F2947L3257J47930G3961J54724l1117c19193B4642b28009
10622b81255g5757K7333A12812O7111c8799j46146P919b929l2897k86261J9646
10611c02441A47287c7329p2910D8207a82568k20535J10880c8612l6085l9141p6515
10600a90353h2722A71108b64289N3136C390J87328j9817A5473b38501J16590n3411
10589a75322P0592e949C5103a07296c9146o0701p5924B9627M05208A50744a01750
10577d83455B48948c3411j90014i5907q0121B62954c56620a23678B35047b78709
$$ y = [-282666, -133520, -81661, -35078, -102985, -139127, 21572, 8763, -73323, -100732, -196355, -229585, -176343, -67014, -163456, 37248, -269851, -94492, 280769, 36825, 101211, -42391, -7073, 238490, -330848, -305705, 62947, 96204, 244134, 73961, 228685, 197568, -319193, 24642, -228009, -281255, -75757, -48424, 112812, 179923, -38799, -184945, -177026, -2929, -35826, -322087, -302441, 147287, -37329, -110239, 48207, -182568, -403103, -292223, -38612, -74697, -113838, -190353, -82722, 171108, -264289, -211153, 3390, 190718, 170901, 15473, -238501, -121911, -175322, -104730, -5949, 35103, -107296, -39146, -99847, -175771, 29627, 434835, 150744, -101750, -483455, 248948, -33411, -223425, -95907, -176028, 262954, -356620, -123678, 235047, -278709]
10566a25950p5094E9339Q2100J9281c05191B21831J45249c59221a03084A68573
10555C02985q6780L938c5204A10267F824d5299k47867J2037b8305C60136b52916
10543B0281c9249C1583a66701m6659c424A99976E2811B2814a97905A0784J88475
10532A99259E0398a50367A34176k4584a64327M227I6042Q0118c9038j82244B47130
10520h5794L2727E1233a08419A12622a36834f5699j67623G1850b46174P6670e6407
10508a21913C5189K92673a02485a1299B19163l1242c01019A06355e5819j10609
10498a66428F1455c49579B43148N3864a09974A46380a45905a8469j65700A53263
10487B8363J0855L56379H5094K25864h2020A65002o8288L33507m9378q1454g1266
$$ y = [-125950, -201044, 59339, 141439, 160720, -305191, 221831, 367080, -359221, -103084, 168573, 302985, 216205, 220143, -35204, 110267, 6824, -45299, -293166, -281129, -28305, 360136, -252916, 20281, -39249, 31583, -166701, -213360, -3424, 199976, 52811, 22814, -197905, 10784, 199259, 50398, -150367, 134176, 109592, -164327, -160100, 96042, 176160, -39038, -221282, 247130, -85794, -53067, 51233, -108419, 112622, -136834, -65699, -233322, 71850, -246174, -169504, -56407, -121913, 35189, 327862, -102485, -11299, 219163, 187921, -301019, 106355, -55819, -166428, 61455, -349579, 243148, 297012, -109974, 146380, -145905, -18469, -184169, 153263, 28363, 39218, 395597, 85094, 310958, -82020, 165002, 96714, 430221, 380843, 299389, -71266]
10475A98242h2459B28999a73720D7210b54379A37216A3881L09304c5065j93841
10465b28906A7532P9535c10854J35608M855M9923e8946B98793D1178a31265e4833
10453C92940e3635K944k0373H1644i8063k8506D1655a9871A1192b12069O1324
10442a50745a2045m8192m9294A05638a57324n1785L4011E0603B0998J4060K52643
10431B87701b47080g8623m6918j22904q8781B44376j15819b23983h2211r0176
10421a72387N1200k0443N0794D52050F1320J09854b67745J24447A71335R2628
10411B63963f7315G3667a57919I1148d5734k62023B41425m4346i3381H3896h2361
10399A31452K26601b1891k47902m5691B25137N2998l962h529A71616b23076B22712
$$ y = [198242, -82459, 228999, -173720, 47210, -254379, 137216, 13881, 323185, -35065, -228906, 17532, 97067, -310854, -175246, -170391, -120468, -58946, 298793, 41178, -131265, -54833, 392940, -53635, -50691, -71064, 81644, -98063, -126569, 41655, -19871, 11192, -212069, -150745, -12045, -60237, -109531, 105638, -157324, -209109, -175098, 50603, 20998, 35058, 287701, -247080, -78623, -125541, -248445, -337226, 244376, 128557, -223983, -82211, -172387, -121187, -141630, -90836, 452050, 61320, 171174, -267745, -143298, 171335, 263963, -67315, 73667, -157919, 91148, -45734, -307757, 241425, 197079, -93381, 83896, -82361, 131452, 358053, -21891, -269793, -315484, 225137, 278135, 274173, -8529, 171616, -223076, 222712]
10387D97569A2218b73391C92760A07325D517J8329d3506B98705A13562Q6347g1226
10375B66774J3400Q191p5869G5054J85069j13973j6452M48617C9108L43918O3175
10364D46201p9443o121A79995R4984k8478L3496G5178M6022J33584J69923a9117
10352a1377C61984j57550N66949k89344A89763J32517J08491j64600b26151D56429
10341E80463j82343a99937d982A32938K50222a09831B26669j00891E9021M4158
10331A03179G522l276c1309C1465d78140D8492j4198K83155A36048b535k69151
10320b71686c6853m8234B86260E3919a94411C14000H7044L5829f4881C06033h4620
10308a96689R6709n4088l0346M2008E627M211K37090G5784d2778k17017B3037
$$ y = [497569, 12218, -273391, 392760, 107325, 4517, 22846, -43506, 298705, 113562, 199909, -71226, 266774, 280174, 288365, 212496, 75054, 260123, 146150, 129698, 578315, 39108, 383026, 446201, 366758, 360637, 179995, 274979, 246501, 279997, 75178, 121200, 254784, 424707, -19117, -11377, 361984, 204434, 771383, 482039, 189763, 322280, 430771, 266171, -226151, 456429, 580463, 398120, -199937, -4982, 132938, 383160, -109831, 226669, 125778, 59021, 103179, 7522, 4246, -31309, 31465, -478140, 48492, 34294, 317449, 136048, -2535, -271686, -36853, -85087, 286260, 53919, -194411, 314000, 87044, 122873, -64881, 306033, -84620, -196689, -99980, -154068, -184414, -142406, 5627, 9838, 246928, 75784, -42778, -259795, 23037]
10296b03252E6142M0905f6149A84035q587a19773q5036b4108k12426O8875A60414
10284I2227b03500d3009k3198j41088j55008J2401F7440g5899H047i979B7414
10272b12556r1735C49597H4147L82074d02337J70283c0082B4043g0162A98715
10261A36392F2364J52743J29538B6551K23840P8440m778j05965J10091f5272A73399
10249a38489B17854b2989I0264j771c4837k16291e4279b2159j11800a4202q6826
10238a01028l8836B848c36494Q2681A78730e2987j67244B96142b14269A06373
10227d15539B35584d2823G0395L00310H1645b6757J0901k39424G3490h7518a0115
10215E7241c09649a6048j85842C06897a87539B5164a16863a9338j51809j82904
$$ y = [-203252, 56142, 97047, -66149, 184035, 175448, -119773, -204809, -24108, -236534, -167659, 160414, 92227, -203500, -43009, -66207, -207295, -362303, -349902, 67440, -75899, 8047, -9979, 27414, -212556, -304291, 349597, 84147, 466221, -402337, -232054, -30082, 24043, -70162, 198715, 136392, 62364, 215107, 344645, 26551, 250391, 328831, 324053, 218088, 328179, -65272, 173399, -138489, 217854, -22989, 90264, 88493, -34837, -251128, -54279, -22159, -133959, -14202, -101028, -139864, 2848, -336494, -253813, 178730, -52987, -220231, 296142, -214269, 106373, -415539, 235584, -42823, 70395, 370705, 81645, -26757, -15856, -255280, 73490, -87518, -10115, 57241, -309649, -16048, -201890, 306897, -187539, 25164, -116863, -19338, -171147, -354051]
10205c54051B8128d1878o5245l6435e113k18826b3158F1028J43459a54310j48611
10194c02921I7055J26598b09778Q6633J9859F5949Q067M2960N9925a03213E7109
10182b56365n4607g7988j52728E1107a23558A95156N1855a31780j16551D2000
10171c24236a41584B62827j04692b7256A51457b66311c0022A5308a87210J1129
10161a76081f8084r4748B37083e2615H4442f2318B5925L4590b14699M8681n5698
10150b21716R1755m8228j32742A13711h2633C3796d46266A53751N5965b30116
10139a47827k1971B9160b62287d724C97229f9687h58n1284C60556b54859C2953
10127A57677b36926B48062e943I2376M6217a4430A36695a55194B34115E0245a26033
$$ y = [-354051, 28128, -41878, -107123, -143558, -5113, -223939, -23158, 61028, 204487, -154310, -302921, 97055, 223653, -209778, -123145, -103286, 65949, 74016, 116976, 176901, -103213, 57109, -256365, -310972, -77988, -230716, 51107, -123558, 195156, 247011, -131780, -248331, 42000, -324236, -141584, 262827, 158135, -27256, 151457, -266311, -30022, 15308, -187210, -176081, -68084, -162832, 237083, -52615, 84442, -62318, 25925, 60515, -214699, -166018, -221716, -129961, -178189, -310931, 113711, -82633, 33796, -446266, 153751, 209716, -230116, -147827, -169798, 29160, -262287, -4724, 397229, -69687, -858, -52142, 360556, -254859, 32953, 157677, -236926, 248062, -5943, 92376, 138593, -14430, 136695, -155194, 234115, 50245, -126033]
10115A53575b12128A04726c41949A23437J0036j1271e3338b2712k22594N8226
10105a87080d210l60209f913B17275m4786H2154o359b29209H7032L4380b61280
10093F1142G243B722P6794R0396a06232j33109e893J030j37604A957L7273G903
10080b32396I257a1086C18568c5062H7390a06020j58132D0609O8948g0524o7160
10069a37684B44037C7883a51328l1876P943I1718K17253e7164k97008A35432g491
10057A04005a73117m032a2871l447r7537E0689c90554c9870A39724c10274I9686
10045c11816d2313E1930J08757b66376e6307k88945A02786K279a29065e8989B537
10033c0697j63380A8579d5537A17344c06546D2768a17109B8378c1492j07980E4566
$$ y = [153575, -212128, 104726, -341949, 123437, 133473, 122202, -53338, -22712, -245306, -187080, -4210, -364419, -6913, 217275, 172489, 82154, 75795, -229209, 87032, 121412, -261280, 61142, 7243, 2722, 79516, 169912, -106232, -239341, -5893, -4863, -142467, 1957, 39230, 7903, -232396, 9257, -11086, 318568, -35062, 87390, -106020, -264152, 40609, 109557, -70524, -137684, 244037, 37883, -151328, -183204, -175261, 91718, 308971, -57164, -354172, 135432, -7491, 104005, -173117, -177149, -12871, -16318, -113855, 50689, -390554, -39870, 139724, -310274, 99686, -311816, -42313, 51930, 160687, -266376, -56307, -345252, 102786, 105065, -129065, -58989, 2537, -30697, -194077, 18579, -45537, 117344, -306546, 42768, -117109, 28378, -31492, -139472, 54566]
10021b72949b3205I7405b11985A9419b27538E1949b22569e3153A98456d283b022
10009E2863b51775M0543j6763c1452a5617m16882a5536j01655p0889c4756B425
9997b09556J8899e8490E61637d08941a99178d3255g978j02350I5966a02979K7334
9986g5645p050I7203c95325a35024l0708B91486D003f2909k63825D7629H667M63854
9974D72521a60365K2456j80716a1323F6826a42415N0650M0745C262N0311a06238
9962a58914j16358K7946k1000A17145b52732I879c1435C28156b35439c8056n9953
9951i8009j49425d7200l0218n4246j71505Q8892G3843j3224b29478j09855a43809
9939E267J19491d38683J99409A10643d18862C1267O9494b8256j335H126J12253
$$ y = [-272949, -23205, 97405, -211985, 19419, -227538, 51949, -222569, -53153, 198456, -4283, -2022, 52863, -251775, -211232, -227995, -31452, -15617, -432499, -15536, -117191, -188080, -34756, 2425, -209556, -190657, -58490, 561637, -408941, -199178, -43255, -7978, -110328, 95966, -102979, -75645, -82695, 97203, -395325, -135024, -165732, 291486, 4003, -62909, -326734, 47629, 8667, 472521, -160365, -137909, -318625, -11323, 66826, -142415, -91765, -51020, 3262, 53573, -106238, -158914, -275272, -247326, -268326, 117145, -252732, 9879, -31435, 328156, -235439, -38056, -98009, -247434, -47200, -77418, -131664, -303169, -214277, 73843, 60619, -229478, -339333, -143809, 5267, 124758, -438683, -239274, 110643, -418862, 31267, 100761, -28256, -29591, 8126, 120379]
9928A20379f3163B4877b4695B37491b14424j1644j18344J24004A88183b179j00428
9917a02607D1317J63353d14393J65416B24319H1613g2779B50986j4059b74508
9906A02124D7814a25896j55468J02440e7938j09819R928l36227E1003b28072i5814
9894D3250h474D1332K6850f1642B8580a81591e6379a7592F3393b09875a0046D33895
9881C0846b26999A52308n2694P3183n4613b35887a1117H3667N0951a9532j03038
9870a22570J5084E1620L5226b30313m7685F8974K487A5978b92006N1701J3178
9859b27127A65649a71768g9058k9337E98481A27284J22745b86476B40407b41879
9848A91246a14871b3912C06889a72338d5316j90312R1299d6807l8320K9970j1270
$$ y = [120379, -63163, 24877, -24695, 237491, -214424, -226068, -344412, -220408, 188183, -2179, -102607, 41317, 204670, -414393, -248977, 224319, 81613, -72779, 250986, 236927, -274508, 102124, 47814, -125896, -281364, -178924, -57938, -167757, -157829, -494056, 51003, -228072, -95814, 43250, -8474, 41332, 68182, -61642, 28580, -181591, -56379, -17592, 63393, -209875, -10046, 433895, 30846, -226999, 152308, 99614, 172797, 118184, -235887, -11117, 83667, 134618, -19532, -122570, -107486, 51620, 86846, -230313, -277998, 68974, 71461, 15978, -292006, -240305, -227127, 165649, -171768, -79058, -108395, 598481, 127284, 250029, -286476, 240407, -241879, 191246, -114871, -23912, 306889, -172338, -45316, -235628, -144329, -46807, -85127, -55157, -66427]
9837f6427a8902p2783B9863e0163N715A1429b2903r6026B2323i285E5779a55325
9824b76811k4442e8898E6469j6620L05566a71661p0937j08567D7922b48599H4887
9812a55491B42106a98945E34M0902i3590k60965C02076g0254C0016a51437I5590
9800b6704k73388C1982K6527c12542f4501A19613c1653A05393i5774k4954j31009
9789b51737L047R5832a6922k40808B08581d57684J60367B65572e78019a26180
9778b37326L2182k98499b48267j8379G2984J54255B812O0902j9823d20471a37169
9766b00765o799N2257E1898a92635A1352K21489i7092L7570A64866f0125A71084
9754a33570A46386L3709a26088A18643C7708J2197J03682b90678N7882e6542j10332
$$ y = [-66427, -18902, -91685, 29863, -50163, -44448, 11429, -22903, -118929, 22323, -9285, 55779, -155325, -276811, -301253, -58898, 56469, 39849, 345415, -171661, -242598, -351165, 47922, -248599, 84887, -155491, 242106, -198945, 534, 41436, -93590, -354555, 302076, -70254, 30016, -151437, 95590, -26704, -300092, 31982, 58509, -312542, -64501, 119613, -31653, 105393, -95774, -120728, -251737, -248690, -152858, -16922, -257730, 208581, -457684, -297317, 265572, -578019, -126180, -237326, -205144, -503643, -248267, -266646, 72984, 227239, 2812, 63714, 43891, -420471, -137169, -200765, -207564, -155307, 51898, -192635, 11352, 232841, -97092, -59522, 164866, -60125, 171084, -133570, 146386, 180095, -126088, 118643, 37708, 49905, 153587, -290678, -232796, -56542, -166874]
9743a66874l41980b21733g0710A32262J29105a21029p5231C4751b53688a05227
9732a72685e8477F0187R1336a22203N8074G958Q159K46514b60070A5191a5732
9720G4131a28267j7694K3613A18448D5212c30042h3343A27204l3678a79665m9501
9709b29166e8606d900r5320A7062h9720j43761A29138c28060C2773g6130q9874
9698a66004O2565j08570b5939A39204c35347H1629O1338j0751b81046G1172a48459
9686D1683d8432r8071A55605E0098b0326E4325b01067M4710H5000O4069A7819
9674g4951A28838b43494K6203j03337N9919r2630e8442k11688A81714a92110o751
9663a98861b9573l1258r966A86359a77235E3087b95182J35494r5305c9212a2107
$$ y = [-166874, -508854, -221733, -70710, 132262, 261367, -121029, -196260, 34751, -253688, -105227, -172685, -58477, 60187, 151523, -122203, -64129, 7958, 16117, 262631, -260070, 15191, -15732, 74131, -128267, -145961, -122348, 118448, 45212, -330042, -83343, 127204, 93526, -179665, -229166, -58606, -4900, -100220, 17062, -89720, -233481, 129138, -328060, 32773, -76130, -166004, -103439, -212009, -25939, 139204, -335347, 81629, 142967, 132216, -281046, 71172, -148459, 41683, -48432, -146503, 155605, 50098, -20326, 54325, -201067, -156357, 85000, 149069, 17819, -74951, 128838, -243494, -217291, -320628, -260709, -353339, -58442, -270130, 181714, -192110, -198861, -29573, -60831, -70797, 186359, -177235, 53087, -295182, -159688, -254993, -39212, -12107]
9651c65015R3854C08820j33518a40526j65499a20587F9753a8334o3586A07449
9640b32492a3972j98407J00188j1375m0778C9753c2354l97391Q1973J45456A20650
9628A38052K1802b9298A2375L0055F29R6826m4307g9268B07201r7813b78259a26163
9615B9384e2871G7375a8002j48179I2191a70698l4492A71084a41563b5145l238
9604b8383A49787E7974a51905g1907r8618M2369j10194H690a5661k52923E9384
9592F020Q331d1997H600b77773H965b28920N2419B06901c0828m73150c0906H4785
9579a48271e3055a857k65698A80118b59854a19536A97202i1919A67338L0290e27444
9567b17830j3946A4883h9151K4690D1114d72543a11220p3778g0806j02381Q0080
$$ y = [-365015, -271161, 308820, 175302, -140526, -306025, -120587, 69753, -18334, -81920, 107449, -232492, -13972, -212379, -112191, -123566, -164344, 39753, -32354, -429745, -347772, -202316, 120650, 138052, 159854, -29298, 12375, 42430, 629, 97455, 53148, -79268, 207201, 109388, -278259, -126163, 29384, -52871, 77375, -18002, -166181, 92191, -170698, -205190, 171084, -141563, -25145, -28383, 149787, 57974, -151905, -71907, -170525, -128156, -238350, 8690, -15661, -268584, 59384, 6020, 14351, -41997, 8600, -277773, 8965, -228920, -176501, 206901, -30828, -503978, -30906, 84785, -148271, -53055, -1857, -267555, 180118, -259854, -119536, 197202, -91919, 167338, 197628, -527444, -217830, -231776, 14883, -89151, -64461, 41114, -472543, -111220, -184998, -70806, -173187, -93107]
9556i3107D2902b09267B02091q5636c7538q5571B81827a49802j60449R9893E3686
9544F2326Q0329o9382c51558B29240a28722L6817n3169j25981B18700g0274r7905
9533a68179l4790m4984D7519e4572G2341h557k46979A427d16041D0833b2283A01891
9520c45k15869c2743m7637o5026e5020r7302N7631a156A38965B8964a41179A25856
9507A36952M5759m130b15504Q1109A77830l562a17131B0656b60147K3256F6113
9495c81748B04457h332l35261e1647E7651J28592M5169I7600k3025P8500i832
9483c09972a39165p3943J2174B7603J48142d74898b27846N3740G3506O9165b0396
9471a15404l3491j68241l1734O1075K0066D964b6140q7027j56371N4943b17k44867
$$ y = [-93107, 42902, -209267, 202091, 116455, -37538, -123109, 281827, -149802, -310251, -210358, 53686, 62326, 142655, 73273, -351558, 229240, -128722, -91905, -145074, -271055, 218700, -70274, -168179, -202969, -247953, 47519, -54572, 72341, -8557, -255536, 1427, -416041, 40833, -22283, 101891, -345, -216214, -32743, -80380, -145406, -55020, -152322, -94691, -1156, 138965, 28964, -141179, 125856, 136952, 182711, 178581, -215504, -134395, 177830, 174268, -117131, 20656, -260147, -236891, 66113, -381748, 204457, -8332, -343593, -51647, 57651, 186243, 231412, 97600, 74575, 153075, -9832, -309972, -139165, -213108, -200934, 27603, 175745, -474898, -227846, -174106, 73506, 142671, -20396, -115404, -148895, -317136, -348870, -287795, -267729, 4964, -26140, -113167, -269538, -214595, -217, -245084]
9459b45084d6956A46205G2754b4439j11039C9645c8600k69899C8143P4375c01739
9447d6217I2146N4372c01462j68994a50904j3086P0002A62505c23796C8611a76488
9435d7446k38295p5689J30940a14482K113j98339i6654B70930c28845Q0410i4156
9423d36020I2904b76612A99929e81847a67234A39743a96420R4307p1977j78751
9413c52841B91382M9829j37490h6636E9664O956J65206C5143F20M73811c08466
9401H0764J92974F4762b0620A10737d414j70722B84430B7409c67587A43427a79243
9389a36245N0992e981j32621a481m61470K20986p0406a37993j02171P6674F1642
9377e8917j1148k7865B83691I2805C6884i7787A9587i4488L8705I0504d3290j02049
$$ y = [-245084, -46956, 146205, 72754, -24439, -135478, 39645, -38600, -308499, 38143, 112518, -301739, -46217, 92146, 146518, -301462, -470456, -150904, -163990, -93988, 162505, -323796, 38611, -176488, -47446, -285741, -361430, -230490, -114482, -112369, -310708, -96654, 270930, -328845, -248435, -94156, -436020, 92904, -276612, 199929, -581847, -167234, 139743, -196420, -102113, -174090, -352841, 291382, 341211, 203721, -86636, 59664, 66620, 231826, 35143, 620, 474431, -308466, 80764, 273738, 64762, -20620, 110737, -4414, -175136, 284430, 27409, -367587, 143427, -179243, -136245, -85253, -5981, -138602, -1481, -462951, -241965, -312371, -137993, -240164, -163490, 61642, -58917, -70065, -97930, 283691, 92805, 36884, -97787, 19587, -94488, -55783, 90504, -43290, -145339]
9365a45339C823b94190A5406J21564D6242i6106c3738E9397b67798G3817k6829
9354D6988a29208k65535G3710j6627J25157b1201p1782M583j18302B16855a64023
9342E4463J00044a08618p943B52403b96257R8089C64431I0957e7371l07779E737
9330B22911a83594B27676E5490a01215P456l7420d6237B24220c485q4249M3617
9319d4117K0836j12217A90105B6336h2999B3739L68560b92401B26618h5063C6228
9307F724a58530J2356A94272c27656h1180D5939J6914h5919K6179C4657a92731
9295b14149g6655k54940L2085h2602j05216C39745A04737a5802A8537d72736n1385
9284e24121A46118a28656J1165H3284a25428p6812K0151L1607a8527j2223l60201
$$ y = [-145339, 3823, -294190, 15406, 136970, 46242, -96106, -33738, 59397, -267798, 73817, 46988, -129208, -394743, 73710, 57083, 182240, -21201, -92983, -88400, -206702, 216855, -164023, 54463, 154507, -108618, -116561, 252403, -296257, -198168, 364431, 90957, -57371, -365150, 5737, 222911, -183594, 227676, 55490, -101215, -93759, -131179, -46237, 224220, -3485, -87734, -44117, -23281, -135498, 190105, 26336, -82999, 23739, 392299, -292401, 226618, -85063, 36228, 6724, -158530, -146174, 194272, -327656, -81180, 45939, 62853, -85919, -59740, 34657, -192731, -214149, -76655, -331595, -299510, -82602, -187818, 339745, 104737, -15802, 18537, -472736, -524121, 146118, -128656, -117491, 83284, -125428, -202240, -182089, -150482, -18527, -30750, -390951]
9273c90951J70134j2171C92227a29800j30908e6140b3062r8906B61292k4821c72899
9261C9465c6204j21796k75119B1008a56094N2143k90661E6944k2182B990R0337
9250I3327a88185j87767I5079a56292L6299j27494B64080a22557A67784p3056
9240I4728O7727e8218I2376A3634a60073B4914O8519a79186a6633A82444a076
9228b08447B21823c41054B65433b05759A06661c32405a52818k21327J74809g5353
9217A40564E8849c02578A23241O170b2885C2166a59136I6844a40158B26846c18696
9205f4714A97509B3698c7355j22489J4708J1692j05215O8602B30235r2227g2168
9193A98116N2172b41826A89519K04022a02264j9329B81418b28913h1268j36360
$$ y = [-390951, -220817, -232988, 392227, -129800, -260708, -56140, -23062, -121968, 261292, 236471, -372899, 39465, -36204, -158000, -433119, 21008, -156094, -103951, -394612, 56944, 34762, 2990, 93327, -188185, -375952, 95079, -156292, -119993, -247487, 264080, -122557, 167784, 94728, 162455, -58218, 92376, 13634, -160073, 24914, 93433, -179186, -16633, 182444, -1076, -208447, 221823, -341054, 265433, -205759, 106661, -332405, -152818, -374145, -199336, -75353, 140564, 58849, -302578, 123241, 129411, -22885, 32166, -159136, 96844, -140158, 226846, -318696, -64714, 197509, 23698, -37355, -159844, -145136, -133444, -238659, -170057, 230235, 138008, -72168, 198116, 250288, -241826, 189519, 393541, -102264, -121593, 281418, -228913, -81268, -217628]
9183b17628G7757c89441g4658A488a96822L8787a0550r0694H693a27855D725a48092
9170a84230O0144l82141J86626J37560B64128r8657a28879L2976q3118E5550b1992
9158a9080B03541I3713P744b6315k40102A09680c7524k67166F2370d15120J84427
9147b30693R3024f2509j3043n6104m3733d9242l89183q9989b22053a0023l37564
9136c47587G4484a89094n3126A24030c24339a32462j41982L6675a04727k8950
9126a33677o0470A22443m3483a19259k91477J69433k03025A43052b0481B5486
9115d89375B6274Q801a52542O3705H2328C1475d7848b970C34668a40811o7358
9104b08169i3884n86A2769a98499h7326G2844a38504d7302l50520J74508b1400
$$ y = [-217628, 77757, -389441, -74658, 1488, -196822, -158035, -10550, -101244, 8693, -127855, 4725, -148092, -184230, -124086, -506227, -319601, -182041, 264128, 165471, -128879, -95903, -179021, 55550, -21992, -19080, 203541, 93713, 101457, -26315, -266417, 109680, -37524, -304690, 62370, -415120, -230693, -137669, -62509, -75552, -131656, -175389, -49242, -438425, -528414, -222053, -10023, -347587, 74484, -189094, -242220, 124030, -324339, -132462, -274444, -237769, -104727, -133677, -194147, 122443, 78960, -119259, -410736, -241303, -444328, 143052, -20481, 25486, -489375, 26274, 35075, -152542, -88837, 82328, 31475, -47848, -2970, 334668, -140811, -208169, -93884, -94470, 12769, -198499, -87326, 72844, -138504, -47302, -397822, -223314, -21400]
9092a99768F7408a63362N1026d6624j12848n3813C4569i4608j74131j8827J33611
9081a53955b2237A68634a10996A04972a40086A50327e007l7707m5252A54899a81662
9069e0531B10650a10455m99747a44140r0169P6265j05165o7657n7779m8007A37702
9057C31777j40369a16555b5484O082e385b06j48337L5869o6745k7012A96584b02789
9044A38674B449J19992K31587i2795H2202e5895j10008A91274J3458i8002j38502
9033b36504A4465J50249G5846b26995i5862L2810D0839b68042B98025C0115c55795
9021g4603c2948q9785A56456a88380L2143J3370A76506j4518b540l56204A61448
9009b2126j44760j51616C9398d978F0355P7842c65123C61917j44703h4672C8473
$$ y = [-199768, 67408, -163362, -112336, -46624, -159472, -213285, 34569, -94608, -268739, -287566, -153955, -22237, 168634, -110996, 104972, -140086, 150327, -5007, -42714, -87966, 154899, -181662, -50531, 210650, -110455, -610202, -144140, -234309, -158044, -263209, -330866, -388645, -436652, 137702, 331777, 191408, -116555, -25484, -19402, -5385, -206, -148543, -112674, -179419, -206431, 196584, -202789, 138674, 2449, 122441, 354028, -92795, 82202, -55895, -165903, 191274, 204732, -98002, -236504, 14465, 164714, 75846, -226995, -95862, -63052, 40839, -268042, 298025, 30115, -355795, -74603, -32948, -122733, 156456, -188380, -156237, -142867, 176506, 161988, -2540, -358744, 161448, -22126, -166886, -318502, 39398, -4978, 60355, 138197, -365123, 361917, 217214, -84672, 38473]
8997d3129n3286I7670e4453p5451m0802b4343B19416b3553l92730c1075n8656
8986h9731E7937a71931D2551i2113d0961j67767Q6491q7170E957g5727N436k53795
8974c24086i9467I1010f0547a1311I731Q4224g6168B14805b71466B08346d1729
8962a9518m0234k21599J00478I2945b9068j34465k28465J19646o3443D19717j32710
8951B87007C0739d7026B6300a59163E9351c933p6326A68995O7841g5219k92401
8940c67620D17594b74342A14626B4994h18F4957C1845L20366A68550A6326J69750
8929A86076c7798n6888d2748n5324F28063k34959J681050L009990N179724D357073
8918A546270E42264B36000a27007A92905K4408J37180b23064D8698q142K52025
$$ y = [-43129, -96415, 97670, -54453, -129904, -170706, -24343, 219416, -23553, -416283, -31075, -89731, 57937, -171931, 42551, -92113, -40961, -208728, -122237, -209407, 5957, -75727, -70291, -324086, -99467, 91010, -60547, -11311, 9731, 93955, -76168, 214805, -271466, 208346, -41729, -19518, -59752, -281351, -180873, 92945, -29068, -163533, -391998, -272352, -335795, 419717, 287007, 30739, -47026, 26300, -159163, 59351, -3933, -80259, 168995, 236836, -75219, -367620, 417594, -274342, 114626, 24994, -818, 64957, 31845, 352211, 168550, 16326, 186076, -37798, -94686, -42748, -98072, 628063, 393104, 2074154, 5084144, 10263868, 4357073, 1546270, 542264, 236000, -127007, 192905, 217313, 354493, -223064, 48698, 40556, 292581]
8908B92581K78502B77465j32700f5692a6593l03600f7305D493d9337l25148E9925
8896A7073a99336C88955c54990c7995k64133A64749i5352M4269A7210g1092o9549
8885a40641e4318j1553A08632c85879J43000J6458d2331r4015K4395N5269j46996
8874b03678B03629a64279o3616G8497c00765a3062j42817A26019K0668D0684O0271
8863A00955a79819p6196a05117A04610b3544j30844L1905k867l14017J20306B10330
$$ y = [292581, 571083, 277465, 144765, -65692, -16593, -320193, -67305, 4493, -49337, -374485, 59925, 17073, -199336, 388955, -354990, -37995, -302128, 164749, -95352, -51083, 17210, -71092, -140641, -54318, -65871, 108632, -385879, -242879, -226421, -42331, -136346, -111951, -56682, -203678, 203629, -164279, -227895, 78497, -300765, -13062, -155879, 126019, 146687, 40684, 100955, -179819, -256015, -105117, 104610, -23544, -154388, -122483, -125350, -439367, -319061, 210330]
$$ [...]
##END NTUPLES=NMR SPECTRUM
##END=
