
##TITLE=UV1110_M2_1290-1353_7180635_9q4j7LhjMn
##JCAMPDX= 6.0         $$ Bruker NMR JCAMP-DX V2.0
##DATA TYPE= NMR SPECTRUM
##DATA CLASS= NTUPLES
##ORIGIN= BRUKER
##OWNER= Administrator
$$ 1.72 TOPSPIN		Version 2.1
$$ 2012-12-05 00:03:32.052 -0500  Administrator@X
$$ Compression mode = diff/dup
##.OBSERVE FREQUENCY= 400.02188249412
##.OBSERVE NUCLEUS= ^1H
##.ACQUISITION MODE= SIMULTANEOUS (DQD)
##.ACQUISITION SCHEME= undefined
##.AVERAGES= 8
##.DIGITISER RES= 22
##SPECTROMETER/DATA SYSTEM= spect
##.PULSE SEQUENCE= zg30
##.SOLVENT NAME= COFFEE_meoh
##.SHIFT REFERENCE= INTERNAL, COFFEE_meoh, 1, 14.98509
##AUDIT TRAIL= $$ (NUMBER, WHEN, WHO, WHERE, PROCESS, VERSION, WHAT)
$$ ##TITLE= Audit trail, TOPSPIN		Version 2.1
$$ ##JCAMPDX= 5.01
$$ ##ORIGIN= Bruker BioSpin GmbH
$$ ##OWNER= Administrator
$$ $$ E:\/data/COFFEE/nmr/UV1110_M2_1290-1353_7180635_9q4j7LhjMn/10/pdata/1/auditp.txt
$$ ##AUDIT TRAIL=  $$ (NUMBER, WHEN, WHO, WHERE, PROCESS, VERSION, WHAT)
(   1,<2012-12-05 00:03:23.818 -0500>,<Administrator>,<X>,<go>,<TOPSPIN 2.1>,
      <created by zg
	started at 2012-12-05 00:02:17.661 -0500,
	POWCHK enabled, PULCHK disabled,
       configuration hash MD5:
       86 BA 57 50 F2 9D 5C 9B 26 00 A9 28 5F 66 2E 89
       data hash MD5: 64K
       9F 7A 4A BF DA A4 A4 75 17 7D F0 D5 A9 6E DF E1>)
(   2,<2012-12-05 00:03:26.896 -0500>,<Administrator>,<X>,<proc1d>,<TOPSPIN 2.1>,
      <Start of raw data processing
       efp LB = 0 FT_mod = 6 PKNL = 1 PHC0 = 0 PHC1 = 0 SI = 32K 
       data hash MD5: 32K
       6A 29 65 3E 3D 7A 52 94 6D 0D 69 08 8F B3 C8 44>)
(   3,<2012-12-05 00:03:27.365 -0500>,<Administrator>,<X>,<proc1d>,<TOPSPIN 2.1>,
      <pk PHC0 = 94.48242 PHC1 = 0 
       data hash MD5: 32K
       D6 79 DA 16 33 67 B4 4C 92 96 7F 45 A7 DA D6 74>)
(   4,<2012-12-05 00:03:27.599 -0500>,<Administrator>,<X>,<proc1d>,<TOPSPIN 2.1>,
      <abs ABSG = 1 
       data hash MD5: 32K
       3A 75 18 D3 59 76 71 B1 55 F0 3F 91 B3 DC E2 8C>)
(   5,<2012-12-05 00:03:27.740 -0500>,<Administrator>,<X>,<proc1d>,<TOPSPIN 2.1>,
      <abs ABSG = 2 
       data hash MD5: 32K
       67 D2 8D BF 57 E4 5F FA 3C C1 8D 06 5B ED 63 4D>)
(   6,<2012-12-05 00:03:27.880 -0500>,<Administrator>,<X>,<proc1d>,<TOPSPIN 2.1>,
      <abs ABSG = 3 
       data hash MD5: 32K
       8D FC 81 88 F6 05 CA B9 B5 97 74 9E 45 7F 97 95>)
(   7,<2012-12-05 00:03:28.021 -0500>,<Administrator>,<X>,<proc1d>,<TOPSPIN 2.1>,
      <abs ABSG = 4 
       data hash MD5: 32K
       5B 05 C1 A1 08 BA 77 9B 9A 6D 13 64 4B 62 18 E1>)
(   8,<2012-12-05 00:03:28.177 -0500>,<Administrator>,<X>,<proc1d>,<TOPSPIN 2.1>,
      <abs ABSG = 5 
       data hash MD5: 32K
       BD 47 39 F8 01 BE 97 5F C1 F4 A3 85 73 C3 7E BC>)
$$ ##END=
$$ 
$$ $$ hash MD5
$$ $$ BD F5 F0 09 D7 10 6B 7F 7D 41 C9 0D 8F 21 76 F6
##$RELAX= 
##$RELAX= 
##$RELAX= 
##$RELAX= 
##$RELAX= 
##$RELAX= 
##$RELAX= 
$$ Bruker specific parameters
$$ --------------------------
##$DU= <E:\>
##$EXPNO= 10
$$ [...]
##$TP= (0..7)
150 150 150 150 150 150 150 150
##$TP07= 0
##$TPNAME0= <>
##$TPNAME1= <>
##$TPNAME2= <>
##$TPNAME3= <>
##$TPNAME4= <>
##$TPNAME5= <>
##$TPNAME6= <>
##$TPNAME7= <>
##$TPOAL= (0..7)
0.5 0.5 0.5 0.5 0.5 0.5 0.5 0.5
##$TPOFFS= (0..7)
0 0 0 0 0 0 0 0
##$TUNHIN= 0
##$TUNHOUT= 0
##$TUNXOUT= 0
##$USERA1= <user>
##$USERA2= <user>
##$USERA3= <user>
##$USERA4= <user>
##$USERA5= <user>
##$V9= 5
##$VALIST= <valist>
##$VCLIST= <CCCCCCCCCCCCCCC>
##$VD= 0
##$VDLIST= <DDDDDDDDDDDDDDD>
##$VPLIST= <PPPPPPPPPPPPPPP>
##$VTLIST= <TTTTTTTTTTTTTTT>
##$WBST= 2048
##$WBSW= 25
##$XGAIN= (0..3)
0 0 0 0
##$XL= 0
##$YL= 0
##$YMAX_a= 671265
##$YMIN_a= -570136
##$ZGOPTNS= <>
##$ZL1= 120
##$ZL2= 120
##$ZL3= 120
##$ZL4= 120
##$ABSF1= 14.98509
##$ABSF2= -5.573092
##$ABSG= 5
##$ABSL= 3
##$ALPHA= 0
##$AQORDER= 0
##$ASSFAC= 0
##$ASSFACI= 0
##$ASSFACX= 0
##$ASSWID= 0
##$AUNMP= <proc_prof1d_extract_pilot.lims>
##$AXLEFT= 0
##$AXNAME= <>
##$AXNUC= <1H>
##$AXRIGHT= 0
##$AXTYPE= 0
##$AXUNIT= <>
##$AZFE= 0.1
##$AZFW= 0.1
##$BCFW= 0
##$BC_mod= 0
##$BYTORDP= 0
##$COROFFS= 0
##$CY= 15
##$DATMOD= 1
##$DC= 0
##$DFILT= <>
##$DTYPP= 0
##$F1P= 0
##$F2P= 0
##$FCOR= 0.5
##$FTSIZE= 32768
##$FT_mod= 6
##$GAMMA= 0
##$GB= 0
##$INTBC= 1
##$INTSCL= 1
##$ISEN= 128
##$LB= 0
##$LEV0= 0
##$LPBIN= 0
##$MAXI= 10000
##$MC2= 0
##$MEAN= 0
##$ME_mod= 0
##$MI= 0
##$NCOEF= 0
##$NC_proc= -8
##$NLEV= 6
##$NOISF1= 0
##$NOISF2= 0
##$NSP= 0
##$NTH_PI= 0
##$NZP= 0
##$OFFSET= 14.98509
##$PC= 1
##$PHC0= 94.48242
##$PHC1= 0
##$PH_mod= 1
##$PKNL= yes
##$PPARMOD= 0
##$PPDIAG= 0
##$PPIPTYP= 0
##$PPMPNUM= 2147483647
##$PPRESOL= 1
##$PSCAL= 4
##$PSIGN= 0
##$PYNMP= <proc.py>
##$REVERSE= no
##$SF= 400.02
##$SI= 32768
##$SIGF1= 0
##$SIGF2= 0
##$SINO= 400
##$SIOLD= 32768
##$SPECTYP= <>
##$SREGLST= <1H.CDCl3>
##$SSB= 0
##$STSI= 32768
##$STSR= 0
##$SW_p= 8223.68421052631
##$SYMM= 0
##$S_DEV= 0
##$TDeff= 65536
##$TDoff= 0
##$TI= <>
##$TILT= no
##$TM1= 0
##$TM2= 0
##$TOPLEV= 0
##$USERP1= <user>
##$USERP2= <user>
##$USERP3= <user>
##$USERP4= <user>
##$USERP5= <user>
##$WDW= 1
##$XDIM= 32768
##$YMAX_p= 484402534
##$YMIN_p= -686228
##$CURPLOT= <Network HP LaserJet P1505>
##$CURPRIN= <$Network HP LaserJet P1505>
##$DFORMAT= <normdp>
##$LAYOUT= <+/1D_H.xwp>
##$LFORMAT= <normlp>
##$PFORMAT= <normpl>
##$SURQMSG= 1
$$ End of Bruker specific parameters
$$ ---------------------------------
##NTUPLES= NMR SPECTRUM
##VAR_NAME=  FREQUENCY,     SPECTRUM/REAL,   SPECTRUM/IMAG
##SYMBOL=    X,             R,               I
##VAR_TYPE=  INDEPENDENT,   DEPENDENT,       DEPENDENT
##VAR_FORM=  AFFN,          ASDF,            ASDF
##VAR_DIM=   32768,         32768,           32768
##UNITS=     HZ,            ARBITRARY UNITS, ARBITRARY UNITS
##FACTOR=    0.250966925370066, 1,           1
##FIRST=     8223.43324360094, 83244,        -1026
##LAST=      0,             -362067,         -23789
##MIN=       0,             -686228,         0
##MAX=       8223.43324360094, 484402534,    0
$$ Real data points
##PAGE= N=1
##DATA TABLE= (X++(R..R)), XYDATA
$$ [...]
23823 327493 90821 -124151 -411783 -386026 -144560 -5193 -215836 209844 85519 -51523 352827
23811 20716 -29320 -774 -114986 -13910 89626 -121312 -118017 -68059 -297801 -43058 -356110
23800 -356110 74658 -343237 -254276 18988 178768 -63270 89256 -26667 -343277 -180886 120232
23788 93300 106304 -122130 -96954 152858 132872 189769 149746 -197629 -68429 10721 205083
23777 205083 -70862 -391866 -108852 62378 76737 -69194 30292 13649 38192 -197440 -215329
23766 -215329 -321654 -149419 -312089 -86984 -15143 168734 -210398 -249477 120857 271484
23756 271484 -15030 -97825 -210300 -257463 -252695 247726 -244335 -297669 -280563 40913 -183971
23744 -142550 8223 129249 301058 -190173 267760 169670 -31167 358134 -14889 -289405
23734 -289405 -98714 -45214 -12272 32276 37724 -386364 268582 351794 149666 -115441 126325
23722 -256433 39632 129600 24554 40725 109891 105976 25779 76498 24128 115240 42849 -158181
23709 -321762 -45254 -71488 41759 6949 -49647 -63120 -160480 304715 163830 9924 -31392
23697 74924 -51275 -18078 -117384 -86143 275787 113651 -16808 33988 320884 -40381 -36058
23686 -36058 -199842 63883 -307429 144527 -66684 -301416 -62235 212139 -132636 -195077
23676 -195077 105945 6575 120498 14400 50389 112265 51902 -48273 34680 -280167 232171
23664 -230336 8401 -115184 162545 -142713 54436 182546 -241608 -149970 299043 -286800
23653 -50760 -104998 114295 333823 -36655 -7651 -318639 -191733 63319 -116701 76087 -202933
23641 -152990 -50891 -258135 205370 211660 20264 48887 -98272 -10409 -41194 11262 -25475
23629 -92922 -111475 -145423 -142176 21243 -163580 105016 62830 175575 -214261 130464 104878
23618 104878 -113928 131837 -11827 -399812 -173910 27787 -55799 -227207 -217450 136154
23607 -173391 -214586 70553 33422 -129277 -36751 -302379 -203916 -69804 -247304 -7374 149088
23595 55465 -328233 27360 -433751 61908 199317 53468 95177 151005 102036 -332169 133565
23583 -118287 209236 162644 36651 22365 163358 -197809 120845 -272084 298605 -90838
23572 -302702 -357085 74232 -213803 177734 253769 -196332 -303003 126163 -61037 -309320
23562 -309320 -213423 -44566 28661 -378182 180648 -140029 -195693 -122335 -69088 14868 223209
23551 223209 -50644 97758 167388 -265279 -54340 -133086 113951 91887 -291117 -83387 204241
23539 69918 -92332 488652 -442728 -344963 224952 -139897 115494 -375558 200392 143314
23529 143314 223013 -96114 74998 33164 -7658 -359949 144376 189506 296 -26204 -211780
23518 -211780 134771 -70162 29468 87830 32195 269245 129158 21589 -181897 100396
23507 -97912 -313221 259319 -109788 -9887 215827 -203812 -255519 33510 142231 33738 129077
23496 129077 -6135 -936 114146 -422638 24697 -330919 -144284 199853 -80284 -296280 -160186
23485 -160186 190480 -177324 141252 160130 -160655 -33484 44619 -167473 449090 95388
23474 -290038 50541 -179490 269682 -325428 413185 30815 -62936 -46146 -140308 -27847 268597
23462 -24173 -155694 58464 122387 -99335 -38142 -114211 124436 -93925 86205 -223584 -296952
23451 -296952 -27538 -161543 -122267 -77564 -591946 414736 4981 -155204 -118523 -24064 31189
23439 -261185 33866 263521 -382150 448 -66261 57332 191690 127326 305811 248101 -64471
23427 111661 149772 465200 -30818 -13141 85180 -172182 33032 223223 2296 208968 -230174
23415 -134480 102796 -166843 99819 -236368 105705 -211955 -143695 -7086 190857 52156
23404 35591 -10738 215117 66882 -125113 82518 341793 249593 133397 240140 121077
23394 121077 -126518 -218357 139388 311536 23012 -66448 -110388 57991 133303 51387 -76834
23382 -164882 283278 -138144 -263116 -82637 -397802 -7457 -164582 -31111 -141734 169393
23371 -235423 -119905 -60495 -7789 -45550 -102586 -109223 55292 185326 81415 43740 -126493
23359 81436 -115496 -322695 398163 -131285 -330535 -208480 260590 -96821 60802 148226
23349 148226 -13240 63463 -1119 293643 -187300 -281075 158371 -164739 112282 -59642 264891
23337 16312 32062 -6040 -49438 120008 -100111 -26161 249887 82665 13088 -167372 -193110
23326 -193110 -82142 142336 -81602 -72378 127658 -532737 140872 -81402 -141158 67420 -57847
23314 80263 -167290 -63240 16850 -48797 139127 180150 -456640 7354 -39563 -3455 -134381
23303 -134381 329474 55369 -296511 54652 -32708 76840 -290390 41112 -351887 325245
23292 75944 -109328 -250375 -163423 -256462 133303 95210 111046 -1911 79668 65102 289057
23281 289057 28592 -44211 -268355 -146690 111282 -61414 206504 136942 163083 -114556
23270 -63908 -223700 -195058 104578 70640 62766 -121398 -48451 56087 -260175 54965 -266962
23258 -131061 -78589 152664 20723 -23129 -131892 155524 -60419 -273425 295055 -63407
23247 -334631 -173860 72742 -103114 -197017 -74370 89731 89110 -38447 12463 -105384 -123897
23236 -123897 -72352 -29885 66273 -51302 -10323 -44639 -75469 -279760 88001 -65080 -459773
23225 -459773 -156318 169327 7018 -16027 116992 138429 -229482 89907 -157838 -212480 -2855
23213 -57041 -361375 -163433 -200714 -10752 98171 -127021 -273285 -93875 54560 32286 154099
23202 154099 -39139 269433 -60355 413580 -247212 -16459 50743 54467 36597 -330079 -100096
23190 -58163 -179734 -155371 -13031 -59113 96781 14803 -99880 333851 46503 71941 392790
23179 392790 -86934 -152742 84189 -189990 -60502 -300109 -96774 134773 106146 -207701 187145
23167 -107109 -57589 100029 187382 131698 -160001 390342 416501 -164289 -131525 145910
23156 -115894 30434 63333 -274946 41428 -71225 -349038 -77909 -120367 -190683 132402 -8500
23144 -158606 192503 -55969 -99025 49599 50570 -50533 -42433 -95379 178045 -121397 -207205
23133 -207205 -160491 -74220 -123955 103508 -234966 14217 110959 4026 35350 -194114 -260943
23122 -260943 -68614 117515 49985 -191443 -294272 120611 189029 -303487 171782 40938
23111 -149737 140720 -308484 274346 335860 -52610 -302897 137363 24508 296599 -52226
23100 -156621 396900 -159280 334286 -39160 324869 15998 88409 -264577 -171069 284025
23089 34714 120816 15680 155193 43023 185171 137976 86665 51154 -221428 -254493 -341787
23078 -341787 -18944 151494 -20596 -165744 -42711 217500 692 -43619 4393 168699 22948
23066 -166798 68234 -275667 120087 -66874 -30208 109573 -59296 -104094 335670 88784 -57105
23054 12222 -82914 78148 146542 512068 -137720 210388 807 -303188 54348 295012 -197912
23042 -163095 159167 -87064 -137734 62450 -322500 -126443 -207397 100835 252409 59897
23031 -117488 42124 -20587 -162679 7804 255940 -105022 -122235 -175196 17845 323992 28729
23019 400926 -192299 241108 272635 -140353 69878 313682 -119977 55171 -148564 -187182
23009 -187182 -92798 -119512 -104488 -302730 145206 203848 -71047 -109696 -71968 218077 -44044
22997 -168234 -77532 24565 47679 -77915 24840 -149111 -25964 212120 130274 109884 108043
22986 108043 184513 -324459 -37390 12733 28173 114284 208542 -201383 77340 111827 214821
22975 214821 69667 67540 136348 126026 -112707 -209942 -16852 -201537 -70708 -238832 21227
22963 -379046 6635 31505 -232687 -198418 -540511 50825 -64475 157247 -10850 -219286 -14037
22951 -49274 312485 346644 -147351 -276251 6460 30751 -244373 -112382 -10352 -116472 72432
22939 89261 -199426 82543 -50683 61042 -135326 -57817 228957 -340769 -193188 76238 -111034
22927 70182 -191658 112417 -151399 -259570 -167077 13303 -108310 -56114 -100559 72834 -104332
22915 -15666 177822 -10090 -176127 30680 -65536 49468 -353 -275744 59720 230036 -174138
22903 -192809 113754 -218616 -314317 -181499 264403 -210946 -276464 177099 227897 -258070
22892 116136 304388 -256725 -356462 -104087 -62622 -307782 -100899 56321 9012 -121973
22881 85695 -117796 -294453 -229452 278945 -43329 126247 216154 -48727 -251511 36997 -158763
22869 -127523 -127381 152480 236468 3536 205046 -175134 4696 -116205 -32604 -129226 -266610
22858 -266610 -347970 143326 291338 25625 -187982 -312019 6483 -81734 -106536 -97198 -64797
22847 -64797 -288592 415085 156154 -29057 106036 126621 -187267 76594 64189 83906 -133961
22835 -32186 -471365 -58040 -364920 -206185 -36049 112042 185677 -709 -210502 -302169 4390
22823 78187 -9753 -30582 -143486 -11094 -138031 223697 79994 -90505 -268132 164899 -76096
22811 -136017 -55511 -3510 -110879 -7917 305725 161890 84433 -25034 -179945 247754 -653
22799 78217 -27083 6862 140989 95506 -62956 129420 298750 -118242 -257568 -67597 104941
22787 168937 -188410 204836 18568 -40824 -120569 98207 -207607 280805 -37487 -90032 343123
22775 548132 -62310 -207425 179015 -115882 -99346 63160 56029 69576 -99109 -389439 -40323
22763 -288223 -129634 276517 -158270 62024 72572 373595 -43794 -9635 -147685 -136667 -99458
22752 -99458 171548 -82691 -238386 -13813 -160666 -350781 16459 213147 -189566 -167623
22742 -167623 249631 55068 54956 -98054 152589 80306 -29647 254908 -116918 -33503 76485
22730 213300 66625 -89302 -67950 94460 -30306 -266497 482864 -107325 -29014 161470 -73482
22718 -266910 345924 53313 178301 -171271 261003 -68206 190900 -206391 118183 -276854
22707 79948 -48787 -145118 15750 48683 -322832 211831 -244690 -285832 -139281 -94881 -74289
22696 -74289 117567 -14058 -269343 -333065 -166096 92008 178756 -222408 -271322 -25153 3172
22684 67080 -84681 -20265 190666 -121021 -300104 -64158 -364075 -27265 -38803 -94824 -76299
22673 -76299 43670 30506 -304744 73368 9112 261637 -296030 -30404 -70941 -282102 -193279
22662 -193279 -45759 79443 202059 61216 -81644 -206696 82883 -60543 139005 43056 36065
22651 36065 91703 45052 -141123 147986 64761 -154116 -43315 140892 157872 -212167 67591
22639 141360 57112 8802 -6667 372268 173707 -250632 -17141 -52990 -245374 -147802 -167201
22628 -167201 -87065 24997 -193760 35751 -216479 -10720 -36805 -273112 -60638 -96461 -4598
22616 -23031 355538 116731 -190486 154196 67296 30658 254508 -76412 -440155 64337
22605 23839 -318285 -148426 -37375 -115015 -202588 -284687 -70547 -101707 56899 -3268 15098
22593 296913 109859 -75694 87281 202439 -145851 -345385 -59114 99647 118673 37358 -290496
22581 -59534 -372250 174396 232190 114227 122631 -60230 10957 33480 -315172 -337409 270676
22569 -30744 378923 -150154 42399 207565 24926 -69325 22244 32169 -144249 78177 -30464
22557 -171043 -271161 -128263 77309 -92156 314170 151889 -19675 -267808 -104506 -47845
22546 76576 -122678 254432 139068 -30363 -239229 44485 -107843 286557 99998 220841
22536 220841 -67239 -133432 44944 96421 -58481 -47019 164229 -132798 -55878 195524 -117158
22524 -194055 -35323 6956 -297325 220435 -76544 -131174 38450 -92751 -91498 -209218 70348
22512 11360 179640 270184 -140411 -184413 207228 -117601 41114 1485 -263 -96048 -16211
22500 135920 -148434 35265 -271599 -61336 -89497 88772 -318485 -105050 78046 -19104 322540
22488 -49296 32635 -125976 -246383 4500 -300936 -40364 -268008 -56328 50728 154057 41611
22476 53321 -99572 -49543 192508 -61776 -50539 -206702 -22894 -21764 227599 284063 -15424
22464 -160249 -47321 -427057 -91570 227300 44999 -234741 -93191 -74889 -188467 25883 -417980
22452 -284991 -197308 -136498 43845 78129 -21331 -109378 270813 88795 -9582 26887 -162793
22440 -202078 -136633 42393 169031 -51853 89132 131299 260646 -255686 128265 -149371
22429 -185535 -164176 -88185 -36565 -201533 31287 32341 -162191 -296925 4555 -194002 -114007
22418 -114007 -134766 132887 -10717 -271128 229025 26810 -184731 -15837 14554 -67011 124098
22406 3038 -147199 -275044 203631 72175 107329 -106961 -218825 127198 8775 160694 -190135
22394 -203619 -226361 -159734 -501197 173077 138540 262571 -49199 17400 -49344 -274296 13191
22382 110745 -114509 -339726 -350941 171354 -287370 58154 -129028 -204709 -412680 164201
22371 94486 -85965 99425 45403 -41149 -132286 -172794 -382024 -331930 -131822 153374 -28844
22359 53465 362796 38078 -100139 -46815 69838 -181543 8738 -147217 51983 78482 163189
22348 163189 -306697 -240799 -37485 205251 231083 -77198 -341729 -125265 -119817 66398 278907
22337 278907 53601 19918 120572 40025 -38215 5591 -10911 -124330 -54508 -55713 92884
22325 -91232 245431 45415 -35629 -238770 -123007 -245695 239931 -16033 -161515 -161114 -48927
22313 -105449 -59379 131814 -115791 -28641 55508 130319 131119 289741 -88513 231807 88991
22301 8842 63810 -16742 -209861 48337 -313713 -112401 173647 45148 181994 -75045 424369
22289 -158265 -15708 41375 -22451 -330743 -114117 72108 295298 -87083 80912 -5561 -120837
22278 -120837 -211509 -158714 -358692 31079 -170665 -140014 76911 35168 -348688 148392 45403
22266 -76106 -132418 -47351 76644 -161919 -108039 -283414 -84390 166241 193471 63720 103112
22255 103112 -216227 -123993 -234199 -68017 49663 -137941 -166276 211206 -109664 -10212
22244 -321380 -187240 -130254 133664 37813 115668 -23195 119894 271629 125300 75819
22234 75819 -287404 105322 7524 176728 179205 -5790 15701 -41149 -287704 -293404 -23837 57379
22221 -78845 202279 -181141 -82624 73424 -147350 356525 37205 48266 105837 146845 -197563
22209 -24953 -40964 19926 -52557 -293973 -186066 165629 2867 183157 281932 -61222 -145819
22198 -145819 -139857 -111105 318334 45179 -43091 -269415 292283 155795 306331 -310804
22187 20311 3465 73497 90392 108720 -188996 63727 -421416 231901 118753 45082 -380058
22175 -335804 -269929 177506 -136579 -25480 -141601 -176743 122040 146670 11390 -83037 324039
22163 -119647 -112497 -203875 -49983 45948 -160286 154664 122938 100726 -118285 1334 -57891
22151 383355 89786 246764 7799 -278862 245956 -109670 -195783 -337981 -18713 -119170
22141 -119170 -64033 -98539 24291 -23047 -22230 -194910 -120627 15326 -230230 -7084 -189234
22130 -189234 88278 -136475 267608 -6439 -109954 -136342 -148322 -257610 -156040 45632 -52152
22118 -98019 39539 183101 -195548 -118717 -154515 61343 -177143 12832 -84895 50068 -61883
22106 48057 -18033 -61285 177319 -15719 -53767 -40121 -16073 -54914 -77034 66696 -133104
22094 126779 146758 54953 69507 -262554 -190702 -76810 -76340 -2367 122952 133506 -237029
22082 132411 -46494 -143069 -360313 79432 -61380 35864 26172 -143607 254579 236431 -339299
22070 53033 -432357 89004 -4405 1678 -215470 -323019 51571 109023 59432 153899 -23188
22058 9602 444567 149002 -66892 -155830 224185 52022 -50626 -92704 157391 -234509 53297
22046 -98076 5734 -225811 33667 -196293 -289032 -221975 -150085 125246 108892 188937 -159819
22034 -72622 43940 -320311 122916 -127387 293940 60563 62528 125748 -101594 83163 -127426
22022 -221780 -86674 -98935 241891 -499506 139611 -206844 -411975 -322212 78919 -260549
22011 -37146 -1577 9421 79164 101905 -121862 -194524 -175603 -8499 100349 -355122 -185985
22000 -185985 3654 -23824 142516 -21740 -121681 166807 -204118 156767 -26650 51839 -564301
21988 46364 -357965 -151388 -78321 98005 110412 -356438 -119244 -336255 265592 204654
21978 204654 137854 24181 295034 201538 266629 -182702 -225710 223955 200431 -296247 -10160
21966 40026 26523 -251779 202641 -3690 -5166 -100933 236171 -251499 92363 58678 25790
21954 -301514 25692 -187549 -167995 -132370 109904 -470104 292358 -278053 662 -109987 117467
21942 7391 287622 -16795 -114906 -177814 40208 -319341 -51604 -190477 -193883 -93663 -38836
21930 -64111 -183498 -96708 119718 -152132 -158353 30799 62648 -63261 152660 -219874 -24788
21918 167004 -61761 360887 135961 -249594 173957 -94378 87235 -27884 241415 144626
21908 144626 270392 87947 157976 -104208 -98425 -119526 -235732 -1314 -304202 259065 138933
21897 138933 -167464 -98068 83320 -340415 488941 3913 -99090 -195346 -4243 159892 -119138
21885 -13920 -115385 -134596 195794 65541 -32474 24438 -146684 -90047 -100695 -340194 15908
21873 34282 151589 -294056 28878 -101650 -12401 242716 -201919 232483 -442417 -170316
21862 138342 -138086 131878 -58795 241319 -93573 144401 -81676 349116 37669 -28012
21851 71970 -72153 -222009 175396 -10740 6820 -8973 427188 -592427 -132392 109027 -64700
21839 -106496 72466 -343610 -56019 -355217 -190046 -169326 307424 128213 13462 49681
21829 49681 251178 45697 149635 -254401 132339 72552 99892 -61012 121043 -242548
21818 -10898 -46099 197165 -186973 -92394 -68353 123492 55938 -144810 105931 28269 41046
21807 41046 331304 -285246 -74945 -100022 -85957 45306 236526 -196352 -196427 -77648 96100
21795 -137959 99122 -34522 188211 -260492 214214 104661 -143390 238080 -89889 -153613
21785 -153613 299117 -35861 -132344 188837 -103492 -148900 205970 2659 194085 -202305
21774 -183871 -150080 -168634 -3077 -310854 -261647 -153774 -74554 39564 -23637 -47782 -283634
21763 -283634 -292992 81 -437702 1727 -257657 111510 -95669 -57681 -291055 62210 -34090 56404
21750 122520 -63859 -88723 144008 -175134 -135739 190402 202817 -32920 -31759 30137 -68821
21738 -308922 -5565 -109171 71649 1944 -148696 -94566 147266 33071 -70982 172430 -194034
21726 -65581 186352 39424 15779 76207 124934 265624 -58211 -78041 -150282 66410 -163575
21714 -338292 -287011 52546 60619 62127 -29276 -201482 -62306 121225 -193576 360813 -211433
21702 -71468 -111248 -188514 163056 -750 -392837 -160427 103586 -63831 -323037 243163 -136922
21690 -18054 -30704 -1845 183905 -183198 128746 -152092 -63039 -6134 -10370 89961 221610
21679 221610 -110080 177642 -180616 -199413 -471976 21493 -156196 7978 553569 -292919
21668 -136520 112443 71078 -63355 101697 290512 -153155 -45160 -122649 -39402 -210584
21658 -210584 65511 -334985 -192239 84860 -70637 -156345 240903 270762 -276863 461340
21647 -191600 48537 11008 -48302 -49705 220394 76354 -80118 -138489 -84013 -404257 -73671
21635 -140323 -28587 -87657 -42434 -41041 -165402 -428925 -128025 49247 77754 129406 233754
21624 233754 -340479 -147768 -207873 -20254 -157288 162989 -39111 -96621 -164804 28266 -105208
21612 53672 180061 -96039 -147997 -49514 159862 98265 -121416 151888 -462203 38584 95063
21601 95063 -241080 -143651 1551 -145373 7864 -509631 -14109 -230726 -31674 -186986 -117656
21590 -117656 -113896 -260090 -61708 -114524 167860 -55546 38479 159869 443822 310230 -33942
21578 65494 -34279 168831 -35068 -151364 298214 61098 -47820 862 -3303 -316624 16007
21566 -100831 22452 -163498 -110511 -79319 354068 -93685 -250806 -267418 -290629 -268076 -171032
21555 -171032 213496 113571 -176285 45524 -13404 123392 -81710 121699 225825 -363478
21544 -322417 250950 -237804 61206 -108426 -372612 -51549 -143407 -192771 43271 -114488
21533 -123101 -264617 -103445 270629 -218485 204913 -89758 -91774 -97164 19767 -313787 -200130
21522 -200130 -168209 -310329 -33088 34980 157508 -203541 -494250 8439 -177423 64924 -178524
21510 -85588 -102261 -1260 23841 -138775 52614 25159 -332374 -327137 -32353 -92604 -213802
21499 -213802 -12240 -3785 2512 24743 -102144 -223283 -36344 157633 80150 95094 -179421
21487 227988 -3301 119110 63925 16986 68276 143868 -15225 -91034 -205446 131500 239742
21476 239742 91397 202539 -45631 -336639 -241072 -164347 -80888 -282741 48812 -135572 -109377
21465 -109377 275792 -35453 -157287 118052 -307364 -193112 35420 -43920 -182350 -42153
21454 119675 -11951 137804 71344 -102467 309740 270582 -136120 -282991 -93613 87875
21443 -108674 75854 399176 171410 185077 51536 527790 285032 634313 225864 -69450
21432 358555 525217 87097 421230 71355 -55918 -120004 83715 202926 47108 17708 182785
21421 182785 48620 -20207 65854 -64821 41974 16278 44709 157098 -192022 -77139 -8792
21409 56548 -188920 -125085 -89058 -45249 -179102 -228107 115257 155012 43256 -19806 -176456
21398 -176456 2906 -42093 -524163 -54292 -100510 -250203 -265902 -10509 -170376 -215228 92071
21386 -276514 115382 62854 17781 -96682 -46469 -21733 240846 -211212 28274 14510 -176535
21374 251962 -97914 -184569 19494 71442 -171616 -154488 -111187 -103971 -186491 160684 -183142
21362 177647 -200293 -205135 -84181 -203254 -166695 143892 152474 -95219 187595 -84934 167005
21350 -42321 -51068 78629 -34348 -117645 -159013 -177695 204621 262625 -36543 -104728 -116924 -159287
21338 -159287 -198061 -38478 -85161 -90456 -279637 162266 -2831 -55894 -263020 -3345 -81673
21327 -81673 10070 -109067 165210 1817 -376072 9173 114711 237771 -74289 -148787 -99887
21316 -99887 -160583 273066 52366 -67163 327464 -134666 -198001 46722 243787 274451 282470
21305 282470 -275058 116390 11499 -277257 48837 -173860 -170769 -13150 153064 -19711 180013
21293 299080 -119057 -87778 28712 -112328 -217584 120498 -110410 153150 173325 262879
21283 262879 244935 -266503 64528 -81942 -105564 12891 155100 -136010 172183 -95984 4070
21271 -244825 -13191 -131808 -302829 104640 4103 -226208 119888 -151481 -169350 -129512
21261 -129512 169608 -74796 211187 24351 -266568 -259336 -91814 -134819 -181716 42712 -319653
21249 104666 5085 -161311 -70977 -118276 179747 113574 133282 -115468 -271235 -339202 -6917
21237 157424 -301171 -97682 38541 -10421 83152 1711 -80878 -114226 -173477 11537 214206
21226 214206 -150426 -369784 54778 -332948 -202430 72961 35851 176541 6504 -39868 -84856
21215 -84856 -300789 -248276 -132135 87532 -191671 160832 102499 -195410 -96188 -10888 -170008
21204 -170008 -199349 274 -133737 114826 21901 -129233 -149894 16132 127821 -221872 -230477
21193 -230477 -83161 5147 -310070 218334 -58592 164682 125683 235602 -291357 147252
21182 -66118 -85728 -23259 211433 -300191 -198972 -132435 -156808 -156894 249828 45936 97220
21171 97220 121331 -105410 124424 -69817 -140575 -104861 141618 -104903 -141789 -166129 -74536
21159 135293 -53751 -292214 158190 30243 -10670 97661 172249 20768 -102879 -198013 137446
21147 101032 7292 -10743 44085 -350871 -331879 26253 56010 32341 -321475 -20040 113253
21135 -296497 -63008 -106241 -303723 -186459 110093 -6160 -108296 -185054 -82230 -221780 78394
21123 -59822 -148864 -135283 39030 -388964 110964 -157952 192057 -154624 55318 -138937
21112 -419187 -179782 -19405 -62154 369560 104031 -231908 -182842 -230938 153647 60916
21101 -299896 -73301 212973 -2220 -290030 37337 -125464 74029 -245886 160911 -112079
21090 -230030 208734 207704 -346900 24307 256195 219178 198307 92022 287853 -307610 -321982
21079 -321982 51029 -412039 208959 -167178 -447073 -122748 -446355 -102609 198485 -378712
21068 -170509 -246179 -120189 68737 137707 -43563 -375066 -63410 -37463 -181349 -363193 -253054
21057 -253054 -211209 57125 -61103 -33443 22611 77943 -19448 -292669 -171733 -242292 -218938
21046 -218938 -259077 -176171 -181928 -160789 72236 -153665 -50164 -51478 -261514 -143757 73122
21034 38108 236121 -156233 -321539 -322648 151933 7927 -21739 -280576 -220102 1730 10055
21023 10055 -26428 4597 -300553 -353132 -340739 -122221 47562 -47165 7389 -292772 -52946
21011 -261907 -355005 105041 38888 3288 -136212 295356 -182507 257331 -276703 210027
21000 458232 3233 29640 108747 -203437 -236419 154079 -44581 -224916 17603 38062 -85534
20988 -323742 66363 -35521 -148511 99422 -96246 145346 -187412 236002 60796 -209221
20977 -274520 -66078 -208438 104715 -133422 -26578 51772 -53685 405438 -223841 111979
20966 193886 937 -111856 118170 -142861 164158 72203 42620 -220081 32061 -121474 103535
20954 868 -129033 49999 -190521 -50131 -84912 -35556 -109726 -146204 -75061 -369584 21726
20942 -83571 -69634 -253065 -46054 223574 -258933 43911 42599 294121 -29800 -75350 -237093
20931 -237093 160048 92033 -7991 -321198 -265333 -124748 -352784 95784 74336 -57007 -101270
20920 -101270 -136726 167364 -84434 222308 184369 -167805 104463 -549607 -168541 -20143
20909 183546 -54794 -93303 -79449 -311971 -84747 -108516 -130032 -357142 -247033 -334243 197770
20897 -192529 -439518 309773 -45685 1419 207104 265668 -151052 -153456 -72272 158445 -79269
20885 -431164 93008 -151320 -95092 89579 53767 -82024 265736 147475 -90901 -206989 -4349
20873 -38393 301460 -70214 -68319 -182939 169005 -457073 -31992 15895 41660 -196237 216679
20861 120861 -97937 -53748 -168097 -153145 -54595 -47383 63541 71873 265897 123905 61042
20849 -104648 148467 -232732 -58674 -293422 348069 196855 127890 -245435 140748 75643
20839 75643 -75561 -60697 27625 -288981 101442 117940 -114413 75030 -81299 -281610 202239
20827 -40607 39659 -89974 6331 -90484 322285 -287241 -199523 -288526 -162950 -30699 218944
20815 -158352 140011 -100987 -365517 -175448 -364398 -280835 -46612 264749 49725 -13807
20804 -69442 25619 70160 68041 130948 -284086 -176131 304866 -64221 -69627 56138 -317589
20792 161132 10456 128712 -82950 99819 203414 -254344 -69834 177048 -21130 -28593 -37359
20781 -37359 91227 -250929 50743 -186983 -143802 -160915 74122 -67981 141298 144279 -177025
20769 -367268 170468 -9192 -215545 183287 69476 257732 -264755 55392 368165 -273026
20758 79304 207518 -101169 147937 -33920 -109649 -203679 -25532 -17591 -90133 47891 23379
20746 -35326 -15433 -81177 54466 114241 60251 -202226 103579 123937 -182026 28244 90880
20735 90880 -211673 -157112 20272 -278132 187657 -135009 273192 70475 24495 -23063 -345235
20724 -345235 113939 -119046 -77289 -296206 -139807 -135651 188399 92686 -400050 -75097
20713 -69070 -128970 56060 63561 -283001 -182525 -127727 -69801 -290781 2210 110008 132035
20702 132035 408732 129130 -225460 294109 -93452 -74726 -503646 -92050 213976 -349792
20691 -251 58649 147450 -282015 -52718 -48240 -39717 -283455 -180641 170335 -160228 -106190
20680 -106190 48269 -215121 16639 -468868 -55539 27627 77797 30594 -237678 11058 -119380
20668 -141432 -314956 206742 -175818 -149634 105360 -201578 163417 76495 -188897 205111
20657 -105600 51028 270535 -418447 55757 -31099 -275949 172800 20051 -463398 112575
20646 -195387 233128 202418 -79814 4577 -272097 -26272 -287606 72268 -254411 -370150 -228987
20635 -228987 -349394 -300618 -90946 -274782 -268092 -248681 -141281 245807 190901 70295 -275803
20623 -128539 -174171 89576 -158662 91748 -12933 -119557 27625 -69334 -118881 -146429 229347
20611 96137 -241412 145770 -189558 -32180 308623 -200473 88267 -282786 -99905 -146501
20601 -146501 -71728 192532 -341628 -17983 -204066 273861 -70447 9201 -108534 -124852 -234969
20590 -234969 91728 117461 -177243 185170 -31980 20440 200059 -311151 -242513 -50275 27108
20578 236342 22113 455713 6402 156306 161733 19649 -365476 -82580 111858 -36072 115426
20566 58579 108879 -265490 3686 -141589 -73339 -285707 -281005 -89153 111112 21306 -146061
20554 -413209 -166419 9707 81370 134246 35507 -216925 -78006 -197029 24487 153255 -18383
20542 6595 327162 88378 -67730 92779 139694 2576 96473 308702 15574 -177637 27282
20530 -199191 -307048 47752 -5499 124552 -24892 61345 -50075 159043 -20503 -89167 148738
20518 121628 -144832 -39453 231757 293299 -312503 25854 -131646 196129 279277 80311
20507 98614 62650 18196 -265692 -95566 209541 -109089 -33756 -129355 -63967 -202156 -92575
20495 -285234 -255444 -136071 -360772 -308371 -17824 -314400 -66300 268992 -223677 -52356
20484 97244 -61267 -125738 -293342 214020 -253960 -248136 52721 -11921 -147095 -39068 -197188
20473 -197188 118023 -3341 -174676 299704 -33285 -918 116391 80298 -507949 144842 -88530
20461 -86431 -43327 -59984 -73429 157406 51637 229342 22242 74511 279540 -367 52894
20449 30605 -18885 -305351 -81411 -256403 -1246 -59607 6365 -86723 -227587 4339 181780
20438 181780 63587 401080 -175143 26850 200194 14071 -128307 101783 -37235 -256502
20428 -256502 166330 -110745 -644703 -41178 -117765 -265188 70017 48946 246647 530670
20418 530670 11427 155228 -195439 -207356 -360669 -44069 -17917 -184020 143706 -81504
20407 -32955 7297 -346815 -39826 326627 78445 121924 274154 135251 -268682 -221214 -226126
20396 -226126 -311946 -26522 -182321 -79741 -26822 -124278 -363625 -116812 -108400 -165217 -223212
20385 -223212 -46796 141609 64673 -127972 -60074 -66668 180998 -254267 151088 173166 116132
20374 116132 -98663 -513334 -124211 -201926 196820 -358828 -174212 42976 -240820 -92043
20363 -306674 -120959 -167246 -268572 -156925 -66969 125039 -60102 -95143 -232274 -212651
20353 -212651 -23695 38925 -49699 48802 -223491 -219376 7620 -129452 -91037 -89462 217988
20341 -462819 59082 26862 -1306 26287 35157 -191976 -310417 -203496 43457 118916 -102419
20329 -24319 -129389 -120813 -58437 -275703 -212257 -55022 180966 -361964 -1578 15745 -143999
20317 -323301 267200 -55557 -114790 -340 -221155 -275214 -307244 -176329 64103 -306477 96416
20305 152064 -124573 -72170 -167358 85703 -296647 84816 181680 -137314 -117000 39944 -139105
20293 -41352 41386 17961 -74698 -82258 81076 -400083 77188 189858 207166 -51660 285980
20281 58649 130857 56430 -97486 -314001 109100 -248491 -309707 171519 -39340 16588 138821
20270 138821 -74799 245155 -2316 -98339 91639 96957 45359 -129460 -56055 -14977 -345665
20259 -345665 57192 -18357 -11859 -242646 -183118 -38364 -89194 -159507 -202026 4161 5730 -71324
20246 -113643 -42233 114607 194939 8122 117930 97908 259731 239050 -176425 -344133 -468814
20235 -468814 31756 42231 -89228 107908 -227071 -82153 -103647 -91580 -165700 -213850 100344
20223 -76423 -29642 -122875 -5440 111987 -50115 91965 -300541 86636 119529 29111 -132009
20211 -347930 -241997 -53837 -210827 -227481 -123595 -214537 -95045 -186063 -26165 -37648 16459
20199 163389 207380 -5143 -143388 -5389 14755 331660 -57466 -270218 272917 -32487 -135150
20188 -135150 -12338 129001 -190559 -188540 -15276 -120889 -29719 -78012 -49929 -14408 93893
20176 -138922 -221308 247205 87324 -205086 -359207 64572 117281 -108936 -82122 -219197
20166 -219197 -63317 192595 99785 -417660 -281993 -518876 63830 -191079 209841 21464
20155 197455 87800 262084 -180254 19928 -243835 97756 63978 439193 29813 -276402
20144 -68488 -125554 24483 232550 -371750 6622 -187802 44633 -60174 -172034 -59430 -101354
20133 -101354 -172370 -373821 209833 48261 137397 39172 79969 199458 -138372 -209240 39431
20121 -66397 -17199 -126663 -132564 -136562 -118440 -107227 -106052 112100 -360849 -23324 -47439 -116414
20109 -116414 70656 -138606 -347745 164368 -117179 -36928 -41083 -369363 -29183 -100413 -385292
20098 -385292 -44426 10653 186289 -39337 198447 -103840 -48329 -12455 -129047 134968
20087 -481674 20672 -50065 444769 50176 -52431 5541 -47139 55799 25257 -5985 -140163
20076 -140163 -25701 265251 288539 -18071 142881 -295314 13560 -327953 257712 338904
20066 338904 40907 -144102 -149112 98592 65382 -10382 -158311 -74310 239709 143020 -78600
20054 -104541 20303 -143535 -161851 25130 -106956 -230051 -22056 -269180 41728 -121503
20043 266610 115795 -310802 -23355 -192171 -226383 -211695 -115602 149098 67811 13419 -58438
20031 53040 -42900 -84660 -219848 86607 159424 -45037 -23212 -55691 460164 -160531 -107001
20020 -107001 250692 267973 -173421 -383691 -54644 -131652 55272 -481211 94083 -11794 -108338
20009 -108338 50736 -229872 -180246 -13152 27454 -109082 -96238 186838 -38232 -230429 16038
19997 -123467 -345006 -113417 33229 83605 -40564 -811 -20692 -265897 169056 383622 -378411
19985 -285687 -85462 -158245 -41879 375307 95525 -140384 -40129 -42614 164758 37390 48758
19974 48758 -115896 70350 254769 157845 17715 56870 -174411 -249133 -78492 -334095 -415633
19963 -415633 271739 139926 -52646 -216840 -18352 123280 -281303 93793 4720 399028
19953 399028 -284976 67306 -39668 252520 -208741 -151397 7408 -131347 -82578 -195327 270026
19941 79287 -10447 -167220 -175834 -196368 -132611 33654 55423 -19054 -190789 -320139 -28843
19929 -53025 152190 -1967 -60878 -67214 -122572 -182889 -1565 97270 -65899 295456 -151409 -293432
19917 -293432 -292831 -88919 -120861 -106556 202492 191328 -68871 -233166 -270559 -176106 41605
19905 -126240 -440184 -122678 -136807 268039 166584 100390 -69559 69283 -153449 43513
19894 -64026 -10382 110990 -77129 -128661 -103317 112657 -322538 -258756 22135 -257035 -77405
19882 134700 -150410 -117959 -451756 -93616 -191969 50507 318647 -187933 -384212 -260257
19872 -260257 -210353 -158972 227962 97850 -71029 102507 -190940 56816 -82775 -16271 571858
19860 53937 93213 -125271 -167932 -84444 -219356 -118487 -26955 -277048 233966 -87005 -148295
19849 -148295 -10050 15506 -239434 -71865 111454 -171462 -1013 -115788 -280989 -147333
19839 -147333 220045 167935 -223574 319380 153346 164130 -187292 -14864 237707 -71559
19828 -399438 -57268 35456 159383 12487 -162517 -127007 110481 24628 -281870 128479
19817 -5347 59649 15308 -154389 -355168 -313706 31001 23432 63416 213352 -209316 -111336
19806 -111336 81310 -204419 -100208 -140677 -18771 -159385 254402 54826 123802 -202051
19795 252383 12345 -109861 -108636 131933 -152348 -90696 66732 -215374 -86421 -85149 -109669
19784 -109669 -341493 -294223 119826 -73385 -72492 -241368 -151048 -57487 174809 244627 -98018
19772 -96803 -224144 77157 29363 -200421 11300 -153048 101858 26763 12630 -24822 -129976
19761 -129976 -127063 -325831 -64783 -36628 -82058 122288 -280549 62796 -151219 22746 -196692
19749 -102259 -97345 835 -214641 294668 -311455 -136167 -21045 -293628 -136837 139067 -129450
19737 -98816 211246 -116901 295258 241232 -24504 -198192 -24270 40263 220953 88194 75588
19726 75588 152384 -88742 154236 -599004 -80949 39984 -290706 6494 109875 -103177 54943
19714 139362 9317 84998 256603 304425 284871 238345 51530 -197037 -290043 97136 -296844
19702 236753 -36801 -100113 -177377 -51629 275299 -169638 77256 176531 191302 -174941 -106096
19691 -106096 114282 59214 234673 -207539 -194626 65442 159643 194688 -160554 -52233 163339
19679 198870 2625 -116544 -573070 153076 -251543 222357 -360102 -259224 -182482 316327
19668 -186364 -251767 11984 58280 -257803 -4631 102410 -86141 -115263 -266268 10446 -68631
19656 -86548 51338 -9190 19937 -385267 -177502 -13461 -245340 -217791 -452655 -142757 306674
19644 -27529 -99982 -174413 106773 -102938 -360888 118676 -23712 310078 -147157 36443
19633 -125033 -37959 -11170 222541 -86329 -87659 -97963 -37025 -240010 -312761 276753 278579
19622 278579 -31089 132427 -164608 -146910 140995 248961 113884 -442592 88043 63635
19612 63635 80736 -6499 -244791 41889 208075 -147918 146240 14530 360816 -315425 -108588
19600 2876 10710 1053 -411620 -138707 80147 -397457 100701 -307915 -485259 25670 -403
19588 -158862 101116 263204 -90627 -420025 -267048 -149991 44081 -249474 -255829 -219505
19578 -219505 -109670 107599 -251774 100507 -101425 -60572 77741 -234917 196901 169860
19568 169860 -13023 -170474 -470911 -93590 -292664 -463678 -65984 -172477 -198568 -263111
19558 -263111 107877 -136971 -268730 -208604 27483 -77512 -69484 433172 28114 -55271 357870
19546 75041 11404 59311 352235 102014 29672 460086 63549 197343 156917 -144297 139877
19534 -105377 433348 61625 39971 -29175 -398752 36612 -68117 -184030 230161 122684
19524 122684 34869 -160569 -87269 -370983 -562178 -50438 -123701 -38766 -40034 -139447 -49194
19512 44185 30203 -459464 7013 -53027 -96457 54520 220891 145733 -6152 167821 207134
19501 207134 -163515 89493 43817 -74410 65901 -243224 -452328 -443361 -160765 -152061 118378
19489 146255 261235 226013 25451 41574 -59079 57686 108121 -138708 60373 -156268 -204390
19478 -204390 -30432 -119185 -145656 -244235 -156997 -298227 319478 510586 186493 132818 115771
19467 115771 -516237 -418645 -256155 -490126 197355 8979 -51930 93730 28507 -199172 -24679
19455 -295062 -200005 -127654 27454 54338 9621 -293318 127156 -572463 -257252 3489 218129
19444 218129 -250072 -331470 -273100 -302810 32407 -245176 -249251 -56349 -15031 29375 -268813
19432 -68040 -321546 -1186 -95087 39098 131467 -220062 -324802 -35541 -532869 -193149 -156894
19421 -156894 -191460 217693 -112415 25569 -34987 -20202 -115087 -138594 -173355 -360348 -124470
19409 -209315 53300 58764 -255514 -9969 -254384 -261784 -104768 -9094 33392 -100868 47185
19397 441593 52170 -29322 296925 97739 202904 88902 147735 -193795 -76913 6434 -381985
19385 -258896 69403 -114319 7163 -136996 -167177 -292150 -113083 -167096 -109492 -164461 -350641
19374 -350641 -276253 15499 119299 20909 -154963 142519 -184620 -170879 -150497 -113788 254341
19362 140135 -209346 -147822 14247 283140 262052 -26297 -275517 -62520 -221823 -9377 -296053
19351 -296053 -63499 -24038 -145376 -292886 4281 -126418 121118 -94942 -47355 44055 230510
19340 230510 -452729 78944 -43197 33603 335948 59647 20301 -315064 -138625 192435
19329 -7692 -128698 -51438 97612 20804 -177491 -217764 11829 175380 25940 193978 254397
19318 254397 -198233 70545 110482 -147854 -193940 -87195 -320737 123285 -180156 -75235
19307 134434 -141742 56675 -19065 -223812 -528671 181120 -247407 -192940 -63538 64408
19296 68466 -224763 -46321 177314 -239860 75038 -80741 -165958 80724 55185 -397015 -71141
19284 516526 -486302 117809 -193929 -92977 9686 -96631 10278 194592 -26075 -22204 -159238
19273 -159238 245795 -64230 -218952 227742 28812 186474 -258942 -193774 -369343 200144
19262 -481772 68617 -91194 -188856 -109732 -83119 85925 71322 -226788 75915 258791 177327
19251 177327 136736 204009 76779 -207312 114081 27376 -68442 -25888 -264859 40300 55554
19240 55554 -126841 31579 106037 81385 -382878 -380971 -215310 -54557 -68731 -99549 -69445
19229 -69445 138595 10043 -283334 193351 223849 34174 -21479 -91654 -309701 -270165 -184918
19218 -184918 -182145 95221 -81412 -97555 -226818 135068 226095 -154529 -101772 -339024 -116938
19206 -262319 90056 -21978 20934 163753 147472 -315292 211391 78496 110586 168608 83532
19194 -72678 -161913 -100864 -54235 27980 -29068 213744 -105665 129455 -89807 -56869 169454
19182 208918 -341263 -63028 -25759 289607 -274177 175954 -111156 213662 114901 -325951
19171 -61080 125596 -180510 -400183 -41575 -250645 -361751 101177 -120054 74598 -218109
19160 -157439 -265544 -219953 181017 -61791 291410 256332 224648 48974 -139762 -153177 62092
19148 60821 -89459 -54846 -80104 64063 40477 -179852 -454775 -65468 -336437 111476 -55397
19136 62620 210802 -448243 19516 -122057 -181160 71503 -20791 -5794 -6106 -295365 246395
19124 -53874 246305 115817 -86597 -367709 -245223 99713 183672 -224741 -83975 -463958
19114 -463958 36645 -92102 22461 -70723 241228 -23265 -287687 30678 -217700 -143461 40519
19102 81242 -215988 92729 -172421 -418929 -286000 -152108 -59292 -326992 -82252 61287
19091 185251 -138689 -72141 -242001 -256561 158926 196385 88491 -141850 91962 82630 -237909
19079 -66834 -204654 -95011 104247 -171141 -33672 70932 129246 69577 -233805 -340384 -250024
19068 -250024 -81117 -245474 -192732 -34441 -11788 -91665 -95607 -3693 -82896 -172463 271060
19056 78340 -79723 206053 -187379 100961 -222048 -168065 -19863 230317 -123983 238424
19045 -167996 22676 -98762 102205 293306 -454255 -38818 -349609 -235581 36261 -180533
19034 15937 142350 -141610 -249399 18957 -75862 338278 193359 62597 116749 -96275 -64829
19023 -64829 83461 328473 32479 90878 -43732 -468760 2327 -245686 235544 45316 6934
19011 -192505 37716 22522 139219 219798 29096 286244 -159187 -229341 -167981 -64485 212909
18999 138952 -12553 -14812 -160372 -29372 207071 129229 -163513 -44490 148171 -89214 -25309
18987 35129 205511 145370 -196493 -93641 -342217 82144 -57168 -211912 124657 19583 -207846
18975 -181648 -311112 -166946 175717 66211 -194794 -32976 -371924 -102198 76623 -185538
18964 373604 -173761 229383 -39127 -145650 -56759 20316 248025 -251566 -46385 91240
18953 -261683 -56743 -23499 163484 226530 133569 103693 -101200 48693 -177216 -106301 135663
18941 10099 -29821 163617 75493 -63627 -276157 16798 -5165 96905 35056 148635 -10167
18929 24726 8885 51183 -129599 -44864 -119984 -80060 46346 -46251 -65815 479312 166473
18917 -221694 154028 -33154 154288 -92405 86515 -227497 198800 -601282 -140889 138922
18906 22295 -478039 -47032 171493 -85491 88482 -159717 -36620 -180111 118066 -2074 326697
18894 172608 45882 -38045 144206 110645 76555 -46398 -2965 -103266 138794 -106580 -362643
18883 -362643 20992 262732 153445 -50633 -5389 26480 129948 -173771 -102333 -192189 -947
18871 150257 81253 -199036 -245512 -487909 -43589 30052 -149713 -187480 -2463 -293093 169360
18859 -164972 -109353 -166836 76519 73505 -162247 53838 69029 -89804 -148001 -100656 239457
18847 298391 2767 -213131 -100461 -159507 -169262 93797 -50675 33339 39306 -196826 -52376
18835 -166879 -224078 115813 -135976 64959 -89869 -189123 -336094 162968 -148953 -153743 35308
18823 233982 -230916 -27554 104797 60707 77687 347538 134678 -154654 -5479 145266
18812 -150066 311714 109814 70752 407465 -92545 27292 -237374 -51924 -1164 149365 43720
18800 -63890 272744 -42770 -201288 -175030 257717 209724 -235174 -19001 -21712 -140099 -301597
18789 -301597 15569 128995 -245068 -39265 -13454 -346591 113979 -52636 -144484 -94990 -260694
18778 -260694 165579 16431 -27265 -199656 21975 -200553 131909 -163126 -220249 10224
18767 -131561 320358 -35915 45510 134203 263289 145823 28550 -119243 -55294 -201194
18757 -201194 -345765 -139454 -121385 -247329 22218 157815 12372 -200064 226452 94106
18746 -137628 -296834 -181005 -86594 -345415 -238845 -202884 59130 -29748 -134839 -54850
18735 -98258 -131953 100378 -132622 115372 -3792 -289891 -222579 53307 117841 -30919 149951
18723 -259525 -144973 -36100 -44240 -243636 55065 169942 -88749 33355 47745 63735 213929
18712 213929 -105769 -219510 -128443 -52561 -19429 -147039 -30375 -237247 -293265 -32603 127916
18700 -27768 81530 -114975 -242421 -216362 93199 105513 -164107 24211 -22882 -73397 -245878
18689 -245878 -149206 -99870 118805 335367 75119 -118662 -209773 -95368 -22215 65880 91482
18678 91482 -3688 147712 -73784 -141358 -5622 14712 74708 126307 -97875 146762 -383597
18666 -362332 -244379 -166951 -244503 28922 -136037 -120560 235499 40757 -69156 -60240 90883
18654 42143 81564 -32893 -48133 -90117 -338687 -159283 -57140 43255 -57720 82007 -4364
18642 -2352 -162039 -108045 170229 -468496 -196883 -194262 -100818 61672 -255063 -62534 -43197
18631 -43197 112394 -162439 -128138 115402 -184823 3215 149931 -117601 -170460 203583
18620 195758 -334571 333666 -160741 -148054 -139800 111563 -74498 82349 138496 10827 -235944
18608 417204 -348002 -138811 74895 -285466 -175373 -28200 -155723 86802 -80960 2970 -119787
18596 -43969 -222913 52033 326361 -195762 124480 -157985 -153547 154889 154662 -35093 -117683
18585 -117683 -145769 248447 -177649 -19698 -89627 52955 406143 -55489 -57387 170725 124918
18574 124918 -23048 151191 -6271 -39174 -301164 -234234 122543 -193721 -50527 32775 -278618
18562 -252744 -165963 326728 -43818 -54275 -51007 -111449 370252 -121223 -268091 120544 32977
18550 -244139 -222396 175582 -104571 -288859 103722 129771 -80063 66237 -305112 -205988
18540 -205988 -99625 99877 -27252 245254 54444 -175452 -44246 -411061 -8058 -320216 -110357
18528 -102754 -433758 -26453 -92510 147798 -173803 492123 -302219 -221987 123573 39303
18517 83688 119411 -71015 236086 116202 -245577 -137262 -106371 120238 152027 -117679
18506 -87423 15354 -250132 -17855 -93201 5458 64146 218981 160562 29802 186158 -319997
18494 316329 146757 -156894 -47755 223737 177717 -118303 176584 19715 62280 184531
18484 184531 -117285 98031 48395 -73214 88633 -116845 -83895 207808 -55200 -1593 -64942
18473 -64942 76367 -109917 -189459 -180972 -184512 -160870 -268732 110887 -297038 -144349 33375
18461 -84894 -260004 -50293 208743 248365 213230 -54032 -146223 -328808 -18632 -84393 -71764
18450 -71764 -283454 420596 51387 57326 207955 241349 17584 -236783 107075 -251682 55786
18438 -274039 15769 78824 -155661 13594 -164851 -132338 -171742 -256703 -242812 161268 109888
18427 109888 -348443 118313 43993 -266606 227621 -3657 34345 -584924 -291815 -40688
18416 -334825 -176355 55537 -133399 103668 -55249 -75489 -37556 98124 55408 153561 190151
18405 190151 131219 -65613 56217 65911 -180955 -289497 -347829 -20411 -181376 -103446 -341387
18394 -341387 206749 88331 -197539 -154749 41442 -44844 22230 -86711 12751 46888 -189645
18382 -99122 -121197 20520 176755 -399042 -96120 267252 -323821 99111 -148123 234428
18371 -58046 128768 -27086 -48273 -330372 -66391 -123431 101090 44147 306849 -225559 -178737
18360 -178737 25251 -153166 -266000 283697 -311572 -17164 -178289 46621 318456 216359
18350 216359 -46905 -142662 -208026 -109486 70525 -93210 120428 -195875 282766 -196220 124595
18338 286829 -317996 60530 -415716 -337515 -112457 -42851 115941 -75336 -61537 -261624
18328 -261624 -226081 -8824 -164739 102820 28099 -95265 24058 -166855 -353496 -3671 -283118
18317 -283118 -317293 402418 243194 -48562 344952 -87210 128213 143905 -174332 111830
18306 -105033 -335538 -65166 -269448 -35613 44662 66585 -66798 60543 -33802 -414187 198780
18294 -16919 -136413 -142139 2003 150291 5864 -1270 116883 -354775 -10750 -25645 377868
18282 -32263 31536 53317 53642 154966 -111230 -332567 24099 80383 -99238 -137589 93750
18270 3148 -36611 187269 332080 -126305 -26561 -61988 142986 -250775 -291845 -25387 -96307
18259 -96307 -52274 -135170 -76689 -96186 -32887 -108370 -193822 -9632 -26797 63498 106503 169867
18247 169867 -294159 -69347 18327 -209616 -218615 115201 122110 -195749 -405612 245619 75724
18235 196429 36600 -149261 110923 -71538 -353391 42422 27835 33393 89196 -442572 -109769
18223 -156248 108700 15232 -421966 93126 -109739 -176904 -234941 191164 53619 -190285
18212 -116574 -64438 -113743 -117091 229099 98470 328350 23612 -116241 -4533 -178204 -75305
18200 -57070 -178251 108133 -321516 -46322 -343235 108941 48211 -108820 -154154 40522
18189 104797 -30085 -17973 345905 -249234 -120159 -121228 -295335 -402172 289208 28808
18178 -36981 -148867 -58924 -1351 -154606 -118016 -87189 -162324 114189 109694 1894 -155824
18166 -111559 143766 -134685 -107937 -179306 107681 -224578 -325165 20297 -371342 -345082
18156 -345082 32056 215120 -191404 152121 -243153 -348675 112866 -246208 350598 61467
18145 -441866 -100770 6 57205 -259638 26213 177623 131968 19866 90027 -173815 -41594
18133 -55319 -181624 91538 -45760 -123065 -24146 120056 182792 -32813 101298 82239 -73743
18121 -47450 -70934 32130 -246168 30588 236387 185577 -129069 -103011 -207457 -206189 -244780
18110 -244780 278016 -60057 117942 84328 -112987 -27058 47344 -106263 -250019 55724
18099 122401 19893 125911 59255 194458 -206154 -31520 148393 -72422 88716 -144993
18088 -216473 -186779 4160 308014 213700 41816 52683 207784 -47271 508277 -236809 -226449
18077 -226449 -60420 -50797 62654 -238352 246680 23821 -362401 -4014 -40191 -5383 118991
18065 -3074 116933 66324 191495 134371 32366 -124480 -16494 -121350 -189247 -104318 96284
18053 -54243 -661030 85860 -184657 -212151 -339344 -28757 99173 261478 106759 -108232
18042 -477 -99959 -202972 152548 71520 332951 -112516 259732 99482 195879 -135338 68505
18030 184934 121041 -76350 108950 -140682 46162 89393 150609 28166 -79672 -1005 -177193
18019 -177193 111800 -99866 47887 -97051 161259 -632836 191104 271434 -100553 172434
18008 83527 -180994 -187322 -177130 108699 -267457 43093 101445 -234907 187012 -188836 -3741
17996 187025 401549 -281425 365458 -229631 132986 -339356 -220073 72598 -151239 -129331
17986 -129331 -413467 -180514 -60647 -73223 116520 -251885 242712 -218504 -124986 103718
17975 148127 -123715 -56103 369428 -308720 230610 58134 126705 47513 -25326 29985 -1972
17963 241655 28126 75235 -175399 -65751 -3878 -156681 -130374 -345117 -130120 22331 2177
17951 -58772 377596 81091 -174099 1427 -320167 262336 -398321 164769 -151831 -63152
17940 40965 -124217 -148464 89890 193208 274694 8955 28075 5041 -74769 -41250 -220924
17929 -220924 -133164 19518 -223216 -23319 292088 1134 90857 128264 53160 93064 -491965
17917 21874 -110760 62316 -175002 149459 -294245 53690 85845 185425 -195584 -23579 -84070
17906 -84070 -254716 173376 -155424 -101432 -223610 -242813 -225083 -102040 -200070 -95396 -31971
17894 -26440 -105017 -97778 -148986 -21084 -35981 -49362 247970 112060 39677 349159 100980
17882 179122 -276092 -242578 -79952 171144 -26459 -101782 57945 -215923 -66163 -553053 142502
17870 50998 169932 -72734 17962 -40746 -297669 123930 -33408 -95716 377508 76715 -85851
17858 71313 -117559 -187722 -121620 -67723 420171 -344865 110522 126283 12997 25534 185225
17847 185225 54123 438268 343909 -153078 -441039 77473 238971 -243470 -95522 -106019
17837 -106019 157084 -65965 -72712 -202190 -177232 -389278 84914 -290364 65472 202740 149596
17826 149596 14975 240677 123926 18363 -28256 -31200 41063 142048 49333 119349 120638
17815 120638 -32625 -14599 -221852 -93061 42337 -130242 23448 121733 -156724 42011 86563
17804 86563 104496 89066 56444 -238224 -162240 124813 26104 172365 120423 -4488 -289298
17793 -289298 -69834 141724 129205 222124 -108318 58317 -135676 -217906 -10148 45107 162120
17782 162120 130160 -48578 203207 349183 35638 -119727 328608 -107717 220502 49389
17771 623 31604 220944 -23861 -19500 -18065 28639 -450273 195235 33675 -93036 256023 -119218
17758 -38773 -3265 89896 177605 -23788 -149273 120303 -136647 -250035 265359 103243 84332
17747 84332 119551 228513 -108012 -77151 174901 224967 -162755 152364 -445375 -241570
17737 -241570 64644 -212008 260660 -160925 302424 160704 -186238 -76447 -25901 117686
17726 165078 168829 18932 58547 -90884 74060 -92843 -28584 111671 -16178 8335 246834
17715 246834 330125 -53203 -43355 226828 -187976 15554 145760 -202614 -114660 102631 239835
17704 239835 -127052 -137023 -12267 80727 30579 -75196 156920 -360816 46356 -78174 -109364
17693 -109364 -10861 -152322 25450 -1578 -164348 27087 66355 -53054 308647 279919 -51001
17681 -255456 239463 -242890 -208888 77300 32186 144556 -68721 -206471 270786 -153368
17670 -2732 62875 -19767 -363231 -126589 22291 -8019 63209 -252946 30622 34358 91679 68252
17658 68252 63547 -116096 235208 272206 -135639 177302 6601 200710 412841 -90186 -183595
17647 -183595 161449 -164434 -338307 170051 -110048 -126593 -190874 205279 -244867 32011
17636 201505 -181026 -172761 138296 63281 -99174 -190022 30961 60182 -105135 216374 -168635
17624 51957 216226 34044 -327311 198813 -201742 21051 -7576 -290983 -109294 282298
17613 388305 -16655 -178629 -139522 -354023 -76407 230164 265760 355742 139512 174445 105464
17602 105464 40527 209001 -117988 -137048 15555 -185821 218973 42150 -24522 70109 168152
17591 168152 185529 233826 -96966 -119455 472565 -93644 74008 151163 -168845 149125 114720
17580 114720 -63779 -86176 259492 207980 -91571 19275 -58419 64168 66859 142323 349935
17569 349935 122600 11361 68401 -25750 48118 -24794 139759 -89171 -250247 45295 170469
17558 170469 -9245 209784 126597 414102 79126 35623 159333 137638 5745 -33802 -251467
17547 -251467 219194 97963 180953 30950 -109689 -12586 -253918 353856 -259395 -82314
17536 -5380 163949 -5277 311234 189447 -60884 173706 -260073 -154457 -30984 203670 -14212
17524 138913 179191 145595 231505 68905 235782 67916 125967 58175 325627 72368 176426
17513 176426 96963 -75084 220681 363130 239835 -34525 155265 -172606 49378 308269
17503 308269 -144641 168737 -60852 423240 415028 388974 -199266 461755 272875 46348
17492 -168708 158597 104963 -4647 -165298 348941 347842 502878 -136789 49150 128393 17973
17480 49099 -90738 226173 482075 233145 -86558 204168 275555 -85790 -51686 -187105 -152933
17469 -152933 253241 84349 298572 99220 262116 131308 -136908 266599 -241839 342205
17458 195039 324199 396188 227995 -173996 200255 38333 230038 585025 174269 455254
17448 455254 473076 219213 347228 284154 159858 407478 -168475 55819 341916 201759
17438 201759 -17285 -242891 -39748 -81007 320262 -187914 229712 486798 398257 291414
17428 291414 357214 170420 308406 42262 77015 75572 443496 238604 42880 397528 129154
17416 118175 404081 230798 437664 83065 489432 161581 293335 276773 140410 81754
17406 81754 -85768 -72115 250720 -287593 178280 -47926 -277573 203355 -130691 42228
17395 26531 -91623 227054 215420 -143283 75598 408011 -54071 -114168 133765 -62508 153268
17383 -86281 51406 254170 213582 449765 176897 -1140 164483 194256 365028 132757 -31633
17371 288712 199679 60942 150763 -95804 190333 -285424 101776 696310 127520 154687
17361 154687 377806 135482 177984 61899 312841 166713 133680 208229 266036 -115014
17350 303195 -34526 29237 187412 403455 -135666 327679 26044 139886 -94384 -241848
17340 -241848 150793 148980 501129 94301 20678 -221200 303429 458505 6129 292743 -65278
17328 134553 15483 221089 -169402 242975 213060 264950 136353 247682 -49649 -191223
17318 -191223 392512 311179 -79664 456011 177867 517442 -133057 291140 238017 416460
17308 416460 2393 159005 166722 6948 346059 103868 300729 426019 34741 168776 321505
17297 321505 269718 389413 354678 -126892 547854 -98585 58157 466289 -76354 -5227 -293599
17286 -293599 196861 49767 4534 235937 124880 110171 -116366 318841 -18165 291034
17275 146001 250032 566808 253749 6238 154847 229660 57094 397853 188791 39142
17264 -160689 111549 279112 81904 90178 179746 514634 255196 249831 169006 299608 -67803
17252 298872 -70099 115783 -23388 304556 240247 104858 166356 16451 506129 224333
17241 110357 -150941 -36122 369637 292570 468367 160824 58856 -144603 318616 156621
17230 182922 149666 370370 467195 449479 454118 136018 179745 361222 250298 68726 272813
17219 272813 365440 690471 197049 214243 376264 185684 272268 163513 213465 14043
17208 475264 147892 427821 184035 512034 286139 463934 12241 2551 -112029 93092
17197 -115119 248231 179899 161337 -46475 605854 137030 325576 184712 -11128 462153
17186 46424 749225 90703 368392 297120 -57463 327247 459545 -86206 238454 512394
17176 512394 509870 298810 340933 236691 -15842 379009 16736 405742 550333 531803 521217
17165 521217 450049 474451 -111665 378654 482158 498664 288437 646744 158726 134429
17155 134429 50046 337294 378759 495295 309101 387123 426016 155436 507099 400694
17145 400694 324212 240699 604523 244884 148734 234719 735921 91664 494049 486685 499096
17134 499096 395876 125620 322182 84147 300369 500444 271016 396331 469028 341659
17124 341659 447325 295737 237634 477796 286512 77446 59328 491405 302209 463597
17114 463597 506292 446771 40094 234019 278560 353632 515287 245003 224042 723083 890005
17103 890005 62275 565667 210337 529416 377695 455667 582529 325637 213676 458721
17093 458721 568382 231620 533718 655271 525971 511370 484849 300009 679984 611305
17083 611305 467261 624860 362749 472271 253969 77962 278102 722788 685935 493544
17073 493544 427254 120983 311774 306588 221510 345840 648256 843386 513792 619775
17063 619775 428863 573173 643593 287565 493662 339762 673417 640937 362594 674314
17053 674314 676400 865610 423765 489258 571878 870060 572653 615580 380160 421568 319293
17042 319293 440251 536503 625088 306468 516004 469684 576384 601058 359810 511052
17032 511052 530540 687902 766321 579515 787914 853383 621615 486032 511249 537136
17022 537136 524647 707684 834794 512001 848437 687955 661410 628877 656294 516587
17012 516587 815065 472133 610475 381700 741692 457820 960548 904775 796779 784107
17002 784107 683912 701757 795669 753966 550637 720184 768940 895423 1057179 944843
16992 944843 655772 472928 833018 854582 563628 1015111 1023034 799769 795502 1206913
16982 1206913 935229 986130 805423 999552 803569 842342 829229 732245 937572 877000
16972 877000 951173 771841 844985 1011433 968338 1056039 944362 1394783 941761 873956
16962 873956 1241805 967734 910486 1164376 1156220 838030 719250 1040749 961862 950275
16952 950275 1268110 758584 1039992 1397377 1086714 805911 1036701 1245328 1263899 1204473
16942 1204473 1097514 1130639 1562658 1282453 802719 882656 1062592 1262932 1107747 1149240
16932 1149240 1433287 1346698 1077130 1382465 1389293 1376228 1290530 1234363 1252789 1428372 1234096
16921 1234096 1765780 1531588 1512074 1372067 1516713 1774719 1553667 1386532 1600436 1542952
16911 1542952 1450816 1696711 1689939 1743244 1580737 1498493 1656038 1703386 1988312 1562079
16901 1562079 2092512 2217165 1865335 1621826 1921916 1772368 1954145 1952446 1962753 2030366
16891 2030366 1926506 1867894 1857832 1833233 2042723 1989118 2321596 2165064 2509700 2027207
16881 2027207 1981538 2313529 2271162 2245300 2264472 2274159 2208328 2348742 2503822 2419005 2429370
16870 2429370 2454084 2219557 2493054 2616089 2582828 2931619 2876392 2775922 2796887 2604339
16860 2604339 2846527 2889615 2958370 3022759 2960499 3078652 3053997 2978124 3012634 2944372 3313642
16849 3313642 3223130 3739730 3479359 3430367 3444466 3580074 3879550 3909239 4035350 3740250
16839 3740250 4070074 4131132 4219763 4163249 3779009 4294464 4048990 4187737 4146520 4567280
16829 4567280 4438964 4751999 4817645 4845974 4886734 5141293 4898234 5493322 5632782 5526694
16819 5526694 5561371 5363118 6024510 5780213 5969361 6072966 6452647 6504564 6472855 6574867
16809 6574867 6814317 6783241 6897851 7246542 7488515 7529721 7711953 7935515 8049347 7968149
16799 7968149 8574849 8213246 8669507 9209631 9509880 9538642 9742563 9716125 10075480 10378130
16789 10378130 10780812 11039041 11267656 11544897 11680745 11801021 12616960 12571156 13334792
16780 13334792 13596597 13687589 14598542 14949818 15125922 15847232 16156938 16715091 17509365
16771 17509365 17742227 18524366 18880796 20176174 20554227 20790004 21879396 22761528 23585653
16762 23585653 24258039 25487201 26207832 26976136 28492895 29614783 30640900 32133923
16754 32133923 33825616 35100234 36700763 38433532 40038111 41931598 44388332 46441811
16746 46441811 48981366 51030462 53792007 56438282 59734186 62987441 66967890 70238382
16738 70238382 74273494 78244454 83222155 87961024 93198129 98873476 104580872 110957915
16730 110957915 117377239 124164398 131359186 138485283 146032929 153858244 161246371 168223705
16722 168223705 175254829 181597382 187133856 191656120 195675254 198232439 199298898 199532132
16714 199532132 198426060 195836232 192329796 187378818 181733502 175874920 169128960 161666270
16706 161666270 154040442 146755322 139265221 131748114 124629382 117636530 111098573 104710161
16698 104710161 98876118 92785235 87637743 82902840 78000436 73464371 69518134 65899031
16690 65899031 62366076 58903782 55688780 52841925 50314895 47992027 45430469 43143651
16682 43143651 41100557 39145775 37175606 35716719 33938536 32553302 30966384 29829525
16674 29829525 28592903 27476120 26093374 25160446 24263121 23088744 22153758 21223841 20743339
16665 20743339 20086914 19193949 18646653 17738779 17606660 16674527 15905797 15646486 15299167
16656 15299167 14771492 14239389 13637480 13323853 13023382 12789873 11934842 11796239 11341810
16647 11341810 11337186 11039313 10507686 10037636 10002531 9548757 9391744 9135705 8863504 8724653
16637 8724653 8647166 8364651 8055234 7869998 7761016 7443114 7552641 7278651 6734413 6758730
16627 6758730 6650867 6307611 5912593 6133646 6139252 5968446 6017770 5765372 5775393 5559776
16617 5559776 5439947 4966228 5347820 4728015 5197146 4648528 4569506 4711410 4339956 4662938
16607 4662938 4147927 4281324 4367562 4243685 4419237 3824951 3902523 3745961 3940242 4030645
16597 4030645 3671957 3482935 3342103 3385238 3468370 3180106 3353369 3552219 3199327 3191309
16587 3191309 3381448 3232346 3107192 3133090 3219877 3061532 2944507 3003932 2852160 2714382
16577 2714382 2759143 2744288 2541819 2511782 2658808 2276854 2341984 2313054 2348443 2406305 2512548
16566 2512548 1969826 2206971 2029377 1895702 1951575 2220562 2356887 1768525 2015327 1955573
16556 1955573 1673685 1821066 1827289 2185786 2135879 1668125 1795884 1862200 1543476 1773701
16546 1773701 1934009 1658095 1974315 1458576 1840537 1858329 1781050 1750806 1656064 1963093
16536 1963093 1699307 1480740 1380489 1594093 1665977 1514652 1060239 1631851 1118824 1192107
16526 1192107 1260296 1618148 1400347 1068920 1067111 1300592 1176969 1204220 1224630 1102855
16516 1102855 1077970 1243522 960969 710055 1177252 1236545 1223579 1170976 1136389 1003067
16506 1003067 984262 1072014 781802 1004792 1209632 1202307 890739 1082881 899079 929638
16496 929638 1311667 1089889 931981 899597 1107016 1050430 990831 971232 1112750 1099161
16486 1099161 903447 853804 878316 1002373 639126 1201135 973292 598982 668003 1075971
16476 1075971 883054 527368 807051 1092501 594922 992854 657236 819408 713083
16467 713083 786033 634378 606736 570078 541534 552327 666217 638098 551215 567273 930891
16456 930891 800075 780025 625939 639314 629419 803452 389909 853549 435876 601093
16446 601093 401237 536474 323304 905638 713579 459273 502397 416822 720577 526091
16436 526091 285679 932716 573686 442932 255398 352004 540779 630903 380460 808573
16426 808573 891859 376525 415305 662370 538994 465115 726237 503649 526858 357600
16416 357600 514624 666337 606546 608174 301986 555757 732432 407022 403485 526478
16406 526478 402151 297856 435273 495932 594755 466382 435807 628019 381009 442844
16396 442844 541203 624554 243568 -9792 532143 243181 27526 296519 15795 367044 312551
16385 312551 398551 470593 96823 374718 252639 223556 520190 279417 485328 514916
16375 514916 252666 621927 230164 185546 9026 334526 -13739 -5747 262892 486093 156118
16363 198617 319063 219051 335900 154400 78077 372512 514398 131779 199718 177998
16353 177998 373531 232053 531322 513712 246573 219777 363851 464913 -161559 244338
16342 495226 96065 106783 64803 306188 -48897 399178 284571 311419 261889 194104 138628
16331 138628 388041 115077 -109757 232453 190100 669554 207367 133525 215586 -119989
16320 299844 175900 329670 262718 53398 155998 163027 124270 205299 188314 443948 -67374
16308 430744 -101849 243458 483924 8258 477244 -79983 219515 47772 283515 107887
16297 106227 137526 209977 386072 40436 172275 139721 229066 192005 101030 257960 -2560
16285 331658 -97679 -33239 219721 209118 81713 -1597 186183 257287 -139882 150616 386992
16274 386992 116822 178364 218112 -138816 16614 62718 296468 143064 266157 207261
16264 207261 -205752 231631 218522 223029 -59451 189677 351318 117375 41342 344369
16254 344369 -169482 89180 140202 53506 75414 149747 347739 363882 104620 166206 -149689
16242 -13478 106949 116482 270207 47872 -170165 365269 -149068 127932 113856 299994
16232 299994 213754 472418 -182776 29103 267947 319847 377494 222570 211029 312980
16222 312980 76650 330356 237312 187255 -62891 -45719 191328 -56672 51840 -321452 110118
16210 12271 248633 187775 135139 225388 77674 235422 -20832 -81885 -19655 8529 256886
16199 256886 12106 190692 51341 127025 43948 -106677 190754 18370 -117646 241684
16188 -33031 223049 -364377 87583 233043 135744 95754 68838 45282 72236 -52873 206089
16176 250504 102906 106174 100090 -405468 255276 -74942 149289 145562 203072 316902 99779
16164 150781 224586 -111846 180217 -41646 1624 125549 -241215 186248 -154540 -309176
16154 -309176 -18620 302074 -122766 -50047 8603 187906 13717 52800 -222121 -153435 -175207
16143 -175207 44101 -109370 -142957 -55927 211089 -292244 -161625 164989 47747 19366
16132 94695 -160265 101854 -263119 -384890 332409 -317922 -52211 -325006 -151552 -56851
16121 48355 285696 -318341 234362 -179690 -88622 65598 -261998 18716 -145288 330042
16110 -30384 -16090 -122733 218041 271342 -189043 80226 117759 -48167 292811 424565 -281268
16098 -45833 15486 -138143 205417 47566 132669 489431 -57517 -166834 97546 215861 108354
16087 108354 -67466 226313 135445 -235576 -228445 -264539 -27380 152794 -153418 83735 -251920
16075 116308 115420 284379 14333 -173448 97487 78590 338006 164461 -171140 195650 -156619
16063 -133418 165576 162595 -155151 -139076 141567 94902 -11911 -72146 -124373 56904 -89976
16051 -96870 -146140 -86606 -237847 -169805 112127 -259795 57436 -13238 -28371 31250 -30660
16039 56616 1732 128891 -90846 77171 -169423 -90795 -58001 338717 -347413 -221671 -231543
16028 -231543 94212 78433 -31657 -284829 80010 -200173 -60576 335762 -2197 -273331 139234
16016 14976 195923 76861 -234385 -75523 110317 -566283 -177837 -35129 -324890 -335975
16006 -335975 -49152 63572 5272 -173176 221345 153790 -40613 22125 127277 5220 21449
15995 21449 94044 -305326 -53663 -135225 343422 276024 57028 82170 -30093 -181099 13194
15983 195128 35622 458828 382972 444158 -216304 -56432 -116610 4271 -4651 -93578 189099
15971 87713 -155834 -29497 -196656 -250160 14615 -206407 -309409 114535 -263097 -266467 297193
15959 117791 246509 200279 170771 3090 166058 -9530 126859 -294595 345100 -13688 -296820
15948 -296820 -274975 -39473 72114 20394 -254492 191903 249575 -126695 549 -159602 524320
15936 -133725 -65030 -140150 -153044 -88639 -32345 -120191 157904 103122 -118918 95684 -51602
15924 -59475 -11682 -251129 -178819 -124649 71706 -11190 106058 -131463 -387342 -144510 -31379
15912 -63124 -81642 -96297 -68211 11763 4892 -215175 -164930 194336 -32301 -79280 -291313
15901 -291313 49323 -105415 -74638 -194869 23774 171061 -47999 -150613 -98305 -93475 -178906
15890 -178906 -145979 -117626 169420 -132120 -75498 216483 46062 -36959 -267015 121467
15879 116713 -167418 -88117 -129971 92596 328222 357523 -105750 -209738 -181167 65745 52603
15868 52603 18749 124351 147281 299228 -286747 -32291 -240613 -33922 17765 -209876 -252650
15857 -252650 -7770 -121626 -4575 -21612 -182447 301884 258013 53253 105144 175359 -86019
15845 30140 -304336 151563 46012 -188291 232005 -57809 251088 110716 -113656 126370
15834 251518 122305 291552 -61439 56941 -61275 136176 -114249 -138536 -112711 -97164 -15282
15822 -103288 -272648 -248436 1149 -310284 -84749 -180104 -117938 -219548 126068 31831 -103702
15810 28297 -73699 -33280 -66063 -48711 144851 168449 -68127 -207795 118818 -62363 121423
15798 84131 -272548 157541 -77171 -82964 58415 -196378 587626 -191761 -397859 407877
15787 51167 -132963 121965 69156 -236034 111968 181272 39817 -203313 -12763 -124804
15777 -124804 -376820 14383 -58180 -279134 -268501 -122109 -162961 -246061 7838 105938 100376
15766 100376 211289 -64751 228152 269040 21896 -36389 -121880 -108117 -22762 49222 -119454
15754 145395 -48259 -63278 139658 106802 -114210 -10922 153832 250031 -128216 341306
15743 5445 189876 -263787 20963 -131555 -84688 -92465 90503 -138788 62738 -48741 28402
15731 244016 98687 -125461 21119 -352379 -20263 -277417 -179962 82384 159170 -199220 139487
15719 23398 88069 76736 -172735 -148709 172456 251700 256225 -253354 3141 -39080 146239
15707 -276363 2565 -15477 29039 -230037 205732 -135242 -2496 40443 10975 104253 -44001
15695 175645 -314633 133611 -121250 197700 -149399 46485 59639 -51895 80489 -336701
15684 -195914 -63287 227239 -141631 -16181 -257430 -84946 72975 -484317 -105513 30220
15673 -186531 -183120 237369 -4531 -189803 -313148 110546 525671 67883 23977 112272 112622
15662 112622 -5197 113243 -324793 126477 -55412 -91775 -32763 -39266 -45303 31288 54216
15651 54216 120590 -345015 28182 -141017 206947 183889 -106308 -84802 19653 244200 -241485
15639 -379388 -57695 70802 31942 -150576 -182924 -267722 31371 -121996 -27258 203149 -3525
15627 -120050 -242335 115940 292266 -94774 -16753 88654 -191734 -77353 69452 -90135 65650
15615 -77617 -320966 28632 -127617 99011 36362 72275 -50539 -292741 -53421 138613 215181
15604 215181 92074 -30564 -78847 -324074 6278 46867 -363744 -44262 13578 -264903 299580
15592 -109521 -96390 -75631 107206 -43487 -29286 -76405 258455 15719 -317324 36096 -359660
15580 -81250 -317247 124149 -12699 -34106 -197271 128214 -207739 973 -143911 211335 -152514
15568 173191 -69378 39101 -186115 421850 -23920 -91826 204443 76373 -121758 -67173 -57325
15557 -57325 62720 303762 93768 -153071 -60713 87050 -671 324508 183138 -227472 21722
15545 -229057 7524 148522 -254535 -10720 -86364 165442 108574 388195 -133932 97605 -281518
15533 202561 239535 -99649 -157245 -82632 22296 -91077 82934 -166412 -36406 40124 70780
15522 70780 121951 265433 122240 -137130 -132150 -259662 238294 329664 383938 -216002 -79869
15510 126305 15993 -257815 -202880 -138585 254748 117403 117940 154098 -49634 67817 -153501
15498 61258 -35053 -13978 -168168 117393 254331 -263903 49794 160706 -92946 -18248 240872
15486 67388 263783 -302413 -22914 -382487 149903 -44047 -319116 52283 -76541 -52109 -93785
15475 -93785 -210939 -15070 -142640 -249445 -77501 94920 -165529 -179032 241238 -83350 -61904
15464 -61904 458835 526942 -138509 -287883 36939 -40480 3688 -105586 -155816 84621 -257276
15452 -157876 -101135 -117837 385273 47572 76105 -29485 -14113 189217 55271 21069 138834
15441 138834 -289413 116881 -6436 88525 -139614 -207826 -288823 131441 -54974 -148143 -17434
15429 -323104 10814 74305 14176 91170 109513 -308640 -44839 342932 117796 74390 36613
15417 51983 -224826 168016 301364 200740 188147 120544 90539 47650 -32056 -194291 31095
15405 -207202 -46352 102689 240094 -45493 203713 302734 384179 236439 -79577 -364370
15395 -364370 -219804 -183620 21638 136781 223374 -1904 -195096 -142060 -388535 122089 6181
15383 -116564 136604 -114273 -117912 -246509 -159491 188343 116947 -102676 -369427 28786
15372 148297 -45280 121571 335768 64852 180033 118578 -139286 -128303 274987 3914 80649
15361 80649 -40582 36937 100549 -26926 -205289 -63789 73618 150736 143078 20229 -104787
15349 -372453 -130297 11282 28900 -77581 -202782 -168694 -76815 44383 8207 246617 -155397
15337 84184 -236679 261591 338586 -137511 -57066 -69462 152417 72318 192773 -126569
15326 34828 -53221 23430 -216745 162393 270585 159003 311998 334451 -23565 78637 219806
15315 219806 52919 222918 -151505 -124622 189632 101297 51354 610195 4612 86869 116563
15304 116563 -88030 -46681 -102282 -60701 -309510 100934 55578 -68065 486324 215035 197793
15293 197793 95573 100624 261204 261283 63540 144731 184106 -110615 66411 -111158 -61536 -112547
15281 -112547 -130952 35712 -265168 243969 420685 282244 -110254 72505 223502 226291
15271 226291 171572 313164 12475 205355 -122523 99587 7492 73072 370207 139787 -89073
15259 56666 135443 232850 3101 -30978 -62205 -142602 -111104 418292 587764 487615 1098155
15248 1098155 1438881 1212177 1309140 1438349 341223 139158 57435 35339 19620 175262
15238 175262 24019 160512 -213697 190976 112631 227847 -87253 207286 190842 348257
15228 348257 -99752 53214 224504 183689 134922 64539 86356 241761 33658 63598 -44400
15216 123771 159937 -199238 128843 -104495 -93656 47242 111733 -162999 -182380 127412
15205 113357 60719 -74589 141458 -222517 269419 174546 254904 416827 322267 -226181
15194 145035 77928 198668 -91200 -160025 2911 -15111 114249 308717 165016 -126863 266430
15182 171685 70764 316190 101652 178049 147460 -2503 150601 -113225 53923 495831 75386
15170 13983 147984 23030 -202511 171508 -215275 121191 61219 108700 -222754 -38302
15159 -115046 -188209 50568 288977 167804 218034 -14647 226260 -101616 215168 256505
15149 256505 155866 -342533 -173531 364058 -28608 198044 1816 116794 169192 149456
15139 149456 128558 210076 -127215 216928 164872 -59862 207735 -99006 119565 -129500
15128 272875 210579 235990 309250 337010 32910 -195500 96946 100681 301522 167469 270566
15117 270566 382647 374856 244382 179165 194427 441245 -37674 -46983 358734 77931 -216632
15105 21498 394216 136003 186558 -130043 286308 115520 -116183 81520 167892 161858 220442
15094 220442 117880 157055 256362 266107 -101450 295537 127280 149388 228384 66869 154477
15083 154477 -125647 -57711 116273 398810 78904 16130 143922 690844 364068 -117226
15072 72846 422705 390386 298986 161651 169880 366064 163376 497635 -5822 538551 204327
15060 -172792 133224 238048 60116 401261 -215191 382371 -295234 144238 447639 163402
15049 261905 307190 57156 292388 -46110 316076 156407 197094 452432 224705 227542 -397
15037 196429 270201 25012 364872 77720 240871 192871 -216675 92169 115415 206708 219239
15026 219239 266487 267502 -103850 16473 136933 -2375 432300 -88344 355528 294899 -82795
15014 232328 62858 627045 112517 318977 -60249 183950 205093 167836 402292 25177
15003 382997 124291 90023 349600 183569 57359 450388 337680 489327 350260 418781
14993 418781 337311 -275672 369389 339949 251008 158646 -61639 442827 492859 281141 -49837
14981 306652 359086 295609 348335 257005 -157631 219253 143647 356194 139793 186323 201993
14970 201993 93919 269962 8823 56069 297547 8247 431292 341127 217537 67334 106360
14959 106360 205106 494406 92383 180209 276706 329512 89674 455472 447328 -104491 94732
14947 -25293 214138 177734 264886 237614 249416 -11190 238116 164374 379301 317327 390864
14936 390864 20909 42825 301873 299853 257821 471599 559255 97042 293510 382895 258416
14925 258416 193782 166493 274976 154983 218932 559338 149141 288222 153075 469982
14915 469982 245117 126839 289462 445650 483207 260416 688738 284987 39082 328112
14905 328112 219037 266765 174957 208536 -29280 260246 141465 495810 51667 147733 15619
14893 482112 294840 165546 350952 345082 -128836 660894 333920 639693 244528 343241
14883 343241 245235 448676 531687 402761 589426 515122 550942 632508 170225 543283
14873 543283 154992 211746 512163 488487 428013 53227 590853 340341 492007 548230
14863 548230 438025 437798 322450 792664 448751 327725 74875 649571 461791 601059
14853 601059 305566 198438 168557 444671 242035 386615 329767 370373 596588 224552
14842 623205 118204 252730 121854 645381 276929 651730 555434 361905 510345 417163
14832 417163 126780 424269 379357 516807 384892 650598 572112 646674 480545 316016
14822 316016 436369 527939 501776 576989 337693 544788 459649 233767 552715 187482
14811 383697 493813 316410 291897 375353 194175 595910 317615 761610 288041 692370
14801 692370 597289 779143 380650 615894 347737 625223 659331 516366 898121 411133
14790 574100 532031 286962 862075 502241 835138 790240 501733 453001 313892 626363
14780 626363 258560 563348 536564 297925 361403 842524 741982 643686 490929 501769
14770 501769 653118 768777 518299 508876 556738 504725 769357 881525 300383 722815
14760 722815 692781 568659 703882 537539 540857 648632 709244 905138 796727 613057
14750 613057 853788 866131 694148 543096 460929 890772 659026 614598 724276 746673
14740 746673 783030 609578 935621 891839 829380 763319 1221732 841346 896410 551967
14730 551967 489318 817778 831866 928932 722937 594431 810332 983593 807812 996492
14720 996492 876228 983802 1070300 724011 933287 534697 1018655 883167 691822 710065
14710 710065 700735 770645 979371 867219 962808 740006 654003 825837 1008779 789392
14700 789392 1064813 831345 1174938 875002 1087323 564141 636112 847877 571385 755997
14690 755997 947139 1166622 806453 938301 1148597 1185915 932559 1038653 1383884 1023617
14680 1023617 858869 763600 1254339 1129226 928583 1000317 1365475 1190133 997076 1056573
14670 1056573 1326071 995426 1156440 807841 1095505 1065693 837243 1119871 1549700 1090632
14660 1090632 847864 1077685 1136069 1198178 1331909 1218461 1352551 987726 980380 1268429
14650 1268429 1117580 1256251 1198760 1231155 974331 1304424 1231944 1029164 936390 873608
14640 873608 959545 929785 1275597 1644616 1034574 1247131 1520140 1472967 1220373 1254992
14630 1254992 1517820 1269010 1222858 1377634 1368545 1115754 1289969 1600392 1242807 1608362
14620 1608362 1842118 1405054 1423317 1708338 1568036 1627414 1647367 1786016 1671098 1436259
14610 1436259 1607515 1582429 1382760 1842993 1776421 1531307 1624649 1501203 1649791 1586640
14600 1586640 1558862 1813100 2031233 1926282 1774489 1786675 1853311 2027579 2085973 1538319
14590 1538319 2009958 1862182 1579242 1972067 1750819 1767246 2016430 1767168 2071979 2066229
14580 2066229 2393901 1988633 1978909 1972389 2298760 2049121 2199964 2242058 2285642 2620986
14570 2620986 2202719 2152159 2311842 2470749 2423724 2203791 2279952 2631885 2714889 2542670
14560 2542670 2776884 2757594 2690086 2770934 2794133 3273770 3409544 3751661 4459197 4805718
14550 4805718 5921381 8002837 12500453 22030635 39836442 48997283 24978693 10263107
14541 4978132 2993161 2374868 2386515 2046389 2071828 1790065 2038386 2024316 1948728 2391684
14531 2391684 2096109 2120027 2566324 2334723 2546077 2187437 2631997 2634690 2557128 2440533
14521 2440533 2640601 2321689 2502957 2225347 2579030 2765598 2906873 2298408 2648552
14512 2648552 2870884 3075649 2960096 2738752 2897372 3008965 2963071 2975603 3093427 2828868
14502 2828868 3456203 3276773 3266106 3413506 3249808 3190824 3298564 3148222 3249849 3693527
14492 3693527 3517813 3753620 3936761 3814328 3617671 3839388 4073391 3959545 3866343 4419325
14482 4419325 3612072 4025841 4240189 3903362 4070331 4327044 4511380 4135418 4350200
14473 4350200 4338713 4439855 4257421 4697835 4590001 4764664 4537574 4621736 4921772 4699884
14463 4699884 4583036 4969847 5220466 4734328 5417048 5122571 5307097 4979328 5441188
14454 5441188 5494196 5507231 5707617 5642662 5475287 5583905 5914094 5820971 5619384 5889620
14444 5889620 5853425 6148030 6028705 6114804 6238549 6498828 6550438 6905477 6345157 6949327
14434 6949327 6811487 7127500 7249734 6911287 7599265 7451495 7110508 7603698 7338479
14425 7338479 7689934 7608330 7953183 8423318 8170754 8358942 8535257 8391108 8839132 8802712
14415 8802712 9072433 9071338 8999023 9066507 9172066 9380922 9325081 9477697 9812216 10218830
14405 10218830 10507719 10222957 10533118 10659680 10817687 11372771 11134820 11302267 11715931
14396 11715931 12024497 12033831 12361252 12360556 12537374 12594131 13220321 13340614 13527192 13876926
14386 13876926 14034094 14200285 14734308 15137380 15083395 15688298 15540786 16011465 16357539
14377 16357539 16479351 16853526 17192060 17324865 17664555 18156517 18177383 18626612 19322542
14368 19322542 19549198 20401732 20929084 20639711 21338150 21923914 22333476 22795489 23085430
14359 23085430 23583408 24135145 24698223 25460532 25665652 26632149 27380033 27801686 28775462
14350 28775462 29438377 29912921 30763840 31802674 32285433 33029861 33789078 34813973 36248815
14341 36248815 36966867 37992347 39098173 40171864 41360368 42159787 43842482 44661217
14333 44661217 46650799 47717337 49338988 50541533 52200088 53722176 55847539 57218024
14325 57218024 59222519 61481558 63826053 65402820 68344677 70182613 73203843 75967077
14317 75967077 78449447 81406320 84414706 87929081 91713354 94839767 99698294 103167686
14309 103167686 107468033 112120440 117056788 122120869 127719127 133421638 139823331 146207484
14301 146207484 153087764 160504750 168443455 176710330 185718332 195032734 204888819 215471806
14293 215471806 226404420 238203813 250138449 263335145 276852268 291131552 305484993
14286 305484993 320491558 336169953 351788936 367775937 383461766 399326261 414404909
14279 414404909 428904813 442650299 454898279 465744186 474839203 481074108 484402534
14272 484402534 483092450 479564222 477011826 475334691 469095168 463871605 455721892 444914206
14264 444914206 432875731 419057564 404477427 389322106 373563458 357547291 341400765
14257 341400765 325165482 309562351 295447891 281277369 267456976 253934403 241324787
14250 241324787 229486471 218081746 207544375 197574076 188050650 179147546 171202468
14243 171202468 162985378 155348047 148079327 141518358 134971170 129401719 124223568 118589798
14235 118589798 113379585 108685217 104340799 100379838 96554888 92760227 88821339 85362163
14227 85362163 82475844 79122047 76186390 73534183 70908348 68370959 65910499 64017991
14219 64017991 61849888 59641443 57785694 55702158 54091295 52646407 51432378 49714922
14211 49714922 47997025 46446147 45220337 43983312 43374520 42370261 40823029 39789727
14203 39789727 38587449 37181731 36532934 36031193 34857786 34031110 32706461 32351930 31260556
14194 31260556 30761752 29747857 28931400 28426511 27694785 26887615 26375466 25541443 25388648
14185 25388648 24499748 23874187 23686408 23157354 22502741 22052448 21765516 21150169 20890196
14176 20890196 20084603 20130878 19660010 18961925 18848830 18318847 18060983 17800908 17169336
14167 17169336 17392368 16765375 16473993 16094195 15910308 15785511 15216174 15128109 14680209
14158 14680209 14723712 14373830 14143384 13556084 13805602 13405385 13457477 13150012 12601826 12483684
14148 12483684 12260832 12255661 12119034 11674593 11547714 11614831 11172324 11139364 10952064 10815367
14138 10815367 10504615 10463044 10126833 10167962 9867263 10083178 9753682 9882582 9425761 9361689
14128 9361689 9539471 9153061 9032375 8971606 8697023 8476978 8573807 8248441 8106135 8216662
14118 8216662 7954935 8004259 8023257 7849599 7205754 7713900 7650615 7379961 7470640 7285590
14108 7285590 7170532 6883548 7077224 6794784 6540496 6696701 6690954 6574827 6623307 6297884
14098 6297884 6165751 6107638 6080343 6027337 6236582 5796749 5693808 5896371 5873491 5514684
14088 5514684 5363477 5658425 5592129 5375244 5384877 5381678 5392221 5329585 5262880 5003952 5063608
14077 5063608 4925050 4701170 4710602 4859805 4739145 4981801 4626886 4882015 4494431 4667612
14067 4667612 4731082 4408293 4463705 4582981 4340420 4696188 4108254 3786359 4073649 4606817
14057 4606817 4349279 3941884 4191382 4002138 3939088 3958751 4099072 3687421 3746451 3702933
14047 3702933 3937302 3681523 3799103 3427977 3742313 3449830 3668694 3658276 3395538 3524665
14037 3524665 3435360 3236097 3332907 3212039 3238920 3617559 3066524 3343864 3587318 3652719
14027 3652719 2791927 3169770 3003195 3168216 2823032 2935800 2922013 3164549 2843561 2952357
14017 2952357 2559286 2836709 2845406 3027669 2694348 2846114 2582550 2696766 2500888 2435748
14007 2435748 2497715 2300648 2290264 2380604 2052024 2373998 2495393 2125829 2121816 2364600
13997 2364600 2221843 1959648 2590011 2119588 2384663 2441608 2607451 2549030 3753722 7135530
13987 7135530 14807263 31127193 48983648 28941536 14748200 8509890 6574401 5204281
13979 5204281 4317095 4105599 3605542 2999710 3174941 3187111 3002200 3010425 3003257 2576191
13969 2576191 2687498 2932267 2690992 2604014 2542004 2598438 2637743 2634706 2251529 2211941 2319610
13958 2319610 2180092 2386173 2094708 2129336 2360584 2080240 2094208 1992832 1948155 2142859
13948 2142859 2024509 1960675 2056399 1792450 2004531 1941109 1954860 1917337 2036335 1800592
13938 1800592 1822056 1975771 2201075 1752766 1729635 2174227 1818661 1735776 1707722 2044600
13928 2044600 1695179 1874750 1732132 1683413 1684349 1744545 1783614 1459310 1593083 1537177 1932774
13917 1932774 1624206 1586667 1776918 1654363 1554302 1371259 1496244 1471453 1024967 1757659
13907 1757659 1647859 1359226 1455581 1474631 1485042 1204258 1464280 1266913 1313266 1226989
13897 1226989 1500280 1537185 1453660 1275212 1138651 1316948 1164444 1537491 1245844 1350603
13887 1350603 1392705 1322168 1638819 1401516 861120 1417251 1311967 1437219 1241949 1327290
13877 1327290 1034501 1281757 1246461 1132670 934990 1209340 943532 1268058 1247132 1072804
13867 1072804 1011650 1137742 1520644 1403814 1078417 1018903 989460 615968 1045397 1171890
13857 1171890 1181503 1046295 1167554 1259631 863612 1116340 1043757 1144734 955744 1271573
13847 1271573 993835 1077989 1237372 973463 1054730 1009429 1168734 698905 1108546 1240721
13837 1240721 1222375 1198953 1122993 730714 938327 1069204 802525 696073 852024 940849
13827 940849 715697 1239196 920868 936387 1064194 593789 816190 956149 884157 1178968
13817 1178968 950533 814644 1395326 509835 1134001 1045194 830902 1233855 1112351 992109
13807 992109 1069129 730793 809374 942849 769000 1166917 951166 885816 787994 648483
13797 648483 884567 618829 702705 772067 867985 776889 802450 1141812 837639 770038 715136
13786 715136 658361 1066215 405256 1046752 672275 938830 603241 760630 780867 1145328
13776 1145328 795244 1075993 514257 730675 770162 620055 931765 732218 763558 905288
13766 905288 418845 705760 824585 945550 912738 831390 891340 1097698 861368 916912
13756 916912 686882 520007 864760 771568 551306 885856 770549 764259 392518 422857
13746 422857 687839 849740 710676 432198 294692 403566 517930 804625 803099 578348
13736 578348 1085689 995806 496468 571953 575115 894145 1065544 886017 1002392 598838
13726 598838 589875 994495 798162 917455 392664 651329 625933 497860 465958 227483
13715 414643 669798 865654 723366 804179 766797 447503 711753 607945 305074 587603
13705 587603 661315 497011 576646 441778 716957 499311 509367 524085 714487 519418
13695 519418 199699 385510 561721 430791 205147 611785 624815 305008 682532 460438
13685 460438 535220 362372 452452 338475 574726 546635 635958 363612 418674 565295
13675 565295 548171 351493 650998 407402 575630 830976 691374 626981 778734 510828
13665 510828 432604 206920 450127 551901 683702 619336 827635 781642 269872 352526
13655 352526 732613 441660 663322 380471 603541 594723 444508 553798 -54807 394830
13644 441747 394549 630143 680806 353060 563424 347389 589665 282901 419969 696535
13634 696535 553197 238048 624879 396823 463913 581320 358958 470528 245216 306304
13624 306304 436169 547845 742875 330896 452088 147532 312878 571751 348355 403878
13614 403878 503664 291651 467458 367370 334892 721428 357484 288985 627706 324528
13604 324528 463337 176896 330530 416568 593749 478990 509295 568485 382254 146341
13593 228552 101330 179079 457351 526499 401935 392759 255057 376801 531333 120356
13582 549623 489312 292261 250412 264158 96871 396277 60856 413831 314111 487350 296150
13571 296150 100504 419214 553908 598822 375093 346749 370687 539107 567420 167444
13560 387574 73965 334345 112945 135237 78566 390127 539854 276425 267196 433894
13550 433894 706018 155471 128365 383127 282983 617698 194841 310458 431694 534809
13540 534809 29940 225954 459078 476495 388219 413005 92654 478264 151821 196955 267799
13529 267799 261067 344673 318197 637113 268162 221874 345845 299704 406391 237749 166168
13518 166168 276503 246633 237023 382842 119867 578939 283770 540680 348859 243435
13508 243435 -112073 256037 257107 419705 72214 315825 88279 420613 392791 385898 369758
13497 369758 464944 172688 404505 9480 -22798 221103 5358 477963 166496 119592 228920
13486 228920 255619 298497 533317 438626 406047 231177 633892 -53596 550044 277044
13476 277044 214980 406254 189901 484940 264531 484231 -27380 428316 170251 34531
13465 175817 463176 248719 561012 208195 201597 257193 381443 400570 118109 20963
13454 395167 538756 312202 325952 130309 801624 258944 299991 545684 282484 -48572
13443 535833 68512 112767 159859 370568 309152 677098 301135 230812 14623 339877 174308
13432 174308 190851 466102 118091 487246 23709 -13986 80544 166125 -24278 373316 324764
13421 324764 169666 95829 370441 -112410 198963 81908 281007 44790 445422 298249
13411 298249 347750 156052 -52442 271086 94453 305538 304801 94865 419608 64189 113449
13400 113449 140716 152674 250183 442048 430724 31189 210055 460228 236545 360841
13390 360841 153015 225503 339198 289567 -47357 250013 302561 49233 465367 272638
13380 272638 419643 93922 3572 184522 76048 22742 86918 -1568 255319 121484 333618
13369 333618 149026 196977 294937 292195 332762 -76559 134085 440277 103028 281592 122007
13357 59450 152614 535579 45311 -69807 242054 297282 464386 592401 155343 10971 207771
13346 207771 546941 343564 306732 134083 230627 127208 439518 247406 -258669 317246
13335 385991 201019 142578 409459 332392 221739 315026 244086 358652 217750 155438
13325 155438 315737 179067 173218 501566 238388 256247 260658 148714 227003 -21452 -2334
13313 550981 159505 101637 62539 484913 207209 241562 14550 -27709 440834 31346 417446
13302 417446 -47691 368889 155766 570523 239006 341264 401841 482591 270100 81560
13291 33559 -41801 31866 347969 321541 107635 242107 -45 241322 146347 399359 68722
13279 188859 67369 178773 352776 57426 137630 271977 109720 -4283 -30734 521295 -119574
13267 -1461 -103182 167834 233100 -7699 -145941 -367212 -171683 144775 109861 83137 58358
13256 58358 344479 392142 -92183 382828 307699 60336 151999 242318 275567 135211 125300
13245 125300 291377 454336 36208 245196 384831 277411 8078 238926 130060 -59236
13234 303317 -11563 4422 340449 -282336 260210 -89618 190583 298831 62372 293550
13224 293550 100807 302123 234479 175661 30511 -304453 166062 -93022 201574 98419
13213 90461 -177200 219077 96825 162354 169292 384524 -75790 419613 -65584 156825 41140
13201 198915 143399 314598 210677 301559 248869 32338 -131601 -28118 -105730 296121 435898
13190 435898 291239 -125752 194062 -8833 75372 360144 -126258 211489 68823 29699
13179 78241 -127558 -101925 101673 -334235 -1643 266984 -145064 207424 -13130 368737
13168 54051 194188 217776 346675 315109 284211 44381 336600 234184 110717 256815
13158 256815 152896 232420 83434 313048 -1444 96520 38189 163867 134604 176033 362369
13147 362369 -17173 120240 -129648 -135556 61461 -162706 112829 139713 82165 300573 209217
13136 209217 178300 300405 182860 242625 -94551 311710 5764 60295 127339 -53430 32262
13124 361830 -221910 -61834 439396 641594 289313 329708 -155976 153480 178871 -121228
13113 83405 292891 237538 116859 383117 141308 148678 -9632 264045 -23568 -120845 77124
13101 44847 -94940 163916 -28593 441992 114868 284521 54706 31566 59878 -31678 360618
13089 134494 140135 172579 122830 151296 100253 -270715 -191010 -14615 202962 -105604 41302
13077 79352 44571 438393 393215 45346 460898 190123 262018 72505 218043 191842 340683
13066 340683 -209599 460307 202539 -200940 490170 -211878 142823 208619 -52016 -24511
13055 341664 180109 213403 363254 -61951 83555 177796 -212269 482487 -86230 -149976 92824
13043 328233 434413 75111 100026 -8625 240474 -374115 83011 407839 126034 -367807
13032 87336 112632 157709 174140 -26655 355957 -147818 -27769 157528 -60210 274534 2432
13020 89388 473543 -436504 -236012 157737 6308 -73535 61460 92086 331382 -26158 145681
13008 341656 310425 42028 447023 -48943 52085 18151 444717 380925 -76331 253790 -66140
12996 270865 -45949 33319 137395 62204 76580 -63414 90385 99526 -39796 42140 48687 232092
12984 232092 -151278 101850 -46654 130472 33269 -191050 -89720 221952 -250720 86450
12973 251569 75939 -199457 61839 287894 -155834 136621 -90379 -90539 184835 26897 51224
12962 51224 125550 -11622 270115 -100492 197555 -96257 111624 -227951 7194 101774 -112060
12950 -62192 -23234 -43446 317175 -77459 44873 290805 42852 -341437 17559 79469 74446
12939 74446 296773 -90963 81746 -220290 -9745 101259 -662928 -260959 278049 197991 105559
12928 105559 -11430 86499 -16359 90477 59519 -105293 -8309 -291773 -283447 31508 129603
12917 129603 123283 -120693 -157650 -157494 65324 220921 -75974 -58886 221341 -139059 352449
12905 12372 110154 -215961 208640 1272 -64192 68293 172715 -226607 213851 -61094 -32883
12894 -32883 73814 298117 163206 151 -47762 81517 53642 423411 -101433 306659 183312
12883 183312 -155550 151047 27481 -24319 277935 204193 -139522 361867 348088 -194194
12872 92226 -195601 140576 92290 197881 135006 202595 -72007 35052 48025 -121996 233504
12860 225680 -13220 23851 -88069 141681 -101402 61430 774938 -132392 222556 281907
12850 281907 -148774 -90090 -52662 91262 -13896 162307 -359931 -147228 -174765 278792
12839 123923 27454 299558 100670 -57364 -3096 313730 -112963 317547 276306 51312 83694
12828 83694 -276060 134374 79788 -123556 -135477 -289429 -92782 37802 63172 207304 -2499
12816 -374469 -55353 289375 161567 -51605 -99300 32126 128619 171134 -27589 61554 102522
12805 102522 79436 49162 50726 330321 160912 -193089 200563 -65641 -132750 61360 25897
12793 -84328 2727 156423 634 145464 146476 -26006 -137847 46237 -125410 -158252 79861 -62254
12780 153880 -132789 -18096 501154 142471 -88550 263566 143937 70866 243022 272834
12770 272834 -56866 -51765 23991 -123325 -125112 -156471 -94518 -170806 142155 -203007 -64513
12758 161547 -71311 234561 166756 -90735 226787 -222405 285567 166762 -117421 174594
12747 9057 28476 318554 -56696 302498 -100852 -74072 -34488 -78217 -112042 210914 243495
12736 243495 245607 -24943 33204 203332 278413 238224 -85263 -192361 -184388 114618 -64803
12724 89165 28664 -201785 43531 -135398 -318764 27813 -153672 -78379 -63527 -22200 -122915
12713 -122915 59299 162087 197870 165133 45278 100593 118249 242498 333122 -6278 -51544
12702 -51544 193047 383078 69852 131099 -36675 -209139 154975 -17828 108732 -201880
12691 80703 -36883 -96428 -26300 103464 -190300 -73855 71900 15667 102659 16045 64822
12680 64822 96427 -102886 399051 256978 -147474 205349 -21176 132564 226512 36031
12669 173881 67270 -174523 81167 125605 -98600 -175748 -132809 -110861 -163301 116344 242736
12658 242736 13696 -119936 682632 385702 -229981 160710 -393733 191236 189599 -1020
12647 322760 119350 -59185 196633 -55815 -52311 -161073 -33619 -28823 197427 -303188 -66762
12635 94578 104711 117072 85949 -9523 67777 486170 60081 -34133 29310 451756 -211291
12623 529314 -213894 -33372 289840 77676 311359 -12139 187385 -293746 -8764 98522 -127921
12611 259172 317549 200447 7957 -50087 74333 -40629 -28259 111093 -322027 23157 -144861
12599 86471 266754 163466 166311 34494 -107040 278999 295726 -33390 -204256 120873 173799
12588 173799 -7726 51097 -137065 244200 -17218 136954 36035 -285824 224298 190667 230529
12577 230529 114714 -167571 25316 263847 35660 -66833 219578 264115 25805 -140760
12566 64773 -41291 -359287 21166 150140 -179524 -66891 188798 -192773 -88015 -67400 2024
12554 58109 -25573 22775 -165411 196969 -11144 155810 90329 -12589 116474 -124353 -280616
12543 -280616 212579 -36838 -16158 -20444 -121591 102751 -42734 195306 25886 59155 217339
12532 217339 -68169 39726 492384 -69962 -99033 -83258 28644 -6587 23052 -145229 -7832
12520 320613 2319 -106265 332376 -53844 90284 -197139 15172 52889 -255395 -163980 -119192
12509 -119192 -268381 65687 188372 -96541 -176666 367054 152332 87444 -122586 -74065
12499 -74065 142810 -62185 185869 61412 -241990 23548 -142458 -255726 320738 -116068
12488 -53872 95660 -184718 83295 -204715 -346593 -96020 426375 335728 156290 236603 -154260
12476 -127727 -319729 -224843 -58061 5002 44310 -36678 -123974 -54133 489889 118331 -218071
12464 262203 201036 -162095 -33008 -68020 -191216 -53249 -1353 1982 232705 10387 -119186
12452 152078 -135561 -107548 232557 87817 -212602 41644 167687 135538 321012 341721
12442 341721 308962 -12720 -301641 246510 -97221 145299 130790 -12357 293010 167427
12432 167427 373251 94386 -23063 -125153 653 268348 -284136 6990 88924 -82778 -143637
12421 -143637 -32259 228595 87948 75205 75144 274249 -103381 302402 306939 45589 -164321
12409 -93883 -195757 355938 28226 148746 -527545 347761 -283051 52451 142764 -85666
12398 12226 510672 -135922 123916 258890 88240 198192 -16613 -203080 -79772 56249
12387 153909 140835 -176295 -99381 -29702 -2755 121874 305233 -227362 -2172 149883 158046
12376 158046 -53728 -163195 -73628 61480 122088 177665 -18053 -495988 -170591 -23962 -26061
12365 -26061 -58025 -69124 41604 88487 -75943 190464 -133736 -249552 156413 243803 -76107
12353 29095 -200438 -69808 -8751 74415 -10043 136110 -149499 160892 -211905 96213 92946
12342 92946 14432 87002 34611 -52542 -94135 -146523 -63078 8196 -226333 327796 156556
12330 -157172 45144 -288264 14411 203809 -176827 -243428 -19838 -273816 -33768 149624
12319 -282509 18566 -84403 -97719 -153096 402808 -231028 -62007 -168836 -260564 121392 16855
12307 -46600 -43843 -109793 -34152 271777 50686 -96059 -121746 -157412 -87782 -154306 -3049 -257683
12295 -257683 -60054 -51753 111428 303142 -136154 -67773 -17007 -52402 -77833 89911 -107235
12283 -233246 -277938 65673 228092 400183 -70839 195197 224099 28764 13148 301133 208904
12272 208904 128532 440021 35693 -108218 90103 -151970 310283 73645 17650 -209425
12261 232543 281063 145639 -6747 -28809 32856 -356033 206240 79893 193058 -159121 -272819
12250 -272819 4777 86653 137117 293073 -28906 -93212 32118 -42982 431915 107729 -302324
12238 319498 31537 409754 52784 159765 69419 12881 49115 -28699 3490 139238 62180
12226 -78454 184516 238976 128813 310104 275150 442427 36914 -88479 163986 169654 491771
12215 491771 98428 -17388 6378 250549 495617 -321196 404228 119362 -30358 249549
12204 211180 174904 181116 124141 122212 358432 15284 -163804 74393 52504 168812 -31588
12192 258601 111914 210823 39927 157743 -172895 136384 100398 -67158 -15347 -119924
12182 -119924 54777 410299 271265 120692 -57417 140377 -128851 315373 177675 154326
12172 154326 336010 51416 278586 262209 -104802 22711 -94941 273652 -129075 411156
12161 305778 230629 -20762 119921 72030 113036 -21538 377761 71469 -201949 197115 371828
12150 371828 275456 369787 3082 -27852 141557 297496 182890 35240 25856 257886 6122
12138 13240 -268122 -188768 -291168 145840 -37720 438539 45904 -24634 78906 175538 214246
12127 214246 243256 -162737 7326 -126262 -56935 -252459 87735 156644 8097 283174 31318
12115 34610 150901 -72642 243369 -246738 12637 44009 161372 249257 -26997 154979 -410729
12103 -82853 -19757 -75759 -106475 260759 176086 -109273 -84377 -52788 -297152 22942 69249
12092 69249 94565 260174 119931 -293526 -67264 204246 119304 30210 -101254 -100864 132474
12080 -206151 -210623 -34361 -95670 134914 527414 1386068 2148932 1024592 317220 126759
12069 256423 85500 -95053 -117847 -333911 172264 -10212 21094 37974 106938 -92882 81317
12057 -79525 -18877 168729 -75934 104821 37073 -88750 -151496 -216611 -94415 -146806 287910
12045 67135 -41431 21894 236843 52986 -85052 -175801 289834 -15931 -84575 205948 265825
12034 265825 27659 -198035 5232 196258 -60975 92523 275900 142574 -190309 -2982 -297783
12023 -297783 45053 118606 7174 68004 79256 -131502 36507 -143457 135027 175938 54916
12011 -36178 -192038 -160757 -31611 239116 67208 14600 -49233 -217262 11434 204761 -121920
11999 33607 80406 267439 -108366 -239074 147496 66111 106702 12712 194259 -38037 -228180
11988 -228180 121032 -182346 247420 -31863 -57865 -44129 -55433 209234 -353631 -68967
11977 -269493 177014 -227760 -16911 -115781 146475 -184861 -112617 -192257 -207051 -59915 -208167
11966 -208167 -72775 80064 209632 -223550 -89590 160763 -61215 -110550 -398090 -112102
11955 72196 351792 -263685 -131862 200431 230681 38701 216971 113356 -294438 -311686
11945 -311686 -87940 85574 -46244 64500 121076 237424 -170631 5063 -169702 33812 -7318
11933 740 -203762 -213829 230168 -227534 -148579 248147 -112618 4522 49411 -21947 -482475
11922 -482475 -369326 -328352 -132601 149352 88435 252657 -107179 108801 -134828 -49189
11911 -25858 26572 -379358 69683 -228946 -88907 -9582 -139981 -237173 239311 95501 -55256
11899 -188801 -188051 72389 -227628 -45979 -256921 311544 -7326 54798 -277001 -116255 42308
11887 -69885 74643 -242556 -136298 192523 2495 119630 12779 129452 209342 -16524 -108059
11876 -108059 -418125 58650 105393 -50826 -100461 126428 -3330 255941 -127936 86535 -112669
11864 84783 -113199 -29953 269064 -72255 -86695 73538 -72995 24978 33023 111254 -85415
11852 -45849 -5172 -279395 11213 -161036 83549 -160603 -321850 -236028 -137394 -182362 287418
11840 188918 20413 -306246 -15575 -232489 -89886 -163829 185825 -75546 7420 61586 249364
11829 249364 -81058 87970 95152 -200698 -170453 206881 -332366 44614 -189378 137311 -205208
11817 95901 129930 58746 -90142 88599 -143879 98463 -106390 129044 90887 -18385 -118280
11806 -118280 -307811 -205752 -86007 -115429 -15851 -407907 237194 61603 -191982 -197391 266639
11794 290141 44175 42940 398776 107013 -332569 -17832 232918 222693 -178927 -189848 -179158
11783 -179158 112116 -169378 201878 -183969 -372171 -23309 -248060 -353810 -97122 206892
11772 -119063 -221534 112964 478316 79412 362242 151044 10167 -31088 -322742 -11062
11761 -299818 -7461 -39010 10585 -21244 -57089 -97901 -29879 100520 177801 336944 9520
11749 93874 202582 -205210 210879 -74267 -106601 126381 -9295 255381 78147 139571 -106480
11737 82307 -33612 -220820 4694 -159833 -31809 -94954 -177231 256477 132648 -40194 -53275
11726 -53275 -39612 -262293 -76113 -202562 244285 -207112 91835 24094 -140068 252517
11715 128648 157900 197034 143998 96361 -45760 73528 352303 293317 -27223 98957 135221
11704 135221 78583 186060 -330444 29048 -218200 -44217 -58040 -70617 141836 -263480
11693 11725 -134745 -451154 -513993 -74478 -9504 190305 42208 -73929 -43875 -217439 -11063
11681 -131180 -23926 33521 -240517 367035 131942 104428 -22906 -13565 -90024 273341 45878
11669 35820 111055 144699 121933 -14953 54663 -214359 103030 -108268 -56829 -171814 146030
11657 34438 28426 230423 69455 -151203 213612 -1826 194801 39726 96865 -82565 62170
11645 -129107 158960 -58186 -116246 50190 93111 -420436 -318149 43728 -267157 2494 97980
11634 97980 -186853 -197590 -76996 -88228 101182 251343 37713 378893 31177 -167382 -30640
11622 -203516 -27193 -162221 39280 97093 293192 -129594 435295 2967 184240 -45209 -88591
11611 -88591 -184658 -57120 289742 -277866 228986 13800 62163 -15787 -224617 -135205 7099
11599 -120671 214832 -62042 -150974 118888 -358731 -146438 5630 484 -128588 147119 231610
11588 231610 96237 -93552 3263 243648 167756 70322 183531 1607 -13826 -55939 100383
11576 41563 -180111 75681 216871 61798 181305 -154055 27254 30698 257958 324776 95702
11564 164160 131648 27834 -215600 154532 295744 64061 260854 94853 -14218 38161 -124606
11552 81680 12005 33023 159237 190692 -156176 -118422 -37838 36994 -126078 -36592 151602
11540 -277763 454380 73674 30973 -186551 250496 393045 283126 -124489 -16057 103497
11529 -5604 -232908 89972 -145276 -115382 -39601 473028 -71217 159919 -51938 -25707 -118918
11518 -118918 -211738 55077 -41050 -13284 -24126 -76912 127241 91558 218167 150273 -135584
11506 -74805 309591 -158870 -193592 511219 -254963 195864 -155617 130288 367808 393258
11496 393258 247673 -91290 454488 -209455 -169748 -73936 34860 227285 -32553 146569
11485 236653 333753 79398 304978 191444 434941 32868 -22828 245699 -39781 384439
11474 406498 117729 -10230 94568 4322 127094 239053 420032 41281 83736 53500 24736
11462 122842 -179920 214886 98216 -230474 172645 17248 -10747 -204193 384344 -94844
11451 4467 -28647 173964 -99996 -20195 8091 4600 83379 82324 -239610 64492 178603 173951
11439 173951 160028 -84364 43896 -124623 81270 86986 -324107 377059 -290175 -245781 108270
11427 87624 -171097 -49721 -146240 48146 29116 -350469 133681 97611 -123002 -13109 173053
11415 308859 171736 177290 -355312 314952 -114267 -262824 37945 361358 225085 -41486
11404 364090 128549 -41963 117493 -159990 80626 -45678 39466 78847 -15123 154272 126497
11393 126497 -24613 93050 245042 -140845 -146058 49865 177997 68914 270028 -193580 -223686
11382 -223686 -53137 -111412 -34339 36320 376589 105660 77453 -2393 260352 170014 -245715
11370 84238 -227629 -95001 157549 -151755 -82041 167142 8761 71141 233410 -100684 -21039
11358 -98743 -304931 232486 -345248 -179026 81496 -240439 -51080 257787 -91433 -194032
11348 -194032 218943 271182 -333730 51983 82838 25579 49093 -73056 108921 70081 -138217
11336 77188 -245191 421703 -55508 138847 161888 48886 -174065 260361 -47672 -242476
11326 -242476 -264864 -154420 -70753 -19376 12891 129479 25586 -112501 -117632 -164870 -155122
11315 -155122 -226322 62339 -185435 -207898 -167775 -52038 -79442 52522 335702 149829 -221317
11303 -171251 -115197 139417 187040 5116 230909 148974 72662 340433 22876 -50056 -174612
11292 -174612 244951 56123 -212212 -124452 -186443 -115892 -37141 -258331 99757 -131782 -145941
11281 -145941 -22361 61564 144766 -91631 -208923 -2904 275616 -184753 108073 -111879 -43971
11269 -8941 79576 -290296 -28411 58024 109017 -544636 -83830 101423 -237926 -93503 -284465
11258 -284465 144123 -158657 172226 -70802 153783 177118 298913 -84338 -59024 129960
11247 -51917 69022 37828 -78630 -470084 -12655 -71439 -62665 -130658 -254962 -218214 -8929 23145
11234 204205 -140721 -90795 36794 -102650 -300991 74488 -148106 -210483 -11373 -252990
11224 -252990 -298369 121307 110960 -65774 -279902 -290782 -281881 -70148 48190 143444 406257
11213 406257 143566 -83168 -137788 -250579 -149 -83997 -152953 -71453 409190 82154 120563
11202 120563 386664 -78858 -55985 158078 -948 -162841 -181948 -86773 -192835 -97769 -254087
11191 -254087 -101872 329881 8901 -186845 37769 -131007 -48147 -236297 11065 -182473
11180 -255661 163093 55317 -90943 -3464 283865 -45464 315425 -23078 -203063 30999 15691
11169 15691 209554 -213059 140111 -64229 -336639 -264226 -285198 73333 192871 -121905
11158 164594 23558 12634 -252416 -151614 -8009 96666 -10909 28550 -85167 -244299 -237756
11147 -237756 -47974 169673 86413 171226 -103319 37465 56231 49970 123704 -200548 41078
11135 35007 238933 6339 336278 -123857 20363 255286 357840 179864 -109245 251787
11124 178923 241321 99052 -134437 504906 -46679 215505 2376 -126781 20512 232833 136472
11113 136472 -104651 259327 -201230 94500 166823 217357 340534 61980 -112349 88777
11102 12133 146115 189609 174530 325176 55762 4962 -7726 110669 -274911 309255 130133
11090 226689 481445 102051 65850 -119403 -21114 160517 259357 207023 167652 543046
11080 543046 203080 273394 10012 225639 76125 180572 45749 155816 196270 465285
11070 465285 188531 18834 395691 89616 84522 482679 306128 308308 365184 299316 398073
11059 398073 185105 435602 276793 593975 565024 899833 714743 379230 278262 400400
11049 400400 850262 428435 766453 571201 530454 612782 428812 713129 739861 539640
11039 539640 747885 616614 802987 227999 589998 653828 566844 631484 753655 626680
11029 626680 420942 387835 444867 921270 407132 1037693 496639 834924 356507 374329
11019 374329 522269 591496 311068 532087 831423 297130 163621 578723 545219 489481
11009 489481 699524 132167 774424 430243 420552 401769 602321 789838 896209 563767
10999 563767 860074 579826 623382 883525 616368 614080 653125 686998 462177 570317
10989 570317 1080825 592293 749064 856115 1166784 730657 1008499 855698 1099652 1088886
10979 1088886 980265 1485499 1556165 1752702 1810549 1989087 2323625 2526778 2429197 2337785
10969 2337785 2382567 2209571 1942912 1699792 1474124 1507775 1624573 1019526 1638586 1611011
10959 1611011 1403992 1560705 1161704 1418353 1312364 1103125 963474 890774 831441 453188
10949 453188 503324 855872 251720 538863 556566 567505 195745 404754 89271 263386
10939 263386 -44621 -67069 -50030 -185138 79040 149514 239327 53410 -79704 188337 36403
10927 -42724 32080 220567 -140031 289493 502477 -191420 180499 77395 218097 -194519
10916 145958 65814 53218 -108292 -230051 -293320 279903 43236 185858 -44819 85819 -376744
10904 -125793 357529 -83382 -53009 -163727 2496 112976 -300191 -124375 127682 117882 -146556
10892 33364 -207283 -278868 -529581 -13854 63641 -412240 -15862 -47018 47974 -262183 551154
10880 -42367 -71197 -101037 -118395 178178 -30328 -158942 -254470 -41514 -15943 173762 -30481
10868 -415847 -101916 -202874 -97147 160604 -373478 154810 -180432 94937 55018 -158292
10857 85420 -209113 8280 -17290 54604 71138 74913 88376 138774 -321079 194568 160593
10846 160593 -92529 -183662 -111749 14628 -209884 26044 -297657 364492 32679 -272177 61656
10834 -259750 113311 -187481 -46093 -230765 -148183 84127 17539 156059 94379 -215917
10823 -272136 -66806 57760 -151920 63984 -176070 322736 -5697 -176963 -89567 -25433 -219488
10812 -219488 125942 -107487 -140934 -134228 90196 124625 -233212 -45081 218244 -59245 67180
10800 3574 208153 -13233 -1990 -575048 -207080 37497 -242517 144971 111812 243955 -217528
10788 313743 -236694 -80879 -74527 36165 -172935 -65227 159785 -212988 334898 -163275
10777 -167101 -160967 196148 -141025 8377 317169 -42273 -118726 288763 107881 163901 -150076
10765 -23871 -166659 393475 -178608 -87074 -35943 69409 129679 -28895 93710 -158065 -81354
10754 -81354 -49510 70959 -3905 80077 -248682 152339 -13602 162088 -124253 -185614 306065
10742 -389930 -87231 -278205 140006 -154254 13489 66697 -59118 -78130 -39527 -194847 36913
10730 22625 10198 143607 43928 -180112 -255311 243255 -361548 181666 373578 63786
10719 -160389 -103969 140724 -155625 210484 -90838 -158477 44643 300712 -175914 -144055
10709 -144055 70171 -338544 29814 -99226 -81963 -282720 -163579 79669 -93670 -63768 88738
10697 -183739 -285675 -59302 64411 34015 99594 -102260 -116222 6713 -146829 339561 -347265
10685 165768 -146531 120071 71082 -11081 111564 36956 -293107 68672 52230 225717
10675 225717 -94277 -236202 181917 76288 339774 106903 -4409 -354181 -241817 -185557
10665 -185557 -10999 -13883 -204759 -126738 61792 104964 -120463 61622 -977 43210 -3738 89895
10652 -198582 -401309 -52326 78689 -13191 263431 -336106 180473 342478 113275 -353819
10641 62711 -162308 -138668 -26756 -9169 162764 -172667 121931 57117 -57558 162799 101792
10630 101792 -8613 43305 27628 -11873 -51181 -345617 -77828 -175568 -140284 -105461 -379317
10619 -379317 -225735 -63693 147838 28188 25137 39121 67849 -90488 -159712 -262210 -200469
10608 -200469 58501 68116 -82514 127562 284797 -203095 -87542 -220395 -58525 -244238 -97435
10596 18999 -264592 105758 14932 4777 -602985 -66770 -127969 -46628 -203899 -8640 -128975
10585 -128975 144498 87363 -98108 -37906 61028 -89153 -155956 68208 -375510 -2102 279559
10573 105804 114359 -104431 -24463 121058 173869 16074 -136629 -274155 -485911 8757 258446
10562 258446 25984 332150 84083 -31888 -221645 94413 -98742 47643 157269 -63882 -157884
10551 -157884 78467 -239114 -394978 -163803 -72856 76525 72964 -154048 -97548 -126534 -258784
10540 -258784 -130524 -221601 -60390 -293870 231877 331470 110030 -52777 -27520 8076 25201
10529 25201 -20379 75762 132945 205857 79805 -484870 -50997 -1157 -186741 80252 173806
10518 173806 -81238 97640 91864 -244356 222990 -295720 -145681 143209 -103741 -226111
10508 -226111 -327250 -22232 -266765 64765 56543 -161869 -283363 44563 276184 285415 -2401
10496 3742 91782 -57491 93660 -356922 4397 -82807 -363360 -24170 139852 152359 -100447
10484 -80980 -46651 -61251 204903 301317 248813 295064 271623 205014 2582 72187 -187912
10472 25618 176629 104923 36381 -58648 -26713 197561 161030 -449383 85582 293410 -164990
10460 130060 -151589 183102 -265909 56545 -88861 3909 31775 -194502 -63963 -102776 -22517
10448 -583444 108706 11063 -10198 -61785 -383279 -214628 -418461 243626 353756 295597
10438 295597 -40440 84591 -43198 -7930 112764 237203 -117472 34784 98794 145349 -181834
10426 26526 362696 -268477 -31251 -162655 64890 -140100 -235741 -61191 217007 -186088
10415 18010 -13756 133966 72157 -120555 -188823 35410 -82886 -148842 -118370 -327494 2143
10403 112997 161296 -93839 -116173 160616 -46450 -22124 -44382 -155795 42235 -133173 40777
10391 -156320 -46214 209556 28254 239237 102898 40574 -54717 -73097 87775 252677 67327
10379 157679 85941 -54033 -76021 -84824 149191 389651 42287 164596 597245 87460 524220
10368 524220 162135 344153 467070 638785 189859 54527 53365 365560 204692 328177
10358 328177 -59330 190690 397712 55090 132548 282608 517357 492938 534087 617194 357812
10347 357812 254412 212734 -11203 292455 463431 347062 209163 256866 241653 189666
10337 189666 99440 385697 41667 -42537 -138538 -175753 54056 327706 -164811 109860 173985
10326 173985 -64261 26459 285807 -37763 149906 125719 46758 168653 213933 -8901 -106449
10315 -106449 376134 44458 -40149 13203 64010 69323 269180 85522 181306 435913 -105882
10303 -105805 86786 112991 207855 329040 98321 -263763 70930 75985 -108983 6268 -183352
10291 -112721 147779 -222540 51048 -28086 98339 -222960 67173 342673 -572852 184780
10280 -88570 -207795 -86460 -53493 -213049 -53637 336173 24074 34682 33199 -155383 -83693
10269 -83693 -95047 -204190 -347718 -279327 -141572 -301846 203603 73494 128595 -32902 224487
10257 60700 200405 225111 53739 69225 -88735 170275 -297956 112658 -135640 -242524
10247 -242524 85848 110939 -96794 98916 -61565 -26787 -435310 -152597 -97844 -208773 192512
10235 173484 -315998 32650 -361704 200760 -50660 85356 121316 175152 270804 -65912 -63276
10224 -63276 265190 26024 14217 -262917 -174068 -29370 -170870 91005 -20810 -186682 75156
10212 117492 -261749 120383 -137111 -35528 84567 -177318 -40650 -51530 388588 64636
10201 79039 184385 -85573 -109893 -1111 -270362 -55964 60438 -338 -174605 239200 130186
10190 130186 49830 278615 -10590 181758 -25845 -99406 -106465 37321 -4119 18059 -131381
10178 -69591 40045 111537 302518 -44102 38093 -141668 -46226 29488 27080 -30320 -75008
10167 -75008 -436747 -105385 -379953 -58813 -31696 372772 -200850 -316255 -222761 -79246
10156 115 -69840 -111778 -111392 -219096 -36716 151163 -104440 47311 -167368 -363216 -86674
10144 -14120 -129110 179788 -63507 -31226 -117660 165455 -103560 73378 72260 -156953 -141217
10133 -141217 69717 4899 269559 39227 -42402 -341383 -238307 -17247 -54401 -254375 -79674
10121 -57515 -317314 260416 -153186 13025 -372743 230912 -185289 102116 -13493 72071
10110 -99181 163051 -296728 -201482 -232278 -263982 -32839 106841 -40359 -121553 -31635 -418839
10099 -418839 207689 -542143 -108312 -2046 -51252 -9142 -69511 -263607 3622 53618 -307078
10087 239102 47209 62842 -56529 -251122 -96668 -126197 -63782 -262806 -219260 -116998 11111
10075 66886 -257927 -368043 -479088 -96262 71571 17681 -49031 -40978 53450 -329837 -201000
10064 -201000 8773 9997 104905 13169 189542 -432172 -4149 -69895 -38308 -265758 -440917
10053 -440917 36366 -158235 -39262 -135939 -394983 43499 46224 45628 -46373 207325 -52890
10041 -15747 210601 271957 -158588 179227 -332812 88243 99516 -33794 1440 -100449 81459
10029 -73016 -254447 74858 -67160 -38098 -31682 -41023 -166919 3691 -212178 -203891 -152628 -300507
10017 -300507 357252 164904 54808 149016 32488 128821 -183347 -400725 -69075 40678 18571
10005 -5402 -339365 88871 -315019 -163719 -22801 -146832 -292467 -294597 -162637 74362 -171608
9993 -125521 -92391 184469 291178 -8010 -168826 244988 69790 206444 -207238 -182109 -57271
9981 -7698 -155128 -311777 34362 -128505 128529 268500 -154653 21688 -90020 145870 229227
9970 229227 -130356 -163778 -316958 -168949 -4468 -149123 -155964 -95577 -329790 -223549 -312551
9959 -312551 80793 -7882 -128729 -348083 241895 -75495 -65874 -232293 -305389 -261791 -314543
9948 -314543 -241271 -186566 83252 137326 -147966 -81736 -93988 -45027 -103293 154870 19394
9936 -158101 -227512 445215 98765 142438 -399131 -527415 -193065 96039 -179830 -478 90832
9924 170378 -76149 -87555 -166110 14453 154795 -203603 -319173 40446 -163668 102548 -131824
9912 -127656 -225694 -44192 -58523 -266890 -223911 -128722 20530 -108506 -269659 49839 -245482
9900 -65308 -195370 -109106 357818 55615 46111 6046 -339628 -354414 191728 -311053 -353245
9889 -353245 -108009 -43090 298382 2701 69107 -93409 68784 157894 -321399 -250168 42855
9877 -11369 253292 37672 -142590 237650 -120702 -128464 27521 71067 -65383 -11564 -96665
9866 -96665 185825 183732 -182854 85115 91068 84622 -77291 223154 11127 215645 132885 -104115
9853 -126229 -75561 160468 33744 194655 56380 -284801 147454 -11111 -227035 216861
9842 24953 -7708 -318559 -7296 -170149 -122918 -333842 -263061 -253218 -63809 28858 50276 -177970
9829 -233835 -78131 -29708 36293 -67670 -240327 -2501 110127 151147 142583 -325780 51088
9817 -780 234436 -104650 -430999 -66811 -149112 -20859 3963 -178584 -374194 -278723 -107300
9805 -33916 97131 -319620 -13845 -200180 -269275 67425 -72124 -11949 -87062 -93734 142406
9793 104196 78564 -74690 -410397 -76258 215298 -250868 -132193 -127189 -91206 -126301 -106295
9782 -106295 -136278 -2933 46517 198679 -423155 -33609 -325804 45299 234707 241086 11686
9770 175794 -200217 105076 -151546 31751 215217 -87614 -124406 -137949 -113670 -24624 -49373
9759 -49373 -58992 127664 -170002 -68912 -394650 -281889 -253069 147769 13819 -35920 192117
9747 118292 144804 -105235 180066 -113107 47633 -159784 -48716 -48268 -141935 89946 -184735
9735 -51673 124635 28284 -172951 134220 -159098 130268 -115102 176659 78160 -412681
9724 -13797 -250275 -126765 33937 -121326 140199 -14306 159151 -16684 201800 -426745
9713 -84825 -265892 204986 -130548 135107 122353 -304572 -343685 71753 -80802 -122703 -191589
9702 -191589 -207814 -59579 4294 -235446 -47616 114825 -16091 -236375 -60357 -217504 -41669
9690 -289962 174462 23819 142615 -98722 -88596 -417105 44830 -213684 194948 -249281
9679 -19894 133503 -223951 -110695 -108153 198059 -160902 -4980 207988 27161 -1339 -103140
9668 -103140 70075 32640 35151 -35311 -272881 -92604 -53366 -320995 -15358 -124301 -334224
9657 -334224 17630 -233646 18145 -232158 -146474 -164076 150536 45552 60828 99939 -360920
9645 -41147 -318603 31609 307399 -100648 348140 -293120 -230804 65547 -179516 -131429 -224452
9634 -224452 -5496 -380836 -241116 -85176 108234 138506 -119688 -97415 331498 -267315 -233532
9623 -233532 155797 209006 -52484 -152304 -459719 -45778 151050 -29028 27783 -59639 -86944
9612 -86944 -402240 52825 -192012 50725 -164102 -223731 148219 -37497 -23000 218642 72127
9600 -87939 -81978 244143 59960 -410270 -219305 -219880 48580 -138062 -101988 260827 -62324
9588 27240 -345437 112559 230417 38823 20754 -100196 -4364 40158 -43640 -281020 59261
9576 -65695 -301240 -345888 -257919 -518395 -180098 -35488 55217 -411994 48671 -249879 13606
9564 -112036 477843 -43952 -87322 208339 -308678 75124 -97410 -107322 -217941 74022 -54013
9552 -162001 -334986 37707 -160122 -29328 115655 149654 300463 -438146 -158445 -425386
9542 -425386 20527 51033 40652 -288371 -189115 96484 -444450 -104593 -245529 54078 125887
9531 125887 -275607 -183862 41514 -42866 143506 47883 -152556 -101929 -151724 11906 106397
9520 106397 -97361 235573 -208887 226041 -12758 251005 -240565 -238876 -203346 53365 257772
9509 257772 332544 -172753 205624 -62081 -138781 -115910 -65940 181989 16953 26289 21171
9498 21171 -239211 -18060 -217853 -420858 -166924 -125119 -250678 63912 68271 -151306 75432
9486 33841 338549 -184603 156044 257188 4524 246435 -258007 123668 -80298 211605
9475 -61294 -158420 -192157 -182815 -159545 -309514 -20082 -269318 139864 29263 -3776 -105864
9464 -105864 -506013 -257062 -3266 181887 68217 -188167 -79344 95832 401769 -363936 81781
9452 -85334 -138796 -187279 -3194 -326571 313305 69985 -26359 144906 83141 -162928 8189
9440 -15874 123726 80088 -329099 81270 -70754 -115060 -196107 -158642 7027 -155184 117440
9428 -97602 -143036 -261338 -292152 -39437 239839 -381973 35457 253996 -93861 152975 -209751
9416 -73022 -55287 -256548 7012 132436 254920 -146158 246849 -39087 -99645 -4144 -351139
9405 -351139 -22202 166342 99092 104578 10651 275798 -22248 -263276 -570109 -13785 -230255
9394 -230255 -182436 157883 299893 -393976 -16422 -12615 46870 -142506 -150928 -135144 37323
9382 61457 98934 -23389 52165 -295931 -2537 -116330 -53413 -29651 -351006 -193627 -161622
9371 -161622 83035 -137379 236990 -198219 -85090 -60106 -141398 152473 -72618 120630 58974
9359 127508 -103914 -89119 -513138 -227194 -21137 -16638 163796 -120981 -134587 -106399 -210819
9348 -210819 113817 179344 -38833 -92483 34933 -145452 79569 -48008 -81310 -896 171406
9336 227462 -292052 20919 201300 -56345 43102 -104590 -243810 374653 49150 152767
9326 152767 -235008 -553106 -50829 -398405 -358331 -93212 34996 -335947 -95875 -105039 220822
9314 -364180 125509 274744 167994 -217334 -41085 25462 136586 -27022 -308075 -88132
9303 -155423 -147102 93554 96926 -35532 202231 -48110 -227377 -153506 -88331 -259992 -135280
9292 -135280 -116244 -308935 -254423 -114214 -101698 134526 -181870 -73956 -78884 46809 -166106
9280 -59798 -167036 42050 -149726 -7561 219943 388574 -46207 -65123 53493 -89350 -72448
9269 -72448 -124457 -7774 -250101 -107475 21599 -151771 -159440 241407 291979 109158 129298
9258 129298 -55838 -231196 170396 184168 -145242 -270630 144012 -16607 -58231 -388355
9248 -388355 -220578 -109988 -52220 -360820 -202240 -54271 -64581 -165328 -282232 -119844
9237 -281479 65078 -184809 -136533 -4431 -229959 -69669 41894 -39065 -90205 -42895 62506
9225 -244911 -301711 -10299 -155077 -29693 168401 -185249 -154721 -143266 -3367 -48462 -249510
9214 -249510 47499 -161631 163224 81694 -192865 -108881 214671 12925 111081 -253554 -195036
9203 -195036 -138641 -60401 -207510 -373124 -155878 -61143 89286 99264 37477 -140006 -67195
9191 238030 58466 -20928 58402 236334 50127 -26834 52868 3801 185563 104788 -361621
9179 51567 62627 15232 40389 93728 -391751 -120433 47142 85415 -152033 60136 84657
9168 84657 -100354 262591 84302 -258799 -285977 150680 200704 -104745 -113043 -102893 32279
9156 -80230 85101 -179783 -155223 153512 139439 -51482 72415 286615 -19006 -353151 -242697
9145 -242697 81053 196589 -138029 154005 -280734 -160072 -155296 33429 -146101 27400 -170314
9133 -354943 166933 -172626 33168 -170207 -18122 -150769 -137804 -239696 -55865 263391
9122 105711 145232 -190515 198430 4577 -312803 -261267 35344 57079 146597 -99696 -126931
9111 -126931 388315 -9869 297679 -138472 -44656 99362 -98251 -234842 74190 -65404 -70969
9100 -70969 -181252 -1361 -85853 -87965 56438 -264393 -45098 -54074 -143137 -141035 -35517 -3490
9087 -115326 170878 136919 -340781 254493 205403 -47258 -148876 71470 -70464 -391881 118466
9075 83208 -234876 -121913 -4861 282634 284453 209018 271280 134910 269872 -236729 -116341
9063 109357 -29765 54791 120335 21199 41374 132917 405216 -40921 141301 208402 165489
9052 165489 -429894 -13333 -237644 -270909 -135551 -324722 -41930 -182133 -24313 43861 -181086
9040 39939 -59185 134145 -51872 -425332 -204556 -70532 -46532 10111 20358 -281194 104137
9028 19123 37248 -181429 -72212 98898 -53549 -263586 267644 -143495 -311179 -204304 -243463
9017 -243463 -372956 43006 -152963 16774 110187 -141159 -53949 -108820 -100432 -49336 -143031
9006 -143031 102440 322222 106797 -254470 -298131 -225501 -15807 115238 220320 -88725
8995 -112738 160084 -355094 200327 -34977 30963 64085 202435 -28386 39763 113036 -46166
8983 -63038 -157799 155991 99070 -244465 3815 12155 -112400 -169540 -194712 295005 -174625
8971 -218489 -174638 -309109 149838 -91299 -57338 -231055 68049 133020 -70992 198282 -290143
8959 86447 -370393 -47201 22755 -73729 -200234 -43317 -228665 -28079 -41679 -129982 -336859
8948 -336859 -385509 760 -95421 -404292 -105878 -125182 65472 -50975 229128 -136355 -41261
8936 -206543 863 116173 -41766 -105758 159689 152410 -106532 -148080 360482 -218152 39749
8924 113525 832199 2644862 6925260 9630830 3024930 1075533 468314 316296 109142
8914 319694 -12960 -48438 -136372 -52744 -157988 155687 214033 308553 272512 18377 4997
8902 95147 -95680 -381065 -98607 77848 106328 -55224 -670631 89231 -365820 103836 -222974
8890 -93344 -18099 104423 -5301 -102293 -52805 -169498 319078 210263 -294785 79993 -285355
8878 56790 -100855 153188 20077 -1950 192699 59868 -30385 169039 -142546 5575 -114316
8866 -161996 256674 26131 -116600 -54990 131485 132479 -158558 -3653 315888 -48518 -320345
8855 -320345 -58774 -240119 -153419 106491 -92190 -208775 102291 -240953 61831 -58663 -330798
8844 -330798 -25077 -80472 -104548 -120695 250023 -230505 21119 -189249 -327492 -71181 -262822
8833 -262822 -59964 191056 -21309 140411 251567 -431694 -161021 -167023 -211146 -218427 -165369
8822 -165369 -306849 64776 135145 -130487 -27857 78677 -52466 198211 90446 -399844 -182491
8810 101655 -73740 -10524 -192515 191407 -37692 -14386 239902 88440 -112446 3377 -232817
8798 -147927 -108201 -206147 50935 -43320 29176 -120863 -130193 10038 111336 -96177 26124
8786 110388 101794 -12661 -138512 135110 -330387 -79181 -48519 100215 -18319 3185 -385522
8774 -44480 -124921 -20880 99214 78489 -377242 -199821 63383 -115796 -165907 -424742 78494
8762 -216319 -5202 -48772 122902 -48350 -57066 -3743 28824 -454915 117728 -192366 224415
8750 14256 -228491 -290744 152184 -210087 -200749 -88859 -140028 -248349 46171 124807 335971
8739 335971 277501 -11464 -27713 -151843 -164571 90361 208941 -260083 145575 -131375 500144
8727 -185105 -155997 -264653 -100934 -150405 156793 55973 -116515 225958 -63964 214478
8716 -17794 69028 -228140 27109 -426088 -76449 117423 -134988 -120600 -142392 87816 -38023
8704 -149637 193277 -130101 -109831 -23801 -262747 -22429 -335423 -73673 163789 63476 271235
8693 271235 42752 15935 -161953 337581 82847 -188410 -211452 191780 211435 220496 -162715
8681 264650 -124752 -180575 -163671 -74098 6027 120080 288297 -266333 -158227 -255709 80639
8669 184262 -202378 -149064 158912 -42486 -63706 -296556 -297475 134366 -94901 -24875 202741
8657 -13107 211409 -253004 -3291 -257409 54600 -33101 -205470 111359 69431 -219539 40227
8645 31733 40007 100004 3763 -19282 160843 -92658 -298325 216998 -115783 -30139 -144391
8634 -144391 -37571 -11682 -93722 173983 185268 20827 -265253 109464 -125858 -149422 109822
8622 56528 218466 -45910 -109961 -148961 -428144 -203249 -304059 -67844 -264414 104145 -176401
8610 -172993 -491724 71320 -1165 202145 -133420 -376589 45680 -92511 -162779 -366658 16913
8598 -186402 168291 -433244 122386 -271851 183328 -64551 -237749 -218952 -175732 -69461
8587 -152801 -40701 51118 -123288 172310 -119350 -99265 128538 -64712 -23804 254721 53822
8575 -123164 -148471 -209005 -1646 130278 92525 104652 44095 -60615 -191151 -31124 -197029
8564 -197029 63378 196085 -66683 64959 58979 -220890 106848 162414 -274434 -54850 -223054
8553 -223054 -92914 63221 -236995 -291676 -15463 -54913 -126660 -99403 -129176 108622 -96250
8541 222764 -182743 -12598 47744 -72377 35505 33073 -31730 -60642 -47478 -116012 -283375
8530 -283375 272384 -65039 -266603 173983 13635 -43685 -47053 -187235 14268 62951 99069
8519 99069 -116609 -12220 -28584 -101276 35004 39174 -20459 269254 -261866 13754 44873
8508 44873 23334 -44393 -17686 -380545 -40791 81318 -345184 108464 -6839 -259221 126705
8496 -148026 -84012 36148 117332 248199 -164201 110052 307705 47395 43714 89336 -456259
8484 -138472 -140202 -82651 346661 78334 168977 23645 68970 271718 148430 -16364 -58181
8473 -58181 -193931 -84413 -57744 84249 77074 -178449 119854 -114902 83754 -125556 -14339
8461 243973 23460 -10166 252822 169317 -158958 -321908 -218325 -113800 -113533 -225931 -190194
8450 -190194 -158442 -113080 479317 357400 -36125 -134317 181308 129004 -126993 387277 -246061
8438 -175830 -260070 -164155 -86814 -440777 330389 36826 350940 42988 -105402 78201 -166997
8426 121073 -70050 -425850 89140 50314 -150047 50759 -205455 -203507 14185 58735 -123252
8414 33168 -220414 -50806 -154681 163679 -157103 -27724 -41652 -36721 -204148 95927 24315
8402 -117833 -130638 78322 22930 -166344 -373023 106197 307952 -317198 -136865 145390
8391 -226143 -196356 -339462 -89390 -238478 237245 60470 137219 73864 -212718 217511 -14145
8379 -182815 -201062 -21086 -161625 85992 -36078 -84615 158845 -305508 -99984 38786 16011
8367 22136 72616 21622 -89033 192507 -227271 -184672 -99559 66906 121525 -36834 216746
8355 -12733 -27682 -120766 -537107 256209 -470014 -247338 94335 -333974 -194561 -194490 53815
8343 25551 -24144 -227844 94289 68851 -234560 -135533 -147954 120119 14029 -11288 133493
8331 -188847 -191186 -146210 65497 495143 -121590 -35597 76706 -304283 -204771 -91666 -12430
8319 -14554 235418 -339832 52343 -266518 -348993 -113221 -115681 -82518 121887 -208246 164937
8307 183449 -31061 -143365 -171411 76137 -363403 -127949 93365 113302 99903 86997 -15682
8295 -175645 -201504 60407 -262442 154327 -144861 1106 -51647 40205 -94035 139342 6447
8283 -148569 58170 119341 4136 -334073 -141360 44341 -267893 -110406 276014 44189 -10920
8271 -173239 -176824 241839 -254395 338092 383428 -101623 113150 20694 300793 -85980 184338
8259 -112088 -277743 133019 -84481 -22388 -31023 -156247 -261741 -155262 -22150 65374 339614
8248 339614 -49059 150348 -109233 29120 1032 -80539 -88782 -146027 309590 -15493 -75777
8237 -75777 -162102 -86358 170280 104973 82687 -60397 91241 -273811 -226090 -268388 216203
8225 54206 -1518 -248180 -126636 3248 56488 -151488 -56845 58269 57678 320546 -76081 -27107
8212 -10856 -109339 228151 43799 -313013 -201855 73496 -242948 129871 -63271 157371 422925
8201 422925 274727 -152802 -249953 -96034 134591 -132249 51997 -199371 45019 -97188 -313029
8190 -313029 194333 19213 -35199 14098 -118139 -301400 112175 -150371 -186383 228161
8179 36523 113323 -21274 -11481 346012 -230724 -93857 147143 -52750 292191 -35951 -88308
8168 -88308 49098 103845 -260799 -208346 -152002 219809 -93057 -80725 101519 -104591 13106
8156 -211070 -90426 -168364 33562 -37831 123197 -56870 -15713 -160550 145033 -244947 -111703
8144 -300545 -146877 95659 -197936 -125062 -328372 -134971 -312276 184575 -273096 -121468
8133 -76577 81136 -81164 -232098 -128814 443220 -147264 -117299 -36749 -66229 34305 -235414
8121 -95322 -269547 -13892 -70486 -63976 -200095 -88812 18265 -194682 -140083 214834 -73328
8109 -121682 -32334 181221 -23251 29327 117859 157185 86340 37161 -7474 -501007 14859
8097 -148789 -11035 163067 155391 -47432 -19279 129320 -65492 29909 -179013 49019 7450
8085 99298 -118359 -105805 291798 -218344 -220385 178344 -146981 25236 -256146 228200 -305138
8073 126933 224676 -5578 -237565 1475 -16228 -189434 -14696 -276496 154318 -111507 -8344
8061 91240 77141 37852 58415 -252286 137978 237237 187113 -106713 26272 -382501 164945
8049 -553525 22119 -144632 -300288 130835 -9832 137814 56632 45403 -39634 69757 -92336
8037 38794 -347090 -38220 206693 -221227 368101 -73499 260590 28026 -278514 -38498 85762
8025 14733 -461530 65601 -264463 29962 5545 -166626 63766 -98224 24717 12076 99971
8014 99971 129445 4517 -100744 -228828 -433309 -399208 86565 58002 -49313 -147330 120609
8002 -322372 -119457 -125727 -247225 124392 -17995 -22877 -110180 -84663 107813 -103103 -14350
7990 -118364 175333 154462 28954 -319719 -209320 -10737 -465319 91597 -74649 322829 -206179
7978 178096 117713 -230325 -7647 133881 -106150 44058 -34086 73633 -363686 -22007 -210839
7967 -210839 -155724 -187403 86051 -147435 14159 183877 -28824 96695 -121126 -95940 21726
7955 -46406 -26842 -81768 -327220 -14708 -112275 318245 58813 -58143 129129 183431 -9908
7943 211395 -264316 104324 -266298 26769 155881 -128645 -100408 -5044 90551 13869 -165171
7931 -314926 -2868 -20561 -66170 -269057 45660 216399 -393209 -174984 69578 -347567 27208
7919 47647 -170169 -83279 5703 -264192 69592 -167033 -107277 27675 -206301 -217688 143773
7907 49402 -94615 -38311 -236784 45641 -69550 -85090 57239 -217667 52110 130928 -182198
7895 -83598 -239042 -134198 124870 -154314 117109 -103028 -338808 -114973 80245 -273877
7884 -185935 168062 -21907 -34734 -135 187829 -195697 37927 195351 -142729 126441 -250625
7872 -207682 -92052 473297 -148151 2202 -69028 26455 172477 -353200 -379357 121635 -75761
7860 -59847 142960 322017 59409 -310043 -322422 -307286 -31591 -123777 -370013 52213 -53540
7848 -143563 177067 -233470 64273 -329977 -70429 -265624 -361920 103553 -598094 -257368
7837 138550 242449 10515 299874 -247793 63754 287402 -146946 161308 141911 -220465
7826 234349 -145704 -240182 -171224 81037 -2208 79305 -205227 425147 -166013 -123952 228531
7814 54217 11614 182086 -217815 -209334 85108 194035 -127337 7045 -180740 -314967 -66748
7802 -369201 71515 -125053 1281 -17168 -187001 19649 -35412 -76309 -306318 -335795 295745
7790 -189244 -117315 -130287 -129181 -209045 -421921 44883 31580 -212294 -64466 120485 -118 10767
7777 -70036 88973 262107 -417311 -232270 -69903 133793 69663 -118578 -39862 609841 -72142
7765 43084 -89069 -57731 -173298 -177729 -268369 19473 -111691 165702 -32113 126223 -7614
7753 171545 156806 -158859 59025 151823 197424 -124770 19696 70702 13283 202571 -63114
7741 -46309 -218831 17234 -68293 85654 24929 121887 75290 -298787 16538 -208589 13144
7729 -375987 -104527 11697 -144966 11276 402348 301146 -82417 -150733 -233985 341169 -216296
7717 -85933 151159 143523 -381769 247168 -76879 221982 -77409 -123572 44650 343208 -27620
7705 31801 57646 -160531 -186265 310158 -30587 -150132 -175227 44636 -77727 98856 373975
7694 373975 -198602 30009 -135110 139505 35964 -423843 -149074 -101117 267497 -35747
7683 -12292 -222596 -47275 -94552 381093 84538 -250461 -88792 103383 -143684 -326541 268375
7671 -28252 -7185 121909 91258 -94000 -34297 -47856 37380 -158928 -251727 -94409 -370467
7660 -370467 -212477 100145 185036 -190800 -269508 -301000 54231 -170751 304117 -137096
7649 81225 -345219 -233825 198518 303901 -198685 -75564 -79430 37391 -277381 -92361 315204
7637 250779 -290638 -206662 125105 243566 -56605 304021 81371 -368186 -293894 -142789
7626 -60067 -95720 -439542 -304321 77089 -363724 195238 -405245 179726 -217866 201200
7615 106914 -56309 -311504 -162903 -105408 -15666 -193114 -203306 -128175 124600 50342 68308
7604 68308 -264866 -45910 -109600 26562 -61733 -12173 199235 9045 222528 -108834 39513
7592 -111545 103962 29506 70460 -99664 -217207 -139047 -166414 195770 -254061 -73334 -163812
7581 -163812 68014 52264 376637 115938 105960 -49854 220277 213706 -493827 123855 100922
7570 100922 -312594 121514 184982 -358828 -89003 -11966 -50638 -5128 143790 269545 56975
7558 -86231 169405 -130348 -9638 75395 44299 124979 84377 -414941 -85832 70232 -91214
7546 156538 8029 144272 -98024 -2096 -80727 -81001 39314 400240 124883 -118118 -9762 -87497
7534 -87497 154731 -470251 -357321 -226208 8988 -65765 -24410 -181971 -187754 1686 -98442
7522 -255286 -61678 -88989 -223844 -81203 17200 134663 -347244 55130 -79618 -108630 -85069
7511 -85069 -104287 -34116 -192805 -385766 -323526 168698 -57836 -75761 230812 250211 -53267
7499 452368 52619 56406 143931 -73628 -5258 -211862 159591 -83282 -6229 -42167 31943 250246
7487 250246 -234134 -115208 -122586 -88783 -7284 -196610 -37690 65300 106575 -250554 -184088
7476 -184088 59073 -207200 -91267 -115925 -198856 148425 -48839 249151 64510 -9314 -83963
7465 -83963 116739 24174 72547 471025 218989 -161949 -69591 -127766 -231116 -103635 25860
7453 -54456 -153898 -91609 -167807 67094 207087 -244045 -97020 -59845 -120517 -83701 -79197 -344581
7441 -344581 -102964 26914 21288 -146899 -8344 -82570 -176372 136966 -101663 5319 -164805
7429 -197874 -89589 -19198 36452 -13395 -183299 28026 -143731 -446702 -160350 -111216 383587
7417 -249995 130816 115237 -350076 -179960 -78579 -40455 -77325 -39081 -66346 -253618 -250730
7406 -250730 -126483 -14128 -354989 60039 -375488 20062 -81763 188567 -140525 -304390
7396 -304390 -198271 -290257 192561 -124660 79478 -19981 191295 370353 54908 -91405 -421492
7385 -421492 326905 282281 158866 -34477 174069 181309 125692 39707 -75147 204401 -92892
7373 -268809 187238 290071 -159967 -11558 -258501 -55474 281969 -98840 21881 -291971
7362 -194400 -37617 -222406 117171 16116 -321728 -29996 -217468 178921 -263444 225428
7351 59083 140069 13160 10868 -305838 -91462 -122620 138040 85149 -93207 197282 -145906
7339 307380 -480067 -9651 -237397 -102829 -154449 164525 -140314 424898 -1575 285692 -163496
7327 -312175 -373139 196114 -26957 -92676 113992 180402 21097 443945 -237969 -96089 -59442
7316 -59442 123403 -156016 -42443 216694 51637 -170278 -12175 75246 -63732 221772 156298
7305 156298 -306852 -234852 30828 41314 -4490 115401 -443320 -53699 -130215 -337295 -25405
7293 33324 -19573 -237457 85198 210853 45472 -172552 14946 228485 173824 -41082 -30514
7282 -30514 -72318 -42932 58413 234883 194375 256242 -63451 95787 246762 68231 -160016
7270 63381 35706 -213206 -63474 45497 -111356 -283814 183032 384000 -41761 2199 111809
7259 111809 -20253 -70849 -256949 135122 -40831 -51231 161353 -135365 -175395 105263 402808
7248 402808 126799 -184024 -26980 -71720 -206143 -375182 -161263 -269559 399180 -86326
7237 98845 -131018 67583 -244911 256858 -71704 214559 -80340 -186664 6330 326406 72230
7225 -57498 -23949 251223 179657 -15384 -8049 -159565 -170705 -159404 -84350 -187479 -232996
7214 -232996 149733 22988 -97396 213442 61967 -258053 106554 38340 -34200 132079 -282980
7202 -63635 -68183 84 123797 438048 -310982 293242 -222073 -97234 -236254 36002 133665
7191 133665 -97804 -3169 133139 -175317 -133626 331394 31158 65715 197012 18252 -64412
7179 -159389 -130789 5829 61002 -82875 202783 -208215 28360 57434 18077 83068 -217376
7167 44230 76059 -71305 -151493 -215309 115382 329395 97091 206260 -322173 -162428 -59307
7155 77677 -77119 95956 -115345 -113637 32575 48255 -102596 -1208 -102012 250316 -47999
7143 177745 139612 -72743 -116302 108207 -152906 -47136 490214 -126977 3751 184702 79011
7131 -213009 -69712 -43631 -320165 12937 31862 -274512 -565185 127691 140265 -284379 64500
7119 -147140 -133777 -158816 -42128 -211290 -55716 16788 1509 -272566 -21453 37956 -21319
7107 -15418 -14188 431791 -25987 -87012 -126597 -27983 429000 -33063 -202004 178524 -308454
7095 57724 34724 304774 19892 416493 -71281 236809 -69456 10866 -77301 -86071 -120010
7084 -120010 -149432 419283 118972 -23943 -473424 -37207 70318 165628 -161669 141591 132724
7073 132724 -114015 222209 117701 -118647 -173671 -45860 -56600 -208952 67904 192448
7063 192448 -34792 -3177 172412 303699 -87973 -47892 -257251 -271933 -201545 202872 36205
7051 -275357 85322 -27230 -76497 79469 -102384 -166035 -62492 351457 -244582 -84761 -120738
7040 -120738 -240394 272064 35147 -260616 -631599 -386810 -52413 -254628 146549 -131641
7029 34615 169034 -233973 43673 -99907 -139215 85838 101658 -617105 152350 -510550 -69314
7017 126846 256842 -43222 -202826 -15685 -86398 85355 59709 19540 95790 113626 -134447
7005 -488447 -49983 -11454 -594442 -42393 184658 11302 213397 -144257 170029 300413
6995 300413 174892 -41534 86173 -33517 -228176 -5213 229733 2192 -126284 -265277 -57420
6983 8165 -240866 19072 -122646 -101392 -297508 -33031 117861 74979 439169 -503 -129976
6972 -129976 257383 -226318 -253205 -261644 -119973 -39298 -295045 300123 -259938 7620 -316325
6960 204330 174815 -35099 41472 -199253 -211233 -95572 341584 -184817 63315 111414 75956
6949 75956 -109934 -187703 19161 53628 114344 650 99508 -13680 -171386 215562 75603 347101
6937 347101 -110271 56463 -230676 -173280 -20004 16107 -240870 -573215 81150 193646 -94154
6925 82764 117035 57499 -283742 -367266 -86691 194707 109830 120730 225741 -107591 245648
6913 -203987 72102 -122615 96015 -62837 -16600 154241 191489 253130 -86304 28010 248327
6902 248327 -78820 -58581 248547 -80619 -139192 309403 -86538 375271 133277 -225521 -204378
6891 -204378 35600 214638 -23831 -55640 -153049 -140445 -138344 187593 -58667 -229414 2962
6879 -24724 136977 -164516 -282973 -137661 74484 244015 58877 274522 -105752 -240952
6869 -240952 -183285 -21293 -176325 -12499 79704 -43764 -280600 -62889 -112361 115779 59627
6858 59627 22872 292447 87821 27775 -70687 622 148494 -198994 -174525 -455 209018 112430
6846 112430 -190374 198250 50126 -29361 -10971 -372985 48873 -49156 -231720 19655 92859
6835 92859 -255191 -264871 -8497 207707 -185195 -445867 -7028 434883 -53370 -104066 53931
6823 -84052 17527 101875 123929 -210647 -121671 34074 179132 -131996 49326 -303986 -203299
6812 -203299 -117609 33775 335243 -118902 90097 -212440 -26943 241210 -66776 36813 64607
6801 64607 -152483 161398 -52910 12267 -144791 -312864 -197827 12323 329554 -288175
6790 255537 432526 102819 -29794 61035 -197887 213254 60676 -63266 -378249 -157052
6779 63771 47071 -101652 36238 -251431 -208345 139203 349 83027 -24274 -221107 -24669
6767 78792 -144752 254164 201905 290586 228765 165028 -112317 -61129 -80018 -110815 6679
6755 -17309 65695 -60856 -326681 211435 135323 -75927 97898 -142957 -328440 -211039 197192
6743 -238406 -198067 -175737 -19729 -288374 121958 -239769 25151 -82800 -109378 -359546 -136627
6731 -167621 82941 17728 179110 7487 -37739 75042 -108379 -197985 -499264 -273865 152161
6719 -20612 271652 52410 -227200 -191693 119573 133302 -423514 -65293 142879 -42704 527239
6707 -117981 -160946 -127361 435961 -103002 5354 -104380 18134 226201 11677 111826 39125
6695 89076 -95845 -25885 -299483 -163359 -5091 -177282 388841 19730 -44294 -178789 84629
6683 73117 -57171 -171374 23905 59477 146911 -80513 -18422 229095 56835 -53086 42216
6671 7469 -95946 166715 -197140 -207556 -177920 -109594 -124908 -146733 74270 199813 -210975
6659 -5586 -81302 -175054 9682 72220 -52896 221479 -122231 125511 173016 -11543 75964 -384161
6646 -223 -142657 -190208 222736 -217799 15903 37931 -104129 20346 -160332 -45237 63869
6634 163142 70985 -133676 423836 172600 -55423 70670 21665 -29500 -19117 80404 -192800
6622 3198 -52086 -68660 80500 -382793 -112639 103171 132970 -283978 95673 -136858 -255391
6611 -255391 -128813 -118178 2916 -145284 379389 -109719 205837 -65219 66087 278182 52084
6599 -49544 201252 77867 -162587 46719 -157672 49705 -93968 189440 -233092 -133612 -135726
6588 -135726 230592 232911 -84845 -74245 400005 -399470 200172 255011 -19639 124697 -38718
6576 62535 103458 -101762 -114799 179858 153480 -138492 189797 -21359 238064 -35296 163082
6564 79930 232445 -102675 289279 121415 67159 -135355 137412 78215 -277833 102796
6553 -240227 -63543 99145 305366 21962 390942 64374 -151993 76580 187581 134252 -39106
6541 -316574 -140663 131037 -40131 -122839 -185212 -238435 -2566 42819 65998 163419 -216169
6529 -73325 153661 -131566 107323 -103837 258765 -125927 148835 -176377 -444399 -218056
6518 -176997 -119593 -36878 -79465 109652 34795 -220099 247919 -59375 288455 255215 212496
6507 212496 -471444 -159151 -96974 -146761 -3368 -65963 -192206 -76199 -189736 219650 121215
6496 121215 -53285 -132564 198408 187355 -223183 -166317 87360 -164975 -29813 -274032 321514
6484 66843 34894 143636 -1082 -164630 -17517 -72943 -317899 -35444 131281 -93913 15996
6472 -289572 -107588 220382 -59221 49112 -111144 -192908 14791 -371078 78294 -58403 99639
6460 -30942 95936 -3701 -5223 299526 90348 -166657 -238332 32189 -109066 378653 63727
6448 -156030 -40412 -354915 -178691 31086 125627 128382 -9234 -18790 -155030 -32477 80385 -173660
6435 -132225 33857 327636 27716 -108312 23135 135843 257783 -248398 123132 -235958
6424 129792 -175782 -120911 -99336 -297110 -45993 12454 84453 -53755 140198 -245299 -121774
6412 -216471 196506 -44541 -355062 -467417 32592 -160257 155067 57047 8636 61056 50964
6401 50964 87386 -248621 112719 221955 236874 -323989 -27452 533080 188149 -147125
6390 -26308 -141175 -37802 48488 -462190 -175323 189854 7662 -92445 -20406 -80470 99555
6378 48835 34515 -52606 -8432 -138794 -41460 169568 417433 48489 4159 -230720 -313415
6367 -313415 70645 -204060 82497 -153243 69095 -206474 -98691 99228 267760 -68742 -156083
6356 -156083 -159145 10500 -193683 5812 -37776 -148324 57943 233860 -275060 -217659 -52741
6344 87020 -195823 -172831 -21293 120876 84927 -138811 176085 -1134 114416 -249687 124903
6332 -258738 23954 -278490 -100315 -64137 -268309 -94444 79061 255539 290335 -265890 205563
6320 -54726 -45157 -450058 -154590 236819 -114759 -269474 -278972 115244 -101051 -149562 235037
6308 -139438 74609 107373 229057 -233421 35832 -183020 311200 30468 35123 64338 -213288
6296 -148642 -72055 -174148 406732 256193 396041 -31278 26002 41701 -54413 -227811 81765
6284 -106760 25884 248926 247087 -149144 -121246 -484154 -199368 24883 -50010 -138509 122364
6272 37325 96959 -47329 -5569 109429 -94931 -199719 -57998 -395257 8397 132737 -249892
6260 -185285 -156151 247183 86092 -67132 -195273 -299022 -6363 305516 70448 -366566 -71967
6248 206338 164930 -133551 208435 198852 -118449 -114348 5136 -40775 -181874 -136273 89498
6236 -104005 77313 206560 -335806 91047 119580 9756 -77595 -195619 -221770 -55426 183139
6224 -224942 -153063 414924 -192710 50260 33265 -277690 -83227 -240901 -118268 -135856 -297081
6213 -297081 244313 -153645 254488 273854 -294986 -97943 39789 -8307 152536 116571 -33844
6201 148399 148014 -510913 -272283 -112188 441966 -256259 46254 -27713 -197889 52405 88206
6190 88206 129089 -17943 292154 9542 -198286 -198059 -54464 -66832 292303 -216549 -179594 350670
6177 6999 83948 63909 150835 -230148 -37678 30443 -39360 187149 28297 -111209 -96101
6166 -96101 -3283 61511 -186631 -155887 36236 -80805 262153 194130 216626 -41187 -67772 -209670
6154 -209670 308536 -124181 -53838 -331489 -15175 -141515 -37212 -304638 -28427 -49724 15841
6142 258349 -47046 458275 26822 -72309 -157250 -101990 14454 -52176 -232062 -83412 59703
6130 -174543 -13073 10610 128193 10233 82646 -157408 -39581 -45370 88570 9641 -254 20253
6117 -129195 42759 62636 -147979 -92278 -25183 125319 257307 -132533 -115595 102311 178704
6106 178704 -95526 -144542 -561579 241956 303925 -138461 153262 18877 84234 -124658 -282151
6095 -282151 -63106 60768 76768 165890 -42381 -76376 45750 -216069 2121 -466248 -46412
6083 -195060 170460 150903 31926 219584 -189906 -199332 168965 -20747 -152 -152803 -293376
6072 -293376 86931 8117 27942 -68055 -116388 -118705 -26027 -214136 -179833 -153383 -180311 127612
6059 -123916 69388 -132774 62901 -11759 158485 28893 -38398 -97082 257542 71559 -120065
6047 74358 104831 127392 -6367 -149982 166979 114253 107059 140883 66867 510435 -59290 78565
6034 -353202 -172355 -39788 -125411 -265323 107478 465708 -18935 210844 -30571 81810 -47274
6022 100064 -36547 62067 -75489 -2436 18612 34864 11757 9757 44460 -240417 -292585 63848
6009 11436 -203274 8918 124476 -4310 84765 184659 -98181 18761 -28447 336773 -245967
5997 -157110 -47256 -255137 372062 -295777 129148 49429 481708 -61534 -35002 287523
5986 -95003 -311076 90169 132657 -50437 77712 43915 -86781 329161 -136224 -179809 -316762
5975 -316762 222637 54800 -92748 -120977 -105944 -154710 -71653 22418 131792 -81123 64672
5963 261980 241036 1382 -137688 -194866 -299187 4970 -15100 6646 16141 126365 32865 181091
5951 181091 34753 -115688 -129620 111606 299973 75652 -360122 -236801 -286043 -244380 195713
5939 22036 -26351 -194866 34113 53485 245322 -239108 -51397 -219273 -119930 28708 73361
5928 73361 166717 65210 -239628 -267015 -258909 170464 87651 -36934 73285 -4269 -109256 47289
5915 -125569 -94105 14228 -134868 -89158 -51965 165346 -143687 259188 11830 185650 343125
5904 343125 345085 -238275 48126 -6039 163004 204898 119137 -15193 210058 281896 51976
5892 -204868 105756 -53256 -303558 82001 -152566 -234975 100767 -318336 -5724 -131105 -381927
5881 -381927 3056 -123321 28693 122613 -67724 214202 -10708 -181160 -255066 104951 -144244
5869 27163 -355971 139021 82748 229837 -189964 -121284 -40833 304744 19833 -181830 321305
5857 218607 -396987 157807 262824 171507 205349 -19848 171634 -120955 223577 -11981
5846 154295 -40021 45668 -110894 -148623 213390 -21792 267936 72709 -51292 -159652 240298
5834 -413212 74174 -3419 -115892 -78497 -46711 -102162 210268 141186 419982 161974 -129480
5822 47599 27407 -344705 -236779 -110146 7265 437519 62731 -87075 -119674 -116253 -266425
5811 -266425 -4042 45850 68577 159984 -90947 70311 -37728 -267195 95125 -98979 -31070 -222134
5799 -222134 39359 113540 -123568 223994 -258515 -32054 -81142 -43182 36096 -206313 169802
5787 -347871 -57853 265244 -270888 -111248 52808 -237629 198787 -48786 -113895 -383465
5777 -383465 -165106 -140587 -86324 -126362 253860 -91278 -51286 -163995 -269018 72189 299615
5766 299615 197419 37844 86220 -103788 24394 -39700 13946 -123364 -259175 -426707 -75710
5754 -214915 -64971 -188491 64994 123713 -257906 -61227 -59461 -179545 49908 26179 262821
5743 262821 -832 -85991 -16233 -238860 -62880 -40492 -373775 -173763 17165 -10840 151289
5731 95838 40071 282493 45198 131983 226675 114896 4396 87117 200659 -129921 -99770
5720 -99770 -117624 -239027 203318 179104 96025 -303595 153260 368153 -196724 -370978
5710 -370978 -245644 165945 -423089 157747 -77685 114068 33147 -95969 271035 65067
5699 254664 -37121 -252881 122280 -91477 158049 111773 -67404 -16982 263940 -122445 56996
5687 181316 808 231895 190244 -28508 206665 -109006 386303 97584 -222394 -132205 -249896
5676 -249896 31833 -49333 211485 -194354 -29888 -25008 60899 -161973 187072 61508 24323
5664 263735 54569 -121000 38586 293918 191166 -27699 20230 142236 158898 -168822 279991
5652 -63686 267974 116168 140011 -59859 -103112 -105849 -272735 -124441 -159698 198713 29354
5640 -154741 32591 15527 -20838 187970 82438 65257 2159 -82730 -108850 272258 -291497
5628 10672 246859 178348 111418 7192 -94457 -148140 189808 -413284 -159947 93713 88601
5617 88601 -60967 -107550 75693 75569 -18862 216719 517956 -145693 256344 269014 -125549
5605 57186 101168 -133070 213230 -119146 182571 231165 -35889 -194975 151972 27524 -106173
5593 -376552 100697 -178232 -112368 -345069 -1875 -173161 -349380 -32271 60107 -75161 -573230
5582 -573230 229322 -102924 -128226 170235 73151 13375 -56776 -97906 229022 -29436 -42498
5571 -42498 -91520 -105589 213558 416 50293 38022 -51353 89056 -107799 -165346 11267 -327583
5558 -13699 92355 -154037 -128688 104153 -174298 -14278 13215 -63497 60861 -66758 -215853
5547 -215853 39545 -103995 -398576 117507 -314128 -147248 -173256 -219390 167216 185752
5537 185752 175743 116936 -29863 2315 -71617 26765 249284 -399054 104621 136963 226550
5526 226550 -83362 49189 -97268 -201297 -136947 -227625 -80646 220882 133863 -16533 -324794
5515 -324794 -34768 171873 41861 -38353 -134324 229695 -143761 -93863 -27790 -117012 -117198
5504 -117198 71210 -23297 295967 -86787 152371 -64108 -10602 -85904 126750 148779 248922
5493 248922 165797 3033 -13149 -271850 164316 9411 79846 207511 -183323 -141583 -129535
5482 -129535 -16730 93421 -209402 16770 -209689 65154 1291 -187034 16154 58429 28077
5470 238955 -38158 210830 -256626 -189505 -27523 -403464 263570 -333877 -224617 63541
5459 10815 253718 -106222 19593 198300 -215341 -46267 598496 -340131 43325 121345 15651
5447 -225059 181589 73658 -105492 48906 118134 -53136 25613 -118667 -186798 -234324 -25015
5435 -375333 112202 -150256 14511 -120052 311895 -64744 -115990 46643 568413 221613
5424 144448 40655 261896 -69359 -263669 51031 268532 -79900 -244485 -35351 -89659 74301
5412 179545 159353 165054 75613 74252 76548 -310706 81081 239241 16708 115234 -236597 101567
5399 -149152 -120039 -20399 35135 260113 182353 -102444 21334 151565 -11106 -65476 -211623
5388 -211623 -16723 -53996 -92358 61289 -102951 120363 -113329 -240355 -116412 -45153 -477308
5377 -477308 -153755 29021 516491 -143404 26731 -228130 -143090 87762 36544 172525 -55843
5365 -131388 150425 58572 -103064 7462 89037 -156952 77617 -222872 478788 -60955 -79268
5354 -79268 -106373 -70283 165653 418363 409745 1781 -22859 -310224 93885 309449 80685
5342 -107550 10652 429327 322814 -325870 -78569 -146122 -15648 53268 -48950 190450 -260775
5330 1274 -24264 -86235 141402 -37957 7852 -110278 37076 -55969 37774 -221266 24071 32773
5318 32773 -12935 64547 108065 -73848 -6808 -72620 161124 -210070 147305 395140 -323244
5306 154093 -115820 -151556 77727 246476 -260474 105140 53623 -37877 -207007 77175 32769
5294 -180287 -94053 -7299 340174 271566 -152090 284022 86264 109595 -344593 -192584 -49466
5282 48064 -17509 -2469 -109078 130473 73643 -182562 -3685 -43315 -356571 197269 121072
5271 121072 23392 87623 -58285 98999 -60906 90644 51167 -275171 -243257 33851 280356
5260 280356 61097 169980 60160 48382 96666 248414 232978 -33867 -50234 179429 257792
5249 257792 6819 288913 137757 71646 -80972 -98363 142174 -60604 270482 157561 -415916
5237 122856 11057 123869 337967 -118522 -122919 -53158 -96944 -15889 98087 69124 68759 181859
5225 181859 229729 164133 -79945 63843 86487 3723 87993 -31795 -137723 -7075 92371 119158
5213 119158 -62098 26282 98736 -92746 -40164 -28653 464966 68424 -103411 46248 -205985
5201 -63122 -202875 -206739 66934 -158203 16389 -3712 174636 15382 -81008 124704 256807
5190 256807 227116 -61585 273329 373393 90261 -93783 64094 -34897 -58092 -113526 -127263
5179 -127263 -75827 -94427 18948 -19705 -63795 -255236 56666 144487 -200581 48180 53116
5168 53116 69583 351125 70130 33692 -242697 222350 198691 -64686 -220308 113291 17649
5156 -121167 -150953 -192786 406769 -271245 -178892 14455 253129 188783 213795 -116056 189700
5144 370873 240922 -89480 180581 -271437 10706 -192612 144410 28088 111696 -295837
5133 -152000 -13588 -37946 55104 -125043 -100566 -133072 201127 9995 108916 163510 -47858
5121 -54900 27639 64912 -177719 241166 203795 -91231 231175 67275 195402 297383 -26451
5109 -198180 -40770 6390 196392 23840 -172394 -231332 -34541 -4455 2425 124272 277470
5098 277470 58490 -153781 -86077 70618 147819 21655 -231632 -107273 331187 -142576 -317543
5087 -317543 -330609 59921 -317942 10049 229050 -15884 -81276 -64356 224747 11862 95999
5076 95999 64616 152497 439872 113769 -141346 154080 -46827 423760 61189 -238672 -160082
5065 -160082 -82094 157386 -86320 156907 -212441 146126 -61517 20235 -72835 -59199 -221400
5054 -221400 42396 -296586 397307 251632 184677 -175794 287115 -147477 174889 -47086
5043 -27961 -12211 92829 -237081 362479 42018 -121650 57273 -182415 -211473 599469 93679
5031 257102 192279 -268471 -196034 157672 -121487 -91287 -112445 -123371 -188702 -326077 -89750
5019 -142543 408972 22651 185298 -82241 -10464 -127491 -110535 -164974 19792 -73712 -140413
5008 -140413 -34483 -178879 -139726 -8864 -335826 162816 217890 99717 54219 -354357 53595
4996 150307 263036 284213 30227 117902 415516 -166792 -1011 -304408 181638 256558 29752
4984 -205946 -352133 -95830 138265 -160582 -9551 -30772 279268 -126541 24965 98954 -42653
4972 -99422 5642 -79639 228646 17970 398794 42122 188398 -104595 37088 -269763 238039
4960 47881 894 284298 -14712 242280 50686 -307402 -289089 132467 -216021 -151158 -25317
4948 178 68609 -152989 383468 -241908 315321 -75211 -171454 -50944 238652 -35958 -67320
4937 -67320 100317 9324 35177 46120 41470 66674 -35478 262351 91977 187379 -263009 -9438
4924 -7393 47027 58346 -57926 -32142 -40952 75031 168182 157263 -231266 38940 -18459 206224
4911 -43813 -190235 210282 194418 -384901 10436 363857 111715 54916 57943 192466 -150388
4899 41221 47358 -56405 -152188 -228181 -294125 -92417 144724 -422842 450533 28706 -296507
4887 -106572 -134899 73205 -34581 -313103 77044 -141799 -169767 218226 -15369 70783 -102606
4875 50843 107200 -42705 254016 -276969 -492549 140626 49415 -115840 31193 107906 118700
4864 118700 111212 -45864 -103844 239936 237486 234624 -58667 -55602 -58843 30404 -233546 186714
4851 -122103 -6857 -200890 21703 -178376 -414352 30859 -31506 -238712 -77073 -184443 149053
4839 155686 333266 -33905 -332946 44098 29793 -83535 -121471 129210 144658 -94039 141815
4827 -357 70625 224544 -120545 198143 361105 -165543 39993 18862 9578 -46748 340193
4815 246087 176983 -176821 -233545 37808 237474 86604 -88501 -80131 113173 -40795 -409531
4804 -409531 20118 375317 141071 -52508 -12992 -185857 48129 -25675 274830 131665 -75718
4792 -162958 -160321 -254624 62063 4360 -43359 169961 -80222 326184 -185825 83185 -171217
4780 -155283 193632 -88086 -11163 172372 -162214 -23883 -7624 -89454 -19777 -205419 -216162
4769 -216162 -98111 -53191 197484 -206590 390328 107832 -36094 -170375 -272261 74529
4758 37754 41480 26240 -232972 -112916 92087 25548 -109552 -184266 292116 109998 -75506
4746 -267557 197781 -340915 -86349 83994 -274 117566 357200 -297866 144253 179733 -216518
4734 11032 118986 -196775 69234 -148455 -41305 119037 -96604 -16308 -177042 -42902 -94305
4723 -94305 16714 179900 -215481 -52947 42798 68719 -80899 -94031 168236 73881 3272
4711 13334 160199 62849 92944 113325 -22507 170855 -26356 359242 12733 -26729 70531
4699 -314540 -229872 260229 -228602 69924 -85406 -82643 -50980 84010 -63123 -293383 160391
4687 -100478 -193667 -188903 -144540 -117897 143043 -34048 -110537 29347 138319 424097 -23909
4675 171915 37750 210962 47079 359281 4857 182701 92241 62097 -146112 -77349 -209163
4664 -209163 327601 244813 104175 -77685 -253371 9274 -310243 344103 179543 248660 40272
4652 138849 122482 2404 -325993 -33107 6620 116293 210261 -138794 -76344 -387289 190425
4640 201181 216122 -25499 -54303 -295518 3824 -123456 34509 -59009 253973 61319 17987
4628 -288732 -14947 2808 70964 213926 33989 173499 127232 -13358 14677 -118462 225786
4616 20400 42103 -247593 -279575 348908 -117374 -145526 -115906 166237 144314 220116 78627
4604 306861 94839 -138264 316058 136907 411798 -213211 -56157 -46423 -29204 -229332 103440
4592 -76728 371948 52856 -50750 -293114 -65317 -50941 -33069 -189762 190833 343111 162998
4580 -131888 85555 -66756 -177226 74106 -284149 89616 162903 184083 219562 43138 3573
4568 -163483 -136732 -105194 195577 124412 -161603 -147765 -39310 103208 -142185 -176092 244837
4556 94251 49196 -263522 -34410 -8598 -93297 140243 28770 -4349 -227840 18643 107986 7402
4543 -71382 -150115 189597 14882 -378279 153782 -13243 247042 -88273 -164170 -249416 158722
4531 150770 -297666 27111 273853 -126726 6104 138748 -203157 25088 -131778 417325
4520 -30814 32115 305699 37309 -112141 -41428 -77451 -7519 164058 -404503 174321 -67550
4508 -253218 -47990 16648 283266 122964 -57730 -55452 -500505 596578 317420 -58325 64960
4496 104352 268354 41113 -87344 150190 -200972 -56560 -231843 -100712 109418 -278340
4485 -6801 23239 278850 -3438 49511 214209 61450 23519 22525 243863 -46544 -2971 286587
$$ [...]
##END NTUPLES=NMR SPECTRUM
##END=
