
##TITLE=UV1110_M2_1290-1353_7180635_9q4j7LhjMn
##JCAMPDX= 6.0         $$ Bruker NMR JCAMP-DX V2.0
##DATA TYPE= NMR SPECTRUM
##DATA CLASS= NTUPLES
##ORIGIN= BRUKER
##OWNER= Administrator
$$ 1.72 TOPSPIN		Version 2.1
$$ 2012-12-05 00:16:34.677 -0500  Administrator@X
$$ Compression mode = diff/dup
##.OBSERVE FREQUENCY= 400.02188249412
##.OBSERVE NUCLEUS= ^1H
##.ACQUISITION MODE= SIMULTANEOUS (DQD)
##.ACQUISITION SCHEME= undefined
##.AVERAGES= 64
##.DIGITISER RES= 22
##SPECTROMETER/DATA SYSTEM= spect
##.PULSE SEQUENCE= noesygpps1d.comp
##.SOLVENT NAME= COFFEE_meoh
##.SHIFT REFERENCE= INTERNAL, COFFEE_meoh, 1, 14.96091
##AUDIT TRAIL= $$ (NUMBER, WHEN, WHO, WHERE, PROCESS, VERSION, WHAT)
$$ ##TITLE= Audit trail, TOPSPIN		Version 2.1
$$ ##JCAMPDX= 5.01
$$ ##ORIGIN= Bruker BioSpin GmbH
$$ ##OWNER= Administrator
$$ $$ E:\/data/COFFEE/nmr/UV1110_M2_1290-1353_7180635_9q4j7LhjMn/12/pdata/1/auditp.txt
$$ ##AUDIT TRAIL=  $$ (NUMBER, WHEN, WHO, WHERE, PROCESS, VERSION, WHAT)
(   1,<2012-12-05 00:16:28.755 -0500>,<Administrator>,<X>,<go>,<TOPSPIN 2.1>,
      <created by zg
	started at 2012-12-05 00:04:58.443 -0500,
	POWCHK enabled, PULCHK disabled,
       configuration hash MD5:
       86 BA 57 50 F2 9D 5C 9B 26 00 A9 28 5F 66 2E 89
       data hash MD5: 64K
       E5 98 48 E2 2D CF A0 34 A5 2D C2 66 EE 9E 12 89>)
(   2,<2012-12-05 00:16:31.896 -0500>,<Administrator>,<X>,<proc1d>,<TOPSPIN 2.1>,
      <Start of raw data processing
       efp LB = 0.3 FT_mod = 6 PKNL = 1 PHC0 = 0 PHC1 = 0 SI = 128K 
       data hash MD5: 128K
       D4 11 EC 5F 9C 7A 5B 46 C7 86 08 46 64 78 9D 7E>)
(   3,<2012-12-05 00:16:32.911 -0500>,<Administrator>,<X>,<proc1d>,<TOPSPIN 2.1>,
      <pk PHC0 = -83.172 PHC1 = 0 
       data hash MD5: 128K
       9C A9 B4 73 13 EB 32 15 DC B3 2B 53 D3 35 26 57>)
(   4,<2012-12-05 00:16:33.615 -0500>,<Administrator>,<X>,<proc1d>,<TOPSPIN 2.1>,
      <abs ABSG = 1 
       data hash MD5: 128K
       12 52 74 1A E4 85 42 20 C0 34 AA 19 02 9C 7E E4>)
(   5,<2012-12-05 00:16:33.786 -0500>,<Administrator>,<X>,<proc1d>,<TOPSPIN 2.1>,
      <abs ABSG = 2 
       data hash MD5: 128K
       D0 AE A6 3A 81 05 E2 DC 7F B0 38 EB 94 96 16 D5>)
(   6,<2012-12-05 00:16:33.974 -0500>,<Administrator>,<X>,<proc1d>,<TOPSPIN 2.1>,
      <abs ABSG = 3 
       data hash MD5: 128K
       C4 78 D6 EA 3D 0C CA 12 F0 8A 33 3F C8 B8 87 DC>)
(   7,<2012-12-05 00:16:34.161 -0500>,<Administrator>,<X>,<proc1d>,<TOPSPIN 2.1>,
      <abs ABSG = 4 
       data hash MD5: 128K
       77 48 B6 49 BD F4 F2 34 41 5A 5E F8 FC E5 9E 9E>)
(   8,<2012-12-05 00:16:34.318 -0500>,<Administrator>,<X>,<proc1d>,<TOPSPIN 2.1>,
      <abs ABSG = 5 
       data hash MD5: 128K
       F0 1D 55 EE 9C C4 FA 97 47 85 21 54 9B 84 F1 81>)
$$ ##END=
$$ 
$$ $$ hash MD5
$$ $$ 69 AF B1 A2 67 13 F2 8C CA 56 FC 6C 9D 51 1E 43
##$RELAX= 
##$RELAX= 
##$RELAX= 
##$RELAX= 
##$RELAX= 
##$RELAX= 
##$RELAX= 
##$RELAX= 
$$ Bruker specific parameters
$$ --------------------------
##$DU= <E:\>
##$EXPNO= 12
$$ [...]
150 150 150 150 150 150 150 150
##$TP07= 0
##$TPNAME0= <>
##$TPNAME1= <>
##$TPNAME2= <>
##$TPNAME3= <>
##$TPNAME4= <>
##$TPNAME5= <>
##$TPNAME6= <>
##$TPNAME7= <>
##$TPOAL= (0..7)
0.5 0.5 0.5 0.5 0.5 0.5 0.5 0.5
##$TPOFFS= (0..7)
0 0 0 0 0 0 0 0
##$TUNHIN= 0
##$TUNHOUT= 0
##$TUNXOUT= 0
##$USERA1= <user>
##$USERA2= <user>
##$USERA3= <user>
##$USERA4= <user>
##$USERA5= <user>
##$V9= 5
##$VALIST= <valist>
##$VCLIST= <CCCCCCCCCCCCCCC>
##$VD= 0
##$VDLIST= <DDDDDDDDDDDDDDD>
##$VPLIST= <PPPPPPPPPPPPPPP>
##$VTLIST= <TTTTTTTTTTTTTTT>
##$WBST= 2048
##$WBSW= 25
##$XGAIN= (0..3)
0 0 0 0
##$XL= 0
##$YL= 0
##$YMAX_a= 5894860
##$YMIN_a= -11715476
##$ZGOPTNS= <>
##$ZL1= 120
##$ZL2= 120
##$ZL3= 120
##$ZL4= 120
##$ABSF1= 14.96091
##$ABSF2= -5.597272
##$ABSG= 5
##$ABSL= 3
##$ALPHA= 0
##$AQORDER= 0
##$ASSFAC= 0
##$ASSFACI= 0
##$ASSFACX= 0
##$ASSWID= 0
##$AUNMP= <proc_prof1d_extract.lims>
##$AXLEFT= 0
##$AXNAME= <>
##$AXNUC= <1H>
##$AXRIGHT= 0
##$AXTYPE= 0
##$AXUNIT= <>
##$AZFE= 0.1
##$AZFW= 0.1
##$BCFW= 0
##$BC_mod= 0
##$BYTORDP= 0
##$COROFFS= 0
##$CY= 15
##$DATMOD= 1
##$DC= 0
##$DFILT= <>
##$DTYPP= 0
##$F1P= 0
##$F2P= 0
##$FCOR= 0.5
##$FTSIZE= 131072
##$FT_mod= 6
##$GAMMA= 0
##$GB= 0
##$INTBC= 1
##$INTSCL= 1
##$ISEN= 128
##$LB= 0.3
##$LEV0= 0
##$LPBIN= 0
##$MAXI= 10000
##$MC2= 0
##$MEAN= 0
##$ME_mod= 0
##$MI= 0
##$NCOEF= 0
##$NC_proc= -2
##$NLEV= 6
##$NOISF1= 0
##$NOISF2= 0
##$NSP= 0
##$NTH_PI= 0
##$NZP= 0
##$OFFSET= 14.96091
##$PC= 1
##$PHC0= -83.172
##$PHC1= 0
##$PH_mod= 1
##$PKNL= yes
##$PPARMOD= 0
##$PPDIAG= 0
##$PPIPTYP= 0
##$PPMPNUM= 2147483647
##$PPRESOL= 1
##$PSCAL= 4
##$PSIGN= 0
##$PYNMP= <proc.py>
##$REVERSE= no
##$SF= 400.020009673497
##$SI= 131072
##$SIGF1= 0
##$SIGF2= 0
##$SINO= 400
##$SIOLD= 131072
##$SPECTYP= <>
##$SREGLST= <1H.CDCl3>
##$SSB= 0
##$STSI= 131072
##$STSR= 0
##$SW_p= 8223.68421052631
##$SYMM= 0
##$S_DEV= 0
##$TDeff= 65536
##$TDoff= 0
##$TI= <>
##$TILT= no
##$TM1= 0
##$TM2= 0
##$TOPLEV= 0
##$USERP1= <user>
##$USERP2= <user>
##$USERP3= <user>
##$USERP4= <user>
##$USERP5= <user>
##$WDW= 1
##$XDIM= 131072
##$YMAX_p= 446127618
##$YMIN_p= -12151
##$CURPLOT= <Network HP LaserJet P1505>
##$CURPRIN= <$Network HP LaserJet P1505>
##$DFORMAT= <normdp>
##$LAYOUT= <+/1D_H.xwp>
##$LFORMAT= <normlp>
##$PFORMAT= <normpl>
##$SURQMSG= 1
$$ End of Bruker specific parameters
$$ ---------------------------------
##NTUPLES= NMR SPECTRUM
##VAR_NAME=  FREQUENCY,     SPECTRUM/REAL,   SPECTRUM/IMAG
##SYMBOL=    X,             R,               I
##VAR_TYPE=  INDEPENDENT,   DEPENDENT,       DEPENDENT
##VAR_FORM=  AFFN,          ASDF,            ASDF
##VAR_DIM=   131072,        131072,          131072
##UNITS=     HZ,            ARBITRARY UNITS, ARBITRARY UNITS
##FACTOR=    0.0627417313425164, 1,          1
##FIRST=     8223.62146879497, 3897,         -53310
##LAST=      0,             5463,            -52957
##MIN=       0,             -12151,          0
##MAX=       8223.62146879497, 446127618,    0
$$ Real data points
##PAGE= N=1
##DATA TABLE= (X++(R..R)), XYDATA
$$ [...]
67847 76720 74920 72939 71472 71062 71311 71410 71002 70194 69186 68328 68165 69015 70657 72687 74886 77064 78861
67830 78861 80111 81159 82522 84386 86649 89199 91919 94647 97388 100315 103368 106131 108312 109980
67816 109980 111074 111156 110071 108464 107079 105844 104210 102102 99901 97637 94910 91657 88404 85641 83425
67801 83425 81666 80305 79066 77546 75773 74327 73654 73549 73482 73174 72658 72016 71295 70555 69834 69127 68464
67784 68464 67910 67475 67128 66943 67102 67759 68869 70114 70944 70928 70199 69445 69310 69973 71343 73297 75470 77231
67766 77231 78360 79450 81145 83208 84902 86095 87318 88809 90232 91444 92824 94556 96140 96913 96686
67751 96686 95705 94415 93416 93110 93117 92504 90925 89153 88204 88362 89333 90801 92309 93017 92266 90330 88098
67734 88098 86062 84001 81627 79145 77063 75705 74975 74448 73733 72860 72220 71982 71744 71006 69863 68932 68594
67717 68594 68588 68483 68319 68581 69506 70568 70831 69859 68171 66704 65948 65729 65647 65455 65158 65083 65747 67270 68926
67698 68926 69738 69580 69215 69153 69034 68409 67571 67127 67093 66974 66572 66261 66450 67093 67772 68090 68063 68164 68806 69759
67678 69759 70371 70454 70522 70937 71325 71250 71012 71206 71842 72497 73133 74062 75139 75689 75361 74563 73933 73824 74430 75885
67658 75885 78030 80442 82890 85375 87554 88603 88061 86537 85155 84425 84025 83496 82744 81863 80898 80003
67642 80003 79541 79690 80022 79765 78604 77055 75916 75460 75357 75305 75439 76070 77255 78774 80333 81623 82332
67625 82332 82310 81714 80917 80370 80521 81540 82923 83739 83648 83492 84413 86476 88622 90007 90892 92065 93801
67608 93801 95741 97433 98625 99133 98836 97827 96349 94504 92225 89606 87132 85428 84786 84904 84985 84126
67592 84126 81855 78599 75618 74127 74308 75246 75957 76241 76391 76343 75630 74194 72736 72031 72135 72491 72590 72303
67574 72303 71727 70953 69958 68650 67147 66024 66019 67260 69015 70374 70979 70986 70616 70059 69594 69410 69430 69554 69885
67555 69885 70429 70819 70750 70485 70508 70742 70650 70100 69607 69590 69835 69913 69784 69717 69817 69876 69592 68809 67640 66392 65304
67534 65304 64364 63497 62859 62758 63290 64249 65290 66052 66246 65901 65415 65054 64551 63582 62473 61949 62216 62823
67516 62823 63451 64208 65029 65500 65592 65935 66824 67442 66729 64770 62731 61537 61197 61332 61801 62608 63649 64759
67498 64759 65801 66585 66939 66951 66976 67264 67711 68055 68150 67969 67503 66850 66343 66358 66921 67601 67947 68020 68322 69147
67478 69147 70172 70839 70975 70774 70270 69227 67637 66018 64994 64756 65084 65728 66568 67542 68587 69573 70205
67461 70205 70164 69504 68792 68692 69480 71030 73015 74910 76042 76028 75183 74211 73463 72740 71809 70824 70110 69737
67443 69737 69508 69313 69312 69710 70423 71068 71364 71499 71962 72939 74010 74545 74356 73810 73330 72873 71941 70140 67732
67424 67732 65573 64394 64168 64324 64497 64817 65470 66349 67259 68117 68725 68716 68111 67601 67797 68365 68432 67782 67046
67405 67046 66642 66173 65212 64175 63906 64658 65947 67295 68628 69880 70646 70455 69258 67498 65770 64470
67389 64470 63666 63230 63094 63378 64207 65406 66475 66927 66616 65798 64977 64684 65171 66181 67118 67611 67904 68505
67371 68505 69467 70155 69847 68462 66637 65141 64328 64072 64109 64350 64916 65913 67209 68442 69249 69474 69184 68594
67353 68594 67977 67568 67464 67619 67962 68403 68732 68681 68233 67763 67699 68062 68478 68616 68530 68609 69255 70520 71910 72733
67333 72733 72877 73144 74487 76958 79769 82340 84817 87397 89669 91110 91929 92858 94119 95074 95020 93919
67317 93919 92176 90040 87606 85188 83282 82053 81224 80594 80364 80656 80983 80679 79857 79478 80361 82444 85152
67300 85152 87960 90280 91392 91157 90507 90475 90808 90322 88658 86900 86127 86087 85757 84673 83190 81824 80895
67283 80895 80527 80471 80151 79345 78620 78633 79219 79692 79851 80122 80815 81765 82703 83471 83927 84141 84669 86068 88048
67264 88048 89654 90387 90651 90939 91157 91018 90578 90029 89348 88517 87788 87381 87163 86907 86611 86294 85751 84853 83861
67245 83861 83152 82813 82788 83147 83858 84517 84707 84502 84252 84052 83795 83634 83888 84518 85150 85614 86055 86448 86437 85863
67225 85863 85093 84615 84557 84782 85212 85806 86353 86565 86397 86155 86233 86727 87287 87454 87237 87183 87684 88356 88494 88069
67205 88069 87837 88369 89442 90625 91934 93432 94524 94273 92539 90408 89328 89946 91748 93652 94910
67190 94910 95578 96177 96895 97360 97264 96893 96707 96657 96415 96183 96701 98319 100507 102421 103586 103885 103375 102456
67172 102456 101807 101721 101735 101257 100382 99722 99654 100176 101250 102783 104303 105211 105422 105397 105488 105704 106114 106905 107851
67153 107851 108288 107997 107701 108180 109231 110042 110445 111158 112723 114679 116127 116771 117111 117657 118287 118501 118192
67136 118192 117884 118130 118878 119703 120518 121627 123002 123995 124154 124044 124744 126576 128688 129979 130175 130024 130583
67119 130583 132319 134689 136604 137498 137834 138308 138767 138429 137164 135972 135916 137050 138710 140464 142265 143912
67103 143912 145002 145468 145757 146320 147252 148530 150200 152108 153720 154584 154915 155391 156382 157583 158463 158814 158800
67086 158800 158699 158770 159205 160043 161206 162699 164593 166622 168118 168744 169139 170311 172375 174407 175660 176339
67070 176339 176997 177826 178954 180808 183371 185518 186033 185236 184799 185877 188168 190873 193656 196341 198535
67055 198535 200220 202121 204736 207434 209171 209826 210208 210967 212177 213801 215796 217764 219179 220146 221366
67040 221366 223216 225391 227586 229922 232424 234648 236239 237493 238975 240914 243295 246173 249445 252614
67026 252614 255356 258143 261736 266009 269860 272389 273799 274993 276675 279109 282366 286391 290847 295220
67012 295220 299160 302674 306033 309586 313608 318176 323060 327771 331782 334918 337667 340992 345612 351364
66998 351364 357420 363102 368384 373593 378908 384278 389624 394856 399841 404582 409413 414697 420320 425669
66984 425669 430233 434082 437744 441801 446715 452770 459861 467375 474599 481404 488376 496122 504489 512629
66970 512629 519834 526178 532325 538849 545877 553318 561209 569757 579118 589240 599838 610516 621013
66957 621013 631424 642098 653200 664482 675658 686942 698948 712041 725983 740323 754908
66946 754908 769864 785250 800946 816829 832870 849119 865712 882812 900418 918316 936411
66935 936411 954975 974290 994179 1014309 1034936 1056830 1080196 1104131 1127596 1150659 1174287
66924 1174287 1199100 1224909 1251497 1279139 1308013 1337576 1367042 1396339 1426125 1456905 1488525
66913 1488525 1520585 1553001 1586014 1619867 1654644 1690310 1726790 1764080 1802366 1841908 1882739
66902 1882739 1924555 1966981 2009935 2053584 2097960 2142616 2186772 2229923 2272428 2315369 2359611
66891 2359611 2404994 2450584 2495623 2540042 2584097 2627865 2671188 2713749 2755054 2794648 2832586
66880 2832586 2869352 2905066 2939066 2970672 3000063 3027891 3054204 3078336 3099845 3118927 3135735
66869 3135735 3149887 3160965 3169065 3174464 3177068 3176607 3173148 3166999 3158128 3146093 3130544 3111591 3089661
66856 3089661 3065220 3038617 3009969 2979153 2946063 2910934 2874308 2836647 2798066 2758481 2717937
66845 2717937 2676702 2635053 2593023 2550396 2507002 2462919 2418350 2373396 2328080 2282511 2236847
66834 2236847 2191152 2145556 2100468 2056344 2013215 1970731 1928728 1887424 1846967 1807161 1767816
66823 1767816 1729018 1690939 1653727 1617750 1583465 1550714 1518531 1486033 1453226 1420641 1388633
66812 1388633 1357480 1327690 1299437 1271973 1244344 1216666 1190004 1164965 1141044 1117388 1093658
66801 1093658 1070087 1047292 1026076 1006763 988556 970117 950991 931892 913498 895678 878168
66790 878168 861227 845076 829314 813505 797886 782897 768377 753892 739577 726006 713343
66779 713343 701195 689217 677355 665582 653919 642616 631758 620703 608572 595455 582600
66768 582600 571142 561044 551588 542511 534171 526732 519751 512718 505691 499057 492786 486329 479411 472511
66754 472511 466169 460069 453399 446117 439181 433264 427780 421609 414455 407069 400413 395024 390896 387505
66740 387505 384050 380117 376017 372197 368516 364489 359994 355295 350565 345861 341354 337045 332393 326904
66726 326904 321069 316074 312439 309498 306306 302544 298390 294107 290061 286751 284442 282937 281739 280241
66712 280241 277893 274697 271468 268991 266888 264027 260213 256652 254439 253319 252416 251392 250183 248261
66698 248261 245125 241274 237837 235261 233007 230471 227598 224595 221661 219084 217081 215418 213621 211601
66684 211601 209736 208260 206956 205530 203934 202199 200250 198035 195675 193406 191505 190205 189443 188742 187560
66669 187560 185761 183596 181408 179592 178556 178325 178283 177805 177004 176379 175843 174749 172904 170906 169268 167822
66653 167822 166234 164615 163218 161949 160527 158861 157007 155070 153385 152386 152045 151846 151604 151770 152514 153048
66637 153048 152525 151224 150087 149294 148135 146273 144240 142484 140726 138697 136911 136083 136112 136225 135955 135461
66621 135461 134936 134251 133339 132507 132048 131749 131114 130004 128736 127539 126215 124529 122728 121354 120605 120182
66605 120182 119788 119495 119485 119654 119677 119365 118836 118396 118207 117976 117066 115288 113575 113368 115045 117384 118879 119202
66587 119202 118959 118463 117522 116200 114982 114039 113002 111689 110496 109771 109276 108643 108026 107897 108373 109007 109139
66570 109139 108324 106699 105094 104519 105198 106259 106556 105677 104090 102588 101806 101933 102540 102828 102349 101373 100408
66553 100408 99595 98832 98258 98189 98672 99413 100084 100429 100233 99486 98519 97644 96729 95432 93804 92370 91638 91820
66535 91820 92899 94601 96277 97243 97347 97009 96617 96085 95014 93117 90564 88112 86783 87075 88510 90244
66519 90244 91931 93585 94801 94810 93463 91528 89728 88012 86115 84360 83342 83084 83023 82739 82318 82042 82037
66502 82037 82257 82514 82487 81935 80944 79927 79315 79313 79829 80564 81218 81634 81746 81501 81041 80805 81101 81578 81506 80699
66482 80699 79731 79161 78977 79051 79585 80675 81837 82481 82609 82569 82390 81970 81745 82470 84209 86066 87061 86932
66464 86932 86070 85059 84391 84228 84320 84344 84344 84514 84673 84414 83817 83466 83616 83831 83747 83745 84446 85818 87151 87772
66444 87772 87532 86764 86029 85712 85631 85178 84076 82849 82309 82734 83739 84729 85185 84764 83583 82353 81819 81966
66426 81966 82070 81589 80726 80078 80011 80459 81049 81240 80599 79193 77670 76718 76452 76409 76124 75641 75429 75834 76633
66407 76633 77190 77082 76540 76176 76353 76952 77654 78210 78423 78155 77546 77066 77098 77559 78082 78457 78668 78604 78079 77190
66387 77190 76343 75774 75343 74990 75073 75926 77226 78220 78552 78529 78602 78964 79749 81130 82929 84441 85035 84795 84295
66368 84295 83859 83371 82672 81796 80830 79865 79127 78867 79042 79333 79488 79395 78839 77564 75744 74054 73094 72910
66350 72910 73197 73662 73938 73566 72536 71705 72134 73909 75983 77275 77631 77541 77252 76547 75295 73857 72836
66333 72836 72491 72537 72461 72046 71537 71293 71340 71356 71119 70823 70900 71638 73075 75077 77212 78651 78662 77439 76234
66314 76234 76338 77966 80262 82200 83252 83347 82720 81843 81146 80661 80195 79907 80258 81234 82113 82321 82094 81856
66296 81856 81373 80199 78738 78099 78848 80516 82347 83866 84604 84092 82555 81000 80079 79369 78295 77248
66280 77248 77019 77480 77718 77484 77626 78816 80489 81513 81509 81077 80904 81076 81226 81111 80945 81149 81760 82196 81858
66261 81858 80882 80011 79658 79495 79081 78540 78287 78341 78303 77896 77247 76652 76316 76292 76486 76752 77131 77869 79001 80101
66241 80101 80787 81319 82214 83302 83728 83092 82041 81388 81070 80498 79658 79231 79629 80453 81042 81182 81080 80931
66223 80931 80775 80605 80447 80402 80608 80999 81099 80345 78752 77013 75798 75163 74764 74387 74058 73898 74183 75274
66205 75274 77128 79018 80126 80409 80541 81027 81748 82426 83107 83977 84914 85497 85396 84635 83505 82331 81245
66188 81245 80183 79074 78082 77611 78043 79403 81174 82500 82813 82405 82182 82759 83942 85155 85972 86051 85072
66171 85072 83275 81754 81470 82039 82133 81167 79954 79594 80284 81494 82738 83811 84671 85443 86250 86814 86593
66154 86593 85590 84609 84324 84510 84587 84558 84841 85399 85592 84900 83455 81920 81130 81663 83354 85261 86437 86724
66136 86724 86581 86382 86220 86212 86520 87070 87635 88114 88390 88038 86666 84579 82704 81759 81784 82450 83423 84336 84839
66117 84839 84869 84701 84661 84989 85875 87308 88889 90158 91126 92165 93413 94688 95957 97326 98493 98801 98184
66100 98184 97561 97850 98896 99752 99755 98986 97887 96888 96342 96382 96758 97032 97000 96847 96905 97334 97965 98426 98589 98984
66080 98984 100432 102994 105496 106439 105411 103406 101790 101175 101190 101128 100715 100362 100624 101381 101732 100957 99457
66063 99457 98414 98500 99271 99936 100326 100790 101355 101468 100705 99445 98632 98888 100046 101456 102599 103370 103945 104470
66045 104470 104842 104769 104152 103382 103112 103611 104504 105216 105531 105639 105837 106328 107075 107669 107630 107118 107075 108208 109990
66026 109990 111201 111380 111196 111361 111844 112444 113519 115613 118583 121538 123592 124443 124368 123965 123836 124291 125266
66009 125266 126505 127734 128706 129363 129992 130984 132367 133893 135646 138117 141552 145604 149885 154408 159198
65994 159198 163873 168053 171789 175107 177537 178696 179064 179512 180211 180666 180718 180672 180350 178835 175610 171374
65978 171374 167293 163801 160483 156838 152814 148820 145592 143825 143553 143940 143894 142895 141145 139140 137353
65963 137353 136135 135608 135579 135726 135882 136058 136271 136436 136389 135998 135399 135132 135821 137538 139647 141494 143089 144943
65945 144943 147372 150197 153064 155770 158292 160762 163453 166586 170000 173165 175623 177371 178706 179792
65931 179792 180544 180997 181623 183049 185402 188067 190307 192080 194054 196741 199808 202420 204190 205652 207809
65916 207809 211301 215952 220970 225498 229051 231629 233588 235507 237959 241137 244571 247429 249226 250166
65902 250166 250698 250893 250438 249140 247212 245053 242880 240638 238153 235326 232226 229007 225719 222283 218716
65887 218716 215266 212059 208661 204314 198801 192912 187758 183672 180029 176138 172018 168150 164771 161720
65873 161720 158881 156404 154429 152913 151884 151570 151990 152574 152599 152006 151473 151532 151898 151887 151284 150560 150241 150373
65855 150373 150670 151000 151501 152295 153301 154332 155268 155997 156401 156580 156984 157989 159282 160067 160032 159776 159957 160349
65837 160349 160204 159378 158471 157884 157438 157162 157788 159895 162977 165988 168643 171659 175735 180860 186661 192908
65821 192908 199430 205826 211552 216220 219707 222137 223807 224961 225578 225488 224688 223336 221425 218732 215198
65806 215198 211118 206857 202636 198749 195625 193347 191271 188590 185356 182640 181503 181890 182649 182605 181537
65791 181537 180151 179290 179330 180305 182291 185355 189270 193670 198543 204266 211047 218646 226831 235733 245407
65776 245407 255303 264614 273102 281139 288817 295284 299124 299351 296088 290429 283555 275836 266858 256477
65762 256477 245645 235867 227966 221733 216709 212840 210328 209363 210234 213296 218557 225629 234359 245159
65748 245159 258324 273228 288620 303641 318262 332839 347569 362267 376298 388639 398251 404488
65736 404488 407110 406099 401762 394802 385916 375215 362385 347430 330983 313868 296693 279939
65724 279939 264020 249061 234936 221758 209995 199820 190631 181736 173354 166446 161481 157882 154880
65711 154880 152429 150799 149562 147682 144798 141840 139986 139285 138891 138444 138563 139746 141379 142334 142247 141738
65695 141738 141523 141795 142412 143193 143935 144533 145211 146345 147921 149476 150681 151691 152845 154392 156668 160162
65679 160162 165022 170792 176940 183424 190506 198315 207043 217253 229491 243610 259060 275764 294153
65666 294153 314170 334790 354816 373773 391653 408169 422759 435234 445895 454917 461862 466021
65654 466021 467161 465962 463834 462249 461927 462445 462720 462068 460892 460309 461125 463140 465311 466412 465474 461835
65638 461835 455027 444784 431105 414285 394972 374148 352863 331804 311116 290718 270705 251441
65626 251441 233412 217178 203275 191864 182490 174491 167656 162198 158027 154530 151292 148642 146965
65613 146965 145755 143967 141357 138886 137553 137260 137137 136654 135989 135515 135410 135723 136409 137175 137640 137755 137868
65596 137868 138279 138961 139771 140702 141804 143027 144245 145226 145609 145295 145013 146084 149217 153787 158622 163305
65580 163305 168324 174179 180973 188849 198298 209774 223314 238653 255483 273533 292658 312822
65568 312822 333591 353604 371118 385354 396864 406219 412768 415200 413010 406825 397468 385347 370796
65555 370796 354393 336699 318099 299168 280832 263823 248157 233461 219664 207124 196197
65544 196197 186963 179341 173137 167975 163511 159846 157425 156267 155578 154506 153138 152358 152709 153910 155537
65529 155537 157577 159875 161550 161629 160083 157699 155093 152494 150325 149095 148469 147268 144860 141962 139587
65514 139587 137767 135953 134181 133021 132538 132117 131373 130640 130461 131068 132393 134129 135664 136446 136516 136343 136108
65497 136108 135666 135220 135430 136603 138269 139867 141403 143104 144928 146918 149655 153719 158765 163689 167714
65482 167714 170926 173739 176239 178198 179386 179644 178897 177329 175471 173856 172498 170822 168175 164396 159916
65467 159916 155345 151102 147399 144398 142160 140539 139301 138325 137514 136602 135360 134065 133394 133624 134206 134387
65451 134387 134095 133902 134209 134819 135330 135689 136169 136935 137872 138837 139898 141154 142384 143145 143382 143762 145080
65434 145080 147394 150063 152647 155330 158255 160853 162267 162287 161476 160411 159181 157675 156026 154557 153414
65419 153414 152424 151322 150145 149390 149608 150693 151725 151843 151211 150793 151088 151528 151364 150834 150929 152057 153411
65402 153411 153907 153479 153128 153807 155583 157937 160527 163371 166435 169397 171921 173964 175624 176847 177446
65387 177446 177399 176922 176253 175492 174705 173998 173357 172542 171345 169918 168661 167742 166985 166333 166126 166649 167587 168341
65369 168341 168819 169529 170802 172368 173957 175919 178839 182740 187050 191301 195531 200098 205446 212028 220059
65354 220059 229232 238937 248760 258482 267616 275395 281425 285991 289452 291621 292017 290555 287671 283852
65340 283852 279312 274050 268041 261386 254430 247647 241233 234866 228068 220828 213651 206951 200616 194359
65326 194359 188423 183658 180695 179152 177897 176139 174058 172315 171187 170434 169766 169088 168359 167541 166702 165839
65310 165839 164627 162636 159883 156910 154273 152157 150454 148981 147640 146671 146678 147997 150066 151890 153132
65295 153132 154268 155675 157245 159044 161550 164759 167670 169250 169555 169402 169377 169603 170042 170395 170079 168923
65279 168923 167602 166811 166340 165654 164951 164769 164819 164250 163056 162209 162213 162424 162089 161216 160082 158671 157077 155725
65261 155725 154719 153551 152050 151006 151243 152552 154216 156155 158725 161626 163842 164775 164759 164284 163284
65246 163284 161459 158976 156506 154642 153429 152429 151210 149713 148116 146482 144855 143705 143805 145356
65232 145356 147495 149047 149572 149416 148988 148414 147739 147070 146522 146303 146673 147488 147970 147412 146103 145067 144890
65215 144890 145197 145284 144800 143748 142387 141333 141229 141955 142564 142376 141860 141966 142836 143661 143671 142832 141608 140556
65197 140556 140236 140957 142283 143125 142733 141550 140794 141263 142780 144708 146637 148430 149923 150952 151677 152543
65181 152543 153799 155124 155946 156158 156354 157278 159071 161215 163160 164718 165791 166034 165155 163458 161675 160302
65165 160302 159439 159326 160450 162846 165796 168686 171828 175864 180608 185102 188767 191831 194653 197398 200587
65150 200587 205185 211595 219068 226629 234258 242684 252389 263416 275942 290345 306673 324453 342963
65137 342963 361303 378358 393318 406355 418336 429829 440766 450982 460416 468565 474398 477254
65125 477254 477450 475649 472024 466477 459361 451400 442926 433604 422929 410715 397187 382898 368550
65112 368550 354552 340750 326856 313139 300350 288845 278095 267297 256289 245628 235886 227103
65100 227103 218863 210712 202519 194665 187964 183140 180172 178173 176128 173762 171615 170289 169845 169927 170176
65085 170176 170369 170401 170413 170810 171781 172828 173070 172078 170170 167903 165578 163374 161622 160714 160823 161823 163320
65068 163320 164714 165568 166053 166782 168022 169310 170083 170350 170430 170355 170009 169692 169968 170927 172118 173291 174756
65051 174756 176756 178872 180340 180784 180369 179388 177982 176282 174636 173545 173229 173213 172560 170790 168500 166706
65035 166706 165632 164519 162728 160509 158436 156506 154226 151399 148478 146202 145121 145224 145741 145535 144186
65020 144186 142691 142624 144490 147181 149151 149847 149892 150182 151086 152384 153713 154960 156309 157988 160048 162381
65004 162381 164831 167228 169431 171454 173461 175497 177359 178898 180348 182017 183700 184683 184471 183398 182430
64989 182430 182418 183512 185187 186870 188552 190677 193387 196231 198847 201566 204837 208268 210898 212396 213276
64974 213276 213760 213156 210842 207295 203573 200074 196438 192451 188449 184841 181734 179138 177079 175387 173721
64959 173721 172030 170694 170000 169625 168850 167282 165283 163723 163266 163807 164586 164865 164459 163618 162574 161420
64943 161420 160248 159148 158063 156901 155829 155255 155461 156412 157922 159814 161869 163784 165294 166208 166354
64928 166354 165639 164258 162618 160988 159321 157488 155544 153709 152233 151359 151218 151657 152364 153330 154943 157338
64912 157338 159820 161401 161953 162439 163811 166030 168416 170673 173036 175596 178072 180436 183208 186748 190662
64897 190662 194446 198480 203751 210584 218223 225792 233060 240054 246490 252153 257434 262911 268529 273657
64883 273657 277833 280958 282859 283258 282265 280361 277690 273820 268480 262129 255460 248687 241811 235375 230404
64868 230404 227425 225955 225088 224341 223706 223130 222349 221288 220247 219426 218429 216618 213940 210951 207814 203771
64852 203771 198158 191722 186201 182398 179330 175695 171732 168982 168364 169130 169817 169696 169020 168264 167612 167074
64836 167074 166652 166301 165943 165655 165685 166109 166616 166737 166294 165528 164807 164324 164119 164303 165177 167056 169963 173524
64818 173524 177257 180952 184658 188353 191874 195321 199296 204425 210710 217612 224711 231979 239433 246877
64804 246877 254060 260746 266442 270377 272023 271484 269185 265388 260225 254065 247561 241343 235782 230910
64790 230910 226406 221851 217232 213105 210058 208087 206693 205510 204670 204565 205365 206698 207722 207700 206666
64775 206666 205424 204793 205026 206046 207923 210836 214818 219855 226055 233395 241416 249458 257088 264111 270413
64760 270413 276116 281634 287222 292652 297709 302741 308242 314115 319851 325277 330550 335510 339647 342715
64746 342715 344772 345568 344471 341186 336075 329644 322170 313913 305240 296405 287560 278980 270902 263250
64732 263250 256032 249900 245620 242995 241115 239654 239036 239170 239080 238274 237537 237734 238670 239838 241488 244041
64716 244041 247067 249908 252938 257192 262876 269127 275144 280672 285357 288476 289558 288720 286235 282220
64702 282220 276834 270319 262809 254543 246283 238983 232961 227811 223220 219419 216714 214966 213707 212471
64688 212471 210950 209139 207428 206256 205591 205049 204567 204653 205898 208503 212304 216991 222178 227558 233096
64673 233096 238933 245095 251469 258025 264790 271599 278109 283986 288753 291541 291480 288537 283752 278413 273079
64658 273079 267440 260981 253766 246700 241057 237601 236144 235931 236235 236554 236610 236536 236854 237892 239432 241273
64642 241273 243878 247942 253400 259394 265211 270865 276898 284082 293192 304334 316454 328096 338777
64629 338777 348918 358299 365429 368945 369095 367228 364207 359921 354099 346971 339024 330558 321645 312417
64615 312417 303324 295091 288303 282930 278427 274318 270569 267451 265321 264577 265369 267226 269275 271021 272580
64600 272580 273993 274753 274380 273098 271556 270132 268917 268076 267695 267372 266534 265202 263986 263302 263029 263034 263562
64583 263562 264830 266677 268964 272067 276517 282269 288681 295235 301882 308580 314872 320139 324060 326582
64569 326582 327639 327128 325056 321383 315878 308493 299856 290997 282475 274110 265631 257215 249285 242184
64555 242184 236267 231867 228760 225989 222642 218653 214574 210856 207749 205672 205148 206365 209071 212742
64541 212742 216591 219709 221722 223153 224707 226281 227134 226822 225457 223235 220350 217368 214998 213392 212164
64526 212164 211136 210494 210172 209751 209144 208828 209130 209821 210559 211237 211710 211734 211432 211287 211499 211916 212821 214996
64508 214996 218534 222326 225373 228036 231305 235342 239638 244284 250036 257048 264415 271339 278087 285332
64494 285332 292863 299481 304147 306837 308065 307868 305713 301528 296357 291514 287328 283300 279368 276278
64480 276278 274537 273706 273090 272520 271990 271097 269474 267388 265257 262832 259529 255518 251851 249369 247936
64465 247936 246889 245967 245640 246641 249186 252615 255903 258534 260636 262202 262671 261677 259846 258300 257476
64450 257476 256896 256060 255120 254581 254717 255448 256639 258343 260771 264028 267922 272133 276584 281483 287071 293540
64434 293540 301143 310033 319953 330578 342289 356173 373075 393055 415981 442121 471903 505666
64422 505666 544095 588425 639770 698653 765512 841080 925532 1017505 1114398 1213138 1310320
64411 1310320 1402422 1486999 1563385 1631381 1689576 1735786 1768707 1787952 1792722 1781992 1756378
64400 1756378 1718576 1671122 1614385 1547332 1469680 1382809 1289217 1191900 1093983 998268 906897
64389 906897 821498 743383 673476 612268 559942 516204 479908 449328 423120 400838 382365
64378 382365 367189 354448 343427 333767 325387 318377 312771 308316 304585 301261 298068 294487 289988
64365 289988 284546 278523 272050 265048 257909 251563 246586 242750 239657 237344 235933 235238 235095 235681 237107
64350 237107 239125 241650 245131 249814 254970 259504 263141 266422 269593 272134 273420 273308 271992 269783
64336 269783 267235 264975 263098 261078 258616 256258 254786 254123 253337 251792 249913 248659 248633 249916 252384
64321 252384 255624 258686 260568 261205 261506 262140 262704 262503 261794 261627 262485 263616 263790 262355 259419 255418
64305 255418 250753 245745 240685 235799 231076 226205 221019 216099 212507 210573 209344 207772 206112 205450
64291 205450 206022 206922 207552 208488 210419 212951 215072 216432 217589 219146 221187 223559 226326 229814 234359
64276 234359 240032 246609 253759 261213 268626 275494 281464 286621 291103 294559 296460 296931 296693 296050 294540
64261 294540 291927 289049 287207 286960 287910 289416 291057 292487 293232 292757 290615 286532 280502 272854 264275
64246 264275 255699 247980 241455 235911 231089 227065 223933 221466 219510 218469 218845 220438 222574 224933
64232 224933 227452 229563 230508 230531 230855 232131 233757 235102 236495 238443 240670 242669 244521 246427 248000
64217 248000 248881 249562 250732 252094 252707 252291 251357 250205 248682 246941 245646 245195 245324 245580 245656 245207 243864
64200 243864 241689 239244 237127 235680 235080 235241 235663 235845 235973 236899 239373 243588 249434 256864 265945 276746
64184 276746 289069 302044 314228 324481 332535 338314 341080 339966 335216 328104 319577 309738 298824
64171 298824 287850 277772 268538 259508 250550 242249 235198 229435 224538 220080 216019 212733 210571 209367
64157 209367 208511 207505 206285 205092 204367 204687 206356 208924 211443 213385 215111 217355 220497 224407 228639
64142 228639 232579 235665 237728 239030 239894 240404 240483 240079 239240 238132 236923 235477 233310 230235 227029 224971
64126 224971 224625 225448 226705 228328 230691 233935 237908 242449 247429 252662 258092 263919 270278 276899 283353
64111 283353 289614 296199 303745 312471 321864 330765 337992 343154 346864 350008 352931 355487 357789 360576
64097 360576 364694 370322 376890 383730 390659 397745 404535 409783 412185 411412 408342 404341 400283 396017
64083 396017 390591 383145 373827 363796 354187 345298 336946 329226 322429 316423 310739 305245 300199 295613
64069 295613 291165 286909 283464 281223 279877 278994 278562 278620 278850 279004 279327 279977 280472 280412 280530 282151 285504
64052 285504 289296 292248 294481 297007 300339 304183 308269 312896 318521 325221 332723 340744 349041 357316
64038 357316 365373 373374 381701 390430 399067 406857 413191 417614 419661 419044 416067 411652 406901 402645
64024 402645 399263 396729 394808 393406 392676 392592 392504 391478 389171 385997 382281 377635 371519 364186 356632
64009 356632 349657 343333 337441 332017 327238 323010 319036 315326 312389 310737 310240 310132 309681 308797 307948
63994 307948 307580 307710 308019 308248 308499 309178 310686 313136 316391 320264 324593 329196 333963 338960 344199 349311
63978 349311 353857 358116 363189 369965 378221 387067 396073 405567 416002 427474 439819 452778 466082
63965 466082 479738 494243 510201 527760 546746 567235 589538 613702 639660 667977 699908
63954 699908 736518 778341 826143 881478 945968 1020407 1105151 1201281 1310940 1436386 1578785
63943 1578785 1737723 1911621 2098631 2297287 2506339 2724114 2948177 3175323 3401321
63934 3401321 3620671 3827288 4015871 4182322 4322845 4433483 4511163 4554732 4564327 4539997
63924 4539997 4481621 4390005 4267451 4117315 3943623 3751064 3544663 3329152 3108888 2888314
63914 2888314 2671945 2463648 2266129 2081125 1909771 1752771 1610596 1483595 1371596
63905 1371596 1273459 1187524 1112653 1048362 993763 947033 906368 871110 841310 816411 794934
63894 794934 775478 757493 740869 725151 709510 693334 676592 659615 642726 626233 610686
63883 610686 596944 585803 577506 571748 568164 566674 567286 569827 574177 580647 589700 601198 614382
63870 614382 628863 645277 664559 686735 710944 736465 763063 790244 817007 842919 868867
63859 868867 895917 923526 949518 971915 990256 1005079 1016724 1025030 1029824 1031242 1029569 1024864
63847 1024864 1016707 1004364 987511 966836 943621 918665 891863 862909 831952 799387 765512
63836 765512 730809 696295 663125 631899 602548 574742 548180 522742 498720 476693 456800
63825 456800 438270 420140 402424 386157 372204 360368 349773 339840 330662 322554 315456 308867
63813 308867 302430 296503 291870 288686 286015 282805 279154 276174 274569 273852 273078 271838 270212 268151 265458
63798 265458 262292 259159 256265 253295 250088 247225 245513 244926 244460 243139 240822 237897 234646 231325 228562
63783 228562 227014 226572 226372 225725 224651 223451 222238 221158 220577 220664 221080 221395 221574 221723 221697 221367 221014 220982
63765 220982 221110 220977 220629 220562 221020 221772 222587 223466 224254 224464 223702 222103 220214 218637 217809 217869 218597 219640
63747 219640 220818 222087 223321 224378 225387 226582 227894 229041 230106 231600 233760 236125 238087 239618
63733 239618 241187 243135 245418 247857 250366 252878 255269 257456 259550 261850 264615 267816 271145 274369
63719 274369 277618 281175 284995 288555 291199 292543 292554 291451 289594 287348 284979 282675 280601 278831 277321
63704 277321 276065 275226 274911 274874 274674 274150 273594 273468 274088 275488 277403 279479 281753 284759 288814 293230
63688 293230 296754 298894 300423 302349 304808 307159 308840 309721 309902 309598 309189 308980 308849 308352 307272 305967
63672 305967 305163 305484 307079 309531 312103 314213 315776 317141 318716 320587 322406 323621 323897 323276 321856
63657 321856 319429 315640 310511 304596 298608 293135 288671 285475 283207 281069 278658 276499 275470 275815
63643 275815 276991 278310 279453 280441 281457 282726 284366 286308 288573 291550 295718 301003 306657 311935
63629 311935 316798 321858 327700 334356 341418 348578 355990 364088 373143 383122 393961 405791 418854
63616 418854 433450 450047 469121 490632 513904 538417 564516 592877 623337 654772 686174
63605 686174 717245 747660 776211 801133 821007 835022 842729 844274 840854 834365 826305 817247 807416
63592 807416 797328 787519 777852 767420 755129 740245 722468 701765 678308 652695 626192 600516
63580 600516 577036 556100 537302 520378 505526 492842 481932 472434 464650 459240 456391 455608 456261
63567 456261 458024 460899 465158 471233 479315 488946 499238 509556 519851 530430 541678 553979 567607
63554 567607 582662 599325 618055 639307 663182 689752 719537 753210 790837 831791 875001
63543 875001 918272 957369 987065 1004122 1009017 1004559 993555 978244 960912 943680 927684 913217
63531 913217 900571 890020 881025 872116 861601 847986 830029 807227 780355 750922 720012 688149
63519 688149 656159 625362 596691 570189 545548 522663 501514 482037 464314 448457 434246
63508 434246 421366 409997 400537 392702 385635 379076 373607 369482 366075 362930 360426 358719 356873 353985
63494 353985 350633 348096 346497 344839 342782 341221 340799 340817 340185 338841 337694 337537 338477 340197 342307 344534
63478 344534 346875 349565 352695 355956 358886 361296 363217 364485 364673 363549 361484 359224 357227 355316
63464 355316 352943 349719 345690 341303 337210 333937 331538 329621 327919 326720 326535 327442 329126 331522 335014
63449 335014 339858 345750 352162 358866 365982 373775 382597 392773 404366 417229 431428 447340 465229
63436 465229 485170 507701 534054 564976 599193 633413 663940 688274 705584 716453 722527 726018
63424 726018 728963 732770 738419 746983 759749 777716 800993 828863 860456 895154 932062 969217
63412 969217 1003806 1033330 1056368 1072222 1080461 1081242 1075807 1066227 1054586 1042467 1030758 1019547
63400 1019547 1008201 995794 981396 963954 942355 916119 885891 852982 818630 783869 749701
63389 749701 716859 685577 656073 629016 605016 583841 564795 547756 533185 521150 511119
63378 511119 502924 497196 494464 494352 496080 499343 504298 511007 519304 528988 539849 551774 565071 580401
63364 580401 598059 617629 638713 661679 687197 715260 745252 776903 810567 846400 883679
63353 883679 921059 957048 989940 1017713 1038577 1051799 1057902 1058098 1053604 1045381 1034256 1021170
63341 1021170 1007192 993230 979631 966058 951667 935324 915925 892902 866603 837940 807629
63330 807629 776132 744405 714101 686463 661365 638092 616947 599371 586506 578346 574382 574028
63318 574028 575767 576621 573435 564674 550636 532475 511749 490462 470371 452047 435207 419932
63306 419932 406826 396008 386909 379234 373304 369078 365686 362427 359577 357615 356185 354387 351692 348102
63292 348102 343796 339150 334768 331020 327810 325045 322807 320747 318008 314358 310798 308333 306680 305037
63278 305037 303586 303211 303987 305017 305668 306033 306218 306152 306129 306552 307036 306741 305844 305696 307065 309095 310519 311250
63260 311250 312158 313820 316036 318293 320259 322065 324296 327363 330817 333778 336186 338948 342664 346991
63246 346991 351674 357348 364553 372531 379933 386463 393088 400775 409768 420041 431731 444945 459592
63233 459592 475619 493023 511469 530146 548301 565876 583497 601743 620389 638494 655361
63222 655361 671259 686977 702923 719119 735873 753680 772331 790825 808488 825459 841659
63211 841659 855909 866682 873276 875629 873426 866148 853899 837536 818052 796255 772967 749020
63199 749020 725083 701759 679671 659153 640182 623011 608484 597105 588167 580523 574100 569935
63187 569935 568730 570076 573137 577424 582755 589047 596431 605087 614770 624926 635416 646725 659240
63174 659240 672590 685858 698180 709149 719065 728813 739061 749388 758531 765468 769915 771821 771034
63161 771034 767596 761675 752876 740203 723295 703364 682423 661752 641444 621214 601171 581884
63149 581884 564035 548052 533872 521050 509176 498119 487899 478623 470647 464449 460026 456643
63137 456643 453439 450225 447488 445792 445318 445718 446172 445849 444730 443839 444307 446281 449083 452351 456502 461930
63121 461930 468172 474233 479590 484538 489538 494515 498992 502749 506058 509202 512006 514132 515760 517665
63107 517665 520511 524201 527994 531198 533724 536058 538674 541442 543730 545258 546639 548748 551638 554508
63093 554508 556744 558525 560285 562059 563651 565051 566301 567206 567514 567175 566148 564249 561601 559019 557483
63078 557483 557319 558242 560093 562980 566676 570421 573614 576453 579646 583667 588512 594104 600692 608759 618506
63063 618506 629539 641243 653531 667006 682323 699673 719118 741105 766155 794176 824581
63052 824581 857111 892029 929414 968728 1009334 1051081 1094090 1138203 1182948 1227849 1272480
63041 1272480 1316369 1359195 1401117 1442716 1484542 1526743 1569042 1610938 1651998 1692018 1730787
63030 1730787 1767587 1800973 1829165 1850562 1863891 1868111 1862506 1846873 1821453 1786706 1743353 1692661
63018 1692661 1636554 1577313 1517028 1457212 1398793 1342593 1289807 1241908 1199900 1163788 1132935
63007 1132935 1106865 1085651 1069626 1058983 1053607 1053072 1056781 1064220 1075043 1088756 1104500 1121452
62995 1121452 1139362 1158291 1177790 1196833 1214833 1232341 1250360 1269162 1288119 1306459 1323674
62984 1323674 1339199 1352238 1362056 1368121 1369786 1366218 1356920 1342150 1322559 1298539 1270204 1237887
62972 1237887 1202403 1164803 1126046 1086968 1048378 1011132 976035 943525 913393 885094 858572
62961 858572 834597 813940 796237 780051 764085 748053 732348 717346 703230 690079 677666
62950 677666 665314 652358 638789 625224 612303 600281 589175 578965 569558 560666 551895 543037
62938 543037 534356 526528 520066 514711 509592 504168 498829 494401 491317 489519 488827 488962 489359 489463 489199
62923 489199 488751 487996 486683 485134 484104 483726 483213 481926 480193 478683 477469 476271 475216 474664 474456 473967
62907 473967 472876 471350 469502 467276 465015 463565 463503 464558 466017 467464 468928 470576 472574 475069 478052
62892 478052 481176 483880 485754 486776 487217 487332 487172 486748 486312 486194 486242 485734 484167 481958 480017 478741
62876 478741 477762 476585 475006 472983 470595 468240 466426 465185 464024 462590 460984 459302 457347 455043
62862 455043 452691 450500 448319 446260 445148 445682 447358 448813 449282 449226 449482 450276 451277 452228 453172 454178
62846 454178 455160 456010 456749 457386 457628 456948 455191 453015 451404 450655 450136 449132 447589 445922 444461 443397
62830 443397 442916 442980 443125 442869 442261 441800 441977 443084 445153 447768 450216 452190 454125 456475 458980 461162
62814 461162 463267 466017 469583 473467 477366 481391 485371 488750 491473 494339 498088 502653 507701 513377
62800 513377 520042 527566 535340 542829 549880 556760 564194 573125 584060 596791 610958 626712 644698
62787 644698 665676 690291 718852 751103 786573 825434 868616 916813 969816 1027189 1088994
62776 1088994 1155150 1224502 1295343 1366697 1438220 1508848 1576375 1638520 1693592 1739805 1774818
62765 1774818 1796760 1805428 1801858 1786936 1760941 1724328 1678328 1624642 1564972 1501022 1434574 1367167
62753 1367167 1299731 1232755 1166833 1102910 1042002 984806 931604 882382 836941 795064 756784
62742 756784 722437 692226 665661 641644 619226 598244 579172 562467 548094 535543 524213
62731 524213 513885 504947 498013 493243 490121 487902 486050 484216 482104 479703 477486 476128 476052 477404
62717 477404 480247 484475 489662 495367 501597 508661 516583 525021 533895 543774 555429 569200 585068
62704 585068 603207 624192 648554 676270 706772 739445 774063 810729 849503 890205 932576
62693 932576 976457 1021671 1067798 1114053 1159154 1201276 1238437 1269246 1293136 1309631 1317677 1316157
62681 1316157 1305035 1285511 1258952 1226092 1187441 1144080 1097671 1049826 1001781 954535 908937
62670 908937 865528 824449 785624 749050 714931 683594 655238 629776 606915 586387 567983
62659 567983 551429 536462 523087 511547 501833 493401 485562 478052 470981 464334 457850 451436 445368
62646 445368 439920 434993 430286 425639 421071 416644 412611 409515 407806 407335 407538 408145 409332 411032 412475
62631 412475 412759 411713 409953 408265 407206 406995 407315 407277 406184 404492 403599 404427 406535 408846 410916 413128
62615 413128 415862 418985 422233 425752 429921 434741 439676 444332 449189 455300 463146 472114 481370 490929
62601 490929 501406 513066 525840 540193 557106 576944 599160 623533 650887 681855 715490
62590 715490 749960 784306 818616 852608 884967 914218 939424 959727 973937 981126 981318 975209
62578 975209 963406 946283 924388 898627 870024 839455 807637 775280 743236 712367 683150
62567 683150 655449 628869 603351 579332 557383 537867 520859 506177 493510 482686 473702 466307
62555 466307 459716 453078 446181 439411 433135 427506 422801 419424 417397 416196 415253 414376 413582 412844 412163
62540 412163 411655 411364 411146 410851 410460 409978 409357 408617 407923 407562 407951 409555 412504 416290 420135 423717 427411
62523 427411 431919 437869 445606 454979 465462 476855 489763 504946 522386 541585 562603 586014
62511 586014 611721 638631 665832 693347 721353 749297 776293 801815 825470 846563 864419
62500 864419 878729 889068 894610 894994 891176 884820 877193 869270 862428 857968 856023 855908 857741 862902
62486 862902 872635 886933 905244 927657 954757 986579 1022247 1060581 1100567 1141089 1180398 1216058
62474 1216058 1245576 1267253 1280608 1286141 1284703 1276803 1262067 1239290 1207506 1167349 1121194 1071689
62462 1071689 1020401 968058 915561 864213 815243 769742 728786 692930 661572 633602 608781
62451 608781 587915 571508 558874 548772 540363 533243 527158 522158 518672 516995 516922 518132 520657 524625
62437 524625 529869 536082 543029 550288 557094 562851 567494 570862 572027 569922 564552 557061 548542 539281
62423 539281 529226 518595 507759 496977 486546 476961 468600 461375 454932 449028 443532 438210 432796
62410 432796 427294 422053 417503 413850 410977 408565 406376 404435 402821 401290 399385 397104 395203 394532
62396 394532 395099 396108 396898 397588 398750 400698 403257 406022 408694 411257 413991 417221 420937 424749 428362
62381 428362 432104 436823 443219 451264 460208 469144 477661 486078 495092 505163 516215 527880 539855
62368 539855 552068 564716 578296 593514 611061 631563 655683 683985 716526 752797 792323
62357 792323 835149 881574 931615 984975 1041181 1099217 1157082 1212210 1262469 1306465 1343016
62346 1343016 1370930 1389506 1398892 1399738 1392788 1378872 1358855 1333334 1302725 1267812 1229774 1189406
62334 1189406 1146887 1102877 1059452 1019155 983061 950307 919632 890950 865271 843418 825020
62323 825020 808580 792420 775733 758856 742432 726345 709703 691871 673177 654441 636006
62312 636006 617632 599317 581807 566021 552090 539344 527308 516404 507380 500296 494393 488932
62300 488932 483784 479201 475351 472247 469884 468320 467708 468210 469637 471329 472804 474492 477259 481131 485150
62285 485150 488744 492530 497318 502913 508545 513982 519447 524776 529543 533991 539067 545392 552775 560826
62271 560826 569530 579130 589910 602250 616497 632750 651128 672195 696622 724504 755552 789951
62259 789951 828324 870793 916894 966711 1021247 1080986 1144590 1209543 1273624 1335131 1392081
62248 1392081 1442156 1483576 1515559 1537868 1550362 1553071 1546400 1531132 1508298 1478820 1442936 1400123
62236 1400123 1350037 1293596 1232922 1170321 1107701 1046796 989224 935946 887076 842566 802805
62225 802805 768114 737882 710767 685939 663750 644974 629583 616524 604606 593320 582779
62214 582779 573148 564311 556013 548208 541266 535767 531896 528942 525727 521797 518010 515645 514991 515239 515697
62199 515697 516634 518704 521961 525877 530126 534916 540523 546853 553610 560725 568417 576882 586053 595710
62185 595710 605719 616060 626638 637236 647777 658414 669161 679522 688866 697168 705046 712956
62173 712956 720792 728625 737485 748893 763698 781847 803308 828662 858529 892776 930615 971212
62161 971212 1013757 1057108 1099746 1140021 1176065 1205716 1227248 1240520 1246865 1247509 1242479 1231433
62149 1231433 1214987 1194408 1170243 1142188 1110411 1076210 1041059 1005703 970704 937288 907018
62138 907018 880821 858801 840725 826191 814467 804781 796825 790638 785999 782235 778662 775023 771561
62125 771561 768823 767221 766599 766459 766794 768348 771703 776510 782020 787871 793663 798147 799794 798194 794178
62110 794178 788654 782196 775761 770597 766902 763315 758301 751475 743096 732999 720811 706943 692623
62097 692623 679092 667225 657730 651098 647395 646408 647867 651170 655106 658449 660897 663121 665913 669610
62083 669610 674307 680246 687727 696777 707047 718141 730109 743554 759067 776614 795687 815969
62071 815969 837414 859666 882044 904431 927721 952953 980345 1009505 1040199 1072321 1105420
62060 1105420 1138795 1171762 1203149 1230725 1252004 1265907 1273158 1275021 1272188 1265055 1254280 1240462
62048 1240462 1223552 1203045 1178585 1149990 1116935 1079319 1038183 995800 954442 915109 877667
62037 877667 841987 808410 777084 747556 719523 693616 670720 650638 632135 614412 597883
62026 597883 583280 570702 559912 550846 543138 535681 527528 519089 511591 505321 499122 491816 483571
62013 483571 475578 468804 463378 458903 455028 451750 449302 447854 447428 448154 450333 454006 458728 464110 470342
61998 470342 477726 485844 493704 500629 506460 510970 513809 515202 515992 516584 516340 514404 510779 506164 501094
61983 501094 495631 489630 482838 474991 466301 457721 450286 444205 438962 434192 429959 426202 422462 418432
61969 418432 414418 410994 408425 406666 405627 405102 404588 403578 402098 400660 399663 399060 398707 398734 399369 400582
61953 400582 402168 404073 406396 409144 412210 415636 419659 424489 430210 436872 444455 452758 461704 471822
61939 471822 484051 498799 515401 532747 550209 567716 585145 602039 617843 632172 644956
61928 644956 656606 667850 678971 689165 697019 701733 703622 703452 701666 698437 694131 689361 684646
61915 684646 680257 676337 673081 670781 669914 671168 675321 682922 693976 707900 723765 740546 757159
61902 757159 772430 785360 795499 802845 807240 808146 805192 798794 789909 779267 767083 753445 738701
61889 738701 723395 708038 692993 678413 664265 650492 637141 624325 612191 600983 590945
61878 590945 581874 573003 563625 553752 543899 534342 524978 515909 507750 501177 496403 493176 491150 490234
61864 490234 490752 493180 497550 503207 509446 516307 524353 533757 544154 555537 568756 584758 603622
61851 603622 624716 647611 672496 699701 729012 759458 789656 818458 845400 870453 893321
61840 893321 913159 928997 940247 946706 948356 945468 938716 928969 917013 903714 890386 878703
61828 878703 870108 865370 864689 868034 875221 885679 898324 911798 924843 936382 945324 950622 951665
61815 951665 948377 940674 928083 910332 888281 863827 838691 813563 788558 764062 740754 718881
61803 718881 697925 677189 656708 637456 620539 606097 593198 580969 569652 560221 553038 547335
61791 547335 542107 537044 532429 528504 525269 522585 520133 517487 514596 512056 510492 509739 508999 507797 506374
61776 506374 505052 503667 501918 499989 498424 497394 496474 495287 494071 493387 493386 493727 494172 494910 496118 497515
61760 497515 498666 499568 500630 502190 504334 507101 510423 513808 516497 518147 519105 519845 520354 520262 519366 517756
61744 517756 515563 512863 509831 506821 504178 502020 500170 498291 496168 493920 491952 490708 490500 491465 493476
61729 493476 496031 498411 500085 500965 501242 501076 500501 499667 499122 499725 502001 505508 509037 511588 513045 513832
61713 513832 514341 514957 516167 518066 519895 520697 520347 519367 517830 515222 511483 507343 503247 498744 493499
61698 493499 488302 484271 481353 478387 474559 470197 466127 462804 460172 457892 455495 452620 449288 445861
61684 445861 442644 439657 436757 433869 431093 428704 426948 425742 424654 423264 421455 419294 416901 414562
61670 414562 412655 411178 409612 407580 405450 403925 403249 403193 403655 404704 406086 407225 407892 408418 409115 409837
61654 409837 410309 410558 410832 411393 412580 414760 417877 421234 424026 426049 427702 429477 431665 434429 437751
61639 437751 441232 444218 446262 447396 447841 447642 446715 445188 443410 441523 439179 435910 431798 427615 424147
61624 424147 421401 418646 415272 411520 408258 406018 404394 402509 400014 397452 395569 394539 394059 393973 394311
61609 394311 394621 393763 390764 385786 379983 374467 369645 365415 361618 358141 354840 351574 348260 344764 340859
61594 340859 336472 331958 327965 324983 323046 321844 320967 319991 318558 316612 314530 312825 311654 310751 309873
61579 309873 309104 308657 308574 308733 308996 309138 308802 307763 306214 304632 303373 302501 301908 301500 301335 301673 302752
61562 302752 304413 306133 307525 308607 309479 310127 310830 312348 315172 318747 321846 323616 323958 323237 322191
61547 322191 321812 322557 323705 324129 323659 323043 322757 322697 323018 324227 326195 328054 329501 331259 333743 336184
61531 336184 337771 338825 340014 341127 341581 341584 341706 341663 340678 338937 337608 337310 337454 337329 336986 336701 336221 335076
61513 335076 333324 331604 330529 330145 329939 329374 328491 327822 327633 327597 327486 327674 328526 329641 330336 330544 330546 330123
61495 330123 328851 327124 325947 325604 325417 325070 325272 326678 328771 330446 331285 331751 332425 333458 334624 335629
61479 335629 336453 337489 339177 341429 343688 345566 347039 348001 348143 347484 346550 345725 344824 343591 342273 341349
61463 341349 340988 341071 341512 342189 342805 343166 343416 343726 343879 343556 342901 342475 342592 342966 343128 343052 343208 344027 345476
61444 345476 347307 349624 352768 356460 359497 360886 361093 361548 362953 364702 366115 367510 369627 372505 375480
61429 375480 378061 380318 382428 384183 385054 384706 383526 382587 382791 384054 385671 387418 389780 392953 396227
61414 396227 398698 400096 400516 399876 398264 396425 395238 394742 394240 393171 391414 388905 385686 382363 379869
61399 379869 378544 377912 377493 377319 377414 377309 376591 375622 375196 375524 375991 375996 375717 375841 376695 377837 378618 379050 379894
61380 379894 381706 383948 385396 385516 385054 385048 385607 386112 386425 387249 389138 391696 394115 396109 397879 399394
61364 399394 400333 400669 400832 401229 402054 403612 406261 409842 413666 417448 421779 427275 433617 439965 446083
61349 446083 452484 459600 467374 475558 483833 491619 498362 504202 509882 515765 521303 525746 529039 531682
61335 531682 533939 535524 536104 535854 535355 534904 534030 531902 528294 523955 519863 516411 513482 511014 509078
61320 509078 507640 506707 506566 507432 509024 510952 513379 516691 520671 524754 529113 534664 541731 549461 556964
61305 556964 564497 573085 583384 595270 608079 620798 632343 642052 649737 655153 657837 657735 655554
61292 655554 652107 647683 642313 636205 629486 621986 613755 605458 597750 590574 583558 576787 570647 565170
61278 565170 560186 555931 552951 551433 551201 552293 554909 558691 562568 565616 567862 570128 573239 577371
61264 577371 581924 586017 589271 592170 595609 600273 606473 614166 622786 631329 639019 645779 651748 656652
61250 656652 660130 662418 664067 665111 665080 663910 662140 660106 657479 653944 649817 645613 641371 636820 632061
61235 632061 627656 624069 621269 618905 616686 614583 612841 611893 612143 613697 616317 619734 624004 629369 635631
61220 635631 641901 647351 652167 657368 663630 670625 677655 684457 691099 697491 703458 709055 714332 718914
61206 718914 722255 724355 725902 727695 730150 733287 736928 740972 745706 751828 759952 770228 782577 797050
61192 797050 813570 831406 849319 866250 881590 894914 905854 914363 920851 925886 929848 932737
61180 932737 934261 934222 932939 930995 928394 924348 918352 911126 903898 896904 889234 880150 869867 858930
61166 858930 847469 835417 822962 810324 797311 783440 768445 752563 736455 720972 706791
61155 706791 694115 682836 672938 664522 657462 651458 646578 643406 642335 642922 644117 644932 644669 642729
61141 642729 638706 632776 625746 618499 611432 604566 598135 592867 589487 588082 588231 589743 592905 597786
61127 597786 603715 609899 616461 624421 634612 646998 661125 676858 694398 713758 734566 756505
61115 756505 779753 804811 831727 859625 887242 914012 940388 967001 993760 1019913 1044648
61104 1044648 1067305 1087289 1104261 1118413 1130104 1139168 1144866 1146589 1144385 1138688 1129749 1117477
61092 1117477 1101816 1083196 1062520 1040541 1017327 992647 966979 941742 918220 896521 875910
61081 875910 855937 836859 819135 802940 788188 774770 762787 752590 744408 737776 731736 725885
61069 725885 720899 717670 716320 716483 718103 721251 725470 730102 735226 741585 749562 758775 768658 778862
61055 778862 789183 799750 811312 824654 839626 855372 871632 889206 908993 931168 955513
61044 955513 981953 1010372 1040381 1071630 1104192 1138510 1175117 1214319 1255791 1298620 1342244
61033 1342244 1387268 1434793 1485073 1537397 1591213 1646537 1703237 1760755 1818850 1877953 1938630
61022 1938630 2001402 2067356 2138275 2215903 2301665 2397199 2504329 2624222 2757324 2904660
61012 2904660 3068967 3254856 3469134 3721500 4024294 4391313 4837408 5378812 6032384
61003 6032384 6814468 7742323 8837688 10128626 11648248 13429168 15483961 17762150
60995 17762150 20103213 22238405 23877013 24838784 25138682 24964227 24578019 24225221 24082839
60986 24082839 24224847 24581468 24927599 24952002 24394828 23166774 21369589 19220304 16950043
60977 16950043 14740689 12708933 10913922 9370789 8066759 6976956 6073821 5329498
60969 5329498 4716895 4212128 3795582 3450344 3161154 2915525 2704512 2521421 2360454
60960 2360454 2216981 2087979 1971329 1865283 1769059 1683047 1607538 1541717 1484290 1434283
60950 1434283 1390405 1350268 1311299 1272335 1233692 1195932 1159305 1124207 1091298 1060928 1032884
60939 1032884 1006767 982118 958113 933719 908573 883457 859614 837604 816968 796908 777082
60928 777082 757738 739306 722049 706090 691566 678679 667650 658599 651267 644806 638150 630866
60916 630866 623478 616758 610988 606190 602762 601212 601225 601557 601144 600082 599379 599995 602155 605295 608443 610881
60900 610881 612555 613814 614827 615500 615861 616150 616401 616243 615238 613234 610344 606795 602772 598208 592768
60885 592768 586366 579548 572925 566255 558716 550184 541668 534159 527590 521294 514984 508789 502744 496881
60871 496881 491626 487443 484084 480752 477139 473849 471592 470339 469562 469118 469496 471146 473801 476660 479153
60856 479153 481315 483408 485422 487168 488642 489994 491265 492491 494003 496126 498459 499952 499974 499005 497972
60841 497972 497249 496633 495983 495344 494511 492980 490471 487197 483548 479798 476166 472908 470145 467755 465552
60826 465552 463537 461869 460626 459640 458564 457163 455547 454051 452784 451411 449552 447304 445098 442987
60812 442987 440394 436784 432443 428278 424817 421685 418141 413952 409526 405348 401588 398270 395460 393061
60798 393061 390657 387889 384989 382648 381280 380518 379547 377872 375727 373801 372586 371986 371586 371251 371253 371745
60782 371745 372353 372542 372237 371757 371225 370450 369424 368566 368293 368587 369183 370025 371346 373427 376441 380403 385125
60765 385125 390214 395210 399685 403288 405907 407830 409531 411158 412413 413040 413184 413100 412751 412016 411128 410466
60749 410466 409911 408838 407019 405290 404904 406198 408171 409545 410015 410113 409885 408300 404392 398753 393209 388910
60733 388910 385209 380764 375295 369788 365217 361727 359052 357062 355509 353720 351111 347941 345106 343168
60719 343168 341930 341026 340502 340571 341030 341320 341084 340490 340018 340112 340938 342265 343638 344858 346196 347872 349517
60702 349517 350583 351291 352577 354923 357763 360340 362671 365171 367696 369591 370587 371136 371901 373328 375649
60687 375649 378786 382125 384807 386441 387337 388066 389053 390576 392723 395181 397312 398571 398757 397977 396670
60672 396670 395539 395048 394979 394845 394643 394631 394377 392780 389411 385250 381683 379173 377315 375738 374335 372913
60656 372913 371272 369647 368625 368603 369577 371358 373666 376126 378532 381042 383794 386469 388616 390257 391651
60641 391651 392465 391792 389202 385290 380937 376481 371976 367888 364947 363384 362765 362606 362779 363264 363908 364680
60625 364680 365891 367761 369838 371192 371343 370821 370705 371664 373489 375359 376465 376485 375721 374813 374282 374335 375054
60608 375054 376500 378490 380412 381563 381668 380995 380105 379593 379804 380460 380743 380157 379226 378926 379516 380397 381165
60591 381165 382117 383532 385001 385923 386261 386347 386248 385766 384928 384065 383532 383667 384838 387101 389909 392595 395117
60574 395117 398037 401807 406499 412235 419353 427935 437548 447758 458710 470891 484386 498614 512722
60561 512722 525942 537463 546257 551423 552781 550939 546693 540586 533133 525164 517559 510808 505191 501260
60547 501260 499620 500276 502704 506646 512217 519113 526518 534303 543659 555905 571041 588143 606710
60534 606710 626755 647757 668411 687465 704055 717179 725615 728738 726882 720842 711617 700748
60522 700748 690054 680475 671621 662817 654105 645902 638371 631760 626879 624397 623873 624191 624912 626534 629446
60507 629446 633315 637774 643287 650968 661765 676019 693704 714979 740520 771197 807293 848202
60495 848202 893126 941847 994294 1049363 1104624 1157395 1205772 1248461 1284006 1310503 1325889
60484 1325889 1328324 1316661 1291069 1253250 1205802 1151258 1091825 1029842 968018 908920 854178
60473 854178 804241 758821 717588 680498 647633 618870 593822 572027 553063 536488 521935
60462 521935 509333 498830 490261 482839 475670 468483 461639 455441 449807 444679 440331 436908 433917 430609
60448 430609 426922 423624 421315 419590 417537 414923 412500 411043 410504 410339 410322 410557 410780 410247 408536 406178
60432 406178 404159 402997 402512 402320 402223 402167 402088 401833 401096 399555 397264 394834 392936 391671 390701 389983 390003 391190
60414 391190 393367 395922 398247 399966 401013 401672 402336 403096 403729 404139 404537 405091 405746 406561 407873 409808
60398 409808 411948 413793 415339 416830 418194 419169 419893 420921 422595 424741 426954 428936 430515 431590 432155
60383 432155 432293 432233 432493 433666 435796 438163 440073 441614 443260 444921 446021 446405 446547 446836 447297 448148
60367 448148 449881 452405 454659 455702 455899 456512 458267 460674 462754 464105 465258 467149 470246 474156 478145
60352 478145 481956 485870 490000 493964 497389 500323 502905 505029 506591 507736 508473 508381 507144 505174 503249
60337 503249 501593 499715 497112 493772 490051 486357 483044 480293 478063 476257 474935 474150 473658 473015 471982
60322 471982 470662 469278 468003 466963 466232 465869 466101 467382 469970 473528 477426 481568 486748 494101 504280
60307 504280 517066 531616 547045 563007 579793 597812 616849 635813 653119 667333 677504
60296 677504 683030 683285 677604 665830 648912 628758 607481 586854 568278 552629 539885 529272
60284 529272 520172 512641 506856 502463 498941 496270 494650 493675 492378 490177 487287 484163 480979 477764
60270 477764 474622 471592 468637 465974 464067 463076 462499 461679 460541 459602 459303 459477 459517 459002 458123 457431 457204
60253 457204 457243 457360 457781 458790 460174 461443 462447 463368 464175 464640 464977 465833 467348 468782 469535 470106 471437
60236 471437 473454 474896 474684 473021 471036 469713 469361 469822 470840 472301 474296 476962 480175 483412 486041
60221 486041 487790 488968 490294 492442 495533 499008 502148 504909 508094 512541 518239 524501 530894 537576
60207 537576 544654 551674 558080 563891 569550 575239 580700 585681 590220 594503 598717 603006 607269 611024
60193 611024 613729 615270 615841 615525 614427 613110 612253 611715 610469 607697 603503 598414 592758 586847 581126
60178 581126 575636 569817 563394 557036 551558 546913 542630 538905 536402 535119 534305 533494 532867 532507 532111
60163 532111 531635 531505 531795 531849 531209 530432 530444 531386 532547 533313 533753 534331 535335 536626 537801 538619 539259 540099
60145 540099 541321 543059 545848 550373 556441 562664 567677 571596 575889 581817 589355 597597 605830 613979
60131 613979 622194 630345 637979 644606 649827 653318 654976 655244 655080 655335 656160 657135 657924 658631 659688 661531
60115 661531 664278 667468 670256 672185 673681 675427 677354 678658 678785 677913 676320 673863 670407 666390 662464
60100 662464 658745 654793 650347 645742 641566 638069 635025 632089 629245 626909 625611 625571 626587 628192 629839
60085 629839 631092 631844 632344 632883 633520 634235 635097 635993 636307 635290 632779 629226 625021 620149 614569 608506
60069 608506 602210 595746 589217 582836 576560 569937 562659 555097 547968 541584 535701 530061 524818 520316
60055 520316 516643 513562 510953 509133 508500 508901 509675 510483 511717 513715 515995 517868 519649 522434 526595
60040 526595 531256 535580 539862 544834 550423 555843 560601 564694 567903 569626 569609 568399 566816 565199 563327
60025 563327 560895 557818 554146 549876 544923 539211 532663 525174 516707 507553 498320 489543 481410 473975
60011 473975 467476 462126 457709 453688 449717 445811 442136 438980 436866 436197 436644 437287 437472 437287 437132 437245
59995 437245 437731 438599 439595 440374 441044 442154 443967 446186 448602 451500 455017 458571 461458 463692 465752
59980 465752 467740 469324 470339 470842 470652 469425 467296 465003 463178 461813 460537 459118 457505 455650 453571
59965 453571 451622 450417 450362 451283 452673 454364 456739 460063 463796 466946 469060 470473 471564 472228 472279 471933
59949 471933 471615 471581 471941 472682 473376 473289 472252 471189 471273 472585 473947 473992 472184 468993 465481 462695 461058
59932 461058 460238 459755 459655 460493 462728 466328 470838 475660 480380 484996 489801 494973 500402 505898 511226
59917 511226 515873 519183 521003 521884 522388 522496 522003 521165 520559 520560 521334 523066 525754 528924 531958 534623 537003
59900 537003 539119 540924 542486 543825 544808 545495 546376 547879 549970 552555 555945 560398 565555 570899 576479
59885 576479 582495 588510 593865 598716 603854 609495 615134 620600 626295 632084 636862 639717 640890 641096
59871 641096 640458 638623 635464 631184 626143 621028 616737 613491 610360 606308 601558 597319 594274 591985
59857 591985 589897 588316 588047 589432 592194 596105 601445 608598 617416 627243 637579 648408 659602 670150
59843 670150 678354 682943 683869 682095 678933 675719 673651 673381 674545 675847 675752 673271 668275 661277 652981
59828 652981 644022 635044 626764 619748 614056 609297 605035 601057 597251 593443 589493 585411 581238 576878
59814 576878 572199 567320 562636 558469 554698 550888 546831 542842 539418 536695 534434 532471 530940 530009
59800 530009 529635 529577 529451 528807 527479 525944 524970 524735 524617 524007 522993 522037 521372 521052 521141 521387 521082 519786
59782 519786 518038 516794 516321 516105 515693 515004 513920 512296 510479 509233 508879 508954 508893 508620 508273 507822 507307
59765 507307 507103 507586 508740 510375 512569 515567 519360 523602 527910 532046 535916 539642 543667 548538 554374
59750 554374 560664 566781 572688 578889 585606 592366 598675 604754 611089 617396 622726 626667 629738 632420
59736 632420 634513 635811 636624 637056 636449 634338 631454 628942 626944 624806 622335 619845 617168 613777 609940
59721 609940 606624 603995 601010 597032 592984 590273 589134 588636 588000 587304 587045 587346 587590 586822 584731 582172
59705 582172 580388 579804 579950 580402 581062 581636 581736 581736 582702 585058 587995 590593 592797 594857 596561 597722 598863
59688 598863 600628 602839 604824 606413 607926 609357 610220 610217 609594 608816 608163 607545 606437 604166 600575 596253
59672 596253 591801 587139 581865 576088 570500 565771 562180 559669 557868 556189 554306 552494 551311 551046
59658 551046 551631 552803 554109 555087 555820 557102 559643 563344 567692 572518 577771 582789 586546 588691 589724
59643 589724 589998 589105 586568 582719 578481 574443 570499 566325 561931 557685 554008 551236 549642 549264 549572
59628 549572 549580 548629 546914 544888 542369 538867 534790 531538 529931 529127 527641 525004 521787 518381 514577
59613 514577 510330 506125 502392 499118 496346 494630 494594 496240 498985 502216 505538 508589 510952 512476 513559
59598 513559 514889 516708 518430 519260 519247 519473 520900 523172 524867 524972 523883 522798 522385 522305 521980 521387 520820
59581 520820 520193 519131 517742 516689 516179 515399 513459 510559 507682 505443 503880 503099 503239 503749 503621 502636
59565 502636 501677 501454 501584 501311 500578 499876 499477 499284 499033 498310 496824 495078 494279 495031 496605 498066 499607
59548 499607 501997 505051 507706 509629 511905 515835 521671 528853 537005 546359 557519 571254 588260
59535 588260 608467 630067 649351 662194 666465 663198 655343 645557 635451 626409 619894 616459 615288
59522 615288 615336 616444 618839 622124 625477 628383 630467 631055 629786 627368 624765 621686 616902 610134 602609
59507 602609 595377 587930 579155 569125 559254 550946 544630 539994 536518 533633 530713 527354 523722 520520
59493 520520 518456 517697 517853 518439 519204 520048 520864 521599 522332 523231 524570 526721 529794 533222 536095 538142
59477 538142 540092 542905 546912 551874 557389 562944 567972 572298 576292 580230 583750 586281 587728 588426
59463 588426 588696 588847 589288 590217 591426 592806 594843 598251 603374 610197 618537 627744 636693 644664 651986
59448 651986 659321 666663 673599 680082 686111 690848 692875 691359 686439 678725 669174 659249 650318 642728
59434 642728 636042 630065 624941 620434 616080 612115 609335 607806 606619 605307 604738 606168 610082 616437
59420 616437 625432 637365 652073 669099 688330 710044 734371 760974 789362 819315 850596 881634
59408 881634 908323 924984 927750 917475 899071 878169 858674 842868 832380 828372 831123 839531
59396 839531 850507 858980 859731 850166 831381 806630 779339 752429 728228 707915 691264 677509
59384 677509 666385 658099 652608 649341 647493 646353 645533 645013 644833 644767 644644 644891 646216 648643 651391 653823
59368 653823 656018 658236 660375 662204 663615 664473 664762 665122 666588 669430 672834 676113 679628 684049 689389
59353 689389 695463 702854 712516 724539 737936 751669 765433 779491 794156 809511 825337 841339
59341 841339 857486 873841 889856 904160 915466 923487 928676 931343 931402 928751 923392 915253 904308
59328 904308 890922 875826 859711 843091 826469 810402 795304 781265 768047 755263 742689
59317 742689 730472 718911 708071 697853 688394 680023 672767 666282 660443 655617 652165 650094 649490
59304 649490 650865 654583 660178 666821 674497 684269 697033 711871 725589 733973 733984 725234 709714 690369
59290 690369 669892 650285 632688 617383 604283 593544 585443 579786 575901 573322 572038 572036 573160
59277 573160 575568 579783 586006 593809 602721 612720 623995 636623 650578 665464 680127 693208 704450
59264 704450 714839 725111 734726 742728 748868 753282 755589 755109 751598 745293 736655 726684 716977 708630
59250 708630 701318 694113 686911 680393 674933 670467 667252 665805 666021 667198 669093 672169 676590 681747
59236 681747 687169 693266 700615 708893 717055 724361 730793 736496 741213 744365 745532 744678 741971 737482
59222 737482 731199 723249 713953 703588 692280 680218 667874 655915 644939 635315 627038 619729 613039
59209 613039 607082 602198 598247 594567 590780 587234 584387 582193 580392 579030 578232 577803 577486 577402 577786 578492
59193 578492 579168 579776 580538 581517 582698 584354 586915 590448 594560 598753 602642 606010 609080 612601 617300
59178 617300 623117 629257 634941 639911 644257 648081 651451 654539 657720 661404 665642 669965 673923 677747
59164 677747 682014 686579 690409 692751 693923 694521 694355 692761 689678 685785 681648 677154 671622 664159 654198
59149 654198 642245 629937 618858 609348 600757 592542 584599 576815 569055 561632 555166 549829 545167
59136 545167 540757 536669 533152 530166 527354 524323 521022 517962 515920 515182 515326 515982 517487 520341 524328
59121 524328 528840 533955 540479 548801 558259 567893 577365 586896 596625 606389 616005 625523 635161 644969
59107 644969 654548 663116 670052 675463 680199 685221 690710 695701 698829 699763 699633 699565 699072 696731 692430
59092 692430 687961 684979 683352 682051 680756 679662 678392 676210 673084 669625 666137 662478 658655 654767
59078 654767 650443 645146 639000 632650 626308 619595 612371 605142 598613 593201 588919 585300 581651 577798
59064 577798 574365 571866 569946 568067 566360 565054 563599 561429 559125 557648 556666 555066 553109 552543 554164
59049 554164 556573 557974 558126 557820 557396 556621 555438 554058 552634 551310 550218 549176 547952 547065 547550 549484
59033 549484 551528 552582 553257 554947 558002 561633 565308 569406 574531 580866 588249 596415 605126 614372
59019 614372 624468 635694 647868 660371 672420 683124 691515 696890 699108 698454 695393 690568 684836
59006 684836 679034 673804 669686 667165 666454 667363 669515 672652 676748 681928 688224 695201 701956 707741 712517
58991 712517 716654 720353 723734 727189 730941 734315 736163 736095 734721 732604 729733 726198 722675 719865 718072
58976 718072 717678 719352 723290 728733 734851 741773 750258 760605 772365 784889 797686 810335 822479
58963 822479 833959 844878 855528 866260 877104 887427 896202 902747 906967 908913 908414 905208 899003
58950 899003 889414 876347 860634 843769 826780 809755 792624 775894 760370 746629 735009 725619
58938 725619 718087 711771 706507 702616 699915 697386 694342 691320 689147 687660 686058 684199 682674 681768
58924 681768 681123 680504 680171 680250 680241 679470 677837 675939 674543 673966 673846 673549 672897 672413 672739 673971 675752 677883
58906 677883 680649 684622 690339 698150 708132 720026 733243 746974 760530 773810 787334 801545
58894 801545 816137 830382 844033 857558 871591 886686 903578 922889 944302 966573 988779
58883 988779 1011042 1033593 1055545 1075133 1090942 1102449 1109603 1112511 1111554 1107313 1100121 1089870 1076359
58870 1076359 1059813 1041112 1021534 1002253 984045 967474 953112 941232 931439 922982 915372 908312
58858 908312 901096 892732 882859 871944 860367 847835 834099 819723 805696 792660 780906 770702
58846 770702 762017 754167 746323 738319 730575 723294 716193 708947 701535 694032 686401 678597 670709 662922
58832 662922 655463 648659 642890 638353 634893 632144 629903 628287 627390 626951 626658 626784 628038 630645 634055
58817 634055 637899 642647 648714 655362 661260 665872 669563 672589 674927 676970 679339 681819 683413 683679
58803 683679 683159 682189 680285 677170 673488 669769 665404 659487 652252 644853 637916 631035 623653 615876 608347
58788 608347 601696 596314 592463 590421 590318 591793 594117 596925 600497 604923 609377 612856 615411 617877
58774 617877 620568 623037 624988 626378 626603 624668 620517 615275 609846 604174 598126 592143 586529 581046
58760 581046 575702 571180 567958 565824 564597 564473 565221 566058 566900 568719 571983 575702 578779 581369 584049
58745 584049 586581 588548 590429 592953 595999 599127 602635 607022 611895 616523 621099 626476 632872 639740
58731 639740 646655 653524 660194 666628 673250 680415 687840 695086 702206 709306 716042 722197 728197 734327
58717 734327 740166 745633 751881 760069 769839 780091 790622 801725 812645 821806 828355 832290 833369
58704 833369 831181 826182 819307 810533 798990 784481 767754 749281 729054 707730 686700 666718
58692 666718 647523 629123 612383 598000 585869 575811 567932 561809 556254 550434 544587 539196 534208
58679 534208 529482 525273 521701 518339 514904 511904 510040 509297 509224 509936 512242 516703 522882 529824 537216
58664 537216 545852 556695 569599 583279 596483 608615 619055 626671 630554 630862 628467 624227 618955
58651 618955 613461 607925 601775 594825 587996 582173 576946 571407 565685 560653 556492 552674 549131 546362
58637 546362 544406 542789 541510 541122 541738 542753 543630 544201 544196 543241 541368 538780 535166 529994 523498 516687
58621 516687 510407 505131 501535 500507 502478 507394 515214 525666 537662 549761 561274 572245 582520
58608 582520 591615 599300 605471 609469 610538 609042 606474 604186 602703 602092 602077 601718 599908 596407 591910
58593 591910 587139 582478 578385 575452 574100 574645 577295 581511 586010 590325 595810 603976 614262 624708
58579 624708 634445 644078 653813 662871 670988 678981 687284 695143 701903 708291 715860 725746 738188 752661
58565 752661 768406 785354 804472 826639 851473 877980 905835 934957 964185 991600 1016011
58554 1016011 1037010 1053834 1065533 1072179 1074644 1073276 1068055 1059969 1050797 1041493 1032037 1022724 1014054
58541 1014054 1005366 995216 983258 970215 955825 938576 917933 895299 872329 849822 828721
58530 828721 810507 795755 783574 773155 764711 758414 753699 750151 747789 745972 743416 739991 737183
58517 737183 736072 735955 735556 734430 732579 729887 726577 723271 720155 717065 714445 712878 711494 708505 703715
58502 703715 698842 694961 691452 688061 685927 685501 685312 684107 682652 682168 682460 682876 683727 685382 687215 688835
58486 688835 691231 695366 700677 706267 712567 720554 730270 741343 754029 768377 783233 797335 810771
58473 810771 824202 837236 848547 856971 861642 861880 857924 851121 842661 832840 822146 811935 803247
58460 803247 796027 790341 787212 787295 789852 793987 799835 807653 816945 827434 839544 852696 864392 872375
58446 872375 876656 878194 876818 871931 864195 854955 844749 833803 823248 814379 807243 801230 796470
58433 796470 793535 792361 792512 793939 796613 800138 804492 810298 817635 825678 834273 844455 856333 867859
58419 867859 876969 883614 888357 890444 889012 885061 880335 875006 868093 859475 849968 840118 830336 821500
58405 821500 814032 807033 799627 792395 786364 781506 777473 774801 773974 774260 774858 776255 779040 782343 784855
58390 784855 786525 787945 789112 790081 791605 793672 794703 793839 792745 793403 795432 797508 800188 805148 812565
58375 812565 821358 831207 842257 853579 863978 873724 883658 893383 902214 911062 921290 932370 942696
58362 942696 952128 961839 972324 983444 995676 1009273 1022817 1034576 1044654 1053921 1061666 1066477
58350 1066477 1068798 1070440 1072065 1073135 1073784 1074716 1075847 1077055 1079632 1084948 1092267 1099876 1107686 1116776
58336 1116776 1127204 1138475 1151339 1166794 1183886 1200828 1217640 1235399 1253464 1269857 1283949
58325 1283949 1296545 1307821 1317410 1325937 1334151 1341112 1345493 1348161 1351231 1355188 1359137 1363145 1367985
58312 1367985 1373390 1378963 1385997 1395907 1407692 1419495 1431733 1445939 1461496 1476596 1491584 1508217
58300 1508217 1526196 1543645 1560524 1578440 1597397 1615835 1633628 1652011 1670867 1689013 1706896
58289 1706896 1726093 1746530 1767117 1788586 1812623 1838636 1864399 1889454 1914976 1941051 1967268
58278 1967268 1995168 2026620 2060404 2093889 2127382 2163297 2201793 2241065 2281286 2324366 2370243
58267 2370243 2417282 2465878 2517886 2573022 2629599 2688082 2750025 2814480 2879608 2946712 3018149
58256 3018149 3092282 3165300 3237014 3309859 3383363 3455246 3527186 3603574 3684885 3768092 3853332
58245 3853332 3944207 4041664 4143781 4251566 4368667 4495110 4627521 4765850 4913686 5071809
58235 5071809 5237824 5412284 5598679 5797371 6006341 6227858 6467307 6725595 7000160
58226 7000160 7293181 7610697 7953869 8319881 8711598 9137215 9600089 10098602 10636669
58217 10636669 11224410 11867833 12568511 13334483 14180530 15116830 16149320 17293034 18573350
58208 18573350 20013416 21634284 23469834 25568239 27977952 30749276 33954698 37694859
58200 37694859 42086468 47267565 53423437 60792482 69644799 80274404 93011578 108213219
58192 108213219 126231582 147417225 172160393 200896754 234014785 271608469 312961493
58185 312961493 355795775 395808823 427294141 444989867 446127618 431286971 403650521
58178 403650521 367511426 327084153 285920074 246658146 210933704 179492505 152469389
58171 152469389 129644450 110587843 94765676 81650454 70781400 61756523 54221753
58164 54221753 47889287 42541954 38004560 34124968 30784041 27897768 25395403 23207386
58156 23207386 21277836 19570605 18054362 16694185 15462767 14346279 13333005 12407344
58148 12407344 11559295 10788082 10090982 9458201 8882345 8362614 7895566 7471378 7083013
58139 7083013 6729712 6407556 6105761 5816658 5541289 5281355 5033654 4796347 4572960
58130 4572960 4365833 4172128 3989780 3820910 3665954 3520765 3382808 3254262 3135943
58121 3135943 3024106 2916254 2814414 2719728 2629467 2542246 2460637 2385718 2314298 2244406 2178348
58110 2178348 2117550 2059483 2002471 1948593 1898983 1851050 1803187 1757533 1715279 1673828 1631503
58099 1631503 1590623 1553052 1516960 1480849 1446578 1415507 1385627 1355427 1326752 1300978 1276164
58088 1276164 1250868 1227080 1206468 1187245 1167635 1148931 1132083 1114634 1094221 1072185 1050692
58077 1050692 1029143 1006406 983865 963208 943584 923768 904839 888023 872092 855538 839327
58066 839327 825024 812199 799924 788836 779472 770554 761042 752013 744481 737271 728947 719917 710825
58053 710825 700925 689892 679218 670017 661436 652859 645406 639511 633439 626177 619454 614780 610722 605333
58039 605333 599153 593517 587947 581590 575413 570604 566345 561317 555794 550143 542998 533149 521893 511418
58025 511418 502177 493667 486187 479844 473378 466080 459449 454945 451509 447287 442408 437984 433765 428967
58011 428967 424246 420701 417891 414773 411630 409244 407138 404524 402000 400540 399688 398419 396924 395951 395308
57996 395308 394496 393818 393473 392681 391126 390000 390106 390231 389039 387296 386435 386195 385539 384725 384563 384545 383588 381773
57978 381773 379694 377037 373515 370198 368115 366454 363919 360959 358844 357422 355691 353838 352844 352707 352821
57963 352821 353538 355586 358513 361294 363891 366669 368940 369768 369605 369491 369192 367638 364678 360912 356468
57948 356468 351499 347211 344748 343568 342455 341515 341680 342906 344550 346886 350618 355424 360630 366738 374546
57933 374546 383310 391538 399179 407181 415242 421854 426393 429396 430819 429783 426166 420937 414752 407520
57919 407520 399411 391079 382821 374612 366845 360030 354031 348598 344247 341415 339279 336719 334104 332841
57905 332841 333477 335463 338333 341699 344538 345999 346648 347586 348636 348939 348959 350196 352912 355768 357818 359471
57889 359471 361339 363484 365955 368824 371492 373091 373696 374117 374535 374438 373863 373438 373057 371662 368606 364311
57873 364311 359441 354239 348816 343285 337522 331437 325415 320007 315360 311444 308452 306444 305201 304989
57859 304989 306716 310550 315278 319937 325076 331345 337917 343734 349285 355538 361975 367508 372603 378449
57845 378449 384488 388821 390918 391980 392690 392488 391163 389288 386890 383390 379093 375064 371255 366395 360146
57830 360146 353873 348859 345149 342437 340622 339048 336601 333195 330031 328061 327204 327274 328369 330035 331297
57815 331297 331947 332594 333113 332213 328967 323735 317158 309348 300452 291109 281985 273594 266647 261620 257974
57800 257974 254798 252148 250652 249917 248734 246908 245454 244788 244250 243697 244068 245781 247881 249388 250385 251330
57784 251330 252416 254070 256955 260981 265347 269947 275652 282813 290600 298244 305793 313257 320173 326536
57770 326536 333012 339658 345458 349654 352530 354377 354744 353366 350985 348639 346800 345428 344109 342045
57756 342045 338929 335928 334601 334796 335002 334990 336386 340017 344284 347052 347838 347222 345390 342332 338464 334020
57740 334020 328614 322260 316080 311238 307864 305564 304114 303091 301818 300331 299471 299442 299359 298842 298864 300164
57724 300164 301967 303289 304486 306405 308835 310867 312146 312824 312915 312592 312522 313037 313578 313650 313646 313898 313655 311839
57706 311839 308321 303777 298894 294349 290793 288097 285284 281845 278415 275551 272851 270062 267982 267171
57692 267171 266607 264829 261802 258587 255700 252852 249890 247034 244543 242889 242750 244066 245699 246814 248084
57677 248084 250855 255918 263864 275702 291969 312015 335370 363172 397050 437183 482627 532742
57665 532742 586388 639626 685581 717034 728943 719481 690488 647166 596108 542915 491595 445148
57653 445148 405307 371811 343204 318522 297516 279663 264252 251434 241939 235563 230940 227016
57641 227016 223794 221455 219691 218283 217521 217625 218295 219106 219889 220533 220856 220819 220513 219914 218998 218015 217229 216455
57623 216455 215262 213516 211368 208890 206189 203632 201504 199639 197785 196075 194691 193496 192506 192241 192937
57608 192937 193844 194077 193787 193685 193756 193417 192675 192131 191900 191523 190960 190769 191126 191434 191067 189837 187689 184604
57590 184604 180908 177108 173388 169822 166910 165095 163849 162134 159910 158295 157937 158056 157500 156154 154768
57575 154768 153878 153351 152803 152026 151013 149717 147937 145622 143312 141883 141569 141615 141272 140691 140354 140082 139379
57558 139379 138476 138212 138930 140164 141349 142172 142350 141821 141180 141235 142111 143372 144978 147330 150322 153124 155154
57541 155154 156624 157956 159245 160531 162019 163778 165649 167627 169855 172095 173728 174516 174932 175452 175856
57526 175856 175497 173996 171492 168417 165208 162106 159171 156449 153930 151270 147884 143668 139291 135412
57512 135412 131954 128603 125619 123460 121889 120214 118359 116973 116477 116651 117207 118118 119239 120151 120562 120463
57496 120463 119848 118706 117362 116324 115736 115335 115008 115029 115684 116957 118565 120079 121148 121811 122317 122427 121428
57479 121428 119297 117286 116632 117098 117551 117548 117412 117095 116109 114551 113172 112318 111700 111236 111137 111040 110088 108212
57461 108212 106495 105907 106433 107666 109377 111127 112132 112042 111359 110713 110263 110051 110303 110976 111586 111879 112200
57444 112200 112913 113962 115266 116956 118898 120530 121604 122547 123683 124535 124386 123238 121781 120672 120114
57429 120114 119991 120115 120439 121103 122124 123127 123754 124244 125153 126484 127625 128159 128260 128191 127922 127350 126499 125535
57411 125535 125012 125863 128453 131735 134170 135469 136563 137830 138418 137663 136142 134802 133876 133239 133040 133314
57395 133314 133590 133592 133858 135022 136826 138427 139340 139698 139958 140725 142441 144778 146744 147785 148414 149325 150404
57378 150404 151150 151649 152465 153817 155440 157090 158640 159802 160256 160044 159455 158558 157198 155497 154051 153487
57362 153487 153896 154789 155588 156094 156297 155916 154630 152975 152370 153618 155881 157857 159548 161834 164620 166711
57346 166711 167614 168206 169218 170154 170299 169809 169197 168564 167980 167837 168100 167920 166737 165243 164529 164744 165216 165467
57328 165467 165466 165307 165231 165617 166469 167306 167934 168758 169854 170400 169677 168120 166661 165592 164796 164635 165644 167483
57310 167483 168990 169304 168545 167558 167293 168067 169076 169119 168223 167945 169467 172022 174019 175117 176198 177688
57294 177688 179035 179764 180010 179933 179414 178561 177843 177488 177143 176247 174411 171542 167943 164207 160664 157079 153228
57277 153228 149464 146321 143869 141961 140778 140489 140675 140843 141393 143355 147145 152139 157521 163030 168844
57262 168844 175125 181804 188569 195099 201438 207863 214220 219855 224523 228843 233398 237907 241824 245204
57248 245204 248344 251164 253751 256973 261478 266459 270495 273466 276598 280699 285418 290181 294735 298631
57234 298631 301377 303518 306535 311148 316462 321324 325775 330582 335987 341572 347002 352246 357245 361884
57220 361884 366273 370787 375823 381619 388158 395144 402221 409249 416228 423104 429935 437160 445307 454370
57206 454370 463776 472944 481674 490085 498526 507486 517236 527548 538056 548796 560163 572454 585793
57193 585793 600227 615428 630513 644763 658469 672585 687563 703043 718620 734352 750433
57182 750433 766902 783827 801396 819727 838857 858839 879550 900522 921419 942574 964627
57171 964627 987667 1011117 1034371 1057170 1079550 1101860 1124668 1148224 1172279 1196850 1222685
57160 1222685 1250301 1279049 1308047 1337686 1369100 1402365 1436421 1470860 1506473 1543662 1581469
57149 1581469 1618681 1654914 1690002 1723287 1754377 1784010 1813388 1842984 1872605 1902274 1932476
57138 1932476 1963723 1996264 2030063 2064809 2100216 2136507 2174319 2213987 2255177 2297245 2339609
57127 2339609 2381852 2424026 2466892 2511291 2557295 2604574 2653509 2705022 2759339 2816023 2875584
57116 2875584 2939922 3010614 3087748 3171046 3261152 3359029 3465125 3580338 3707383 3850361
57106 3850361 4013567 4201741 4421107 4679380 4985248 5349028 5783902 6306101 6934443
57097 6934443 7690250 8596443 9674365 10940128 12403053 14065034 15918177 17942065
57089 17942065 20104471 22365383 24680552 27003785 29290909 31505208 33619181 35609850
57081 35609850 37450671 39103060 40507881 41581800 42229833 42376634 41997569 41123505 39815561
57072 39815561 38134403 36129871 33851667 31362393 28739313 26066927 23427883 20895047
57064 20895047 18524818 16353668 14399594 12666473 11147995 9830525 8695998 7724687
57056 7724687 6896749 6192781 5594405 5084875 4649167 4273924 3947823 3661777 3408218
57047 3408218 3180234 2971690 2777989 2596260 2424900 2263187 2111038 1968578 1835909
57038 1835909 1713405 1601794 1501530 1412471 1334626 1268765 1215628 1174951 1146113 1129423 1125822
57027 1125822 1135362 1156546 1186338 1218940 1244326 1250203 1227807 1176668 1103971 1019868 933205 849890
57015 849890 773134 704359 644118 592475 548873 512243 481608 456318 435532 417933 402349
57004 402349 388390 376173 365591 356171 347451 339198 331309 323700 316274 309028 302227 296354 291671
56991 291671 288028 285405 284427 285854 289648 295135 302025 310699 321357 333381 345521 356142 363295
56978 363295 365345 361926 353877 342237 327829 311838 295991 281761 269866 260584 253898 249293 246305
56965 246305 245551 248266 254457 262515 271317 281821 295774 313557 334149 356373 378853 398976 413187
56952 413187 418781 415051 402923 384259 361607 337797 315148 294986 277836 263857 253134 245795
56940 245795 241966 241630 244633 250824 260045 272152 287407 306702 330829 359434 390976 423353 453617
56927 453617 477210 489051 486498 470984 446429 416653 384521 352332 321810 293918 269361 248968
56915 248968 233063 220912 211324 203466 196738 190530 184702 179744 175844 172396 169121 166959 166995 169022
56901 169022 172058 175739 180185 184962 189337 193407 197928 203135 208644 214439 221038 228780 237808 248671
56887 248671 261999 277564 294423 311757 328465 341952 348726 346895 337417 322662 304571 284620
56875 284620 264616 246590 232042 221728 215976 214962 218851 227868 242129 261470 285738 315230
56863 315230 350559 392227 440654 496216 558234 623420 685555 736962 770655 782222 771201
56852 771201 741351 699123 651209 603010 558464 520229 489767 467763 454642 450520 454995 467697
56840 467697 489048 519967 560937 612049 673891 747477 832875 928117 1028911 1128003 1214345
56829 1214345 1274483 1297294 1279191 1225616 1147791 1057533 963843 872751 788912 716254 656943
56818 656943 610637 575696 551152 537153 533925 541129 558214 584685 620011 663913 716800 778975
56806 778975 848644 920386 985408 1033337 1055142 1046369 1008831 949261 876152 797440 719772 648033
56794 648033 584828 530959 486687 452127 426649 408996 398403 394936 398419 407753 421784 440428
56782 440428 464502 494623 530136 568211 603559 629699 641464 636736 616327 583033 540972 494813
56770 494813 448570 404787 364742 329016 297744 270818 248105 229268 213383 199295 186551
56759 186551 175604 166919 160311 155231 151171 147552 143734 139480 135135 131107 127457 124064 120862 117812
56745 117812 115023 112901 111759 111224 110532 109442 108365 107536 106652 105444 104084 102836 101852 101407 101797 102800
56729 102800 103777 104446 105037 105589 105742 105439 105292 105952 107510 109591 111616 113035 113881 115012 117119 119588
56713 119588 121165 121693 122156 123006 123669 123928 124482 125626 126614 127012 127490 128461 128976 128024 125995 123903 121986
56696 121986 120167 119112 119505 120696 121323 121001 120344 119662 118831 118230 118587 119740 120610 120634 120467 121015 122389
56679 122389 124012 125215 125624 125429 125345 125911 126841 127475 127742 128207 129238 130625 131991 133142 134100 135161 136868
56662 136868 139484 142614 145725 148830 152180 155471 157972 159440 160432 161650 163338 165243 166818 167537 167403
56647 167403 167064 167138 167511 167575 166866 165189 162492 159164 156156 154126 152546 150230 146735 142736 139121 136287
56631 136287 134331 133327 133170 133399 133328 132300 130107 127447 125633 125363 126016 126596 127081 128133 129728 130865
56615 130865 130754 129621 128249 127308 127224 128015 128989 129139 128203 126987 126397 126470 126535 125966 124599 122767 121222 120694
56597 120694 121219 122024 122351 122274 122537 123710 125659 127745 129405 130566 131619 132973 134569 135857 136301 135915
56581 135915 135311 135252 136143 137820 139701 141073 141402 140716 139853 139996 141632 144079 146360 148380 150844 154135
56565 154135 157865 161579 165324 169321 173576 178116 183259 189318 196203 203383 209989 214966 217627 218242
56551 218242 217729 216706 215246 213486 211766 210030 207836 205267 203125 201887 201151 200479 200033 199904 199574 198653
56535 198653 197446 196143 194179 191164 187846 185273 183536 182129 180994 180259 179466 178192 177108 177251 178405
56520 178405 179239 179053 178338 177563 176495 174982 173490 172503 171996 171778 171809 171978 172085 172163 172362 172523 172431 172386 172848
56501 172848 173512 173551 172910 172512 172921 173560 173672 173356 173110 172899 172313 171365 170482 169864 169342 168841 168492 168189 167401
56482 167401 165768 163731 162241 161806 162135 162878 164231 166290 168160 168655 168016 168012 169859 172763 175115 176472
56466 176472 177575 178888 180145 181181 182266 183407 183980 183410 181923 180425 179749 180061 180889 181766 182693 183759
56450 183759 184539 184521 184148 184589 186170 187844 188586 188546 188343 188102 187854 188041 188768 189301 189164 188995 189393 189729 189218
56431 189218 188470 188614 189458 189949 190072 190756 192066 193015 193260 193585 194470 195421 196012 196428 196732 196650 196415 196769 197833
56412 197833 198871 199436 199858 200394 200875 201398 202390 203664 204369 204203 203827 203786 203947 204293 205237 206667 207486 206705
56394 206705 204399 201263 197915 194892 192635 191041 189582 188074 186660 184963 182097 177866 173236 169395
56380 169395 167018 166592 168538 172638 178035 184122 190806 197714 204035 209390 214057 218052 220865 222420
56366 222420 223479 224691 226048 227537 229468 231758 233803 235501 237527 240108 242380 243585 244131 244828 245737
56351 245737 246441 246929 247601 248764 250529 252812 255163 257012 258250 259072 259297 258635 257622 257288 257688 257863
56335 257863 257586 257996 259929 262683 265215 267579 270284 273041 275168 276811 278898 282146 286626 291911 297120
56320 297120 301233 303861 305476 306667 307618 308479 309551 310752 311539 311704 311728 312134 313168 315200 318526 322496
56304 322496 325832 328218 330639 333787 337260 340899 345654 352108 359109 364945 369288 373021 376760 380528
56290 380528 384446 388770 393428 398224 403384 409376 416333 423992 431910 439608 446941 454512 463142 472787
56276 472787 482677 492627 503354 515275 527910 540888 554601 569476 585521 602944 622253 643255
56264 643255 665046 687527 711861 738803 767727 798119 831105 868721 912538 963579 1022477
56253 1022477 1088906 1161977 1242099 1331437 1431648 1542255 1662228 1791888 1931797 2080588
56243 2080588 2235361 2393684 2553854 2713582 2869562 3018144 3155485 3277369 3379740
56234 3379740 3459308 3513408 3540036 3538753 3510938 3458600 3383694 3289031 3178656 3056319 2924421
56223 2924421 2785312 2642575 2499950 2359739 2223280 2092112 1967591 1850048 1739376
56214 1739376 1635856 1539600 1449997 1366599 1289728 1219450 1154920 1095598 1041959 994018 950361
56203 950361 909831 872970 840503 811546 784795 760346 738746 719243 700696 683398 668407
56192 668407 655724 644657 635151 627197 619782 612172 605505 601291 598937 596565 593721 591427 589978 588580
56178 588580 586937 585458 583998 582042 580035 579057 579260 579878 580566 581471 582384 583128 584389 586879 590165 593576
56162 593576 597580 602840 608624 613814 618870 625172 632970 641665 651480 663108 676211 690028 704942
56149 704942 721783 740259 759982 782315 809185 840674 876040 916558 964929 1022173 1087525
56138 1087525 1161178 1244472 1337037 1435866 1537369 1638106 1733488 1818451 1890493 1950624 2001185
56127 2001185 2044525 2083597 2121079 2156777 2187484 2209957 2222678 2224878 2216243 2198358 2174505 2146956
56115 2146956 2115371 2077860 2032072 1975283 1905605 1824058 1734351 1640509 1546009 1454865 1371296
56104 1371296 1297608 1233809 1179454 1134403 1097764 1067910 1043888 1025415 1011542 1000864 992864
56093 992864 987382 983185 979005 975710 975183 977205 979716 982078 985575 990629 996111 1001833 1009116 1018226
56079 1018226 1027552 1036141 1044998 1055168 1066388 1078166 1090361 1102341 1113425 1124445 1136914 1150528
56067 1150528 1163546 1175751 1188757 1203187 1217969 1232754 1248639 1265981 1283767 1301553 1319841
56056 1319841 1338195 1355347 1371509 1388241 1405682 1422283 1437594 1452897 1468843 1484872 1501265
56045 1501265 1519208 1538570 1558159 1578293 1600446 1624275 1647897 1671303 1696528 1724214 1753020
56034 1753020 1782626 1814217 1847812 1882381 1918735 1958867 2002166 2045896 2089646 2135555 2183884
56023 2183884 2232431 2280823 2331267 2384340 2438222 2492855 2550587 2611817 2674347 2737923 2805017
56012 2805017 2876172 2949260 3024322 3104250 3189511 3277264 3367145 3462747 3565704 3673481 3784795
56001 3784795 3901950 4025925 4154572 4287880 4429669 4581827 4742079 4909469 5086545
55992 5086545 5274204 5470362 5676045 5896636 6134769 6388266 6657491 6947943 7262970
55983 7262970 7601056 7963261 8355959 8783124 9243718 9740226 10281791 10875247 11521627
55974 11521627 12225680 13000181 13856782 14802246 15848789 17018738 18334517 19815206 21489196
55965 21489196 23400153 25596102 28126830 31061004 34495599 38544536 43336602 49037628
55957 49037628 55863895 64067255 73923422 85741091 99857959 116610446 136324051
55950 136324051 159346140 186066281 216863661 251928026 290824948 331743740 370832585
55943 370832585 402476494 420975945 422858984 408268699 380530635 344469590 304761374
55936 304761374 265066456 227836167 194422597 165322777 140491575 119604484 102198875
55929 102198875 87752332 75762081 65797941 57497770 50547867 44689450 39725456 35499744
55921 35499744 31876050 28743247 26022646 23653203 21576433 19742834 18120032 16682591
55913 16682591 15401405 14250781 13216359 12287071 11446814 10681277 9985038 9354320 8779608
55904 8779608 8252062 7770052 7332453 6931752 6560200 6216782 5901905 5610840 5338391
55895 5338391 5084757 4851009 4633661 4429189 4239162 4065686 3906260 3758065 3622844
55886 3622844 3502524 3394294 3294958 3206044 3129525 3062007 2997873 2934987 2873114 2810173 2744480
55875 2744480 2677588 2610733 2541338 2466752 2388409 2308641 2226639 2141526 2056367 1975152 1898461
55864 1898461 1825705 1758669 1698919 1644346 1592199 1543137 1498700 1457291 1416565 1377429 1341815
55853 1341815 1308554 1275319 1242798 1213114 1185685 1158202 1130313 1102955 1075481 1046829 1018289
55842 1018289 991953 967488 943375 920085 899053 879641 860050 840329 821752 804216 786949
55831 786949 770796 757203 745677 734622 723907 714386 705811 697370 689291 681752 673241 662251 649706
55818 649706 637568 625921 613542 600470 587983 576761 566938 559093 553370 548506 543467 539105 536539
55805 536539 535065 533488 532387 533200 536071 540403 546429 554354 562915 570615 577390 583421 587476 588323 586696
55790 586696 584013 580254 574926 568982 563756 558982 553742 548341 543217 537013 527801 515544 501641 487037
55776 487037 472656 460610 452820 449103 448436 451168 458025 467792 477876 486272 491119 489634 480121 464522
55762 464522 446830 429457 413009 398539 387339 378851 371269 364177 358519 354212 349901 345039 340219
55749 340219 335499 330267 324703 319584 314718 309268 303493 298496 294483 290971 288431 287809 288504 288681 287612
55734 287612 286007 284049 280942 276550 271871 267556 263375 259218 255264 251077 245948 240170 234751 229919
55720 229919 225234 221008 218175 216749 215851 215328 216091 218725 222926 228300 234636 241394 247870 253673 258230
55705 258230 260456 260022 258337 256893 255224 251920 247042 241798 236347 229795 222200 214791 208245 202353
55691 202353 197277 193523 190701 187913 185352 183972 183649 183288 182708 182774 183696 184826 186218 188692 192216 195791
55675 195791 198951 201786 203484 202786 200124 197519 195931 194377 192017 189348 186814 183930 180556 177650
55661 177650 176107 176078 177751 181297 185617 188730 190159 191484 193928 196802 199115 201221 203837 206621 208829
55646 208829 210547 212337 214291 216037 217076 216716 214482 210883 206910 202549 196855 189777 182633 176314
55632 176314 170245 163751 157277 151592 146791 142831 140074 138610 137893 137604 137952 138603 138449 137215 136233 136692
55616 136692 137984 138696 138471 137894 137173 135977 134259 132356 130421 128358 126193 124155 122558 121711 121569 121409
55600 121409 120466 118965 117813 117133 116003 113915 111576 109765 108254 106486 104667 103537 103459 104218 105309
55585 105309 106109 106296 106360 107203 109036 111187 113132 114976 116758 118154 119269 120956 123885 127834 132216
55570 132216 136690 140962 144687 147985 151395 154999 158089 159983 160592 160016 158280 155669 152669 149362 145540
55555 145540 141475 137765 134339 130604 126736 123732 121847 120049 117504 114610 112081 110007 108380 107571
55541 107571 107620 107923 108193 108896 110194 111415 112207 113218 114867 116373 116943 117110 117926 119460 120960 121938 122222
55524 122222 121550 119973 118249 117015 116068 115125 114715 115500 117183 118939 120541 122293 124242 126205 128220
55509 128220 130290 132034 133156 133812 133876 132489 129135 124689 120488 116813 113104 109229 105543 102008 98334
55494 98334 94849 92247 90509 88905 87115 85573 84667 84360 84591 85300 85945 85764 84734 83704 83346 83437 83339
55477 83339 82774 81925 81119 80644 80653 81088 81752 82442 82965 83156 83074 83013 83179 83501 83902 84468 85130 85468 85153 84352
55457 84352 83395 82265 80759 78990 77411 76408 76073 76289 76823 77436 77994 78415 78580 78531 78659 79262 79977 80187
55439 80187 80042 80431 81730 83211 84024 84208 84325 84613 84977 85364 85672 85605 85015 84190 83497 83024 82743 82687 82810
55420 82810 83145 84229 86720 90320 93707 95994 97626 99383 101128 102150 102245 101777 100975 99792 98251 96451
55404 96451 94450 92447 90789 89516 88347 87359 87053 87373 87366 86419 85206 84696 84786 84719 84398 84400 84970 85820 86766
55385 86766 87775 88467 88376 87681 87102 86986 87025 86871 86535 86181 85912 85825 86014 86504 87310 88371 89304 89591 89227
55366 89227 88792 88645 88556 88360 88336 88524 88336 87484 86648 86444 86307 85286 83597 82348 81918 81585 80826 80099 80094
55347 80094 80824 81736 82324 82455 82354 82356 82489 82389 81764 80744 79622 78564 77801 77674 78139 78659 78889 79052 79301
55328 79301 79278 78791 78307 78203 78124 77750 77534 77853 78044 77307 76135 75716 76197 76668 76760 77070 77928 78821 79311 79583
55308 79583 79774 79598 78985 78429 78274 78168 77612 76691 75930 75691 75868 76032 75879 75636 75888 76839 78120 79615
55290 79615 81891 85201 88560 90665 91484 92003 92645 92915 92537 91901 91190 90060 88514 87248 86674 86284 85460
55273 85460 84403 83792 83901 84484 85234 85961 86444 86365 85473 83923 82513 82238 83256 84545 85027 84770 84554 84613
55255 84613 84580 84510 85067 86494 88113 89143 89496 89568 89737 90187 90821 91212 91011 90435 89972 89665 89169 88420 87697
55236 87697 87081 86489 86211 86660 87494 87736 87016 86073 85744 85962 86072 85646 84744 83755 83265 83715 84993 86536
55218 86536 87882 88829 89187 88878 88265 87906 87893 87918 87923 88123 88434 88533 88587 89223 90584 92025 92925 93173 92726 91439
55198 91439 89681 88459 88387 88944 89163 88701 87917 87281 87082 87394 87968 88314 88109 87354 86144 84632 83317 82907
55180 82907 83675 85240 87066 88848 90344 91300 91706 91815 91799 91736 91889 92508 93324 93820 94101 94828 96111 97146
55162 97146 97304 96971 96871 97006 96815 95988 94679 93147 91678 90725 90734 91743 93266 94567 95136 95087 95054 95441
55144 95441 95888 95831 95412 95289 95597 95804 95682 95744 96389 97214 97562 97357 96999 96749 96571 96368 96125 95925 95937 96193
55124 96193 96417 96348 96148 96091 95942 95208 94007 93085 92823 92837 92710 92542 92517 92497 92330 92145 92081 92101 92166 92195 91871 91076
55102 91076 90561 91399 93543 95702 96928 97578 98340 99132 99557 99766 100124 100502 100557 100436 100613 101274 102321 103669
55084 103669 105063 105883 105647 104534 103105 101801 101023 101306 102852 105112 107221 108776 109911 110845 111634 112143
55068 112143 112046 111122 109736 108670 108261 108068 107579 106809 105926 104839 103529 102369 101667 101229 100742 100264 100004
55051 100004 99996 100291 101052 102120 102940 103327 103799 104671 105334 105036 104000 103107 102741 102586 102353 102074 101753 101291 100720
55032 100720 100130 99451 98668 98040 97704 97260 96301 95233 94969 95728 96657 96925 96847 97549 99512 101732 102658 101934
55014 101934 100842 100753 101592 102345 102687 103238 104285 105245 105678 105995 106702 107646 108490 109292 110130 110709 110868 110979
54996 110979 111398 111978 112589 113550 115030 116502 117344 117570 117535 117361 117067 116754 116242 115120 113608 112732 113093 114113
54978 114113 115073 116121 117530 118821 119564 120311 121618 122676 122196 120317 118444 117381 116758 116192 115755 115264
54962 115264 114264 113028 112598 113456 114893 115992 116559 116807 116760 116328 115610 114903 114617 115035 115823 116011 115028 113519
54944 113519 112563 112302 112062 111592 111335 111560 112099 112946 114232 115506 115939 115398 114615 114081 113618 113303 113953 116182
54926 116182 119504 122855 125620 127796 129598 131371 133678 137103 141886 147755 154035 160024 165477 170549
54912 170549 175007 177865 178219 176181 172528 167802 162426 157331 153437 150509 147367 143386 139065 135085
54898 135085 131582 128511 125971 123899 122101 120768 120343 120690 121020 120901 120797 121343 122635 124404 126383 128325
54882 128325 130170 132317 135181 138432 141355 144048 147499 152163 157271 161929 166197 170529 174684 177755
54868 177755 178940 177878 174599 169633 163974 158558 153835 149881 146610 143721 140824 137793 134813 132101
54854 132101 129866 128339 127320 125843 123030 119322 116180 114461 113747 113300 112797 111957 110474 108817 108265
54839 108265 109502 111743 113700 114801 115022 114280 112760 111290 110684 110885 111303 111623 111826 111791 111453 111064 110879
54822 110879 110789 110646 110614 110841 111150 111371 111581 111690 111333 110610 110387 111275 112746 113883 114623 115552 116765 117681
54804 117681 117915 117724 117556 117598 117742 117701 117268 116721 116781 117899 119728 121505 122660 122874 122091 120829 120031 120103
54786 120103 120487 120613 120843 121868 123523 124855 125215 124783 124229 124279 125321 126993 128422 129342 130528 132616
54770 132616 135034 136896 138533 141155 145226 150138 155379 161033 167000 172721 177953 182966 187575 190762
54756 190762 191656 190322 187201 182448 176402 170175 165040 161315 158283 155115 151489 147518 143555 140214
54742 140214 138172 137604 137814 137638 136447 134767 133694 133607 133700 132999 131528 130111 129262 128886 128994 130091 132512
54725 132512 135807 139114 141986 144620 147468 150896 155069 159885 164937 169691 173681 176600 178218 178323
54711 178323 176770 173621 169300 164490 159778 155359 151116 146994 143253 140358 138540 137409 136135 134282
54697 134282 132391 131384 131363 131431 130886 130073 129702 129764 129709 129396 129186 129156 128913 128323 127833 127763 127732 127185 126192 125322
54677 125322 124833 124358 123440 122065 120572 119249 118208 117591 117565 118013 118424 118337 117823 117310 116956 116535 115987 115729
54659 115729 116194 117230 118189 118466 117879 116710 115589 115145 115520 116282 116918 117297 117565 117760 117756 117515 117254 117392
54641 117392 118269 119721 120968 121250 120668 120017 119729 119441 118846 118428 118878 120080 121192 121586 121364 121044 121081 121628
54623 121628 122479 123299 123938 124312 123998 122505 120139 117989 116673 115708 114648 114099 114777 116100 116780 116539 116183
54606 116183 116153 116157 116310 117382 119533 121787 123263 124052 124396 123942 122603 121378 121332 122089 122297 121399 120163 119556
54588 119556 119816 120689 121806 122615 122500 121419 120110 119387 119365 119572 119681 119910 120730 122281 124069 125286 125529
54571 125529 125241 125273 125981 126907 127417 127467 127531 127890 128299 128427 128350 128370 128522 128503 128086 127361 126581 125990 125834 126268 127115
54550 127115 127953 128536 128991 129520 130164 130993 132193 133713 135078 135860 136227 136721 137563 138377 138543 137718 136149
54533 136149 134626 133870 133730 133329 132250 131228 131229 132180 133204 133832 134246 134455 134116 133377 133085 133614 134083 133331
54515 133331 131390 129440 128424 128210 128072 127571 126814 126175 125984 126396 127367 128678 130003 130962 131164 130366 128787
54498 128787 127265 126806 127628 128828 129361 129316 129713 131033 132602 133700 134524 135455 136016 135495 134291 133592 133746
54481 133746 133939 133702 133787 135072 137296 139497 141225 142766 144419 146109 147557 148506 148874 148905 149039 149512 150263
54464 150263 151226 152391 153456 153896 153626 153213 153180 153504 153992 154614 155093 154775 153519 152256 151916 152132 151758 150483
54446 150483 149026 147798 146343 144394 142590 141585 141071 140318 139296 138601 138514 138714 138903 139114 139337 139310 138909
54429 138909 138401 138134 138207 138616 139487 140889 142549 143974 144863 145270 145444 145653 146037 146460 146586 146291 145872 145632
54411 145632 145420 144944 144479 144723 145840 147116 147857 148182 148555 148896 148734 148105 147725 148203 149479 151115 152786
54394 152786 154332 155621 156605 157350 157916 158276 158394 158259 157799 156888 155489 153750 152021 150799 150526 151234 152463
54377 152463 153645 154534 155145 155490 155605 155702 156011 156567 157314 158329 159690 161378 163523 166493 170281 174101
54361 174101 177118 179420 181706 184164 186363 188159 189867 191394 192048 191535 190417 189152 187395 184791 181770
54346 181770 178811 175488 171150 166256 162120 159390 157555 156037 154970 154626 154707 154610 154013 152931 151515 150138
54330 150138 149352 149377 149737 149723 149183 148589 148368 148484 148744 149158 149750 150146 149797 148686 147537 147068 147223 147414 147357
54311 147357 147286 147321 147104 146303 145229 144635 144946 145864 146710 147047 146986 146911 146841 146197 144479 142199 140729 140956 142296
54292 142296 143338 143300 142585 142028 142037 142515 143245 144058 144757 145157 145283 145386 145685 146147 146619 147134 147886 148883 149836
54273 149836 150524 151047 151488 151548 150891 149730 148664 147957 147399 146914 146814 147268 147957 148532 149028 149521 149777 149680 149765
54254 149765 150771 152709 154793 156367 157485 158438 159056 158861 157878 157013 157334 158926 160645 161159 160180 158499
54238 158499 156924 155587 154289 153060 152137 151673 151757 152477 153678 154818 155374 155403 155527 156364 158046 160129 161887
54221 161887 162832 163029 162785 162097 160751 158977 157470 156489 155461 153894 152262 151381 151257 151229 151083 151252 151910
54204 151910 152631 153089 153421 153614 153158 151725 149710 147680 145759 144059 143241 143866 145375 146491 146721 146767 147338
54187 147338 148220 148923 149583 150605 151738 152299 152248 152366 153211 154456 155459 156008 156174 155913 155278 154735 154686 154861
54169 154861 154648 153991 153432 153238 152994 152256 151160 150123 149250 148317 147236 146262 145788 146017 146750 147497 147951 148329
54151 148329 149050 150084 150893 151105 150926 150815 150987 151349 151683 151736 151413 151018 151056 151670 152532 153422 154485 155665
54133 155665 156298 155811 154655 154013 154527 155730 156847 157807 159236 161634 164811 168082 170796 172593 173347 173095
54117 173095 172099 170809 169627 168821 168610 169084 169914 170454 170457 170434 170963 171894 172663 173107 173373 173315 172762 172339 173103
54098 173103 175091 177041 178014 178635 180231 183285 187249 191526 196158 201818 209352 218848 228847 236999 241901
54083 241901 243776 243110 239519 232820 224470 216770 210837 206279 202589 199747 197465 194987 192088 189513
54069 189513 187979 187295 186841 186462 186482 187131 188260 189417 190078 190037 189716 189835 190673 191863 192984 194099 195637
54052 195637 198002 201339 205437 209709 213419 216069 217558 218116 218181 218229 218501 219016 219944 221690 224380 227536
54036 227536 230605 233598 236875 240594 244776 249563 254860 259907 263883 266863 269623 272544 275302 277556
54022 277556 279261 280259 280255 279466 278728 278661 279073 279347 278982 277626 275020 271204 266527 261337 255872 250461 245448
54005 245448 240911 236762 233086 230004 227312 224747 222497 220848 219397 217333 214553 211741 209270 206850
53991 206850 204477 202832 202264 202197 202047 201990 202142 201755 200109 197764 195998 195207 194693 193930 193227 193092 193601 194478
53973 194478 195291 195406 194333 192377 190634 190098 190907 192508 194274 195781 196716 196852 196316 195829 196434 198656
53957 198656 201995 205507 208891 212672 217281 222460 227808 233459 239854 247203 255601 265295 276245 287452
53943 287452 297190 303950 306935 305983 301650 295394 289091 283946 280063 277109 275042 274028 273986 274542 275377
53928 275377 276426 277785 279572 281861 284642 287813 291198 294615 297938 301213 304759 309048 314365 320491
53914 320491 326811 332780 338318 343708 349210 354869 360611 366214 371107 374478 375868 375564 374289 372608
53900 372608 370752 368740 366429 363660 360585 357622 354740 351137 346074 339833 333339 327050 320821 314620
53886 314620 308591 302419 295554 288299 281898 277165 273664 270572 267663 264987 262214 258913 255072 250902
53872 250902 246554 242503 239592 238040 236735 234281 230529 226524 223201 220770 219156 218265 217767 217181 216251
53857 216251 214850 212741 209958 207316 205860 205710 205999 206003 205771 205519 205090 204374 203777 203847 204586 205424 205728 205195
53839 205195 203953 202480 201286 200509 199875 199098 198159 197150 196044 194843 193834 193525 194262 195962 198162 200247
53823 200247 201619 201919 201381 200961 201749 203906 206435 208378 210022 212347 215398 217998 219338 220121 221627
53808 221627 224103 226693 228658 230124 231787 234356 238160 242876 247755 252382 257028 262011 267063 271731
53794 271731 276005 280052 283686 286697 289332 291811 293663 294295 293992 293517 292941 291841 290523 289829 289541 288153
53778 288153 284818 280505 276556 272987 269036 264688 260573 256792 252897 248940 245550 242852 240122 236763
53764 236763 233048 229632 226843 224715 223266 222323 221424 220225 218890 217705 216512 214893 212848 210866 209240
53749 209240 207700 205971 204369 203540 203672 204293 204797 204916 204727 204569 204923 205990 207249 207844 207639 207480 208091
53732 208091 209110 209684 209750 210127 211391 213179 214712 215642 216305 217406 219455 222200 224659 226088 226941 228442
53716 228442 231134 234293 236946 238963 240817 242628 243973 244574 244742 245067 245891 247249 249153 251665 254616
53701 254616 257475 259850 262083 265003 268922 273228 277198 280793 284280 287475 290032 292205 294515 296648
53687 296648 297508 296661 295006 293625 292541 291123 289241 287418 286095 285320 285085 285360 285691 285214 283405 280775
53671 280775 278644 278123 279169 280616 281174 280430 278886 277303 276271 276185 277095 278425 279319 279462 279211 278800 277911
53654 277911 276319 274497 273146 272433 272136 272189 272570 272913 272839 272616 272873 273626 274219 274417 274968 276631 278997 280835
53636 280835 281541 281791 282604 284063 285322 285819 286126 287375 290023 293449 296702 299324 301397 303229 305278
53621 305278 308138 312228 317466 323371 329366 334949 339854 344329 349064 354476 360160 365343 369766 373726
53607 373726 377305 380076 381765 382801 383833 384941 385692 385944 386217 387059 388272 389048 388899 388212 387696 387475
53591 387475 387019 385991 384759 383859 383214 382252 380650 378638 376543 374340 371762 368687 365375 362420 360371
53576 360371 359200 358195 356664 354739 353141 352163 351279 349951 348418 347337 346955 347022 347315 347758 348089 347930
53560 347930 347305 346701 346433 346266 345889 345495 345596 346462 348001 350047 352413 354715 356484 357597 358411 359415
53544 359415 360815 362474 364153 365851 367960 371015 375137 379850 384680 389777 395636 402284 409184 416053
53530 416053 423349 431717 441240 451553 462495 474259 486934 500156 513354 526300 539347 553029
53518 553029 567341 581549 594962 607919 621745 637701 656191 676912 699283 722618 746341
53507 746341 770377 795036 820319 845658 870546 894934 918728 941415 962723 983188 1003415
53496 1003415 1023111 1041536 1058673 1075194 1091425 1107191 1122718 1138750 1155477 1172097 1187849
53485 1187849 1202971 1218232 1234051 1250458 1267435 1284713 1301514 1317033 1331060 1343797 1355146
53474 1355146 1364625 1371869 1376859 1379572 1379700 1376929 1371401 1363748 1354563 1343877 1331369 1317121 1301885
53461 1301885 1286338 1270355 1253448 1235724 1217855 1200075 1181810 1162463 1142150 1121411 1100678
53450 1100678 1080236 1060309 1040838 1021459 1001998 982760 964181 946507 929982 915006 901830
53439 901830 890409 880818 873451 868476 865426 863639 862846 862988 863826 865209 867533 871457 877223 884581 893234
53424 893234 902965 913471 924556 936505 949931 965150 981947 999904 1018791 1038677 1059896 1082903
53412 1082903 1107996 1135176 1164259 1194938 1226671 1258962 1291990 1326644 1363515 1402132 1441608
53401 1441608 1481865 1523729 1567986 1614792 1663867 1714638 1766233 1817978 1870105 1923415 1978040
53390 1978040 2032981 2087190 2140586 2193560 2245827 2296369 2344447 2390112 2433638 2474970 2513931
53379 2513931 2550508 2584415 2614592 2639723 2659390 2674227 2684787 2690723 2691477 2687234 2678437 2664535
53367 2664535 2644003 2615848 2580557 2539381 2493353 2443328 2390407 2335679 2279781 2223158 2166498
53356 2166498 2110486 2055299 2000809 1947226 1895176 1845194 1797405 1751637 1707565 1664816 1623126
53345 1623126 1582255 1541639 1500568 1459160 1418880 1381524 1347671 1316472 1286847 1258515 1231988
53334 1231988 1208087 1187469 1170166 1155462 1142515 1131084 1121317 1112888 1104738 1095811 1085771 1074997
53322 1074997 1064218 1054207 1045467 1038002 1031501 1025764 1020854 1016930 1014157 1012681 1012460 1013223 1014897 1017898
53308 1017898 1022572 1028432 1034420 1040069 1046059 1053594 1063498 1075954 1090695 1107217 1125041 1143953 1163946
53295 1163946 1184979 1206992 1230118 1254586 1280329 1306928 1334028 1361593 1389644 1417758 1444848
53284 1444848 1469497 1490716 1508523 1523571 1536214 1546286 1553849 1559456 1563178 1563957 1560691 1553606 1543826
53271 1543826 1531882 1517507 1500714 1482031 1461617 1439126 1414690 1389168 1363064 1335999 1307603
53260 1307603 1278217 1248260 1217657 1186388 1154983 1123919 1093071 1062324 1032209 1003317 975512
53249 975512 948333 921719 895743 870045 844265 818809 794407 771049 748075 725275 703296
53238 703296 682911 664412 647756 632757 619041 606206 594229 583420 573988 565886 559012 553111
53226 553111 547488 541229 533887 525761 517470 509435 501722 494033 485871 476942 467488 457977 448592 439273
53212 439273 430202 421776 414006 406290 398132 389899 382658 377214 373357 370058 366402 362257 357936 353334
53198 353334 347854 341325 334540 328462 323175 318105 313104 308711 305276 302391 299392 296030 292425 288711
53184 288711 285028 281661 278894 276726 274850 272881 270591 268068 265676 263755 262314 261096 259881 258557
53170 258557 257015 255241 253516 252196 251284 250505 249846 249600 249699 249412 248129 246217 244760 244465 245135 246140
53154 246140 247062 247797 248272 248273 247549 246092 244332 242930 242206 241807 241153 240182 239456 239389 239633 239462 238682 237865 237642
53135 237642 238007 238465 238734 239050 239781 240938 242178 243141 243690 243870 243843 243878 244266 245073 246008 246672 247049 247664 249133
53116 249133 251530 254325 256887 258854 260016 260158 259328 258082 257086 256474 255870 255008 254005 252973 251737 250156
53100 250156 248398 246634 244704 242458 240298 239005 238972 239798 240730 241323 241668 242069 242557 242733 242158 240932 239666
53083 239666 238798 238166 237449 236719 236151 235467 234260 232862 232212 232629 233276 233241 232678 232343 232345 232019 230979 229565
53065 229565 228110 226413 224360 222563 221843 222216 222888 223154 222925 222337 221362 220033 218734 217927 217715 217879 218210
53048 218210 218644 219120 219573 220049 220668 221433 222169 222654 222765 222563 222290 222213 222322 222313 222050 221939 222552 223774 224626
53029 224626 224149 222437 220622 219819 220203 221147 222073 222933 223799 224308 223938 222851 222080 222592 224293 226171 227269
53012 227269 227381 226954 226656 226962 227934 229270 230660 231980 233083 233638 233414 232526 231144 229228 226992 225358
52996 225358 225302 226657 228165 228849 228903 229045 229508 229996 230190 229965 229358 228666 228306 228318 228259 227871 227551 227837 228743
52977 228743 230008 231714 234083 236849 239333 241200 242662 243884 244658 244847 244765 244875 245307 245856 246285 246478
52961 246478 246437 246317 246365 246661 246972 246938 246409 245514 244437 243238 241927 240597 239357 238172 236892 235594 234685
52944 234685 234431 234363 233481 231214 228107 225397 224002 223946 224621 225393 225989 226446 226793 226858 226414 225412 223990 222379
52926 222379 220977 220314 220522 220902 220498 219246 218097 217800 218028 218075 217971 218302 219158 219907 220072 219869 219751 219787
52908 219787 219776 219670 219626 219786 220227 221096 222585 224734 227275 229711 231534 232430 232354 231543 230456 229592 229238 229391
52890 229391 229923 230657 231142 230694 229092 227174 226245 226743 227882 228720 229136 229469 229693 229477 228911 228681 229467 231384
52872 231384 234020 236770 239176 241082 242557 243688 244584 245522 246793 248360 249904 251272 252553 253656 254181
52857 254181 253849 252634 250382 246942 242926 239692 237951 236884 235166 232443 229220 225798 222241 219091
52843 219091 217140 216375 215938 215267 214658 214579 215062 215919 216962 217764 217727 216746 215528 215080 216030 218344 221256 223505
52825 223505 224215 223685 222870 222025 220475 217874 215074 213366 213249 214284 215800 217391 219009 220883 223205
52810 223205 225752 228040 229982 232034 234524 237072 238854 239169 237646 234303 229728 224938 220773 217470
52796 217470 214884 212838 211228 210081 209655 210158 211274 212247 212588 212442 212167 211954 211949 212301 212872 213276 213328 213109
52778 213109 212503 211277 209890 209519 210775 212864 214541 215446 215949 216170 215914 215318 214748 214110 212993 211579
52762 211579 210731 211000 212021 213049 213643 213690 213276 212846 213108 214344 215999 217267 217965 218613 219732 221339 223070
52745 223070 224546 225544 226060 226378 226992 228260 230126 232233 234288 236168 237728 238807 239434 239803 239923 239599
52729 239599 238982 238767 239448 240582 241210 240849 239656 237860 235663 233580 232159 231221 230007 228270 226588 225416
52713 225416 224488 223538 222911 222974 223444 223854 224241 224812 225302 225314 224971 224664 224325 223583 222506 221584 221056 220765 220636
52694 220636 220748 220957 220942 220693 220567 220821 221442 222417 223712 224993 225811 226157 226496 227143 227968 228801 229732 230816
52676 230816 231725 231961 231393 230445 229749 229574 229598 229367 228923 228704 228797 228768 228483 228567 229614 231343 233094 234794 236737
52657 236737 238726 240222 241279 242525 244170 245859 247574 249818 252526 254571 254830 253229 250390 246887
52643 246887 243373 240829 239869 239942 239842 238945 237559 236224 235174 234413 233842 233265 232621 232265 232738 234213 236393
52626 236393 238929 241616 244150 245981 246586 245832 243978 241465 238763 236311 234454 233463 233529 234659 236486
52611 236486 238275 239339 239557 239462 239658 240165 240482 240325 240125 240612 242022 243875 245485 246506 247088 247663 248552
52594 248552 249609 250332 250427 250126 249780 249363 248688 247962 247677 247977 248547 249114 249699 250301 250816 251338 252112 252969 253216
52575 253216 252379 250768 249059 247665 246777 246644 247318 248308 248873 248708 248100 247509 247167 246983 246602 245656 244142
52558 244142 242469 241006 239781 238738 237972 237456 236803 235695 234397 233515 233340 233803 234858 236448 238120 239204
52542 239204 239541 239678 240207 241179 242287 243284 244044 244473 244602 244713 245233 246474 248383 250372 251557 251491 250659
52525 250659 249952 249669 249423 249012 248851 249306 250150 251021 252023 253375 254785 255793 256608 258029 260461 263450
52509 263450 266290 268716 270889 273017 275136 276962 277911 277547 276064 273991 271385 267866 263650 259931 257741
52494 257741 256756 255786 254258 252669 251702 251459 251604 251772 251685 251261 250813 250830 251440 252354 253377 254674 256344 258101
52476 258101 259569 260690 261608 262368 262941 263434 264082 265066 266390 267874 269274 270597 272243 274550 277224 279581
52460 279581 281424 283258 285386 287204 287720 286546 284078 280985 277815 274870 272102 269259 266373 263887
52446 263887 262032 260391 258446 256319 254533 253257 252296 251692 251780 252574 253506 253909 253506 252503 251436 250811
52430 250811 250574 250096 249005 247842 247402 247671 248015 248253 248782 249624 250185 250286 250665 252058 254291 256753 259262
52413 259262 262000 264940 267929 271121 274900 279522 285181 292207 300781 310435 320125 328706 335184 338760
52399 338760 339094 336532 331828 325632 318398 310660 303171 296683 291669 288116 285521 283295 281290 279804
52385 279804 278930 278224 277243 276200 275780 276405 277876 279672 281459 283341 285704 288656 291669 294103 296145
52370 296145 298789 302590 306859 310469 313136 315422 317694 319593 320503 320157 318819 317183 315967 315317 314743
52355 314743 313908 313198 313125 313481 313710 313911 314710 316118 317258 317477 317100 316862 317184 318332 320666 324169 328153
52338 328153 331960 335737 340022 344860 349874 355083 361010 367902 375328 382818 390569 399318 409629 421366
52324 421366 433718 445816 457561 469872 483770 499116 514496 528555 541219 553473 566172
52313 566172 579348 592478 605079 617044 628709 640645 653227 666318 679476 692395 704949
52302 704949 716941 728121 738517 748418 757905 766683 774502 781408 787333 791796 794353 795095 794331 791999
52288 791999 787849 782075 775235 767644 759383 750968 743359 737068 731670 726551 721817 718257 716677 717448
52274 717448 720315 724414 728848 733583 739425 746819 755051 763112 770944 779213 788066 796857 805079 812900
52260 812900 820638 828379 836448 845690 856719 869094 881675 893734 905324 916551 926915 935608
52248 935608 942240 946923 949642 949948 947554 942945 936941 929714 920785 910122 898716 887741 877481
52235 877481 867488 857406 847209 836929 826727 817055 808190 799686 790903 782029 773957 767073 760928
52222 760928 755303 750822 747988 746143 744098 741583 739516 738915 739969 742126 744657 747072 749287 751545
52208 751545 754099 756978 760089 763274 766091 767828 768198 767974 768462 770278 772943 775736 778613 782047 786225
52193 786225 790707 794851 798383 801579 804944 808675 812379 815348 817158 817885 817734 816655 814483 811275 807220
52178 807220 802248 796061 788644 780540 772505 765080 758566 753145 748784 745226 742373 740561 740164 741062 742826
52163 742826 745347 748785 752869 756769 759893 762502 765202 768134 770931 773200 774780 775682 776106 776387 776771
52148 776771 777422 778770 781398 785208 789088 791963 793939 795856 797941 799613 800497 800880 801025 800841 800514 800887
52132 800887 802787 806348 811291 817445 824774 833388 843895 857252 873755 892566 912658 933855 956330
52119 956330 979489 1002226 1024259 1046437 1069456 1092832 1115382 1136265 1155249 1172288 1187238
52108 1187238 1199923 1210252 1218321 1224508 1229373 1233363 1236686 1239496 1242047 1244510 1246672 1247937 1247664 1245629
52094 1245629 1242184 1237836 1232514 1225305 1215139 1201761 1185922 1168714 1150946 1133171 1115932 1099762
52082 1099762 1085057 1072121 1061287 1052852 1046864 1042992 1040573 1038885 1037604 1037099 1038149 1041246 1046227
52069 1046227 1052612 1060097 1068561 1077732 1087171 1096687 1106547 1117105 1128228 1139197 1149204 1157952 1165805
52056 1165805 1173420 1181212 1189067 1196467 1202913 1208267 1212650 1215926 1217358 1216018 1211637 1204888 1196645 1187070
52042 1187070 1175678 1162307 1147767 1133322 1119644 1106445 1093126 1079695 1066976 1055917 1046721
52031 1046721 1038688 1030903 1022894 1014577 1005782 996254 986181 976318 967274 958834 950289 941341 932371 923861
52017 923861 915892 908329 901183 894618 888757 883662 879284 875261 870967 866031 860636 855020 848801 841191
52003 841191 831846 821093 809253 796227 782012 767243 752783 738981 725712 713078 701672 692042
51991 692042 684129 677341 670999 664669 658236 651764 645225 638360 630849 622550 613432 603350 592111 579794
51977 579794 566788 553457 539972 526659 514401 504413 497383 492801 489292 485838 482782 481523 483248
51964 483248 488103 495465 504513 514309 523825 532459 540316 547527 553453 557145 558384 557586 554763 549489
51950 549489 542144 534342 527568 522016 517331 513888 512560 513680 517065 522876 531562 542948 556190 570796
51936 570796 587014 604979 624107 643591 662906 681432 698140 712286 724148 734553 743833 751659
51924 751659 757681 761672 762872 759731 750741 735475 714774 690105 662935 634597 606408 579677
51912 579677 555539 534762 517650 504017 493265 484660 477785 472756 469929 469398 470921 474242 479283
51899 479283 485890 493476 500983 507070 510381 509989 505913 499098 490667 481182 470807 460035 449880 441216
51885 441216 434215 428614 424362 421753 421033 422176 425066 429725 436236 444549 454373 465160 476202 486848
51871 486848 496686 505431 512666 517903 520937 521884 520755 517249 511217 503142 493943 484512 475775 468880
51857 468880 464676 462885 462334 462220 462698 464037 465696 466692 466524 465270 463035 459753 455495 450503 444960
51842 444960 439055 433228 427957 423294 418954 414801 410940 407365 403984 401072 399279 399019 400091 401965
51828 401965 404170 406349 408249 409780 410813 410938 409781 407583 405003 402339 399452 396589 394594 393939 394170
51813 394170 394800 396159 398715 402019 405088 407613 409974 412181 413615 413878 413143 411528 408835 405259 401715
51798 401715 399009 397097 395510 394097 392919 391769 390353 388755 387262 385873 384358 382760 381401 380428
51784 380428 379740 379401 379741 380881 382460 383976 385173 385975 386335 386472 387089 388925 392029 395806 399923 404925
51768 404925 411669 420286 430093 440490 451510 463264 475095 485575 493213 497013 496641 492497 485613
51755 485613 477108 467652 457558 447204 437008 427144 417774 409598 403567 399813 397301 394854 392242
51742 392242 390031 388759 388598 389572 391699 395024 399796 406405 414898 424696 434904 444577 452526 457540
51728 457540 459477 459866 460729 462904 466012 469701 473939 477993 480145 478958 474400 467470 459362 451428 445219
51713 445219 441610 439869 438175 435208 431016 426498 422494 419426 417488 416882 417808 420157 423241 426029 427836
51698 427836 428646 428717 428108 426856 425414 424565 424816 426059 427805 429562 430917 431370 430361 427661 423799 419820
51682 419820 416379 413226 409928 406929 405373 405820 407753 410520 414159 418777 423657 427736 430839 433950
51668 433950 438248 444310 452164 461631 472458 484272 496345 507242 514989 518125 516642 511628 504131
51655 504131 494790 484448 474490 466370 461053 458938 459817 462705 466010 468165 468096 465245 459563 451618 442388
51640 442388 432750 423272 414400 406468 399475 393218 387780 383600 381013 380023 380542 382372 384869 387172 389071
51625 389071 391180 393859 396310 397236 396194 393843 391028 388089 385047 381995 379122 376557 374309 372297
51611 372297 370344 368205 365621 362445 358936 355879 354119 353785 354179 354598 355066 356178 358462 362121 367196
51596 367196 373721 381813 391726 403461 416083 427630 436086 440396 440459 436650 429912 422079 415268 410624
51582 410624 407951 406639 406616 408280 411942 417712 425763 436329 449347 464195 479851 495375 510390
51569 510390 525174 540274 555969 571984 587553 601806 614494 626662 640550 658441 681495
51558 681495 709641 742326 778953 818579 859474 899140 934769 963842 984727 996907 1000615 996263
51546 996263 984276 965218 939738 908464 872341 833123 793101 754062 716674 681064 647734
51535 647734 617607 591256 568401 548304 530691 516175 505681 499269 495652 493055 490526 488173
51523 488173 486209 484198 481472 477892 473797 469341 464291 458472 452121 445741 439714 434143 428902 423829
51509 423829 418949 414507 410690 407328 404075 400861 397997 395703 393725 391559 388991 386237 383582 381101
51495 381101 378802 376872 375612 375140 375272 375690 376127 376419 376483 376366 376247 376355 376823 377564 378245 378456 377999 376996
51477 376996 375558 373477 370482 366838 363402 360869 359171 357759 356276 354646 352772 350629 348665 347618
51463 347618 347706 348283 348553 348360 347978 347360 346082 344116 342227 341281 341270 341342 340845 340219 340782 343647 348903 355783
51445 355783 363571 372342 382843 395690 410643 426495 441496 453922 462632 467496 469377 469548 469053
51432 469053 468539 468281 467889 466091 461556 454268 445713 437415 429769 422694 416786 412877 410636 408602 405813
51417 405813 402702 400143 398317 396926 395875 395157 394483 393569 392501 391372 389923 388119 386770 386908 388623
51402 388623 391108 393842 397062 400900 404635 407223 408407 409059 410471 413355 417416 421869 426443 431829
51388 431829 439096 448793 460750 474546 489997 507392 527588 551741 580646 614434 653069 696873
51376 696873 746175 800553 858651 918370 976753 1030091 1075076 1110084 1134941 1149499 1153151 1145788
51364 1145788 1128438 1102534 1069085 1028999 983719 934939 883917 831564 779130 728368 680949
51353 680949 637918 599681 566287 537580 513164 492356 474399 458836 445564 434366 424613 415717
51341 415717 407667 400749 394865 389678 385310 382273 380539 379322 377970 376529 375063 373049 370002 366405
51327 366405 363493 362243 362860 364971 367874 370776 373190 375135 376758 377920 378344 377988 377054 375795 374534
51312 374534 373608 373048 372528 371878 371354 371073 370556 369250 367267 365109 362872 360324 357701 355849 355346 355872
51296 355872 356497 356350 354956 352375 349225 346351 344263 342962 342282 342195 342720 343785 345293 347318 350209 354497
51280 354497 360523 367947 375700 382670 388373 392842 395989 397458 397116 395470 393474 392010 391478 391706 392286
51265 392286 393123 394562 396898 399889 402963 405652 407569 408249 407502 405815 403843 401484 397954 392965 387311
51250 387311 382052 377518 373453 369763 366628 364020 361575 359015 356449 354228 352679 352004 352198 352972 353844
51235 353844 354415 354509 354036 352899 351216 349616 349012 349827 351475 352890 353597 354112 355226 357145 359517 361996
51219 361996 364421 366576 368195 369330 370391 371639 372804 373354 373008 371892 370364 368891 368045 368368 370048
51204 370048 372745 375786 378569 380782 382273 382891 382619 381816 381117 380978 381414 382162 382922 383415 383486 383378 383705
51187 383705 384885 386699 388584 390227 391602 392596 392992 392840 392541 392385 392199 391568 390335 388781 387390 386433
51171 386433 385767 385096 384494 384511 385579 387434 389373 391057 392775 394930 397489 400089 402371 404097 405054 405086
51155 405086 404167 402398 399896 396714 392793 388037 382555 376918 372039 368631 366734 365775 365117 364551 364223
51140 364223 364153 364025 363639 363431 364182 366112 368568 370704 372206 373139 373530 373469 373415 373929 375155 376934 379335
51123 379335 382629 386755 391165 395268 398657 400942 401901 401984 402178 402998 403908 404123 403768 403824 404996 407023 409113
51106 409113 410716 411697 412075 411921 411516 411293 411501 412025 412662 413437 414413 415281 415438 414649 413382 412352 411870 411834
51088 411834 412143 412822 413710 414292 414027 412828 411263 410171 409908 409978 409638 408945 408834 410014 412109 414175 415742
51071 415742 417032 418492 420586 423830 428434 433913 439554 445306 451832 459758 469414 481380 496631 515575
51057 515575 537019 558318 576700 590753 601102 609800 618938 629700 642432 656882 671807 684893
51045 684893 694077 699133 701286 701204 698058 690810 679728 666252 652006 638403 626648 617333 610037
51032 610037 603618 596818 588492 577858 565185 552104 540659 531843 525210 519812 515224 511633 509254
51019 509254 507916 507324 507593 509214 512282 516092 520016 524592 531113 540125 550942 562740 575340 588577
51005 588577 601721 614117 625912 637492 648623 658741 667691 675496 681703 685784 688041 689319 689810
50992 689810 688859 686128 682290 678314 674581 671067 668005 665972 665446 666631 669725 675132 683105 693036 703255
50977 703255 712027 718980 725303 732402 740762 750488 762441 778109 798422 823205 851819 883829 919038
50964 919038 957370 998895 1043651 1091312 1141246 1192832 1245402 1297922 1349099 1397832 1443287
50953 1443287 1484626 1521149 1552647 1579159 1600358 1615725 1625450 1630603 1632269 1631039 1627579 1623144
50941 1623144 1619000 1615560 1612305 1608164 1601714 1591514 1576992 1559010 1539182 1518612 1497531 1475899
50929 1475899 1453840 1431415 1408298 1383890 1357617 1329087 1298152 1264992 1230135 1194300 1158123
50918 1158123 1121951 1085971 1050611 1016735 985244 956521 930453 906921 885923 867175 850050
50907 850050 834164 819755 807218 796449 786851 777801 768939 760247 752032 744562 737485 730017 722106
50894 722106 715049 710376 708276 707692 707723 708216 708979 709392 709180 708941 709406 710663 712566 715322 719000 722894
50878 722894 726272 729657 734487 741352 749292 757103 764643 772496 780988 790183 800454 812368 826113
50865 826113 841505 858437 876912 896824 918271 942061 969264 1000162 1034145 1070899 1111164
50854 1111164 1156035 1205986 1261071 1321792 1389197 1464065 1546310 1635256 1730244 1830950 1937188
50843 1937188 2048397 2163208 2279559 2395308 2508563 2617295 2718905 2810551 2889909 2955333
50833 2955333 3005360 3038572 3054297 3053344 3037761 3009892 2971807 2925680 2874422 2821647 2770942 2725166
50821 2725166 2686225 2655003 2631194 2613435 2599923 2588839 2578022 2564607 2545671 2519366 2485056
50810 2485056 2442435 2391159 2331518 2264778 2192375 2115195 2034091 1950730 1867361 1785999 1708240
50799 1708240 1635474 1568577 1507482 1451723 1401470 1357577 1320635 1290500 1266727 1248862 1236142
50788 1236142 1227488 1222065 1219471 1219190 1220281 1221924 1223889 1226138 1228198 1229264 1228760 1226552 1222784 1217785
50774 1217785 1212010 1205755 1198888 1190909 1181257 1169530 1155685 1140178 1123760 1106928 1089644 1071682
50762 1071682 1053190 1034755 1017047 1000509 985332 971541 959089 947958 938234 930150 924098 920466
50750 920466 919327 920350 923223 928191 935983 947183 961864 979919 1001547 1027284 1057631 1092656
50738 1092656 1131815 1174206 1219220 1266932 1317625 1370947 1425918 1481819 1538616 1596288 1654130
50727 1654130 1711160 1766973 1821752 1875462 1927451 1976828 2022854 2064775 2101492 2131521 2153173
50716 2153173 2164704 2164606 2152117 2127711 2093146 2051076 2004518 1956486 1909741 1866551 1828474 1796374
50704 1796374 1770658 1751423 1738287 1730173 1725492 1722685 1720602 1718362 1714926 1708816 1698307 1682003 1659328
50691 1659328 1630504 1596259 1557840 1517299 1477148 1439156 1403620 1370228 1339472 1312728 1291044
50680 1291044 1274466 1262713 1255825 1253789 1256073 1262108 1272080 1286760 1306612 1331324 1359993 1391314
50668 1391314 1423652 1455444 1485761 1514314 1540865 1564903 1586035 1604561 1621459 1637800 1654196
50657 1654196 1670710 1687133 1703267 1719046 1734580 1750190 1766263 1783010 1800490 1819078 1839716
50646 1839716 1863447 1890741 1921554 1955862 1993688 2034546 2077465 2121800 2167606 2214880 2262807
50635 2262807 2310104 2355732 2398863 2438494 2473759 2504710 2532321 2557722 2581732 2604801 2626378
50624 2626378 2643681 2651574 2644752 2620885 2582127 2533942 2482514 2432782 2387961 2350025 2320213 2299167
50612 2299167 2286824 2282317 2284015 2289863 2297880 2306357 2313483 2316941 2314265 2303648 2284157 2255124 2215834
50599 2215834 2166227 2107653 2042555 1973423 1902287 1830932 1761101 1694280 1631428 1572915 1518542
50588 1518542 1467673 1419711 1374546 1332466 1293678 1258074 1225427 1195622 1168750 1145172 1125436
50577 1125436 1109816 1097943 1089108 1082934 1079526 1079045 1081489 1086910 1095402 1106617 1119623 1133534 1148135
50564 1148135 1163641 1180104 1197376 1215591 1235281 1256963 1280781 1306597 1334191 1363267 1393465
50553 1393465 1424446 1455929 1487604 1519085 1549962 1579764 1607965 1634309 1659289 1684048 1709664
50542 1709664 1736756 1766036 1798962 1837269 1881800 1932171 1987737 2048537 2115173 2188219 2268048
50531 2268048 2354893 2448653 2548818 2654997 2767296 2885665 3008959 3135141 3262404 3389539
50521 3389539 3515094 3636689 3751416 3856516 3949431 4027741 4089459 4133171 4157518 4160944 4142458
50510 4142458 4102551 4042978 3965796 3873134 3767839 3653787 3535330 3416665 3301812 3194800
50500 3194800 3099493 3019225 2956531 2912955 2888828 2883325 2894945 2921950 2962268 3012850 3069237
50489 3069237 3125812 3176552 3215544 3237071 3235936 3208615 3154539 3076091 2977216 2862136 2735333
50478 2735333 2601963 2467295 2335400 2208595 2088253 1975831 1872845 1780031 1696954 1622656
50468 1622656 1556516 1498262 1447238 1402060 1361215 1323798 1289418 1257733 1228592 1202568 1180775
50457 1180775 1163888 1151637 1143356 1138569 1136973 1138308 1142557 1149818 1159677 1171173 1183828 1198293 1215470
50444 1215470 1235339 1257192 1280604 1305270 1329939 1352416 1370976 1385368 1396253 1404216 1409615 1412963
50432 1412963 1414956 1416184 1417035 1417864 1419081 1421054 1423926 1427477 1431329 1435484 1440669 1448032 1458616 1473150
50418 1473150 1492051 1515358 1542979 1575385 1613736 1658755 1709624 1764663 1823044 1885168 1951216
50407 1951216 2020006 2089511 2157902 2223684 2285378 2341705 2391934 2435617 2471980 2499695 2517107
50396 2517107 2522607 2515108 2494399 2460824 2414603 2355998 2286498 2209449 2129060 2048875 1971394 1898652
50384 1898652 1832542 1774676 1726403 1688892 1662740 1647490 1641962 1645107 1656194 1674157 1697138 1722745
50372 1722745 1748316 1770757 1786652 1793120 1788637 1772941 1746309 1709316 1663254 1610366 1553340 1494520
50360 1494520 1435666 1378261 1323705 1273077 1226827 1184865 1146885 1112551 1081528 1053670 1029294
50349 1029294 1009169 994054 984202 979123 977602 977792 977445 974374 967088 955313 940014 922808 905214
50336 905214 888416 873498 861463 852717 846792 842892 840603 839802 840123 841071 842681 845551 850067 855930
50322 855930 862601 869788 877203 884176 889916 894083 896887 898728 899962 900850 901418 901377 900424 898772 897217
50307 897217 896543 896858 897567 898079 898442 899180 900540 902210 903909 905940 908841 912764 917602 923522 930822 939225
50291 939225 947885 956233 964405 972784 981521 990478 998956 1005245 1007175 1003733 995885 985524 974092 962577
50277 962577 952116 943662 937231 932201 928326 925843 924638 924013 923477 923253 923740 924827 925973 926726 927090
50262 927090 927623 929296 932949 938720 946138 954854 965087 977352 991947 1008724 1027097 1046113 1064690
50249 1064690 1081985 1097600 1111611 1124493 1136864 1148978 1160567 1171426 1181919 1192370 1201930
50238 1201930 1208600 1210657 1207702 1200228 1188697 1173512 1155468 1135653 1115000 1094471 1075557 1059972
50226 1059972 1048537 1040539 1034184 1027331 1017787 1003618 983843 958899 930191 899308 867891 837857
50214 837857 810958 787847 767909 750271 734713 721484 710649 702078 695721 691325 687938 684272
50202 684272 679756 674851 670194 665837 661568 657594 654447 652247 650405 648156 645322 642463 640292 638898
50188 638898 637628 635797 633374 630720 627857 624506 620895 617972 616393 615551 614079 611304 607927 605328
50174 605328 604396 605058 606741 609120 612323 616394 620818 624876 628461 632198 636702 642053 648023 654429 661087
50159 661087 667788 674482 681184 687647 693724 700218 708660 719681 732165 744572 756592 768763 780982
50146 780982 792519 803412 814734 827198 840414 854023 868901 886641 908225 933693 962844
50135 962844 995625 1031666 1069729 1107944 1144800 1179943 1213883 1246878 1278425 1308045 1336012
50124 1336012 1362650 1387043 1407099 1420880 1427308 1425671 1415398 1396730 1371049 1340067 1304965 1266585
50112 1266585 1226013 1184627 1143889 1105347 1070359 1039410 1011942 987191 964911 944948 926512
50101 926512 908467 890235 872021 854201 836942 820392 804859 790667 777983 766837 757264 749462
50089 749462 743822 740582 739385 739490 740519 742634 745792 749257 752245 754649 756571 757518 756818 754849 753077
50074 753077 752591 753049 753321 752721 751280 749229 746788 744390 742566 741419 740407 738843 736525 733772 730924
50059 730924 728036 725062 722107 719320 716688 714191 712128 710982 710909 711515 712282 712998 713727 714566 715708 717646
50043 717646 721108 726679 734421 743720 753619 763552 773847 785241 797813 810667 822786 833920 844491
50030 844491 854951 865538 876381 887456 898501 909223 919501 929307 938719 948226 958655 970443
50018 970443 983320 997012 1011843 1027985 1044500 1059955 1073924 1087035 1099448 1110211 1118555 1125102
50006 1125102 1131190 1137429 1143479 1148794 1152870 1154840 1153467 1147781 1137526 1123134 1105546 1085935 1065155
49993 1065155 1043356 1020374 996517 972629 949425 927097 905672 885382 866372 848263 830351
49982 830351 812189 793820 775442 757099 738813 720885 703955 688721 675597 664532 655156 647130
49970 647130 640409 635028 630628 626396 621753 617072 613411 611447 610881 610997 611454 612318 613587 615158 617216
49955 617216 620293 624868 631157 639285 649321 661061 674096 688145 702957 717704 730904 741394
49943 741394 749182 755035 759457 762505 764330 765208 764814 762011 755765 746043 733514 718651 701643 683185
49929 683185 664805 648033 633386 620437 608827 598879 591148 585656 581833 579147 577533 577204 578225
49916 578225 580332 583003 585663 588027 590328 593088 596590 600747 605519 611144 617802 625318 633535 642754
49902 642754 653378 665303 678083 691616 706043 720813 734452 745629 754120 760378 764538 766339
49890 766339 765776 763208 758786 752255 743437 732605 720287 707007 693252 679364 665365 651271 637639
49877 637639 625366 614721 605038 595776 587444 580905 576024 571674 567170 563086 560512 559982 561340 564097
49863 564097 567536 570918 574206 578498 585198 594708 606208 618669 631620 644910 658289 671610 685100
49850 685100 698903 712326 723885 732293 737424 740324 742324 743986 744737 743433 739349 732583 723600 712684
49836 712684 700096 686571 673276 661232 650932 642450 635524 629563 624014 619022 615455 614003 614464
49823 614464 616132 618608 621889 625925 630689 636674 644812 655641 668716 682819 696453 708199 717229
49810 717229 723804 728978 733540 737433 740350 742391 743675 743618 741227 736059 728458 718926 707839 695870
49796 695870 684095 673291 663320 653461 643190 632509 621792 611587 602431 594596 588080 582903 579265
49783 579265 577189 576205 575644 575166 574804 574507 574011 573258 572763 573419 575976 580713 587414 595484 604182 612927
49767 612927 621490 629884 638067 645801 652833 659073 664531 669106 672579 674875 676190 676723 676345 674579 670881
49752 670881 664860 656369 645631 633320 620357 607561 595588 585098 576653 570275 565325 561079 557327
49739 557327 554268 551902 549822 547666 545613 544339 544500 546279 549309 552970 556741 560349 563676 566726
49725 566726 569755 573330 578140 584684 593166 603526 615441 628280 641239 653617 664960 674913 683018
49712 683018 688726 691718 692241 691029 688814 685842 681915 676802 670487 663082 654800 646132 637824 630440
49698 630440 624071 618653 614371 611437 609550 607957 606208 604641 604003 604783 607010 610455 614812 619771 625185
49683 625185 631159 637842 645150 652789 660584 668723 677767 688506 701675 717489 735245 753356 769796
49670 769796 782655 790685 793828 793344 791113 788565 786306 784701 784308 785463 787763 790438 792941 794568
49656 794568 793621 787873 776452 760867 743725 726676 709987 693675 678349 664945 654174 646308
49644 646308 640982 637113 633526 629989 627346 626487 627482 629795 632792 635703 637563 637799 636746 635063 632728
49629 632728 629081 623880 617839 612008 606935 602532 598442 594401 590531 587442 585710 585062 584344 582597 580022
49614 580022 577618 576050 575235 574885 574994 575652 576762 578200 580035 582299 584659 586561 587691 588154 588330 588693
49598 588693 589636 591139 592644 593581 594090 594884 596288 597802 598880 599727 600897 602340 603396 603721 603669 603643 603534
49581 603534 603087 602473 602175 602413 602891 603027 602434 601396 600982 602384 605893 610737 616111 622150 629548 638457
49565 638457 648235 658269 668554 679276 690076 700014 708172 714114 717853 719575 719520 717949 714994 710500
49551 710500 704329 697035 689950 684179 679623 675564 672189 670720 671618 673399 674005 673018 671715 671154 671190 671460
49535 671460 672341 674379 677415 680935 684966 690083 696790 705380 716191 729379 744489 760774 778035
49522 778035 796674 816701 836962 855549 870756 881581 887772 889900 889331 887733 886338 885649 885803
49509 885803 887039 889808 894501 901018 908276 914053 915679 911421 901436 887323 870804 853022 834966
49496 834966 817960 803212 791011 780756 771802 764045 757682 752707 748807 745620 742988 741104 740385
49483 740385 741013 742551 744240 745786 747601 750122 753120 755920 758068 759478 760152 760188 760057 760427 761564 763208
49467 763208 765151 767554 770495 773536 776106 778121 779906 781702 783614 785855 788502 791001 792448 792520 791641
49452 791641 789998 786903 781700 774950 768184 762464 757629 752928 748019 743290 739520 737251 736346 736207 736698
49437 736698 738618 742859 749232 756692 764657 773393 783055 793169 803461 814449 826570 839248 851512
49424 851512 863173 874804 886915 899894 914267 929831 944327 954042 956354 951400 941184 927848
49412 927848 913153 898866 886662 877654 872401 871245 874205 880637 889408 899643 911206 924485 939723
49399 939723 956467 973637 990294 1006348 1022228 1037856 1052369 1065036 1076046 1085966 1094721 1101513
49387 1101513 1105558 1106570 1104674 1100291 1093963 1085893 1075733 1063308 1049492 1035862 1023448 1012271
49375 1012271 1002199 993589 986764 981411 977045 973851 972560 973556 976469 980561 985133 989545 993241 995852
49361 995852 997072 996463 993697 989035 983191 976554 968845 959749 949594 939247 929628 921558 915730 912315
49347 912315 910636 909695 909071 909010 909722 910997 912541 914154 915397 915592 914536 912873 911299 909622 907055 903403
49331 903403 899561 896775 895737 896373 898244 901053 904979 910495 917664 925644 933251 940123 947085 955297
49317 955297 965403 977605 992038 1008338 1024818 1038569 1046877 1048735 1045031 1037421 1027171 1014969
49305 1014969 1001472 987520 973734 960286 947388 935750 926053 918002 910493 902954 896137 891203
49293 891203 888367 886895 886181 886206 886855 887396 887032 885717 884025 882342 880486 878074 874969 871390 867803 864792
49277 864792 862775 861797 861833 863251 866621 871891 878210 884834 891815 899262 906310 911572 914597 916189 917194
49262 917194 917694 917637 917509 917896 918959 921002 925154 932785 944354 959306 976843 996299 1016923 1037748
49248 1037748 1057399 1073580 1083221 1084150 1076751 1063426 1046558 1027712 1008428 990418 974381 959578
49236 959578 945257 931928 920734 912178 906121 902528 901460 902593 905340 909306 914192 919530 924992
49223 924992 930725 936864 943020 948811 954649 961280 968530 975192 980282 983943 987019 990172 993523 996747
49209 996747 999408 1001547 1004060 1008178 1014487 1022767 1032741 1044491 1057992 1072747 1088154 1103911 1119761
49196 1119761 1135169 1149609 1162980 1175368 1186533 1196022 1203782 1210380 1216563 1222754 1228940 1234786 1239812
49183 1239812 1243748 1246933 1250301 1254796 1260890 1268788 1279050 1292710 1310651 1333083 1359855 1391159
49171 1391159 1427543 1469035 1514254 1560249 1602904 1637566 1660067 1668210 1662897 1647884 1628148 1608031
49159 1608031 1590225 1575713 1564302 1555348 1548399 1543369 1540129 1537982 1535859 1533255 1530854 1529906 1530949
49146 1530949 1533493 1536973 1541492 1547276 1553895 1560666 1567661 1575602 1584737 1594440 1604115 1613945 1624515 1636124
49132 1636124 1648778 1662451 1676998 1692084 1707445 1722948 1738204 1752548 1765747 1778429 1791527
49121 1791527 1805551 1820609 1836706 1853697 1871480 1890703 1912936 1939587 1970935 2006791 2047836
49110 2047836 2095885 2153274 2222782 2307710 2410542 2530329 2661092 2793032 2916547 3027380
49100 3027380 3129406 3230973 3335140 3431708 3500039 3522049 3494261 3428696 3343330 3251193 3155780
49089 3155780 3053823 2941570 2819712 2694009 2572262 2460921 2363738 2282091 2215490 2162072
49079 2162072 2119464 2085572 2058632 2036979 2019223 2004451 1991845 1980296 1968816 1957228 1945995
49068 1945995 1935433 1925486 1916270 1908282 1901854 1896701 1892328 1888764 1886556 1885930 1886137 1885904 1884647 1883069
49054 1883069 1882360 1883013 1884724 1887287 1890979 1895972 1901950 1908713 1916762 1926833 1939077 1953044 1968197
49041 1968197 1983915 1999132 2012515 2023098 2030449 2034368 2034971 2033160 2030547 2028626 2028226 2029772 2033572
49028 2033572 2039448 2046425 2053167 2058757 2062920 2065751 2067576 2068960 2070417 2072021 2073624 2075465 2078230 2082308
49014 2082308 2087399 2093155 2099918 2108266 2118007 2128229 2138467 2149225 2161073 2173688 2186328 2198876
49002 2198876 2211828 2225320 2238687 2250961 2261451 2269866 2276394 2281708 2286395 2290132 2291809 2290710 2287337
48989 2287337 2282928 2278454 2274208 2270047 2265725 2261125 2256375 2251646 2246876 2241906 2236910 2232356 2228458 2225013
48975 2225013 2221838 2218876 2215729 2211634 2206287 2200229 2194030 2187522 2180330 2172796 2165801 2159893 2155144 2151590
48961 2151590 2149145 2147261 2145418 2144090 2144536 2147409 2152110 2157737 2164253 2172455 2183162 2196706 2212924
48948 2212924 2231322 2251336 2272593 2294880 2317941 2341596 2366005 2391460 2417902 2445097 2473294
48937 2473294 2503217 2535216 2569014 2604558 2642457 2683043 2725522 2768827 2813026 2859067 2907166
48926 2907166 2956294 3005467 3054860 3105250 3156924 3209625 3263161 3317396 3371762 3425339 3477549
48915 3477549 3528378 3577805 3625457 3671026 3714729 3757016 3797993 3837492 3875683 3913177 3950382
48904 3950382 3986974 4022246 4055787 4087667 4118087 4147191 4175244 4202627 4229360 4254709 4277397
48893 4277397 4296259 4310750 4321027 4327680 4331244 4331802 4329065 4322915 4313674 4301693 4286855 4268866 4247970
48880 4247970 4224925 4200163 4173431 4144467 4113528 4080738 4045257 4005819 3962091 3914885 3864944
48869 3864944 3812229 3756758 3699529 3641937 3584651 3527752 3471876 3418423 3368431 3321770 3277739
48858 3277739 3236050 3196918 3160554 3127019 3096390 3068691 3043624 3020732 2999890 2981457 2965890
48847 2965890 2953350 2943724 2936846 2932584 2930860 2931708 2935286 2941724 2950857 2962138 2974831 2988353 3002550
48834 3002550 3017716 3034325 3052631 3072468 3093366 3114848 3136494 3157806 3178293 3197964 3217603
48823 3217603 3238196 3259970 3282197 3304020 3325272 3346430 3368064 3390555 3413978 3437921 3461541
48812 3461541 3484198 3505945 3527153 3547802 3567608 3586814 3606380 3627220 3649589 3673261 3697946
48801 3697946 3723329 3749086 3775188 3802045 3830087 3859184 3888543 3917071 3943869 3968605 3991512
48790 3991512 4012875 4032571 4050361 4066554 4081944 4096919 4111003 4123364 4133300 4139946 4141968 4138088
48778 4138088 4127827 4111396 4089063 4061055 4027961 3990801 3950612 3908105 3863668 3817511 3769828
48767 3769828 3720929 3671008 3619729 3566490 3511464 3456087 3401999 3349682 3298670 3248860 3200869
48756 3200869 3155035 3110870 3067884 3026398 2987093 2950178 2915556 2883545 2854772 2829244 2806008
48745 2806008 2783931 2762562 2742147 2723082 2705641 2690092 2676737 2665720 2656913 2650000 2644515 2639815
48733 2639815 2635281 2630796 2626827 2623728 2621059 2618025 2614657 2612100 2611464 2612690 2614814 2617034 2619106 2620892
48719 2620892 2622175 2623001 2623757 2624652 2625409 2625671 2625532 2625499 2626096 2627632 2630221 2633760 2637910 2642193 2646203 2649806
48703 2649806 2653284 2657166 2661696 2666382 2670376 2673473 2676546 2680719 2686231 2692431 2698874 2706083 2715046 2726089
48689 2726089 2738410 2750675 2761902 2771854 2780805 2789156 2797297 2805710 2814931 2825239 2836400 2847861
48677 2847861 2859237 2870445 2881299 2891218 2899589 2906302 2911643 2915674 2918095 2918732 2917803 2915465 2911369 2904845
48663 2904845 2895239 2881830 2863781 2840624 2812693 2780778 2745525 2707486 2667435 2626107 2583773
$$ [...]
##END NTUPLES=NMR SPECTRUM
##END=
