
##TITLE=UV1111_M2_1290-1353_7180813_8xUUjKTMku
##JCAMPDX= 6.0         $$ Bruker NMR JCAMP-DX V2.0
##DATA TYPE= NMR SPECTRUM
##DATA CLASS= NTUPLES
##ORIGIN= BRUKER
##OWNER= Administrator
$$ 1.72 TOPSPIN		Version 2.1
$$ 2012-12-05 03:05:15.323 -0500  Administrator@X
$$ Compression mode = diff/dup
##.OBSERVE FREQUENCY= 400.02188249412
##.OBSERVE NUCLEUS= ^1H
##.ACQUISITION MODE= SIMULTANEOUS (DQD)
##.ACQUISITION SCHEME= undefined
##.AVERAGES= 8
##.DIGITISER RES= 22
##SPECTROMETER/DATA SYSTEM= spect
##.PULSE SEQUENCE= zg30
##.SOLVENT NAME= COFFEE_meoh
##.SHIFT REFERENCE= INTERNAL, COFFEE_meoh, 1, 14.98509
##AUDIT TRAIL= $$ (NUMBER, WHEN, WHO, WHERE, PROCESS, VERSION, WHAT)
$$ ##TITLE= Audit trail, TOPSPIN		Version 2.1
$$ ##JCAMPDX= 5.01
$$ ##ORIGIN= Bruker BioSpin GmbH
$$ ##OWNER= Administrator
$$ $$ E:\/data/COFFEE/nmr/UV1111_M2_1290-1353_7180813_8xUUjKTMku/10/pdata/1/auditp.txt
$$ ##AUDIT TRAIL=  $$ (NUMBER, WHEN, WHO, WHERE, PROCESS, VERSION, WHAT)
(   1,<2012-12-05 03:05:07.120 -0500>,<Administrator>,<X>,<go>,<TOPSPIN 2.1>,
      <created by zg
	started at 2012-12-05 03:04:01.042 -0500,
	POWCHK enabled, PULCHK disabled,
       configuration hash MD5:
       86 BA 57 50 F2 9D 5C 9B 26 00 A9 28 5F 66 2E 89
       data hash MD5: 64K
       7C F3 BB 4F 9B 5F 73 F6 4F 42 C2 5D 57 6B 9C D5>)
(   2,<2012-12-05 03:05:10.245 -0500>,<Administrator>,<X>,<proc1d>,<TOPSPIN 2.1>,
      <Start of raw data processing
       efp LB = 0 FT_mod = 6 PKNL = 1 PHC0 = 0 PHC1 = 0 SI = 32K 
       data hash MD5: 32K
       2E 19 E0 5B A5 D2 AC DE 5D B1 DC D3 CF AA 12 2E>)
(   3,<2012-12-05 03:05:10.714 -0500>,<Administrator>,<X>,<proc1d>,<TOPSPIN 2.1>,
      <pk PHC0 = 99.31091 PHC1 = 0 
       data hash MD5: 32K
       4C 52 76 81 22 1A A9 E7 30 3E 50 3B BF 90 31 AC>)
(   4,<2012-12-05 03:05:10.948 -0500>,<Administrator>,<X>,<proc1d>,<TOPSPIN 2.1>,
      <abs ABSG = 1 
       data hash MD5: 32K
       26 5E 48 31 67 43 10 88 F0 56 F2 34 D2 A8 AC 9F>)
(   5,<2012-12-05 03:05:11.089 -0500>,<Administrator>,<X>,<proc1d>,<TOPSPIN 2.1>,
      <abs ABSG = 2 
       data hash MD5: 32K
       9C A4 E3 9C 27 8C 3A E1 5A 95 E5 9F 6C 3A A2 C8>)
(   6,<2012-12-05 03:05:11.245 -0500>,<Administrator>,<X>,<proc1d>,<TOPSPIN 2.1>,
      <abs ABSG = 3 
       data hash MD5: 32K
       EE F1 67 9E 1E 87 B1 C9 67 00 46 A9 2E 59 CB 77>)
(   7,<2012-12-05 03:05:11.385 -0500>,<Administrator>,<X>,<proc1d>,<TOPSPIN 2.1>,
      <abs ABSG = 4 
       data hash MD5: 32K
       86 EC 46 D7 22 82 F6 9C 7E 2A 27 00 64 B4 4A D1>)
(   8,<2012-12-05 03:05:11.542 -0500>,<Administrator>,<X>,<proc1d>,<TOPSPIN 2.1>,
      <abs ABSG = 5 
       data hash MD5: 32K
       36 EB 09 EF B1 9A C6 29 86 C7 B4 82 CE 4F FE 29>)
$$ ##END=
$$ 
$$ $$ hash MD5
$$ $$ 93 A1 20 A1 E3 F1 36 26 5A B2 06 35 33 73 6B 9E
##$RELAX= 
##$RELAX= 
##$RELAX= 
##$RELAX= 
##$RELAX= 
##$RELAX= 
##$RELAX= 
$$ Bruker specific parameters
$$ --------------------------
##$DU= <E:\>
##$EXPNO= 10
$$ [...]
150 150 150 150 150 150 150 150
##$TP07= 0
##$TPNAME0= <>
##$TPNAME1= <>
##$TPNAME2= <>
##$TPNAME3= <>
##$TPNAME4= <>
##$TPNAME5= <>
##$TPNAME6= <>
##$TPNAME7= <>
##$TPOAL= (0..7)
0.5 0.5 0.5 0.5 0.5 0.5 0.5 0.5
##$TPOFFS= (0..7)
0 0 0 0 0 0 0 0
##$TUNHIN= 0
##$TUNHOUT= 0
##$TUNXOUT= 0
##$USERA1= <user>
##$USERA2= <user>
##$USERA3= <user>
##$USERA4= <user>
##$USERA5= <user>
##$V9= 5
##$VALIST= <valist>
##$VCLIST= <CCCCCCCCCCCCCCC>
##$VD= 0
##$VDLIST= <DDDDDDDDDDDDDDD>
##$VPLIST= <PPPPPPPPPPPPPPP>
##$VTLIST= <TTTTTTTTTTTTTTT>
##$WBST= 2048
##$WBSW= 25
##$XGAIN= (0..3)
0 0 0 0
##$XL= 0
##$YL= 0
##$YMAX_a= 639720
##$YMIN_a= -547081
##$ZGOPTNS= <>
##$ZL1= 120
##$ZL2= 120
##$ZL3= 120
##$ZL4= 120
##$ABSF1= 14.98509
##$ABSF2= -5.573092
##$ABSG= 5
##$ABSL= 3
##$ALPHA= 0
##$AQORDER= 0
##$ASSFAC= 0
##$ASSFACI= 0
##$ASSFACX= 0
##$ASSWID= 0
##$AUNMP= <proc_prof1d_extract_pilot.lims>
##$AXLEFT= 0
##$AXNAME= <>
##$AXNUC= <1H>
##$AXRIGHT= 0
##$AXTYPE= 0
##$AXUNIT= <>
##$AZFE= 0.1
##$AZFW= 0.1
##$BCFW= 0
##$BC_mod= 0
##$BYTORDP= 0
##$COROFFS= 0
##$CY= 15
##$DATMOD= 1
##$DC= 0
##$DFILT= <>
##$DTYPP= 0
##$F1P= 0
##$F2P= 0
##$FCOR= 0.5
##$FTSIZE= 32768
##$FT_mod= 6
##$GAMMA= 0
##$GB= 0
##$INTBC= 1
##$INTSCL= 1
##$ISEN= 128
##$LB= 0
##$LEV0= 0
##$LPBIN= 0
##$MAXI= 10000
##$MC2= 0
##$MEAN= 0
##$ME_mod= 0
##$MI= 0
##$NCOEF= 0
##$NC_proc= -8
##$NLEV= 6
##$NOISF1= 0
##$NOISF2= 0
##$NSP= 0
##$NTH_PI= 0
##$NZP= 0
##$OFFSET= 14.98509
##$PC= 1
##$PHC0= 99.31091
##$PHC1= 0
##$PH_mod= 1
##$PKNL= yes
##$PPARMOD= 0
##$PPDIAG= 0
##$PPIPTYP= 0
##$PPMPNUM= 2147483647
##$PPRESOL= 1
##$PSCAL= 4
##$PSIGN= 0
##$PYNMP= <proc.py>
##$REVERSE= no
##$SF= 400.02
##$SI= 32768
##$SIGF1= 0
##$SIGF2= 0
##$SINO= 400
##$SIOLD= 32768
##$SPECTYP= <>
##$SREGLST= <1H.CDCl3>
##$SSB= 0
##$STSI= 32768
##$STSR= 0
##$SW_p= 8223.68421052631
##$SYMM= 0
##$S_DEV= 0
##$TDeff= 65536
##$TDoff= 0
##$TI= <>
##$TILT= no
##$TM1= 0
##$TM2= 0
##$TOPLEV= 0
##$USERP1= <user>
##$USERP2= <user>
##$USERP3= <user>
##$USERP4= <user>
##$USERP5= <user>
##$WDW= 1
##$XDIM= 32768
##$YMAX_p= 480328264
##$YMIN_p= -708008
##$CURPLOT= <Network HP LaserJet P1505>
##$CURPRIN= <$Network HP LaserJet P1505>
##$DFORMAT= <normdp>
##$LAYOUT= <+/1D_H.xwp>
##$LFORMAT= <normlp>
##$PFORMAT= <normpl>
##$SURQMSG= 1
$$ End of Bruker specific parameters
$$ ---------------------------------
##NTUPLES= NMR SPECTRUM
##VAR_NAME=  FREQUENCY,     SPECTRUM/REAL,   SPECTRUM/IMAG
##SYMBOL=    X,             R,               I
##VAR_TYPE=  INDEPENDENT,   DEPENDENT,       DEPENDENT
##VAR_FORM=  AFFN,          ASDF,            ASDF
##VAR_DIM=   32768,         32768,           32768
##UNITS=     HZ,            ARBITRARY UNITS, ARBITRARY UNITS
##FACTOR=    0.250966925370066, 1,           1
##FIRST=     8223.43324360094, -156230,      -34566
##LAST=      0,             126491,          -142062
##MIN=       0,             -708008,         0
##MAX=       8223.43324360094, 480328264,    0
$$ Real data points
##PAGE= N=1
##DATA TABLE= (X++(R..R)), XYDATA
$$ [...]
$$ plain form
19549 -91802 33945 -16581 128673 -220504 -40006 -197446 -105546 229739 -129103 2548 72468
19538 72468 -283029 -223034 -119028 18866 41488 264108 -190428 -29999 -45017 311895 148031
19526 -346238 -140407 114772 -137017 -215706 -80394 -279398 -97965 -10788 46915 -239798
19515 -324962 -424278 47872 -234055 -95542 92649 283499 -3824 -10167 12567 -251062 158313
19503 -58927 -563 -85163 -80683 112348 -160811 219134 44454 -110458 -100271 -178450 80470
19491 65438 -231478 -307243 -322482 -360607 51977 -53034 4835 -261220 -153344 -181558 -23269
19479 28650 185138 40057 274754 -300209 -254018 69578 -125364 -187376 84307 -345376 -250678
19468 -250678 269652 -36710 264775 -421164 243009 -165974 -329152 -308420 143619 -27316
$$ packed form
19549i1802C3945a6581A28673b20504d0006j57440R1900B29739a29103B548O9920
19538G2468b83029N9995J04006A8866K2622K22620a90428b9999j5018C11895A48031
19526c46238a40407A14772a37017p8689h0394j99004i7965a0788D6915b39798
19515c24962r9316D7872b34055i5542I2649J90850c824o343A2567b51062A58313
19503e8927e63q4600M480A12348a60811B19134D4454a10458J0187p8179H0470
19491F5438b31478p5765j5239l8125E1977e3034D835b61220J07876k8214b3269
19479B8650J56488D0057K34697c00209M6191F9578a25364o2012H4307c45376R4698
19468b50678B69652c6710B64775d21164B43009a65974j63178K0732A43619b7316
$$ plain form
19457 -18951 -221330 42936 -35842 -22439 201866 197323 -129628 -122141 -279060 -279367 -224568 116585
19444 40248 230375 -305567 75590 63071 204077 -73546 238513 -79837 -85651 -106951 80291
19432 -115921 260364 -43784 -270727 -127246 -229228 351383 -168934 -468577 20909 -317610
19421 -180449 77038 -16988 -9531 -133299 44522 -190767 -285812 -84280 -142645 -316436 -35652
19409 54950 24752 148522 -45913 -400494 -342089 -122366 -16899 195492 -133116 71674 -142654
19397 293278 -230539 -303669 -69881 69407 -95422 -33530 -325389 -464563 43779 -293856 -121644
19385 -26196 -36560 -77450 17609 6166 -25100 -98471 -71591 -224273 375814 -102375 31989
19373 -321619 -177463 -85622 -119066 40480 -148723 106779 -103537 -108498 -47464 8114 -138385
$$ packed form
19457a8951k02379D2936c5842J3403B01866m543a29628P487j56919l07N4799A16585
19444D0248J90127c05567G5590j2519J41006g3546B38513g9837n814k1300H0291
19432a15921B60364d3784k26943a27246j01982C51383a68934k99643B0909c17610
19421a80449G7038a6988P457j23768D4522a90767r5045h4280n8365j73791c5652
19409E4950B4752J23770d5913l54581N8405a22366a6899A95492a33116G1674a42654
19397B93278b30539p3130f9881F9407i5422c3530k91859j39174D3779b93856a21644
19385b6196j0364m0890A7609F166b5100p3371K6880j52682C75814a02375C1989
19373c21619J44156h5622l3444D0480a48723A06779a03537m961d7464H114a38385
$$ plain form
19361 -198160 62915 -13139 -27295 -111653 -51125 47270 -225601 68383 -202193 4328 42025
19350 42025 -266491 -80988 -386827 -230558 -5764 52603 211250 225883 -30117 46484 -183764
19338 10831 381701 45819 153496 98370 -449617 -6515 -133600 201692 -253809 341983
19327 116111 -247514 -260784 82799 -26983 17973 -300034 -312581 131166 -139549 -312697
19317 -312697 114478 42591 -170023 -133616 137720 -85866 -65793 -8602 96065 -65868 51516
19305 -219299 -261952 -49830 -45621 -194227 -28936 -37266 -93338 169991 200733 -93426 -179625
19294 -179625 -88454 -315768 -233955 142245 120848 434956 -64793 -55429 -51873 228663 365449
19283 365449 -234682 -268727 -434553 -255422 -37856 46626 190407 171428 3077 -47524 38327
$$ packed form
19361a98160F2915a3139j4156q4358e1125D7270b25601F8383b02193D328L7697
19350D2025b66491h0988l05839J56269e764E2603J58647J4633c0117D6484a83764
19338A0831L70870D5819J07677n5126d49617f515j27085B01692b53809C41983
19327A16111b47514j3270H2799b6983A7973c00034j2547A31166a39549j73148
19317c12697A14478D2591a70023L6407A37720h5866K0073h602I6065f5868E1516
19305b19299m2653d9830M209j48606b8936q330n6072A69991L0742i3426q6199
19294a79625h8454k27314Q1813A42245k1397L14108f4793R364L556B28663J36786
19283C65449b34682l4045j65826J79131c7856D6626J43781j8979C077d7524C8327
$$ plain form
19271 209457 -171390 46119 31597 241775 126459 -253900 115540 -218722 63897 116815
19261 116815 9574 -147688 -114810 -214496 37277 -201645 188054 31416 -230371 -143779 -16401
19249 -61131 -206362 293591 -271405 183202 -49988 -189666 -33226 39307 -24467 -22306 -223882
19238 -223882 -21398 -299702 502124 -276765 -127213 -248115 -76128 -43917 -12753 16660
19227 214855 46726 51410 31348 221081 -161823 99244 156365 -104578 -111272 12261 -304200
19215 21575 -101577 82826 69942 -199151 -58334 -91179 -225108 48912 79713 -174292 127833
19203 39983 266023 46174 4597 -188823 -197847 -405672 -216019 192981 -65738 9389 -125795
19191 -75002 -300408 -320163 -478214 -94087 -27360 -275539 -260168 -130535 92839 -189457 154846
$$ packed form
19271B09457a71390D6119j4522K10178j15316b53900A15540b18722F3897N2918
19261A16815I574a47688L2878r9686C7277b01645A88054C1416b30371Q6592a6401
19249f1131j45231B93591b71405A83202d9988j39678c3226C9307b4467K161k01576
19238b23882b1398k78304E02124b76765a27213j20902g6128L2211a2753A6660
19227B14855D6726M684k0062J89733a61823I9244N7121a04578o694A2261c04200
19215B1575a01577H2826j2884a99151e8334l2845j33929D8912L0801a74292A27833
19203C9983K26040D6174D597a88823r024k07825J89653A92981f5738I389a25795
19191g5002k25406j9755j58051i4087b7360k48179J5371J29633I2839a89457A54846
$$ plain form
19179 116661 86494 -61303 -86812 -193005 -179829 -207331 -320246 -129582 3069 24564 128614
19168 128614 40692 -114419 -220943 -176386 -149892 -113564 134069 -131623 -2747 179358 26861
19156 -139167 -109657 -286641 -174238 51966 -14624 -179122 -249513 65408 52889 -108597 -169655
19145 -169655 -351883 -105855 -257055 -173658 -98290 -17242 280507 -39110 -3795 -29756 44617
19133 -348321 -319555 79424 -68966 80347 -153464 -53443 -1303 -277446 -156273 403475 -25882
19121 -115831 -124195 -79868 -173798 -48917 -159407 -102272 -61422 127618 36039 325290 122871
19109 -13471 -164727 -157643 -131690 -203335 -46710 -194143 407776 294798 130184 -155562 -232674
19098 -232674 -37578 -305583 -70074 -56109 -49927 98134 -84158 -120030 246429 232991 -72446
$$ packed form
19179A16661l0167f1303k5509j06193J3176k7502j12915a29582C069K1495J04050
19168A28614D0692a14419j06524M4557K6494L6328A34069a31623b747A79358B6861
19156a39167K9510j76984J12403E1966a4624j64498p0391F5408j2519a08597o1058
19145a69655j82228a05855j51200Q3397P5368a7242B80507c9110c795k5961D4617
19133c48321K8766G9424f8966H0347a53464e3443a303k76143J21173D03475b5882
19121a15831q364M4327r3930d8917j10490N7135M0850A27618C6039K89251A22871
19109a3471j51256P084K5953p1645d6710j47433D07776j12978A30184a55562p7112
19098b32674c7578k68005g0074J3965O182I8134h4158l5872B46429j3438g2446
$$ plain form
19086 -75219 60069 179065 53012 -494978 105648 -134328 -133027 -103557 168185 94286 -269625
19074 -98719 28054 127911 154715 146419 5546 -110750 106950 151107 -319784 115615 -105301
19062 181796 -26930 11789 -220376 14239 66537 -116181 47788 -404011 -68025 -60226 268787
19050 119219 -134929 60203 -135946 28248 284681 -19897 -241356 -208056 92816 -205013
19039 -240778 -197219 87774 -194805 19160 -165784 -47452 93537 -466448 -163683 -72868 267933
19027 131453 -61301 -77301 -159523 -78615 13738 279628 263490 -129515 176230 44576 -146525
19015 355014 -55872 -261522 -352324 -140328 -5917 86061 -54612 -34054 437543 98933 -108434
19003 -30339 -26403 -326393 -188751 -115410 62117 -166952 -501239 -293561 -315582 -188816 218679
$$ packed form
19086g5219F0069J18996E3012d94978A05648a34328J301K9470A68185p3899b69625
19074i8719B8054R9857K6804q296E546a10750A06950M4157c19784A15615a05301
19062A81796b6930A1789b20376A4239N2298a16181D7788d04011f8025P799B68787
19050A19219a34929F0203a35946B8248K56433a9897k21459L3300I2816b05013
19039b40778M3559H7774a94805A9160a65784d7452I3537d66448a63683g2868B67933
19027A31453f1301j6000q2222g8615A3738K65890j6138a29515A76230D4576a46525
19015C55014e5872k05650r0802a40328e917H6061e4612K0558D37543I8933a08434
19003c0339L936k99990J37642P3341F2117a66952l34287K07678k2021J26766B18679
$$ plain form
18991 -119156 -292012 -98683 -151200 -262501 -114736 -63503 -107581 -311043 -175393 -365821
18981 -365821 -39801 -293455 -34431 212661 74678 -28095 55165 -178724 -332027 5781 48356
18970 48356 -372159 -39595 80875 292152 161473 45046 -169682 16246 -212873 280153
18959 128016 235315 212688 311245 -47903 75220 193570 -116667 -169822 -14692 213609 270151
18948 270151 -63277 -292425 -289153 -431240 -72968 -7828 -113481 8110 19796 78625 113500
18937 113500 15456 -258996 -194615 -16106 -18346 229980 -128767 22362 -34650 -34226 83449
18925 -331062 135614 -39955 99610 -362498 167680 -299860 130237 -182824 -155279 -114290
18915 -114290 148051 -76918 -435368 -151507 -12520 -24050 94811 502204 138103 146225 232713
$$ packed form
18991a19156j72856i8683n2517j11301a14736N1233m4078k03462J35650j90428
18981c65821c9801k53654c4431B12661G4678b8095E5165a78724j53303E781M2575
18970D8356c72159c9595H0875K11277j30679D5046a69682A6246b12873B80153
18959A28016J07299k2627R8557d7903G5220J18350a16667n3155a4692B13609N6542
18948B70151f3277k29148L272j42087g2968g828j05653H110J1686N8829L4875
18937A13500A5456b58996O4381a6106k240B29980a28767B2362c4650M24H3449
18925c31062A35614c9955I9610c62498A67680b99860A30237a82824K7545M0989
18915a14290A48051g6918l58450a51507a2520j1530I4811M07393A38103Q122Q6488
$$ plain form
18904 232713 -21123 -179400 -66888 114194 93919 -211614 -190577 -13707 -20302 -82158 -168899
18893 -168899 30235 78899 -239551 24492 -47054 67177 273121 -310723 -83344 -94974 -52761
18882 -52761 -310832 100510 159916 239652 -292531 -219601 -24623 122824 -171518 -205997 182772
18870 -144190 -184666 19431 -65433 -39426 -296432 -72453 -108093 -300679 84061 -23037 197615
18858 -179066 225615 45700 -80408 8080 336493 -163637 -38065 177571 33886 -359648 -164713
18846 -212253 225838 -329199 -38170 -107646 181047 52409 52229 -123834 -46765 -225142 -448573
18835 -448573 2424 -321074 -32723 -128864 -351837 -57003 22828 -153874 -64375 -215450 -132557
18824 -132557 -53968 156284 166225 -385592 16227 223717 207256 77899 -52167 46724 -403085
$$ packed form
18904B32713b1123j58277f6888A14194k0275b11614K1037a3707o595o1856q6741
18893a68899C0235M8664b39551B4492d7054F7177K05944c10723h3344j1630M2213
18882e2761k58071A00510N9406P9736b92531P2930b4623A22824a71518l4479A82772
18870a44190m0476A9431f5433K6007k57006g2453l5640j92586H4061b3037A97615
18858a79066B25615D5700h0408H080L28413a63637c8065A77571C3886c59648a64713
18846b12253B25838c29199c8170o9476A81047E2409j80a23834d6765j78377k23431
18835d48573B424c21074c2723r6141k22973e7003B2828a53874f4375j51075Q2893
18824a32557e3968A56284R941c85592A6227K07490j6461G7899e2167D6724d03085
$$ plain form
18812 320380 101920 -154642 318010 -82740 168063 -104450 -144410 -33466 360 245429 -28180
18800 -52586 -131533 -308140 25177 -375855 21708 -154290 175395 -290477 -66022 -99365 -51903
18789 -51903 30725 -202538 2000 -185186 78464 49545 -41499 26602 436915 141954 -42427
18777 -93744 -69079 114261 -88862 29978 133299 53187 75788 78421 287234 -197673 153357
18765 -146382 -225826 64852 -102632 -16145 -229375 -129825 51005 -385283 -48699 -30521 135960
18753 -239414 -245406 102064 131420 -378689 173596 -343345 -204429 -56402 -51545 68906 -180572
18741 96909 -322350 -186431 -350508 104278 -300878 -36191 103593 -30265 158893 1673
18730 96519 -225214 303199 -25831 17388 -57745 103472 -418083 150806 -142999 -486409
$$ packed form
18812C20380A01920a54642C18010h2740A68063a04450l9960c3466C60K45069b8180
18800e2586p8947j76607B5177c75855B1708a54290A75395b90477f6022l3343M7462
18789e1903C0725b02538B000a85186G8464k8919d1499B6602M10313A41954d2427
18777i3744K4665A14261h8862B9978J03321E3187K2601K633K08813a97673A53357
18765a46382p9444F4852a02632a6145k13230R9550E1005c85283d8699J8178A35960
18753b39414n992A02064K9356c78689A73596c43345J38916e6402M857F8906a80572
18741I6909c22350J35919j64077A04278c00878c6191A03593c0265A58893A673
18730I6519b25214C03199b5831A7388e7745A03472d18083A50806a42999l43410
$$ plain form
18720 -486409 -91053 -250053 -88332 269019 25750 -147979 -328269 -370701 30378 -109936
18709 -175657 142489 133875 -333698 -141073 127466 -102877 240212 -92368 -110440 -293308
18699 -293308 -323485 -165736 -213517 -94325 104066 -99068 -191440 -226012 -44768 -276749 -109951
18687 -97159 -70227 -275032 -219615 -44850 -112719 157514 -86511 -46996 -367019 -187887 92428
18675 -96228 -303466 21160 -118737 -188211 -265984 -286435 31324 -32563 22456 -540495 -267657
18663 16713 106229 -170636 -154803 -9322 148248 -433474 54408 -145623 88032 -232080 251388
18651 -2048 -30302 -64963 309679 10842 188055 149364 -179398 129260 267963 28345 32957
18640 32957 -166238 37023 290821 121702 195840 -143730 -344332 74846 -200826 132718
$$ packed form
18720d86409i1053j59000h8332B69019B5750a47979j80290m2432C0378a09936
18709a75657A42489q614c33698a41073A27466a02877B40212i2368j8072j82868
18699b93308l0177J57749m7781i4325A04066i9068r2372l4572d4768k31981a09951
18687i7159K6932k04805N5417d4850o7869A57514h6511L9515l20023J79132I2428
18675i6228k07238B1160a18737o9474p7773k0451C1324c2563B2456e40495b67657
18663A6713Q9516a70636J5833i322A48248d33474E4408a45623H8032b32080B51388
18651b048k8254l4661C09679A0842J77213l8691a79398A29260J38703B8345M612
18640C2957a66238C7023K53798A21702P4138a43730k00602G4846b00826A32718
$$ plain form
18629 59502 209333 -236391 39210 -297037 123058 -49621 243901 385055 -210816 96390
18618 -263954 34158 -77542 216440 114993 4563 -289711 232642 -380750 71296 -302231
18607 -44403 166256 -267675 -199196 26807 -149616 -166956 -55785 -253522 -243472 -288905 26180
18595 -162976 49790 51119 -657 -215192 3825 -135892 21688 -318133 -132164 -34981 16349
18583 -14954 -267995 42674 74376 -386713 -154817 -18967 -58990 -206761 52896 -339300 -118962
18571 -316302 -262458 119613 -175706 -146873 -63530 245099 173496 -173231 -215241 -141012 81930
18559 221641 14258 -124533 370594 -122760 -279894 223506 -71090 78622 -265656 -58531
18548 -74335 -314717 -301843 35165 91235 149494 78046 -8307 -65040 143487 -134517 -155069
$$ packed form
18629E9502J49831b36391C9210b97037A23058d9621B43901J41154b10816I6390
18618b63954C4158g7542B16440j01447D563b89711B32642c80750G1296c02231
18607d4403A66256b67675O8479B6807a49616j7340e5785j97737J0050m5433B6180
18595a62976D9790J329f57k14535C825a35892B1688c18133a32164c4981A6349
18583a4954k53041D2674L1702c86713a54817a8967m0023j47771E2896c39300a18962
18571c16302N3844A19613a75706K8833f3530B45099p1603a73231m2010P4229H1930
18559B21641A4258a24533C70594a22760j57134B23506g1090G8622b65656e8531
18548g4335k40382J2874C5165N6070N8259p1448h307n6733A43487a34517k0552
$$ plain form
18537 -155069 59156 -210959 -143048 -10362 -211659 4735 2722 65986 -52756 -10949 45084
18525 -235971 -80678 -57464 -208520 -46606 68030 -63160 28518 70999 -137572 135731 -196269
18513 -135628 370413 -61699 -247272 -39202 151885 108751 -198986 -164653 -315264 -214504
18503 -214504 -90180 89590 113407 158472 -33696 150540 -66847 -7916 162642 -29410 -75731
18492 -75731 211189 29303 56189 -432146 -191318 -113232 -110607 -242770 128376 -136398 -23578
18480 79985 -83837 193988 -91486 -186130 -172535 -161922 -83195 32517 29292 -96741 -211048
18469 -211048 164688 -15461 -352162 108287 84015 56278 73615 141360 -251351 -11259 -176896
18458 -176896 90700 67368 -3940 150353 -353201 74432 -203864 -12220 -459415 101494 -158944
$$ packed form
18537a55069E9156b10959O7911a0362k01297D735k013O3264e2756a0949D5084
18525b35971h0678K3214j51056d6606F8030f3160B8518M2481a37572A35731a96269
18513a35628C70413f1699j85573c9202A51885m3134a98986L4333j50611J00760
18503b14504i0180H9590K3817M5065c3696A50540f6847g916A62642b9410m6321
18492g5731B11189B9303K6886d32146a91318P8086K625j32163A28376a36398b3578
18480G9985h3837A93988i1486r4644J3595J0613P8727C2517l225i6741j14307
18469b11048A64688a5461l36701A08287k4272k7737J7337O7745b51351a1259j65637
18458a76896I0700k3332c940A50353c53201G4432b03864a2220m47195A01494a58944
$$ plain form
18446 116142 186250 -245379 -188771 18501 93103 -182937 -130929 -254208 -68707 22700 235640
18435 235640 299061 -266309 -28269 -135890 202984 224032 41464 25105 4000 -28448 -74961
18424 -74961 58411 -135406 -385950 16195 -232941 -177048 21912 15811 -394635 308685 -118284
18412 -418289 -107744 -102586 -54945 71521 26635 284956 -91022 203485 -134399 -63874 -23307
18400 241916 -311243 -34851 -35577 -263251 179192 -139946 -326055 -160232 -36504 -180497
18390 -180497 104717 -229884 -99481 -54533 137365 -84870 -146859 -75253 108711 116816 -76826
18378 -268654 90551 103636 -81321 -173648 -82690 23594 -132481 -65282 -381928 135620 -103558
18366 -396253 85364 -325339 -56920 -50216 171440 58925 115469 -48374 197381 -442520 -17289
$$ packed form
18446A16142P0108b45379N6608A8501P4602a82937N2008j23279f8707B2700K12940
18435B35640O3421b66309b8269j07621B02984K1048D1464j6359D000b8448m6513
18424g4961E8411a35406k50544A6195b32941N5893B1912o101c94635C08685a18284
18412d18289a07744N158M7641G1521B6635K58321i1022B03485a34399f3874b3307
18400B41916c11243c4851p26k27674A79192a39946j86109a60232c6504j43993
18390a80497A04717b29884i9481M4948A37365h4870o1989P1606A08711Q105g6826
18378b68654I0551J3085h1321r2327h2690B3594a32481f5282l16646A35620a03558
18366c96253H5364c25339e6920O704A71440E8925N6544d8374A97381d42520a7289
$$ plain form
18354 13730 -15000 18293 -63540 60911 -116588 75089 -4707 -223023 -67900 -29232 -476989
18343 -476989 153882 -151291 -29323 203968 17019 30031 183832 -356676 -6800 38180 95189
18332 95189 166408 -304179 -329615 -284074 107350 74283 -201829 -168466 245647 -234643 -298505
18321 -298505 -138435 -118832 195477 -159190 305364 -108493 298080 -308169 -285594 -122800
18310 -23580 410559 -336543 -151614 -16055 148000 -174206 462 -123190 -39747 130504 -124189
18298 -33593 -220475 -124800 -237006 -377988 -241598 -79751 -79900 -367936 42088 9254 195115
18287 195115 -275914 -4749 -185925 -47292 -114152 -142008 -174897 -182094 -134951 22488 -241642
18275 -63572 58783 -75399 -198037 15850 -38767 55444 -61307 276465 -265642 36951 -46303
$$ packed form
18354A3730a5000A8293f3540F0911a16588G5089d707k18316f7900b9232m47757
18343d76989A53882a51291b9323B03968A7019J3012J53801c56676f800C8180N7009
18332I5189P1219c04179k5436M5541A07350l3067b01829L3363B45647b34643o3862
18321b98505a38435J9603A95477a59190C05364a08493B98080c08169K2575a22800
18310b3580D10559c36543a51614a6055A48000a74206D62a23190c9747A30504a24189
18298c3593j86882R5675j12206j40982J36390g9751j49k88036D2088I254J85861
18287A95115b75914d749j81176d7292o6860k7856l2889p197M7143B2488b41642
18275f3572E8783g5399j22638A5850c8767E5444f1307B76465b65642C6951d6303
$$ plain form
18263 113533 -283138 174722 266069 13434 88377 29612 31144 28900 -113645 102286 285973
18252 285973 -241337 -190462 236306 -103437 -120109 -79388 40844 -223597 -111346 208259
18241 -15074 146697 255946 -71066 130859 -105508 179943 261312 94471 310932 -67711
18230 -1546 -342621 21900 15259 -292854 -124814 388639 -99055 -107712 60413 290188 -63781
18218 -281099 -133151 67365 -54262 -37791 -395340 -90975 -279502 -92683 -65113 -162068 107493
18206 -187541 126092 83758 49021 -309958 147454 -72542 79629 78409 196518 -176659 -45513
18194 -98649 21468 512275 -2414 79016 65282 -399191 -83773 -108607 454675 -82626 -256821
18183 -256821 112598 -7404 211369 -162510 45913 -336000 9448 -125685 -353055 -117263
$$ packed form
18263A13533b83138A74722R1347A3434P4943B9612J532k244a13645A02286J83687
18252B85973b41337N0875B36306a03437j6672M0721D0844b23597a11346B08259
18241a5074A46697J09249g1066A30859a05508A79943Q1369I4471K16461f7711
18230a546l41075B1900o641b92854a24814C88639i9055q657F0413K29775f3781
18218b81099a33151F7365e4262J6471l57549i0975j88527i2683K7570r6955A07493
18206a87541A26092m2334l4737c09958A47454g2542G9629j220J18109a76659d5513
18194i8649B1468M90807b414G9016j3734c99191h3773k4834D54675h2626j74195
18183b56821A12598g404B11369a62510D5913c36000I448a25685k27370a17263
$$ plain form
18172 279016 -47568 27553 -138720 -27316 -356694 -216467 -97634 -34777 -314443 -101262
18161 41655 204428 -170515 650920 -136793 -178062 -8818 -43900 8852 -161058 328787 -172102
18149 29445 118047 -398123 -151977 -205196 15318 187551 -139469 -224889 -118251 -146381 -314511
18138 -314511 20081 -121568 165758 -161010 -279291 121452 -90531 322805 -205142 -279256
18128 -279256 159393 216994 -204166 318882 -53118 -59039 668 -335326 -111415 -125218 42934
18116 2934 -147775 -105742 30382 221734 -46570 323564 -239852 -322909 29993 -409264 -118357
18104 66967 -4067 -112542 26204 -177344 49874 -59239 -176398 113163 -242281 -191692 -36585
18092 -97350 -109659 -225761 119099 -404760 120220 -384011 -188662 -108916 2230 193069
$$ packed form
18172B79016d7568B7553a38720b7316l29378J40227i7634c4777k79666a01262
18161D1655J62773a70515F50920a36793m1269h818l5082H852a61058C28787a72102
18149B9445Q8602c98123a51977n3219A5318J72233a39469q5420J06638k8130j68130
18138c14511B0081a21568A65758a61010j18281A21452i0531C22805b05142p4114
18128b79256A59393N7601b04166C18882e3118n921F68c35326a11415j3803D2934
18116B934a47775M2033C0382J91352d6570C23564b39852q3057B9993d09264a18357
18104F6967d067j08475B6204a77344D9874e9239j17159A13163b42281N0589c6585
18092i7350j2309j16102A19099d04760A20220c84011a88662P9746B230J90839
$$ plain form
18082 193069 -23292 -44249 140011 34189 -286245 -46655 46212 18840 72813 118982 -90973
18070 135239 50228 -152273 -108095 -227342 -188039 126330 -54093 189702 62561 67177 65884
18059 65884 130931 199382 147041 127623 -225028 43856 220811 -16702 16789 154744 -97985
18047 52647 304004 -282494 92422 -36480 -191691 218508 -48998 -16035 204296 196517 267462
18036 267462 76832 -125670 -197461 157801 38888 280985 -232816 -188515 237738 79442
18025 -287652 -237355 -237939 -61056 -254313 96617 113484 -75198 -124327 -181098 56709 -103199
18013 -34836 -160748 423059 -165853 -107248 5285 -323296 127737 -221560 267815 -190985
18002 20820 62774 -109012 169337 73074 -24689 223242 -87140 -82491 237901 -67064 -126597
$$ packed form
18082A93069b3292k0957A40011C4189b86245d6655D6212A8840N3973M6169i0973
18070A35239E0228a52273M4178j19247L9303A26330e4093A89702F2561M616j293
18059F5884O5047O8451n2341j9418b25028D3856J76955a6702A6789J37955i7985
18047E2647K51357b82494I2422c6480j55211B18508d8998a6035B04296p779P0945
18036B67462G6832a25670p1791A57801C8888K42097b32816M4301B37738G9442
18025b87652N0297n84f1056j93257I6617J6867g5198m9129n6771E6709a03199
18013c4836j25912D23059a65853N8605E285c23296A27737b21560B67815a90985
18002B0820M1954a09012A69337G3074b4689B23242h7140M649B37901f7064n9533
$$ plain form
17991 -126597 143462 261062 22782 -162447 -242384 -211268 -113053 90013 225204 142098 -147155
17979 124644 -354275 -23898 269173 -146316 -8862 31992 -82186 -402163 40659 224022 -232010
17967 -86697 -109958 -1937 -55285 -33869 78738 -97947 -213740 -72260 207891 143018 -93952
17955 -225526 115943 -222868 -260426 -44445 21316 -318184 47560 -332872 -69382 156238
17944 122776 40723 -241927 -96835 185349 65323 -358382 -439156 -70184 -63925 -150375 103574
17932 284652 10745 -194057 -244063 -5443 -1167 -8778 45614 -321010 55873 291046 247506
17921 247506 -232063 -185332 167617 61356 -75464 -60833 43272 140181 -44741 -261720 -28430
17909 434018 -167408 -349281 204271 -279621 -240032 32466 -61298 177830 102873 -101560
$$ packed form
17991a26597A43462J17600B2782a62447p9937L1116R8215I0013J35191q3106a47155
17979A24644c54275b3898B69173a46316h862C1992h2186l19977D0659J83363b32010
17967h6697k3261a937n3348K1416G8738i7947j15793g2260B07891o4873i3952
17955b25526A15943b22868l7558d4445B1316c18184D7560c32872f9382A56238
17944A22776D0723b41927i6835A85349F5323c58382q0774g0184O259q6450A03574
17932B84652A0745a94057n0006e443a167p611D5614c21010E5873K35173m3540
17921B47506b32063M6731A67617F1356g5464J4631D3272R6909d4741k16979b8430
17909D34018a67408j81873B04271b79621L9589C2466f1298A77830p4957a01560
$$ plain form
17898 -238425 -395871 111463 315983 27608 -168134 102800 116232 242449 77126 108041
17888 108041 -453814 -55458 -306397 -177247 -36163 -20584 121633 161424 -302580 -152662
17878 -152662 -355453 331703 -75103 205979 -159197 -226886 -67974 15265 -63270 -318678
17868 -318678 -66075 -147963 64505 41158 -301799 -88065 -34020 221603 134688 154234 206138
17857 206138 -74304 26350 284507 48860 -147751 -102313 14804 147870 54853 64920 -30027
17845 126983 -388861 -122165 152513 6916 -140600 -269275 -7995 164541 -73394 153973
17834 32979 -56872 -86143 -102580 289307 217717 -42453 190740 -227644 76988 -73146 -223514
17823 -223514 -442896 249881 -113720 -109353 1301 -409230 -12812 41815 -245692 -67643 169686
$$ packed form
17898b38425j57446A11463K04520B7608a68134A02800J3432J26217G7126L0915
17888A08041d53814e5458k50939J29150c6163J5579A21633L9791c02580J49918
17878a52662k02791C31703g5103B05979a59197o7689f7974A5265f3270k55408
17868c18678f6075q1888F4505k3347c01799h8065c4020B21603q6915J9546N1904
17857B06138g4304B6350K58157D8860a47751M5438A4804J33066E4853J0067c0027
17845A26983c88861a22165A52513F916a40600j28675g995A64541g3394A53973
17834C2979e6872k9271j6437B89307p1590d2453A90740b27644G6988g3146j50368
17823b23514k19382B49881a13720M367A301d09230a2812D1815b45692f7643A69686
$$ plain form
17811 -43610 -236252 -162108 253768 212960 -9755 -174966 -63527 -132844 -309862 55374 262002
17800 262002 -119432 -256164 -23430 -435763 55139 185011 -169211 67076 -157990 -185076
17790 -185076 -126636 -45507 -255376 -289548 -373127 -115839 -169145 -25655 43053 -92320 -8183
17778 83445 51288 66482 5816 78685 52401 -154307 256111 -35386 -105526 -49281 62438
17766 -458418 125498 63000 -93330 -249107 94898 -143837 200091 -62593 15080 -43682 230982
17754 -145883 -121901 -71543 114432 -184673 12375 848 -40943 113102 174960 5820 -137751
17742 210214 261985 -26311 37623 251610 94236 -110698 -260905 75013 102954 -21559 80393
17730 28993 -154860 77274 23649 149953 -163718 102028 -164633 -76242 695 89482 21922
$$ packed form
17811d3610j92642P4144B53768m0808i755j65211f3527o9317j77018E5374K06628
17800B62002a19432j36732b3430m12333E5139J29872a69211F7076a57990k7086
17790a85076N8440d5507k09869l4172q3579a15839n3306b5655D3053i2320h183
17778H3445l2157J5194E816P2869k6284a54307B56111c5386p0140d9281F2438
17766d58418A25498o2498i3330j55777I4898a43837B00091f2593A5080d3682B30982
17754a45883K3982N0358A14432a84673A2375H48d0943A13102O1858E820a37751
17742B10214N1771b6311C7623K13987I4236a10698j50207G5013K7941b1559H0393
17730B8993a54860G7274B3649J26304a63718A02028a64633g6242F95Q8787B1922
$$ plain form
17718 126431 -311064 -26800 -297586 -87941 -241788 -274678 -333206 123952 101174 45584 229103
17707 229103 113271 -16874 42863 -54502 75749 -56302 -310756 -92922 471262 -157668 -279873
17696 -279873 140059 155905 164797 112166 -26114 62568 -40905 -265773 178943 55488 -76504
17684 38138 -708008 60461 180741 84818 26249 147669 -290748 135962 -55361 -59286 115270
17672 -46517 -420238 -28820 -239229 207546 54196 176289 -371149 -90565 -172720 -197527 -109635
17661 -109635 -118260 312063 307067 41985 111022 -40127 310526 11708 -360701 114774 2254
17649 -15619 10920 168756 -22327 465627 10976 -5386 -199739 -87625 7962 308936 92131
17637 -83965 27469 152273 -341358 112676 74450 -1672 23972 -337580 73654 -289964 314210
$$ packed form
17718A26431c11064b6800k70786h7941j53847l2890n8528A23952k2778D5584J83519
17707B29103A13271a6874D2863e4502G5749e6302k54454i2922D71262a57668j22205
17696b79873A40059J5846Q892n2631b6114F2568d0905k24868A78943E5488g6504
17684C8138g08008F0461J20280H4818B6249J21420b90748A35962e5361l925A15270
17672d6517l73721b8820k10409B07546E4196J22093c71149i0565q2155k4807Q7892
17661a09635q625C12063m996D1985O9037d0127C10526A1708c60701A14774B254
17649a5619A0920J57836b2327D65627A0976e386j94353h7625G962L00974I2131
17637h3965B7469J24804c41358A12676l8226a672B3972c37580G3654b89964C14210
$$ plain form
17625 -7597 106492 -100310 -8737 -149979 -103459 -9825 -123437 240339 70429 283717 143519
17614 143519 -63587 -281819 -123880 268617 245859 69606 -61405 225655 204599 229015 35031
17602 -150660 43913 302546 -208756 43339 102163 -189393 23924 286435 -31380 -57791 230825
17590 115553 59445 159925 63030 187213 -361655 128292 -142677 156638 174177 -2331
17579 -220173 406311 95437 -147331 -116054 -265956 -168473 -131602 32070 30008 -36419 -48208
17568 -48208 45559 27896 74961 -255463 -258750 29309 -189675 103202 -20119 267323 -37471
17556 48386 -164013 160033 62795 153829 175480 272802 -106143 176503 -64888 122205 -95014
17544 -6622 276513 56095 -165888 -130791 105990 103107 130 17414 -121068 265615 38578
$$ packed form
17625g597A06492a00310h737j41242M6520i825j13612B40339G0429K13288j40198
17614A43519f3587k18232a23880B68617k2758F9606f1405B25655k1056K4416C5031
17602a50660D3913K58633b08756D3339N8824a89393B3924K62511c1380k6411B30825
17590A15553n6108J00480F3030J24183c61655A28292a42677A56638J7539b331
17579b20173D06311I5437a47331L1277j49902R7483L6871C2070k062c6419j1789
17568d8208D5559j7663M7065b55463l287B9309a89675A03202b0119B67323c7471
17556D8386a64013A60033F2795R1034K1651R7322a06143A76503f4888A22205i5014
17544f622B76513E6095a65888L5097A05990k883A30J7284a21068B65615C8578
$$ plain form
17532 113335 -193479 -15389 53228 -60549 -182850 -53471 196440 299758 251170 -54203 200769
17520 128906 137921 -14178 552813 -118297 238380 147459 215368 -140632 -46099 -153411 5557
17508 147965 -290149 -44778 247885 -150930 210795 362954 68876 -127837 -100339 -60993
17498 -60993 319863 281668 98863 262069 -197774 260360 -65890 188340 -148483 216210
17487 114842 144939 31880 130469 169212 161869 -7229 49764 -58803 416670 403454 75183 -18007
17474 139978 162082 45433 207152 146323 -65539 296954 74525 49471 116984 169992 342105
17463 342105 -7648 -14626 346157 264100 180921 86951 42814 125064 65711 377194 212114
17452 212114 221038 14516 389579 160924 267063 251654 89166 215626 82474 59017 405078
$$ packed form
17532A13335a93479a5389E3228f0549j22301e3471A96440J03318m8588e4203B00769
17520A28906R015a4178E52813a18297B38380r0921O7909a40632d6099j07312E557
17508A47965b90149d4778B47885a50930B10795J52159F8876a27837K7498L9346
17498f0993C19863l8195I8863J63206a97774B60360f5890A88340a48483B16210
17487A14842L0097C1880R8589L8743p343g229D9764e8803D16670j3216G5183a8007
17474A39978K2104D5433J61719o0829f5539B96954G4525k5054O7513N3008J72113
17463C42105g648o978C46157q2057q3179H6951D2814Q2250n9353L11483j65080
17452B12114Q924A4516L75063A60924J06139j5409H9166J26460H2474k3457L46061
$$ plain form
17441 405078 -76308 343720 -2992 125631 407795 413091 413579 47885 -2710 212228 297017 480277
17429 480277 426042 112764 33306 173171 260335 279200 247689 370595 126530 456256
17419 456256 167516 382928 103456 337217 163240 -14805 12818 10210 311834 226269
17409 226269 171964 474399 -122535 -234552 -12057 153458 -26577 459163 319900 369374
17399 369374 72365 6444 309297 300435 12151 196126 277308 150752 30426 132126 353572
17388 353572 -317744 285167 354637 143108 359490 -252612 16299 31558 201821 122737
17378 122737 81610 -197659 -80074 75651 -259478 -89706 -119528 231706 -66817 -23407 109925
17366 316920 329756 255437 189041 -70794 167274 -259651 966 306923 177441 162365 127000
$$ packed form
17441D05078g6308C43720b992A25631K82164N296M88D7885b710B12228Q4789J83260
17429D80277n4235A12764C3306J39865Q7164J8865l1511J22906A26530L29726
17419D56256A67516K15412A03456K33761A63240a4805A2818k608L01624q5565
17409B26269n4305L02435a22535j12017a2057A53458b6577D59163j39263M9474
17399C69374G2365F444L02853q862A2151J83975Q1182j26556C0426J01700K21446
17388C53572c17744B85167O9470A43108K16382b52612A6299J5259J70263p9084
17378A22737m1127a97659h0074G5651b59478h9706k9822B31706f6817b3407A09925
17366C16920J2836p4319o6396g0794A67274b59651I66L05957j29482j5076l5365
$$ plain form
17355 127000 344666 25859 89734 108809 55597 16481 -93428 181038 -212766 -60655 95793
17343 197712 50846 67230 165178 62589 101880 -150270 -80639 139651 286001 273111 31151
17331 53422 25052 219212 355770 -10069 61486 169613 30145 234284 -43531 -133459 -236663
17320 -236663 206237 79473 -240883 17694 478297 184221 235602 362211 -86257 176396
17309 -287120 92238 325382 189449 258918 -243763 -381820 212430 172323 530953 -33813
17298 162847 22334 126487 167768 78249 260469 446660 603807 238016 315763 386266
17288 386266 124755 -219344 311978 294963 204842 162034 37100 135616 -52958 304702 88060
17276 238617 277590 59749 188612 378384 173230 106105 247202 504826 61226 14932
$$ packed form
17355A27000K17666B5859O3875J9075n3212A6481i3428A81038b12766f0655I5793
17343A97712E0846J6384R7948F2589L9291a50270O9631A39651J46350j2890C1151
17331E3422B5052J94160J36558a0069F1486J08127C0145K04139d3531q9928j03204
17320b36663B06237G9473b40883A7694M60603A84221N1381J26609h6257A76396
17309b87120I2238K33144j35933O9469b43763j38057B12430m0107L58630c3813
17298A62847B2334J04153M1281G8249J82220J86191J57147B38016P7747P0503
17288C86266A24755b19344C11978j7015r0121m2808C7100R8516e2958C04702H8060
17276B38617L8973E9749J28863J89772A73230o7125J41097K57624F1226A4932
$$ plain form
17265 152175 222913 47072 334886 277334 353891 77724 254641 -7418 93309 124369 122237
17254 122237 -215549 187285 222742 158162 154850 111675 85562 189987 285738 133509 -67242
17242 285166 181819 -118575 -675 16064 182188 263990 185217 100754 208635 62543 352785
17231 352785 -92645 179884 222033 309570 465503 43614 211160 183175 303720 265317 -41477
17219 138748 47638 362439 125705 480992 59811 486363 116333 119099 448422 505590
17209 505590 -82349 63019 38667 70659 310935 70440 245288 275380 182031 581102 208081
17197 94979 165422 -109486 314206 117277 149970 381075 135095 354054 184188 117503
17187 117503 225047 18079 -166918 -62461 315364 414257 334869 208957 160927 164652 -29749
$$ packed form
17265A52175P0738D7072K87814n7552P6557G7724J76917g418I3309L1060k132
17254A22237b15549A87285L5457o4580l312m3175k6113J04425R5751A33509f7242
17242B85166j03347a18575f75A6064J66124Q1802p8773q4463J07881F2543K90242
17231C52785i2645A79884M2149Q7537J55933D3614J67546k7985J20545l8403d1477
17219A38748D7638L14801A25705L55287E9811M26552A16333K766L29323N7168
17209E05590h2349F3019k4352L1992K40276G0440J74848L0092r3349L99071B08081
17197I4979P0443a09486C14206A17277L2693K31105A35095K18959j69866o6685
17187A17503J07544A8079a66918f2461C15364R8893p9388j25912m8030L725b9749
$$ plain form
17175 301658 -915 278919 89333 469748 195711 271742 64014 70962 392475 263612 182838
17164 182838 85749 123549 266751 247984 307358 220438 180627 606646 -28046 -138644 162166
17152 89888 401100 186498 299891 316743 135013 307197 769000 104745 187107 282626
17142 282626 161219 164215 269747 561482 107226 184202 330017 302453 614376 427845
17132 427845 307505 313522 343311 520951 299017 124289 409923 327047 421048 287319
17122 287319 56407 851650 270547 176868 533240 377947 179875 512390 776058 350605
17111 339959 350095 124435 162560 461019 591745 181232 467876 307757 42806 321809
17101 321809 394466 448779 356598 539738 521450 541486 456491 336337 359550 248222 465613
$$ packed form
17175C01658i15B78919H9333L80415A95711P6031F4014O948L21513j28863q0774
17164A82838H5749L7800J43202j8767N9374q6920l9811M26019b8046j10598A62166
17152H9888L11212A86498J13393J6852A35013J72184M61803A04745Q2362R5519
17142B82626j21407K996J05532K91735A07226P6976J45815k7564L11923j86531
17132D27845j20340O017K9789J77640k21934A24289K85634q2876R4001j33729
17122B87319E6407P95243B70547r3679L56372j55293A79875L32515K63668C50605
17111C39959J0136A24435L8125K98459J30726A81232K86644j60119D2806K79003
17101C21809P2657N4313r2181J83140j8288K0036q4995j20154K3213j11328K17391
$$ plain form
17090 465613 422439 442493 502081 405031 814396 252094 433396 84963 289006 379615 509297
17079 509297 428861 333432 240845 291042 249369 621846 112979 198473 526617 465450 256997
17068 256997 -31389 355275 405922 382772 323773 718403 471341 423247 263336 846285
17058 846285 494746 513329 500666 501198 370199 440935 613284 395245 294267 527579 191547
17046 184059 308697 528126 605903 526179 485818 339812 562738 599751 591542 415030 255443
17035 255443 414744 460412 487663 630057 746741 620600 794217 712826 837714 537623
17025 537623 593243 61238 848419 839495 659233 590945 533684 505446 877699 791852 211509
17013 522461 643888 520801 739166 288766 723493 463803 568536 762397 584422 401643
$$ packed form
17090D65613m3174K0054N9588r7050M09365B52094J81302H4963K04043R0609J29682
17079E09297q0436r5429r2587N0197m1673L72477A12979Q5494L28144o1167k08453
17068B56997c1389C55275N0647k3150n8999L94630k47062m8094j59911N82949
17058H46285l51539J8583j2663N32j30999P0736J72349k18039j00978K33312A91547
17046A84059J24638K19429P7777p9724m0361j46006K22926L7013q209j76512j59587
17035B55443J59301M5668K7251J42394J16684j26141J73617q1391J24888l00091
17025E37623N5620F1238P87181q924j80262o8288n7261k8238L72253q5847B11509
17013E22461J21427j23087K18365B88766M34727k59690J04733J93861j77975j82779
$$ plain form
17003 401643 724206 836067 602974 540540 951693 653445 690297 741713 698572 526717
16993 526717 567126 706380 685632 653583 761439 413623 474838 842424 711441 532806
16983 532806 944391 730894 939175 939422 1032710 766090 514434 811148 973528 775319
16973 775319 767102 1150907 974245 1154417 1073477 667079 596236 860093 1181726 949194
16963 949194 659137 1135426 861666 743042 759161 715111 749818 882593 998647 749225
16953 749225 1005554 957814 928353 1058300 1319794 1118449 811283 1076894 1127236 1064944
16943 1064944 1167754 930660 1198644 1067732 1054560 1156518 926732 832261 817200 972246
16933 972246 865348 1565817 1121174 1103248 1164618 1362775 1308762 1239616 1377943 1350363
$$ packed form
17003D01643L22563J11861k33093o2434M11153k98248L6852N1416m3141j71855
16993E26717M0409J39254k0748l2049J07856l47816O1215L67586j30983j78635
16983E32806M11585k13497K08281K47R3288k66620k51656K96714J62380j98209
16973G75319q217L83805j76662J80172q0940m06398p0843K63857L21633k32532
16963I49194k90057M76289k73760j18624J6119m4050L4707J32775J16054k49422
16953G49225K56329m7740k9461J29947K61494k01345l07166K65611N0342o2292
16943A064944J02810k37094K67984j30912j3172J01958k29786r4471j5061J55046
16933I72246j06898P00469m44643j7926O1370J98157n4013o9146J38327k7580
$$ plain form
16923 1350363 1056995 1251284 1082305 1505148 1728421 1272007 1075734 1382183 1646037
16914 1646037 1216383 1432938 1322309 1822609 1674312 1179894 1457119 1476733 1613563 1503933
16904 1503933 1288382 1680771 1775269 1590832 1486749 1533814 1729096 1800561 1466717 1710955
16894 1710955 1717808 1608603 2103112 1974976 1880256 1848762 2083937 1738286 1842281 1863180
16884 1863180 1778074 1720062 2030414 1970275 2069661 2061963 2074235 1829642 2227990 2204308 2122813
16873 2122813 2070185 2251333 2216419 2768268 2284315 2616335 2424559 2610178 2276133 2461734
16863 2461734 2817809 2741280 2752992 2438888 2474680 2781733 2503371 2773323 3013506 2993110
16853 2993110 2835338 2756603 2963287 3208734 3027234 3052209 3079154 3381672 3429259 3211893
$$ packed form
16923A350363k93368J94289j68979M22843K23273m56414j96273L06449K63854
16914A646037m29654K16555j10629N00300j48297m94418K77225J9614J36830j09630
16904A503933k15551L92389R4498j84437j04083M7065J95282P1465l33844K44238
16894A710955O853j09205M94509j28136r4720l1494K35175l45651J03995K0899
16884A863180q5106n8012L10352o0139R9386p698J2272k44593L98348k3682q1495
16873B122813n2628J81148l4914N51849m83953L32020j91776J85619l34045J85601
16863B461734L56075p6529J1712l14104L5792L07053k78362K69952K40183k0396
16853B993110j57772p8735K06684K45447j81500K4975K6945L02518M7587k17366
$$ plain form
16843 3211893 3473302 3635720 3868881 3564827 3475191 3845290 3600230 3636549 3842439 4077696
16833 4077696 3917533 3999039 4030696 4209099 4418451 4180127 4136312 4756672 4528652 4901849
16823 4901849 4817606 5098048 5053406 4999818 4788320 5322756 5490645 5450114 5713007 5764216
16813 5764216 5477486 5838792 5866282 6081161 6346861 6368658 6548724 6499126 6737903 6706750
16803 6706750 7090380 7428523 7682130 7560791 7764356 8289318 8019510 8473112 8977254
16794 8977254 8856584 8878150 9200658 9169395 9771356 10072099 10176822 10595299 10842304 11347952
16784 11347952 11311635 11754991 12122101 12379682 12894288 12973735 13685284 14140208 14586099 14779475
16774 14779475 15537728 15858663 16461072 17156466 17301738 18294917 19008680 19547334 20579215
$$ packed form
16843C211893K61409J62418K33161l04054q9636L70099k45060L6319K05890K35257
16833D077696j60163Q1506L1657J78403K09352k38324m3815O20360k28020L73197
16823D901849q4243K80442m4642n3588k11498N34436J67889m0531K62893N1209
16813E764216k86730L61306K7490K14879K65700K1797J80066m9598K38777l1153
16803F706750L83630L38143K53607j21339K03565N24962k69808M53602N04142
16794H977254j20670K1566L22508l1263O01961L00743J04723M18477K47005N05648
16784A1347952l6317M43356L67110K57581N14606P9447P11549M54924M45891J93376
16774A4779475P58253L20935O02409O95394J45272R93179P13763N38654J031881
$$ plain form
16765 20579215 20869117 21576323 22497574 23552024 24257347 25116460 26334136 27377768 28631716
16756 28631716 29922385 31213527 32802783 34115398 35883850 37641043 39478910 41134812
16748 41134812 43390162 45411837 48064203 50545291 53086855 56354298 59233276 62967056
16740 62967056 65992905 70293423 74222877 78819054 83672276 88711387 94390979 99839373
16732 99839373 106072775 112839326 119176798 126087706 133574350 141061467 148722994 155703715
16724 155703715 162985567 169617760 175960814 181307519 185738571 189236712 191506473 192665581
16716 192665581 192346880 190956969 187978699 183932547 178922998 172750805 166350666 159443575
16708 159443575 151910626 144431381 137173863 129728458 122785830 115306420 108995571 102348279
$$ packed form
16765B0579215K89902P07206R21251J054450P05323Q59113J217676J043632J253948
16756B8631716J290669J291142J589256J312615J768452J757193J837867J655902
16748D1134812K255350K021675K652366K481088K541564L267443K878978L733780
16740F2967056L025849M300518L929454M596177M853222N039111N679592N448394
16732I9839373O233402O766551O337472O910908P486644P487117P661527O980721
16724A55703715P281852O632193O343054N346705M431052L498141K269761J159108
16716A92665581l18701j389911k978270m046152n009549o172193o400139o907091
16708A59443575p532949p479245p257518p445405o942628p479410o310849o647292
$$ plain form
16700 102348279 96761587 90812553 85558143 80507983 76050331 71389923 67335158 63109768
16692 63109768 59803028 57404516 53760274 50890989 48631678 45879967 43791761 41390275
16684 41390275 39184613 37221659 35656520 34080169 32700548 31003916 29490784 28417289
16676 28417289 26921992 25857031 25147212 23798108 22980529 21968052 21378511 20374087
16668 20374087 19407152 18953311 18129838 17861862 17071557 16196292 15937838 15654905 15208004
16659 15208004 14541548 13644362 13528850 13182641 12748017 12394558 11825314 11647578 11020681
16650 11020681 10705787 10434105 10099188 10172177 9675073 9763762 9100772 8787375 8923875 8562735
16640 8562735 8211092 8262963 7743577 7990404 7570026 7173560 7333552 6865093 6542654 6770489
$$ packed form
16700A02348279n586692n949034n254410n050160m457652m660408m054765m225390
16692F3109768l306740k398512l644242k869285k259311k751711k088206k401486
16684D1390275k205662j962954j565139j576351j379621j696632j513132j073495
16676B8417289j495297j064961p09819j349104q17579j012477n89541j004424
16668B0374087r66935m53841q23473k67976p90305q75265k58454k82933m46901
16659A5208004o66456q97186j15512l46209m34624l53459n69244j77736o26897
16650A1020681l14894k71682l34917P2989m97104Q8689o62990l13397J36500l61140
16640H562735l51643N1871n19386K46827m20378l96466J59992m68459l22439K27835
$$ plain form
16630 6770489 6503489 6473120 6120924 6175707 6079433 5717613 5653923 5388673 5583125 5491483
16620 5491483 5431657 4717659 4954946 5421567 4904700 4748587 4742788 4495176 4502748 4678807
16610 4678807 4116643 4243198 3956002 4164714 3772692 4006955 3709418 3687202 3559081 3303334
16600 3303334 3272062 3537700 3586994 3356101 3029757 3377960 3310630 3327425 3223583 3195343
16590 3195343 2870231 2937910 2796008 2571716 2829695 2531007 2779199 2398185 2435613 2593815
16580 2593815 2552516 2038705 2225069 2570435 2536719 2573005 2293702 2129260 2195514 2348781
16570 2348781 2293702 1939246 1810813 2023348 1790930 2200348 2103041 2134479 1955278 2087669
16560 2087669 2003404 1887070 1778477 1966332 2330740 1777807 1860715 1728465 1553102 1568743
$$ packed form
16630F770489k67000l0369l52196N4783r6274l61820o3690k65250J94452r1642
16620E491483n9826p13998K37287M66621n16867j56113n799k47612P572J76059
16610D678807n62164J26555k87196K08712l92022K34263k97537k2216j28121k55747
16600C303334l1272K65638M9294k30893l26344L48203o7330J6795j03842k8240
16590C195343l25112O7679j41902k24292K57979k98688K48192l81014L7428J58202
16580B593815m1299n13811J86364L45366l3716L6286k79303j64442O6254J53267
16570B348781n5079l54456j28433K12535k32418M09418r7307L1438j79201J32391
16560B087669q4265j16334j08593J87855L64408n52933Q2908j32250j75363J5641
$$ plain form
16550 1568743 1782627 1660921 1902212 1622428 1633090 1424983 1481031 1398276 1540194 1692181
16540 1692181 2044976 1536948 1490974 1516144 1673103 1087491 1524433 1501892 1375187 906964
16530 906964 1176219 1075596 1202434 1292705 1193623 1466623 799629 1267925 1649620 1188372
16520 1188372 1249614 1145908 1210433 1207372 1090839 917261 1198414 965237 1267829 1092467
16510 1092467 1153101 1506278 989613 969631 735081 981407 1246933 1018617 1428362 1165925
16500 1165925 933767 1208422 1001105 674399 901202 785655 711093 888747 887875 865223
16490 865223 905745 937277 820451 638085 497490 899462 932791 554464 742145 580291
16480 580291 914506 504875 573385 488902 639215 796769 492383 746227 575257 949015
$$ packed form
16550A568743K13884j21706K41291k79784J0662k08107N6048q2755J41918J51987
16540A692181L52795n08028m5974K5170J56959n85612M36942k2541j26705m68223
16530I06964K69255j00623J26838R0271r9082K73000o66994M68296L81695m61248
16520A188372O1242j03706O4525l061j16533j73578K81153k33177L02592j75362
16510A092467O0634L53177n16665j9982k34550K46326K65526k28316M09745k62437
16500A165925k32158K74655k07317l26706K26803j15547p4562J77654q72k2652
16490H65223M0522L1532j16826j82366j40595M01972L3329l78327J87681j61854
16480E80291L34215m09631O8510q4483J50313J57554l04386K53844j70970L73758
$$ plain form
16470 949015 841307 808849 460138 985627 1105950 948190 1094815 701798 558241 649395
16460 649395 473124 681863 496499 590863 342916 796772 719280 659286 760158 963703
16450 963703 873726 304632 296713 419374 237972 342120 781927 618815 192489 662703
16440 662703 253808 512343 538225 317531 547167 392998 634134 507814 400502 387261
16430 387261 687073 507592 453840 308302 639426 578966 675490 312071 498326 461992
16420 461992 583612 262614 509065 587105 159057 529025 423031 377021 567231 241630
16409 420880 770122 582307 488440 198293 399530 366326 441741 419412 810097 291761
16398 337295 421378 567723 406680 467581 320135 365626 523074 284172 315730 231213
$$ packed form
16470I49015j07708l2458l48711N25489J20323j57760J46625l93017j43557R1154
16460F49395j76271K08739j85364R4364k47947M53856p7492n9994J00872K03545
16450I63703q9977C04632p919J22661j81402J04148M39807j63112A92489M70214
16440F62703B53808K58535K5882k20694K29636j54169K41136j26320j07312j3241
16430C87261K99812j79481n3752j45538L31124o0460R6524C12071J86255l6334
16420D61992J21620B62614K46451P8040A59057L69968j05994m6010J90210B41630
16409D20880L49242j87815r3867A98293K01237l3204P5415k2329L90685B91761
16398C37295Q4083J46345j61043O0901j47446M5491J57448k38902L1558q4517
$$ plain form
16388 231213 602002 407134 514963 348274 377539 236447 313718 372115 403982 442495
16378 442495 188121 -50954 440619 360278 223499 33575 420728 691245 500555 27386
16367 223569 321906 97738 369967 220240 610047 227462 383777 326223 279898 127568
16356 706686 228183 26410 -24855 150540 93070 276348 272254 506473 346634 123616
16345 470910 201882 295793 17534 346093 16380 -45087 191405 216984 315050 88395 677770
16334 677770 339912 329578 -50910 479547 280301 308602 -37762 588148 161344 324413
16324 324413 127635 -16334 128954 128357 329635 305750 120252 137878 332413 323532 169460
16313 169460 32396 121769 -16279 129929 280771 237186 103921 -12446 428866 435622 262516
$$ packed form
16388B31213L70789j94868J07829j66689K9265j41092P7271N8397L1867L8513
16378D42495A88121e0954D40619q0341j36779C3575L87153K70517j90690B7386
16367B23569R8337I7738K72229j49727L89807B27462J56315n7554m6325A27568
16356G06686B28183B6410b4855A50540n7470J83278m094K34219j59839A23616
16345D70910B01882R3911A7534L28559A6380d5087A91405K5579R8066H8395N89375
16334F77770l37858j0334e0910D79547j99246K8301c7762E88148A61344J63069
16324C24413A27635a6334A28954n97K01278k3885A20252J7626J94535q881j54072
16313A69460C2396Q9373a6279A29929J50842m3585A03921a2446D28866O756j73106
$$ plain form
16302 262516 125260 319970 211065 218266 -6922 -69240 188686 65687 363531 -118253 195031
16290 194312 147515 266664 18911 385633 217907 458749 89557 204904 323873 12777
16279 467766 398935 33805 222631 94079 -5139 -127483 215552 502774 143668 -214756
16268 78637 -26617 -142702 133109 78966 172753 -347346 249017 87473 346085 181412
16258 181412 212515 172033 154038 461871 -63732 410848 -5580 16731 98773 119708 207787
16247 207787 467878 13980 247895 69268 102322 -360033 -116366 -20755 161064 -246179
16236 315721 220968 446650 41729 114630 299397 -168843 297472 581809 206691 94196
16225 118245 221020 -36859 5042 182507 -30843 23080 -249887 49510 211458 205375 220714
$$ packed form
16302B62516A25260J94710j08905P201f922o2318A88686F5687K97844a18253A95031
16290A94312m6797J19149A8911L66722j67726K40842H9557J15347J18969A2777
16279D67766o8831C3805J88826I4079e139j22344B15552K87222A43668b14756
16268G8637b6617j16085A33109n4143R3787c47346B49017H7473K58612j64673
16258A81412L1103m0482j7995L07833f3732D10848e580A6731Q2042K0935Q8079
16247B07787K60091A3980K33915F9268L3054c60033a16366b0755A61064b46179
16236C15721r4753K25682D1729P2901J84767a68843B97472K84337B06691I4196
16225A18245J02775c6859E042J77465c0843B3080b49887D9510J61948o083J5339
$$ plain form
16214 220714 -207619 229939 177754 92475 -355443 -52977 -41605 298696 406832 170970
16203 -59650 286250 275078 90517 -53711 -30253 165427 283057 49024 164944 231361 167998
16192 167998 173117 5786 10505 -134756 181959 -35547 101333 195727 -134821 -99405 -30836
16180 -178032 176798 46872 -23697 336605 64134 -374906 594396 -296048 -37947 -119306
16170 -119306 290832 -35070 57799 99047 5390 141795 77431 164053 256697 -173578 112572
16158 248008 41631 -144232 146255 259488 -14590 -77883 57612 -253621 -329860 -214354
16148 -214354 -68082 -119138 -167644 85937 98427 -57926 -106358 218327 812 76374 78668 440534
16136 440534 13390 -151373 -209409 -179200 130965 210093 -274185 -9300 -138846 66284 81153
$$ packed form
16214B20714b07619B29939n2185q5279c55443e2977J1372B98696J08136A70970
16203e9650B86250j1172I0517e3711K3458A65427J17630D9024J15920O6417o3363
16192A67998N119E786M719a34756A81959c5547A01333R4394a34821L5416c0836
16180a78032A76798D6872b3697C36605F4134c74906E94396b96048c7947q1359
16170a19306B90832c5070E7799M1248E390J36405o4364Q6622R2644a73578A12572
16158B48008D1631a44232A46255J13233a4590o3293E7612b53621p6239J15506
16148b14354f8082n1056m8506H5937J2490e7926m8432B18327H12P5562K294L61866
16136D40534A3390a51373n8036L0209A30965P9128b74185i300j29546F6284J4869
$$ plain form
16125 81153 -114976 342368 -1147 187547 -141150 195016 -140100 -215470 -189668 59405 214310
16114 214310 -56890 -17613 89650 170576 205675 153082 210737 65520 174173 214888 265370
16103 265370 -60625 199474 65630 151682 171505 219755 21581 -289646 122768 -12059 -249104
16092 -249104 32016 25408 137477 -70828 59206 -104546 -105085 -147534 348075 -37515 283812
16080 52619 142920 -138416 -147592 108298 229153 -67736 23982 -86120 244083 -15599 -100469
16069 -100469 -185183 -247796 237385 132005 141035 -80376 -56004 -125720 -437 93719 -138579
16057 -198961 -69674 81881 -20994 -10408 -43753 224654 -22912 115758 68115 133738 320772
16046 320772 261276 670 33188 -75962 -44157 -26557 -155223 -117725 42973 -35271 12370 -345504
$$ packed form
16125H1153a14976C42368a147A87547a41150A95016a40100p5370K5802E9405J54905
16114B14310e6890a7613H9650Q0926L5099n2593N7655F5520J08653M0715N0482
16103B65370f0625A99474F5630Q6052J9823M8250B1581b89646A22768a2059k37045
16092b49104C2016o608J12069g0828E9206a04546n39m2449C48075c7515B83812
16080E2619R0301a38416r176A08298J20855f7736B3982h6120B44083a5599q4870
16069a00469q4714o2613B37385j05380R030h0376K4372o9716d37I3719a38579
16057a98961f9674H1881b0994a0408l3345B24654b2912A15758m7643O5623J87034
16046C20772n9496F70L2518g5962L1805J7600j28666L7498D2973c5271A2370c45504
$$ plain form
16033 -262452 -319240 -65951 -148117 180321 -305048 -143541 -196203 320103 -46375 346971
16022 18615 212974 -94519 -223717 -6351 -129598 -157299 -58492 137106 -359395 432528 -342755
16010 33619 -253455 17023 53425 -13293 79377 -114824 -246583 -93614 -185655 24314 -325263
15998 -236342 -287319 48503 113003 -213382 -91281 -225365 85011 -85009 -237250 150134 -82296
15986 -79171 16228 148680 130553 505843 24312 106915 189696 388195 -34674 -291266 218735
15974 35388 56533 258851 -152455 189575 -254459 -292434 -44896 123560 196465 145922 82191
15963 82191 -187592 236618 112856 95157 121116 -45022 61178 -4923 -197161 342349 -10886
15951 166697 -387936 -127676 -83244 -9351 -61210 51189 -287364 -83013 -273014 113999 325896
$$ packed form
16033b62452n6788f5951q2166A80321c05048a43541n2662C20103d6375C46971
16022A8615J94359i4519j29198f351j23247k7701e8492A37106c59395D32528c42755
16010C3619b53455A7023L6402a3293G9377a14824j31759i3614r2041B4314c25263
15998b36342n0977D8503O4500b13382i1281j34084H5011h5009j52241A50134h2296
15986g9171A6228J32452j8127L75290B4312Q2603Q2781J98499c4674k56592B18735
15974C5388K1145K02318a52455A89575b54459l7975d4896A23560P2905n0543o3731
15963H2191a87592B36618A12856j7699K5959d5022F1178d923j92238C42349a0886
15951A66697c87936a27676M4432i351n1859E1189b87364h3013j90001A13999K11897
$$ plain form
15940 325896 233322 -134159 -102619 13248 -212830 -132714 102647 219089 -97793 -43599 -118052
15929 -118052 -139288 192840 -52649 124686 -193557 -58569 -104675 2608 -122644 -119461 -144755
15918 -144755 -126006 191518 -21145 -100338 295154 -144946 -86506 -279672 -31173 -62160 -57023
15907 -57023 304687 -210136 147001 -15136 -336397 -204930 87723 -14588 124592 50992
15896 -413427 -17808 43477 373120 -207481 194944 122789 -186767 53277 -158764 -85027
15886 -85027 -40112 105155 -28583 246974 48290 -145123 -230296 -328999 -258062 -13612 163041
15874 -118757 79927 -80744 -71212 -81764 73063 250941 -329768 -15590 -335087 -336866 42604
15862 -1520 1502 20457 274544 281953 78426 149330 236769 -320321 53651 421713 -53207 106185
$$ packed form
15940C25896r2574a34159L1540A3248b12830Q0116A02647J16442i7793d3599p4453
15929a18052k1236A92840e2649A24686a93557e8569m6106B608a22644L183k5294
15918a44755J8749A91518b1145p9193B95154a44946N8440j93166c1173l0987N137
15907e7023C04687b10136A47001a5136l21261J31467H7723a4588A24592E0992
15896d13427a7808D3477L29643b07481A94944p2155a86767E3277a58764P3737
15886h5027d0112A05155b8583B46974D8290a45123q5173r8703P0937a3612A63041
15874a18757G9927h0744R532j0552G3063J77878c29768a5590l19497j779D2604
15862a520A502J8955K54087P409G8426P0904Q7439c20321E3651L68062e3207A06185
$$ plain form
15849 -199660 -1554 -129278 -136166 -183322 238612 -11421 -304763 234647 -87741 -80654 -154922
15838 -154922 -220723 67923 101520 312317 270979 126490 -190781 64062 -43836 -122518 -146347
15827 -146347 -205016 -31134 -211671 -82070 47549 -66002 223741 238147 281067 -24936 -100205
15816 -100205 -82481 -115815 14452 -370788 -226472 -97035 50888 46489 339202 -98507 70308
15804 113212 8533 -177072 -113136 -137042 -24867 53638 -146256 87918 137122 23175 -128955
15792 -16078 166457 -179556 -113203 -34042 -1206 -206581 -28357 -237101 165801 78324 -45747
15780 62613 46532 -29950 -106142 115348 -133742 58966 -396636 42500 -105520 215868 -100138
15768 -330210 -201342 -13660 -157412 -17376 6103 -75541 -59217 -214275 -185462 -12119 -68582
$$ packed form
15849a99660a554j27724o888m7156B38612a1421k93342B34647h7741P087p4268
15838a54922o5801F7923L3597K10797m1338A26490a90781F4062d3836p8682k3829
15827a46347n8669c1134j80537h2070D7549f6002B23741J4406M2920b4936p5269
15816a00205J7724l3334A4452c70788J44316i7035E0888m399K92713i8507G0308
15804A13212H533a77072O3936k3906b4867E3638a46256H7918M9204B3175a28955
15792a6078A66457a79556O6353c4042a206k05375b8357k08744A65801G8324d5747
15780F2613j6081b9950p6192A15348a33742E8966c96636D2500a05520B15868a00138
15768c30210J28868a3660j43752a7376F103g5541J6324j55058K8813a2119n6463
$$ plain form
15757 -68582 192986 179509 278199 175454 -19100 137162 39337 -267929 310442 142739
15746 80798 244408 255607 52234 237286 252816 -187422 -189604 175621 84947 -54086 -79798
15735 -79798 46933 15874 128540 -155206 128794 117374 -125934 148435 -202298 -118005
15725 -118005 -182154 -81616 -194017 173648 -44907 57155 43735 -120427 -241502 -201904 266061
15713 -215805 112176 -160609 5454 -142817 6558 34209 -222510 -288168 258798 -30604 -88850
15702 -88850 -199060 -118128 -180747 -40946 -7607 -304798 -50541 -358255 139549 406224 -249844
15690 115628 2078 -31097 95358 79621 -60562 -185981 -435361 -5834 -73208 -98525 107797
15678 -11300 126149 -54626 54719 -234547 -176666 -107044 156461 -154042 319541 105898
$$ packed form
15757f8582A92986j3477R8690j02745a9100A37162C9337b67929C10442A42739
15746H0798J63610J1199E2234J85052J5530a87422k182A75621H4947e4086k5712
15735g9798D6933A5874J12666a55206A28794j1420a25934A48435b02298Q4293
15725a18005o4149h1616j12401A73648d4907E7155j3420a20427j21075L9598B66061
15713b15805A12176a60609E454a42817F558K7651b22510o5658B58798c0604n8246
15702h8850j10210Q0932o2619d0946g607k97191e0541l07714A39549K66675b49844
15690A15628B078c1097I5358j5737f0562j25419k49380e834o7374k5317A07797
15678a1300A26149e4626E4719b34547N7881O9622A56461a54042C19541A05898
$$ plain form
15667 -254857 -1579 16930 7255 -447006 -270431 219231 -115818 -391553 -15993 -401111 -218110
15656 -218110 33670 -191129 90822 -191564 -182038 -268860 230281 133483 -17349 -124292 -181667
15645 -181667 -45565 31238 40835 33358 323343 -183747 207444 145156 -381950 -328842 -5515
15633 9771 -16260 -134449 77961 -269831 125801 -54684 110784 -178089 176285 -338094
15622 126686 96514 -171302 -31102 1375 -197886 86030 -245417 -174507 -49216 -277187 8279
15610 -254677 -289860 68651 -159276 -13350 -65777 -244089 -87319 -462634 -248483 176347
15599 91373 170609 -30235 -260937 -9158 194781 41149 84510 -88666 15940 137080 150534
15588 150534 141583 216896 -79230 46134 -56422 -7395 161312 -170790 194573 50286 68989
$$ packed form
15667b54857a579A6930G255d47006J76575B19231a15818k75735a5993l85118J83001
15656b18110C3670a91129I0822a91564R526q6822B30281r6798a7349j06943n7375
15645a81667d5565C1238R597p477K89985a83747B07444o2288c81950N3108e515
15633I771a6260j18189G7961b69831A25801e4684A10784a78089A76285c38094
15622A26686l0172a71302c1102A375a97886H6030b45417P0910d9216k27971H279
15610b54677l5183F8651a59276a3350n2427j78312h7319l75315K14151A76347
15599I1373P9236c0235k30702i158A94781D1149M3361h8666A5940J21140J3454
15588A50534q951P5313g9230D6134e6422g395A61312a70790A94573E0286J8703
$$ plain form
15577 68989 3008 -78716 25371 212969 36211 -256952 13413 48312 2058 -341166 -276080
15566 -276080 156640 5697 -141618 -402873 -9385 149835 -34520 -24565 -287754 -131977 -75943
15555 -75943 95952 -123818 -257390 -379188 11660 184675 177413 182946 -144541 42905 69865
15544 69865 301132 119558 -170771 -337536 215495 135046 9646 -41358 -91107 -138785 310669
15532 133977 -232183 171808 -176390 307247 -300225 -175387 253007 18794 137724 -1187
15521 187294 262127 -152994 23771 181200 232992 295805 190371 58090 -75617 -14273 -47676
15510 -47676 158543 -60827 -165776 -46971 -255842 -128330 112452 -272332 257957 -232905
15499 87564 81552 67512 136900 43614 -94590 -9784 161307 -130584 121589 -317661 -18660
$$ packed form
15577F8989C008g8716B5371J87598C6211b56952A3413L4899B058c41166O5086
15566b76080A56640E697a41618k61255i385A49835c4520R955k63189a31977N6034
15555g5943I5952a23818j33572j21798A1660J73015p262N533a44541D2905K6960
15544F9865K31267A19558a70771j66765B15495q0449I646d1358m9749m7678C10669
15532A33977b32183A71808a76390C07247c00225J24838B53007A8794J18930a187
15521A87294P4833a52994B3771J57429N1792O2813j05434E8090g5617a4273l3403
15510d7676A58543f0827j04949d6971k08871J27512A12452b72332B57957b32905
15499H7564o012j4040O9388D3614i4590i784A61307a30584A21589c17661a8660
$$ plain form
15487 298677 208177 -133196 -13421 36517 295052 -48162 45504 195015 -140526 -137934 -354549
15476 -354549 86386 3642 -73359 254023 -45479 100263 -19094 56292 -183957 -246965 -21128
15464 -85232 275486 79364 -43851 -308207 62753 16359 50415 21016 -24901 -108744 141003
15452 226599 -141297 58981 75812 105153 103294 -52515 -39368 -98208 -61131 229320 -129001
15440 -258226 -155788 211811 275244 -5017 -6555 2888 -208941 -32800 127519 122642 -25262
15428 -302244 -59838 31308 -340868 44364 -26299 216372 275323 -258474 148172 42118 -137
15416 -72092 31553 103056 -159889 60582 -381587 -251691 -284476 -393008 -131128 -139545 -96693
15405 -96693 -71734 -96607 -223746 53301 -31060 -251145 -298199 -137810 -83424 -85895 14073
$$ packed form
15487B98677r0500a33196a3421C6517K58535d8162D5504J49511a40526K592k16615
15476c54549H6386C642g3359B54023d5479A00263a9094E6292a83957o3008b1128
15464h5232B75486G9364d3851k64356F2753A6359L4056B1016b4901q3843A41003
15452B26599a41297E8981J6831K9341j859e2515J3147n8840L7077B29320a29001
15440b58226J02438B11811O3433e017j538B888b08941c2800A27519m877b5262
15428c02244e9838C1308c40868D4364b6299B16372N8951b58474A48172D2118a37
15416g2092C1553P1503a59889F0582c81587J29896l2785j08532a31128q417M2852
15405i6693K4959k4873j27139E3301c1060k20085m7054a37810N4386k471A4073
$$ plain form
15393 -162375 114399 105415 182112 -92684 -110081 10482 -108821 89243 -58877 -168018 -31262
15381 -220493 -156467 -36742 -71428 137548 231101 180804 571 26502 -99425 354546 -54559
15369 -82764 -299236 -125676 273029 -240247 -171977 194529 -181688 -289482 -168182 109816
15358 -267795 4632 165171 -40186 10071 156402 -90572 -121089 -250001 -30195 86921 -114164
15346 -12031 -13573 43338 107389 -244105 320418 -386848 162220 -7050 -318735 -160780 131210
15334 196977 172978 -19745 -236365 -28908 431825 -71878 -93501 137796 -85840 -132113 388324
15322 323538 168290 -283658 32677 206065 -260140 118021 237710 60244 -237173 -188174
15312 -188174 18793 181552 330273 170339 263690 267255 -200034 76025 287311 119992
$$ packed form
15393a62375A14399q984P6697i2684j7397A0482a08821H9243e8877j09141c1262
15381b20493O4026c6742l4686A37548R3553n0297E71K5931i9425C54546e4559
15369h2764k16472a25676B73029b40247O8270A94529a81688j07794J21300A09816
15358b67795D632J60539d0186A0071J46331i0572l0517j28912c0195H6921a14164
15346a2031j542D3338O4051b44105C20418c86848A62220g050l11685J57955A31210
15334A96977k3999a9745k16620b8908D31825g1878k1623A37796h5840m6273C88324
15322C23538j55248b83658C2677J73388b60140A18021J19689F0244b37173M8999
15312a88174A8793J62759J48721j59934R3351L565b00034G6025K11286A19992
$$ plain form
15301 101651 -167405 151512 -29785 80683 27092 187749 -44200 259492 213062 -31906 -123311
15290 -123311 -217929 128192 323471 123721 285054 346807 216388 178398 75717 183476
15280 183476 -108943 192759 -263545 186107 184378 199951 -8014 -17884 -62148 -86879 162525
15268 -7909 348889 308875 257742 83481 68293 12703 126196 -256172 1020 202334 108818
15257 108818 438041 -336894 -133754 119774 -54668 290992 165385 126276 664136 1172293
15247 1172293 1565641 1428126 1465384 1271372 311592 144778 18477 -136638 58426 -21540
15236 -45475 337857 -118324 -228834 307866 261741 186140 506327 225936 161638 -84790
15225 158595 155977 226280 -22128 206156 17912 234401 51200 152958 172571 155411 -7841
$$ packed form
15301A01651a67405A51512b9785H0683B7092J60657d4200B59492m6430c1906r1405
15290a23311r4618A28192J95279A23721J61333O1753j30419l7990G5717J07759
15280A83476a08943A92759b63545A86107j729J5573h014r870m4264k4731A62525
15268g909C48889m0014n1133H3481j5188A2703J13493b56172A020K01314r3516
15257A08818L29223c36894a33754A19774e4668B90992j25607l9109N37860N08157
15247A172293L93348j37515L7258j94012C11592A44778A8477a36638E8426b1540
15236d5475C37857a18324j10510C07866m6125p5601L20187B25936o4298h4790
15225A58595k618P0303b2128B06156A7912K16489E1200J01758J9613j7160g841
$$ plain form
15213 -166368 56194 -39106 63918 84797 102682 -85005 429404 28110 -164536 -102082 486793
15201 -79042 54181 130377 -106386 -48906 5660 213997 -10335 236131 259986 -7829 -209678
15190 -209678 292566 -253895 61492 420629 178891 -128047 -35912 294157 38321 25159
15180 25159 -72506 425760 74746 82619 166878 22312 -74168 -48785 1414 283183 116097
15168 14666 276661 78789 -9035 226090 224556 -18172 -148402 143436 18749 28229 -168984
15156 -261677 290004 -1097 19895 219949 55099 297461 201740 -125829 141234 -360098
15145 -165235 325389 70737 326042 188670 512650 302646 31807 94726 138527 -64385
15134 185275 197017 -63386 205398 362378 79710 133229 -225717 16001 305368 -85134 -124271
$$ packed form
15213a66368E6194c9106F3918K0879J7885h5005D29404B8110a64536O2454D86793
15201g9042E4181P6196a06386d8906E660K08337a0335B36131K3855g829k01849
15190b09678B92566b53895F1492L59137A78891a28047c5912B94157C8321j3162
15180B5159g2506D25760G4746P873Q4259B2312g4168K5383A414K81769A16097
15168A4666K61995G8789i035B26090j534a8172j30230A43436A8749R480a68984
15156b61677B90004a097A9895K00054E5099K42362r5721a25829A41234c60098
15145a65235C25389G0737K55305j37372L23980k10004C1807O2919M3801f4385
15134A85275J1742f3386B05398J56980G9710N3519b25717A6001K89367h5134l9137
$$ plain form
15123 -124271 -106351 174089 115536 -208833 355506 176019 62231 94818 400957 -60733
15112 86728 91187 98062 33548 19721 323172 67009 156068 389361 192857 506782 -134993
15100 212141 596358 -107533 24222 60541 212073 -17451 4830 279852 -97220 48246 -41384
15088 71033 242661 369602 298395 -5186 238132 365704 220733 142538 92001 -67599 -166198
15077 -166198 242375 -152524 238493 140775 375095 257842 -131068 -218068 23619 212313
15067 212313 285669 151846 320696 -200421 120372 215423 -396444 304815 261255 145542
15057 145542 121950 209251 341797 236334 322617 27930 159955 433434 428579 179620 344923
15046 344923 -41443 357627 115221 348148 -5926 12755 406374 242905 170486 60676 108178
$$ packed form
15123a24271J7920A74089n8553b08833C55506A76019F2231L2587L06139f0733
15112H6728M459O875C3548j3827L03451F7009Q9059K33293A92857L13925a34993
15100B12141L84217a07533B4222L6319J51532a7451D830K75022i7220D8246d1384
15088G1033J71628J26941p1207e186B38132J27572j44971p8195n0537f7599r8599
15077a66198B42375a52524B38493r7718K34320j17253a31068q7000B3619J88694
15067B12313P3356j33823J68850b00421A20372R5051c96444C04815m3560j15713
15057A45542k3592Q7301J32546j05463Q6283B7930J32025K73479m855A79620J65303
15046C44923d1443C57627A15221K32927e926A2755L93619j63469p2419F0676M7502
$$ plain form
15035 108178 482517 -18885 140647 295726 192107 179445 349191 39887 -145644 343158
15024 241742 95424 -117933 119889 30939 158464 403349 221964 203587 246750 142274
15014 142274 326987 102891 272591 198661 431587 309160 243973 79352 144912 -73695
15003 218612 300110 138068 -61355 -14339 213185 48911 170385 -39924 -462844 -28757 376647
14991 -200537 468736 158026 93700 -36068 -129970 -327023 189687 190824 174346 151931 384227
14980 384227 196874 57707 -27886 282062 231965 367287 -1492 -47897 -8749 141769 442134
14969 442134 170122 369243 187601 123530 -254848 142655 -14481 253656 -184125 -62836
14958 228369 157958 -182769 292063 600379 211150 311940 182425 191517 500598 302100
$$ packed form
15035A08178L74339a8885A40647J55079j03619j2662J69746C9887a45644C43158
15024B41742I5424a17933A19889C0939J27525K44885j81385j8377M3163j04476
15014A42274J84713A02891J69700p3930K32926j22427o5187G9352O5560g3695
15003B18612Q1498A38068f1355a4339B13185D8911J21474c9924m22920b8757C76647
14991b00537D68736A58026o4326c6068r3902j97053A89687J137j6478k2415K32296
14980C84227j87353E7707b7886B82062n0097J35322a492m6405h749A41769L00365
14969D42134A70122J99121j81642o4071b54848A42655a4481B53656a84125f2836
14958B28369p0411a82769B92063L08316B11150J00790j29515R092L09081j98498
$$ plain form
14948 302100 -91850 120116 149470 445227 -15811 20443 310250 103399 370491 572767
14938 572767 278578 70967 93486 170542 280583 90373 206673 128684 152449 178782 512557
14927 512557 387860 239586 314845 248763 354095 629345 120964 329521 24877 133814
14917 133814 461704 868933 327917 133180 308100 196351 573678 410499 216898 22264
14906 256977 410468 -266319 133900 205291 83492 463061 370206 351135 147993 455346
14896 455346 530409 231618 353329 209591 412487 119833 428381 329625 486188 594382
14886 594382 155192 236100 264865 357916 236593 88885 178374 511855 140854 210269 219354
14875 219354 455892 162174 33426 -46129 495294 322835 -45410 368117 309765 538339
$$ packed form
14948C02100i1850A20116K9354K95757a5811B0443K89807A03399K67092K02276
14938E72767B78578G0967K2519P7056J10041I0373J16300p7989K3765K6333L33775
14927E12557j24697j48274P5259o6082J05332K75250A20964K08557B4877J08937
14917A33814L27890M07229C27917A33180J74920j11749L77327j63179j93601B2264
14906B56977J53491b66319A33900P1391H3492L79569r2855j9071A47993L07353
14896D55346P5063B31618J21711j43738K02896A19833L08548r8756J56563J08194
14886E94382A55192Q0908K8765R3051j21323H8885Q9489L33481A40854O9415R085
14875B19354K36538A62174C3426d6129D95294j72459d5410C68117n8352K28574
$$ plain form
14865 538339 342361 403398 197230 495077 162572 250397 236782 584305 133126 139517
14855 139517 381855 383752 270383 207303 450375 445723 344392 161144 348530 307153 320041
14844 320041 377941 279421 425077 243005 529990 430868 365926 496657 444033 635999
14834 635999 672553 768618 540238 601470 452453 513394 222621 466237 166938 554076
14824 554076 375686 195339 568139 350004 568131 354975 82470 651348 470942 87691
14813 586999 664267 424463 562433 666782 368098 754616 237323 626835 89753 352874
14803 352874 343613 624659 134199 337648 644609 322480 464501 655509 550158 374171
14793 374171 678682 468006 341469 548403 368174 150439 625733 444907 456804 246506
$$ packed form
14865E38339j95978O1037A97230K97847A62572Q7825j3615L47523A33126O391
14855A39517K42338J897j13369o3080K43072m652j01331A61144J87386m1377J2888
14844C20041N7900r8520J45656j82072K86985r9122o4942J30731n2624J91966
14834F35999L6554R6065k28380O1232j49017O0941B22621K43616A66938L87138
14824E54076j78390j80347L72800k18135K18127k13156H2470N68878j80406H7691
14813E86999P7268k39804J37970J04349k98684L86518B37323L89512H9753K63121
14803C52874r261K81046A34199K03449L06961l22129J42021J91008j05351j75987
14793C74171L04511k10676j26537K06934j80229A50439M75294j80826J1897k10298
$$ plain form
14783 246506 279465 620712 623815 675002 624035 689466 385219 325884 612520 591686 733027
14772 733027 572641 898207 501718 641790 626568 316966 603020 339696 836226 433196
14762 433196 535854 565330 348944 446377 502315 725253 496271 192725 534327 680310
14752 680310 803593 366086 782386 674224 679413 380254 884428 436835 690313 489604
14742 489604 857266 663939 654829 554502 638577 669163 747696 614762 581264 706619 506140
14731 506140 692512 405235 683114 479115 762062 337387 783399 529971 593503 472835
14721 472835 599082 452738 440600 695017 647597 702616 808557 544225 633618 747508
14711 747508 624008 689212 753987 986028 939165 762122 699843 726522 901609 558573
$$ packed form
14783B46506L2959L41247L103N1187n0967O5431l04247n9335K86636k0834J41341
14772G33027j60386L25566l96489J40072j5222l09602K86054k63324M96530m03030
14762D33196J02658K9476k16386R7433N5938K22938k28982A92725L41602J45983
14752F80310J23283C66086M16300j08162N189k99159N04174D36835K53478k00709
14742D89604L67662j93327r110j00327Q4075L0586P8533j32934l3498J25355k00479
14731E06140J86372k87277K77879k03999K82947C37387M46012k53428O3532j20668
14721D72835J26247j46344j2138K54417m7420N5019J05941k64332Q9393J13890
14711G47508j23500O5204O4775K32041m6863j77043o2279K6679J75087l43036
$$ plain form
14701 558573 843095 801281 423432 747606 941711 774492 805700 945162 990399 864992
14691 864992 784924 1032243 669247 898838 543375 569568 954194 939394 949650 807771
14681 807771 904492 691607 903171 1019791 720835 678005 938587 911140 745034 959869
14671 959869 1354175 1089933 807867 892295 1215206 936743 857938 838993 972153 1041068
14661 1041068 1170871 1305039 1196266 1026244 1031025 709340 794575 1304036 1037820 696900
14651 696900 1006188 924327 1209487 1077965 884121 1098902 1028922 1182526 1017253 1309382
14641 1309382 1142710 1172362 1053730 1089476 703065 1010160 1210199 1104737 1011211 1131357
14631 1131357 1471211 1224439 1130927 1211396 1368397 1090278 916894 1179299 1019905 1636733
$$ packed form
14701E58573K84522m1814l77849L24174J94105j67219L1208J39462M5237j25407
14691H64992q0068K47319l62996K29591l55463K6193L84626j4800J0256j41879
14681H07771R6721k12885K11564J16620k98956m2830K60582k7447j66106K14835
14671I59869L94306k64242k82066Q4428L22911k78463p8805j8945J33160O8915
14661A041068J29803J34168j08773j70022M781l21685Q5235N09461k66216l40920
14651F96900L09288q1861K85160j31522j93844K14781o9980J53604j65273K92129
14641A309382j66672K9652j18632L5746l86411L07095K00039j05462r3526J20146
14631A131357L39854k46772r3512Q0469J57001k78119j73384K62405j59394O16828
$$ plain form
14621 1636733 1373032 1344300 1237229 1055332 1254997 1103140 1326038 1587864 1400124 1403703
14611 1403703 1443709 1584515 1626256 1275598 1502207 1379668 1295540 1380462 1609062 1329658
14601 1329658 1610458 1446971 1296974 1421506 1399041 1352033 1788878 1287545 1637054 1743374
14591 1743374 1496355 1813444 1552145 1385537 1880622 1470823 1694307 1725733 1390091 1564307
14581 1564307 1575729 1818860 1834319 1651461 1970345 2145801 1878437 1878053 1654705 1846865
14571 1846865 2048426 1739384 2311430 2208995 2092498 2227727 2117844 2413950 2263043
14562 2263043 2496563 2203515 2449103 2267612 2715643 2433135 2708878 2845205 2803984 3235862
14552 3235862 3547588 3961845 4880375 6345778 9848912 17956514 34147748 46918563
$$ packed form
14621A636733k63701k8732j07071j81897J99665j51857K22898K61826j87740L579
14611A403703M0006J40806M1741l50658K26609j22539q4128Q4922K28600k79404
14601A329658K80800j63487j49997J24532k2465m7008M36845n01333L49509J06320
14591A743374k47019L17089k61299j66608M95085m09799K23484L1426l35642J74216
14581A564307J1422K43131J5459j82858L18884J75456k67364l84k23348J92160
14571A846865K01561l09042N72046j02435j16497J35229j09883K96106j50907
14562B263043K33520k93048K45588j81491M48031k82508K75743J36327m1221M31878
14552C235862L11726M14257R18530J465403L503134Q107602J6191234J2770815
$$ plain form
14544 46918563 28589068 11966950 5584741 3477523 2983955 2125261 2175633 1992955
14536 1992955 1906596 2076757 1724361 2065209 1671282 1792883 2020449 1959887 2474181 2023389
14526 2023389 1952146 1673502 2135810 2216794 2495847 1959166 1951029 2013334 2350295 2220866
14516 2220866 2410125 2397125 2613098 2481387 2142998 2330105 2765985 2635750 2666514 2583319
14506 2583319 2727694 2894137 2433798 2579186 2593510 2924835 3070387 3035035 3039196 2598827
14496 2598827 2839432 3007839 3044179 3542810 3074275 3475237 3318775 3097215 3036916 3357639
14486 3357639 3260103 3090446 3529245 3116950 3434143 3449197 3760583 3563601 3461078 3786274
14476 3786274 3671598 3578041 3719739 3465782 3686639 3911646 3895237 3862166 3764337 4141282
$$ packed form
14544D6918563j8329495A1966950E584741k107218m93568q58694N0372j82678
14536A992955q6359J70161l52396L40848l93927J21601K27566o0562N14294m50792
14526B023389p1243k78644M62308Q0984K79053n36681q137O2305L36961j29429
14516B220866J89259j3000K15973j31711l38389J87107M35880j30235L0764q3195
14506B583319J44375J66443m60339J45388J4324L31325J45552l5352M161m40369
14496B598827K40605J68407L6340M98631m68535M00962j56462k21560o0299L20723
14486C357639r7536j69657M38799m12295L17193J5054L11386j96982j02523L25196
14476C786274j14676r3557J41698k53957K20857K25007j6409l3071r7829L76945
$$ plain form
14466 4141282 3916749 4280879 4124344 4296785 4169181 4552110 3895078 4838569 4713070
14457 4713070 4795602 4507670 4652068 4851820 4707663 4750355 5022368 4644939 4971888 5300564
14447 5300564 5195243 5096864 5003129 4936733 5508094 5482316 5654564 5367526 5509414 5590747
14437 5590747 5951994 5882971 5884154 5978569 6205293 6233060 5892323 5917370 6519616 6652900
14427 6652900 6347662 6803411 7057847 6984367 7155339 7137049 7369807 7067583 7610966 7314457
14417 7314457 7392556 7786701 7623829 8076031 7994673 8410291 8330710 8504582 8486943 8748805
14407 8748805 8797713 8691753 8731664 9164005 9237766 9498550 10040486 9709849 9484545 10100337
14397 10100337 10426194 10511360 10380576 10821186 10700766 11000517 11034049 11569182 11635670 11946079
$$ packed form
14466D141282k24533L64130j56535J72441j27604L82929o57032R43491j25499
14457D713070Q2532k87932J44398J99752j44157M2692K72013l77429L26949L28676
14447E300564j05321r8379r3735o6396N71361k5778J72248k87038J41888Q1333
14437E590747L61247o9023J183R4415K26724K7767l40737K5047O02246J33284
14427F652900l05238M55749K54436p3480J70972j8290K32758l02224N43383k96509
14417G314457P8099L94145j62872M52202q1358M15618p9581J73872j7639K61862
14407H748805M8908j05960L9911M32341P3761K60784N41936l30637k25304O15792
14397A0100337L25857Q5166j30784M40610j20420K99751L3532N35133O6488L10409
$$ plain form
14387 11946079 11766294 12265726 12562699 12712770 12871399 12844094 13403158 13909943 13895073 13994429
14377 13994429 14663433 14495547 15139697 15018637 15442809 15793047 16206476 16455472 16641556
14368 16641556 16986139 17522622 17659059 18202651 18411557 19091908 19045081 19626654 20061813
14359 20061813 20297267 21085469 21472533 22146398 22601446 22964567 23877564 24164188 24909140
14350 24909140 25291858 26146316 26497652 27259827 28123386 28594975 29608765 30026173 31153565
14341 31153565 31931078 32896763 33711717 34591235 35843162 36480047 37856165 38755925 39881146
14332 39881146 41375537 42393605 43637362 44778784 46964653 47821985 49655069 51710995
14324 51710995 52968857 54835227 56401933 58690855 60740395 62915385 64999319 67640379
$$ packed form
14387A1946079j79785M99432K96973J50071J58629k7305N59064N06785j4870R9356
14377A3994429O69004j67886O44150j21060M24172L50238M13429K48996J86084
14368A6641556L44583N36483J36437N43592K08906O80351m6827N81573M35159
14359B0061813K35454P88202L87064O73865M55048L63121R12997K86624P44952
14350B4909140L82718Q54458L51336P62175Q63559M71589J013790M17408J127392
14341C1153565P77513R65685Q14954Q79518J251927O36885J376118Q99760J125221
14332C9881146J494391J018068J243757J141422K185869Q57332J833084K055926
14324E1710995J257862J866370J566706K288922K049540K174990K083934K641060
$$ plain form
14316 67640379 70214143 72843837 75490314 78758529 82054924 85065535 88909357 92603343
14308 92603343 96336146 100960269 105312114 110048816 115230989 120698814 126271554 132545950
14300 132545950 139093970 145366455 152602278 160683964 169076901 177767887 187510419 197469960
14292 197469960 207979148 219300975 231436034 244233343 257251987 271375985 286312572
14285 286312572 301424587 317050837 333603030 350250089 367090691 384150508 400484824
14278 400484824 416789805 432287642 446513396 459157433 469927384 477041223 480328264
14271 480328264 479762262 477518312 476680967 474925260 471269648 463890617 454305251 443501026
14263 443501026 431459372 417179538 401018388 384218402 367262164 350258003 333180316
$$ packed form
14316F7640379K573764K629694K646477L268215L296395L010611L843822L693986
14308I2603343L732803M624123M351845M736702N182173N467825N572740O274396
14300A32545950O548020O272485P235823Q081686Q392937Q690986R742532R959541
14292A97469960J0509188J1321827J2135059J2797309J3018644J4123998J4936587
14285B86312572J5112015J5626250J6552193J6647059J6840602J7059817J6334316
14278D00484824J6304981J5497837J4225754J2644037J0769951P113839L287041
14271D80328264n66002k243950q37345j755707l655612p379031r585366j0804225
14263D43501026j2041654j4279834j6161150j6799986j6956238j7004161j7077687
$$ plain form
14256 333180316 316673651 300979962 286532493 271770323 257499931 244180002 231292399
14249 231292399 219233357 208142245 197315775 187396686 177788713 169176973 160806140
14242 160806140 153365833 145846090 138756563 132468956 126491527 120963566 115117268 110048717
14234 110048717 105306378 100702863 96675849 93041875 89450051 85553163 81920284 78858585
14226 78858585 75526085 72729493 70050945 67492224 64847263 62748751 60733524 58624532
14218 58624532 56637187 54723570 52663106 50995461 49408916 48391034 46799008 45133727
14210 45133727 43771198 42269370 41369770 40545848 39515521 37988388 36854728 35850733
14202 35850733 35260428 33948319 33441241 32527842 31326699 30752107 30130290 28996902 28543562
$$ packed form
14256C33180316j6506665j5693689j4447469j4762170j4270392j3319929j2887603
14249B31292399j2059042j1091112j0826470r919089r607973q611740q370833
14242A60806140p440307p519743p089527o287607n977429n527961n846298n068551
14234A10048717m742339m603515m027014l633974l591824l896888l632879l061699
14226G8858585l332500k796592k678548k558721k644961k098512k015227k108992
14218E8624532j987345j913617k060464j667645j586545j017882j592026j665281
14210D5133727j362529j501828q99600q23922j030327j527133j133660j003995
14202C5850733n90305j312109n07078r13399j201143n74592o21817j133388m53340
$$ plain form
14193 28543562 27663654 27031262 25935025 25599541 25318709 24633206 24003070 23468931 23071211
14184 23071211 22286626 22004759 21518712 20743481 20538640 20049251 19282908 18988138 18765494
14175 18765494 18315222 18150801 17426891 17433494 16778182 16544017 16278813 16017005 15921030 15529400
14165 15529400 15440983 15060417 14749205 14509260 14220590 13736958 13982925 13377176 12814653
14156 12814653 12961096 12504626 12439133 12159572 11851691 11771793 11433106 11657488 11336630 10834292
14146 10834292 10841298 10535890 10479050 10396382 10116414 9935560 9985744 10014656 9619905 9480165
14136 9480165 9455040 9332970 9016109 9213633 8840435 8684583 8856510 8620342 8253181 7952239
14126 7952239 7817519 8017362 7813719 7617523 7640268 7563851 7379694 7379328 7359537 7088204
$$ packed form
14193B8543562q79908o32392j096237l35484k80832o85503o30136n34139l97720
14184B3071211p84585k81867m86047p75231k04841m89389p66343k94770k22644
14175A8765494m50272j64421p23910O603o55312k34165k65204k61808r5975l91630
14165A5529400q8417l80566l11212k39945k88670m83632K45967o05749n62523
14156A2814653J46443m56470o5493k79561l07881p9898l38687K24382l20858n02338
14146A0834292P006l05408n6840q2668k79968j80854N0184K8912l94751j39740
14136I480165k5125j22070l16861J97524l73198j55852J71927k36168l67161l00942
14126G952239j34720J99843k03643j96196K2745p6417j84157l66j9791k71333
$$ plain form
14116 7088204 7036037 6988959 7129458 7028785 6587376 6653778 6532035 6664113 6724593 6133516
14106 6133516 6138561 6127575 5790657 5773063 5893633 5872062 5759571 6017957 5854495 5129501
14096 5129501 5682167 5636106 5539432 5669560 5221738 5218767 5037434 5241822 4920346 5302241
14086 5302241 5105400 4963583 4849749 4677055 4859925 5078747 5007737 4793632 4609839 4611949
14076 4611949 4456454 4123083 4290209 4245440 4228584 3974782 4381212 3916295 4124797 4562209
14066 4562209 4193870 4189537 3444373 4221955 3733589 3606470 3857623 3838677 3906748 3851401
14056 3851401 3882159 3473185 3473443 3544031 3372049 3653529 3654266 3078128 3402761 3314508 3363220
14045 3363220 3123519 3006402 3137647 3432126 3177945 3233437 3193796 3358243 3298661 3072804
$$ packed form
14116G088204n2167m7078J40499j00673m41409O6402j21743J32078O0480n91077
14106F133516N045j0986l36918j7594J20570k1571j12491K58386j63462p24994
14096E129501N52666m6061r6674J30128m47822k971j81333K04388l21476L81895
14086E302241j96841j41817j13834j72694J82870K18822p1010k14105j83793K110
14076D611949j55495l33371J67126m4769j6856k53802M06430m64917K08502M37412
14066D562209l68339m333p45164P77582m88366j27119K51153j8946O8071n5347
14056C851401L0758m08974K58P0588j71982K81480P37n76138L24633q8253M8712
14045C363220k39701j17117J31245K94479k54181N5492l9641J64447n9582k25857
$$ plain form
14035 3072804 2751910 2972105 2785555 2907422 3082249 2818590 2710038 2860201 2920607 2691507
14025 2691507 2939699 2771997 2605790 2794349 2671615 2206858 2430229 2549676 2623982 2188605
14015 2188605 2256831 2112009 2022162 2486484 2603120 2372039 2510306 2458525 2297524 2063003
14005 2063003 2221496 2188665 2235354 2074046 2133242 2211256 2105028 1898368 1888282 1822347
13995 1822347 1715040 1935936 1711601 1864044 2081689 2300311 3005558 5123241 11476501
13986 11476501 27184049 45254331 32151572 15735887 9105685 6248483 4963752
13979 4963752 4254036 3790345 3231750 3279533 2919908 2942485 2580721 2566166 2566237 2343852 2434460
13968 2434460 2343392 2581459 2331015 2238742 2215124 2164627 2166086 2194394 1962762 2228654 2155799
$$ packed form
14035C072804l20894K20195j86550J21867J74827k63659j08552J50163O0406k29100
14025B691507K48192j67702j66207J88559j22734m64757K23371J19447P4306m35377
14015B188605O8226j44822q9847M64322J16636k31081J38267n1781j61001k34521
14005B063003J58493l2831M6689j61308N9196P8014j06228k06660j0086o5935
13995A822347j07307K20896k24335J52443K17645K18622P05247K117683O353260
13986A1476501J5707548J8070282j3102759A5735887o630202k857202j284731
13979D963752p09716m63691n58595M7783l59625K2577l61764j4555P1k22385R0608
13968B434460r1068K38067k50444r2273k3618n0497J459K8308k31632K65892p2855
$$ plain form
13957 2155799 2069493 1919933 1968341 1941761 2070294 2053967 2201340 2098443 1871506 1817239
13947 1817239 1689398 1990015 1663346 1928168 1424789 2141091 1612204 1863077 2005689
13938 2005689 1781270 1649778 1303775 1413933 1622349 1482552 1880638 1364565 1540368
13929 1540368 1399201 1535897 1636524 1479511 1327587 1697602 1225468 1641072 1529841
13920 1529841 1453884 1588566 1848588 1368448 1548523 1483392 1263446 1518982 1515386 1654358
13910 1654358 1266589 1118349 1701109 1138627 1336037 1666532 1395981 1031662 1362028
13901 1362028 1182599 1499654 1089229 1418217 1527075 1549376 1293858 1066142 907935 1229422
13891 1229422 1406597 1230914 1202837 1087855 1176860 1140173 974117 1226195 1271328 814130
$$ packed form
13957B155799q6306j49560M8408k6580J28533j6327J47373j02897k26937n4267
13947A817239j27841L00617l26669K64822n03379P16302n28887K50873J42612
13938B005689k24419j31492l46003J10158K08416j39797L98086n16073J75803
13929A540368j41167J36696J00627j57013j51924L70015m72134M15604j11231
13920A529841p5957J34682K60022m80140J80075o5131k19946K55536l596J38972
13910A654358l87769j48240N82760n62482J97410L30495k70551l64319L30366
13901A362028j79429L17055m10425L28988J08858K2301k55518k27716j58207L21487
13891A229422J77175j75683k8077j14982Q9005l6687j66056K52078M5133m57198
$$ plain form
13881 814130 1330060 1218354 1292446 1494591 1030870 1268581 1271320 1075628 858922 1215928
13871 1215928 1104598 1072620 1239260 922460 1064429 1094794 911483 1115482 1205298 902207
13861 902207 822691 1108988 1214023 730135 1393127 1363984 1025127 1005390 1433149 1030817
13851 1030817 1027884 1025347 1107742 1203821 1428766 1078190 734930 989780 875071 665576
13841 665576 761841 899306 617409 956012 706250 973296 880564 1027210 1109159 756831
13831 756831 669274 859063 1022874 925492 556246 1060805 1015064 957145 609031 944506
13821 944506 960776 619939 706936 712684 986833 1018124 626385 1116755 903386 981940 621781
13810 621781 522115 829644 848011 740487 926577 771811 774619 675059 584338 895842 631757
$$ packed form
13881H14130N15930j11706P4092K02145m63721K37711K739j95692k16706L57006
13871A215928j11330l1978J66640l16800J41969L0365j83311K03999Q9816l03091
13861I02207p9516K86297J05035m83888O62992k9143l38857j9737M27759m02332
13851A030817k933k537Q2395R6079K24945l50576l43260K54850j14709k09495
13841F65576R6265J37465k81897L38603k49762K67046r2732J46646Q1949l52328
13831G56831q7557J89789J63811r7382l69246N04559m5741n7919l48114L35475
13821I44506J6270l40837Q6997N748K74149L1291l91739M90370k13369P8554l60159
13810F21781r9666L07529J8367j07524J86090j54766K808r9560r0721L11504k64085
$$ plain form
13799 631757 738285 755896 936530 693834 943755 923679 801140 541308 866834 695309
13789 695309 946815 627025 705930 1048485 642614 467188 782438 266626 540812 913978
13779 913978 506968 668897 793300 550741 765120 587074 875649 472991 657999 344693
13769 344693 625031 701742 747272 557965 611621 687184 730896 854161 630873 733997
13759 733997 886087 589729 467722 563138 731447 937325 705047 742405 655991 586892
13749 586892 363265 746106 342194 369637 503407 526220 126310 429421 706090 456564
13739 456564 634589 436261 409171 667252 278970 699793 384624 540423 398057 485671
13729 485671 333411 497608 275167 570451 399882 513795 484246 767380 615394 467269
$$ packed form
13799F31757J06528J7611J80634k42696K49921k0076j22539k59832L25526j71525
13789F95309K51506l19790P8905L42555m05871j75426L15250B66626K74186L73166
13779I13978m07010J61929J24403k42559K14379j78046K88575m02658J85008l13306
13769C44693K80338P6711M5530j89307N3656P5563M3712J23265k23288J03124
13759G33997J52090k96358j22007R5416J68309K05878k32278L7358q6414o9099
13749E86892k23627L82841C42194K7443J33770K2813A26310L03111K76669k49526
13739D56564J78025j98328k7090K58081B78970M20823l15169J55799j42366Q7614
13729D85671j52260J64197k22441K95284j70569J13913k9549K83134j51986j48125
$$ plain form
13719 467269 45907 428591 694554 401423 592524 596720 641288 601027 328861 691845
13709 691845 737982 327301 530338 498150 763592 519725 394260 605461 588230 261769
13698 691270 377908 543037 558892 389931 600122 447157 285155 311696 512797 707767
13688 707767 660897 425452 545968 595491 439921 637237 709943 797229 655602 482342
13678 482342 760528 536124 524873 540230 575329 395792 748708 441838 414649 568781
13668 568781 561824 413276 108282 676007 454752 367588 466748 449575 234483 229930 256779
13657 256779 311536 377176 586727 480520 481502 477987 391814 193067 584285 646904 158534
13645 346246 482163 286426 416036 483299 277961 257257 472734 405080 95493 100277 572467
$$ packed form
13719D67269D5907L82684K65963k93131J91101M196M4568m0261k72166L62984
13709F91845M6137C27301K03037l2188K65442k43867j25465K11201j7231B61769
13698F91270l13362J65129J5855j68961K10191j52965j62002K6541K01101J94970
13688G07767m6870k35445J20516M9523j55570J97316P2706Q7286j41627j73260
13678D82342K78186k24404j1251J5357L5099j79537L52916l06870k7189J54132
13668E68781o957j48548A08282N67725k21255q7164R9160j7173k15092m553K6849
13657B56779N4757O5640K09551j06207R82l515q6173A93067L91218O2619A58534
13645C46246J35917j95737J29610O7263k05338k0704K15477o7654I5493M784M72190
$$ plain form
13634 572467 231204 457913 -42067 735594 720215 430251 602603 417917 455531 98324
13623 462869 529641 214986 467148 390866 151273 191232 653311 515918 604693 278874
13612 462239 389764 290619 759961 282282 437040 487688 98242 297648 466525 -80415
13601 373882 490877 93708 345226 285791 575843 219169 521538 667526 503927 280248
13591 280248 377028 282227 286800 115520 582261 351031 215551 579183 476324 389296
13581 389296 445865 271605 175879 -8292 475867 617485 179992 184257 253160 449396 247802
13570 247802 -25931 443178 682884 202018 328512 136120 113477 527360 331656 254817
13560 254817 212277 473822 189444 222182 575952 543244 383618 229543 635816 428164
$$ packed form
13634E72467B31204K26709d2067G35594j5379k89964J72352j84686L7614I8324
13623D62869O6772B14986K52162p6282A51273L9959M62079j37393Q8775B78874
13612D62239p2475r9145M69342B82282J54758N0648I8242J99406J68877h0415
13601C73882J16995I3708K51518n9435K90052B19169L02369J45988j63599k23679
13591B80248R6780r4801M573A15520M66741k31230j35480L63632j02859q7028
13581C89296N6569j74260r5726h292D75867J41618A79992M265O8903J96236k01594
13570B47802b5931D43178K39706B02018J26494A36120k2643M13883j95704p6839
13560B54817m2540K61545A89444L2738L53770l2708j59626j54075M06273k07652
$$ plain form
13550 428164 617078 282551 397937 341245 411555 126347 222709 293173 317861 439675
13540 439675 260927 43246 420237 115540 262852 256292 605065 312573 340558 200464
13530 200464 181480 613296 36066 430889 366444 362807 147775 144985 302731 235071 60064
13518 332183 403244 200040 278375 380969 340465 177524 284484 486107 90645 85488 172393
13507 172393 129117 -25980 -61312 324341 147115 129918 178458 210654 -136633 219420 405143
13496 405143 217588 -4172 -91373 354172 -89125 -128047 433407 72856 361436 304137 118881
13484 233109 87848 456483 -76508 238954 406432 172819 447203 319352 346362 261245
13474 261245 192146 66959 211904 133736 289412 161599 198646 128699 291263 146504
$$ packed form
13550D28164J88914B82551J15386n6692P0310A26347R6362P0464K4688J21814
13540D39675j78748D3246L76991A15540J47312o560L48773k92492K7985j40094
13530B00464j8984M31816C6066L94823o4445l637A47775k790J57746o7660F0064
13518C32183P1061B00040P8335J02594m0504j62941J06960K01623I0645n157Q6905
13507A72393m3276b5980l5332C24341A47115j7197M8540L2196a36633B19420J85723
13496D05143j87555d172q7201C54172h9125l8922D33407G2856K88580n7299A18881
13484B33109H7848L68635g6508B38954J67478A72819K74384j27851K7010q5117
13474B61245o9099F6959J44945p8168J55676j27813L7047o9947J62564j44759
$$ plain form
13464 146504 432337 273270 -69391 133508 257070 316742 166616 254055 381783 278051
13454 278051 256116 71466 226595 110887 474324 252350 427995 172795 287536 266512
13444 266512 -7621 49976 129343 195049 181216 88415 125650 241484 285572 168 490173 428668
13432 428668 -4284 13419 48219 263190 264471 264458 330926 379923 398975 -118927 143754 347157
13420 347157 342680 263162 -234859 364714 324801 189592 190819 426781 375183 217270 143377
13409 143377 -73434 74345 430342 410920 145763 41190 177534 29145 131864 49102 367178
13398 367178 326061 160635 484252 114497 234873 471313 202628 58993 58168 5437 3131
13387 3131 -182043 330661 263614 145781 344487 389792 73679 15869 63070 162173 121053
$$ packed form
13464A46504K85833j59067f9391A33508J23562N9672j50126Q7439J27728j03732
13454B78051k1935G1466J55129A10887L63437k21974J75645A72795J14741k1024
13444B66512g621D9976P9367O5706j3833H8415L7235J15834M4088A68M90005o1505
13432D28668d284A3419L4800K14971J281j3O6468M8997J9052a18927A43754K03403
13420C47157m477p9518b34859C64714l9913j35209J227K35962n1598j57913p3893
13409A43377g3434G4345L55997j9422A45763D1190J36344B9145J02719D9102L18076
13398C67178m1117A60635L23617A14497J20376K36440B02628E8993q25E437k306
13387C131a82043C30661o7047j17833J98706M5305G3679A5869M7201R9103m1120
$$ plain form
13376 121053 306227 228177 367609 12075 -123465 590587 354093 47275 36624 495305
13366 495305 454975 192535 360285 144839 -22978 248920 233095 98502 321395 2054 139704
13355 139704 4411 238757 414439 168269 155866 -19945 462029 353951 40762 413504
13345 413504 -5410 552313 -37403 114165 423802 378516 111481 93416 111794 15785 422982
13334 422982 141963 214513 -168145 -138933 -137240 8620 -32112 283393 -107457 122281 344576
13323 344576 421984 81948 251024 231824 137 291466 397621 62013 484528 219506 169859
13312 169859 235375 -52007 82037 255285 150105 326611 293805 177919 120924 173358 123765
13301 123765 329090 717025 54569 8716 37889 189270 261843 -137762 366316 -194957
$$ packed form
13376A21053J85174p8050J39432A2075a23465E90587k36494D7275j0651M58681
13366D95305m0330A92535J67750A44839b2978B48920j5825I8502K22893B054J37650
13355A39704D411K34346J75682A68269j2403a9945D62029j08078D0762L72742
13345D13504e410E52313c7403A14165L09637m5286A11481j8065J8378A5785M07197
13334D22982A41963P2550a68145K9212J693H620c2112B83393a07457A22281K22295
13323C44576P7408H1948J69076j9200A37K91329J06155F2013M22515B19506m9647
13312A69859O5516e2007H2037J73248j05180J76506l2806j15886n6995N2434m9593
13301A23765K05325L87935E4569H716K9173J51381P2573a37762C66316a94957
$$ plain form
13290 8813 406845 280117 186927 280094 124570 286270 83631 248978 93209 -17475 20068
13278 130976 -111938 -161372 -7998 362669 207595 -27409 306981 153797 124928 183421 22169
13266 -111898 269499 33731 -65625 296224 125314 227768 145734 -81444 -6118 297321 348023
13255 348023 115098 30061 471534 196793 108802 -81853 -52499 507844 12595 147802
13245 147802 -113838 141211 97035 226780 -105143 165275 302941 205274 47439 93038
13235 93038 179189 272568 -12748 -53758 -76416 437735 89580 -3610 374620 289933 301842
13224 301842 -34574 -101811 106923 -8209 -204073 -105958 -163765 218573 341803 76135 203501
13213 203501 -232155 145944 49339 74688 539307 84238 -46630 -216741 -12411 229368
$$ packed form
13290H813L98032j26728r3190R3167A24570J61700H3631J65347I3209a7475B0068
13278A30976a11938m9434g998C62669j55074b7409C06981j53184k8869N8493B2169
13266a11898B69499C3731f5625B96224A25314J02454q2034h1444f118B97321N0702
13255C48023A15098C0061M41473A96793q7991h1853K9354E07844A2595J35207
13245A47802a13838A41211m4176J29745a05143A65275J37666r7667D7439M5599
13235I3038Q6151R3379a2748m1010k2658D37735H9580c610C74620q4687J1909
13224C01842c4574o7237A06923h209j95864R8115n7807B18573J23230G6135J27366
13213B03501b32155A45944D9339K5349M64619H4238d6630j70111a2411B29368
$$ plain form
13202 212992 212030 99683 2068 38203 -74302 93062 316363 -365809 -34824 3365 11867 448587
13190 448587 38110 -5069 44526 34484 -46349 -174502 -38291 -52703 179706 -147577 332054
13178 -109918 41382 308713 132068 30661 -132983 -30261 39617 -47335 204321 284451 251211
13167 251211 178714 307892 41687 -221341 -179281 327082 386265 55418 -23914 235265 265558
13156 265558 127287 -108745 357193 -170920 322959 -43283 355535 290275 27690 -321777
13145 15167 56959 327904 -11897 301912 153222 294743 106218 36643 17911 54736 -11959
13133 -318736 39142 187930 40273 -6246 -119360 -274010 147167 292829 -290475 -79402
13122 -111410 178142 52725 215571 158549 76799 385827 61831 -121434 42811 70206 341671
$$ packed form
13202B12992r62I9683B068L6135g4302I3062K23301c65809c4824C365Q502M36720
13190D48587C8110e069D4526j0042d6349j28153c8291j4412A79706a47577C32054
13178a09918D1382K67331A32068C0661a32983c0261C9617d7335B04321Q0130l3240
13167B51211p2497J29178D1687b21341M2060C27082N9183E5418b3914B35265L0293
13156B65558A27287a08745C57193a70920C22959d3283C55535o5260B7690c21777
13145A5167M1792K70945a1897C01912j48690J41521A06218C6643A7911L6825a1959
13133c18736C9142J48788D0273f246j13114j54650A47167J45662b90475g9402
13122a11410A78142E2725J62846n7022G6799L09028F1831a21434D2811K7395K71465
$$ plain form
13111 341671 240627 222524 480868 47175 121432 -101886 -35515 -106496 500742 53206 11513
13099 311943 122127 87316 -185125 302344 125220 -213191 437699 138954 -68838 -64025
13089 -64025 -13904 193188 374853 340203 114007 157178 -120203 -42036 -7828 127929 -119970
13077 39894 -106652 -15919 56204 184694 457065 126518 -35992 315019 177123 212403
13067 212403 1358 -167377 183401 -10247 150608 101943 151561 248819 479422 -34663 -148763
13056 -148763 -238079 515621 -123946 322762 247457 -95008 190555 -27566 21763 52189 -113553
13044 202754 -62878 -2753 -252770 -201217 -185901 173232 -51486 162192 469723 -358108 732090
13032 165780 -11749 179263 191615 140305 105164 116196 -93946 285737 -139294 699 93625
$$ packed form
13111C41671j01044j8103K58344D7175P4257a01886c5515p0981E00742E3206A1513
13099C11943A22127l4811a85125C02344A25220b13191D37699A38954f8838M813
13089f4025a3904A93188J81665l4650A14007M3171a20203d2036g828A27929a19970
13077C9894a06652a5919E6204J28490K72371A26518c5992C15019j37896L5280
13067B12403A358a67377A83401a0247A50608m8665M9618R7258K30603c4663j14100
13056a48763q9316E15621a23946C22762p5305i5008A90555b7566B1763L0426a13553
13044B02754f2878b753k50017N1553J5316A73232e1486A62192L07531c58108G32090
13032A65780a1749A79263J2352n1310l5141J1032i3946B85737a39294F99R2926
$$ plain form
13021 93625 104868 -105272 317329 437093 185578 132831 -24437 51088 134888 -20134 130591
13009 80008 -443256 -206436 112386 104304 -159574 -21725 259640 -51287 8126 17672 262024
12998 262024 -98537 53391 83232 186058 -131657 -203826 -60937 380167 -27163 -215831 -227346
12987 -227346 57 -201070 -67657 -104530 -153201 130281 249394 -90803 49085 316201 -233395
12975 -130091 -42263 -234939 161200 -168016 184688 -337909 80123 115779 -42359 192710
12964 64876 -150775 306771 -336888 236004 -105418 213052 -197265 -128720 186624 77812
12953 194235 -12106 93946 23314 324925 -207108 72561 25080 130649 275238 377241
12943 377241 -70123 -128125 124680 283641 295844 229796 -158668 -40268 322854 297096 -12063
$$ packed form
13021I3625J1243a05272C17329J19764A85578n2747b4437E1088Q3800b0134A30591
13009H0008d43256b06436A12386q082a59574b1725B59640e1287H126R546K44352
12998B62024i8537E3391K9841J02826a31657p2169f0937C80167b7163j88668j1515
12987b27346E7b01070f7657l6873m8671A30281J19113i0803D9085K67116b33395
12975a30091d2263j92676A61200a68016A84688c37909H0123L5656d2359A92710
12964F4876a50775C06771c36888B36004a05418B13052a97265O8545A86624G7812
12953A94235a2106I3946B3314L01611b07108G2561B5080J05569J44589J02003
12943C77241g0123n8002A24680J58961J2203o6048a58668d0268C22854k5758a2063
$$ plain form
12931 6017 59526 -113048 -2328 -2191 76611 120630 -53266 119818 -45013 -264664 -1122 -72433
12919 -72433 19166 46222 -167789 -304927 -45335 522187 -124752 -470077 -144697 111919
12908 29052 227395 12162 258261 -125624 112714 -95254 17934 118141 -113567 69382
12897 -467889 -194363 46155 -16256 152713 1295 -16717 -136983 -156928 246495 209313 293716
12886 293716 73992 -26173 136827 65498 79141 105764 35749 -135883 -25567 335004 -123906
12874 120517 -59250 -118158 318537 85880 -31501 -94059 82578 330834 36631 184424 18296
12862 364444 -157274 -188721 -26877 269135 -65575 2234 -298152 -117807 -59880 261686 44265
12850 -139919 70920 36733 -173322 -84184 -5163 -102601 202283 6925 -170832 58965 -300289
$$ packed form
12931F017N3509a13048b328J37G6611M4019e3266A19818d5013k19651a122p1311
12919g2433A9166K7056a67789j37138d5335E22187a24752l45325a44697A11919
12908B9052J98343A2162K46099a25624A12714i5254A7934J00207a13567F9382
12897d67889a94363D6155a6256A52713A295a6717j20266j9945B46495l7182Q4403
12886B93716G3992b6173A36827F5498J3643K6623C5749a35883b5567C35004a23906
12874A20517e9250n8908C18537H5880c1501o2558H2578K48256C6631J47793A8296
12862C64444a57274l1447b6877B69135f5575B234b98152a17807N7927B61686D4265
12850a39919G0920l4187a73322h4184e163r7438B02283F925a70832E8965c00289
$$ plain form
12838 -156072 -64966 163992 -16496 316156 162051 139509 -88006 65339 -149096 -325498
12828 -325498 -5334 201625 299947 260385 218993 222255 113885 257735 -7502 204203 450500
12817 450500 -230987 -47660 361809 77781 88532 128227 130384 -93367 -35200 324055 -320324
12805 18931 -85323 230986 183640 -82843 -75260 18315 36452 -295783 -33797 -247720 -245956
12794 -245956 -212972 191984 -55430 120759 -7402 256401 202275 -67303 -406783 302847 186415
12783 186415 219473 -257406 -5327 -111698 -317922 -131716 -70702 -5366 -10468 187809 -90559
12771 -234778 -89778 202742 -235831 363149 47333 -351713 208661 -131720 229408 -446363
12760 -46080 99163 125074 -210466 90285 107812 -75751 -72803 -324363 -99905 174773 397808
$$ packed form
12838a56072f4966A63992a6496C16156j54105k2542h8006F5339a49096j76402
12828c25498e334B01625R8322l9562m1392L262j08370J43850g502B04203K46297
12817D50500b30987d7660C61809G7781J0751L9695K157i3367c5200C24055c20324
12805A8931h5323B30986m7346h2843P583A8315J8137b95783c3797k13923J764
12794b45956L2984A91984e5430A20759g402B56401n4126f7303l39480C02847j16432
12783A86415L3058b57406e327j06371k06224a31716O1014e366n102A87809i0559
12771b34778h9778B02742b35831C63149D7333c51713B08661a31720B29408d46363
12760d6080I9163K5911b10466I0285J7527g5751K948k51560i9905A74773K23035
$$ plain form
12749 397808 -170183 -109935 103586 -47263 155600 144471 33872 -82739 -74241 -34553 -115503
12738 -115503 110330 46519 120319 314037 248869 107538 202218 349050 151947 177995
12728 177995 363856 33873 268092 -4360 156232 61917 -140420 254615 80953 89166 -175594
12716 189896 -137050 -74724 323374 203391 159980 -14230 268486 314777 558712 -33606
12705 321776 343044 44140 -176685 -196821 111179 561549 358978 273204 -117034 -121611 -164147
12694 -164147 142661 -74156 -210253 16911 149443 -107311 72498 -168115 -117016 171256
12683 -148804 227520 91719 -515 -449928 334295 284491 181323 32539 435120 -272700 -119300
12671 -146692 239995 -3279 180719 -178332 -278933 22799 -71276 -58699 223807 -102486
$$ packed form
12749C97808a70183O0248A03586d7263A55600j1129C3872h2739Q498c4553q0950
12738a15503A10330D6519P3800J93718o5168A07538R4680J46832A51947K6048
12728A77995J85861C3873K34219d360A56232F1917a40420B54615H0953Q213a75594
12716A89896a37050O2326C23374j19983m3411a4230B68486M6291K43935c3606
12705C21776K1268D4140a76685k0136A11179M50370k02571q5774a17034m577m2536
12694a64147A42661g4156j36097A6911J32532a07311G2498a68115N1099A71256
12683a48804B27520I1719e15m49413C34295m9804j03168C2539M02581b72700a19300
12671a46692B39995c279A80719a78332j00601B2799g1276J2577B23807a02486
$$ plain form
12660 70872 361532 -163195 58357 338858 -48320 483024 81673 160161 24590 423357 29235
12648 -134907 -3527 -56088 91228 104731 539484 -112470 188727 208101 366682 -32429 64033
12636 172261 179627 53295 -20338 -176133 271203 -147308 124982 403308 -38270 262558
12625 -68548 191032 153076 469658 148125 78144 553556 -204816 -81510 199121 -22031
12614 111411 2691 -72948 -18340 7129 -223912 88042 -29810 -122733 -162265 -255884 -126352
12602 58265 -97577 153489 188440 210694 242900 87784 -77219 64746 -161983 48467 419002
12591 419002 -9622 196561 305729 -77041 82213 -41619 168652 98330 76928 81485 -32768
12579 100839 -29448 -28927 -192370 -983 112153 -194039 143419 35868 89307 104218 57762
$$ packed form
12660G0872K90660a63195E8357K80501d8320D83024H1673P8488B4590L98767B9235
12648a34907c527n2561I1228J3503M34753a12470A88727J9374J58581c2429F4033
12636A72261P366E3295b0338j55795B71203a47308A24982K78326c8270B62558
12625f8548A91032l7956L16582A48125o9981M75412b04816h1510A99121b2031
12614A11411B691g2948a8340G129b23912H8042b9810r2923l9532r3619a26352
12602E8265i7577A53489L4951K2254L2206H7784g7219F4746a61983D8467L70535
12591D19002i622A96561J09168g7041H2213d1619A68652p0322k1402M557c2768
12579A00839b9448N21j63443i83A12153a94039A43419C5868N3439J4911m6456
$$ plain form
12568 57762 159391 282953 432440 -44436 56366 -68869 -33384 205818 -139832 333662
12557 93268 39707 -186479 -208317 204055 84552 -64372 -95472 -65895 -207247 218656 13913
12545 9431 14425 41604 93444 58679 46250 186099 -327826 196889 217632 253340 -190848
12533 -141845 384234 48450 -20281 -25329 -29891 78250 142021 69022 87901 240158 -288348
12521 54174 -188302 -149929 -157868 -237746 -36596 92649 -76946 90944 259345 -13402 5108 17254
12509 17254 30856 20981 -64756 179328 -240343 105625 -34655 58182 295077 323332 -197730
12497 270833 -201567 41877 -242535 -60975 -116870 100693 145473 -60536 -196233 -199675 -86706
12485 -144557 92424 105290 101425 135163 -364152 -237068 -247912 -364404 -83157 118428 -58486
$$ packed form
12568E7762J01629J23562J49487d4436E6366f8869c3384B05818a39832C33662
12557I3268C9707a86479k1838B04055H4552f4372l1100K9577j41352B18656A3913
12545I431M994K7179N1840l4765j2429J39849c27826A96889K0743L5708a90848
12533a41845C84234D8450b0281n048m562G8250O3771F9022J8879J52257b88348
12521E4174a88302L8373p939p9878c6596I2649g6946I0944J68401a3402E108J2146
12509A7254J3602r875f4756A79328b40343A05625c4655E8182K36895K8255a97730
12497B70833b01567D1877b42535f0975n5895A00693M4780f0536j35697l442h6706
12485a44557I2424J2866l865L3738c64152J27084j0844j16492h3157A18428e8486
$$ plain form
12473 -4635 31292 50977 -184784 219682 -167479 -30258 -110987 -63096 -91329 95638 -9349
12461 236779 -28070 -221366 -159879 33599 -239525 -63852 245107 -227025 -75959 64352 222683
12450 222683 -181178 26172 -125059 151566 80731 182872 -154146 -66201 86990 152492
12440 152492 299757 -326953 78852 27300 -196743 89908 218095 6457 176610 193961 -101665
12428 -116376 -13339 513645 178188 349958 382282 -102276 30801 92692 -320215 243690
12417 -222318 -212257 -133390 120000 136424 -329937 38043 9390 -373329 334962 103155 155059
12406 155059 -22004 -164858 24270 -459716 -198184 -214242 -284089 134055 123486 155202 -135011
12394 66293 -58235 53927 61724 -178912 -267497 -21274 -20241 295082 -266834 276724 -152282
$$ packed form
12473d635C1292J9685a84784B19682a67479c0258q0729M7891k8233I5638i349
12461B36779b8070j93296O1487C3599b39525f3852B45107b27025g5959F4352J58331
12450B22683a81178B6172a25059A51566p0835J02141a54146f6201H6990O5502
12440A52492J47265c26953G8852B7300a96743H9908J28187F457J70153J7351a01665
12428a16376a3339E13645A78188J71770L2324a02276C0801O1891c20215B43690
12417b22318J0061P8867A20000J6424c29937C8043I390c73329C34962A03155N1904
12406A55059b2004j42854B4270d59716a98184j6058o9847A34055j0569L1716a35011
12394F6293e8235E3927P797a78912q8585b1274J033B95082b66834B76724a52282
$$ plain form
12382 -72753 116273 -187219 70217 -195802 -17316 -186748 -102896 116728 -228712 62266
12371 -4221 -219842 -161189 10068 -16799 -10415 249555 10054 -367896 152361 -308341 226242
12359 177130 -32045 5160 45094 -5188 183286 -67359 90388 94775 467706 46842 56917 62958
12347 62958 -63079 216331 -49111 68128 104 7908 61720 116863 373406 155465 85299 -26117
12334 -42532 25467 -106004 303251 27300 -45383 -309798 228653 -107903 -377202 49392
12323 5345 36418 315606 -56639 371938 -101279 -29417 -88497 102266 -130561 -4607 177328
12311 -48658 113519 -211441 45565 -210376 52549 -110669 -110404 -303927 -95780 -30601 -145582
12300 -145582 95021 135174 10158 -376925 187014 38381 218858 217202 -242887 -10695 196896
$$ packed form
12382g2753A16273a87219G0217a95802a7316j69432Q3852A16728b28712F2266
12371d221k15621N8653A0068a6799O384B49555A0054c67896A52361c08341B26242
12359A77130c2045E160L9934e188A83286f7359I0388M387L72931D6842J0075O041
12347F2958f3079B16331d9111F8128A04P804N3812N5143K56543A55465p0166b6117
12334d2532B5467a06004C03251B7300d5383k64415B28653a07903k69299D9392
12323E345L1073K79188e6639C71938a01279b9417n9080A02266a30561d607A77328
12311d8658A13519b11441D5565b10376E2549a10669K65j93523i5780c0601j14981
12300a45582I5021M0153A0158c76925A87014C8381J80477j656b42887a0695A96896
$$ plain form
12288 35719 89932 169310 296719 277055 494343 -29254 -63891 111354 300253 306681 252411
12277 252411 145340 43860 303506 55457 77521 293310 -56516 -50800 279761 -193565 -456
12265 -36850 232281 62061 -7280 98223 301777 -132151 -110565 22180 130436 84947 244923
12254 244923 157383 -161121 2769 196893 228082 -210358 67482 136753 22085 10539 297572
12243 297572 35667 -305895 32239 -218252 82091 242166 -2072 54803 383428 74025 155148
12232 155148 142018 -30213 -128905 271201 370555 43690 371789 489806 165764 -36420 -184503
12221 -184503 181951 254165 499996 -24730 69733 257553 378281 159146 155997 236425 226984
12210 226984 230151 337048 -16242 228334 -85214 -371935 44158 -136486 128522 253550
$$ packed form
12288C5719N4213P9378J27409j9664K17288b9254l4637A11354J88899O428n4270
12277B52411j07071D3860K59646E5457K2064K15789e6516N716B79761a93565d56
12265c6850B32281F2061g280I8223K03554a32151K1586B2180J08256m5489J59976
12254B44923q7540a61121B769J94124L1189b10358F7482O9271B2085A0539K87033
12243B97572C5667c05895C2239b18252H2091J60075b072E4803L28625G4025Q1123
12232A55148j3130c0213r8692B71201R9354D3690L28099J18017A65764c6420j48083
12221a84503A81951P2214K45831b4730F9733J87820J20728A59146l149Q0428r441
12210B26984L167J06897a6242B28334h5214k86721D4158a36486A28522J25028
$$ plain form
12200 253550 237353 146217 120871 38670 -17103 126977 148833 178921 253454 -15510 -79072
12189 -79072 -1045 342228 -133352 41270 669858 -155936 -182903 -30304 -39157 185193 205777
12178 205777 102675 24538 196179 -150160 291841 466858 240230 270058 49645 -202732
12167 77818 -85287 -122209 107935 157541 -316419 243936 -127273 175955 28612 152116
12157 152116 -8681 151803 202388 336503 -294487 344891 18233 -10074 -107855 102728 165548
12146 165548 -11172 536520 -11903 214017 -4659 -47620 249206 37842 83585 206346 -104133
12134 -75464 -212666 278691 -19307 -164589 124840 -105340 42161 249371 -93482 -139775
12124 -139775 354345 -201675 -267694 233497 100401 427007 -96044 40839 347072 -81344
$$ packed form
12200B53550j6197r1136k5346C8670a7103A26977K1856L0088P4533a5510o3562
12189g9072a045C42228a33352D1270O28588a55936k6967c0304q853A85193K0584
12178B05777A02675B4538J71641a50160B91841J75017k26628K9828D9645b02732
12167G7818h5287l6922A07935M9606c16419B43936a27273A75955B8612J23504
12157A52116h681A51803N0585J34115b94487C44891A8233a0074r7781A02728O2820
12146A65548a1172E36520a1903B14017d659m2961B49206C7842M5743J22761a04133
12134g5464j37202B78691a9307j45282A24840a05340D2161K07210i3482m6293
12124a39775C54345b01675o6019B33497A00401L26606i6044D0839L06233h1344
$$ plain form
12113 -200442 221545 410850 -32238 211991 -142766 394466 -124408 -193393 -285659 387351
12102 -74511 102408 -42733 -130184 -130391 -53383 209639 -123951 199956 -125472 124788 -134999
12090 -273563 -43491 158473 152678 74296 -118373 141784 -201715 -435905 -33117 103160
12079 -93394 140233 161263 111159 92892 -67356 -126802 38178 -38935 225031 1198769 1066266
12068 1066266 853597 278601 -17353 36240 160213 139946 -126834 336884 160341 -67710
12057 3237 -48729 91858 34021 80521 -53185 -113588 280555 -45144 -226518 335958 46326
12045 -57182 -142200 -94876 -54461 238766 -6388 150569 269474 28129 -347564 104443 -78015
12033 -94108 -259284 169154 48460 237661 29290 379932 -51304 -68398 -174185 69849 174024
$$ packed form
12113b00442B21545J89305c2238B11991a42766C94466a24408o8985r2266C87351
12102g4511A02408d2733q7451k07e3383B09639a23951A99956a25472A24788a34999
12090b73563d3491A58473n795G4296a18373A41784b01715k34190c3117A03160
12079i3394A40233K1030n0104j8267f7356n9446C8178c8935B25031R73738j32503
12068A066266k12669B78601a7353C6240J23973k0267a26834C36884A60341f7710
12057C237d8729I1858C4021M6500e3185o0403B80555d5144j81374C35958D6326
12045e7182q5018M7324M0415B38766f388A50569J18905B8129c47564A04443g8015
12033i4108j65176A69154D8460J89201B9290L50642e1304j7094j05787F9849J04175
$$ plain form
12022 174024 -158018 -160485 -158609 205722 47846 88115 -199143 149890 -587342 46930 -195801
12010 -47219 240623 -127167 -107039 250398 24138 180178 177549 -156709 31803 -4956 53952
11998 153596 85851 154027 -202760 30843 254981 -203375 -40565 66385 -240843 -167272 -128652
11987 -128652 -201355 -185439 73503 72855 27670 131819 100363 165537 -271368 -28590 -189152
11976 -189152 -436368 111829 -72237 -11342 2046 -253654 -70921 985 -173108 118985 -206634
11964 155011 116520 -105765 57184 227778 -51472 232104 20088 197568 -132609 114378
11953 -72615 -121743 -146862 -59829 350237 -107686 -64918 11747 112378 201493 145945 -25858
11941 115991 79066 232978 47403 421669 -13763 -58341 50121 -314195 225056 -10651 -77424
$$ packed form
12022A74024a58018k467J876B05722D7846M0269a99143A49890e87342D6930a95801
12010d7219B40623a27167K0128B50398B4138J56040k629a56709C1803d956E3952
11998A53596o7745O8176b02760C0843K24138b03375d0565F6385b40843P3571L8620
11987a28652p2703J5916G3503o48B7670J04149l1456O5174b71368b8590j60562
11976a89152k47216A11829g2237a1342B046b53654g0921I85a73108A18985b06634
11964A55011l8491a05765E7184J70594e1472B32104B0088J77480a32609A14378
11953g2615m9128k5119e9829C50237a07686M2768A1747J00631Q9115n5548b5858
11941A15991l6925J53912D7403L74266a3763m4578E0121c14195B25056a0651o6773
$$ plain form
11930 -77424 184139 186344 -169162 -117025 -126597 -205637 178850 222829 -159300 -121020 44553
11918 69617 157494 183297 4464 52755 137122 11651 37875 -95571 -153124 -18425 -385287 21718
11905 -254155 -3522 -106822 -46644 70735 -91346 178412 -143431 -209466 285311 26442 -13454
11893 -362290 -23401 -276616 -66550 -300746 -270529 -26634 -227955 131702 -120530 74065
11882 -72743 411573 -119394 -2401 -49471 -85182 -264617 -335597 133553 -114421 50219 -271076
11870 -42266 99798 -108914 -44113 -94835 -176957 -69220 -111936 -19869 -55654 25312 -345687
11858 21360 -300079 -46694 -42027 -14448 -3950 62770 186782 174809 -73993 383874 -147617
11846 161224 12216 147072 -63170 -302478 135969 84686 -117633 -12668 48383 9298 -66638
$$ packed form
11930g7424A84139K205a69162N2137r572p9040A78850M3979a59300L8280D4553
11918F9617Q7877K5803D464M8291Q4367A1651K6224i5571n7553a8425l66862B1718
11905b54155c522j03300d6644G0735i1346A78412a43431o6035B85311B6442a3454
11893c62290b3401k53215f6550k34196L0217b6634k01321A31702a20530G4065
11882g2743D11573a19394b401m7070l5711j79435p0980A33553a14421E0219b71076
11870d2266I9798a08914d4113n0722q2122f9220m2716a9869l5785B5312c45687
11858B1360c00079d6694M667a4448c950F2770J24012j1973g3993C83874a47617
11846A61224A2216J34856f3170k39308A35969n1283a17633a2668D8383I298f6638
$$ plain form
11834 109039 -193517 -318867 9496 -260501 215688 -39164 -135855 -146361 -84118 -20799 48650
11822 -94334 134037 8817 -206206 -17488 -272695 240884 -89389 -12978 -87204 -276144 -238295
11811 -238295 -67305 -10387 -119531 -191267 -14978 245492 127663 -240523 -3829 -130114 200337
11799 107171 37677 -139798 -76029 274559 -89828 -116432 -123138 111569 160557 143201 35212
11787 -58870 -159491 165294 193563 -42520 115611 108419 181282 447 -37945 -50376 158427
11775 -130315 15651 -114889 363402 -260933 527 -105084 -90034 66165 -45091 -403929 -275468
11764 -275468 106816 -310244 292616 83040 -132604 -194033 -17229 136668 -114877 148858
11753 141715 150449 -235688 33544 96623 -158973 -94623 21423 -118530 -253715 -143165 12719
$$ packed form
11834A09039a93517j25350I496b60501B15688c9164r6691j0506O2243b0799D8650
11822i4334A34037H817b06206a7488k55207B40884h9389a2978p4226j88940L7849
11811b38295f7305a0387j09144p1736a4978B45492j17829b40523c829j26285B00337
11799A07171C7677a39798O3769B74559h9828k6604o706A11569M8988j7356C5212
11787e8870j00621A65294K8269d2520A15611p192P2863D47c7945j2431A58427
11775a30315A5651a14889C63402b60933E27a05084J5050F6165d5091l58838J28461
11764b75468A06816c10244B92616H3040a32604o1429a7229A36668a14877A48858
11753A41715Q734b35688C3544O3079a58973O4350B1423a18530j35185J10550A2719
$$ plain form
11741 51814 -24850 -126255 201338 152382 -271888 202510 -88600 204928 -36788 -75423 100176
11729 -75330 122718 -54075 -190421 87975 -223470 4053 97385 -249885 49592 263909 -132894
11717 30348 326524 150582 212820 186334 202299 -243593 -242470 -60486 -358124 -113218 -8363
11705 -47639 -102507 159089 -125314 -83936 28784 -42798 7458 -219759 -127009 -180494 9953
11693 -46832 46477 306542 23990 64661 -58610 -15905 -128738 -131697 -218232 393035 279066
11682 279066 450024 -362261 172495 -60551 142638 -75218 -160530 139214 316024 -48976
11671 30238 -228438 -271770 -147400 326695 -22472 -69394 -291652 245306 -10764 38180 -311901
11659 -142933 -101621 -135653 34953 -173787 53898 -77314 315395 -117291 113216 125804 -89494
$$ packed form
11741E1814b4850j01405B01338m8956b71888B02510h8600B04928c6788l8635A00176
11729g5330A22718e4075j36346H7975b23470D053R3332b49885D9592K14317a32894
11717C0348K96176A50582O2238k6486J5965b43593J123f0486k97638a13218h363
11705d7639n4868A59089a25314M1378B8784d2798G458b19759R2750n3485I953
11693d6832D6477K60065B3990M0671e8610a5905j12833k959q6535C93035j13969
11682B79066J70958c62261A72495f0551A42638g5218q5312A39214J76810d8976
11671C0238b28438m3332J24370C26695b2472m6922k22258B45306a0764C8180c11901
11659a42933M1312l4032C4953a73787E3898g7314C15395a17291A13216J2588h9494
$$ plain form
11647 99687 103293 65738 -62996 -197638 -184353 156247 -159605 449133 -275556 -44797 -63146
11636 -63146 123037 416318 -27824 -15652 -385488 226258 76731 28921 -4872 11514 91891
11625 91891 25516 62441 412956 -47886 -310475 -65340 -15633 30155 -69658 -143788 -228860
11614 -228860 -333649 -214643 24826 98499 127343 196083 40612 -28164 70300 158959 -24384
11602 -35965 -170425 -486603 -96079 -88506 -51681 73747 -145231 -160716 146313 -72524 1464
11590 66784 -14878 -62738 -113337 142879 -31349 43791 321623 290319 164721 375083 -24884
11578 -95056 -115716 -72685 107085 -58863 292740 -64997 147043 575 204663 -46219 136788
11566 138716 156754 -120256 3781 66369 174511 79877 125916 232498 98405 273195 -279703
$$ packed form
11647I9687L606l7555f2996j34642J3285A56247a59605D49133b75556d4797j8349
11636f3146A23037K93281b7824J2172l69836B26258G6731B8921d872A1514Q0377
11625I1891B5516L6925L50515d7886k62589f5340a5633C0155f9658p4130q5072
11614b28860j04789J19006B4826P3673K8844O8740D0612b8164G0300Q8659b4384
11602c5965j34460l16178i6079P573L6825G3747a45231j5485A46313g2524A464
11590F6784a4878m7860n0599A42879c1349D3791K77832l1304j25598K10362b4884
11578i5056k0660M3031A07085e8863B92740f4997A47043E75K04088d6219A36788
11566A38716J8038a20256C781O2588J08142G9877M6039J06582I8405J74790b79703
$$ plain form
11554 -367698 86886 39226 -288248 136985 102844 158181 74121 -134427 205804 11361 -213220
11542 -19206 65536 -97142 -113620 251044 14651 -26120 -43153 52926 218237 189376 -72578
11530 11440 -208344 147057 -120338 137586 26360 -61253 109225 198817 -13893 -134542
11520 -134542 129497 -3342 -143515 -38017 -131160 51377 -41908 4294 35051 185062 148203
11509 148203 135194 365057 518286 166665 89610 -244448 206759 73517 342579 231895
11499 231895 83923 189193 60434 -225173 204513 239453 -203867 67352 -946 194167 -234525
11487 221063 71424 144341 463553 149556 191102 254489 -39541 66545 218192 -261197 78648
11475 334798 41599 211482 -128932 -93653 42970 180150 224072 116267 175896 276397
$$ packed form
11554c67698H6886C9226b88248A36985l4141N5337G4121a34427B05804A1361b13220
11542a9206F5536i7142j6478B51044A4651b6120j7033E2926J65311k8861g2578
11530A1440b08344A47057a20338A37586B6360f1253A09225Q9592a3893j20649
11520a34542A29497c342j40173c8017r3143E1377d1908D294L0757J50011l6859
11509A48203j3009K29863J53229A66665p7055b44448B06759G3517K69062j10684
11499B31895H3923J05270F0434b25173B04513L4940b03867F7352i46A94167b34525
11487B21063G1424P2917L19212A49556M1546O3387c9541F6545J51647b61197G8648
11475C34798D1599J69883a28932L5279D2970J37180M3922j07805N9629J00501
$$ plain form
11465 276397 -292908 -90697 -99343 134672 446607 14100 132254 257872 132224 -99389
11454 -319259 18810 246280 277208 -148788 -65427 321492 300416 -215389 -32238 -89737 135449
11442 172667 89691 55388 67863 -114713 -206947 190989 -211429 76771 68761 53635 -247239
11430 -139578 -82434 151820 -84188 54145 170831 205713 -378944 -141539 25961 -34677 -24489
11419 -24489 -189886 61307 35360 -98924 20251 72371 138604 -199354 185045 -3282 -103417
11408 -103417 11188 -96177 -29895 -122042 -10546 289470 118622 186481 -59337 -164400 -52262
11396 -123587 27784 -189117 239529 36432 118391 74191 224940 -105097 -136406 201602
11385 131358 -23773 -273110 170314 -339111 135035 129641 -168778 -107580 -143316 226270
$$ packed form
11465B76397b92908i0697q646A34672L11935A4100J18154J25618j25648i9389
11454c19259A8810K27470L0928a48788f5427C21492k1076b15389c2238n7499A35449
11442A72667q2976l4303J2475a14713r2234A90989b11429G6771q010j5126b47239
11430a39578N7144A51820h4188E4145J16686L4882c78944a41539B5961c4677J0188
11419b4489j65397F1307k5947i8924B0251N2120O6233a99354A85045c282j00135
11408a03417A1188i6177b9895r2147a0546B89470A18622O7859e9337j05063e2262
11396a23587B7784a89117B39529C6432Q1959m4200J50749a05097l1309B01602
11385A31358b3773k49337A70314c39111A35035n394a68778O1198l5736B26270
$$ plain form
11374 -9801 -238081 9990 -18223 65659 104875 206703 176488 -140277 239006 49593 197712
11363 197712 162018 -334080 98243 118448 157168 -29089 -21186 -160514 279945 -93845 -123104
11352 -123104 -155931 162480 -21550 126369 226322 -253945 207949 -138292 68022 -69610
11341 -159106 240409 -15219 24744 1144 425601 167364 -138961 26825 277501 104887
11330 -56117 102691 -72932 151489 -8604 45026 -252599 -145226 69451 -126009 149954 -75163
11318 186553 251575 -438283 -186324 51193 -200897 -2079 138226 296535 78258 285363
11308 285363 180502 -238011 324663 322498 68048 -202177 -95839 -154786 -82924 -77288 -2441
11296 -176751 -153146 137486 -44871 133968 -134709 246692 123328 62817 -308005 -28569
$$ packed form
11374i801k28280I990a8223F5659L9216J01828l0215a40277B39006D9593J48119
11363A97712l5694c34080I8243K0205L8720b9089P903j39328B79945i3845k9259
11352a23104l2827A62480b1550A26369R9953b53945B07949a38292F8022f9610
11341a59106B40409a5219B4744A144M24457A67364a38961B6825K50676A04887
11330e6117A02691g2932A51489h604D5026b52599J07373F9451a26009A49954g5163
11318A86553O5022d38283a86324E1193b00897b079A38226J58309G8258K07105
11308B85363j04861b38011C24663k165F8048b02177i5839n8947P1862N636b441
11296a76751K3605A37486d4871A33968a34709B46692A23328o0511c08005b8569
$$ plain form
11285 57536 282828 279022 -106149 -228590 -22246 -93125 54159 -17701 97317 -124818 -83428
11274 -83428 150306 69670 262861 -410827 -191342 -242941 -402982 -422379 45295 -401368
11263 -54828 -169380 213629 -95923 -68245 -75909 -77759 -573073 -52833 -92532 150034 12744
11251 112263 321449 -285333 5809 -45810 -422376 134426 -182916 67525 99762 172874 156486
11240 156486 -362120 -94179 -340511 60741 313324 -12992 249008 -120190 105379 81800
11230 81800 -86082 -22723 -59812 -54889 -203719 153091 -258579 -92818 197083 -224724 89665
11218 -205175 166300 -465456 -247125 189254 57113 -58618 -79435 -354159 179313 212696
11208 212696 58196 -216688 160819 -166120 142626 -132759 -201703 -257490 -308615 -118551
$$ packed form
11285E7536K25292l806a06149j22441b2246p0879E4159a7701I7317a24818M1390
11274h3428A50306F9670J93191d10827a91342n1599j60041j9397D5295d01368
11263e4828j14552B13629i5923K7678p664j850m95314e2833l9699A50034A2744
11251A12263K09186b85333E809d5810l76566A34426a82916F7525L2237P3112j6388
11240A56486c62120i4179k46332F0741K52583a2992B49008a20190A05379k3579
11230H1800h6082b2723l7089M923j48830A53091b58579i2818A97083b24724H9665
11218b05175A66300d65456K18331A89254E7113e8618k0817k74724A79313L3383
11208B12696E8196b16688A60819a66120A42626a32759o8944n5787n1125a18551
$$ plain form
11197 71076 34187 69178 237321 -132432 -70280 -436966 380916 123835 -246499 298484
11186 -177485 458486 -379097 -184108 -5736 -43283 -31426 -122005 -164915 81562 -160566 255624
11174 -34336 35155 -136371 140434 -79915 -337295 -70274 -101307 152772 112575 38515 310348
11163 310348 259129 -156286 51802 130922 -39695 86715 -90016 13530 24543 -121224 -66163
11152 -66163 101913 -92859 31416 -417263 -133355 -90949 -339305 11824 132811 -205667
11141 426678 257984 -72752 -213006 -160056 -317819 -217837 436266 -79042 197480 170079
11131 170079 93859 52688 297974 -148022 359463 -57975 167124 219183 128139 188568 275518
11120 275518 -284507 -122754 -180986 -281304 -75089 -204235 -105642 261377 579383 30615
$$ packed form
11197G1076C4187L4991J68143a32432O2152l66686C80916A23835b46499B98484
11186a77485D58486c79097a84108e736l7547J1857r0579m2910H1562a60566B55624
11174c4336C5155a36371A40434g9915k57380g0274l1033A52772m0197C8515K71833
11163C10348n1219a56286E1802P9120c9695H6715i0016A3530J1013a21224N5061
11152f6163A01913i2859C1416d17263a33355M2406k48356A1824J20987b05667
11141D26678j68694g2752j40254N2950j57763R9982D36266g9042A97480k7401
11131A70079p6220m1171K45286a48022C59463e7975A67124N2059r1044O0429Q6950
11120B75518b84507a22754n8232j00318g5089j29146R8593B61377L18006C0615
$$ plain form
11109 14543 -103847 -45076 -14108 118570 -128732 22277 119106 44165 49541 231251 62774
11097 155312 -11982 276959 364206 211672 41101 -83416 209771 141087 -56564 -383297 401533
11085 128572 -367634 39783 26006 -25131 198329 433087 408474 60311 247649 23443 414021
11074 414021 94651 201393 239843 284549 442218 45630 416575 388524 344382 -23413 331415
11062 558021 617080 268621 647185 523942 265764 531367 416090 485023 498751 566508
11052 566508 519343 578539 882433 336169 730277 853558 241033 785721 659942 543791
11042 543791 569103 637359 486605 733170 568208 426646 589686 484550 638554 489861
11032 489861 547405 474340 479724 738632 479182 512555 991690 889666 700836 536030
$$ packed form
11109A4543a03847d5076a4108A18570a28732B2277R6829D4165N376J81710F2774
11097A55312a1982B76959Q7247j52534D1101h3416B09771o8684e6564l26733D01533
11085A28572c67634C9783j3777b5131A98329K34758k4613F0311J87338B3443L90578
11074D14021I4651J06742L8450M4706J57669D5630L70945k8051m4142b3413C31415
11062E58021N9059B68621L78564j23243k58178K65603j15277O8933J3728O7757
11052E66508m7165N9196L03894C36169L94108J23281B41033N44688j25779j16151
11042E43791K5312O8256j50754K46565j64962j41562J63040j05136J54004j48693
11032D89861N7544p3065N384K58908k59450L3373M79135j02024j88830j64806
$$ plain form
11022 536030 438281 426301 427478 376346 543630 298928 533131 626123 549852 505573 526250
11011 526250 605833 493453 652905 678800 434871 801208 477382 364817 467379 439999
11001 439999 696206 357250 72226 716087 518535 499914 736329 250937 425868 757767
10991 757767 768255 349036 1059868 772471 836466 670822 743941 756160 631816 837746
10981 837746 931972 974342 1043953 1446042 1210557 1553721 1579375 1847325 2217856 2312863
10971 2312863 2679050 2305294 2341699 2204447 2193541 1738244 1471748 1542168 1106484 1011174
10961 1011174 1285993 1410461 1547726 1277882 1105628 1532638 904618 889061 763957 902466
10951 902466 807941 617508 574892 538812 680587 830957 305311 -166060 36107 312103
$$ packed form
11022E36030r7749j1980J177n1132J67284k44702K34203R2992p6271m4279K0677
11011E26250P9583j12380J59452K5895k43929L66337l23826j12565J02562k7380
11001D39999K56207l38956G2226O43861j97552j8621K36415B50937J74931L31899
10991G57767J0488C49036P10832k87397O3995j65644P3119J2219j24344K05930
10981H37746R4226M2370O9611M02089k35485L43164K5654K67950L70531R5007
10971B312863L66187l73756L6405j37252j0906m55297k66496P0420m35684r5310
10961A011174K74819J24468J37265k69844j72254M27010o28020j5557j25104J38509
10951I02466r4525j90433m2616l6080J41775J50370C05311a66060C6107K75996
$$ plain form
10941 312103 -79893 374654 187662 52398 -61643 131182 300213 20339 31957 7889 49904
10930 49904 76165 -249466 384040 193113 -77175 5887 -85259 400626 104594 233194 -20306
10918 -46518 553912 -169376 143272 -354265 9510 -262570 -230040 -17463 -177604 119628
10907 -72027 -207625 193024 -57696 187507 -110842 -147713 -210045 55620 8485 29859 37569
10896 37569 104651 -325657 -260574 428806 55445 -167371 64004 -116188 145199 -40551 -41730
10885 -41730 100742 -61643 -176791 118754 -214888 -30454 84136 -177398 174373 -246970
10874 -160240 -69927 119959 -271625 11705 -67587 -170351 156584 -130565 -213629 28250
10863 -20139 90277 44452 2256 241427 120788 376578 33260 -218143 -219454 -208922 122143
$$ packed form
10941C12103g9893C74654j86992E2398f1643A31182J69031B0339J1618G889M2015
10930D9904K6261b49466C84040j90927g7175E887h5259D00626A04594J28600b0306
10918d6518E53912a69376A43272c54265I510b62570L2530a7463j60141A19628
10907g2027j35598A93024e7696A87507a10842l6871o2332E5620H485K1374P710
10896C7569O7082c25657O5083D28806E5445a67371F4004a16188A45199d0551j179
10885d1730A00742f1643j15148A18754b14888c0454H4136a77398A74373b46970
10874a60240f9927A19959b71625A1705f7587j02764A56584a30565q3064B8250
10863b0139I0277D4452B256K39171j20639K55790C3260b18143j311J0532A22143
$$ plain form
10851 -215413 91932 -310752 -446079 194200 465842 -163673 -49772 -401069 -108700 -175377
10841 -175377 -93911 -195461 -111052 122149 74235 1290 -34715 122526 -268287 149228 162706
10830 162706 -198373 -68951 132959 -155325 -45343 -50049 -344031 -98987 399170 110203
10819 49043 65265 -104067 -150213 -178643 -53557 14349 117883 106581 86143 239434 112957
10807 -93964 128951 -40545 116065 -189709 143384 316852 -54486 119208 26612 7460 -151534
10795 106391 -117531 -99867 -193445 83980 -99152 135889 157929 -252599 -92225 175552 -36394
10783 -184691 -44722 190685 -165466 -67084 28514 93423 -64069 -173718 -318444 135242
10772 67667 71168 34318 204383 -233143 19456 -365711 -38218 132185 -309911 14478 124104
$$ packed form
10851b15413I1932c10752j35327A94200K71642a63673d9772l51297a08700o6677
10841a75377Q1466j01550Q4409A22149m7914A290c4715A22526b68287A49228J3478
10830A62706a98373f8951A32959a55325d5343m706k93982i8987C99170A10203
10819D9043J6222a04067m6146k8430e3557A4349J03534j1302k0438J53291A12957
10807i3964A28951d0545A16065a89709A43384J73468e4486A19208B6612G460a51534
10795A06391a17531J7664r3578H3980i9152A35889K2040b52599i2225A75552c6394
10783a84691d4722A90685a65466f7084B8514O4909f4069j09649j44726A35242
10772F7667L501C4318J70065b33143A9456c65711c8218A32185c09911A4478J09626
$$ plain form
10761 124104 -81260 -116063 119713 -186032 -311233 -338082 -110352 -13854 225007 -222898
10750 -9193 -63337 138600 50570 -198010 -27087 196325 -426436 4654 -6153 157516 -455041
10738 211207 363472 -225273 25040 -359383 59432 -36235 403036 40432 -32739 -68310 185054
10726 94730 -10559 -187103 449326 -55604 159472 54382 206850 -7100 -420016 -63891 199428
10714 -202175 112224 -310710 321776 -264884 -81973 -150933 246678 -173109 -32187 -255524
10704 -255524 -232125 -342455 -171356 41793 -16884 -83928 -248821 -110491 -190676 -71421 -160622
10693 -160622 54449 16981 -103232 289473 -3003 -33 -373612 148130 -127045 8914 -111277
10681 -195254 146773 -233656 177722 15628 -76485 -9932 -12507 13188 84008 -90141 23741
$$ packed form
10761A24104h1260l4803A19713a86032j25201k6849a10352a3854B25007b22898
10750i193n4144A38600E0570a98010b7087A96325d26436D654f153A57516d55041
10738B11207J52265b25273B5040c59383E9432c6235D03036D0432c2739l5571A85054
10726I4730a0559j76544D49326e5604A59472E4382J52468g100m12916f3891A99428
10714b02175A12224c10710C21776b64884h1973o8960B46678a73109c2187k23337
10704b55524K3399j10330J71099D1793a6884o7044j64893a10491q0185g1421q9201
10693a60622E4449A6981a03232B89473c003c3l73579A48130a27045H914a11277
10681a95254A46773b33656A77722A5628g6485i932k575A3188P0820i0141B3741
$$ plain form
10669 -61426 -115757 -178069 -330628 -34025 -115168 13179 -129465 -89771 51053 -220216 -29994
10657 -267010 -258007 -62538 -134228 -77646 114693 25672 81661 -309640 -130638 -80035 -149104
10646 -149104 -33597 -95274 26180 -42466 64845 32902 -268351 145219 -121967 -106469 64666
10634 -89984 282683 -119279 274627 -17164 -104981 212748 -168496 -84595 322647 -174734
10623 161421 -248533 34509 14888 30477 -86626 116399 -164897 -362353 11118 68322 -3264
10611 13832 337238 331880 157612 33560 -227104 279295 -183129 -38680 -108514 -169726 -339571
10600 -339571 -87703 -56537 -90263 80638 355630 -260242 -76485 199200 22566 140460 -344453
10588 44413 63685 335761 -246927 176235 -93055 -128612 128405 -94700 -123390 -56957 31187
$$ packed form
10669f1426n4331o2312j52559c4025q1143A3179a29465L9694E1053b20216b9994
10657b67010R003f2538p1690N6582A14693B5672N5989c09640a30638N0603o9069
10646a49104c3597o1677B6180d2466F4845l1943b68351A45219a21967J5498F4666
10634h9984B82683a19279B74627a7164q7817B12748a68496Q3901C22647a74734
10623A61421b48533C4509A4888J5589h6626A16399a64897j97456A1118N7204c264
10611A3832L23406n358A57612C3560b27104B79295a83129c8680o9834o1212j69845
10600c39571h7703L1166l3726H0638K74992b60242g6485A99200B2566J17894c44453
10588D4413J9272K72076b46927A76235i3055l5557A28405i4700k8690e6957C1187
$$ plain form
10576 -13052 -13026 -94620 -188413 -220128 125453 30174 -19395 181166 281969 -22626 143766
10564 -114274 -356073 129942 -123604 271560 -160432 -237607 -14548 -237577 -71209 271959
10553 -65766 205176 2553 40564 80332 -50153 -9366 -151191 -110316 -67609 -11894 176437
10541 155916 211989 95391 223991 22491 188768 132174 66597 -137299 -9762 79867 100885
10530 100885 -38255 155014 35601 126892 -147689 232157 54120 40269 -164626 56669 -168127
10518 83151 258629 273318 -229446 -57224 142172 61767 51242 -350146 -177326 -24119 173559
10506 -240735 -94385 -272529 -80800 -290585 20492 -269875 63321 -318966 -128446 79736
10495 -131650 -17420 -23269 170128 25641 119048 -96497 4271 -141539 -13862 61365 11523
$$ packed form
10576a3052K6q1594r3793l1715A25453C0174a9395A81166J00803b2626A43766
10564a14274k41799A29942a23604B71560a60432p7175a4548k23029g1209B71959
10553f5766B05176B553L8011L9768e0153i366j41825M0875M2707a1894A76437
10541A55916N6073I5391J28600B2491J66277n6594o5577a37299i762G9867K1018
10530A00885c8255A55014C5601R1291a47689B32157E4120j3851a64626E6669a68127
10518H3151J75478J4689b29446e7224A42172F1767j0525c50146J72820b4119A73559
10506b40735i4385j78144h0800k09785B0492b69875F3321c18966a28446G9736
10495a31650a7420n849A70128B5641R3407i6497D271a41539a3862F1365A1523
$$ plain form
10483 -121230 -149135 48413 526706 256955 119989 151322 -83734 408608 71647 282878
10473 282878 39614 -92612 -38950 101277 -238158 -187310 -33562 -434424 -314948 -359099 -86272
10461 83097 -153487 -350375 -24582 159768 75690 1607 47563 13777 -213526 173526 -2099
10449 -20048 97063 -164757 77015 -252096 -88056 -118621 -80098 -36723 76711 302617 4720
10437 -89274 302366 -264307 -176124 22457 -155720 24486 -98145 -168719 -159584 40826 211753
10426 211753 390239 -189031 175106 -43840 18360 -85145 123249 -22865 154942 -86266
10415 -77923 -142766 -73392 -104394 126344 258549 -61352 -119234 28383 62314 -37345 200495
10403 61282 -80351 -45277 -399343 19344 198498 -76574 105410 -377934 134654 -94906 281596
$$ packed form
10483a21230k7905D8413M78293B56955A19989L1333h3734D08608G1647K11231
10473B82878C9614i2612c8950A01277b38158N0848c3562m00862J19476m4151h6272
10461H3097a53487j96888b4582A59768G5690A607M5956A3777b13526A73526b099
10449b0048I7063a64757G7015b52096h8056l0565L8523c6723G6711K25906D720
10437h9274C02366b64307Q8183B2457a55720B4486i8145p0574R135D0826J70927
10426B11753J78486a89031A75106d3840A8360h5145A23249b2865A54942h6266
10415g7923o4843O9374l1002A26344J32205f1352n7882B8383L3931c7345B00495
10403F1282h0351L5074l54066A9344J79154g6574A05410c77934A34654i4906B81596
$$ plain form
10391 168520 207145 -122554 158302 106317 -105672 -284467 -63380 -82547 58840 142967 -127762
10379 129470 -6630 80946 574306 32123 252024 -120069 -122095 420436 401448 147017 87361
10368 87361 66202 166100 434908 45085 447836 344444 397729 200708 -75810 -30778 192584
10356 -40700 3935 227217 264069 128733 247920 573801 562931 295507 169936 506883
10346 506883 134694 113011 113406 655071 150170 -85212 345970 540141 183196 305298
10336 305298 -39043 -49799 126026 -98649 -76504 155953 276617 76611 84356 326341 600518
10325 600518 368974 -111699 247699 -43371 750 -26957 314070 125277 -55196 -38711 56131
10313 64373 99798 -79818 -184245 -76741 120090 -207191 80006 129076 55543 260881 290726
$$ packed form
10391A68520L8625a22554A58302n1985a05672j78795f3380j9167E8840Q4127a27762
10379A29470f630H0946M93360C2123K19901a20069k026D20436j8988A47017n9656
10368H7361k1159R9898K68808D5085M02751j03392N3285j97021g5810c0778A92584
10356d0700C935K23282L6852A28733J19187L25881j0870k67424j25571L36947
10346E06883A34694k1683L95N41665A50170h5212C45970J94171A83196J22102
10336C05298c9043j0756A26026i8649K2145A55953J20664G6611P745K41985K74177
10325F00518k31544a11699B47699d3371G50b6957C14070A25277e5196J6485E6131
10313F4373L5425g9818j04427g6741A20090b07191H0006M9070E5543K05338K9845
$$ plain form
10302 290726 210809 55237 143242 -103164 56833 -51038 142828 216756 116816 -135505 -170854
10291 -170854 -65265 -159706 -149107 -104672 56124 -200643 -439367 -39391 94051 20085 -264717
10279 231996 -1245 108493 319622 -66133 -47084 107873 143432 -268662 -269886 -104718 40012
10267 86570 165428 -88228 160159 -42765 261447 -41145 90723 -158663 32447 116139 93931
10256 93931 78542 204143 239096 33590 135544 239739 134276 -126095 -28675 -24092 -225675
10245 -225675 -379765 -47187 34869 -136726 101241 72256 257326 -179943 -179362 -34970 135259
10233 256181 194668 -75670 27298 -100795 -175723 -260172 -59427 -117383 105625 -250225 -17643
10221 36355 -407346 88678 -92397 -131024 104699 -259211 -42401 -217035 17773 -89712 -230787
$$ packed form
10302B90726p9917E5237Q8005a03164E6833e1038A42828P3928r9940a35505l5349
10291a70854f5265r4441J0599M4435E6124b00643k38724c9391I4051B0085b64717
10279B31996a245A08493K11129f6133J9049A07873L5559b68662j224a04718D0012
10267H6570P8858h8228A60159d2765B61447d1145I0723a58663C2447Q3692k2208
10256I3931j5389J25601L4953C3590J01954J04195j05463a26095b8675M583k01583
10245b25675j54090d7187C4869a36726A01241k8985J85070a79943N81c4970A35259
10233B56181o1513g5670B7298a00795p4928q4449e9427n7956A05625b50225a7643
10221C6355d07346H8678i2397l8627A04699b59211d2401j74634A7773h9712j41075
$$ plain form
10210 -230787 -90235 -352833 108901 53624 34735 -65914 162528 -149823 -300064 -160864
10200 -160864 -61531 -69097 -47827 94652 -165561 -329293 11829 -259843 -292546 -157174 79729
10188 67126 253693 -431802 113090 47224 -163854 262631 167904 75632 -29866 -181062
10178 -181062 -181529 -260371 131077 -65959 101292 -112215 -217195 136883 -107892 -41781 -12189
10166 -361544 145841 -22509 82629 -167123 -157967 -506034 -89326 -110241 -146486 -310168 -179856
10155 -179856 -56611 162835 -200272 -220737 -80010 54510 -124932 -129481 -132477 -284465 -136033
10143 -220695 -72929 32258 -3550 262296 367858 -36929 -194013 -146895 -1529 -179166 -78386
10131 -481966 -156569 -166809 -263351 -62141 -318432 286790 85921 -149145 -250910 -54545
$$ packed form
10210b30787i0235k62598A08901E3624j8889f5914A62528a49823j50241J39200
10200a60864f1531p566K1270I4652a65561j63732A1829b59843l2703J35372G9729
10188F7126J86567d31802A13090D7224a63854B62631r4727G5632b9866j51196
10178a81062m67p8842A31077f5959A01292a12215j04980A36883a07892d1781a2189
10166c61544A45841b2509H2629a67123R156l48067h9326k0915l6245j63682J30312
10155a79856e6611A62835b00272k0465h0010E4510a24932m549k996j51988a36033
10143b20695g2929C2258c550B62296J05562c6929j57084M7118a529j77637g8386
10131d81966a56569j0240r6542f2141k56291B86790H5921a49145j01765e4545
$$ plain form
10120 -48547 -135955 17690 29656 36707 168768 121399 -19116 -36864 -7502 20597 -176754 -245329
10108 -245329 -214092 33909 -169092 -79402 -101071 22804 -44399 14869 -244564 9747 119166
10097 119166 166847 -110141 222891 7046 80956 -249253 338038 176682 41662 108200 56876
10086 56876 -383198 -106642 6829 -83440 -178056 -199630 -120682 44519 32764 -17327 -113046
10075 -113046 -84104 77082 -171251 -208125 -267616 25564 198369 -81572 340300 9018 -234945
10063 -171482 -9652 60341 -95434 178671 145598 -83036 94567 -341625 12195 442443 -41930
10051 -87742 77302 165733 -160804 204061 83469 -138355 32617 78399 -217918 -196630 -12652
10039 47978 -214871 -369754 -64337 -92727 -98531 57033 -135991 -224474 -131059 -145016 -298073
$$ packed form
10120d8547q7408A7690J1966P051J32061m7369a9116j7748g502B0597a76754o8575
10108b45329L1237C3909a69092g9402k1669B2804d4399A4869b44564I747J09419
10097A19166M7681a10141B22891G046P3910b49253C38038j61356D1662O6538n1324
10086E6876c83198a06642F829h3440r4616k1574P8948D4519j1755a7327r5719
10075a13046K8942G7082a71251l6874n9491B5564J72805h1572C40300I018b34945
10063a71482i652F0341i5434A78671l3073h3036I4567c41625A2195M30248d1930
10051h7742G7302Q8431a60804B04061H3469a38355C2617M5782b17918K1288a2652
10039D7978b14871j54883f4337k8390n804E7033a35991q8483R3415j3957j53057
$$ plain form
10028 -298073 356779 -276933 -159544 117516 -330086 -68898 237076 -44215 -458883 88485
10017 -148676 -50472 -126566 126379 -123468 91927 -106474 -425255 -357189 -196187 68402
10006 -73921 -114497 96243 73751 -198448 -338239 -274312 -167758 -153748 -7425 75518 -26744
9994 -34743 -173129 -57160 -18514 -38896 38847 -51680 -21144 -93109 80690 -60724 -7158 -312169
9982 -312169 -428882 -101287 -12420 -36270 -256864 6823 -177024 -152179 -68761 204517 113008
9971 113008 -1180 -286571 90501 -88337 130076 -110422 58809 -81536 -3886 86690 -89271
9959 74374 -247907 -80023 -79904 236844 -386911 136478 -271385 24157 -62771 52353 -91512
9947 -62057 120388 -175021 387369 63720 -65511 -237249 -99128 -358377 -138363 -140833 -84260
$$ packed form
10028b98073C56779b76933J17389A17516c30086f8898B37076d4215m14668H8485
10017a48676e0472p6094A26379a23468I1927a06474l18781O8066J61002F8402
10006g3921m0576I6243k2492a98448j39791O3927J06554J4010g425G5518b6744
9994c4743j38386e7160a8514k0382C8847e1680b1144p1965H0690f0724g158l05011
9982c12169j16713a01287a2420k3850k20594F823a77024K4845f8761B04517r1509
9971A13008a180k85391I0501h8337A30076a10422E8809h1536c886H6690h9271
9959G4374b47907h0023J19B36844c86911A36478b71385B4157f2771E2353i1512
9947f2057A20388a75021C87369F3720f5511j71738i9128k59249a38363k470N6573
$$ plain form
9936 -84260 106806 -309855 -63310 367266 168312 -139218 -55160 -147594 -169118 -77859 -187058
9925 -187058 -187371 -249379 144489 93277 133924 -267771 118935 288669 -13261 114949 -244851
9913 -33000 245249 -252912 -73443 355618 -40493 59130 222589 -92041 70260 -205452 35765
9901 -382936 -107118 184063 120714 -171812 -122586 104623 207171 -370356 181887 -2696
9890 -247392 144267 -15209 80321 -98463 -150729 627 -138248 -4195 -37436 315318 -41818 107119
9877 215419 -165298 -41725 -103539 -391826 -289644 -140482 86766 95976 204683 56938 -144716
9865 -207592 40011 162653 -260682 -141336 -29205 81346 -137286 -173032 -68386 -59552 144922
9853 106507 -119471 80487 -48897 -156842 28673 -169313 -93866 218089 -243513 -76139 166074
$$ packed form
9936h4260A06806c09855f3310C67266A68312a39218e5160r2434k1524g7859j09199
9925a87058l13o2008A44489n1212M0647b67771A18935J69734a3261A14949b44851
9913c3000B45249b52912g3443C55618d0493E9130J63459i2041G0260b05452C5765
9901c82936a07118A84063o3349a71812M9226A04623J02548c70356A81887b696
9890b47392A44267a5209H0321i8463n2266F27a38248d195l3241C15318d1818A07119
9877B15419a65298d1725o1814k88287J02182a40482H6766R210J08707E6938a44716
9865b07592D0011J22642b60682J19346b9205H1346a37286l5746f8386Q834A44922
9853A06507a19471H0487d8897j07945B8673a69313P5447B18089b43513g6139A66074
$$ plain form
9841 -81482 -97896 105262 -273659 201238 44259 -22461 -137082 253645 10198 167881 119405
9830 119405 33407 -344947 -188327 -178277 40557 -33598 -58661 -165132 -279536 -35849 6255
9818 21547 90824 -114135 203260 2933 21105 -238732 56382 89087 -139619 6613 -113041
9806 -205335 163378 -289964 235377 -441511 -83824 -266677 -205493 -150090 176121 216303
9796 216303 -140202 -287088 -344633 106684 -118271 53262 42005 -89841 124763 176974 -233248
9784 -95858 11358 92800 -119655 70949 -120725 -347751 177772 115941 -425500 -67349 -41979
9773 -41979 -158108 -155887 -381822 -134536 -48106 52760 -320112 -224823 -230740 -156932 -176213
9762 -176213 -20588 1876 108018 -256959 -102229 -145145 67502 443909 212254 269440 -292079
$$ packed form
9841h1482j6414A05262b73659B01238D4259b2461j14621B53645A0198J57683m8476
9830A19405C3407c44947J56620J0050D0557c3598k5063j06471j14404c5849F255
9818B1547O9277a14135B03260B933J8172b38732E6382L2705a39619F613a13041
9806b05335A63378b89964B35377d41511h3824j82853O1184N5403A76121M0182
9796B16303a40202j46886n7545A06684a18271E3262j1257h9841A24763N2211b33248
9784i5858A1358Q1442a19655G0949a20725k27026A77772o1831d25500f7349K5370
9773d1979j16129K221k25935a34536d8106E2760c20112R5289n917P3808j9281
9762a76213b0588A876J06142b56959a02229m2916F7502L76407B12254N7186b92079
$$ plain form
9750 -383223 13918 -114620 -320510 80036 -34133 139901 23524 130366 -237413 321314
9739 -80146 -139346 53114 -109619 -69511 -237143 -106185 -35750 107985 -245118 -398554 -126824
9727 117723 -43134 195742 -14053 -68440 -268011 358130 -344857 -195259 23570 177707
9717 177707 346837 195902 206461 -161893 19120 -165193 47921 -239583 15789 -14977 -137611
9706 -137611 121193 -195882 -10316 -493102 -401965 -405076 272007 -1144 261074 -140919 85757
9694 207825 -477494 -79196 -124069 160247 -223105 14979 87600 -66950 -313290 113402 50119
9682 62321 -229446 167353 40184 -250050 164196 -55876 81029 -227238 -148674 10560 -85732
9670 -60307 -141627 -197399 221817 98126 -90598 8961 -57263 -261307 -63025 -90562 -207601
$$ packed form
9750c83223A3918a14620k05890H0036c4133A39901B3524J06842b37413C21314
9739h0146n9200E3114a09619M0108j67632a06185c5750A07985b45118j53436a26824
9727A17723d3134A95742a4053n4387j99571C58130c44857J49598B3570J54137
9717A77707J69130j50935J0559a61893A9120a65193D7921b39583A5789a4977j22634
9706a37611A21193a95882a0316m82786R1137l111B72007a144B61074a40919H5757
9694B07825d77494g9196m4873A60247b23105A4979P2621f6950k46340A13402E0119
9682F2321b29446A67353D0184b50050A64196e5876H1029b27238P8564A0560h5732
9670f0307q1320n5772B21817I8126i0598H961e7263k04044f3025k7537j17039
$$ plain form
9659 -207601 171975 -26906 -98571 248958 -323480 -73898 -216966 -153085 -58270 -54044 -131844
9648 -131844 -88107 -391975 -93194 -201494 -319217 -318861 16571 -143708 -223512 -119309 137927
9636 -114445 38602 -78236 87774 12227 -120954 67607 -11870 -187543 -313551 68901 -254881
9624 -66007 -47348 100239 48353 -189080 -68852 -109855 -222124 -235421 -153666 23580 -234796
9612 -118940 93286 205003 58034 -46711 330465 -11251 44044 318162 -58154 -62297 -50340
9601 -50340 118525 18609 -58271 -126509 -217455 -122852 253306 43057 -65972 15445 -265920
9589 -139418 -432998 -473914 -179684 -303008 53794 -165193 27011 205345 -314863 24997
9578 -152791 -177216 -73505 -87463 -46418 -192532 -138760 -15024 -170817 -184810 27365 19235
$$ packed form
9659b07601A71975b6906p1665B48958c23480g3898j43068O3881e8270M226p7800
9648a31844M3737l03868i3194j08300j17723L56A6571a43708p9804J04203A37927
9636a14445C8602g8236H7774A2227a20954F7607a1870j75673j26008F8901b54881
9624f6007J8659A00239D8353a89080f8852m1003j12269j3297Q1755B3580b34796
9612a18940I3286J11717E8034d6711C30465a1251D4044K74118e8154m143J1957
9601e0340A18525A8609e8271o8238r0946R4603B53306D3057f5972A5445b65920
9589a39418k93580m0916a79684j23324E3794a65193B7011J78334c14863B4997
9578a52791k4425g3505j3958M1045j46114N3772a5024j55793j3993B7365q130
$$ plain form
9567 19235 89741 -275387 -89844 154257 -142829 -175018 -75101 95448 -35285 -16314 -214548
9556 -214548 260117 -14845 66463 81846 -533764 98935 -163746 -120204 -5499 79002 -50696
9544 -46497 -190094 282450 236175 -201069 -55655 108852 -55812 83397 -261856 369857 75483
9532 269173 -61670 -25889 -211023 -261945 -25857 -226198 177856 37232 -61613 453401 -134064
9520 -64351 154154 -145742 333824 279377 -354933 128823 163454 51544 99245 -158917 -47731
9508 -189446 152437 -356509 129450 -396390 125473 -61243 -231859 -53229 52530 -146458
9497 -349301 42471 -62820 25860 -234949 -85085 32229 -252814 243314 76695 -69675 -77961
9486 -77961 -105659 52727 29793 231695 -78290 1561 273545 80856 -76745 185216 -388622
$$ packed form
9567A9235P0506b75387h9844A54257a42829l2189g5101I5448c5285a6314j98234
9556b14548B60117a4845F6463J5383e33764I8935a63746M3542e499G9002e0696
9544d6497j43597B82450m6275b01069e5655A08852e5812H3397b61856C69857G5483
9532B69173f1670b5889j85134n0922b5857k00341A77856C7232f1613D53401a34064
9520f4351A54154a45742C33824n4447c54933A28823L4631E1544M7701a58917d7731
9508a89446A52437c56509A29450c96390A25473f1243j70616e3229E2530a46458
9497c49301D2471f2820B5860b34949h5085C2229b52814B43314G6695f9675q286
9486g7961k7698E2727k2934K01902g8290A561K71984H0856g6745A85216c88622
$$ plain form
9474 -57727 24147 182282 12935 -14162 -47303 -197489 -209790 -269525 18933 -245768 -23044
9462 150909 -270276 -281632 181437 -105543 120094 68826 -23448 140817 -106250 -65713
9452 -65713 172866 27454 -306314 -182859 -58027 19714 96038 278611 114336 -104428 25057
9440 -82020 -175606 -401285 -56873 72112 115484 -180737 -21097 -48271 -201364 66128 19463
9428 -103443 67343 -112810 -184448 -266052 52876 124071 -229309 228979 -5568 217600 -121925
9416 409353 -333742 -183541 -269588 160033 165861 -58686 140409 -80187 -72292 88889 51218
9405 51218 209071 -218885 144507 -185358 -232180 51837 -287152 -201165 -200451 -406153 -148987
9393 -44925 -334320 -130489 280542 305471 -60584 -92690 31187 188965 -82901 -248524 -20403
$$ packed form
9474e7727B4147J58135A2935a4162l3141j50186j2301n9735A8933b45768b3044
9462A50909b70276j1356A81437a05543A20094n1268b3448A40817a06250M0537
9452f5713A72866B7454c06314J23455e8027A9714P6324J82573A14336a04428B5057
9440h2020r3586k25679e6873G2112M3372a80737b1097k7174j53093F6128A9463
9428a03443F7343a12810p1638q1604E2876P1195b29309B28979e568B17600a21925
9416D09353c33742J50201q6047A60033N828e8686A40409h0187P895H8889l7671
9405E1218J57853b18885A44507a85358m6822E1837b87152Q5987P14k05702a48987
9393d4925k89395a30489B80542K4929f0584l2106C1187J57778h2901j65623b0403
$$ plain form
9381 -43050 -417408 -282013 225089 -194784 -57353 -36930 7464 -159733 201456 315833 -238757
9369 -235304 -511784 -265013 -100309 36427 3428 -199817 -18707 -67074 -402293 -302480 25674
9357 104294 204051 -6010 100521 -129178 -31635 114120 155829 104212 341463 -154952 440476
9345 71367 -3651 -22283 -123885 -60950 255661 32141 -26550 -20622 151725 116588 231352
9334 231352 117919 187582 -62374 -80799 -41825 -350885 -64085 -412077 -543238 -61705 -229715
9323 -229715 -142190 24142 166687 -162662 -186180 130187 -447085 -191926 -41799 -89816 16172
9311 -162883 -190254 50744 -382757 -431487 -86694 -171999 -23506 -120383 -131542 -87496 3524 119016
9299 119016 -139803 38159 -114001 51536 24296 -111597 33740 -150203 -269983 -118428
$$ packed form
9381d3050l74358J35395B25089a94784e7353K0423G464a59733B01456J14377b38757
9369b35304k76480K46771a00309C6427C428a99817a8707m8367l35219R9813B5674
9357A04294R9757f010A00521a29178c1635A14120M1709n1617K37251a54952D40476
9345G1367c651j8632j01602f0950B55661C2141b6550N928A51725l5137J14764
9334B31352j13433O9663f2374j8425L8974l09060f4085l47992j31161f1705j68010
9323b29715Q7525B4142J42545a62662k3518A30187d47085a91926d1799m8017A6172
9311a62883k7371E0744c82757m8730h6694q5305b3506r6877j1159M4046C524J15492
9299A19016a39803C8159a14001E1536B4296a11597C3740a50203j19780a18428
$$ plain form
9288 62806 5190 -36948 264979 -145643 -328977 7933 -256893 -235809 185664 185370 -148482
9276 44541 -429190 -171535 -152879 -69833 -125741 174219 -212199 170128 -116111 -6684 248461
9264 100394 -253938 -24705 -416530 -168662 -127282 -115844 -401320 24499 156160 -55044 -198311
9253 -198311 -53027 -140276 -229114 -95652 -95896 -6119 -370122 -171851 106502 -119095 258148
9241 -169628 -146207 -41970 93259 -116056 -248113 276299 -37068 -242260 -239372 63498 128754
9230 128754 -188082 -192427 50710 -139936 -384435 150915 44547 105942 -104229 102969 -21743
9218 19904 56834 167593 56649 -284327 375253 -90251 67478 118241 -66788 273526 -120231
9206 29036 231882 -56937 -307117 127732 55210 -4657 -235554 14307 30512 -69115 -483315
$$ packed form
9288F2806E190c6948B64979a45643j83334G933b56893K1084A85664k94a48482
9276D4541d29190a71535J8656f9833n5908A74219b12199A70128a16111f684B48461
9264A00394b53938b4705l91825a68662M1380J1438k85476B4499J31661e5044j43267
9253a98311e3027q7249q8838i5652k44f119l64003a71851A06502a19095B58148
9241a69628K3421d1970I3259a16056j32057B76299c7068k05192K888F3498O5256
9230A28754a88082m345E0710a39936k44499A50915D4547O1395a04229A02969b1743
9218A9904L6930J10759E6649b84327C75253i0251F7478N0763f6788B73526a20231
9206B9036K02846e6937k50180A27732E5210d657k30897A4307J6205f9115m14200
$$ plain form
9195 -483315 -177571 9095 104897 -263554 -179043 -493196 -247231 -179174 -50483 -132444 -209589
9184 -209589 -100518 151638 22541 -119394 -293155 179691 113428 -42400 -306840 -120196
9173 -40929 -19129 196526 115999 69319 -114121 -92902 -267034 -114840 48541 -18674 -33275
9162 -33275 22193 158755 -341012 140795 -245126 -159173 -15215 -11774 31337 -72498 -49838
9151 -49838 -162638 57228 536877 -23737 157439 269491 -149316 -114355 77408 -236108 5939
9139 -10848 6820 23634 -230157 -6501 -329015 108854 -178517 -315139 57286 -123767 -137089
9128 -137089 -204484 -133094 -41368 164709 -215928 272689 110337 52053 251054 175040 149930
9117 149930 71429 54680 -213045 -60993 -283368 -4911 -243074 -7570 -17049 -127992 -208274
$$ packed form
9195d83315a77571I095R5802b63554Q4511l14153K45965O8057e0483q1961p7145
9184b09589a00518A51638B2541a19394j73761A79691o6263d2400k64440a20196
9173d0929a9129A96526q0527m6680a14121K1219j74132a14840D8541a8674j4601
9162c3275B2193J36562c41012A40795b45126Q5953a5215L441C1337g2498K2660
9151d9838j12800E7228M79649b3737A57439J12052a49316L4961G7408b36108E939
9139a0848F820J6814b30157f501l22514A08854a78517j36622E7286a23767j3322
9128a37089o7395P1390d1368A64709b15928B72689A10337E2053J99001p6014k5110
9117A49930G1429j6749b13045f0993k22375d911k38163g570r479j10943q0282
$$ plain form
9106 -208274 -338855 24476 208586 44832 70 138318 8223 55502 -237813 -33682 -438779
9095 -438779 -51836 86430 -317541 -90527 -5271 324202 81024 -428690 9837 76939 -51783
9083 -317565 39304 -96870 -114113 -176711 -90981 50144 313566 -201826 -13758 356818 -319876
9071 244347 -228504 59212 -428724 -151284 -211163 -263648 22571 -457743 -146473 -210438 -61810
9059 -12340 172051 167620 61068 -109056 -401836 -164648 -4612 18340 -4080 -177438 68317
9047 34052 3779 -122823 219902 -328863 173460 -293597 -154055 -24104 150401 -38450 141697
9035 -82272 -89211 -40006 345675 19606 -103187 -57971 1263 -75857 -66449 286114 -76423 -211115
9023 -211115 -358844 -234400 308634 -215908 -109601 191343 -302753 -107969 -480488 -132623
$$ packed form
9106b08274j30581B4476J84110D4832G0J38248H223M7279b37813c3682m05097
9095d38779e1836H6430c17541i0527e271C24202H1024d28690I837O7102e1783
9083c17565C9304i6870j7243o2598Q5730E0144K63422b01826a3758C56818c19876
9071B44347b28504E9212d28724a51284n9879n2485B2571d57743a46473o3965f1810
9059a2340A72051m431F1068a09056k92780a64648d612A8340d080j73358F8317
9047C4052C779a22823B19902c28863A73460b93597J39542b4104A50401c8450A41697
9035h2272o939d0006C45675A9606a03187M5216A263g5857R408B86114g6423j34692
9023b11115j47729J24444C08634b15908J06307A91343c02753a07969l72519a32623
$$ plain form
9012 -67947 -239823 -133202 -67275 151634 -228254 -213721 -348566 77053 -134100 -126545 -110217
9001 -110217 169940 -19613 -127986 -168965 -180232 -94656 105103 -63872 -218441 227076 -47948
8989 -443843 49554 149612 216782 -236069 241902 148056 -145854 -176408 -234605 -457560 38753
8977 -202204 -423308 -105021 64873 69558 -96491 -96402 -110939 63255 75888 286441 -318914 157197
8964 56257 61820 -56720 62196 -456619 6648 -302794 -84900 -114311 171612 -218000 306619
8952 121087 -76106 24546 45959 47798 59843 -520329 -125699 -151027 66974 -13639 311007
8940 178500 -233558 120638 -197186 -80761 -119733 265554 177676 -116737 -195787 -116107 -109409
8929 -109409 -322788 44078 256086 58725 94771 445321 2007641 6294905 10827612 3326436
$$ packed form
9012f7947j71876J06621O5927A51634b28254J4533j34845G7053a34100P555J6328
9001a10217A69940a9613j08373m0979j1267Q5576A05103f3872j54569B27076d7948
8989d43843D9554J00058O7170b36069B41902r3846a45854l0554n8197k22955C8753
8977b02204k21104a05021F4873M685i6491Q9j4537F3255J2633K10553c18914A57197
8964E6257N563e6720F2196d56619F648c02794h4900k9411A71612b18000C06619
8952A21087g6106B4546K1413J839J2045e20329a25699k5328F6974a3639C11007
8940A78500b33558A20638a97186h0761l8972B65554q7878a16737p9050P9680O698
8929a09409k13379D4078K12008E8725L6046L50550J562320M287264M532707C326436
$$ plain form
8918 803817 455506 97705 11410 -11874 114428 164878 -126760 -76142 -80975 9613 220541
8907 220541 131445 -55838 68961 -135994 158539 406147 -159212 -103071 -31151 -93116 -70230
8896 -70230 241177 366937 366181 -6901 152260 -41402 55379 59145 60088 -219302 -302543 -330482
8884 -330482 75621 66595 -1862 50201 -65197 -269594 -186685 -105704 224630 412450 -365121
8872 -104288 51498 -105137 113316 -319719 204222 -30834 -24553 119927 -66602 -375258 -146244
$$ packed form
8918H03817l48311I7705A1410a1874A14428N0450a26760N0618m833I613K10928
8907B20541q9096e5838F8961a35994A58539K47608a59212N6141c1151o1965K2886
8896g0230B41177J25760p56f901A52260d1402E5379L766R43b19302q3241k7939
8884c30482G5621r026a862E0201f5197k04397Q2909Q0981B24630J87820c65121
8872a04288E1498a05137A13316c19719B04222c0834O281A19927f6602l08656a46244
$$ [...]
##END NTUPLES=NMR SPECTRUM
##END=
