
##TITLE=UV1111_M2_1290-1353_7180813_8xUUjKTMku
##JCAMPDX= 6.0         $$ Bruker NMR JCAMP-DX V2.0
##DATA TYPE= NMR SPECTRUM
##DATA CLASS= NTUPLES
##ORIGIN= BRUKER
##OWNER= Administrator
$$ 1.72 TOPSPIN		Version 2.1
$$ 2012-12-05 03:18:17.885 -0500  Administrator@X
$$ Compression mode = diff/dup
##.OBSERVE FREQUENCY= 400.02188249412
##.OBSERVE NUCLEUS= ^1H
##.ACQUISITION MODE= SIMULTANEOUS (DQD)
##.ACQUISITION SCHEME= undefined
##.AVERAGES= 64
##.DIGITISER RES= 22
##SPECTROMETER/DATA SYSTEM= spect
##.PULSE SEQUENCE= noesygpps1d.comp
##.SOLVENT NAME= COFFEE_meoh
##.SHIFT REFERENCE= INTERNAL, COFFEE_meoh, 1, 14.96103
##AUDIT TRAIL= $$ (NUMBER, WHEN, WHO, WHERE, PROCESS, VERSION, WHAT)
$$ ##TITLE= Audit trail, TOPSPIN		Version 2.1
$$ ##JCAMPDX= 5.01
$$ ##ORIGIN= Bruker BioSpin GmbH
$$ ##OWNER= Administrator
$$ $$ E:\/data/COFFEE/nmr/UV1111_M2_1290-1353_7180813_8xUUjKTMku/12/pdata/1/auditp.txt
$$ ##AUDIT TRAIL=  $$ (NUMBER, WHEN, WHO, WHERE, PROCESS, VERSION, WHAT)
(   1,<2012-12-05 03:18:12.026 -0500>,<Administrator>,<X>,<go>,<TOPSPIN 2.1>,
      <created by zg
	started at 2012-12-05 03:06:42.385 -0500,
	POWCHK enabled, PULCHK disabled,
       configuration hash MD5:
       86 BA 57 50 F2 9D 5C 9B 26 00 A9 28 5F 66 2E 89
       data hash MD5: 64K
       4F C6 07 25 3E F2 FA 6F 89 6B F1 23 E9 50 66 73>)
(   2,<2012-12-05 03:18:15.167 -0500>,<Administrator>,<X>,<proc1d>,<TOPSPIN 2.1>,
      <Start of raw data processing
       efp LB = 0.3 FT_mod = 6 PKNL = 1 PHC0 = 0 PHC1 = 0 SI = 128K 
       data hash MD5: 128K
       7E 1D 5B 0F 57 E6 75 F6 FB 01 BC 72 FA 79 F0 4B>)
(   3,<2012-12-05 03:18:16.198 -0500>,<Administrator>,<X>,<proc1d>,<TOPSPIN 2.1>,
      <pk PHC0 = -78.37646 PHC1 = 0 
       data hash MD5: 128K
       F2 B9 A6 FE 65 9F C5 C1 67 2F B8 0A 60 5D 33 16>)
(   4,<2012-12-05 03:18:16.901 -0500>,<Administrator>,<X>,<proc1d>,<TOPSPIN 2.1>,
      <abs ABSG = 1 
       data hash MD5: 128K
       69 8D 69 13 A6 B2 E2 6A 25 53 3B 87 62 86 0B 8D>)
(   5,<2012-12-05 03:18:17.073 -0500>,<Administrator>,<X>,<proc1d>,<TOPSPIN 2.1>,
      <abs ABSG = 2 
       data hash MD5: 128K
       6D 30 AB 54 4A 87 0E 03 BA 01 92 4A 04 D1 AD BB>)
(   6,<2012-12-05 03:18:17.260 -0500>,<Administrator>,<X>,<proc1d>,<TOPSPIN 2.1>,
      <abs ABSG = 3 
       data hash MD5: 128K
       29 2F D0 F9 4A 93 63 60 EE EC F8 0C 35 99 FF C1>)
(   7,<2012-12-05 03:18:17.417 -0500>,<Administrator>,<X>,<proc1d>,<TOPSPIN 2.1>,
      <abs ABSG = 4 
       data hash MD5: 128K
       A1 10 AA 9F 3A 42 36 73 51 3F 4B 6E D1 C9 8E 1D>)
(   8,<2012-12-05 03:18:17.542 -0500>,<Administrator>,<X>,<proc1d>,<TOPSPIN 2.1>,
      <abs ABSG = 5 
       data hash MD5: 128K
       EB 36 A7 38 0C 68 D9 0C F2 B5 C6 CC D2 FA 06 C6>)
$$ ##END=
$$ 
$$ $$ hash MD5
$$ $$ 8D 69 5B 6C 13 BB 03 04 2C 52 37 51 84 65 C7 53
##$RELAX= 
##$RELAX= 
##$RELAX= 
##$RELAX= 
##$RELAX= 
##$RELAX= 
##$RELAX= 
##$RELAX= 
$$ Bruker specific parameters
$$ --------------------------
##$DU= <E:\>
##$EXPNO= 12
$$ [...]
##$TP07= 0
##$TPNAME0= <>
##$TPNAME1= <>
##$TPNAME2= <>
##$TPNAME3= <>
##$TPNAME4= <>
##$TPNAME5= <>
##$TPNAME6= <>
##$TPNAME7= <>
##$TPOAL= (0..7)
0.5 0.5 0.5 0.5 0.5 0.5 0.5 0.5
##$TPOFFS= (0..7)
0 0 0 0 0 0 0 0
##$TUNHIN= 0
##$TUNHOUT= 0
##$TUNXOUT= 0
##$USERA1= <user>
##$USERA2= <user>
##$USERA3= <user>
##$USERA4= <user>
##$USERA5= <user>
##$V9= 5
##$VALIST= <valist>
##$VCLIST= <CCCCCCCCCCCCCCC>
##$VD= 0
##$VDLIST= <DDDDDDDDDDDDDDD>
##$VPLIST= <PPPPPPPPPPPPPPP>
##$VTLIST= <TTTTTTTTTTTTTTT>
##$WBST= 2048
##$WBSW= 25
##$XGAIN= (0..3)
0 0 0 0
##$XL= 0
##$YL= 0
##$YMAX_a= 5623616
##$YMIN_a= -11309651
##$ZGOPTNS= <>
##$ZL1= 120
##$ZL2= 120
##$ZL3= 120
##$ZL4= 120
##$ABSF1= 14.96103
##$ABSF2= -5.597152
##$ABSG= 5
##$ABSL= 3
##$ALPHA= 0
##$AQORDER= 0
##$ASSFAC= 0
##$ASSFACI= 0
##$ASSFACX= 0
##$ASSWID= 0
##$AUNMP= <proc_prof1d_extract.lims>
##$AXLEFT= 0
##$AXNAME= <>
##$AXNUC= <1H>
##$AXRIGHT= 0
##$AXTYPE= 0
##$AXUNIT= <>
##$AZFE= 0.1
##$AZFW= 0.1
##$BCFW= 0
##$BC_mod= 0
##$BYTORDP= 0
##$COROFFS= 0
##$CY= 15
##$DATMOD= 1
##$DC= 0
##$DFILT= <>
##$DTYPP= 0
##$F1P= 0
##$F2P= 0
##$FCOR= 0.5
##$FTSIZE= 131072
##$FT_mod= 6
##$GAMMA= 0
##$GB= 0
##$INTBC= 1
##$INTSCL= 1
##$ISEN= 128
##$LB= 0.3
##$LEV0= 0
##$LPBIN= 0
##$MAXI= 10000
##$MC2= 0
##$MEAN= 0
##$ME_mod= 0
##$MI= 0
##$NCOEF= 0
##$NC_proc= -2
##$NLEV= 6
##$NOISF1= 0
##$NOISF2= 0
##$NSP= 0
##$NTH_PI= 0
##$NZP= 0
##$OFFSET= 14.96103
##$PC= 1
##$PHC0= -78.37646
##$PHC1= 0
##$PH_mod= 1
##$PKNL= yes
##$PPARMOD= 0
##$PPDIAG= 0
##$PPIPTYP= 0
##$PPMPNUM= 2147483647
##$PPRESOL= 1
##$PSCAL= 4
##$PSIGN= 0
##$PYNMP= <proc.py>
##$REVERSE= no
##$SF= 400.020009623989
##$SI= 131072
##$SIGF1= 0
##$SIGF2= 0
##$SINO= 400
##$SIOLD= 131072
##$SPECTYP= <>
##$SREGLST= <1H.CDCl3>
##$SSB= 0
##$STSI= 131072
##$STSR= 0
##$SW_p= 8223.68421052631
##$SYMM= 0
##$S_DEV= 0
##$TDeff= 65536
##$TDoff= 0
##$TI= <>
##$TILT= no
##$TM1= 0
##$TM2= 0
##$TOPLEV= 0
##$USERP1= <user>
##$USERP2= <user>
##$USERP3= <user>
##$USERP4= <user>
##$USERP5= <user>
##$WDW= 1
##$XDIM= 131072
##$YMAX_p= 425913854
##$YMIN_p= -13991
##$CURPLOT= <Network HP LaserJet P1505>
##$CURPRIN= <$Network HP LaserJet P1505>
##$DFORMAT= <normdp>
##$LAYOUT= <+/1D_H.xwp>
##$LFORMAT= <normlp>
##$PFORMAT= <normpl>
##$SURQMSG= 1
$$ End of Bruker specific parameters
$$ ---------------------------------
##NTUPLES= NMR SPECTRUM
##VAR_NAME=  FREQUENCY,     SPECTRUM/REAL,   SPECTRUM/IMAG
##SYMBOL=    X,             R,               I
##VAR_TYPE=  INDEPENDENT,   DEPENDENT,       DEPENDENT
##VAR_FORM=  AFFN,          ASDF,            ASDF
##VAR_DIM=   131072,        131072,          131072
##UNITS=     HZ,            ARBITRARY UNITS, ARBITRARY UNITS
##FACTOR=    0.0627417313425164, 1,          1
##FIRST=     8223.62146879497, -2282,        -49227
##LAST=      0,             -788,            -50034
##MIN=       0,             -13991,          0
##MAX=       8223.62146879497, 425913854,    0
$$ Real data points
##PAGE= N=1
##DATA TABLE= (X++(R..R)), XYDATA
$$ [...]
63942A218708J21952J34147J45951J57788J69280J79492J87813J94078J97750
$$ 1218708 1340660 1474807 1620758 1778546 1947826 2127318 2315131 2509209 2706959
63933B706959J97581J92360J81742J66167J46403J23376R8015P0858M2053J2038
$$ 2706959 2904540 3096900 3278642 3444809 3591212 3714588 3812603 3883461 3925514 3937552
63923C937552j8123m7390p5482j02455j27700j49802j67399j79892j87353j90219
$$ 3937552 3919429 3872039 3796557 3694102 3566402 3416600 3249201 3069309 2881956 2691737
63913B691737j89189j85123j78756j70448j60329j48640j35965j23100j10605
$$ 2691737 2502548 2317425 2138669 1968221 1807892 1659252 1523287 1400187 1289582
63904A289582r8490q6470p4522o3134n2883m4007l6478l0309k5494k1728j8498
$$ 1289582 1191092 1104622 1030100 966966 914083 870076 833598 803289 777795 756067 737569
63893G37569j5513j2886j0889r753r695j0819j2747j4549j5399j5266j4718j4043
$$ 737569 722056 709170 698281 688528 678833 668014 655267 640718 625319 610053 595335 581292
63881E81292j2905j1023q757o672m702k221R93M319O969Q844J0536J2660J5402
$$ 581292 568387 557364 548607 541935 537233 535012 536005 540324 547293 556137 566673 579333 594735
63868E94735J8486K1411K3855K5938K7951K9768L0876L1104L0996L1170L1548
$$ 594735 613221 634632 658487 684425 712376 742144 773020 804124 835120 866290 897838
63857H97838L1517L0659K8950K6507K3468K0020J6253J2105P745L658K5l690p999
$$ 897838 929355 960014 988964 1015471 1038939 1058959 1075212 1087317 1095062 1098720 1098745 1095055 1087056
63844A087056j2548j6652k0398k4402k8506l1712l3607l4985l6578l7941l8210
$$ 1087056 1074508 1057856 1037458 1013056 984550 952838 919231 884246 847668 809727 771517
63833G71517l7461l6477l5538l4205l2284l0281k8651k7099k4996k2279j9650
$$ 771517 734056 697579 662041 627836 595552 565271 536620 509521 484525 462246 442596
63822D42596j7819j6777j5936j4897j3792j2773j1577r934q238p210o902o569
$$ 442596 424777 408000 392064 377167 363375 350602 339025 329091 320853 313643 306741 300172
63810C00172n687m565l713l131k564k137k161k570k947l085l106l134l178l266
$$ 300172 294485 289920 286207 283076 280512 278375 276214 273644 270697 267612 264506 261372 258194 254928
63796B54928l349l149k499j800j736k352k870k609j875j542j874k176j752q99
$$ 254928 251579 248430 245931 244131 242395 240043 237173 234564 232689 231147 229273 227097 225345 224446
63782B24446n11q66j225r18l58m57j292j956j817j269r57q53n40n7J98J66J49
$$ 224446 223935 223069 221844 220926 220568 220111 218819 216863 215046 213777 212820 211967 211427 211370 211568 211734 211883
63765B11883J64j36q02j376j532j504j570j507r51n5N77N80O9o94j438j731j159
$$ 211883 212047 211911 211109 209733 208201 206697 205127 203620 202669 202614 203191 203771 203840 203146 201708 199977 198818
63748A98818P1J096J247P45L15L36P27J381K155K585K290J734J931L080M121M116
$$ 198818 198889 199985 201232 201977 202292 202628 203355 204736 206891 209476 211766 213500 215431 218511 222632 226748
63732B26748L435K998K792K097R69M53J130K293L024L402M017M852N284N055M573
$$ 226748 230183 233181 235973 238070 239039 239492 240622 242915 245939 249341 253358 258210 263494 268549 273122
63717B73122M195L772L087K323J809J473Q42l97k011l401m086l975l309k465j747
$$ 273122 277317 281089 284176 286499 288308 289781 290623 290226 288215 284814 280728 276753 273444 270979 269232
63702B69232j238q29m22j17J0J59O05J163J327J004P81J128J729J956J763J567
$$ 269232 267994 267165 266743 266626 266636 266795 267400 268563 269890 270894 271675 272803 274532 276488 278251 279818
63686B79818J506J331J013Q73J058J352J565J698J637J222O74M88O96O99J61l67
$$ 279818 281324 282655 283668 284541 285599 286951 288516 290214 291851 293073 293747 294235 294931 295630 295791 295424
63670B95424q8R92K016K163J391M25J27P29J557J705R81j1p65j410k263l269m155
$$ 295424 295336 296328 298344 300507 301898 302323 302450 303179 304736 306441 307422 307411 306646 305236 302973 299704 295549
63653B95549m807n171n000m166l028k213j997k084j966j334k90P23J241J190R56
$$ 295549 290742 285571 280571 276405 273377 271164 269167 267083 265117 263783 263493 264216 265457 266647 267603
63638B67603R53J277J779K328K846L222L353L261L147L293L875M782N724O577
$$ 267603 268556 269833 271612 273940 276786 280008 283361 286622 289769 293062 296937 301719 307443 314020
63624C14020P406Q060Q159P802P882R109J1040J2670J3803J5020J6473J7749J8997
$$ 314020 321426 329486 337645 345447 353329 362438 373478 386148 399951 414971 431444 449193 468190
63611D68190K1021K3826K6167K7220K7867K9387L1469L2605L1997L0099K7352
$$ 468190 489211 513037 539204 566424 594291 623678 655147 687752 719749 749848 777200
63600G77200K3377J7677J0590L315k775o866r087j0164j0522j0025q782p773q119
$$ 777200 800577 818254 828844 832159 829384 822518 813431 803267 792745 782720 773938 766165 758046
63587G58046r999j2790j5981j9312k2228k4007k4529k4359k3919k3054k1492j9360
$$ 758046 748047 735257 719276 699964 677736 653729 629200 604841 580922 557868 536376 517016
63575E17016j7068j4958j3106j1195q711n565k445j64J203K194L122L921M721
$$ 517016 499948 484990 471884 460689 451978 446413 443968 443804 445007 447201 450323 454244 458965
63562D58965N901P434Q684R129Q958Q789R090J0003J1383J2910J4414J6224J8846
$$ 458965 464866 472300 480984 490113 499071 507860 516950 526953 538336 551246 565660 581884 600730
63549F00730K2269K5893K9327L2896L7122M1836M5900M7546M5002L7351K5379
$$ 600730 622999 648892 678219 711115 748237 790073 835973 883519 928521 965872 991251
63538I91251J1579j092j0709j6822j9796k0041j8036j4705j1298q720p194o782
$$ 991251 1002830 1001738 991029 974207 954411 934370 916334 901629 890331 881611 874417 867635
63526H67635p925j1002j5464k0017k3838k7088l0005l2067l2577l1688l0236k8763
$$ 867635 859710 848708 833244 813227 789389 762301 732296 700229 667652 635964 605728 576965
63514E76965k7207k5354k3102k0366j7276j4450j2556j1621j1132j0740j0412
$$ 576965 549758 524404 501302 480936 463660 449210 436654 425033 413901 403161 392749
63503C92749r956r007p589o154m961l832k705j957j885k229k443k306k002j760
$$ 392749 382793 373786 366197 360043 355082 351250 348545 346588 344703 342474 340031 337725 335723 333963
63489C33963j594j362j009p12p53j097j259p66L33J586K634L403L941M321M590
$$ 333963 332369 331007 329998 329286 328533 327436 326177 325411 325744 327330 329964 333367 337308 341629 346219
63474C46219M595M012K792J423M53j01n81j156j808k591l493m166m237l780l172
$$ 346219 350814 354826 357618 359041 359494 359393 358812 357656 355848 353257 349764 345598 341361 337581 334409
63459C34409k668k489k911l759m103l180j426R9J080J940K689K855K628L003M331
$$ 334409 331741 329252 326341 322582 318479 315299 313873 313972 315052 316992 319681 322536 325164 328167 332498
63444C32498N708O374O909Q368J0711J2899J4319J5528J7524K0706K4660K8744
$$ 332498 338206 344580 351489 359857 370568 383467 397786 413314 430838 451544 476204 504948
63432E04948L2669L6190L8190L6717L0715K1599J2419N392Q30j754k393q33K866
$$ 504948 537617 573807 611997 648714 679429 701028 713447 718839 719669 717915 715522 714689 717555
63419G17555Q201J4251J9809K4220K8079L2278L6254L8252L7486L4744L0441K3587
$$ 717555 725756 740007 759816 784036 812115 844393 880647 918899 956385 991129 1021570 1045157
63407A045157J3832L329m854r556j1689j2300j1944j1461j1814j2990j4296j5847
$$ 1045157 1058989 1062318 1057464 1047908 1036219 1023919 1011975 1000514 988700 975710 961414 945567
63395I45567j8633k2950k7763l1899l4940l6690l6746l5151l2746l0277k7656
$$ 945567 926934 903984 876221 844322 809382 772692 735946 700795 668049 637772 610116
63384F10116k4533k1147j8172j5939j4209j2533j0613q397n990l396m70K597M994
$$ 610116 585583 564436 546264 530325 516116 503583 492970 484573 478583 475187 474717 477314 482308
63371D82308O021O104O476P761R444J0863J2123J3644J5376J6956J8348J9905
$$ 482308 488329 494433 500909 508670 518114 528977 541100 554744 570120 587076 605424 625329
63359F25329K1882K4303K7107L0170L3182L5746L7551L8402L8097L6344L2683
$$ 625329 647211 671514 698621 728791 761973 797719 835270 873672 911769 948113 980796
63348I80796K6673J8498R421J246m859q792j0889j1418j0930j0496j0943j2144
$$ 980796 1007469 1025967 1035388 1036634 1031775 1022983 1012094 1000676 989746 979250 968307 956163
63336I56163j3501j4985j7227k0614k4785k8954l2323l4169l4128l2577l0314
$$ 956163 942662 927677 910450 889836 865051 836097 803774 769605 735477 702900 672586
63325F72586k7660k4199j9715j4951j0928p642m098J58L883M814J512n373j3393
$$ 672586 644926 620727 601012 586061 575133 567491 563393 563551 567434 572248 573760 568387 554994
63312E54994j9779k2928k2985k1211j8913j6881j5405j4333j3092j1171q819o911
$$ 554994 535215 512287 489302 468091 449178 432297 416892 402559 389467 378296 369477 362566
63300C62566n891n244m315l283k787k892l040k912k784k996l539m211m688m527
$$ 362566 356675 351431 347116 343833 341046 338154 335114 332202 329418 326422 322883 318672 313984 309457
63286C09457l667k878k999l696l689k435q44L8K63M03M13j23j040j599j393o82
$$ 309457 305790 302912 299913 296217 292528 290093 289249 289287 289550 289953 290366 290243 289203 287604 286211 285529
63270B85529KK55J3k49P3Q57J177N51l10n08k65l46p06n23N39J952L091L590L196
$$ 285529 285531 285786 285799 285550 285623 286480 287657 288208 287898 287390 287125 286779 286073 285550 286089 288041 291132 294722 297918
63251B97918K151J566K369L869M408L613K847L142L819L850L534L907N165O543
$$ 297918 300069 301635 304004 307873 312281 315894 318741 321883 325702 329552 333086 336993 342158 348701
63237C48701P425P896Q376R325J0965J2806J3807J3564J2964J3115J3979J4718
$$ 348701 356126 364022 372398 381723 392688 405494 419301 432865 445829 458944 472923 487641
63225D87641J5044J5374J5823J5856J5135J4059J3194J2721J2626J3057J4125
$$ 487641 502685 518059 533882 549738 564873 578932 592126 604847 617473 630530 644655
63214F44655J5474J6327J5940J4168J1553Q833O205L274k48m115p948j1618j4930
$$ 644655 660129 676456 692396 706564 718117 726950 733155 736429 736181 732066 724118 712500 697570
63201F97570j7342j8500j8822j8940j8912j8403j7397j6055j4144j1411q407o046
$$ 697570 680228 661728 642906 623966 605054 586651 569254 553199 539055 527644 519237 513191
63189E13191m394k752j022R1O07J818M512P472Q786Q234P429P809R316J1017J2189
$$ 513191 508797 506045 505023 505114 505721 507539 512051 519523 528309 536543 543972 551781 561097 572114 584303
63174E84303J2619J2489J2229J2133J1990J1374J0341R429Q863Q143O646M342
$$ 584303 596922 609411 621640 633773 645763 657137 667478 676907 685770 693913 700559 704901
63162G04901J763o30k877n428q636j2296j5721j8346k0097k1061k1120k0293j9086
$$ 704901 706664 706034 703157 697729 689093 676797 661076 642730 622633 601572 580452 560159 541073
63149E41073j8038j7010j5510j3622j2022j0955r873q330o678n549n078m971m946
$$ 541073 523035 506025 490515 476893 464871 453916 444043 435713 429035 423486 418408 413437 408491
63136D08491m722l974k769j724j300j174p27J06R47J652K337K837K841K552K567
$$ 408491 403769 399795 397026 395302 394002 392828 392101 392207 393154 394806 397143 399980 402821 405373 407940
63121D07940K974L201K966K875L621M948N922O016N515M942M500M138L818L579
$$ 407940 410914 414115 417081 419956 423577 428525 434447 440463 445978 450920 455420 459558 463376 466955
63107D66955L469L605M082M720M980M451L414K659K618K913K951K740K729K998
$$ 466955 470424 474029 478111 482831 487811 492262 495676 498335 500953 503866 506817 509557 512286 515284
63093E15284L127K904K689K753K751K236J408R00R14R61M80n80j782k588k743
$$ 515284 518411 521315 524004 526757 529508 531744 533152 534052 534966 535927 536407 535827 534045 531457 528714
63078E28714k454k120j813j205j86P62J156J230J619K436L112L190K904K845L380
$$ 528714 526260 524140 522327 521122 520936 521698 522854 524084 525703 528139 531251 534441 537345 540190 543570
63063E43570M437N676O846Q095R825J2060J4115J5273J5707J6375J8093K0923
$$ 543570 548007 553683 560529 568624 578449 590509 604624 619897 635604 651979 670072 690995
63051F90995K4348K7639L0208L2004L3524L5122L6445L6983L6857L6606L6349
$$ 690995 715343 742982 773190 805194 838718 873840 910285 947268 984125 1020731 1057080
63040A057080L5889L5443L5438L5615L5236L4326L3834L4212L4697L4415L3365
$$ 1057080 1092969 1128412 1163850 1199465 1234701 1269027 1302861 1337073 1371770 1406185 1439550
63029A439550L1762K9145K4900J9165J2511N073l250j2016k0369k7835l4483m0341
$$ 1439550 1471312 1500457 1525357 1544522 1557033 1562106 1558856 1546840 1526471 1498636 1464153 1423812
63017A423812m5131m8494n0120m9830m7872m5034m2005l8762l4876l0273k5291
$$ 1423812 1378681 1330187 1280067 1230237 1182365 1137331 1095326 1056564 1021688 991415 966124
63006I66124k0227j5188j0316n750j467K568O156R087J1445J3446J5061J6169
$$ 966124 945897 930709 920393 914643 913176 915744 921900 930987 942432 955878 970939 987108
62994I87108J6903J7544J8214J8863J9462J9903J9948J9548J9002J8478J7591
$$ 987108 1004011 1021555 1039769 1058632 1078094 1097997 1117945 1137493 1156495 1174973 1192564
62983A192564J5823J3183J0090O734K955j408o369j1887j7744k3381k8187l1913
$$ 1192564 1208387 1221570 1231660 1238394 1241349 1239941 1233572 1221685 1203941 1180560 1152373 1120460
62971A120460l4588l6195l6693l6237l5090l3451l1509k9445k7222k4702k2174
$$ 1120460 1085872 1049677 1012984 976747 941657 908206 876697 847252 820030 795328 773154
62960G73154k0234j8867j7290j5238j3758j3909j5070j5520j4510j2785j1209
$$ 773154 752920 734053 716763 701525 687767 673858 658788 643268 628758 615973 604764
62949F04764r933r127r382j0765j2160j2276j1024r439q437q110q035p866p498
$$ 604764 594831 585704 576322 565557 553397 541121 530097 520658 512221 504111 496076 488210 480712
62936D80712o926o094n058m172l859m039m088l574k814k340k133j838j463j272
$$ 480712 473786 467692 462634 458462 454603 450564 446476 442902 440088 437748 435615 433777 432314 431042
62922D31042j134o02K58P52M27l26p69o35k89k71p30j240j262q47o38r17j129
$$ 431042 429908 429306 429564 430316 430743 430417 429648 429013 428724 428453 427723 426483 425221 424374 423736 422819 421690
62905D21690p30j14n5m87n66J76J376K464L129L238K980K936L432L901L699L255
$$ 421690 420960 420846 420791 420304 419738 419914 421290 423754 426883 430121 433101 436037 439469 443370 447069 450324
62889D50324L476M014L403J260q40j367p22l61p35j113r93p31q22j304j938k527
$$ 450324 453800 457814 461217 462477 461637 460270 459548 459187 458452 457339 456346 455615 454793 453489 451551 449024
62873D49024k959l198l277l202k972k770k911l387l807l857l620l296k879k271
$$ 449024 446065 442867 439590 436388 433416 430646 427735 424348 420541 416684 413064 409768 406889 404618
62859D04618j450m83M63J040J043P97P56P84L35n53j105q19m5O28J002J003M73
$$ 404618 403168 402685 403148 404188 405231 406028 406784 407568 407903 407350 406245 405426 405381 406009 407011 408014 408487
62842D08487l71r04r01q61j110j232q96n99q88j324j125m43j85o46j150j098o92
$$ 408487 408116 407212 406311 405450 404340 403108 402212 401613 400725 399401 398276 397833 397648 397002 395852 394754 394062
62825C94062n03p65j224j382p87N56K068L085L368L060K396J756J668K263K890
$$ 394062 393559 392794 391570 390188 389401 389957 392025 395110 398478 401538 403934 405690 407358 409621 412511
62810D12511K830K214J808J955K323K672L229M066M642M435L753L501M203N454
$$ 412511 415341 417555 419363 421318 423641 426313 429542 433608 438250 442685 446438 449939 454142 459596
62796D59596O422O647O333O035O244P230Q929J0797J2064J2562J3248J5441J9457
$$ 459596 466018 472665 478998 485033 491277 498507 507436 518233 530297 542859 556107 571548 591005
62783E91005K4243K8470L1649L4179L6764M0024M4212M8882N3079N6158N8255
$$ 591005 615248 643718 675367 709546 746310 786334 830546 879428 932507 988665 1046920
62772A046920N9773O0580O0036N7650N3450M7753M0745L2323K2386J1345K45r955
$$ 1046920 1106693 1167273 1227309 1284959 1338409 1386162 1426907 1459230 1481616 1492961 1493206 1483251
62760A483251j9096k7517l5190m1676m6875n1144n4451n6212n6290n5535n4781
$$ 1483251 1464155 1436638 1401448 1359772 1312897 1261753 1207302 1151090 1094800 1039265 984484
62749I84484n3775n1652m8210m4094m0044l6400l3186l0252k7423k4770k2582
$$ 984484 930709 879057 830847 786753 746709 710309 677123 646871 619448 594678 572096
62738E72096k0836j9010j6786j4570j2934j1751j0402q636o814n379m458l905
$$ 572096 551260 532250 515464 500894 487960 476209 465807 457171 450357 444978 440520 436615
62726D36615l452k827j998j191n64l5M53P65Q76J060J611K581L828N032N666N478
$$ 436615 433163 430336 428338 427147 426583 426548 427001 427766 428642 429702 431313 433894 437722 442754 448420 453898
62710D53898N051N375O695Q378J0052J2099J4675J7161J9098K0958K3325K5986
$$ 453898 458949 464324 471019 479397 489449 501548 516223 533384 552482 573440 596765 622751
62698F22751K8460L0841L3382L5858L8078M0356M2714M4254M4301M3553M2945
$$ 622751 651211 682052 715434 751292 789370 829726 872440 916694 960995 1004548 1047493
62687A047493M1867L8792L3353K6577J9179J0956J944p107j5701k3920l1407l7066
$$ 1047493 1089360 1128152 1161505 1188082 1207261 1218217 1220161 1213054 1197353 1173433 1142026 1104960
62675A104960m0306m1873m2946m3915m4390m3819m1908l8941l5859l3519l1749
$$ 1104960 1064654 1022781 979835 935920 891530 847711 805803 766862 731003 697484 665735
62664F65735k9722k7243k4930k2982k0719j7721j4682j2603j1637j1176j0652
$$ 665735 636013 608770 583840 560858 540139 522418 507736 495133 483496 472320 461668
62653D61668r847q739p515o555o112o093o207o143n664m818m013l518l046k198
$$ 461668 451821 443082 435567 429012 422900 416807 410600 404457 398793 393975 389962 386444 383398 381200
62639C81200j202o70p20q89q38n95k00K36K89k56p79m99K75M69k20j053j539j897
$$ 381200 379998 379328 378608 377719 376881 376286 376086 376322 376611 376355 375576 375077 375352 375821 375601 374548 373009 371112
62621C71112k069j505l25M42L65L19J032J945K330K589L367M179M108L426L343
$$ 371112 369043 367538 367213 367655 368020 368339 369371 371316 373646 376235 379602 383781 387889 391315 394658
62606C94658M239N253N608N556N789O527P495Q432R469J1060J3405J5972J7939
$$ 394658 398897 404150 409758 415314 421103 427630 435125 443557 453026 464086 477491 493463 511402
62593E11402J9307K1019K3667K6562K8571K9395K9462K8945K7612K5367K2272
$$ 511402 530709 551728 575395 601957 630528 659923 689385 718330 745942 771309 793581
62582G93581J8202J3103P512K229k523p076j1527j5553j8964k1908k4415k6182
$$ 793581 811783 824886 832398 834627 832104 825028 813501 797948 778984 757076 732661 706479
62570G06479k7024k7182k6994k6459k5268k3220k0632j8290j6804j5936j4788
$$ 706479 679455 652273 625279 598820 573552 550332 529700 511410 494606 478670 463882
62559D63882j2900j0851r499q866q169o804m982l457k843l181l848m022l404k423
$$ 463882 450982 440131 430632 421766 413597 406793 401811 398354 395511 392330 388482 384460 381056 378633
62545C78633j628j113p42n54o00n89j01Q85J966K721K875K259R55n44j643k066
$$ 378633 377005 375892 375150 374596 373996 373407 373306 374191 376157 378878 381753 384012 384967 384423 382780 380714
62529C80714j885j252l61N07J205J874K735L790M946O246P771R463J1239J3115
$$ 380714 378829 377577 377216 377723 378928 380802 383537 387327 392273 398519 406290 415753 426992 440107
62515D40107J5002J6626J7894J9097K0522K2095K3686K5389K7115K8199K8000
$$ 440107 455109 471735 489629 508726 529248 551343 575029 600418 627533 655732 683732
62504F83732K6691K4953K2973K0324J6783J2732Q616M501L80l532o950r667j1316
$$ 683732 710423 735376 758349 778673 795456 808188 816804 821305 821685 818153 811203 801536 790220
62491G90220j1352r608o711l636q88J722M593P888J1558J5498J9461K3052K6065
$$ 790220 778868 769260 762549 758913 758025 759747 764340 772228 783786 799284 818745 841797 867862
62478H67862K8758L1381L3403L3558L1021K6233K0316J3975P457J193m401r801
$$ 867862 896620 928001 961404 994962 1025983 1052216 1072532 1086507 1093964 1095157 1090756 1080955
62466A080955j6183k3952l1928l8363m2412m4336m4794m4356m3436m2136m0245
$$ 1080955 1064772 1040820 1008892 970529 928117 883781 838987 794631 751195 709059 668814
62455F68814l7573l4112k9893k5084k0366j6666j4166j2068r676p242n306l783
$$ 668814 631241 597129 567236 542152 521786 505120 490954 478886 469210 461968 456662 452879
62443D52879k278q56J48Q51J622K410K917L244L785M544N152N447N474M938L349
$$ 452879 450601 449745 449893 450744 452366 454776 457693 460937 464722 469266 474418 479865 485339 490277 493626
62428D93626Q13j883m094n815p273q416q977q760p840o718o181o620p439p520
$$ 493626 494439 492556 488462 482647 475374 466958 457981 449221 441381 434663 428482 421862 414423 406903
62414D06903o349m481k961k493k997l702l767l148k683k990l601l540k617j513
$$ 406903 400554 396073 393112 390619 387622 383920 380153 377005 374322 371332 367731 364191 361574 360061
62400C60061p82k95K78R63J534J722J420R63J004J701K300K025J178O46O71Q43
$$ 360061 359279 358984 359262 360225 361759 363481 364901 365864 366868 368569 370869 372894 374072 374718 375389 376232
62384C76232J146K039L452M664N307N676N898N745N514O027P342Q409Q612Q684
$$ 376232 377378 379417 382869 387533 392840 398516 404414 410159 415673 421700 429042 437451 446063 454747
62370D54747R401J0311J0726J1164J2575J4708J6477J7793J9701K2684K5975K8885
$$ 454747 464148 474459 485185 496349 508924 523632 540109 557902 577603 600287 626262 655147
62358F55147L1861L5696M0449M5561N0481N4692N7619N8953N8773N7024N3243
$$ 655147 687008 722704 763153 808714 859195 913887 971506 1030459 1089232 1146256 1199499
62347A199499M7173L9277L0277K0562J0534J069o984j3648j9555k4975k9759l4076
$$ 1199499 1246672 1285949 1316226 1336788 1347322 1348391 1341407 1327759 1308204 1283229 1253470 1219394
62335A219394l8392m2437m5002m5253m3714m1449l8729l5247l1207k7403k4163
$$ 1219394 1181002 1138565 1093563 1048310 1004596 963147 924418 889171 857964 830561 806398
62324H06398k1066j7909j5312j4005j3991j4757j5939j7353j8648j9382j9429
$$ 806398 785332 767423 752111 738106 724115 709358 693419 676066 657418 638036 618607
62313F18607j9032j8465j7830j7041j5930j4435j2839j1536j0515r301p670o059
$$ 618607 599575 581110 563280 546239 530309 515874 503035 491499 480984 471683 464013 457954
62301D57954n010m446l881l112k330j674j095n97k33J38P20J398J819J894J921
$$ 457954 452944 448498 444617 441505 439175 437501 436406 435809 435576 435714 436434 437832 439651 441545 443466
62286D43466K166K499K630K523K475K856L718M657N155N096M785M456M007L395
$$ 443466 445632 448131 450761 453284 455759 458615 462333 466990 472145 477241 482026 486482 490489 493884
62272D93884K949L058L720M678N781P006Q368J0033J2229J4789J7129J9154K1670
$$ 493884 496833 499891 503611 508289 514070 521076 529444 539477 551706 566495 583624 602778 624448
62259F24448K5397K9894L4165L8101M2518M7837N3452N8470O2265O4199O3549
$$ 624448 649845 679739 713904 752005 794523 842360 895812 954282 1016547 1080746 1144295
62248A144295O0125N4423M6914L7732K7310J6736P038j560r347j6511k3222k9878
$$ 1144295 1204420 1258843 1305757 1343489 1370799 1387535 1394573 1393013 1383666 1367155 1343933 1314055
62236A314055l6777m3664m9883n4791n7837n8611n7192n4256n0449m5930m0738
$$ 1314055 1277278 1233614 1183731 1128940 1071103 1012492 955300 901044 850595 804665 763927
62225G63927l5393l0623k6718k3404k0308j7258j4298j1707r824q525p083m973
$$ 763927 728534 697911 671193 647789 627481 610223 595925 584218 574394 565869 558786 553813
62213E53813k688j184o14j20R04J974K300K015K032K831L915M481M225L352K206
$$ 553813 551125 549941 549327 549207 550111 552085 554385 556400 558432 561263 565178 569659 573884 577236 579442
62198E79442J129M32J40l8l13n13m92m72o42n85J93J349J997K066K506L899N581
$$ 579442 580571 581003 581143 581105 580792 580279 579787 579315 578673 578088 578281 579630 581627 583693 586199 590098 595679
62181E95679O719P452Q240Q722Q166O777N586N106N005N147N989P714R795J1856
$$ 595679 602398 609850 618090 626812 634978 641755 647341 652447 657452 662599 668588 676302 686097 697953
62167F97953J4364J7977K2624K7652L2505L6999M1030M4332M6316M6119M3112
$$ 697953 712317 730294 752918 780570 813075 850074 891104 935436 981752 1027871 1070983
62156A070983L7556L0491K2928J5343P968J027n383j1286j6569k1058k4944k8634
$$ 1070983 1108539 1139030 1161958 1177301 1185269 1186296 1180913 1169627 1153058 1132000 1107056 1078422
62144A078422l2087l4764l6371l7151l7271l6411l4364l1494k8266k4677k0606
$$ 1078422 1046335 1011571 975200 938049 900778 864367 830003 798509 770243 745566 724960
62133G24960j6334j2379r065o621n291m981n040m892m607m486m306l472j826J39
$$ 724960 708626 696247 687182 680561 675270 670289 665249 660357 655750 651264 646958 643486 641660 641799
62119F41799J860L188M382N785P429Q766Q969P723N478K859K22k026l183k921
$$ 641799 643659 646847 651229 657014 664443 673209 682178 689901 695379 698238 698460 696434 693251 690330
62105F90330j878j056q78j336k728n385q680j1123j1717j0768r152p373n583l976
$$ 690330 688452 687396 686518 685182 682454 677069 668389 657266 645549 634781 625629 618256 612673 608697
62091F08697k597j097P63K520L490L808M478O123Q127R392R719J0018J1149J3031
$$ 608697 606100 605003 605766 608286 611776 615584 620062 626185 634312 643704 653423 663441 674590 687621
62077F87621J4975J6548J7787J8879K0002K1353K2955K4473K5515K6084K6488
$$ 687621 702596 719144 736931 755810 775812 797165 820120 844593 870108 896192 922680
62066I22680K6856K7201K7795K9034L0800L2436L3514L4066L3876L2053K7927
$$ 922680 949536 976737 1004532 1033566 1064366 1096802 1130316 1164382 1198258 1230311 1258238
62055A258238K1999J5459Q964K468l835r144j3001j6142j9893k4727k9809l4074
$$ 1258238 1280237 1295696 1304660 1307128 1303293 1294149 1281148 1265006 1245113 1220386 1190577 1156503
62043A156503l7337m0062m2232m3142m2494m1148m0190l9470l7750l4380l0279
$$ 1156503 1119166 1079104 1036872 993730 951236 910088 869898 830428 792678 758298 728019
62032G28019k6899k4668k2883k0913j9018j7785j7068j5877j3552j0782r030q857
$$ 728019 701120 676452 653569 632656 613638 595853 578785 562908 549356 538574 529544 520687
62020E20687r275r007p933o878o447o642p241p851p821o926n951n728n711m554
$$ 520687 511412 502405 494472 487594 481147 474505 467264 459413 451592 444666 438715 432987 427276 422722
62006D22722k182j24N39M69Q10J687K664L736M972N855N948N666N523N088L675
$$ 422722 420540 420416 420955 421424 422234 423921 426585 430321 435293 441148 447096 452762 458285 463373 467048
61991D67048J654J45m28n41n58m59m87j111k266l366m212n106n977o131n210l793
$$ 467048 468702 468847 468419 467878 467320 466861 466374 465263 462997 459631 455419 450313 444336 438205 432995 429202
61975D29202k764k433k495k419j811q17j63l63r39j022o37o51j300j652r46J87
$$ 429202 426438 424005 421510 419091 417280 416463 416300 415937 414998 413976 413339 412688 411388 409736 408790 408977
61959D08977N11k27j151j422j023m50m6K19O22J305K069K621L135M164N833P436
$$ 408977 409488 409261 408110 406688 405665 405215 405169 405388 406010 407315 409384 412005 415140 419304 425137 432573
61943D32573Q254Q539R159J0338J1446J2151J3232J5565J8663K0900K1348K0679
$$ 432573 440827 449366 458525 468863 480309 492460 505692 521257 539920 560820 582168 602847
61931F02847J9998J9370J8183J6565J5452J5179J4828J3434J1166Q736O119K670
$$ 602847 622845 642215 660398 676963 692415 707594 722422 735856 747022 755758 761877 764547
61919G64547j550n364p678q654r298j0107j0446r354o737l586r39J163L498O539
$$ 764547 762997 757633 749955 741301 732003 721896 711450 702096 695359 691773 690834 691997 695495 702034
61905G02034R871J2684J4514J5308J5090J3828J1522Q301M493N58l248o989j0608
$$ 702034 711905 724589 739103 754411 769501 783329 794851 803152 807645 808203 804955 797966 787358
61892G87358j3502j5121j5856j6640j7547j7632j6479j5020j4297j4076j3489
$$ 787358 773856 758735 742879 726239 708692 691060 674581 659561 645264 631188 617699
61881F17699j2465j1626j1138j0598r995r843j0269j0618j0226r107p788o741
$$ 617699 605234 593608 582470 571872 561877 552034 541765 531147 520921 511814 504026 497285
61869D97285o095n534m580l133j605k93J056K735M443N754O859Q185R561J0483
$$ 497285 491190 485656 481076 477943 476338 476045 477101 479836 484279 490033 496892 505077 514638 525121
61855E25121J1187J2644J5370J8782K1914K4303K6113K7813K9812L2042L3884
$$ 525121 536308 548952 564322 583104 605018 629321 655434 683247 713059 745101 778985
61844G78985L4816L4953L4567L3354L0776K6912K2269J6915J0591L705k640p696
$$ 778985 813801 848754 883321 916675 947451 974363 996632 1013547 1024138 1027843 1025203 1017507
61832A017507j1477j3941j4694j3744j1875r701o922k922K177P453J1818J4534
$$ 1017507 1006030 992089 977395 963651 951776 942075 935153 932231 934408 941861 953679 968213
61820I68213J5450J4960J3507J0993P060J849l957r860j5725k1232k5798k9232
$$ 968213 983663 998623 1012130 1023123 1030183 1032032 1028075 1018215 1002490 981258 955460 926228
61808I26228l1769l3305l3402l2243l0833k9664k8042k5387k2499k0588j9519
$$ 926228 894459 861154 827752 795509 764676 735012 706970 681583 659084 638496 618977
61797F18977j8051j5668j3207j1517j0331q923p254n956n373n171m889m503m216
$$ 618977 600926 585258 572051 560534 550203 541280 534026 528070 522697 517526 512637 508134 503918
61784E03918l962l479k858k598k924l386l384k867k192j596j159j036j200j225
$$ 503918 499956 496477 493619 491021 488097 484711 481327 478460 476268 474672 473513 472477 471277 470052
61770D70052p86k62k64p34j077j088j019q34j92P54J384J548J747K208K553K641
$$ 470052 469266 469004 468740 468006 466929 465841 464822 463988 463796 464550 465934 467482 469229 471437 473990 476631
61754D76631K827L046K570J249J80L58J359K023J963J525Q00l82j712k568k898
$$ 476631 479458 482504 485074 486323 486503 486861 488220 490243 492206 493731 494531 494149 492437 489869 486971
61739D86971l205l628l641k827j451j25P42J080J026P95N18K45J06K76P25J174
$$ 486971 483766 480138 476497 473670 472219 472094 472836 473916 474942 475737 476255 476500 476606 476882 477607 478781
61723D78781J484J781K068K104J893J864K195K343J733P06K39Q21J932K630K362
$$ 478781 480265 482046 484114 486218 488111 489975 492170 494513 496246 496952 497191 498012 499944 502574 504936
61708E04936J348L11k63o76j587k950l890l856l371l230l421l421l119k811k608
$$ 504936 506284 506595 506332 505656 504069 501119 497229 493373 490002 486772 483351 479930 476811 474000 471392
61693D71392k431k421k694k871k524k002k122k932l475l017k009j460j738k303
$$ 471392 468961 466540 463846 460975 458451 456449 454327 451395 447920 444903 442894 441434 439696 437393
61679D37393k492k244k030k199k539k602k329k097k098k081j808j421j121q76
$$ 437393 434901 432657 430627 428428 425889 423287 420958 418861 416763 414682 412874 411453 410332 409456
61665D09456p74j125j824k041j244j48J05n13r15m85K19M77L79M45P84J162J448
$$ 409456 408682 407557 405733 403692 402448 402300 402405 401892 400977 400492 400711 401188 401567 402012 402796 403958 405406
61648D05406J621J492R70M51N81J528K672L231L053K727K840L268L384K841J905
$$ 405406 407027 408519 409489 409940 410521 412049 414721 417952 421005 423732 426572 429840 433224 436065 437970
61633D37970R93K68k60o09j033j937l215m068l978l529l735m649n256m741l307
$$ 437970 438963 439231 438971 438362 437329 435392 432177 428109 424131 420602 416867 412218 406962 402221 398914
61618C98914j722o50m55j072j820j858j181p44j248k200k619k393k407l339m864
$$ 398914 397192 396542 396087 395015 393195 391337 390156 389412 388164 385964 383345 380952 378545 375206 370342
61603C70342o078o400n885n033m453m491m879m946m392l722l549l677l316k271
$$ 370342 364264 357864 351979 346946 342493 338002 333123 328177 323785 320063 316514 312837 309521 307250
61589C07250j282r48r16o19l45q50k074k986k860k065j430j319j538j770j811
$$ 307250 305968 305020 304104 303485 303140 302290 300216 297230 294370 292305 290875 289556 288018 286248 284437
61574B84437j668j517j407j084m61j27o71j580j614n19N10M85o8r4M42Q02Q13
$$ 284437 282769 281252 279845 278761 278300 278173 277502 275922 274308 273789 274299 274784 274716 274622 275064 275866 276679
61557B76679R74J437J690J351O25o8m33l00L10J020J367J309J173J221J492J924
$$ 276679 277653 279090 280780 282131 282756 282688 282255 281955 282265 283285 284652 285961 287134 288355 289847 291771
61541B91771K272K066J077j79p95l63P26J843K645L035K953K348J358M02l1J12
$$ 291771 294043 296109 297186 297007 296212 295849 296575 298418 301063 304098 307051 309399 310757 311159 311128 311240
61525C11240K69j47j032j793k181k374k269j493k92L27j82j132j556j324q96n27
$$ 311240 311509 311362 310330 308537 306356 303982 301713 300220 299928 300255 300073 298941 297385 296061 295165 294638
61509B94638k99l85o46o00k69m43j383k036j421j67M37L55N44J183J456R98K64
$$ 294638 294339 293954 293308 292708 292439 291996 290613 288577 287156 286989 287426 287781 288325 289508 290964 291962 292226
61492B92226n52j683k692k490q36J119K233K455K193J493L94o10r71n42N98K190
$$ 292226 291674 289991 287299 284809 283973 285092 287325 289780 291973 293466 293860 293250 292279 291737 292335 294525
61476B94525L521L787L007K060J578J389J120O59r6j137j785j156M60J520J073
$$ 294525 298046 301833 304840 306900 308478 309867 310987 311646 311550 310413 308628 307472 307932 309452 310525
61461C10525r2o19k21M38P89O32j08j131j605r38N04J803K355K023R74k47r10
$$ 310525 310433 309814 309593 310031 310820 311452 311344 310213 308608 307670 308174 309977 312332 314355 315329 315082 314172
61444C14172q62o75o73l79N08J237R45Q6K0J286L052M241M538M200L582L034K778
$$ 314172 313310 312635 311962 311583 312091 313328 314273 314359 314379 315665 318717 322958 327496 331696 335278 338312 341090
61427C41090K746K720K674K640K380J619O41J91O52J656K666L488M093M220L592
$$ 341090 343836 346556 349230 351870 354250 355869 356510 356701 357353 359009 361675 365163 369256 373476 377068
61412C77068K396J272O92N38L19k23q77j336j619k003k556k942k823k359k133
$$ 377068 379464 380736 381428 381966 382285 382062 381185 379849 378230 376227 373671 370729 367906 365547 363414
61397C63414k519l175l291k439j014K49J069J603J792J245n1j417k182k333k209
$$ 363414 360895 357720 354429 351990 350976 351225 352294 353897 355689 356934 356883 355466 353284 350951 348742
61382C48742j888j309n84K17J267K483L218L049K424J969J505N56n02p85k24M52
$$ 348742 346854 345545 344961 345178 346445 348928 352146 355195 357619 359588 361093 361649 361147 360362 360138 360590
61366C60590R35J546K157K048J201O37J007J717K074K361L075L751L502K437J774
$$ 360590 361525 363071 365228 367276 368477 369114 370121 371838 373912 376273 379348 383099 386601 389038 390812
61351C90812K487M330O165P117P356P785Q826R733R485Q119O557N286M129L253
$$ 390812 393299 397629 403794 410911 418267 426052 434878 444611 454096 462215 468772 474058 478187 481440
61337D81440L318M277N012M691L708K761J807N52o88j428j751k039k329k511k743
$$ 481440 484758 489035 494047 498738 502446 505207 507014 507566 506878 505450 503699 501660 499331 496820 494077
61322D94077l126l314k921j986p59N24J288Q84l36q64K96K373L926M594M950N253
$$ 494077 490951 487637 484716 482730 481971 482495 483783 484667 484331 483467 483763 486136 490062 494656 499606 504859
61306E04859N372N655O860R157J1892J4221J5483J5194J3418J0979Q726O654M255
$$ 504859 510231 515886 522746 531903 543795 558016 573499 588693 602111 613090 621816 628470 632725
61293F32725J509j098l305n168o575p279p463p715q382r235r691r195p695o019
$$ 632725 634234 633136 629831 624663 618088 610809 603346 595631 587249 578014 568323 559128 551433 545414
61279E45414n332n764o097n298l870k977k717k204j056J72R75J495K004K452K773
$$ 545414 540082 534318 528221 522923 519053 516076 513359 511155 510099 510271 511246 512741 514745 517197 519970
61264E19970L081L483L937M361M636M705M856N649P245R101J0628J1662J1967
$$ 519970 523051 526534 530471 534832 539468 544173 549029 554678 561923 571024 581652 593314 605281
61251F05281J0969Q652O137M585L904L231K284J372M79o59j862k772l598m700
$$ 605281 616250 624902 631039 635624 639528 642759 645043 646415 646894 646235 644373 641601 638003 633303
61237F33303n663n726m979m172l484k521j460j082j464j683j063Q5J166J959K433
$$ 633303 627640 621914 616935 612763 609279 606758 605298 604216 602752 601069 600006 600091 601257 603216 605649
61222F05649K620K873L531M223M260L840L986N053O067N985M972M111M188N017
$$ 605649 608269 611142 614673 618896 623156 626996 630982 636035 642102 648087 653059 657170 661358 666375
61208F66375N637N157L711K382J801J328L14m61K78K235L801M345M886O345Q426
$$ 666375 672012 677169 680880 683262 685063 686391 686705 686244 686522 688757 692558 696903 701789 708134 716560
61193G16560J0596J2806J4828J6066J6582J7131J7587J6630J3745J0357P977O265
$$ 716560 727156 739962 754790 770856 787438 804569 822156 838786 852531 862888 870865 877130
61181H77130M141J906Q78J316K012J833O64j083k989m636n731o425p102p945q948
$$ 877130 881271 883177 884055 885371 887383 889216 889880 888797 885808 881172 875441 869016 861914 853969 845021
61166H45021j0090j1116j1590j1553j1802j2933j4464j5416j5516j5255j4962
$$ 845021 834931 823815 812225 800672 788870 775937 761473 746057 730541 715286 700324
61155G00324j4437j3484j2282j1187j0380r675q529o481l792j399L8P41J180J262
$$ 700324 685887 672403 660121 648934 638554 628879 620350 613869 610077 608678 608716 609457 610637 611899
61141F11899N24j089l115n070o730p913q341p777o235m111k080n98M94J642K935
$$ 611899 612423 611334 608219 603149 596419 588506 580165 572388 566153 562042 559962 559364 559858 561500 564435
61126E64435M120N147O280P624R070J0668J2582J4633J6471J8158K0006K1786
$$ 564435 568555 573702 579982 587606 596676 607344 619926 634559 651030 669188 689194 710980
61114G10980K2893K3358K3940K4983K6020K6662K7069K7295K6992K6162K5288
$$ 710980 733873 757231 781171 806154 832174 858836 885905 913200 940192 966354 991642
61103I91642K4323K2507J9657J6651J4021J1042P050K701j033m341p965j1822
$$ 991642 1015965 1038472 1058129 1074780 1088801 1099843 1106893 1109594 1108561 1104220 1096255 1084433
61091A084433j5281j8361k1480k4301k5996k6562k6851k7259k7229k6245k4657
$$ 1084433 1069152 1050791 1029311 1005010 979014 952452 925601 898342 871113 844868 820211
61080H20211k3258k2379k1625k0346j8436j6566j5314j4245j2531j0397q963q460
$$ 820211 796953 774574 752949 732603 714167 697601 682287 668042 655511 645114 636151 627691
61068F27691p809o373m869l836k564o28Q64R72P65J765L406L912L287L399N086
$$ 627691 619882 613509 608640 604804 602240 601612 602476 603448 604213 605978 609384 613296 616583 619982 625068
61053F25068P079Q096Q518R270J0410J1537J2777J4556J6843J9028K0417K0875
$$ 625068 632147 640243 648761 658031 668441 679978 692755 707311 724154 743182 763599 784474
61041G84474K1160K2328K4464K6490K7653K8578L0096L1884L3221L4376L6062
$$ 784474 805634 827962 852426 878916 906569 935147 965243 997127 1030348 1064724 1100786
61030A100786L8143M0110M2259M5084M8011N0088N1370N2243N2157N0790M9816
$$ 1100786 1138929 1179039 1221298 1266382 1314393 1364481 1415851 1468094 1520251 1571041 1620857
61019A620857N1535N6158O2458P0438Q0937R3016J04549J15453J27782J42804
$$ 1620857 1672392 1728550 1791008 1861446 1942383 2035399 2139948 2255401 2383183 2525987
61009B525987J61226J86245K22508K71434L31552M04515M96262O10922P48994
$$ 2525987 2687213 2873458 3095966 3367400 3698952 4103467 4599729 5210651 5959645
61000E959645R13662J112020J346142J611094J905863K226554K520740K652176
$$ 5959645 6873307 7985327 9331469 10942563 12848426 15074980 17595720 20247896
60992B0247896K455919J874851J049202K49038k97416n14013m43854j63877K27813
$$ 20247896 22703815 24578666 25627868 25876906 25579490 25065477 24621623 24457746 24685559
60983B4685559N64931O29670K79593m29470j263145j960730k376982k506679k419809
$$ 24685559 25250490 25880160 26159753 25730283 24467138 22506408 20129426 17622747 15202938
60974A5202938k197947j911649j616475j346633j113628r16641p53139o20026
$$ 15202938 13004991 11093342 9476867 8130234 7016606 6099965 5346826 4726800
60966D726800n11708m22641l50362k93655k49745k15297j88323j67165j49219
$$ 4726800 4215092 3792451 3442089 3148434 2898689 2683392 2495069 2327904 2178685
60957B178685j32563j17537j04918r3706q2280p0610n9744m9969m1106l3987k9915
$$ 2178685 2046122 1928585 1823667 1729961 1647681 1577071 1517327 1467358 1426252 1392265 1362350
60946A362350k8894k9518l0365l0573k9595k7446k4959k2843k0843j8501j6332
$$ 1362350 1333456 1303938 1273573 1243000 1213405 1185959 1161000 1138157 1117314 1098813 1082481
60935A082481j5230j5131j5175j4866j4280j3422j2303j1345j0804j0039q298
$$ 1082481 1067251 1052120 1036945 1022079 1007799 994377 982074 970729 959925 949886 941588
60924I41588n995m245l225k037l53R52J146Q56J280K696M243N013M944M664M699
$$ 941588 935593 931348 928123 926086 925733 926685 927831 928687 929967 932663 936906 941919 946863 951527 956226
60909I56226M944M998M782M536M190L285J801N42K12M45K64p47k261l886n466
$$ 956226 961170 966168 970950 975486 979676 982961 984762 985304 985516 985961 986225 985478 983217 979331 973865
60894I73865o808p754q449r136r676r818r796j0202j1198j2367j3349j4163j4879
$$ 973865 967057 959303 950854 941718 932042 922224 912428 902226 891028 878661 865312 851149 836270
60881H36270j5417j5702j5663j5036j3625j1850j0606j0375j0759j0993j0644
$$ 836270 820853 805151 789488 774452 760827 748977 738371 727996 717237 706244 695600
60870F95600r742q584p545o854o399n952n583n596n929n997n334m146l082k564
$$ 695600 685858 677274 669729 662875 656476 650524 644941 639345 633416 627419 622085 617939 614857 612293
60856F12293k591l060m007n343o544o935o396n650n461n703n581m822m113m165
$$ 612293 609702 606642 602635 597292 590748 583813 577417 571767 566306 560603 555022 550200 546087 541922
60842E41922m774n231n202m879m522m371m789n911p328q423q936q829p935o323
$$ 541922 537148 531917 526715 521836 517314 512943 508154 502243 494915 486492 477556 468727 460792 454469
60828D54469m743l982l827l319k098q44j90R0N23J057J254R94O39N14N56M68J40
$$ 454469 449726 445744 441917 438598 436500 435656 435466 435556 436079 437136 438390 439384 440023 440537 441093 441561 441701
60811D41701j39L0O28J170J285J102P68P0r88j656j187k2N93J74n28p26n65n87
$$ 441701 441562 441592 442220 443390 444675 445777 446545 446615 445627 443971 442784 442762 443355 443529 443001 442275 441710 441123
60793D41123r26j380j797k076k064j826j716j928k250k365k164j740j464j998
$$ 441123 440197 438817 437020 434944 432880 431054 429338 427410 425160 422795 420631 418891 417427 415429
60779D15429l616n492o291n640m409l440k733k150k037k619l339l403k554r69
$$ 415429 411813 406321 400030 394390 389981 386541 383808 381658 379621 377002 373663 370260 367706 366737
60765C66737R82K513K672J495K63J8L81N29O47J415K552L043K664K205K143K040
$$ 366737 367719 370232 372904 374399 374662 374680 375061 375590 376237 377652 380204 383247 385911 388116 390259 392299
60749C92299J486P98M77N80R49J558K354L079L495L502K999J894K95j510l208
$$ 392299 393785 394583 395060 395640 396589 398147 400501 403580 407075 410577 413576 415470 415765 414255 411047
60734D11047m425m749m238l690l894m636m954m358l307k523k317k662l384m071
$$ 411047 406622 401873 397635 393945 390051 385415 380461 376103 372796 370273 367956 365294 361910 357839
60720C57839m209l656k757j980j553j495j616j544j012k17L16K44l38j018j344
$$ 357839 353630 349974 347217 345237 343684 342189 340573 339029 338017 337800 338116 338360 338022 337004 335660
60705C35660j147p73p01q21n56P5J68p18j582j189K07J269J412J181R62N29m7
$$ 335660 334513 333740 333039 332218 331662 331737 331905 331187 329605 328416 328623 329892 331304 332485 333447 333976 333929
60688C33929j30N02J322J961K667L456L778L431L112L467M242M815N055N119M970
$$ 333929 333799 334301 335623 337584 340251 343707 347485 350916 354028 357495 361737 366552 371607 376726 381696
60673C81696M552M110L838L621L326K984K460J549N77J93L04rj111k119k221j876
$$ 381696 386248 390358 394196 397817 401143 404127 406587 408136 408713 408906 409210 409201 408090 405971 403750 401874
60657D01874j960k389k464k048j460o24O67J838J942J000J93M11J261J612P88
$$ 401874 399914 397525 395061 393013 391553 390929 391596 393434 395376 396376 396569 396980 398241 399853 400641
60642D00641q53k255k638k338k428l299m054l812l022k746l069l140k638k129
$$ 400641 399788 397533 394895 392557 390129 386830 382776 378964 375942 373196 370127 366987 364349 362220
60628C62220j933j548o46K63N21J86k73o81j132j494j436q33P0Q26J079P85K63
$$ 362220 360287 358739 358093 358356 358877 359063 358790 358109 356977 355483 354047 353214 353284 354110 355189 355974 356237
60611C56237o4j6L22P70J099J104R12J037J689K220J727K66j051j243m22N96J154
$$ 356237 356173 356157 356479 357249 358348 359452 360364 361401 363090 365310 367037 367303 366252 365009 364587 365183 366337
60594C66337J118P01K92K64O85J240J517J373R76O03M02L05J87J37M48J184J940
$$ 366337 367455 368156 368448 368712 369397 370637 372154 373527 374503 375106 375508 375813 376000 376137 376585 377769 379709
60577C79709K252K133J980K114K574L274M105N013O112P604R363J0926J2119J3347
$$ 379709 381961 384094 386074 388188 390762 394036 398141 403154 409266 416870 426233 437159 449278 462625
60563D62625J4898J6207J6369J5102J2733R533N731J964j107l646o298q891j0342
$$ 462625 477523 493730 510099 525201 537934 547467 553198 555162 554055 550409 544111 535220 524878
60550E24878j0106q898p541n883l491p43J566L324N036O846Q409R692J1231J3451
$$ 524878 514772 505874 498333 492450 488959 488216 489782 493106 498142 504988 513397 523089 534320 547771
60536E47771J6211J9082K1591K3082K2897K0997J8046J4519J0166M718j092n844
$$ 547771 563982 583064 604655 627737 650634 671631 689677 704196 714362 719080 717988 712144
60524G12144q756j0213j0871j0884j0240r422r044q968q458p219n701m265k631
$$ 712144 703388 693175 682304 671420 661180 651758 642714 633746 625288 618069 612368 608103 605472
60511F05472n49J485K715L060L127L474M306N724P757J0186J2755J5636J9317
$$ 605472 604923 606408 609123 612183 615310 618784 623090 628814 636571 646757 659512 675148 694465
60498F94465K4000K9464L5411M1614M7668N3064N7593O1222O3487O3380O0142
$$ 694465 718465 747929 783340 824954 872622 925686 983279 1044501 1107988 1171368 1231510
60487A231510N3845M4974L3722K0045M320j2330k8365m2371n3408o1068o5397
$$ 1231510 1285355 1330329 1364051 1384096 1388416 1376086 1347721 1305350 1251942 1190874 1125477
60476A125477o6820o6000o3608o0006n5330m9898m4388l9347l4730l0221k5882
$$ 1125477 1058657 992657 929049 869043 813713 763815 719427 680080 645350 615129 589247
60465E89247k2131j9150j6720j4674j3091j1895j0679r196p762o860o443n933
$$ 589247 567116 547966 531246 516572 503481 491586 480907 471711 463949 457089 450646 444713
60453D44713n009m131m050m823n591n570m975m530m239l397j960j019j265j718
$$ 444713 439704 435573 431523 426700 421109 415539 410564 406034 401795 398398 396438 395419 394154 392436
60439C92436r48Q57K087J845Q39No24j296j722j577j185j010q91m35J35J52o00
$$ 392436 391488 392345 394432 396277 397116 397121 396497 395201 393479 391902 390717 389707 388816 388381 388516 388668 388068
60422C88068j628k304k344j807j006l49m4N7K25O06J195J817K040J525O02O3J18
$$ 388068 386440 384136 381792 379985 378979 378630 378586 378643 378868 379474 380669 382486 384526 386051 386653 386716 386834
60405C86834J14l92q61o20L7L32K75N45J258J733J599J275J068O40j48n33K28
$$ 386834 386948 386556 385695 385075 385112 385444 385719 386264 387522 389255 390854 392129 393197 393837 393689 393156 393384
60388C93384J681K575K388J739J397J437J533J472J153M88l17n91K04J797L204
$$ 393384 395065 397640 400028 401767 403164 404601 406134 407606 408759 409247 408930 408339 408543 410340 413544
60373D13544L502K448O22q08q06N80K008K115R90qM8P01J002P26L11L7o0J89R68
$$ 413544 417046 419494 420116 419308 418502 419082 421090 423205 424195 424187 424235 424936 425938 426664 426975 427012 426952 427141 428109
60354D28109J949K484K375K090K121K492K994L540M059M330M209L874L632L464
$$ 428109 430058 432542 434917 437007 439128 441620 444614 448154 452213 456543 460752 464626 468258 471722
60340D71722K891J474n55k295k993k847k690k894k898k061o36L91K87p84j913
$$ 471722 474613 476087 475532 473237 470244 467397 464707 461813 458915 456854 456218 456609 456896 456112 454199
60325D54199k134j232m3L41j87p10n89k28k09l19o0M64Q70J335K307L701N149
$$ 454199 452065 450833 450790 451131 450944 450234 449645 449417 449208 448889 448829 449293 450163 451498 453805 457506 462655
60308D62655O760Q817J0978J2684J4217J6423J9498K2913K6295K9186L0093K7265
$$ 462655 469415 478232 489210 501894 516111 532534 552032 574945 601240 630426 660519 687784
60296F87784K0883J3170N807j669j0148j8746k5308k8459k8323k5815k2152j8575
$$ 687784 708667 721837 727644 725975 715827 697081 671773 643314 614991 589176 567024 548449
60284E48449j5706j3185j0476p766n682m496m065m168m425m338l847l493l587
$$ 548449 532743 519558 509082 501316 495634 491138 487073 482905 478480 474142 470295 466802 463215
60271D63215l705l421l009k875k795k410j998k029k250j989j135j90M61P55N98
$$ 463215 459510 456089 453080 450205 447410 445000 443002 440973 438723 436734 435599 435409 435870 436625 437223
60256D37223j1o32o72p4O58J008P62Q9m01m4R97J666J294M56Q0K27M23N98R14
$$ 437223 437212 436580 435908 435834 436492 437500 438262 438351 437950 437906 438903 440569 441863 442319 442399 442626 443049 443647 444561
60237D44561J064P14K69K74L48k32j052q63N68K049K638K685K824K916K569J972
$$ 444561 445625 446339 446608 446882 447230 446998 445946 445083 445651 447700 450338 453023 455847 458763 461332 463304
60221D63304J533J231R03P40R82J369J505J544K082L330M711N386N117M565M595
$$ 463304 464837 466068 466971 467711 468693 470062 471567 473111 475193 478523 483234 488620 493737 498302 502897
60206E02897N263N682N179M231L864M332M957N215N278N386N264M584L537K617
$$ 502897 508160 513842 519021 523252 527116 531448 536405 541620 546898 552284 557548 562132 565669 568286
60192E68286K023J570J066N38J53j23o89j938l627m849n017m570m306m285m002
$$ 568286 570309 571879 572945 573483 573636 573513 572824 570886 567259 562410 557393 552823 548517 544232 540230
60177E40230l485l431m108m810m689l692k367j215n11l99q20j454j950k094j809
$$ 540230 536745 533314 529206 524396 519707 516015 513648 512433 511922 511523 510703 509249 507299 505205 503396
60162E03396j264q87r53j108p28K42J213J758J984J971J431L28o49p02K25J543
$$ 503396 502132 501245 500292 499184 498456 498698 499911 501669 503653 505624 507055 507383 506734 506032 506257 507800
60146E07800K749L677M206M188L744L346L421L988M739N442O172P103Q118Q833
$$ 507800 510549 514226 518432 522620 526364 529710 533131 537119 541858 547300 553472 560575 568693 577526
60132E77526Q971Q596P864O844N663M548L435J917j25k080l222l498l316k801
$$ 577526 586497 595093 602957 609801 615464 620012 623447 625364 625239 623159 619937 616439 613123 610322
60118F10322j868q06j28J76N98J226J605J632J832K500L056K777J735N68l88j323
$$ 610322 608454 607648 607520 607696 608294 609520 611125 612757 614589 617089 620145 622922 624657 625225 624837 623514
60102F23514k427l582m533n138n379n217m514l181j443J31J051J234Q76K55j47
$$ 623514 621087 617505 612972 607834 602455 597238 592724 589543 588100 588231 589282 590516 591392 591647 591500
60087E91500L02J715L251L937L816L721L982L958L055J601L83l06q80j887l397
$$ 591500 591802 593517 596768 600705 604521 608242 612224 616182 619237 620838 621221 620915 620035 618148 614751
60072F14751m822n431n190m988n679p104q429r205r478r138q006o636o084o574
$$ 614751 609929 604498 599308 594320 588641 581537 573108 563903 554425 545287 537281 530645 524561 517987
60058E17987p100o776n852n024m339l420k307j395q23l97r1j26n92j204j386n76
$$ 517987 510887 504111 498259 493235 488896 485476 483169 481774 480951 480554 480463 480337 479745 478541 477155 476579
60042D76579J254L316M545M645M297M210M358M330M067L834L702L381K495R44
$$ 476579 477833 481149 485694 490339 494636 498846 503204 507534 511601 515435 519137 522518 525013 525957
60028E25957q47k051k169j717j769k741m058n100n878o575o979o892o557o230
$$ 525957 525110 523059 520890 519173 517404 514663 510605 505505 499627 493052 486073 479181 472624 466394
60014D66394n671m592l305k436k152k115k135k335k717k897k518j703j065j147
$$ 466394 460723 456131 452826 450390 448238 446123 443988 441653 438936 436039 433521 431818 430753 429606
60000D29606j791k192j772r05m30n86q37p15k68L90J323K341K900K766K325J997
$$ 429606 427815 425623 423851 422946 422516 421930 421093 420378 420110 420500 421823 424164 427064 429830 432155 434152
59984D34152J761J558J658K215K888L207L007K304J182J1p72j337k270l443l827
$$ 434152 435913 437471 439129 441344 444232 447439 450446 452750 453932 453943 453171 451834 449564 446121 442294
59969D42294k998j996j964k543k521j564l72O01J600K741L628L868L432K491J376
$$ 442294 439296 437300 435336 432793 430272 428708 428336 428937 430537 433278 436906 440774 444206 446697 448073
59954D48073O33N78R30J235J494J810J781R80j70p73o75m48k73K57J104J493J053
$$ 448073 448706 449284 450214 451449 452943 454753 456534 457514 457344 456571 455896 455448 455175 455432 456536 458029 459082
59937D59082M08K19K75J05j13J13O98J044Q66N05M28Q41J661K596L187L141K628
$$ 459082 459490 459709 459984 460089 459976 460089 460787 461831 462697 463202 463630 464471 466132 468728 471915 475056 477684
59920D77684K142J989K038K020J956K185K977M121N046N361N164M753M188L335
$$ 477684 479826 481815 483853 485873 487829 490014 492991 497112 502158 507519 512683 517436 521624 524959
59906E24959K230J150L71MKQ4k35j170k183k328j336n7M28mn43n39j65J53N91
$$ 524959 527189 528339 528710 528714 528716 528800 528565 527395 525212 522884 521548 521491 521919 521915 521372 520833 520668 520821 521412
59887E21412J745L682N532O319N927N115M672M770N096N332N455N638N896N899
$$ 521412 523157 526839 532371 538690 544617 549732 554404 559174 564270 569602 575057 580695 586591 592490
59873E92490N309M299L356K446Q91j602m191n774o317o631p055p072o265m921
$$ 592490 597799 602098 605454 607900 608791 607189 602998 597224 590907 584276 577221 570149 563884 558963
59859E58963l565k485j848j711j701j309n76R0Q13K188M142N762O663P633R326
$$ 558963 555398 552913 551065 549354 547653 546344 545768 545858 546671 548859 553001 558763 565426 573059 582385
59844E82385J1056J1606J0575Q320N181J640j248k499k172j051L22J685K449J892
$$ 582385 593441 605047 615622 623942 629123 630763 629515 627016 624844 623793 624115 625800 628249 630141
59830F30141k0k586n021o757p373o902o070n622n557n436n227n200n243n049m839
$$ 630141 630121 627535 622514 615757 608384 601482 595412 589790 584233 578797 573570 568370 563127 558078 553239
59815E53239n153n805n793m479k413p57k18o37j321j722j931k437l297l865l630
$$ 553239 548086 542281 536488 532009 529596 528839 528621 527984 526663 524941 523010 520573 517276 513411 509781
59800E09781k903k303j949j687j717k271k943l038k492j805j275r35j017j610
$$ 509781 506878 504575 502626 500939 499222 496951 494008 490970 488478 486673 485398 484463 483446 481836
59786D81836k013j319J85J122O97l98j054j015p42o10o17n90l37J46M59J50o63
$$ 481836 479823 478504 478689 479811 480508 480110 479056 478041 477299 476689 476072 475482 475145 475291 475750 475900 475237
59769D75237j325j407j062o17k49j51n32j211j569j166k36N60P71N36N02J210
$$ 475237 473912 472505 471443 470826 470577 470426 469894 468683 467114 465948 465712 466272 467043 467579 468081 469291
59753D69291K433L305L367L158L471M294N024N349N341M980M324L875M048M317
$$ 469291 471724 475029 478396 481554 485025 489319 494343 499692 505033 510013 514337 518212 522260 526577
59739E26577L824K707J946J858J715J106O06O77P75J79q72j592j717j606j550
$$ 526577 530401 533108 535054 536912 538627 539733 540339 541016 541791 541970 541098 539506 537789 536183 534633
59724E34633j518j394j114o42j40K7l57j105j818k144j837r38L5M07J3o86j199
$$ 534633 533115 531721 530607 529965 529825 529852 529495 528390 526572 524428 522591 521653 521688 522095 522108 521422 520223
59707E20223j371j219q21m80n00o72l96N03J542K238K629K933L113L091L008L004
$$ 520223 518852 517633 516812 516332 515832 515160 514764 515267 516809 519047 521676 524609 527722 530813 533821 536825
59691E36825K945K630K068J407P80L24J70L25P13J213J558J354N85j60l84m32
$$ 536825 539770 542400 544468 545875 546655 546979 547149 547474 548187 549400 550958 552312 552897 552737 552353 551921
59675E51921r75j991k831l262l671m219m540m486m484m825n089m700l610k289
$$ 551921 550946 548955 546124 542862 539191 534972 530432 525946 521462 516637 511548 506848 503238 500949
59661E00949j280q96j005j036n58J83O58Q64J199J739K256K799L533M152M272
$$ 500949 499669 498773 497768 496732 496174 496357 497015 497879 499078 500817 503073 505872 509405 513557 517829
59646E17829M286M771N103L962J418p32j298j132j513k325k724k769l114l730
$$ 517829 522115 526886 531989 535951 537369 536637 535339 534207 532694 530369 527645 524876 521762 518032
59632E18032l910l315k164p29N51R15O1j159j603j190p30o69p92r34j141j264
$$ 518032 514122 510807 508643 507914 508465 509380 509441 508282 506679 505489 504759 504090 503298 502364 501223 499959
59616D99959j197j474k807m853o197n888m424k892j671l45J299K741L271K809
$$ 499959 498762 497288 494481 489628 483431 477543 473119 470227 468556 468211 469510 472251 475522 478331
59602D78331J974J393J198J248J488J794J770J218O70P85J320J344N96j69l89
$$ 478331 480305 481698 482896 484144 485632 487426 489196 490414 491084 491869 493189 494533 495129 494960 494571
59587D94571m51q31j281j404j441j771k141k070j687j532j787k226k618k694k076
$$ 494571 494120 493289 492008 490604 489163 487392 485251 483181 481494 479962 478175 475949 473331 470637 468561
59572D68561q39J78K01n06j081j218j249j351j363j298j299j122l37P88J373J055
$$ 468561 467722 467900 468101 467595 466514 465296 464047 462696 461333 460035 458736 457614 457277 458065 459438 460493
59556D60493M99M42P40Q31P57J090J917K519K358J866J842K351K826L180M035
$$ 460493 460992 461434 462174 463005 463762 464852 466769 469288 471646 473512 475354 477705 480531 483711 487746
59541D87746N623P259Q339R273J0775J2977J5825J9407K2585K2191J5646M597
$$ 487746 493369 500628 508967 518240 529015 541992 557817 577224 599809 622000 637646 642243
59529F42243n742j1447j2799j2133j0641q285n366k527J11K597M428N106M894
$$ 642243 636501 625054 612255 600122 589481 581196 575830 573303 573414 576011 580439 585545 590439
59516E90439M267L174J657L86l24j346l447n834p169p520p996q792r035q412p659
$$ 590439 594706 597880 599537 599923 599599 598253 594806 588972 581803 574283 566287 557495 548460 540048 532389
59501E32389p239o743n814m727l815l115k729k729k668j907o23L05M58K15j11
$$ 532389 525150 518407 512593 507866 504051 500936 498207 495478 492810 490903 490280 490585 491043 491258 491147
59486D91147o07j108j071m38J82N24J201K720M510N554N639N535O033P107Q044
$$ 491147 490540 489432 488361 487923 488105 488629 489830 492550 497060 502614 508253 513788 519821 526928 534972
59471E34972Q184P450O233M785L093J346J43j52N4P8j86l49k03K00R58K297M169
$$ 534972 543156 550606 556839 561624 564717 566063 566206 566054 566108 566186 566000 565651 565448 565648 566606 568903 573072
59454E73072O235Q218R958J1232J1915J2169J2226J2089J1719J1192J0395Q843
$$ 573072 579307 587525 597483 608715 620630 632799 645025 657114 668833 680025 690420 699263
59442F99263O246K941o00m302q113j1448j3607j4489j4373j3280j1197q701o796
$$ 699263 705509 708450 707850 703548 695435 683987 670380 655891 641518 628238 617041 608340 601544
59429F01544o076o392p049p040n556k774J29K226L755N441P402R368J1457J4066
$$ 601544 595468 589076 582027 574987 569431 566657 566786 569012 572767 578208 585610 594978 606435 620501
59415F20501J7210K0472K3324K5298K6520K8216L1275L3614L0491J9224K871j2148
$$ 620501 637711 658183 681507 706805 733325 761541 792816 826430 856921 876145 879016 866868
59403H66868k1530k4962k3890j9774j4188q208j403O536J2853J2748M424q422
$$ 866868 845338 820376 796486 776712 762524 754316 752913 759449 772302 785050 789474 781052
59391G81052k0106k7547l0670l0182k6861k2158j7724j4213j1353q853o686m809
$$ 781052 760946 733399 702729 672547 645686 623528 605804 591591 580238 571385 564699 559890
59379E59890l299k425k055j433m0J692K924L347L192K825K621K852L317L530L532
$$ 559890 556591 554166 552111 550678 550638 552330 555254 558601 561793 564618 567239 570091 573408 576938 580470
59364E80470L922M798N388N223M982N497O379O501N591M635M664N745P181Q363
$$ 580470 584392 589190 594578 599801 604783 610280 616659 623160 628751 633386 638050 643795 650976 659339
59350F59339R182R857J0562J1355J2282J3345J4264J4654J4607J4710J5147J5250
$$ 659339 668521 678378 688940 700295 712577 725922 740186 754840 769447 784157 799304 814554
59338H14554J4412J2955J1418R459O385K461j289m413p216r699j1451j2620j3953
$$ 814554 828966 841921 853339 862798 869183 871644 870355 865942 858726 849027 837576 824956 811003
59325H11003j5538j6535j6444j5812j5294j4740j3609j1723r431p485o659o837
$$ 811003 795465 778930 762486 746674 731380 716640 703031 691308 681877 674392 667733 660896
59313F60896o686n161l142k392l016l330k409j187n91o8J158K697L886N102P137
$$ 660896 654210 649049 645907 643515 640499 637169 634760 633573 632982 632914 634072 636769 640655 645757 652894
59298F52894R962J2994J5816J7731J7169J2693M534n315j4293k0434k3052k2907
$$ 652894 662856 675850 691666 709397 726566 739259 743793 738478 724185 703751 680699 657792
59286F57792k1338j8983j5769j2086q964o826n069l273j830r05R0J400K429K973
$$ 657792 636454 617471 601702 589616 580652 573826 568757 565484 563654 562749 562839 564239 566668 569641
59272E69641L881N687P677R170J0658J2628J4301J4686J4052J3197J2010R981
$$ 569641 573522 579209 586886 596056 606714 619342 633643 648329 662381 675578 687588 697569
59260F97569P381M729J771j765n020o975q025r217j0397j0607r948r470r326q614
$$ 697569 704950 709679 711450 709685 704665 697690 689665 680448 670051 659444 649496 640026 630700 622086
59246F22086p118n769n056m321l049j674o17M78J913L205L798L927M232M936N783
$$ 622086 614968 609199 604143 599822 596773 595099 594482 594960 596873 600078 603876 607803 612035 616971 622754
59231F22754O423O525N907M810L773L013K192R14p43k366l645m570n294n825n946
$$ 622754 629177 635702 641609 646419 650192 653205 655397 656311 655568 653202 649557 644987 639693 633868 627922
59216F27922n569n062m895m871m305l115k190k250k871l130k780k280k006j987
$$ 627922 622353 617291 612396 607525 603220 600105 597915 595665 592794 589664 586884 584604 582598 580611
59202E80611k156k394k523k531k529k270j350q5M47j71r85r65l85j99o42j226
$$ 580611 578455 576061 573538 571007 568478 566208 564858 564773 565220 565049 564064 563099 562714 562515 561873 560647
59186E60647j589j561r12J52P67N49L96J159K175K253J647J665K595L443L713
$$ 560647 559058 557497 556585 556737 557504 558053 558449 559608 561783 564036 565683 567348 569943 573386 577099
59171E77099M019M709N190N092N029N625O667P697Q688R671J0300J0268R714Q806
$$ 577099 581118 585827 591017 596109 601138 606763 613430 621127 629815 639486 649786 660054 669768 678574
59157F78574P465N689L775J888j77k522m857o853q373r215r134q432q010q473
$$ 678574 686039 691728 695503 697391 697214 694692 689835 682982 674609 665394 656260 647828 639818 631345
59143F31345r351r655r012q022p521p719q095q031p489o994o977p248p183o266
$$ 631345 621994 612339 603327 595305 587784 580065 571970 563939 556450 549456 542479 535231 528048 521782
59129E21782m538k687j558j277r36L39K134L245L413L684M781O108O919P522Q481
$$ 521782 517244 514557 512999 511722 510786 511125 513259 516504 519917 523601 528382 534490 541409 548931 557412
59114E57412R409R531R022Q791R176R683R840R598R053Q413Q027P878P300N816
$$ 557412 566821 576352 585374 594165 603341 613024 622864 632462 641515 649928 657955 665833 673133 678949
59100F78949L936K540J743J010O9r23j907k870l532l641l407l184k974k757k768
$$ 678949 682885 685425 687168 688178 688247 687324 685417 682547 679015 675374 671967 668783 665809 663052 660284
59085F60284k951k709j900j504k397m018n122n438n633o049o515p061p769q136
$$ 660284 657333 654624 652724 651220 648823 644805 639683 634245 628612 622563 616048 608987 601218 593082
59071E93082p567o403n575n297m993m287l345k404j695j524j781j740j080n11
$$ 593082 585515 579112 573537 568240 563247 558960 555615 553211 551516 549992 548211 546471 545391 544880
59057E44880o22q59o36n77j369k180j819q03n03p41k78O02K50j375k181j085L04
$$ 544880 544258 543399 542763 542186 540817 538637 536818 536015 535512 534771 534493 535095 535345 533970 531789 530704 531008
59040E31008R9j295k165j830q48J73R88J456J618J633J409Q39M73J116K639M119
$$ 531008 531107 529812 527647 525817 524969 525142 526130 527586 529204 530837 532246 533085 533558 534674 537313 541432
59024E41432N252O527P979Q948R377J0013J1019J1668J1791J2107J2540J1680
$$ 541432 546684 553211 561190 570138 579515 589528 600547 612215 624006 636113 648653 660333
59012F60333Q809N229K545P15j183l184m560n050m909m205k936j458n5J481L283
$$ 660333 669142 674371 676916 677631 676448 673264 668704 663654 658745 654540 651604 650146 650091 651572 654855
58997F54855M849N717O157O612O848O350N224M173L697L718L754L336K430J483
$$ 654855 659704 665421 671578 678190 685038 691388 696612 700785 704482 708200 711954 715290 717720 719203
58983G19203P00m64k483m563n318m583l609l288l250k881k086o12K146N960R309
$$ 719203 719903 719439 716956 712393 707075 702492 698883 695595 692345 689464 687378 686766 688912 694872 704181
58968G04181J0896J0967J0662J0698J1201J2079J2944J3261J3005J2689J2489
$$ 704181 715077 726044 736706 747404 758605 770684 783628 796889 809894 822583 835072
58957H35072J1931J0699Q998O933M259J002k509o263j0305j3874j5867j6370j6535
$$ 835072 847003 857702 866700 873633 877892 878894 876385 870122 859817 845943 830076 813706 797171
58944G97171j6825j6662j5972j5459j4957j3220j0101p282n999n497m791m287
$$ 797171 780346 763684 747712 732253 717296 704076 693975 686693 680694 675197 670406 666119
58932F66119m501m618l825k811k496k347j517o17p47j536j770j373j224j485j607
$$ 666119 661618 657000 653175 650364 647868 645521 644004 643387 642640 641104 639334 637961 636737 635252 633645
58917F33645j569j688j628r38k51n26j370j431l70Q97J766K595L709M898O054
$$ 633645 632076 630388 628760 627822 627571 627045 625675 624244 623874 624771 626537 629132 632841 637739 643793
58902F43793P406R012J0675J2258J3535J4021J3692J3396J3764J4116J3456J2139
$$ 643793 651199 660211 670886 683144 696679 710700 724392 737788 751552 765668 779124 791263
58890G91263J1611J2695J5029J7916K0766K2965K4281K5202K6071K6155K4486
$$ 791263 802874 815569 830598 848514 869280 892245 916526 941728 967799 993954 1018440
58879A018440K1277J7563J3729R447M847N33l524q000j2966j7557k0964k3009
$$ 1018440 1039717 1057280 1071009 1080456 1085303 1085836 1082312 1074312 1061346 1043789 1022825 999816
58867I99816k3661k2908k1237j9427j7664j5504j2870j0462r044q758r207r813
$$ 999816 976155 953247 932010 912583 894919 879415 866545 856083 847039 838281 829074 819261
58855H19261j0123j0125j0235j0692j1220j1519j1657j1613j0987r723q562q097
$$ 819261 809138 799013 788778 778086 766866 755347 743690 732077 721090 711367 702805 694708
58843F94708p882p240o428o220o706p383q030q576q529p522o254n799o122o228
$$ 694708 686826 679586 673158 666938 660232 652849 644819 636243 627714 620192 613938 608139 602017 595789
58829E95789n652m896m365l842l145k469j917j252l46O45J580K415L063L579M284
$$ 595789 590137 585241 580876 577034 573889 571420 569503 568251 567905 568550 570130 572545 575608 579187 583471
58814E83471N230N804N438M442L604L207K943K565K007J125p1j157j790k221k817
$$ 583471 588701 594505 599943 604385 607989 611196 614139 616704 618711 619836 619765 618608 616818 614597 611780
58799F11780l414l615l464l282l220l365l856m432m485m018l825m210m303l401
$$ 611780 608366 604751 601287 598005 594785 591420 587564 583132 578647 574629 570804 566594 562291 558890
58785E58890k123j293o06N61J790K339K569L344M457M990M838M587M253L482K599
$$ 558890 556767 555474 554868 555429 557219 559558 562127 565471 569928 574918 579756 584343 588596 592078 594677
58770E94677K088J303p78l632n544n966o022o493o799o417n896n832n796n076
$$ 594677 596765 598068 597290 593658 588114 582148 576126 569633 562834 556417 550521 544689 538893 533817
58756E33817l710k221q94K74J280K112K737L035L053L105L239K890J724N02M25
$$ 533817 530107 527886 526992 527266 528546 530658 533395 536430 539483 542588 545827 548717 550441 550943 551368
58741E51368J752L707N481O637O900O376N797N784O042N985N822O188P032P806
$$ 551368 553120 556827 562308 568945 575845 582221 588018 593802 599844 605829 611651 617839 624871 632677
58727F32677Q431R123R518Q987P720O589N923N325M684M466M994O028P065P724
$$ 632677 641108 650231 659749 668736 676456 683045 688968 694293 698977 703443 708437 714465 721530 729254
58713G29254P996Q432R528J0609J0253Q333O477N708M809K333j068l852o123r037
$$ 729254 737250 745682 755210 765819 776072 784405 790882 796590 801399 803732 802664 798812 792689 783652
58699G83652j2466j5230j7245j9418k1586k2483k1777k0478j9195j7631j5743
$$ 783652 771186 755956 738711 719293 697707 675224 653447 632969 613774 596143 580400
58688E80400j3929j2007r575p344o530o916p119o712o448o409n766m533l727l497
$$ 580400 566471 554464 544889 537545 531015 524099 516980 510268 503820 497411 491645 487112 483385 479888
58674D79888k771j153M44J416K190K992L425L661M498N924P102Q032R592J1702
$$ 479888 477117 475964 476408 477824 480014 483006 486431 490092 494590 500514 507616 515648 525240 536942
58660E36942J3063J3113J2496J1202Q226L706m12k819m303n859p025p100o627
$$ 536942 550005 563118 575614 586816 595042 598748 598336 595517 591214 585355 578330 571230 564603
58647E64603o442o337n754m847m077l531l306l635m147l948k911j880j281o46
$$ 564603 558161 551824 546070 541223 537146 533615 530309 526674 522527 518579 515668 513788 512507 511861
58633E11861J60N89N89Q88J606J923J528J065P37M7o90k07J633L253L641L725
$$ 511861 512021 512610 513199 514087 515693 517616 519144 520209 520946 520993 520303 520096 521729 524982 528623 532348
58617E32348M619O006P186Q292R455R991R530Q752Q189P319N746L995K396L48
$$ 532348 536967 542973 550159 558451 567906 577897 587427 596179 604368 611687 617433 621428 623824 624172
58603F24172k332m511n159m681m003l382k955l317m580n826o286o141n626m394
$$ 624172 621840 617329 612170 607489 603486 600104 597149 593832 589252 583426 577140 570999 565373 560979
58589E60979k531j053n63l72M27J961M070O631Q941J0001R969R965J0117R326
$$ 560979 558448 557395 556832 556460 556887 558848 562918 569549 578490 588491 598460 608425 618542 627868
58575F27868P507O211O275O573O102N597O007O964Q003R716J2404J4987J6578
$$ 627868 635375 641586 647861 654434 660536 666133 672140 679104 687107 696823 709227 724214 740792
58562G40792J7877J9799K1971K3746K5313K6555K6211K3635K0149J7210J4319
$$ 740792 758669 778468 800439 824185 849498 876053 902264 925899 946048 963258 977577
58551I77577J0227N166N09k995n398o806p558q348r271r574r143r028r789j0639
$$ 977577 987804 992970 993479 990484 985086 978280 970722 962374 953103 943529 934386 925358 915569 904930
58537I04930j1195j2513j5237j8092j9616k0012k0030j9308j7241j4411j1745
$$ 904930 893735 881222 865985 847893 828277 808265 788235 768927 751686 737275 725530
58526G25530r220o613m400k790j077R48K196K123J941K696L498L154K157J488
$$ 725530 716310 709697 705297 702507 701430 702378 704574 706697 708638 711334 714832 717986 720143 721631
58512G21631P53p84k426l042k906l004l288l143k792k904l487m193m944n353m691
$$ 721631 722384 721600 719174 716132 713226 710222 706934 703791 700999 698095 694608 690415 685471 680118 675427
58497F75427l288k600l023l179k359j809k298k392q72R61J312O54N84J292K041
$$ 675427 672139 669539 666516 663337 660978 659169 656871 654479 653607 654568 655880 656534 657118 658410 660451
58482F60451K897M101N047N547O800R435J2017J3189J3729J4658J4987J3396J0562
$$ 660451 663348 667449 672496 678043 684843 694278 706295 719484 733213 747871 762858 776254 786816
58469G86816P699M407J45l684n607o582q247r950j0053q870p813o749m738k328
$$ 786816 794515 798922 799067 795383 789776 783194 774947 764997 754944 746074 738261 731512 726774 724446
58455G24446o07J027L599O176P262P620Q945J0609J0409P914M629J435j770m517
$$ 724446 723839 724866 728465 734641 741903 749523 758468 769077 779486 787400 792029 793464 791694 787177
58441G87177o254p665r342j0045q517n997m494l647j914K40J197J327K327M071
$$ 787177 780923 773258 763916 753871 745354 739357 734863 731216 729302 729542 730739 732066 734393 738464
58427G38464M971N059N827P480Q935J0126J1733J3022J2558J0643Q710O806M116
$$ 738464 743435 748494 754321 761801 770736 780862 792595 805617 818175 828818 837528 844334 848450
58414H48450J194q48k585n087p339p637o785o989q227q597p735o940o447n437
$$ 848450 849644 848796 846211 841124 833785 826148 819363 812374 804147 795550 787815 780875 774428 768991
58400G68991m344m261m569l860k571j996j484M08K754L484K908K909L381K841
$$ 768991 764647 760386 755817 751957 749386 747390 745906 746314 749068 752552 755460 758369 761750 764591
58386G64591J789J940K718K165Q60J188L106M369M660N683P288P464O219N654
$$ 764591 766380 768320 771038 773203 774063 775251 778357 782726 787386 793069 800357 807821 814040 819694
58372H19694O020N488M031L742M912N550N193N592P118Q020P776P833Q599R011
$$ 819694 825714 831202 835233 838975 843887 849437 854630 860222 867340 875360 883136 890969 899568 908579
58358I08579R277J0647J2325J2135J0383R458R524Q413N907M181L660K527P48
$$ 908579 917856 928503 940828 952963 963346 972804 982328 990741 996648 1000829 1004489 1007016 1007764
58345A007764N37K116L034K484K479L905N222N842P138R277J0634J1056J2176
$$ 1007764 1008301 1010417 1013451 1015935 1018414 1022319 1027541 1033383 1040521 1049798 1060432 1071488 1083664
58332A083664J3997J4731J4378J4768J5790J5429J3822J3176J3464J2329R624
$$ 1083664 1097661 1112392 1126770 1141538 1157328 1172757 1186579 1199755 1213219 1225548 1235172
58321A235172P728P052N607L384K648L459L476K644L354N619O829O764P824R961
$$ 1235172 1242900 1249952 1255559 1258943 1261591 1265050 1268526 1271170 1274524 1280143 1286972 1293736 1301560 1311521
58307A311521J0562R857J0955J3887J5277J4656J5302J7770J8685J7154J6409
$$ 1311521 1322083 1331940 1342895 1356782 1372059 1386715 1402017 1419787 1438472 1455626 1472035
58296A472035J7559J7784J6310J6075J7784J8418J7462J8367K1794K3765K2744
$$ 1472035 1489594 1507378 1523688 1539763 1557547 1575965 1593427 1611794 1633588 1657353 1680097
58285A680097K2252K4042K5079K3802K3115K4439K5034K3956K4424K7468K9527
$$ 1680097 1702349 1726391 1751470 1775272 1798387 1822826 1847860 1871816 1896240 1923708 1953235
58274A953235K9183K9943L3420L6159L6212L6634L9317M1755M2744M4900M8706
$$ 1953235 1982418 2012361 2045781 2081940 2118152 2154786 2194103 2235858 2278602 2323502 2372208
58263B372208N0700N0390N2048N6824O0215O0202O0497O2754O3448O1565O1358
$$ 2372208 2422908 2473298 2525346 2582170 2642385 2702587 2763084 2825838 2889286 2950851 3012209
58252C012209O4025O4931O2653O2338O6412P0583P2837P7324Q5399R2155R5966
$$ 3012209 3076234 3141165 3203818 3266156 3332568 3403151 3475988 3553312 3638711 3730866 3826832
58241C826832J01899J11405J18825J22488J28588J39288J48200J52920J60291
$$ 3826832 3928731 4040136 4158961 4281449 4410037 4549325 4697525 4850445 5010736
58232E010736J73402J85454J92826K01972K16682K31157K42753K58411K81031
$$ 5010736 5184138 5369592 5562418 5764390 5981072 6212229 6454982 6713393 6994424
58223F994424L03058L21392L44410L76129M08462M37772M73236N19474N67791
$$ 6994424 7297482 7618874 7963284 8339413 8747875 9185647 9658883 10178357 10746148
58214A0746148O14587O70813P42470Q20742R02910J002771J127897J268451J422411
$$ 10746148 11360735 12031548 12774018 13594760 14497670 15500441 16628338 17896789 19319200
58205A9319200J608764J841280K114794K433470K824683L307855L881988M564957
$$ 19319200 20927964 22769244 24884038 27317508 30142191 33450046 37332034 41896991
58197D1896991N410737O466405P754125R322321J1265182J3654413J6498475J9798071
$$ 41896991 47307728 53774133 61528258 70850579 82115761 95770174 112268649 132066720
58189A32066720K3570117K7769775L2253285L6782901M0761030M2707921M0309346
$$ 132066720 155636837 183406612 215659897 252442798 293203828 335911749 376221095
58182C76221095L1737991J7439861N14907j5011808k6491424l3479900l6835019
$$ 376221095 407959086 425398947 425913854 410902046 384410622 350930722 314095703
58175C14095703l7510958l6172620l3404757k9820572k5941257k2123660j8605711
$$ 314095703 276584745 240412125 207007368 177186796 151245539 129121879 110516168
58168A10516168j5529860j2928961j0763429q986360p552138o393429n439391
$$ 110516168 94986308 82057347 71293918 62307558 54755420 48361991 42922600
58161D2922600m649735m002553l464281l000231k600152k266086j986380j743840
$$ 42922600 38272865 34270312 30806031 27805800 25205648 22939562 20953182 19209342
58153A9209342j536293j366817j224983j097502r86190q96715q20384p44808o72353
$$ 19209342 17673049 16306232 15081249 13983747 12997557 12100842 11280458 10535650 9863297
58144I863297o11128n57401n03226m52244m12009l78693l44296l11689k88510
$$ 9863297 9252169 8694768 8191542 7739298 7327289 6948596 6604300 6292611 6004101
58135F004101k73018k58837k46813k39822k32612k18924k02529j90085j79377
$$ 6004101 5731083 5472246 5225433 4985611 4752999 4534075 4331546 4141461 3962084
58126C962084j65393j51343j42585j35803j25194j13613j07012j03239r6741q9273
$$ 3962084 3796691 3645348 3502763 3366960 3241766 3128153 3021141 2917902 2821161 2731888
58116B731888q5767q4291p9942p4296p1650p0164o5800o0817n9522n9657n6648
$$ 2731888 2646121 2561830 2481888 2407592 2335942 2265778 2199978 2139161 2079639 2019982 1963334
58105A963334n2365n1168n1316m8723m5287m5044m5781m2995l8623l7488l8300
$$ 1963334 1910969 1859801 1808485 1759762 1714475 1669431 1623650 1580655 1542032 1504544 1466244
58094A466244l6556l3284l2621l3373l1256k7165k5403k5650k4232k1446k0308
$$ 1466244 1429688 1396404 1363783 1330410 1299154 1271989 1246586 1220936 1196704 1175258 1154950
58083A154950k0010j7638j4668j4761j6833j7020j5841j6706j9017j9380j8160
$$ 1154950 1134940 1117302 1102634 1087873 1071040 1054020 1038179 1021473 1002456 983076 964916
58072I64916j8427j9652j8862j6688j6173j6799j5667j3339j2601j2704j0802
$$ 964916 946489 926837 907975 891287 875114 858315 842648 829309 816708 804004 793202
58061G93202p846p128q057p325n261n155p062q113q275j0011j2680j2969j0717
$$ 793202 785356 778228 770171 762846 757585 752430 745368 737255 728980 718969 706289 693320 682603
58048F82603r057q912q425p534q023r202q400n797m214m308m360m329n642p381
$$ 682603 673546 664634 656209 648675 640652 631450 623050 617253 613039 608731 604371 600042 594400 587019
58034E87019p237n917o079p374p189n858o330q732j0070r497r254j0063r977q379
$$ 587019 579782 573865 567786 560412 553223 547365 541035 532303 522233 512736 503482 493419 483442 475063
58020D75063o984o353n244l834l897n313n891m967l950l255k013p92j131k401
$$ 475063 468079 461726 456482 452648 448751 443438 437547 432580 428630 425375 423362 422570 421439 419038
58006D19038k493j497j386k193k076r68o96j483j683j023q04r52j00J535K470
$$ 419038 416545 415048 413662 411469 409393 408425 407729 406246 404563 403540 402736 401784 401684 403219 405689
57991D05689K840L779M501L407J597J592K992L088J470K44j43j292l076l494k540
$$ 405689 408529 412308 416809 420216 421813 423405 426397 429485 430955 431199 431056 429764 426688 423194 420654
57976D20654k451l711m506m396m841n715n113l150k233k926l166k175j555j778
$$ 420654 418203 414492 409986 405590 400749 395034 389921 386771 384538 381612 378446 376271 374716 372938
57962C72938j274J29M47o77j001M22J683J515J091J106K60j860l382l114k300
$$ 372938 371664 371793 372240 371563 370562 370984 372667 374182 375273 376379 376639 374779 371397 368283 365983
57947C65983k108j879j116o12n38K66J938K956K863L206M728O051O233O374P556
$$ 365983 363875 361996 360880 360268 359730 359996 361934 364890 367753 370959 375687 381738 387971 394345 401901
57932D01901R264J0750J1956J2323J0885Q201O095M917L273Q86q04j408k307l886
$$ 401901 411165 421915 433871 446194 457079 465280 471375 476292 479565 480451 479647 478239 475932 472046
57918D72046m802m768n364p057q150p760p262p509p331o071n112n316n331m047
$$ 472046 467244 462476 457112 450055 441905 434145 426883 419374 412043 405972 400860 395544 390213 386166
57904C86166k528j993j879j508j691l036m452m902m992n399n358m202k864k389
$$ 386166 383638 381645 379766 378258 376567 373531 369079 364177 359185 353786 348428 344226 341362 338973
57890C38973k292j749j089q09l34R85K614L641L937L713K980K038J501J302P28
$$ 338973 336681 334932 333843 333034 332700 333685 336299 339940 343877 347590 350570 352608 354109 355411 356139
57875C56139k22p40o54n97o29k73nq60k359k729j584m18j30n2J44k35j053r91
$$ 356139 355917 355177 354523 353926 353297 353024 353019 352159 349800 347071 345487 345069 344939 344887 345031 344796 343743 342752
57857C42752J86J054R14P27R34N95m32o70M84J506J203M31J69j98j275k203k149
$$ 342752 342938 343992 344906 345633 346567 347162 346730 346060 346544 348050 349253 349684 349853 349655 348380 346177 344028
57840C44028j824k113k588k653k813l667m732n261n163m491l236k102k060k653
$$ 344028 342204 340091 337503 334850 332037 328370 323638 318377 313214 308723 305487 303385 301325 298672
57826B98672k325q14M72Q46J119J541J243M01O23K188L253K913K756L928M935
$$ 298672 296347 295533 296005 296851 297970 299511 300754 301155 301778 303966 307219 310132 312888 316816 321751
57811C21751L999J687n03k442m525o127o613o604o774o612n598m331l272j791
$$ 321751 325750 327437 326934 324492 319967 313840 307227 300623 293849 287237 281639 277308 274036 272245
57797B72245L29J908K115J771J744J568Q36M12R17J589J840K356L318L295J523
$$ 272245 272574 274482 276597 278368 280112 281680 282516 282928 283845 285434 287274 289630 292948 296243 297766
57782B97766l67n67L23P06O04J072K103K897L324L642L536K795K136K134K205
$$ 297766 297399 296832 297155 297861 298465 299537 301640 304537 307861 311503 315039 317834 319970 322104 324309
57767C24309J683R07K05j010l040m895n622n621n703n945o325p128p932p687o625
$$ 324309 325992 326899 327104 326094 323054 318159 312537 306916 301213 295268 288943 281815 273883 266196 259571
57752B59571o459p753q877q606p752o944m979j106L015N540O900Q154Q657P426
$$ 259571 253112 245359 236482 227876 220124 213180 208201 207095 210110 215650 222550 230704 239361 246787
57738B46787N421M262L927L578L394L610L053Q35j649k404j548n71l4J45n58k147
$$ 246787 252208 256470 260397 263975 267369 270979 274032 274867 273218 270814 269266 268695 268661 268806 268248 266101
57722B66101k989j957n50p30j811j912j314j705k914l172k246j659k001k334k276
$$ 266101 263112 261155 260605 259875 258064 256152 254838 253133 250219 247047 244801 243142 241141 238807 236531
57707B36531k396k586k102j284j312k122k321j278J89J178J354N45q60j528p18
$$ 236531 234135 231549 229447 228163 226851 224729 222408 221130 221319 222497 223851 224396 223536 222008 221290
57692B21290K78j72j497j852j002l27l42l34j93n11q67p7J628K677K675L087N006
$$ 221290 221568 221396 219899 218047 217045 216718 216376 216042 215849 215338 214471 214394 216022 218699 221374 224461 229467
57675B29467P838J0685J3531J6668K0217K4601L0320L7008M3803N0683N8000O4253
$$ 229467 237305 247990 261521 278189 298406 323007 353327 390335 434138 484821 542821 607074
57663F07074O5542N7975M0407J5254j2412l6701n3348o1252o1876n7597n0824
$$ 607074 672616 730591 770998 786252 773840 737139 683791 622539 560663 503066 452242
57652D52242m3603l6865l0405k4287j9546j6706j4662j2151r467p519o172m914
$$ 452242 408639 371774 341369 317082 297536 280830 266168 254017 244550 237031 230859 225945
57640B25945m172m387m641l840k560j977j728p10O90J205J003J325K024J629q8
$$ 225945 221773 217386 212745 208905 206345 204368 202640 201930 202620 203825 204828 206153 208177 209806 209718
57625B09718j614j940j604j297j034r28j313j857j833j356j158j249j073p52q33
$$ 209718 208104 206164 204560 203263 202229 201301 199988 198131 196298 194942 193784 192535 191462 190710 189877
57610A89877j059p78l49o50j389j516j013p60q15m53K23L49q2l19m21j121k144
$$ 189877 188818 188040 187691 187041 185652 184136 183123 182363 181548 181095 181318 181667 181585 181266 180845 179724 177580
57593A77580k371j731j330j609j934k030k292k583k314j715j632j995k001j595
$$ 177580 175209 173478 172148 170539 168605 166575 164283 161700 159386 157671 156039 154044 152043 150448
57579A50448j355j113l85J24o18j838j744m10K45m97j260j066n75m24k95k53r51
$$ 150448 149093 147980 147595 147719 147101 145263 143519 143109 143354 142857 141597 140531 139956 139532 139237 138984 138033
57562A38033j964j860o57k23j389k636k581j920j712j477l95J000J718J843J953
$$ 138033 136069 134209 133552 133329 131940 129304 126723 124803 123091 121614 121219 122219 123937 125780 127733
57547A27733J867J173K37k08l4N00J235J910K031J504Q29M35L30M73O97L80r01
$$ 127733 129600 130773 131010 130802 130768 131268 132503 134413 136444 137948 138777 139212 139542 140015 140712 141092 140191
57530A40191k452l159l047l054l484l868m182m797n257m670l316k425k275k088
$$ 140191 137739 134580 131533 128479 124995 121127 116945 112148 106891 102221 98905 96480 94205 92117
57516I2117j737j878k209j516K60J777K546L546N125O144N955N471N410N129M083
$$ 92117 90380 88502 86293 84777 85037 86814 89360 92906 98031 104175 110130 115601 121011 126140 130223
57501A30223K956K477K376K290K414K547J894M31q15j431k123l021l128k176j370
$$ 130223 133179 135656 138032 140322 142736 145283 147177 147608 146793 145362 143239 140218 137090 134914 133544
57486A33544j474j623j005k76k85p46j116j518j914j643o77r4m90j126j386j679
$$ 133544 132070 130447 129442 129166 128881 128135 127019 125501 123587 121944 121267 121173 120683 119557 118171 116492
57470A16492k156k049j176o22r59j247p67k33k48j21O49J200R25P70J512K208
$$ 116492 114336 112287 111111 110489 109530 108283 107516 107283 107035 106914 107563 108763 109688 110458 111970 114178
57454A14178J814J026Q97R23J61p68o44K06M91Q4o2L29O12M38k8p56j628j937
$$ 114178 115992 117018 117915 118838 118999 118231 117587 117793 118284 118368 118306 118635 119247 119685 119657 118901 117273 115336
57436A15336j156J32R48J066P38l7j051j472q27J50N33M19K75q2q08j134l25R50
$$ 115336 114180 114312 115260 116326 117064 117027 115976 114504 113677 113827 114360 114779 115054 114972 114164 113030 112705 113655
57418A13655J381P37q9m15l15o6J40K04K84O40J062J008N49K86J64n74j891k601
$$ 113655 115036 115773 115684 115269 114954 114888 115028 115232 115516 116156 117218 118226 118775 119061 119225 118651 116760 114159
57400A14159k116j320j035q55k57L07L44K38L31K32j56q7O53J089P34O11J506
$$ 114159 112043 110723 109688 108833 108576 108883 109227 109465 109796 110028 109872 109785 110438 111527 112261 112872 114378
57383A14378K461K349J672J515J739J651J488J773J990J295n9j170j677j555o73
$$ 114378 116839 119188 120860 122375 124114 125765 127253 129026 131016 132311 132252 131082 129405 127850 127177
57368A27177M49N25p08j729j398o99q95j326p43L29M98n7l0P01J082Q43O71O68
$$ 127177 127626 128151 127443 125714 124316 123617 122722 121396 120653 120982 121480 121423 121393 122094 123176 124019 124690 125358
57350A25358K87l82o01k38K16N78Q91P50j28j088j306r33n28n2N79Q18M49L06
$$ 125358 125645 125263 124662 124424 124640 125218 126109 126859 126731 125643 124337 123404 122876 122824 123403 124221 124670 124976
57332A24976Q12Q54m61j922j888q31m70j014j282r84r01j088q29k46j59m31j17
$$ 124976 125788 126642 126181 124259 122371 121540 121070 120056 118774 117790 116889 115801 114972 114726 114567 114136 114019
57315A14019P69J201Q27K37l20j013j331m77J088J831J023o85k340l250k828j211
$$ 114019 114788 115989 116816 117053 116733 115720 114389 113912 115000 116831 117854 117169 114829 111579 108751 107540
57299A07540L22P48P13J286J960J524L33j34L58P41P17J025J707J953J861K475
$$ 107540 107862 108610 109323 110609 112569 114093 114426 114292 114650 115391 116108 117133 118840 120793 122654 125129
57283A25129L861M798M751M537M783N152N437N970O623O718O237N904N837N368
$$ 125129 128990 133788 138539 143076 147859 153011 158448 164418 171041 177759 183996 189900 195737 201105
57269B01105M321L250K292J066j73o22l57m57j493k933m133m804m609l502k321
$$ 201105 205426 208676 210968 212034 211861 211239 210882 210425 208932 205999 201866 197062 192453 188951 186630
57254A86630j866j642p82J50p1j093j304l41N52P24Q11J064Q21N9k42J33J97m76
$$ 186630 184764 183122 182340 182490 182419 181326 180022 179681 180233 180957 181768 182832 183653 183712 183470 183603 183800 183324
57236A83324j038r08n07j12N54J108O00p37j269k44J171J667J303P15K14J97J049
$$ 183324 182286 181378 180871 180759 181313 182421 183021 182284 181015 180771 181942 183609 184912 185627 185841 186038 187087
57219A87087K168K339J566J108J370J399Q68P40J327J488O94J27O55J310J029
$$ 187087 189255 191594 193160 194268 195638 197037 197905 198645 199972 201460 202154 202281 202936 204246 205275
57204B05275M53O45J295J575J649K005K192J655J039J365K426L086K847K111J443
$$ 205275 205728 206373 207668 209243 210892 212897 215089 216744 217783 219148 221574 224660 227507 229618 231061
57189B31061J334K207L811N003M894L867K946K658K942L673M653N597O462P447
$$ 231061 232395 234602 238413 243416 248310 252177 255123 257781 260723 264396 269049 274646 281108 288555
57175B88555Q441R107R601J0456J1561J2095J1725J0990J0323R657R196R452J0227
$$ 288555 296996 306103 315704 326160 337721 349816 361541 372531 382854 392511 401707 411159 421386
57162D21386J0629J0498J0690J1590J2494J2951J3490J4487J5468J6147J6983
$$ 421386 432015 442513 453203 464793 477287 490238 503728 518215 533683 549830 566813
57151E66813J8090J8775J8860J9299K0728K2497K3900K5252K6905K8302K8902
$$ 566813 584903 603678 622538 641837 662565 685062 708962 734214 761119 789421 818323
57140H18323K9172K9729L0420L1010L1844L2977L3619L3343L2933L3192L3849
$$ 818323 847495 877224 907644 938654 970498 1003475 1037094 1070437 1103370 1136562 1170411
57129A170411L4519L5650L7400L8628L8264L7074L6784L8054M0371M3308M6721
$$ 1170411 1204930 1240580 1277980 1316608 1354872 1391946 1428730 1466784 1507155 1550463 1597184
57118A597184N0093N2855N5187N7687O0583O4002O8524P4654Q2101R0383R9757
$$ 1597184 1647277 1700132 1755319 1813006 1873589 1937591 2006115 2080769 2162870 2253253 2353010
57107B353010J10887J24050J39433J57692J79545K05305K35770K73179L20363
$$ 2353010 2463897 2587947 2727380 2885072 3064617 3269922 3505692 3778871 4099234
57098D099234L79220M50518N34714O32090P42466Q65496J000791J146582J298123
$$ 4099234 4478454 4928972 5463686 6095776 6838242 7703738 8704529 9851111 11149234
57089A1149234J447803J586466J703799J788276J828986J819274J758591J650559
$$ 11149234 12597037 14183503 15887302 17675578 19504564 21323838 23082429 24732988
57081B4732988J500470J317250J118433R28671P64682O15236M37263J79599j80690
$$ 24732988 26233458 27550708 28669141 29597812 30362494 30977730 31414993 31594592 31413902
57072C1413902o18790j073962j479865j790002j986367k074312k072052k001281
$$ 31413902 30795112 29721150 28241285 26451283 24464916 22390604 20318552 18317271
57064A8317271j882208j732585j567728j399755j237199j085889r49711q30447
$$ 18317271 16435063 14702478 13134750 11734995 10497796 9411907 8462196 7631749
57056G631749p27975o41341n69203n09254m58382m14002l74468l38163l03548
$$ 7631749 6903774 6262433 5693230 5183976 4725594 4311592 3937124 3598961 3295413
57047C295413k70587k40732k14764j91735j70601j51488j34548j18958j04135
$$ 3295413 3024826 2784094 2569330 2377595 2206994 2055506 1920958 1802000 1697865
57038A697865r0769p9567p0024o1487n4218m8234m2246l5069k7218j9682j2011
$$ 1697865 1607096 1527529 1457505 1396018 1341800 1293566 1251320 1216251 1189033 1169351 1157340
57027A157340k964P837K0378L5211N1409O3499O2925M4464J1233k6822n9296q0721
$$ 1157340 1154376 1162213 1182591 1217802 1269211 1332710 1395635 1440099 1451332 1424510 1365214 1284493
57015A284493r1315r3858r0593q2956p2980o3210n4918m7582m0525l4095k8864
$$ 1284493 1193178 1099320 1008727 925771 852791 789581 734663 687081 646556 612461 583597
57004E83597k4803k1815k0027j9010j7777j6192j5263j5417j5656j5138j4286
$$ 583597 558794 536979 516952 497942 480165 463973 448710 433293 417637 402499 388213
56993C88213j3566j2526j1002r833r247p929n043j914r9J025L112O147Q600R459
$$ 388213 374647 362121 351119 341286 332039 324110 319067 317153 317054 318079 321191 327338 335938 345397
56979C45397Q460N047r49p857j3138j5819j6751j6786j5971j4398j2490j0489
$$ 345397 353857 358904 357955 350098 336960 321141 304390 287604 271633 257235 244745 234256
56967B34256q537o980n719l766n40K960N391O982Q972J1741J4672J7437J9841
$$ 234256 225719 218739 213020 209254 208714 211674 217065 224047 233019 244760 259432 276869 296710
56954B96710K0733J8470J2673M528m383j2603j8622k1552k1980k1148j9421j6516
$$ 296710 317443 335913 348586 353114 348731 336128 317506 295954 273974 252826 233405 216889
56942B16889j2911r787p619n772l533o81K760O573J0174J3193J6068J9509K3612
$$ 216889 203978 194191 186572 180800 177267 176586 179346 185919 196093 209286 225354 244863 268475
56929B68475K7734L0610L0124K4091J2413j988j5216k4946l0553l2131l0603k7875
$$ 268475 296209 326819 356943 381034 393447 391459 376243 351297 320744 288613 258010 230135
56917B30135k5370k2885j9791j6487j3598j0825p953o030n928o597o393n402m733
$$ 230135 204765 181880 162089 145602 132004 121179 113226 107196 101268 94671 88278 82876 78143
56904G8143m260l043j430o66o08J07J642K624K435K118K679L984N732Q139J1241
$$ 78143 73883 70840 69410 68744 68136 68243 69885 72509 74944 77062 79741 83725 89457 97596 108837
56889A08837J4530J7558K0124K2044K3580K5662K8399K9723K6938J9616R846K0
$$ 108837 123367 140925 161049 183093 206673 232335 260734 290457 317395 337011 346857 346877
56877C46877q341j4053j6386j5951j4116j1444p787l643j0L020O161R536J2735
$$ 346877 338536 324483 308097 292146 278030 266586 258799 255156 255146 258166 264327 273863 286598
56864B86598J6163K0834K6807L3205L9804M7124N4614N9810N9531N1346L4648
$$ 286598 302761 323595 350402 383607 423411 470535 525149 584959 644490 695836 730484
56853G30484J1850j1682l0504m2340m7936m8461m4615l7678k9476k1070j2735
$$ 730484 742334 730652 700148 657808 609872 561411 516796 479118 449642 428572 415837
56842D15837n018J691Q281J6035K4787L3556M2626N3171O5008P6671Q7249R5655
$$ 415837 410819 412510 420791 436826 461613 495169 537795 590966 655974 732645 819894 915549
56830I15549R7827Q7628O2246K5593j4128m9038p4021q7273r0311q6479p8519
$$ 915549 1013376 1101004 1163250 1188843 1174715 1125677 1051656 964383 874072 787593 709074
56819G09074o7875n5948m4394l3793k3511j3332l928M571J3011K1850L0720L9667
$$ 709074 641199 585251 540857 507064 483553 470221 466293 470864 483875 505725 536445 576112
56807E76112M9359N9417O7534P0499O5246M9530K3802p109l5905n7313p0015p4788
$$ 576112 625471 684888 752422 822921 888167 937697 961499 954390 918485 861172 791157 716369
56795G16369p2881o6381n7939m9074m0013l1364k4163j8062j1511m341J818O362
$$ 716369 643488 577107 519168 470094 430081 398717 374554 356492 344981 340640 342458 348820
56783C48820J0923J6839K3322K9129L3997L7099L5885K8208J4721j799j8279l1825
$$ 348820 359743 376582 399904 429033 463030 500129 536014 564222 578943 577144 558865 527040
56771E27040m0107m2905m2286m0236l7020l2556k7882k3975k0374j6341j2531
$$ 527040 486933 444028 401742 361506 324486 291930 264048 240073 219699 203358 190827
56760A90827j0203r439r182q569p421o031n001m746m749m062k735j824j805k114
$$ 190827 180624 171185 162003 153434 146013 139982 134981 130235 125486 121424 118689 116865 115060 112946
56746A12946k394k876l296k959k199k196k884k795j512m87o18q65k67M55M66L56
$$ 112946 110552 107676 104380 101421 99222 97026 94142 91347 89835 89348 88730 87865 87598 88053 88519 88875
56730H8875P86J166R07O57Q94P42m01j331p19P59J539J504J665K266K652K562
$$ 88875 89661 90827 91734 92391 93285 94027 93626 92295 91576 92335 93874 95378 97043 99309 101961 104523
56714A04523K309K042J772J687J714J364O26K63N85Q48N62L40P27J151R34M02
$$ 104523 106832 108874 110646 112333 114047 115411 116037 116300 116885 117733 118295 118635 119362 120513 121447 121849
56698A21849J22o0m01n70l57k22m71o85n39l37k25P6L43r6j022j369j032j098
$$ 121849 121971 121911 121510 120940 120583 120361 119890 119205 118666 118329 118104 118180 118523 118427 117405 116036 115004 113906
56680A13906j731j623k45J082J352J321J727J844J079L45M42O34J61k89mL91L60
$$ 113906 112175 110552 110307 111389 112741 114062 115789 117633 118712 119057 119499 120133 120294 120005 120001 120392 120752
56663A20752P40K025K963K462J446J133Q91l06j636j662p05p2P3K53J04q60j768
$$ 120752 121492 123517 126480 128942 130388 131521 132412 132106 130470 128808 128103 128031 128104 128357 128461 127601 125833
56646A25833j633j180j661k563k464j419o13k10M80J210J080L66L05J155J958
$$ 125833 124200 123020 121359 118796 116332 114913 114300 114090 114570 115780 116860 117226 117531 118686 120644
56631A20644K056J562O71l12o30l3N10J27n56n45j73k93o11l21K78L31m6j82k11
$$ 120644 122700 124262 124933 124621 123991 123958 124468 124595 124039 123494 123321 123028 122417 122096 122374 122705 122659 122477 122266
56612A22266n43o80m8P01P10N29J105J881J636O31K17O20Q82O24K84j18q90j541
$$ 122266 121723 121043 120995 121696 122406 122935 124040 125921 127557 128188 128405 129025 129907 130531 130815 130697 129807 128266
56594A28266j193J3J113J713K013J937J352P18M30N7p09j147o95j74n16j128q96
$$ 128266 127073 127086 128199 129912 131925 133862 135214 135932 136362 136419 135710 134563 133868 133694 133178 132050 131154
56577A31154K0Q23J550K442K768J918Q40O75Q95N03J22R15K292K731K335K479
$$ 131154 131174 131997 133547 135989 138757 140675 141515 142190 143085 143588 143710 144625 146917 149648 151983 154462
56561A54462L505M687N968P683R028Q891P766O900N982L818Q95r14j071o68k86
$$ 154462 157967 162654 168622 176305 185333 194224 201990 208890 214872 218690 219585 218671 217600 216932 216646
56546B16646L85Q50J0j802k927k763k316k279k323k315k588k866k513j876j877
$$ 216646 217031 217881 217891 216089 213162 210399 208083 205804 203481 201166 198578 195712 193199 191323 189446
56531A89446k400k573k350k244j909p44M68M11n77j110j155j746k628k445j286
$$ 189446 187046 184473 182123 179879 177970 177226 177694 178105 177528 176418 175263 173517 170889 168444 167158
56516A67158p35j230j501r74o19j043j594j793j935j927j195j5O31P10J013J421
$$ 167158 166423 165193 163692 162718 162099 161056 159462 157669 155734 153807 152612 152597 153228 153938 154951 156372
56500A56372R98r8n58M9Q96J516K115K314J425L0n94n89j090j785j141P27J714
$$ 156372 157370 157272 156714 156763 157659 159175 161290 163604 165029 165059 164465 163876 162786 161001 159860 160587 162301
56483A62301Q39m15n78r3j5m47j022j572j726j112k20J66L75J266K395K470J606
$$ 162301 163140 162725 162147 162054 162039 161592 160570 158998 157272 156160 155940 156106 156481 157747 160142 162612 164218
56466A64218J272J876K323K081J797J687J169L92K52O25M19m29q10m93m43p75
$$ 164218 165490 167366 169689 171770 173567 175254 176423 176815 177067 177692 178111 177682 176872 176379 175936 175161
56450A75161m25P82J579J282O25K32r7k94Q3O35M61j59j17N32P20M57P69J563
$$ 175161 174736 175518 177097 178379 179004 179236 179139 178845 178928 179563 180024 179865 179748 180280 181000 181457 182226 183789
56432A83789J630Q05J41q7m36n66K51J092M33r23p22R24J575N91j9O34R51J67
$$ 183789 185419 186224 186365 186278 185842 185276 185527 186619 187052 186129 185407 186331 187906 188497 188478 189112 190063 190230
56414A90230j55P57J247K00j000j044p23r41r74k68K31n9k04K32J99n73n96O89
$$ 190230 190075 190832 192079 192279 191279 190235 189512 188571 187597 187329 187560 187501 187297 187529 187728 187155 186559 187248
56396A87248J504O02n70k92Q07J235R87P96N67J14N2O47J139J228J777L083M054
$$ 187248 188752 189354 188784 188492 189299 190534 191521 192317 192884 192998 193050 193697 194836 196064 197841 200924 204978
56379B04978M093M076M559M787M276L623K943J478m32j167m81k00j178j888j136
$$ 204978 209071 213147 217706 222493 226769 230392 233335 234813 234381 233214 232733 232533 231355 229467 228331
56364B28331L3L60J82j4n97j225n45J293K142J181L19R14J614J076L30N43Q00
$$ 228331 228364 228724 228906 228892 228295 227070 226525 227818 229960 231141 231460 232374 233988 235064 235394 235937 236737
56347B36737Q9n81q9O73M84j35k48j68k25K37J226J384L81n2J041K168K107J919
$$ 236737 236826 236245 236156 236829 237313 237178 236930 236762 236537 236774 238000 239384 239765 239713 240754 242922 245029 246948
56329B46948K569K962K292J966L044M040L442K322K260K705K515K145K179J726
$$ 246948 249517 252479 254771 256737 259781 263821 267263 269585 271845 274550 277065 279210 281389 283115
56315B83115M48O6J609L219K976J855J595J695J033M23R47J615J263R43J958L276
$$ 283115 283563 283629 285238 288457 291433 293288 294883 296578 297611 298034 298981 300596 301859 302802 304760 308036
56299C08036L474L400M286N020M121K748K855L829L823L000K746K895K523K262
$$ 308036 311510 314910 319196 324216 328337 331085 333940 337769 341592 344592 347338 350233 352756 355018
56285C55018L190M557N082N340O385P397P135O381O519P010O789O689P846R131
$$ 355018 358208 362765 367847 373187 379572 386969 394104 400485 407004 414014 420803 427492 435338 444469
56271D44469Q925Q205R004J1014J2373J2826J3514J4672J5915J7771K0520K2782
$$ 444469 453394 461599 470603 481617 493990 506816 520330 535002 550917 568688 589208 611990
56259F11990K3557K4308K6670K9756L2229L5359M1117M8753N6155O3234P1046
$$ 611990 635547 659855 686525 716281 748510 783869 824986 873739 929894 993128 1064174
56248A064174P9022Q6073R3127J01492J09928J16367J21296J26324J30685J32211
$$ 1064174 1143196 1229269 1322396 1423888 1533816 1650183 1771479 1897803 2028488 2160699
56238B160699J30625J26725J19508J07383R1176P2851N2371K9086M981j6976l6724
$$ 2160699 2291324 2418049 2537557 2644940 2736116 2808967 2861338 2890424 2895405 2878429 2841705
56227B841705n5896p3684q7624r7676j05876j12415j15642j15693j14542j12647
$$ 2841705 2785809 2712125 2624501 2526825 2420949 2308534 2192892 2077199 1962657 1850010
56217A850010j08776j03071r7132r1315q4860p8403p3287o8681o2538n5191m9077
$$ 1850010 1741234 1638163 1541031 1449716 1364856 1286453 1213166 1144485 1081947 1026756 977679
56206I77679m4988m1524l8029l5254l3134l0618k7650k4999k2431j9294j6306
$$ 977679 932691 891167 853138 817884 784750 754132 726482 701483 679052 659758 643452
56195F43452j4539j3374j1739j0239r724r089p124n165m949n326m226k388j843
$$ 643452 628913 615539 603800 593561 583837 574748 567624 562459 557510 552184 547958 545570 543727
56182E43727k102j388l55q33k042j784m60j27n87j65O64K82m11O10K325K078L99
$$ 543727 541625 540237 539882 539049 537007 535223 534763 534636 534049 533884 534548 534830 534419 535029 537354 539432 539831
56165E39831K50J966L151L249L993N550O288O260P039Q209P874O505O545Q341
$$ 539831 540081 542047 545198 548447 552440 557990 564278 570538 577577 585786 593660 600165 606710 615051
56151F15051J0050J1228J2948J4859J5786J6643J9148K2494K5081K8423L5165
$$ 615051 625101 636329 649277 664136 679922 696565 715713 738207 763288 791711 826876
56140H26876M4220N2376N9759O9004P9757Q8799R5028R9474J00858R6263Q6138
$$ 826876 871096 923472 983231 1052235 1131992 1220791 1315819 1415293 1516151 1612414 1698552
56129A698552P4036O1749M9399L9533L5609L6361L6632L3778K8533K0375P898
$$ 1698552 1772588 1834337 1883736 1923269 1958878 1995239 2031871 2065649 2094182 2114557 2122455
56118B122455o240j6544k1496k4217k6658k8711l2822m3028n8407p3112q3710
$$ 2122455 2116215 2099671 2078175 2053958 2027300 1998589 1965767 1922739 1864332 1791220 1707510
56107A707510r1145r5146r2906q4585p4435o5056n5548m6044l8672l3117k6710
$$ 1707510 1616365 1521219 1428313 1343728 1269293 1204237 1148689 1102645 1063973 1030856 1004146
56096A004146j9727j5303j3490j0964p139m783m028j877J601K886J720J884M237
$$ 1004146 984419 969116 955626 944662 937523 932740 928712 926835 928436 931322 933042 934926 939163
56083I39163N395M479M717O978Q183P519P800R319Q958O823O925R699J0827R261
$$ 939163 944558 949037 953754 960732 968915 976434 984234 993553 1002511 1009334 1016259 1025958 1036785 1046046
56069A046046R226J2171J3994J2690J1759J3325J4662J4261J4672J6738J7579
$$ 1046046 1055272 1067443 1081437 1094127 1105886 1119211 1133873 1148134 1162806 1179544 1197123
56058A197123J6708J7517K0342K0971J8357J6779J7951J8182J5960J4879J6380
$$ 1197123 1213831 1231348 1251690 1272661 1291018 1307797 1325748 1343930 1359890 1374769 1391149
56047A391149J7006J5669J6072J9078K0332J8427J7707J9997K1447K0581K1330
$$ 1391149 1408155 1423824 1439896 1458974 1479306 1497733 1515440 1535437 1556884 1577465 1598795
56036A598795K4917K7006K6204K7045L1035L3430L2399L2607L6022L8153L7259
$$ 1598795 1623712 1650718 1676922 1703967 1735002 1768432 1800831 1833438 1869460 1907613 1944872
56025A944872L8040M2138M4329M2505M1909M5087M7259M6197M6776N1053N3923
$$ 1944872 1982912 2025050 2069379 2111884 2153793 2198880 2246139 2292336 2339112 2390165 2444088
56014B444088N3411N4947O0473O4094O3650O5479P2241P7529P8351Q1084Q8897
$$ 2444088 2497499 2552446 2612919 2677013 2740663 2806142 2878383 2955912 3034263 3115347 3204244
56003C204244R5427R7504J01670J11183J19201J22066J26462J35997J44035J47461
$$ 3204244 3299671 3397175 3498845 3610028 3729229 3851295 3977757 4113754 4257789 4405250
55993D405250J53620J65649J75446J79579J86948K01799K15151K22627K34103
$$ 4405250 4558870 4724519 4899965 5079544 5266492 5468291 5683442 5906069 6140172
55984F140172K55300K77096K94124L15969L47945L79657M05425M36668M80440
$$ 6140172 6395472 6672568 6966692 7282661 7630606 8010263 8415688 8852356 9332796
55975I332796N26054N67560O17921O85279P57893Q29630R16447J029365J156681
$$ 9332796 9858850 10426410 11044331 11729610 12487503 13317133 14233580 15262945 16419626
55966A6419626J292982J458781J670007J917721K202097K554939L002624L541984
$$ 16419626 17712608 19171389 20841396 22759117 24961214 27516153 30518777 34060761
55958C4060761M182424M973844N961210P157133Q598837J0381559J2586497J5225683
$$ 34060761 38243185 43217029 49178239 56335372 64934209 75315768 87902265 103127948
55950A03127948J8301825K1845906K5827073L0099285L4453576L8441035M0827679
$$ 103127948 121429773 143275679 169102752 199202037 233655613 272096648 312924327
55943C12924327L9414810L2097601J8674913J648066j4999302k7972531l5908564
$$ 312924327 352339137 384436738 403111651 404759717 389760415 361787884 325879320
55936C25879320l9101054l8617264l5712837l1575449k7120408k2875520j9074700
$$ 325879320 286778266 248161002 212448165 180872716 153752308 130876788 111802088
55929A11802088j5819492j3128482j0932708r134190p670831o497710n547063
$$ 111802088 95982596 82854114 71921406 62787216 55116385 48618675 43071612
55922D3071612m752927m088683l543590l086819k686414k339284k051158j806875
$$ 43071612 38318685 34230002 30686412 27599593 24913179 22573895 20522737 18715862
55914A8715862j587207j395004j238477j106313r83185q73256p85679p12187o40434
$$ 18715862 17128655 15733651 14495174 13388861 12405676 11532420 10746741 10034554 9394120
55905I394120n75134n25537m85053m42649m02410l73306l50684l25203k99698
$$ 9394120 8818986 8293449 7808396 7365747 6963337 6590031 6239347 5914144 5614446
55896E614446k80905k64316k42860k21222k06665j94558j77240j58577j45959
$$ 5614446 5333541 5069225 4826365 4605143 4398478 4203920 4026680 3868103 3722144
55887C722144j36034j21919j06751r6990q9311p6804o1636m9833m0064k9055k1556
$$ 3722144 3586110 3464191 3357440 3260450 3171139 3094335 3032699 2982866 2942802 2913747 2892191
55876B892191k3475l0831l6456m2082n3241o7569p8629q6537r4847j01522j02410
$$ 2892191 2868716 2837885 2801429 2759347 2706106 2638537 2559908 2473371 2378524 2277002 2174592
55865B174592r9489r6884r2985q4742p5284o9156o4518n7882n1754m9801m9202
$$ 2174592 2075103 1978219 1885234 1800492 1725208 1656052 1591534 1533652 1481898 1432097 1382895
55854A382895m5580m0943l9053l7683l3227k8372k7371k8081k6373k4136k5137
$$ 1382895 1337315 1296372 1257319 1219636 1186409 1158037 1130666 1102585 1076212 1052076 1026939
55843A026939k7206k6132k3504k3077k3292k0865j7931j8129j9198j7008j3484
$$ 1026939 999733 973601 950097 927020 903728 882863 864932 846803 827605 810597 797113
55832G97113j3074j4634j4153j2391j2562j3338j1467q528q053q629o853m460
$$ 797113 784039 769405 755252 742861 730299 716961 705494 696966 688913 680284 673431 668971
55820F68971n490q826j0484j0877j2958j5417j4744j2021j0855j0496p798m239
$$ 668971 663481 654655 644171 633294 620336 604919 590175 578154 567299 556803 549005 544766
55808E44766l985o283o530l916j721q85O37K854L826M061N518P184O663N012M929
$$ 544766 540781 534498 527968 524052 522331 521446 522083 524937 528763 532824 538342 545526 552189 557201 562130
55793E62130N486L860Q00q40j586l951o992p714o653o673p383o263m305m955q125
$$ 562130 567616 571476 572276 571436 569850 565899 558907 551193 544540 537867 530484 524221 519916 514961 506836
55778E06836j0553j1506j2896j4285j3037r113n001j224L586Q789J2280J3971
$$ 506836 496283 484777 471881 457596 444559 435446 430445 429221 432807 441596 453876 467847
55766D67847J4437J1468L010p557j4375j6559j7668j8729j7432j3879j1344j0900
$$ 467847 482284 493752 496762 489205 474830 458271 440603 421874 404442 390563 379219 368319
55754C68319j0318q744p724p361o053m308m279n350m730k662k279l978m598k945
$$ 368319 358001 349257 341533 334172 328119 323811 319532 314182 309452 306790 304511 300533 295935 292990
55740B92990j557k006k604j967j041o57l96o76k628n298o184n007l855l558l120
$$ 292990 291433 289427 286823 284856 283815 283158 282762 282086 279458 274160 267976 262969 259114 255556 252436
55725B52436k683l521m980m993l753l481m360m296k790j519q69N09K430L083K531
$$ 252436 249753 246232 241252 236259 232506 229025 224665 220369 217579 216060 215191 215700 218130 221213 223744
55710B23744K908M670N962N943N499M552K157o57j595r21j186k994m545n414o946
$$ 223744 226652 231322 237284 243227 248726 253278 255435 254778 253183 252262 251076 248082 243537 238123 231177
55695B31177q686q353n998m404m625m723l678k918l124k997k094j647j700p49
$$ 231177 222491 214138 208140 203736 199111 194388 190710 187792 184668 181671 179577 177930 176230 175481
55681A75481J107J959J635K045L374L498J961Q96J028M32j550k828k289j624j966
$$ 175481 176588 178547 180182 182227 185601 189099 191060 191956 192984 193416 191866 189038 186749 185125 183159
55666A83159k089j390j346k427k708j248J33J38R0J096J922J517J010J507K253
$$ 183159 181070 179680 178334 175907 173199 171951 172084 172222 172312 173408 175330 176847 177857 179364 181617
55651A81617K550L103M033M055K949K403K976K882J225k72l21k48j359k694l161
$$ 181617 184167 187270 191303 195358 198307 200710 203686 206568 207793 207521 207200 206952 205593 202899 199738
55636A99738l587m753n667n582n628o592p205o392n242m936m642l346j850j210
$$ 199738 196151 191398 185731 180149 174521 167929 160724 154332 149090 144154 139512 136166 134316 133106
55622A33106q54q8K45o50j744j709q34NQ33J588J247n83k526l273l150k842k114
$$ 133106 132252 132164 132409 131759 130015 128306 127472 127477 128310 129898 131145 130562 128036 124763 121613 118771 116657
55605A16657j011n71j063j156j92M99q1o80R5J375J503N84j25l44o46j058j162
$$ 116657 115646 115075 114012 112856 112664 113163 113082 112402 112497 113872 115375 115959 115834 115490 114844 113786 112624
55588A12624r00l89L57Q31K79q68j116n5J015J206J143J332J194N96N71J541K525
$$ 112624 111724 111335 111692 112523 112802 111934 110818 110763 111778 112984 114127 115459 116653 117249 117820 119361 121886
55571A21886K986L683M817N224M450L672L501K829J103l51o31q76k001k875k395
$$ 121886 124872 128555 133372 138596 143046 146718 150219 153048 154151 153800 153169 152293 150292 147417 145022
55556A45022j581j742k328k380k550l611m580m229l231k873k787j955q51o64j229
$$ 145022 143441 141699 139371 136991 134441 130830 126250 122021 118790 115917 113130 111175 110324 109660 108431
55541A08431j494j277j004n35K70P15L88J89Q65J515J013p6n81o98j364k437l056
$$ 108431 106937 105660 104656 104121 104391 105106 105494 105683 106548 108063 109076 109000 108419 107721 106357 103920 100864
55524A00864l112k971k499j641j233j977l267m181m760n279n290m668m554n828
$$ 100864 97752 94781 92282 90641 89408 87431 84164 79983 75223 69944 64654 59986 55432 49604
55510D9604p500p937o816m763k058R94L412M640N440O523P229O749N603M619L572
$$ 49604 42104 34167 27351 22588 20530 21524 24936 29576 35016 41539 48768 55517 61120 65739 69311
55495F9311K219J438J821K228J436K41J57R62J288R37P89R89R46P09P55Q07K98
$$ 69311 71530 72968 74789 77017 78453 78694 78851 79813 81101 82038 82827 83816 84762 85471 86226 87033 87331
55478H7331l84m37l9O0j34j58j90o14j067j007o72m21O3Q89J157L30m81l9J122
$$ 87331 86947 86510 86471 86531 86397 86239 86049 85435 84368 83361 82689 82268 82331 83220 84377 84707 84226 84187 85309
55459H5309J642J363R33K93q73j850j766j092q00o56J07J068J192N79J22q3m48
$$ 85309 86951 88314 89247 89540 88667 86817 85051 83959 83159 82503 82610 83678 84870 85449 85571 85488 85040
55442H5040o77m06l51j215k081j636l96J79J42O65J580J561N57q4nk35r66r60
$$ 85040 84363 83957 83606 82391 80310 78674 78278 78457 78599 79264 80844 82405 82962 82878 82873 82638 81672 80712
55424H0712K34J324J330J012J444K372K853K622K129J781J644J500J057L88JP3
$$ 80712 80946 82270 83600 84612 86056 88428 91281 93903 96032 97813 99457 100957 102014 102402 102403 102476
55408A02476j0o85j422j632j718k251k718k304j407j114j531j842j697j313n94
$$ 102476 102466 101781 100359 98727 97009 94758 92040 89736 88329 87215 85684 83842 82145 80832 80238
55393H0238N46J335J004K09K77J198J811J701J497J396R34K23K2M00N80K41j79
$$ 80238 80784 82119 83123 83332 83609 84807 86618 88319 89816 91212 92146 92369 92391 92791 93371 93612 93433
55376I3433n73j281j973j708l89Q77J132M94l43p40l31O02J071N25k37j99K42
$$ 93433 92860 91579 89606 87898 87509 88386 89518 90012 89669 88929 88598 89200 90271 90796 90559 90360 90602
55359I0602j19j433k657l074k758j888p19Oj82n46j51N97O99L02L05N78K91l41
$$ 90602 90483 89050 86393 83319 80561 78673 77954 77960 77778 77232 77081 77678 78377 78679 78984 79562 79853 79512
55341G9512l71J1k58j006q82K76R94M50n03r96j121q67K01J604J970J072L48P01
$$ 79512 79141 79152 78894 77888 77006 77282 78276 78726 78223 77227 76106 75239 75440 77044 79014 80086 80434 81135
55323H1135J255J038M84L22L06ml11l32m24p20o44n4J70m67j072o75L38R91J086
$$ 81135 82390 83428 83912 84234 84540 84536 84225 83893 83469 82749 82105 82051 82221 81754 80682 80007 80345 81336 82422
55304H2422R53O02M2k72j33j35p10j223q45J14O80N39J84mm8L2K55M27L00l7k67
$$ 82422 83375 83977 84019 83747 83614 83479 82769 81546 80701 80815 81495 82034 82218 82214 82166 82198 82453 82880 83180 83143 82876
55283H2876k34k4J88K47J79K38N67Q73Q14N76N88Q10Q23N76M07L59J90l7j6J28
$$ 82876 82642 82618 82806 83053 83232 83470 84037 84910 85724 86300 86888 87698 88521 89097 89504 89863 90053 90016 90000 90128
55263I0128j3l29k74J63L79P6l82o06m87N8R06J337O95n59j329j361j297j307
$$ 90128 90115 89786 89512 89675 90054 90130 89748 89142 88655 88713 89619 90956 91651 91092 89763 88402 87105 85798
55245H5798p90L62J321J517J332J222R85L18o14j458j908j590m81N37M64m05q08
$$ 85798 85008 85370 86691 88208 89540 90762 91747 92065 91451 89993 88085 86495 86014 86551 87015 86610 85802
55228H5802l46J01m3k91k36k45m74l45L66R24P85N16P89J290J309P61k4r01j661
$$ 85802 85456 85557 85514 85223 84987 84742 84268 83923 84289 85213 85998 86514 87303 88593 89902 90663 90639 89738 88077
55209H8077j787r98K65J283J607J110J06n48k47L98K77m61n08N05J357J139N40
$$ 88077 86290 85292 85557 86840 88447 89557 89663 89115 88868 89266 89543 89082 88574 89079 90436 91575 92115
55192I2115M89O70L42k76m91l09j94k23k54l96o01l48M86J079O74l06r06q88o26
$$ 92115 92604 93274 93616 93340 92849 92540 92346 92123 91869 91473 90872 90524 91010 92089 92763 92457 91551 90663 90037
55173I0037k79J75M32J59m21p96p92n53j89J38K35L06Q15J573J657P25k76l71
$$ 90037 89758 89933 90365 90524 90103 89307 88515 87962 87773 87911 88146 88452 89267 90840 92497 93222 92946 92575
55155I2575J18K91R7J32M39M61O1k62k45k86q05j558j836j184R4J130J355J070
$$ 92575 92693 92984 93081 93213 93652 94113 94174 93912 93667 93381 92576 91018 89182 87998 88092 89222 90577 91647
55137I1647R15R03N25k46p03l72K92N35J68m12p16n47j68r1l54k61N88J385J111
$$ 91647 92562 93465 93990 93744 93041 92669 92961 93496 93664 93252 92536 91989 91821 91730 91376 91115 91703 93088 94199
55118I4199J31l50k17m84j347j677q91Q8L72K59K28J3m49l73N66J360J148N87
$$ 94199 94330 93980 93763 93279 91932 90255 89364 89452 89824 90083 90311 90324 89875 89502 90068 91428 92576 93163
55100I3163O44R20N02k66k50O91J623J958J871J499P56j18n94m94j1O54J227J240
$$ 93163 93807 94727 95229 94963 94713 95404 97027 98985 100856 102355 103111 102993 102399 101905 101894 102548 103775 105015
55082A05015N79k13o28p71q30n48J45O12L18l33o24m82k16J60O60R12O98L39J6
$$ 105015 105594 105381 104753 103982 103152 102604 102749 103361 103679 103346 102722 102240 102024 102184 102844 103756 104454 104793 104809
55063A04809n72j297j248j71O75J75r42j275q83p96j056p61J46P01N65M24O15
$$ 104809 104237 102940 101692 101521 102196 102371 101429 100154 99271 98475 97419 96658 96804 97505 98070 98494 99109
55046I9109O25J81k33k81k17j95K5M05M29q3o57q29o11j62L79P23O41M17M71O13
$$ 99109 99734 99915 99682 99401 99184 98989 99014 99419 99848 99765 99108 98279 97668 97506 97885 98608 99249 99666 100137 100750
55026A00750K74n12j052r77n46L4Q46J657J819J115J59l48l48j76m0k2k91r53
$$ 100750 101024 100512 99460 98483 97937 97971 98817 100474 102293 103408 103567 103219 102871 102695 102655 102633 102342 101389
55008A01389j750k106j548j99J157J724J451R07M70M2l18j52O52J482J760J592
$$ 101389 99639 97533 95985 95786 96943 98667 100118 101025 101495 101537 101219 101067 101719 103201 104961 106553
54992A06553J253O93N4l9N98J113P36p2m12l66o07j047r60l09J72K04K95P81J320
$$ 106553 107806 108499 108553 108514 109112 110225 110961 110889 110477 110111 109504 108457 107497 107188 107360 107564 107859 108640 109960
54973A09960J471J182O12L1k11p3l9m32p51l36O23J399J720J725J338N36j5L50
$$ 109960 111431 112613 113225 113256 113045 112972 112933 112501 111750 111414 112037 113436 115156 116881 118219 118755 118740 119090
54955A19090J141J165J19j166j946k147j829j036k85k08o70r27p51n35l90l6L80
$$ 119090 120231 121396 121515 120349 118403 116256 114427 113391 113106 112898 112228 111301 110550 110015 109625 109589 109969
54938A09969L67K2m6J06k10r66j184m21N66J062J312J662J834J724K040L235M468
$$ 109969 110336 110358 110312 110418 110208 109242 108058 107637 108203 109265 110577 112239 114073 115797 117837 121072 125540
54921A25540M540L561K851L347M696N895O317O089N751N546N068L681J347j275
$$ 125540 130080 133641 136492 139839 144535 150430 156747 162836 168587 174133 179201 182882 184229 182954
54907A82954l518n134o090o376o150n720n223m650m144l856l547k865k038j737
$$ 182954 179436 174302 168212 161836 155686 149966 144743 140093 135949 132093 128546 125681 123643 121906
54893A21906k084k358j875p56L54R22P65J21l23P6J195K276K873L220L614L915
$$ 121906 119822 117464 115589 114833 115187 116109 116874 116995 116672 116748 117943 120219 123092 126312 129926 133841
54877A33841L904L704L591L720M189N026N950O482O412N803M517K219r00l828
$$ 133841 137745 141449 145040 148760 152949 157975 163925 170407 176819 182622 187139 189358 188458 184630
54863A84630n579o089o067o143o314o144n366m266l412k952k527k007j898k535
$$ 184630 179051 172962 166895 160752 154438 148294 142928 138662 135250 132298 129771 127764 125866 123331
54849A23331l232k932j647n59o33j626k536k534j447J90J357J345M93j86k13o4
$$ 123331 120099 117167 115520 114961 114328 112702 110166 107632 106185 106375 107732 109077 109570 109384 109171 109107
54833A09107l11p83q42k40N58R07P28N76Q76J237R89K69j37r5l42j074j310m45
$$ 109107 108796 108013 107171 106931 107489 108396 109124 109700 110576 111813 112802 113071 112934 112839 112497 111423 110113 109668
54815A09668M83J84r17j344p04J09N45Q87J224J192Q31N65K69n26j417j323j23
$$ 109668 110151 110335 109418 108074 107370 107479 108024 108911 110135 111327 112158 112723 112992 112466 111049 109726 109603
54798A09603J012J228Q25L65m7k31J64Q27R28M36K91Q29J150O46M0J60N95M69
$$ 109603 110615 111843 112668 113033 112986 112755 112919 113746 114674 115110 115401 116230 117380 118026 118066 118226 118821 119290
54780A19290k11q12j072j086p13J94J390K497L379L852L629K916K517K900L703
$$ 119290 119079 118267 117195 116109 115396 115590 116980 119477 122856 126708 130337 133253 135770 138670 142373
54765A42373M468N259O118O588O416O048N898N631M728L264J578l14k446m452
$$ 142373 146841 152100 158218 164806 171222 177270 183168 188799 193527 196791 198369 198055 195609 191157
54751A91157n896o710o906o349n239m232l716l406l019k753k638k167j145k76
$$ 191157 185261 178551 171645 165296 160057 155825 152109 148703 145684 142931 140293 138126 136981 136705
54737A36705k30o90r49r80j144j331j119n38k4K09K31J81M33J541L405M938N205
$$ 136705 136475 135785 134836 133856 132712 131381 130262 129724 129700 129909 130140 130321 130754 132295 135700 140638 145843
54720A45843M616M370M907N600N764N349M623L680K338L45k235m710o133o218
$$ 145843 150459 154829 159736 165336 171100 176449 181072 184752 187090 187435 185200 180490 174357 168139
54706A68139n557m850m288l872l728l772l635l258l051l052k614j391q9L96J14
$$ 168139 162582 157732 153444 149572 145844 142072 138437 135179 132128 129076 126462 125071 124982 125378 125492
54691A25492k41l46l51l64m40p96j438j833j472n29L65Q06O74Nq03j084o52j13
$$ 125492 125251 124905 124554 124190 123750 122954 121516 119683 118211 117682 118047 118853 119527 119532 118729 117645 116993 116880
54673A16880J1j7K27N20M10Kk76l21k40J9L79L97j24o56o98m96m42k27N60J400
$$ 116880 116891 116874 117101 117621 118031 118033 117757 117436 117196 117215 117594 117991 117867 117211 116513 116017 115575 115348 115908 117308
54653A17308J323L28n76o91l27q5j25k88m80o40o09j97N16R80N51o14j315n95
$$ 117308 118631 118959 118383 117692 117365 117280 117155 116867 116387 115747 115138 114941 115457 116437 116988 116374 115059 114464
54635A14464Q32J355O46m4P4K54k30p60n70j07r2j60L34R10O63j06k70M20J216
$$ 114464 115296 116651 117297 117253 117327 117581 117351 116591 116021 115914 115822 115662 115996 116906 117569 117463 117193 117613 118829
54616A18829J584J492Q20l94j334j213m49j3O9M52R97R09J78m26p20j193j637
$$ 118829 120413 121905 122725 122331 120997 119784 119335 119322 119391 119843 120840 121749 121927 121501 120781 119588 117951
54599A17951j169K02J194R62P3n31o09k78L77R78R79N19L63P15R27N79L0m30r96
$$ 117951 116782 116984 118178 119140 119213 118682 118073 117795 118172 119150 120129 120648 121011 121726 122653 123232 123262 122832 121836
54580A21836j548j388l20P96J165R94Q23O47K86mQ6L72N48O65P98P23L47L7M8
$$ 121836 120288 118900 118580 119376 120541 121535 122358 123005 123291 123287 123373 123745 124293 124958 125756 126479 126826 126863 126911
54561A26911M0l14o60m63J50N66N42L46J92k7l89o99p12m41j60r3j35L0N29J114
$$ 126911 126951 126637 125977 125514 125664 126230 126772 127118 127310 127283 126894 126195 125483 125042 124882 124789 124654 124684 125213 126327
54541A26327J495J630J516J030K79k10n9L92N57L98L10M11M95N22N71M48k7n19
$$ 126327 127822 129452 130968 131998 132277 132067 132008 132400 132957 133355 133665 134076 134571 135093 135664 136112 136085 135566
54523A35566n63l38l38l63K52J365J824R04p67k007k302j873j056m9Q80J272O90
$$ 135566 135003 134665 134327 133964 134216 135581 137405 138309 137542 135535 133233 131360 130304 130255 131135 132407 133097
54506A33097p69k146k243r43N23J014O66J49n12j459j959j158M29J451J561J490
$$ 133097 132328 130182 127939 126996 127519 128533 129199 129348 128836 127377 125418 124260 124689 126140 127701 129191
54490A29191J387O34n51r09m9Q10O61P9ML20M26L06J70j54o06n13M78J657K216
$$ 129191 130578 131212 130661 129752 129703 130513 131174 131253 131257 131577 132003 132309 132479 132325 131719 131206 131684 133341 135557
54471A35557K208J929J173Rn40L16J824K599K385J916J461P12j48m46j33R8n5
$$ 135557 137765 139694 140867 140876 140336 140652 142476 145075 147460 149376 150837 151549 151401 150955 150822 150920 150865
54454A50865p2M21R64Q55j7j182k070k377k164j705j145m43K13K82m67j420j724
$$ 150865 150793 151214 152178 153033 153016 151834 149764 147387 145223 143518 142373 141930 142143 142425 141958 140538 138814
54437A38814j244n94k88k98l83m11l47k00j4J65L40M52L86J74J6L2J49L10N23
$$ 138814 137570 136976 136688 136390 136007 135596 135249 135049 135035 135200 135540 135992 136378 136552 136568 136600 136749 137059 137582
54418A37582P47R60J317J788J804Q40n61j122m25N23O49Q1l64k32M19J310J751
$$ 137582 138329 139289 140606 142394 144198 145038 144477 143355 142930 143453 144102 144183 143819 143587 144006 145316 147067
54401A47067R56p76j786q77J067K130J673O26j42o05p92l91N49J378J704J757
$$ 147067 148023 147247 145461 144584 145651 147781 149454 150080 149938 149333 148541 148150 148699 150077 151781 153538
54385A53538J624Q49o77k025k143j191l67m17q77q87k98L33N88O23P14Q40Q85
$$ 153538 155162 156011 155334 153309 151166 149975 149608 149191 148314 147427 147129 147462 148050 148673 149387 150227 151112
54368A51112R78J232J398J150O47L14J41k23p02p08p3N70O71N26P48J417K156
$$ 151112 152090 153322 154720 155870 156517 156831 156972 156749 156047 155339 155266 155836 156507 157033 157781 159198 161354
54351A61354K728L062L001K500J918J667J659J437Q00n4q47j428j720j736j656
$$ 161354 164082 167144 170145 172645 174563 176230 177889 179326 180126 180072 179225 177797 176077 174341 172685
54336A72685j733k094k628l006k826k028j082n72o03q88j241j567j560r80k37
$$ 172685 170952 168858 166230 163224 160398 158370 157288 156716 156113 155225 153984 152417 150857 149877 149640
54321A49640pk83m99n41q02j133p19N66J669J716J081N25Q1n10j000j068r22q18
$$ 149640 149633 149350 148851 148310 147508 146375 145656 146222 147891 149607 150688 151213 151294 150784 149784 148716 147794 146976
54303A46976n28L4K76j93p91q55p50j112j600j504j075j074j265o25R31K212K279
$$ 146976 146448 146482 146758 146565 145774 144919 144169 143057 141457 139953 138878 137804 136539 135914 136845 139057 141336
54286A41336J369K41n97q07l10L67N79M60O82J197J132J34r65j158m00O74J550
$$ 141336 142705 142946 142349 141542 141232 141599 142178 142638 143320 144517 145649 145783 144818 143660 143260 143934 145484
54269A45484K020J990J471O15l72j189j470j107m93j5M33J036J384R35n1p59r12
$$ 145484 147504 149494 150965 151580 151208 150019 148549 147442 146949 146934 147367 148403 149787 150722 150671 149912 149000
54252A49000r14q79m32M40J133J252J032O69m9j083j784j670j083o48m48j25M83
$$ 149000 148086 147207 146775 147215 148348 149600 150632 151301 151252 150169 148385 146715 145632 144984 144536 144411 144894
54235A44894J129J387R28j35j098j227o48k63o20j259j417r86m35j11L6J96M29
$$ 144894 146023 147410 148338 148203 147105 145878 145230 144967 144347 143088 141671 140685 140250 140139 140175 140371 140800
54218A40800O21N91L27J07K15N51Q22R52J086J148Q74K66l21o03n73k78K43P49
$$ 140800 141421 142012 142339 142446 142661 143212 144034 144986 146072 147220 148094 148360 148039 147436 146863 146585 146828 147577
54200A47577Q97O65L34N7k44n23n84m14j95N6M42P37M37n04j388j469p31J52M94
$$ 147577 148474 149139 149473 149530 149286 148763 148179 147765 147570 147626 148068 148805 149242 148738 147350 145881 145150 145302 145796
54181A45796K15q7K80J247J917J597O58k4j86k50m46n46l89p4L84R43J082K10
$$ 145796 146011 145924 146204 147451 149368 150965 151623 151599 151413 151163 150717 150171 149782 149708 150092 151035 152117 152327
54163A52327j335k408k430k039k007k180j917j064q5N91Q57Q10O22M56L55L25
$$ 152327 150992 148584 146154 144115 142108 139928 138011 136947 136862 137453 138310 139120 139742 140198 140553 140878
54147A40878M66Q06J054Q58L14j44l19k96k5N79J136J111O85O36J167J464R05
$$ 140878 141344 142150 143204 144062 144376 144232 143913 143617 143592 144171 145307 146418 147103 147739 148906 150370 151275
54130A51275k3l95n4M14N69N11M67M13J02n69j268j375o97J78O07P77J324K170
$$ 151275 151252 150857 150803 151217 151786 152297 152764 153177 153279 152710 151442 150067 149370 149548 150155 150932 152256 154426
54112A54426K490J872Q46P1l27m02r7L71M45j5n07o63p81j186j651j791j544q72
$$ 154426 156916 158788 159634 159705 159378 158976 158879 159250 159695 159680 159173 158510 157729 156543 154892 153101 151557 150685
54094A50685L66J840K605K127J018K94K90O59R36O97k25j166q71R41K758K826
$$ 150685 151051 152891 155496 157623 158641 158935 159225 159884 160820 161517 161292 160126 159255 160196 162954 165780
54078A65780J195m76r10k64O72J426J918K186K338K513K820L378M259N237N930
$$ 165780 166975 166499 165589 165325 165997 167423 169341 171527 173865 176378 179198 182576 186835 192072 198002
54063A98002O407P306Q992J0891J2011J1744R846O204J216l876p657r536r754
$$ 198002 204409 211715 220707 231598 243609 255353 265199 271403 272619 268743 261086 251550 241796
54050B41796q841p449o310n717n201m258l041j885o10J038K565L206L064K931
$$ 241796 232955 225506 219196 213479 208278 204020 200979 199094 198484 199522 202087 205293 208357 211288
54036B11288L142L341L403L673M185M458M308M234M596M954M616L532K337J684
$$ 211288 214430 217771 221174 224847 229032 233490 237798 242032 246628 251582 256198 259730 262067 263751
54022B63751J673J800J419M41n07p97m89l0L66N53J5j614l613m612m164l276l120
$$ 263751 265424 267224 268643 269084 268577 267780 267291 267261 267627 268180 268195 266581 262968 258356 254192 250916 247796
54005B47796l792m609n019m889m328l622l083k605j790o77l3m49j507k242k277
$$ 247796 244004 239395 234376 229487 225159 221537 218454 215849 214059 213382 213349 212900 211393 209151 206874
53990B06874k031j896j722j212m87L5J97K72N68J022J367J593J966K516K836K563
$$ 206874 204843 202947 201225 200013 199526 199561 199758 200030 200598 201620 202987 204580 206546 209062 211898 214461
53974B14461J844J117N82K22L9l4l26j100k103k847l205l317l045k131r28k94
$$ 214461 216305 217422 218004 218226 218265 218231 217905 216805 214702 211855 208650 205333 202288 200157 199229 198935
53958A98935n15q92p52l54l48p08p45j01Q42J554J974K393K937L391L403K834
$$ 198935 198420 197528 196776 196422 196074 195366 194621 194520 195362 196916 198890 201283 204220 207611 211014 213848
53942B13848J924J147R01J272K055K861L243K990K408K250L036M427N392N213
$$ 213848 215772 216919 217820 219092 221147 224008 227251 230241 232649 234899 237935 242362 247754 252967
53928B52967M212L402L413L956M402M574M711M908N073N391O273P717R161J0290
$$ 252967 257179 260581 263994 267950 272352 276926 281637 286545 291618 297009 303282 310999 320160 330450
53914C30450J1526J3346J5421J6938J7481J7013J5172J1414N985K06m551p826
$$ 330450 341976 355322 370743 387681 405162 422175 437347 448761 454746 454952 450401 442575
53902D42575r853j0825j0760r851q569p416o664o281n970n454m865m793n743p488
$$ 442575 432722 421897 411137 401286 392717 385301 378637 372356 366386 360932 356067 351274 345531 338043
53888C38043r081r544q631o956n372m329l849l969m763n863o317n509m001l033
$$ 338043 328962 319418 310787 303831 298459 294130 290281 286312 281549 275686 269369 263860 259859 256826
53874B56826l076l362l026k262j959k449l085l094k501k038k272k971l368k941
$$ 256826 253750 250388 247362 245100 243141 240692 237607 234513 232012 229974 227702 224731 221363 218422
53860B18422j957j208j288k031k748k922k659k351k028j294JJ270J671J045P1
$$ 218422 216465 215257 213969 211938 209190 206268 203609 201258 199230 197936 197937 199207 200878 201923 201994
53845B01994m92n14l98n50j046j546j476n61O58J166N53m91r81o99j90K3j48n80
$$ 201994 201502 200988 200590 200040 198994 197448 195972 195411 196069 197235 197788 197297 196316 195617 195427 195450 195302 194722
53827A94722j128j524j431p79Q4O52O38K02k00k10R6L36L61M59R36J646K108K034
$$ 194722 193594 192070 190639 189860 189944 190596 191234 191436 191236 191026 191122 191458 191819 192278 193214 194860 196968 199002
53809A99002J668J597K207L203L771L423K625K341K937L975M963N802O451O715
$$ 199002 200670 202267 204474 207677 211448 214871 217496 219837 222774 226749 231712 237514 243965 250680
53795B50680O657O675O815O497N261L452J798P00K55M37Q33O65l00j277j410r12
$$ 250680 257337 264012 270827 277324 282585 286037 287835 288535 288790 289227 290060 290725 290425 289148 287738 286826
53779B86826p23j293k334l401m180m435m290m320m766n000m446l629l512l988
$$ 286826 286103 284810 282476 279075 274895 270460 266170 261850 257084 252084 247638 244009 240497 236509
53765B36509m086l515l064l294l720l597k809j757q93n68p72r36m83L16O46K70
$$ 236509 232423 228908 225844 222550 218830 215233 212424 210667 209774 209206 208434 207498 207015 207331 207977 208247
53749B08247k72o16r26j180j025n74n07j004j288p34K78J121J802K487K658J653
$$ 208247 207975 207359 206433 205253 204228 203654 203147 202143 200855 200121 200399 201520 203322 205809 208467 210120
53733B10120k05j665j795p61N48J362J467J109O12J80J6L17Q99J158Q79P21J256
$$ 210120 209915 208250 206455 205694 206242 207604 209071 210180 210792 210972 210988 211305 212204 213362 214241 214962 216218
53716B16218J894J586M82k40j06J47Nj04P6O4j46M44K237L913M030K975K265K464
$$ 216218 218112 219698 220180 219940 219834 219981 219986 219882 219958 220022 219876 220320 222557 226470 230500 233475 235740 238204
53698B38204K948L244L409L423L255L327L833L939K765J005K62P93J214O62j03
$$ 238204 241152 244396 247805 251228 254483 257810 261643 265582 268347 269352 269614 270407 271621 272283 272180
53683B72180k04j8k63o82o35l69o93j657k413k326j649j027q35j030j275j130
$$ 272180 271976 271958 271695 271013 270378 270009 269316 267659 265246 262920 261271 260244 259409 258379 257104 255974
53667B55974m54L43O32K33m55r65j191j270j237j037p60o24p01p77o43l63j47
$$ 255974 255520 255863 256495 256728 256273 255308 254117 252847 251610 250573 249813 249189 248488 247711 247068 246705 246558
53650B46558k0J63M46P19R42J125J127P48J02l92m46q3O19J573K349K350J613
$$ 246558 246538 246701 247147 247866 248808 249933 251060 251808 251910 251518 251072 250989 251608 253181 255530 257880 259493
53633B59493R46R08J104R42O13P05J167J438J470J773K393K654K190J605J654
$$ 259493 260439 261347 262451 263393 264006 264711 265878 267316 268786 270559 272952 275606 277796 279401 281055
53618B81055K278K916L389L948M556M707M101L163K629K801L364L927M414M849
$$ 281055 283333 286249 289638 293586 298142 302849 306950 310113 312742 315543 318907 322834 327248 332097
53604C32097N005M624L925L522L651L838L488K626J808J583K149L282M267M197
$$ 332097 337102 341726 345651 349173 352824 356662 360150 362776 364584 366167 368316 371598 375865 380062
53590C80062K806Q99m43j017j489k359l414m233m728m933m710m071l515l610m219
$$ 380062 382868 383767 383324 382307 380818 378459 375045 370812 366084 361151 356441 352370 348855 345245 341026
53575C41026m489l769k382j281j024j330j656j852j989j836j089m7N31L99J88
$$ 341026 336537 332768 330386 329105 328081 326751 325095 323243 321254 319418 318329 318282 318813 319212 319400
53560C19400M69R59J055P85P14J077J543J771J743J593J398J167Q12K82j42R4
$$ 319400 319869 320828 321883 322668 323382 324459 326002 327773 329516 331109 332507 333674 334486 334768 334626 334720
53544C34720J089K140K524K451K730L584M411M698M678M883N492O258O790O823
$$ 334720 335809 337949 340473 342924 345654 349238 353649 358347 363025 367908 373400 379658 386448 393271
53530C93271O515O460P079Q002Q438Q254Q210R022J0502J1833J2413J2312J2168
$$ 393271 399786 406246 413325 421327 429765 438019 446229 455251 465753 477586 489999 502311 514479
53517E14479J2696J4003J5354J5941J5898J6213J7481J9289K0944K2283K3506
$$ 514479 527175 541178 556532 572473 588371 604584 622065 641354 662298 684581 708087
53506G08087K4569K5179K5178K4565K3428K2139K1338K1257K1252K0441J8791
$$ 708087 732656 757835 783013 807578 831006 853145 874483 895740 916992 937433 956224
53495I56224J7208J6478J6513J6736J6895J7213J7834J8436J8468J7750J6729
$$ 956224 973432 989910 1006423 1023159 1040054 1057267 1075101 1093537 1112005 1129755 1146484
53484A146484J6112J6178J6529J6469J5682J4464J3415J2893J2736J2392J1305
$$ 1146484 1162596 1178774 1195303 1211772 1227454 1241918 1255333 1268226 1280962 1293354 1304659
53473A304659R293O718M268K394Q16j240m147p328r906j1756j3482j5371j6852
$$ 1304659 1313952 1320670 1324938 1327332 1328148 1326908 1322761 1315433 1305527 1293771 1280289 1264918 1248066
53460A248066j7367j7223j7210j7646j8288j8958j9741k0624k1356k1751k1777
$$ 1248066 1230699 1213476 1196266 1178620 1160332 1141374 1121633 1101009 1079653 1057902 1036125
53449A036125k1441k0876k0483k0524k0546j9713j7794j5538j3898j3100j2518
$$ 1036125 1014684 993808 973325 952801 932255 912542 894748 879210 865312 852212 839694
53438H39694j1351r327o963n070l889k903j653m47K16N93J503L192N078O673Q131
$$ 839694 828343 819016 812053 806983 803094 800191 798538 798091 798307 798900 800403 803595 808673 815346 823477
53423H23477R653J0941J1635J1986J2691J4207J6347J8424J9797K0480K1242K2765
$$ 823477 833130 844071 855706 867692 880383 894590 910937 929361 949158 969638 990880 1013645
53411A013645K4808K6580K7866K9184L0787L2241L3273L4356L6000L7930L9547
$$ 1013645 1038453 1065033 1092899 1122083 1152870 1185111 1218384 1252740 1288740 1326670 1366217
53400A366217M0769M1996M3441M5013M6645M8283M9691N0632N1289N2101N3228
$$ 1366217 1406986 1448982 1492423 1537436 1584081 1632364 1682055 1732687 1783976 1836077 1889305
53389A889305N4282N4612N3800N2042N0073M8481M7076M5181M2603L9802L7105
$$ 1889305 1943587 1998199 2051999 2104041 2154114 2202595 2249671 2294852 2337455 2377257 2414362
53378B414362L4298L1197K7956K4432J9970J4479R081M890J479k556p868j3974
$$ 2414362 2448660 2479857 2507813 2532245 2552215 2566694 2575775 2580665 2582144 2579588 2571720 2557746
53366B557746k0420k7263l4287m0696m5945n0134n3342n5221n5745n5697n5891
$$ 2557746 2537326 2510063 2475776 2435080 2389135 2339001 2285659 2230438 2174693 2118996 2063105
53355B063105n6246n6192n5643n4960n4113n2481m9703m6391m3754m2545m2453
$$ 2063105 2006859 1950667 1895024 1840064 1785951 1733470 1683767 1637376 1593622 1551077 1508624
53344A508624m2514m2023m1003l9824l8564l7004l5046l2867l0575k8162k5734
$$ 1508624 1466110 1424087 1383084 1343260 1304696 1267692 1232646 1199779 1169204 1141042 1115308
53333A115308k3525k1447j9035j6075j3113j0945r763r103q593q421q896r742
$$ 1115308 1091783 1070336 1051301 1035226 1022113 1011168 1001405 992302 983709 975288 966392 956650
53321I56650j0086r256p469n649m477l807l048j974r24k39K50J073K594M661O627
$$ 956650 946564 937308 929839 924190 919713 915906 912858 910884 909960 909721 909971 911044 913638 918299 924926
53306I24926P808Q108Q221Q952J0385J1949J3323J4839J6773J8729K0122K1064
$$ 924926 932734 940842 949063 958015 968400 980349 993672 1008511 1025284 1044013 1064135 1085199
53294A085199K2228K3899K5620K6831K7527K8070K8641K9011K8733K7438K5103
$$ 1085199 1107427 1131326 1156946 1183777 1211304 1239374 1268015 1297026 1325759 1353197 1378300
53283A378300K2236J9656J7860J6632J5321J3484J1070Q151M664N96l744p730
$$ 1378300 1400536 1420192 1438052 1454684 1470005 1483489 1494559 1502710 1507374 1507970 1504226 1496496
53271A496496j0771j2683j3859j5016j6670j8756k0850k2757k4670k6628k8114
$$ 1496496 1485725 1473042 1459183 1444167 1427497 1408741 1387891 1365134 1340464 1313836 1285722
53260A285722k8563k8232k8153k9008l0366l1272l1313l0804l0140k9440k8761
$$ 1285722 1257159 1228927 1200774 1171766 1141400 1110128 1078815 1048011 1017871 988431 959670
53249I59670k8136k7376k6250k5051k4400k4353k4141k3241k2175k1747k1874
$$ 959670 931534 904158 877908 852857 828457 804104 779963 756722 734547 712800 690926
53238F90926k1819k1294k0507j9329j7372j5006j3314j2634j1993j0501q596p237
$$ 690926 669107 647813 627306 607977 590605 575599 562285 549651 537658 527157 518561 511324
53226E11324o513n883n333n345n919o522o951p482q135q609q911r327r670r414
$$ 511324 504811 498928 493595 488250 482331 475809 468858 461376 453241 444632 435721 426394 416724 407310
53212D07310q678q197q076p473o067m862m855n588n847n349m809m691m765m837
$$ 407310 398632 390435 382359 374886 368819 363957 359102 353514 347667 342318 337509 332818 328053 323216
53198C23216n107n623o041o067n761n275m710m239m017l913l581k868j955j153
$$ 323216 318109 312486 306445 300378 294617 289342 284632 280393 276376 272463 268882 266014 264059 262906
53184B62906p41q37j218j433j366j425j848k134j625n26K62K35k18n17n59o50
$$ 262906 262165 261328 260110 258677 257311 255886 254038 251904 250279 249753 250015 250250 250032 249515 248956 248306
53168B48306j007j524j842j705j276r69q62o46l10l75j036j644j561j102q77p23
$$ 248306 247299 245775 243933 242228 240952 239983 239121 238475 238165 237790 236754 235110 233549 232447 231570 230847
53152B30847j94K74j63j199j507n95N02P59L63l3k99m94l63J60N09K63j52o0M92
$$ 230847 230653 230927 230764 229565 228058 227463 227965 228724 229087 229054 228755 228261 227898 228058 228567 228830 228678 228618 229110
53133B29110R93J287J555J729J514Q43j9p67j132r06j69O93J347J693J641J177
$$ 229110 230103 231390 232945 234674 236188 237031 237012 236245 235113 234207 234038 234731 236078 237771 239412 240589
53117B40589P24R00J576J832J136R5m22l65k28k43m09q38j503j939j810j473j474
$$ 240589 241313 242213 243789 245621 246757 246852 246430 246065 245837 245594 245185 244347 242844 240905 239095 237622 236148
53100B36148j774k039k319k751k916k218q57K87O94O15M30J65k83q60j384j600
$$ 236148 234374 232335 230016 227265 224349 222131 221274 221561 222255 222870 223300 223465 223182 222322 220938 219338
53084B19338j283n38J54M82O35R16J244J407J422J284P35j73p48n28j12l81j211
$$ 219338 218055 217517 217671 218153 218788 219704 220948 222355 223777 225061 225796 225623 224875 224347 224235 223854 222643
53067B22643j736j703j622j620j152j05O86M57n02j282j409j120q97j026j404
$$ 222643 220907 219204 217582 215962 214810 214705 215391 215848 215346 214064 212655 211535 210638 209612 208208
53052B08208j590j195l01O45J266J481J375J128R37Q12N83K70J26L9n48j650k240
$$ 208208 206618 205423 205122 205767 207033 208514 209889 211017 211954 212766 213349 213619 213745 213784 213236 211586 209346
53035B09346j494j54K73m77j238j153o63m81n31k74M54J285J616J002k95j170
$$ 209346 207852 207698 207971 207494 206256 205103 204440 203959 203428 203154 203608 204893 206509 207511 207216 206046
53019B06046q28P3K13m26m54P65K028J936P60k10m11k68j42P0L88N28K22n27j381
$$ 206046 205218 205291 205504 205078 204624 205389 207417 209353 210113 209903 209492 209224 209082 209152 209540 210068 210290 209763 208382
53000B08382j721j081J44R24Q15N10O95R60M44p79j696j585n93P17J854K466K435
$$ 208382 206661 205580 205724 206648 207463 207973 208668 209628 210072 209293 207597 206012 205419 206136 207990 210456 212891
52983B12891J991J437Q01O6m66m03K26J033J688J981J693Q67Lm27n39o37n22K01
$$ 212891 214882 216319 217120 217186 216720 216317 216543 217576 219264 221245 222938 223805 223808 223381 222842 222205 221683 221884
52965B21884J237J760J589J481J950K372J787K23j284j930j891j831k003k139
$$ 221884 223121 224881 226470 227951 229901 232273 234060 234283 232999 231069 229178 227347 225344 223205
52951B23205k021j823j794j794j477r10o32r40j378j258n20K33M72J64m62j185
$$ 223205 221184 219361 217567 215773 214296 213386 212754 211814 210436 209178 208658 208891 209363 209527 209065 207880
52935B07880j642j364l22P20Q52M1q22j017p77p14p85l91N26J106O67l08o99j20
$$ 207880 206238 204874 204552 205272 206124 206165 205343 204326 203549 202835 202050 201659 202185 203291 203958 203650 202951 202831
52917B02831P51J108Q70N08M01N25N44J56n09q76n22K56P27N65P6l08m61m11j95
$$ 202831 203582 204690 205560 206068 206469 206994 207538 207694 207185 206309 205787 206043 206770 207335 207411 207103 206642 206231 206036
52898B06036J07L72N72O75M86q4o67p75m34p2J94O12J095J140O03k9l72n98q19
$$ 206036 206143 206515 207087 207762 208248 208164 207497 206722 206288 206216 206410 207022 208117 209257 209860 209831 209459 208861 208042
52879B08042o52Q0P45O01k10q86j010p88m22K08J140J999K335K107J803J961K559
$$ 208042 207390 207470 208215 208816 208606 207720 206710 205922 205500 205708 206848 208847 211182 213289 215092 217053 219612
52862B19612K986K767K159J691J323O15l29q48p66o50q85j143j228j513k088k305
$$ 219612 222598 225365 227524 229215 230538 231153 230824 229976 229210 228560 227675 226532 225304 223791 221703 219398
52846B19398j883j687k459l412l203j892p68l80q3M63N58k83j320j567j116p93
$$ 219398 217515 215828 213369 209957 206754 204862 204094 203714 203631 204094 204652 204369 203049 201482 200366 199573
52830A99573q80p72O5J321K092J805P61k14n66l41J91Q06J103N55p54j833j796
$$ 199573 198693 197921 197986 199307 201399 203204 203965 203751 203185 202844 203035 203841 204944 205499 204745 202912 201116
52813B01116r36k07R9M91J269K151K910L581L864L123J352m18j152r45p60j279
$$ 201116 200180 199973 200072 200563 201832 203983 206893 210474 214338 217461 218813 218395 217243 216298 215538 214259
52797B14259k310l166l387l068k613k227j740j005k66J23J07j16m26o36m68J3
$$ 214259 211949 208783 205396 202328 199715 197488 195748 194743 194477 194600 194707 194591 194165 193529 193061 193074
52781A93074J75l56q97m92O91J471J212M78O2J66O65J411J932J597N04l86m07
$$ 193074 193249 192893 191996 191504 192195 193666 194878 195356 195418 195584 196249 197660 199592 201189 201693 201307 200900
52764B00900M3K82K97M02M68J26n58j141j361j229p94j96K46L52K83K26J40M7
$$ 200900 200943 201225 201522 201924 202392 202518 201960 200819 199458 198229 197435 197239 197485 197837 198120 198346 198486 198533
52746A98533J66N04O76N20N08J078J929K423K379J991J285K67n75o00J66J042
$$ 198533 198699 199203 199879 200399 200907 201985 203914 206337 208716 210707 211992 212259 211684 211084 211250 212292
52730B12292J514J610J485J183Q71Q62J174J346Q82k44j480k063j631o51j07n51
$$ 212292 213806 215416 216901 218084 218955 219817 220991 222337 223219 222975 221495 219432 217801 217150 217043 216492
52714B16492j588k449k771k535j734o18L6l34j122j134j75O94O10r2o79j078j514
$$ 216492 214904 212455 209684 207149 205415 204797 204833 204499 203377 202243 202068 202762 203372 203280 202601 201523 200009
52697B00009j683j107j00M63L53L01Q62J558J588J012O91J118J814J979J446P65
$$ 200009 198326 197219 197119 197582 197935 198236 199098 200656 202244 203256 203947 205065 206879 208858 210304 211069
52681B11069N34Q23J184J043K40p11j033m97K59M37m5o10q35p89o26l11J43N28
$$ 211069 211603 212426 213610 214653 214893 214182 213149 212652 212911 213348 213303 212693 211858 211069 210443 210132 210275 210803
52663B10803P44R28J096J002N67J50J37N19J102J847K691L337L565L506L253K491
$$ 210803 211547 212475 213571 214573 215140 215290 215427 215946 217048 218895 221586 224923 228488 231994 235247 237738
52647B37738J003o88j692j734j341j087j107j258j322j089o29m75j012j817k072
$$ 237738 238741 238053 236361 234627 233286 232199 231092 229834 228512 227423 226794 226319 225307 223490 221418
52632B21418j591r18l53L08R86J125P18P55J896L209L081J220j039k368k669k503
$$ 221418 219827 218909 218556 218864 219850 220975 221693 222448 224344 227553 230634 231854 230815 228447 225778 223275
52616B23275k025j031L21J368J636J307Q67M51j96j128j874j906j272m86Q9L92
$$ 223275 221250 220219 220540 221908 223544 224851 225718 226169 225973 224845 222971 221065 219793 219307 219396 219788
52600B19788L46j42p44q18k10M47N48K75J76L43M35L12J61J06R7N6j34n90j023
$$ 219788 220134 219992 219248 218430 218220 218667 219215 219490 219666 220009 220444 220756 220917 221023 221120 221176 221042 220452 219429
52581B19429p39M54J667J909J412J173J346J073Pj009j214r42p48l55P21K035
$$ 219429 218690 219144 220811 222720 224132 225305 226651 227724 227731 226722 225508 224566 223818 223463 224184 226219
52565B26219K562K005R81J09m55o69n20k57k29m22n64n86n50k61M00R02N63l61
$$ 226219 228781 230786 231767 231876 231421 230752 230232 229975 229746 229324 228760 228174 227624 227363 227763 228665 229228 228867
52547B28867p58j08Q31J066M84m30j420k377k849k281p85P59J470J166L86j11
$$ 228867 228109 228001 228832 229898 230382 229952 228532 226155 223306 221025 220240 220999 222469 223635 224021 223910
52531B23910O0O53J126J215J048P62L28j58l77j59K88O88R64J051Q18L59Q6J85
$$ 223910 223970 224623 225749 226964 228012 228774 229102 228944 228567 228408 228696 229384 230348 231399 232217 232576 232662 232847
52513B32847L70M03N74J221K059K494K404K148J944J710J453J222P35m41k045
$$ 232847 233217 233620 234194 235415 237474 239968 242372 244520 246464 248174 249627 250849 251584 251143 249098
52498B49098l052k767j681q93q24r32n94P7M68K86j21k55p0R6Nk52m55l78K27
$$ 249098 246046 243279 241598 240705 239881 238949 238355 238432 238900 239186 239065 238810 238740 238836 238841 238589 238134 237756 237983
52479B37983J389K534K764J821M85k86l82l24l48j88L08Q41J126J251J404J525
$$ 237983 239372 241906 244670 246491 246976 246690 246308 245984 245636 245448 245756 246597 247723 248974 250378 251903
52463B51903J506J551K025K880L477L169K073R84M19J8q28j994k807l070l276
$$ 251903 253409 254960 256985 259865 263342 266511 268584 269568 269987 270005 269177 267183 264376 261306 258030
52448B58030l612l525k647j566j114j307j578j709j814j736j186m34j41m63q70
$$ 258030 254418 250893 248246 246680 245566 244259 242681 240972 239158 237422 236236 235802 235661 235198 234328
52433B34328q91o10l53l65p57j364j642j209l87K27N60R33J305J343J184J304
$$ 234328 233437 232827 232474 232109 231352 229988 228346 227137 226750 226977 227537 228470 229775 231118 232302 233606
52417B33606J611J477Q24M01O38J086J299J548K195L004L660M392N505O806P976
$$ 233606 235217 236694 237518 237919 238557 239643 240942 242490 244685 247689 251349 255741 261246 268052 276028
52402B76028Q991R589Q885O357K808m93l281n995q205q621o933m703l631l611
$$ 276028 285019 294608 303493 309850 312658 312165 308884 302889 294684 286063 279130 274427 270796 267185
52388B67185l225j905p15q96k177l028k352n52J085J698J420R49Q75J334J970
$$ 267185 263960 262055 261340 260444 258267 255239 252887 252335 253420 255118 256538 257487 258362 259696 261666
52373B61666K237J947J497J345J442J520J772K671M010M692L809J675m66j588
$$ 261666 263903 265850 267347 268692 270134 271654 273426 276097 280107 284799 288608 290283 289817 288229
52359B88229j541r16m42l70k97K56J123J684J708J576J502J140K49p12j096p52
$$ 288229 286688 285772 285330 284960 284663 284919 286042 287726 289434 291010 292512 293652 293901 293189 292093 291341
52343B91341J01J293K525L180K933K344K263K720L030K912K899L464M264M652
$$ 291341 291442 292735 295260 298440 301373 303717 305980 308700 311730 314642 317541 321005 325269 329921
52329C29921M636M942O090P758R158R894J0232J0590J1077J1606J2120J2391J1964
$$ 329921 334557 339499 345589 353347 362505 372399 382631 393221 404298 415904 428024 440415 452379
52316D52379J0799R720R645J0339J0645R989R102Q979R785J0956J1870J2019J1213
$$ 452379 463178 472898 482543 492882 503527 513516 522618 531597 541382 552338 564208 576227 587440
52303E87440R977R329R615J0059R838R172Q818Q864Q714P943O606M842K784Q19
$$ 587440 597417 606746 616361 626420 636258 645430 654248 663112 671826 679769 686375 691217 694001 694820
52289F94820o37j630k599l797m959n615n544n072m882n271n580m897l360k100
$$ 694820 694183 692553 689954 686157 681198 675583 670039 664967 660085 654814 649234 644337 640977 638877
52275F38877j625j069L95K167L061K972K821L220M055N189O609P923Q516Q296
$$ 638877 637252 636183 636578 638745 641806 644778 647599 650819 654874 660063 666672 674595 683111 691407
52261F91407P705P014O230N659N850O886Q194R183R642R596R256R034R149R232
$$ 691407 699112 706126 712356 718015 723865 730751 738945 748128 757770 767366 776622 785656 794805 804037
52247H04037Q733P550N874L682R70j690l544m498n072n587o007o394o892p315
$$ 804037 812770 820320 826194 829876 830846 829156 825612 821114 816042 810455 804448 798054 791162 783847
52233G83847p378p259p293p244o626n663n207n623o342o607o078m858l473k722
$$ 783847 776469 769210 761917 754673 748047 742384 737177 731554 725212 718605 712527 707669 704196 701474
52219G01474k863l122k648j690j030o13J83J177J568J457J835K899L724L946M356
$$ 701474 698611 695489 692841 691151 690121 689508 689691 690868 692436 693893 695728 698627 702351 706297 710653
52204G10653N244N516M324K471J300J043J173J585K336K926K829K396K369K802
$$ 710653 715897 721413 725737 728208 729508 730551 731724 733309 735645 738571 741400 743796 746165 748967
52190G48967L224L506L828M091M038L785L592L326K573J124r97l597o023p328
$$ 748967 752191 755697 759525 763616 767654 771439 775031 778357 780930 782054 781057 777460 771437 764109
52176G64109p206o470o134o389o782o942o667n846m746l885l193j967j25J298
$$ 764109 756903 750433 744299 737910 731128 724186 717519 711673 706927 703042 699849 697882 697757 699055
52162F99055J586J475J999K870L091K631K259K123J697J017P94J180J465J199
$$ 699055 700641 702116 704115 706985 710076 712707 714966 717089 718786 719803 720597 721777 723242 724441
52148G24441O89K97K3N2Q03K114L049K938K124J421J151J003N23m16j389j701
$$ 724441 725130 725427 725450 725502 726305 728419 731468 734406 736530 737951 739102 740105 740628 740212 738823 737122
52132G37122j127k11N29J415L068N342P437R009J0415J1996J3740J5636J7594
$$ 737122 735995 735784 736313 737728 740796 746138 753575 762584 772999 784995 798735 814371 831965
52119H31965J9011J9295J8919J9056J9940K0457J9754J8369J7142J5857J3835
$$ 831965 850976 870271 889190 908246 928186 948643 968397 986766 1003908 1019765 1033600
52108A033600J1379R590Q861Q395P330N777M458L775L575L623L905M431M922M956
$$ 1033600 1044979 1054569 1063430 1071825 1079155 1084932 1089390 1093165 1096740 1100363 1104268 1108699 1113621 1118577
52094A118577M354L241J714l19k848n569q195j0760j3242j5141j5869j5493j4639
$$ 1118577 1122931 1126172 1127886 1127567 1124719 1119150 1110955 1100195 1086953 1071812 1055943 1040450 1025811
52081A025811j3645j2215j0121p811o089n242m739l771k080k48R66J541K197L401
$$ 1025811 1012166 999951 989830 982019 975930 970688 965949 962178 960098 959850 960816 962357 964554 967955
52067I67955M765N695O232O820P524Q040Q243Q221P870P025O032N604O014O757
$$ 967955 972720 978415 984647 991467 998991 1007031 1015274 1023495 1031365 1038390 1044422 1050026 1056040 1062797
52053A062797P062O492N120L541K539K254J839M43j639l413m635n989p779r355
$$ 1062797 1069859 1076351 1081471 1085012 1087551 1089805 1091644 1092087 1090448 1087035 1082400 1076411 1068632 1059277
52039A059277j0062j0024r640r053q460q240q315q015p107o372o510p058p148
$$ 1059277 1049215 1039191 1029551 1020498 1012038 1003798 995483 987468 980361 973989 967479 960421 953273
52026I53273o875p018p607p790p196o607o850p643q012p548o697n920n089l912
$$ 953273 946398 939380 931773 923983 916787 910180 903330 895687 887675 880127 873430 867510 862421 858509
52012H58509k647k001k303l083l608l723l928m731o143p790r309j0632j1952j3391
$$ 858509 855862 853861 851558 848475 844867 841144 837216 832485 826342 818552 809243 798611 786659 773268
$$ [...]
##END NTUPLES=NMR SPECTRUM
##END=
