
##TITLE=UV1112_M2_1290-1353_7180724_vbbVE3yvxo
##JCAMPDX= 6.0         $$ Bruker NMR JCAMP-DX V2.0
##DATA TYPE= NMR SPECTRUM
##DATA CLASS= NTUPLES
##ORIGIN= BRUKER
##OWNER= Administrator
$$ 1.72 TOPSPIN		Version 2.1
$$ 2012-12-05 01:16:19.460 -0500  Administrator@X
$$ Compression mode = diff/dup
##.OBSERVE FREQUENCY= 400.02188249412
##.OBSERVE NUCLEUS= ^1H
##.ACQUISITION MODE= SIMULTANEOUS (DQD)
##.ACQUISITION SCHEME= undefined
##.AVERAGES= 8
##.DIGITISER RES= 22
##SPECTROMETER/DATA SYSTEM= spect
##.PULSE SEQUENCE= zg30
##.SOLVENT NAME= COFFEE_meoh
##.SHIFT REFERENCE= INTERNAL, COFFEE_meoh, 1, 14.98509
##AUDIT TRAIL= $$ (NUMBER, WHEN, WHO, WHERE, PROCESS, VERSION, WHAT)
$$ ##TITLE= Audit trail, TOPSPIN		Version 2.1
$$ ##JCAMPDX= 5.01
$$ ##ORIGIN= Bruker BioSpin GmbH
$$ ##OWNER= Administrator
$$ $$ E:\/data/COFFEE/nmr/UV1112_M2_1290-1353_7180724_vbbVE3yvxo/10/pdata/1/auditp.txt
$$ ##AUDIT TRAIL=  $$ (NUMBER, WHEN, WHO, WHERE, PROCESS, VERSION, WHAT)
(   1,<2012-12-05 01:16:11.398 -0500>,<Administrator>,<X>,<go>,<TOPSPIN 2.1>,
      <created by zg
	started at 2012-12-05 01:15:05.304 -0500,
	POWCHK enabled, PULCHK disabled,
       configuration hash MD5:
       86 BA 57 50 F2 9D 5C 9B 26 00 A9 28 5F 66 2E 89
       data hash MD5: 64K
       2F 4D 32 87 02 8E 12 FB 34 91 46 17 2E 82 80 99>)
(   2,<2012-12-05 01:16:14.507 -0500>,<Administrator>,<X>,<proc1d>,<TOPSPIN 2.1>,
      <Start of raw data processing
       efp LB = 0 FT_mod = 6 PKNL = 1 PHC0 = 0 PHC1 = 0 SI = 32K 
       data hash MD5: 32K
       E0 38 93 90 5C 57 5C 32 FC 80 03 91 17 E7 43 2F>)
(   3,<2012-12-05 01:16:14.991 -0500>,<Administrator>,<X>,<proc1d>,<TOPSPIN 2.1>,
      <pk PHC0 = 97.4762 PHC1 = 0 
       data hash MD5: 32K
       3A 02 C2 E7 9B 1C C0 54 62 E7 C7 BA 9D 59 62 6D>)
(   4,<2012-12-05 01:16:15.210 -0500>,<Administrator>,<X>,<proc1d>,<TOPSPIN 2.1>,
      <abs ABSG = 1 
       data hash MD5: 32K
       66 29 C9 93 A8 53 13 E3 DD F8 A8 99 6C 65 BB D7>)
(   5,<2012-12-05 01:16:15.351 -0500>,<Administrator>,<X>,<proc1d>,<TOPSPIN 2.1>,
      <abs ABSG = 2 
       data hash MD5: 32K
       23 5F 4C AB 93 10 15 F4 F6 1E 2A 3E 36 19 72 D6>)
(   6,<2012-12-05 01:16:15.507 -0500>,<Administrator>,<X>,<proc1d>,<TOPSPIN 2.1>,
      <abs ABSG = 3 
       data hash MD5: 32K
       5A BE CF F3 D6 3A 38 79 EB CF 1A 90 9B 7B 0E AB>)
(   7,<2012-12-05 01:16:15.663 -0500>,<Administrator>,<X>,<proc1d>,<TOPSPIN 2.1>,
      <abs ABSG = 4 
       data hash MD5: 32K
       05 A7 C2 EE B1 9E D9 45 FF DC 21 B3 B6 B3 06 1A>)
(   8,<2012-12-05 01:16:15.804 -0500>,<Administrator>,<X>,<proc1d>,<TOPSPIN 2.1>,
      <abs ABSG = 5 
       data hash MD5: 32K
       29 56 D2 0E 7F F7 11 63 5F D9 04 5E 6D 3A D8 D1>)
$$ ##END=
$$ 
$$ $$ hash MD5
$$ $$ F5 42 3D AE 98 FE 2C 33 DF 65 E1 DA B1 CD 75 B7
##$RELAX= 
##$RELAX= 
##$RELAX= 
##$RELAX= 
##$RELAX= 
##$RELAX= 
##$RELAX= 
$$ Bruker specific parameters
$$ --------------------------
##$DU= <E:\>
##$EXPNO= 10
$$ [...]
##$TP= (0..7)
150 150 150 150 150 150 150 150
##$TP07= 0
##$TPNAME0= <>
##$TPNAME1= <>
##$TPNAME2= <>
##$TPNAME3= <>
##$TPNAME4= <>
##$TPNAME5= <>
##$TPNAME6= <>
##$TPNAME7= <>
##$TPOAL= (0..7)
0.5 0.5 0.5 0.5 0.5 0.5 0.5 0.5
##$TPOFFS= (0..7)
0 0 0 0 0 0 0 0
##$TUNHIN= 0
##$TUNHOUT= 0
##$TUNXOUT= 0
##$USERA1= <user>
##$USERA2= <user>
##$USERA3= <user>
##$USERA4= <user>
##$USERA5= <user>
##$V9= 5
##$VALIST= <valist>
##$VCLIST= <CCCCCCCCCCCCCCC>
##$VD= 0
##$VDLIST= <DDDDDDDDDDDDDDD>
##$VPLIST= <PPPPPPPPPPPPPPP>
##$VTLIST= <TTTTTTTTTTTTTTT>
##$WBST= 2048
##$WBSW= 25
##$XGAIN= (0..3)
0 0 0 0
##$XL= 0
##$YL= 0
##$YMAX_a= 639164
##$YMIN_a= -545759
##$ZGOPTNS= <>
##$ZL1= 120
##$ZL2= 120
##$ZL3= 120
##$ZL4= 120
##$ABSF1= 14.98509
##$ABSF2= -5.573092
##$ABSG= 5
##$ABSL= 3
##$ALPHA= 0
##$AQORDER= 0
##$ASSFAC= 0
##$ASSFACI= 0
##$ASSFACX= 0
##$ASSWID= 0
##$AUNMP= <proc_prof1d_extract_pilot.lims>
##$AXLEFT= 0
##$AXNAME= <>
##$AXNUC= <1H>
##$AXRIGHT= 0
##$AXTYPE= 0
##$AXUNIT= <>
##$AZFE= 0.1
##$AZFW= 0.1
##$BCFW= 0
##$BC_mod= 0
##$BYTORDP= 0
##$COROFFS= 0
##$CY= 15
##$DATMOD= 1
##$DC= 0
##$DFILT= <>
##$DTYPP= 0
##$F1P= 0
##$F2P= 0
##$FCOR= 0.5
##$FTSIZE= 32768
##$FT_mod= 6
##$GAMMA= 0
##$GB= 0
##$INTBC= 1
##$INTSCL= 1
##$ISEN= 128
##$LB= 0
##$LEV0= 0
##$LPBIN= 0
##$MAXI= 10000
##$MC2= 0
##$MEAN= 0
##$ME_mod= 0
##$MI= 0
##$NCOEF= 0
##$NC_proc= -8
##$NLEV= 6
##$NOISF1= 0
##$NOISF2= 0
##$NSP= 0
##$NTH_PI= 0
##$NZP= 0
##$OFFSET= 14.98509
##$PC= 1
##$PHC0= 97.4762
##$PHC1= 0
##$PH_mod= 1
##$PKNL= yes
##$PPARMOD= 0
##$PPDIAG= 0
##$PPIPTYP= 0
##$PPMPNUM= 2147483647
##$PPRESOL= 1
##$PSCAL= 4
##$PSIGN= 0
##$PYNMP= <proc.py>
##$REVERSE= no
##$SF= 400.02
##$SI= 32768
##$SIGF1= 0
##$SIGF2= 0
##$SINO= 400
##$SIOLD= 32768
##$SPECTYP= <>
##$SREGLST= <1H.CDCl3>
##$SSB= 0
##$STSI= 32768
##$STSR= 0
##$SW_p= 8223.68421052631
##$SYMM= 0
##$S_DEV= 0
##$TDeff= 65536
##$TDoff= 0
##$TI= <>
##$TILT= no
##$TM1= 0
##$TM2= 0
##$TOPLEV= 0
##$USERP1= <user>
##$USERP2= <user>
##$USERP3= <user>
##$USERP4= <user>
##$USERP5= <user>
##$WDW= 1
##$XDIM= 32768
##$YMAX_p= 481438222
##$YMIN_p= -762842
##$CURPLOT= <Network HP LaserJet P1505>
##$CURPRIN= <$Network HP LaserJet P1505>
##$DFORMAT= <normdp>
##$LAYOUT= <+/1D_H.xwp>
##$LFORMAT= <normlp>
##$PFORMAT= <normpl>
##$SURQMSG= 1
$$ End of Bruker specific parameters
$$ ---------------------------------
##NTUPLES= NMR SPECTRUM
##VAR_NAME=  FREQUENCY,     SPECTRUM/REAL,   SPECTRUM/IMAG
##SYMBOL=    X,             R,               I
##VAR_TYPE=  INDEPENDENT,   DEPENDENT,       DEPENDENT
##VAR_FORM=  AFFN,          ASDF,            ASDF
##VAR_DIM=   32768,         32768,           32768
##UNITS=     HZ,            ARBITRARY UNITS, ARBITRARY UNITS
##FACTOR=    0.250966925370066, 1,           1
##FIRST=     8223.43324360094, -43698,       -99404
##LAST=      0,             -235530,         -222
##MIN=       0,             -762842,         0
##MAX=       8223.43324360094, 481438222,    0
$$ Real data points
##PAGE= N=1
##DATA TABLE= (X++(R..R)), XYDATA
$$ [...]
19557B06221Q4323b23060c009j77966A05610a65834A55692j4060a07660p8622
19547a86282I2264g3969k46009C23606E8708J95587c00367J09016Q7156r2446
19537a96641b6403B90852d7836k7632A02966c98150A90275A3945a40251j3118
19527a53369L1602m2518b435A01201b1255C35967j49881m2448A6387c69334A9997
19515B3047K08317q9244b80500C4858b60870F4267K0484d7801g193j31313A7544
19503E1547J31633F8553a21044j76513a35192j3647m5283H7735B5284K1149O5078
19492A11511a03310o7690A23314J92245d58610E2044g0120A70387A0166O6041
19482G6207h7971F6293i3665a7437k5046C69314d12176a8984A8695i1512G297
$$ y = [206221, 290544, -223060, -3009, -180975, 105610, -165834, 155692, 141632, -107660, -186282, 92264, -73969, -319978, 323606, 58708, 254295, -300367, -191351, -104195, -196641, -26403, 290852, -47836, -75468, 102966, -398150, 190275, 13945, -140251, -153369, -121767, -164285, -2435, 101201, -21255, 335967, 186086, 143638, 16387, -369334, 19997, 23047, 231364, 142120, -280500, 34858, -260870, 64267, 84751, -47801, -7193, -138506, 17544, 51547, 183180, 68553, -121044, -297557, -135192, -148839, -194122, 87735, 25284, 46433, 111511, -103310, -171000, 123314, 315559, -458610, 52044, -70120, 170387, 10166, 76207, -87971, 66293, -93665, -17437, -42483, 369314, -412176, -18984, 18695, -91512, 7297]
19470c5734E5790q211N4902b22844n9271A23586a40462M5817j35868A21173g3977
19458c46005d0025l47619B67642a83082A06314b007l57522c5675j60017J1150
19448a84542F378b45291f4167r2554k48305a35797b9309q3092r8184B14570D827
19436b37255a6592D6024b07457k08205c2121q5440E6472d5364I3547b17361a6339
19424e7674j41395h5771j8054J9559j21635d5559A80907J7328b79822a21400j15496
19413b36896K0339J9550B74283A1739M9249C927L9836a47170j65610q0125e6096
19401B41618q2685d85698d642j00277c3682k81014a34612M4527A02498l6791G123
19389B15717h8907C9432a67621B3838b642A67329J59464A40706c17032c5992j34824
$$ y = [-35734, 55790, 47579, 102481, -222844, -282115, 123586, -140462, -94645, -230513, 121173, -73977, -346005, -40025, -387644, 267642, -183082, 106314, -2007, -359529, -35675, -195692, -184542, 6378, -245291, -64167, -156721, -405026, -135797, -29309, -112401, -210585, 214570, 4827, -237255, -16592, 46024, -207457, -415662, -32121, -117561, 56472, -45364, 93547, -217361, -16339, -57674, -199069, -85771, -103825, -84266, -205901, -45559, 180907, 198235, -279822, -121400, -236896, -216557, -197007, 274283, 11739, 60988, 3927, 43763, -147170, -312780, -392905, -56096, 241618, 158933, -485698, -4642, -104919, -33682, -314696, -134612, -90085, 102498, 65707, 7123, 215717, -88907, 39432, -167621, 23838, -2642, 167329, 326793, 140706, -317032, -35992, -170816]
19378a70816P8875A81557R446a03683I1172O7606O7684F2218d4013H1770d5653
19366h3016k03479a11551l0036A04030g2023J456H9567a53053b5299A21280k5400
19355I5880C0960c7254l964k31933M279a19671k12929A0201b49342P0213C28d291
19342B7166b13907p0643B28367G4570A7806R2939a18470j9172e5143G909J7194
19331B5103b82658Q4377A18308c2255o7686k98292A08394e9897J6955j7878C07379
19319f6597B63786a8090j5830p6786j60312a31324b3665a1738D7942P2787F0058
19307A8771e4540H6592b37189j40819a11256A00601J9625a89428j29074j67654
19297d86156C49078a47595h272j29127N4884C5187a23586n66714A42449b0958
$$ y = [-170816, -91941, 181557, 191003, -103683, 91172, 158778, 226462, 62218, -44013, 81770, -45653, -83016, -286495, -111551, -141587, 104030, -72023, -70567, 89567, -153053, -25299, 121280, 95880, 30960, -37254, -41218, -273151, -268872, -119671, -332600, 10201, -249342, -179129, 328, -4291, 27166, -213907, -284550, 228367, 74570, 17806, 110745, -118470, -137642, -55143, 7909, 25103, -282658, -198281, 118308, -32255, -99941, -398233, 108394, -59897, -42942, -60820, 307379, -66597, 263786, -18090, -33920, -110706, -271018, -131324, -23665, -11738, 47942, 120729, 60058, 18771, -54540, 86592, -237189, -378008, -111256, 100601, 120226, -189428, -318502, -486156, 349078, -147595, -8272, -137399, -82515, 35187, -123586, -690300, 142449, -20958]
19286a99779C43579b13073A11293a69514G6452K37923A7614b77090J10353e4901
19275A657a86401A89922c1993k7522G3738i8908c3706B10411b30153k95798a01693
19263C8863a249F7807b34561A25138l306h5381j00282d8125A18588a82440k61435
19252d43875a57213q4195l345h1261p0842m034A2000P9702f3669k9504b2946C10004
19239c20937I4869a1320q4658n9636L8846C24348I0197l9890R7274a16664k22074
19228c38738a0307D8662b7914h750l05670N2111J03421E8047A6873b06915c8816
19216A3384K6265J77067a80240j3625N5729M8780j03179c7862j23286J9200a2897
19204b88512j16962e2413j14990m9652g8052L1743m76944D4566Q4715d52413a21029
$$ y = [-199779, 343579, -213073, 111293, -169514, 76452, 314375, 17614, -277090, -166737, -54901, 1657, -186401, 189922, -31993, -59515, 73738, -98908, -33706, 210411, -230153, -525951, -101693, 38863, -1249, 67807, -234561, 125138, 121832, -85381, -185663, -48125, 118588, -182440, -443875, -157213, -241408, -244753, -81261, -152103, -156137, 12000, 91702, -63669, -93173, -22946, 310004, -320937, 94869, -11320, -95978, -155614, -116768, 324348, 90197, 50307, 147581, -116664, -338738, -10307, 48662, -27914, -8750, -314420, -262309, -158888, 58047, 16873, -206915, -38816, 13384, 39649, 216716, -180240, -193865, -138136, -89356, -192535, -37862, -161148, -141948, -12897, -288512, -405474, -52413, -167403, -217055, -78052, -46309, -523253, 44566, 129281, -452413, -121029]
19192f72353E3375K06679J6564a53833N6688j4335i954C1356c9341p9925k10729
19181c29995e3986E8346L6496B1776J801a63351E0990c47476d0743l66084L0416
19170c76411A25279c30467a45697d8981A23380A7552c45635O7513f4505B3166
19159B36143e7600k1481l9898M8464C1676M750n05a59390H6005k6217c55993B08143
19146c98517J44787B72740E23L44351o7021b3693p3179a5451k46810B42203a87284
19134G7051a06829B51097a42602e2726j33968G9468C4752h2988b2269A2890K87053
19123B99943a56303J1898B56346c5674l64753B0791i5749l05601J88741M8278
19113a64331B1231a43017A84828b23828r954B778a18280j26310L3811A38971J14121
$$ y = [-672353, 53375, 260054, 276618, -153833, -97145, -111480, -9954, 31356, -39341, -119266, -329995, -53986, 58346, 94842, 21776, 23577, -163351, 50990, -347476, -40743, -406827, -376411, 125279, -330467, -145697, -48981, 123380, 17552, -345635, -278122, -64505, 23166, 236143, -57600, -79081, -118979, -70515, 31676, 36426, 35921, -159390, 86005, 59788, -355993, 208143, -398517, -253730, 272740, 523, 344874, 277853, -23693, -96872, -15451, -262261, 242203, -187284, 77051, -106829, 251097, -142602, -52726, -186694, 79468, 34752, -82988, -22269, 12890, 299943, -156303, -144405, 256346, -35674, -400427, 20791, -95749, -401350, -212609, -164331, 21231, -143017, 184828, -223828, -233782, 2778, -118280, -244590, -210779, 138971, 253092]
19102B53092r1631A8422F660R480a18957C30873H0458i9597l8259p2164I780h0884
19089a00382j27366A60746p8129c0158D3885a3972r0968A24953i6446L0366a2437
19077c33041R9797A03562a62716j25074G8369K58997g1335J7765j4885j67775
19067b36230d6626I7594c42614A08401a06060j85635J04706B2956Q2624b839A73600
19055a45513a5164d802p6918a0309C3389J04216a18915J2754A84990a57109c9458
19043a88210c576l0368B10542P3004I6549o074c40400A51912c30717b8271l26561
19032c54832E493K5153a91926M818a0818D2456K52309j44379K9523B3815b41054
19020a68006b4320E2816c979j49545A03859a46828b1621k13732f6821D32R4128
$$ y = [253092, 161461, 18422, 6660, 16140, -118957, 330873, 80458, -99597, -137856, -210020, 9780, -80884, -100382, -227748, 160746, 82617, -30158, 43885, -13972, -104940, 124953, -96446, -66080, -12437, -333041, -233244, 103562, -162716, -287790, 78369, 337366, -71335, -53570, -68455, -236230, -46626, 97594, -342614, 108401, -106060, -291695, -186989, 22956, 105580, -2839, 173600, -145513, -15164, -4802, -81720, -10309, 33389, 137605, -118915, -106161, 184990, -157109, -39458, -188210, -3576, -33944, 210542, 283546, 96549, 90475, -340400, 151912, -330717, -28271, -354832, 5493, 30646, -191926, -187108, -10818, 42456, 294765, 150386, 179909, 23815, -241054, -168006, -24320, 52816, -3979, -153524, 103859, -146828, -21621, -235353, -66821, 432, 94560]
19009I4560c26373A06826a35177p0409A28189F045b35188I5658H134a03146f785
18997a30531D3489p554J42620b60131p3181f685n2259o6008H9742L09782a36437
18985G4163b45498B43789f8667n1641F8790B5807b53946J16460J9148q0415d1715
18973c634k32188a11611k29122A2185b64229M6471C83722a75866f3226G2105J40395
18962B12500C9196A0048a0010C2347d1314k62850a40125j50506A31702b67439
18951a71692k7749C36920E4736b12079A22336a33668H4862A708J69379o9435g0316
18939a33029B48533F2676L5955a01476c6213A04016g9763K9149A00280c48297
18928b62878A09394b17612O5492c373J153B28872b32987N2392B5706b36225e6654
$$ y = [94560, -326373, 106826, -135177, -205586, 128189, 6045, -235188, 95658, 8134, -103146, -6785, -130531, 43489, 35935, 178555, -260131, -333312, -6685, -58944, -124952, 89742, 399524, -136437, 74163, -245498, 243789, -68667, -120308, 68790, 25807, -253946, -137486, -118338, -198753, -41715, -3634, -235822, -111611, -340733, 12185, -264229, -217758, 383722, -175866, -63226, 72105, 212500, 39196, 10048, -10010, 32347, -41314, -304164, -140125, -290631, 131702, -267439, -171692, -199441, 336920, 54736, -212079, 122336, -133668, 84862, 1708, 171087, 101652, -70316, -133029, 248533, 62676, 98631, -101476, -36213, 104016, -79763, -50614, 100280, -348297, -262878, 109394, -217612, -152120, -3373, -2220, 228872, -232987, -180595, 25706, -236225, -56654]
18916h4106d0656j45264e5134G736c9252D9016A0730M3346b70100A53139c31569
18904a68735A62106c20293A63584G2233i8855A67711a75371O9937k6006O0054
18894g1386j64397E4033c89009J78526J03064A34638D1308O1427b71012H1623
18883A14080B1303R130P4776a38345A19800b10564A7604J22823J36357g5431A25952
18871C5277d8126j64196A89445J9235C6908a15576a9765I6246d1449k35351K4594
18860b52206l2243j59209i2554c0654I5249B8058K22576f4467a3634l4140A92722
18848E5016o279j0913g2098k15121g9819b4570A03200D1088i0536l62826d7021
18836b21087O8678j33937G7678D169a57768d2950B75703I4309R1367N0489M7858
$$ y = [-84106, -40656, -185920, -55134, 7736, -39252, 49016, 10730, 54076, -270100, 153139, -331569, -168735, 162106, -320293, 163584, 72233, -98855, 167711, -175371, -105434, -131440, -71386, -235783, 54033, -389009, -210483, -107419, 134638, 41308, 102735, -271012, 81623, 114080, 21303, 30433, 105209, -138345, 119800, -210564, 17604, 140427, 276784, -75431, 125952, 35277, -48126, -212322, 189445, 208680, 36908, -115576, -19765, 96246, -41449, -276800, -252206, -284449, -443658, -92554, -30654, 95249, 28058, 250634, -64467, -13634, -47774, 192722, 55016, 48737, 37824, -72098, -287219, -79819, -24570, 103200, 41088, -90536, -453362, -47021, -221087, -152409, -286346, 77678, 4169, -157768, -42950, 275703, 94309, 185676, 236165, 284023]
18825B84023c69795b9339A81924c89025a78846B1540a80361E7592P0419g714p335
18814a5049d238D4462g9510j79743E542Q3326L1793D2425b38724j30933H5647
18802H4810B7904a11230A23778E3884M86201a32252a5847k91686A51099a83642
18791E1661h6950q0986A03447a18433b657A76244a53539j61480I0395a61670A05187
18779a00620q9340g6844A77956d24267f4204A67074l6000A2000b57997j01030
18769c59027B0065c14876B83880a21346A89926a88626g7077k0822B2835Q1843
18759A04678N3955e6649j01407F0285b57755G2220K41689d20722D0848b82626
18748h0094c0532C7875a784j54767A95579f5022I8591F197a16221A43854d4788
$$ y = [284023, -369795, -29339, 181924, -389025, -178846, 21540, -180361, 57592, 128011, -7714, -15049, -4238, 44462, -79510, -259253, 5542, 88868, 120661, 42425, -238724, -369657, 85647, 84810, 27904, -111230, 123778, 53884, 540085, -132252, -15847, -307533, 151099, -183642, 51661, -86950, -167936, 103447, -118433, -2657, 176244, -153539, -315019, 90395, -161670, 105187, -100620, -189960, -76844, 177956, -424267, -64204, 167074, 131074, 12000, -257997, -359027, 20065, -314876, 283880, -121346, 189926, -188626, -77077, -97899, 22835, 104678, 158633, -56649, -158056, 60285, -257755, 72220, 313909, -420722, 40848, -282626, -80094, -30532, 37875, -1784, -156551, 195579, -65022, 98591, 6197, -116221, 143854, -44788]
18736D9903a8301F9535J3083Q5563b04509K8341P593B2830b73961J00486c1127
18724D4582b52715j6129E6484b63429F4113a90279d6031m1098A27841N0982L283
18713A82106A4174d6885l0020A85190F7307f3792g410j56005C6757a32731p9005
18702b11736J2659j91331A07575b58658I8088a45691C74303H8398c16463g9653
18691a65633k02259q2828B2278a84422g2979L2774A68629c23238a16335C8915
18680F2364K19378P747a21724d2430j29746a5133k14782A61164n4510D8386c71122
18668A9658b24299p4014A74469J82429A14251a55930f4792B2583a95535q6940
18658b82475C74706b81599n6137M9825k98145G7288g4060B63042d53053J70942
$$ y = [49903, -18301, 69535, 82618, 168181, -204509, -176168, -168575, 22830, -273961, -173475, -31127, 44582, -252715, -268844, 56484, -263429, 64113, -190279, -46031, -87129, 127841, 178823, 182106, 14174, -46885, -76905, 185190, 67307, -63792, -7410, -163415, 36757, -132731, -211736, -199077, -390408, 107575, -258658, 98088, -145691, 374303, 88398, -316463, -79653, -165633, -367892, -450720, 22278, -184422, -72979, -40205, 168629, -323238, -116335, 38915, 62364, 281742, 289489, -121724, -42430, -172176, -15133, -229915, 161164, 106654, 48386, -371122, 19658, -224299, -298313, 174469, 356898, 114251, -155930, -64792, 22583, -195535, -282475, 374706, -281599, -337736, -287911, -586056, 77288, -74060, 263042, -453053, -282111]
18648b82111j53524J91225C4899b884p0963A35645a06040d9076k80467l1439a35540
18636f5181j58757A1433Q5859f1321C8799b82124a17043l5901B579h4550A30904
18624b10915f1440n8213B15947J07070o6084j22510b27191B29598E7029c1814
18613d1526j44625A51623j4844b94536F3442O7394n0934c45395a29276H5488a85314
18601D0893L19816r9454a34179d4038B16896N8725h6078B18108a70499N4399A07928
18589A17040J34204j15937a84903j92344B60676b23695A50976G0580b05919O1225
18579a44694E82220A26O0281b4398k16988B14091f7815l3531A8525a23008L4524
18568h8484r2910r548A4890L3173a95212d0222n3442A48452b31379I5339D84g4128
$$ y = [-282111, -435635, -244410, 34899, -2884, -73847, 135645, -106040, -49076, -329543, -360982, -135540, -65181, -223938, 11433, 97292, -61321, 38799, -282124, -117043, -152944, 2579, -84550, 130904, -210915, -61440, -119653, 215947, 323017, 256933, 134423, -227191, 229598, 57029, -31814, -41526, -186151, 151623, 136779, -294536, 63442, 130836, 79902, -345395, -129276, 85488, -185314, 40893, 360709, 261255, -134179, -44038, 216896, 275621, -86078, 218108, -170499, -116100, 107928, 117040, 251244, 135307, -184903, -377247, 260676, -223695, 150976, 70580, -205919, -144694, 582220, 126, 60407, -24398, -241386, 214091, -67815, -101346, 18525, -123008, -88484, -181394, -190942, 14890, 48063, -195212, -40222, -93664, 148452, -231379, 95339, 484, -74128]
18555f3672k13169a08669p5834n9712B5437a57794F313B412J85201b46435m7865
18544b94300e0915n6152L8201l9009j82355A39059a18769G1613b77291F7280a78716
18532A3294c63089a04427A44165B8486K1569a61143f8031A88661b13045j06220
18522c19265Q8473a9937C10688a23950j98381D2936J65789a73458G8334d12750
18511b07021h1738j40853D37625a28453A36140a74458l9224B05799m8624C9985
18500A01128P1279e66511I65a16213k7233C8206a9662D35664a95619A25600g8224
18488a98091h5694A60622a96258k5849O6431j02073a05416b5805R010k41763D7205
18476a34438k4320J6988A01254L9761c61658c5108F589e00248B5155a06159A82050
$$ y = [-63672, -276841, -108669, -184503, -244215, 25437, -157794, 6313, 2412, 187613, -246435, -294300, -50915, -107067, -68866, -107875, -290230, 139059, -118769, 71613, -277291, 67280, -178716, 13294, -363089, -104427, 144165, 28486, 50055, -161143, -68031, 188661, -213045, -319265, -230792, -19937, 310688, -123950, -322331, 42936, 208725, -173458, 78334, -412750, -207021, -81738, -222591, 437625, -128453, 136140, -174458, -213682, 205799, 157175, 39985, 101128, 172407, -566511, 965, -116213, -143446, 38206, -19662, 435664, -195619, 125600, -78224, -198091, -85694, 160622, -196258, -222107, -155676, -257749, -105416, -25805, -16795, -258558, 47205, -134438, -158758, -141770, 101254, 141015, -361658, -35108, 6589, -500248, 25155, -106159, 182050]
18464B5310b30438K902n3937Q7536C7497A0475b48825A80719d9080B27764q3376
18453A44388g5546j68990c6437C6505L425j7811b53144B14312a10989A28430e5707
18441i0665F6806c93222a9747j02223k66035J55831I6390j1918J12274f09l13719
18430c14328e5548F7163J12796m2511J13341A20211a2241l6546j27139L9444q342
18419a44824p563F9662i8900E3730c7401j42515l0458d6918j21674A54220a61722
18407b59838J19221C4293J80945l1447F934a18819C43988h8391J4215p3178A25389
18395a4406A02647c51653e3559E5149a52348A64814f8527j25873L5152j808C97712
18383b27733A83422a59660e7703A09343b82421B69193b33795A15239C6537O5075
$$ y = [25310, -230438, -227536, -281473, -193937, 37497, 10475, -248825, 180719, -49080, 227764, 144388, -75546, -244536, -36437, 36505, 39930, 22119, -253144, 214312, -110989, 128430, -55707, -90665, 66806, -393222, -19747, -121970, -388005, -232174, 96390, 84472, 196746, -609, -314328, -55548, 67163, 179959, 137448, 250789, 120211, -12241, -48787, -175926, -136482, -144824, -152387, 69662, -98900, 53730, -37401, -179916, -210374, -46918, -168592, 154220, -161722, -259838, -140617, 34293, 215238, 183791, 6934, -118819, 343988, -88391, -74176, -147354, 125389, -14406, 102647, -351653, -53559, 55149, -152348, 164814, -68527, -194400, -159248, -161056, 397712, -227733, 183422, -159660, -57703, 109343, -282421, 269193, -233795, 115239, 36537, 101612]
18373A01612i4282C687c22152J2658K8695f0708b8257B67068c31964A28752K8073
18362A56825b97993C39295A21118b38476b5882B1091L0099e1524I7461K8280a41507
18350A44060P8965I3041a19676A39847a08730j76025E15314b75496E9014i886
18339A32815D5673b36177C2516a43181G8473L5014g2126b2318l04859k3472A28481
18327a89569J1995D4119a4839l7459E570O4217f1404H217c37044G49g5828j10442
18315a86270O1713o2238F9395a67326O9161D5708c17577a2737n957j19798k647
18304a41139A76688m0347a02959k72112M6069C2323i717H9251A4675a95884j72599
18293c68483H5749C8343J74028h8666k3973K9158A4109g6018E0993A3409M37665
$$ y = [101612, -94282, 3687, -322152, -309494, -280799, -60708, -28257, 267068, -331964, 128752, 156825, -297993, 339295, 121118, -238476, -25882, 21091, 51190, -51524, 97461, 125741, -141507, 144060, 223025, 93041, -119676, 139847, -108730, -284755, 515314, -275496, 59014, -9886, 132815, 45673, -236177, 32516, -143181, 78473, 113487, -72126, -22318, -327177, -350649, 128481, -189569, -177574, 44119, -14839, -52298, 5570, 69787, -61404, 8217, -337044, 749, -75828, -186270, -124557, -186795, 69395, -167326, -98165, 45708, -317577, -12737, -18694, -138492, -141139, 176688, 136341, -102959, -375071, -329002, 32323, -9717, 89251, 14675, -195884, -368483, 85749, 38343, 212371, -88666, -112639, -83481, 14109, -76018, 50993, 13409, 451074]
18282D51074A40042a07712C9530c7074A21968a09049m0823g0196A71098k8376
18272A42722a43841j6358A19521C6566a95494L4566e543B59754C3970j6917f6561
18260i888A97972e5818j26816B10807B3610a34876A46640b86352a4801k59006
18250b73807H273f9246l6212j0717J7898A21778b09680B77985A08062b34624l16858
18239e51482b04410j93910C4189a16852B43272a90585J9297A97658a94031O290
18229a87741g3761F8582d30840c7899J5963k8088a0357j99497K6745E7203k7681
18218B9522h5807j04257j59435g9441A8143L0864D28b9774r7182I1989g3474C00138
18205D33044I8129d63473c5751f475m3749l66074H7396c66596b075j3067n08401
$$ y = [451074, 140042, -107712, 39530, -37074, 121968, -109049, -149872, -70196, 171098, 142722, -143841, -160199, 119521, 36566, -195494, -160928, -5543, 259754, 33970, 17053, -66561, -9888, 197972, -55818, -182634, 210807, 23610, -134876, 146640, -286352, -14801, -273807, 8273, -69246, -105458, -116175, -98277, 121778, -209680, 277985, 108062, -234624, -551482, -204410, -398320, 34189, -116852, 243272, -190585, -171288, 197658, -194031, -187741, -73761, 68582, -430840, -37899, -21936, -50024, -10357, -209854, -183109, 57203, 29522, -85807, -190064, -349499, -79441, 18143, 49007, 428, -29774, -126956, 91989, -73474, 300138, 433044, 98129, -463473, -35751, -6475, -50224, -416298, 87396, -366596, -2075, -15142, -523543]
18194e23543C67689a21432F77b83824a13991B75197D9628i6661E1818b74712d1588
18182a3387n8378B90741b52033h0288I8555D3009O6448K1615a52489d8752F9954
18170d83491a84751Q6194C2638b75746B62304H3865k8858B1450M5328a28513K1216
18159a07297j6555E4092K01645F0811a32494E2183P2465a01206H6857l3868f9434
18147B9804g5046K5768j585B10877I040O7793a7066A4901g1091B6716h184j61406
18135a69590G1363L5483K5225J07937c54567D11914c50064i5618k35469a31939
18124b56751B19826a58076A96523H3048a01115A93326E6984b35405A03565a20212
18113D8730R7932a25251M3895A30024c8869J8864m55390J08003B6740c71614J84333
$$ y = [-523543, 367689, -121432, 677, -283824, -113991, 275197, 49628, -96661, 51818, -274712, -41588, -13387, -71765, 290741, -252033, -80288, 98555, 43009, 109457, 131072, -152489, -48752, 69954, -483491, -184751, -98557, 32638, -275746, 262304, 83865, 55007, 21450, 66778, -128513, -107297, -123852, 54092, 255737, 60811, -132494, 52183, 124648, -101206, 86857, 52989, -69434, 29804, -75046, -49278, -50863, 210877, 9040, 76833, -17066, 14901, -71091, 26716, -8184, -169590, 71363, 106846, 132071, 240008, -354567, 411914, -350064, -95618, -331087, -131939, -256751, 219826, -158076, 196523, 83048, -101115, 193326, 56984, -235405, 103565, -120212, 48730, 146662, -125251, -81356, 130024, -38869, -20005, -475395, -367392, 26740, -371614, -187281]
18102a87281L0304A86756d7498I0955d39949a99092A4077O5168c1166G4183b07036
18090b98165B26974I1854J23800d2572j271j02553G1663Q7021p4858m780f3830
18078a11401j44942N1204B51544C4675J09997J71302f6519l5290c0911q9413p612
18067a27936j80754c3042k11850A65968m3922b9825C09938a29702o5262R6887
18057i8077n3370H8004a27697A67510a20115A22780d10223B53697d63018A98669
18046h254j45591E7420a16945A25346a9786m2112A19721C184a56423j37365a9492
18034d26929D0704d08538B53382b45344Q6162m5830i4703c0237j16865J1445j25937
18023b61594P9964L1654H1000O8328a67820I0882a39035I9071a28333I5896G572
$$ y = [-187281, -156977, 186756, -47498, 90955, -439949, -199092, 14077, 79245, -31166, 74183, -207036, -298165, 226974, 91854, 215654, -42572, -43843, -146396, 71663, 158684, 83826, 79046, -63830, -111401, -256343, -205139, 251544, 34675, 144672, 315974, -66519, -101809, -30911, -120324, -127936, -308690, -33042, -244892, 165968, 122046, -29825, 309938, -129702, -194964, -98077, -151447, 88004, -127697, 167510, -120115, 122780, -410223, 253697, -463018, 198669, -8254, -153845, 57420, -116945, 125346, -19786, -61898, 119721, 3184, -156423, -293788, -19492, -426929, 40704, -408538, 253382, -245344, -159182, -205012, -94703, -30237, -147102, -135657, -261594, -181630, -149976, 81000, 149328, -167820, 90882, -139035, 99071, -128333, 95896, 7572]
18011D8261e5506A03667D3161b11158O7135n552A66435G505K66100b68948A44908
17999A070a63010A92061b88732J9807A53263c0302J4800A2327a26531p8495Q9766
17988a15260A27828d3485A46488a0067A33383K74335a92761Q3278A4375a22347
17977i993D5604g1062k21131J15653J7280C585g1126D25192d13555B94533B6564
17965E0500K3606c0472C27672H2556K835l8340a70497k0669h2795C3481K861L33294
17953C69636f1930j88134l0415a26929L7073E6717a13206b6431A62426c4801n1773
17942h6574c8328C62449D7246d0892n408C6408L63652c17279c8993B38503E906
17930a72676D5562J4695b94265G0025b79649G4322B56a64347A1464K5479c54594
$$ y = [48261, -55506, 103667, 43161, -211158, -144023, -149575, 166435, 7505, 273605, -268948, 144908, 1070, -163010, 192061, -288732, -268925, 153263, -30302, -15502, 12327, -126531, -205026, -115260, 127828, -43485, 146488, -10067, 133383, 407718, -192761, -109483, 14375, -122347, -9993, 45604, -71062, -292193, -176540, -159260, 3585, -71126, 425192, -413555, 294533, 26564, 50500, 74106, -30472, 327672, 82556, 85391, 47051, -170497, -191166, -82795, 33481, 36342, 369636, -61930, -250064, -280479, -126929, -89856, 56717, -113206, -26431, 162426, -34801, -86574, -38328, 362449, 47246, -40892, -46300, 36408, 400060, -317279, -38993, 238503, 5906, -172676, 45562, 60257, -294265, 70025, -279649, 74322, 256, -164347, 11464, 36943, -354594]
17918a94782A23049J17614b42470p7081a37242M8819k5514c008j00941A62299
17907C3809b71558b5622j11970K1368H3068a44113B37721a73409G5621R6411C8916
17895A18947b14260O4699C37625A40017a07909q5739F9732O5964c62813F7960
17884b09339C2114N2326m0877a92622j6232H6145a73860I3209d440m7785H7931
17872D2555K151a48737E4281R8404a6821p8924B87960a77984L5045j60253O3563
17861b39629J00717c5888j49724k34830e2382k96433c4174R025C186a64340C5362
17849A18425C6248M670L24367C3887k98J41373h792k56145R1496f3104b6623B47663
17836E9712J21430c09397d6620D25305b48552B61955J06930j37912b36847A42622
$$ y = [-194782, 123049, 240663, -242470, -319551, -137242, -88423, -113937, -3008, -103949, 162299, 33809, -271558, -25622, -137592, -116224, 83068, -144113, 237721, -173409, 75621, 172032, 38916, 118947, -214260, -149561, 337625, 140017, -107909, -193648, 69732, 135696, -362813, 67960, -209339, 32114, 84440, 43563, -192622, -208854, 86145, -173860, 93209, -4440, -52225, 87931, 42555, 44706, -148737, 54281, 152685, -16821, -95745, 287960, -177984, -142939, -303192, -239629, -138912, -35888, -185612, -420442, -52382, -348815, -34174, -25149, 3186, -164340, 35362, 118425, 36248, 40918, 365285, 33887, 33589, 174962, -8792, -264937, -173441, -63104, -26623, 247663, 59712, 181142, -309397, -46620, 425305, -248552, 261955, 368885, 230973, -236847, 142622]
17825a17965j32535D786b3221C394b26733G6893c4187A8143a76711A45703a15072
17813b66762f9842p6364A542K59134p7075a22149e4321D4654j0819h8176B815
17801b16919G0710b03308O7552C88517c82134B06449a08240a0447c511B91519
17790A0464e3135C26292b33817R0030a4028F060a41898A8047a47368F177a79588
17778a17519A13919M5261c85263j14597g1353c5450B90772j26129a4652K584r3684
17767a05752B51633h879A66436D4712d2201k7040c3566B93433a18501B14752a29433
17755A40121d5244k07633d1667k48083A05415a77242B75570p3705g3408o4537
17745a37945H0409e4152j84313E3776h7689K0988K3497B8803l369J63098c7413
$$ y = [-117965, -250500, 4786, -23221, 3394, -226733, 76893, -34187, 18143, -176711, 145703, -115072, -266762, -69842, -146206, 1542, 260676, 183601, -122149, -54321, 44654, 33835, -88176, 2815, -216919, 70710, -203308, -135756, 388517, -382134, 206449, -108240, -10447, -3511, 291519, 10464, -53135, 326292, -233817, -143787, -14028, 6060, -141898, 18047, -147368, 6177, -179588, -117519, 113919, 159180, -385263, -499860, -71353, -35450, 290772, 164643, -14652, -12068, -105752, 251633, -8879, 166436, 44712, -42201, -69241, -33566, 293433, -118501, 214752, -129433, 140121, -45244, -252877, -41667, -289750, 105415, -177242, 275570, 201865, -73408, -137945, 80409, -54152, -238465, 53776, -87689, -66701, -43204, 28803, 25434, 188532, -37413]
17733a64629B8294J83342g491H7526P9563a49566e5879k6481C12715j42329D3739
17721B7362j1396A665J80360J9374a91556M0297A70311i8417d2610B10722J46820
17710C57542I900c65911B3528f7165j96857a19602A68657g5440M372C03730r321
17699B94409e0109I0816B7963b26095D03289a93624k0163B6029c91840D4545J9076
17688F3621d70361d5242C31128h2637o020A10284a04657J1273p4441F7621K50982
17677C18603F4534A6946c3844L939F5029d8710B12556r8646i3192m3864M9304
17666h7752j07376R4809B89556i3163D9693J47694E0451a69786h2489j13919e640
17654b4178k48005k73723A88488a46143C8724J34137n6749f1015o9741B08699
$$ y = [-164629, 28294, 211636, -7491, 87526, 167089, -149566, -55879, -82360, 312715, 170386, 43739, 27362, 15966, 1665, 182025, 201399, -191556, -151259, 170311, -98417, -42610, 210722, 357542, 9900, -365911, 23528, -67165, -264022, -119602, 168657, -75440, -71068, 303730, 294409, -50109, 90816, 27963, -226095, 403289, -193624, -213787, 26029, -391840, 44545, 63621, -470361, -45242, 331128, -82637, -88657, 110284, -104657, -93384, -167825, 67621, 318603, 64534, 16946, -33844, -29905, 65029, -48710, 212556, 113910, -93192, -137056, -87752, -195128, -100319, 289556, -93163, 49693, 197387, 50451, -169786, -82489, -196408, -5640, -24178, -272183, -545906, 188488, -146143, 38724, 172861, 116112, -61015, -130756, 208699]
17643A86145k6039b19986a07306j83427J16396g307j894k70357B10031C7416M3167
17632H0583J7289l933b01104g1220k028l66742J97989A32480a58904O2354B09800
17620C25749c8380o4590B0035P9453b79657B289c3213B27827H3015b14129D9901
17608A03427c6918j12483d4726q4363E5269Q0594F6086a59572J1777C33510o1537
17597B71973A1906h1932q5545B8772M51241B30749H0662o586a60275A72506f8299
17585b14890c0060o9908B0511a21386m2182E30361A38951c83058A01336l5384
17575F5952E844J92152F6314a05559k9983n8792j4736l5249C03491j28395D8622
17563C91408I4845C3491M1806K7843c1381C7167j0869a13985a2706A35282R2762
$$ y = [186145, 160106, -219986, -107306, -290733, -174337, -7307, -9201, -279558, 210031, 37416, 80583, 97872, 93939, -201104, -71220, -73248, -439990, -242001, 132480, -158904, -96550, 209800, 325749, -38380, -102970, 20035, 99488, -279657, 2289, -33213, 227827, 83015, -214129, 49901, 103427, -36918, -149401, -44726, -129089, 55269, 135863, 66086, -159572, -147795, 333510, 271973, 11906, -81932, -167477, 28772, 480013, 230749, 80662, 74076, -160275, 172506, -68299, -214890, -30060, -99968, 20511, -121386, -163568, 530361, 138951, -383058, 101336, 65952, 5844, 197996, 66314, -105559, -135542, -194334, -209070, -244319, 303491, 175096, 48622, 391408, 94845, 33491, 75297, 103140, -31381, 37167, 26298, -113985, -12706, 135282, 228044]
17552B28044c51561B14873g3254H9780d64680A83805a49487M4616K6055C01594
17541I7063K47589f91k9235l3135n5008A81267d53390E1680J97774j22044a62232
17529d1244m1224A26692C9521c1578A83301k4808N859c32211h8639c5301C57510
17517A76605a82613O3312A23305J55910a7274l3031K3320l07175D212a32508B48521
17505B26917b4806n2566j03340Q7018L4902C65352A09292a73255B35263j06225
17495A29038l5848j4808a00164C44027H437a1086o6773q6874C46088a17015L2759
17484h4256D32104A39409J75454j11565f5525B02516L40396a8343G211L2539a71066
17472d880A15949O4604K54368A62094Q2309J5947p9254d1572q9770A36897h1017
$$ y = [228044, -351561, 214873, -73254, 89780, -464680, 183805, -149487, -104871, -78816, 301594, 97063, 344652, -691, -29926, -63061, -118069, 181267, -453390, 51680, 249454, 127410, -162232, -41244, -82468, 126692, 39521, -31578, 183301, 158493, 164352, -332211, -88639, -35301, 357510, 176605, -182613, -119301, 123305, 279215, -17274, -50305, -26985, -334160, 4212, -132508, 248521, 226917, -24806, -77372, -180712, -93694, -58792, 365352, 109292, -173255, 235263, 129038, 93190, 78382, -100164, 344027, 8437, -11086, -77859, -164733, 346088, -117015, -84256, 432104, 139409, 314863, 203298, -65525, 202516, 542912, -18343, 7211, 39750, -171066, -4880, 115949, 180553, 434921, 162094, 244403, 260350, 181096, -41572, -131342, 136897, -81017]
17460A95834O5324C2146a8835B51410D775a83296d82A6349J22875E2059L64374
17449D16433b00667A15883L8996O7241c7026A25653A8436L37861N8761B2752a1278
17437B05313D8128K52116H8953A0816P8472c7736A3938J78388J04413J45820k14119
17426B28440P9650A47094K89745j54118k4588a50092A03357K30410p0938J23692
17416C86521F7396J57858K3945n2693P6226k3459a18101A04439b04677h2874C86923
17404g1765I1583J10016J501m5109K27008d5883C36222R2927A59990a14027A62620
17392B65K36900a90214O9651C41625j14874J12176J21550c8935A49899h7422A56708
17380I7273M04056A24954D5980K30126E3135K6625d0814C30229l5842H5488k6582
$$ y = [195834, 261158, 32146, -18835, 251410, 4775, -183296, -482, 16349, 139224, 52059, 416433, -200667, 115883, 154879, 222120, -37026, 125653, 18436, 356297, 415058, 22752, -11278, 205313, 48128, 300244, 88953, 10816, 89288, -37736, 13938, 192326, 296739, 442559, 228440, 308090, 147094, 436839, 282721, 258133, -150092, 103357, 333767, 262829, 386521, 67396, 225254, 249199, 196506, 272732, 249273, -118101, 104439, -204677, -82874, 386923, -71765, 91583, 201599, 203100, 157991, 384999, -45883, 336222, 429149, 159990, -114027, 162620, 265, 237165, -190214, -120563, 341625, 226751, 338927, 460477, -38935, 149899, -87422, 156708, 97273, 501329, 124954, 45980, 276106, 53135, 79760, -40814, 330229, 294387, 85488, 58906]
17369E8906k7054O5778g1858D49373E71a33235I3480C0529G37K03289b7393l31229
17357c58622I2827B3499a28932B57838i679A27177J9953l1282b05329H5378a1037
17345A38352o2652J340K16785j38564C0700A3000a76083I8986a30494CJ2517P3424
17333H5944i834C34758a67780B65732A14388c20347A69874g5024A40575R8789
17323B39364K66507c62373a71352A99630b65248B2829a846D64096H9770a77189
17312A59911i552m3639A47717J56817j553j49687J08197d2688C3168R4076K12940
17301C40184F8193C490d4539A2146a88656A69452f6757A25282C2716M28054j63104
17290B97666j05804o7305D34g261E3565K50651A24073E0248J07575J07202n7585
$$ y = [58906, 31852, 97630, -71858, 449373, 571, -133235, 93480, 30529, 737, 204026, -27393, -358622, 92827, 23499, -128932, 257838, -9679, 127177, 147130, 115848, -205329, 85378, -11037, 138352, 75700, 77040, 293825, 155261, 30700, 13000, -176083, 98986, -130494, 3, 12520, 85944, -9834, 334758, -167780, 265732, 114388, -320347, 169874, -75024, 140575, 239364, 505871, -362373, -171352, 199630, -265248, 22829, -1846, 464096, 89770, -177189, 159911, -9552, -53191, 147717, 304534, 302981, 153294, 261491, -42688, 33168, 127244, 340184, 68193, 3490, -44539, 12146, -188656, 169452, -66757, 125282, 32716, 460770, 297666, 191862, 124557, 434, -7261, 53565, 304216, 124073, 50248, 157823, 265025, 207440]
17279B07440A1027b990j24660B41832E8677k6021b5618B65151E0128K46019I4431
17267b2921D3564N3027g3008B51323a13875C92172A94557J76594A6006L7498K12363
17256B65867p0797a93289c543B71867H030R4456J89668I4328K46346J37610E333
17244I1917a61241F7267e4336C11136Q7705A13530A6706M74539A03784c56428
17233A35403J31520e203l4129J1961C13144k3979j41421l4572J01544Q4112a10738
17221B28612E0728J77343K12594I7324L65364A49536Q7192a76777B67953q7324
17211A80629L288G1664k1278j8090K52043a18600M0007B98894g0667D57466j86952
17200B70514A4591L33481I1122P6308F4829K38096F7222g1821G27324A11320a24364
$$ y = [207440, 11027, -2990, -127650, 241832, 58677, 32656, -25618, 265151, 50128, 296147, 94431, -22921, 43564, 96591, -73008, 251323, -113875, 392172, 194557, 371151, 16006, 53504, 265867, 195070, -193289, -3543, 271867, 8030, 102486, 292154, 94328, 340674, 478284, 5333, 91917, -161241, 67267, -54336, 311136, 398841, 113530, 16706, 491245, 103784, -356428, 135403, 266923, -5203, -39332, -27371, 313144, 289165, 147744, 113172, 214716, 298828, -110738, 228612, 50728, 228071, 440665, 97324, 462688, 149536, 236728, -176777, 267953, 180629, 183917, 71664, 50386, 32296, 284339, -118600, -78593, 298894, -70667, 457466, 270514, 14591, 348072, 91122, 167430, 64829, 302925, 67222, -71821, 727324, 111320, -124364]
17188H7934J95762K40297B00815k6390L9002J9134g8723A56490m1954J68039r5630
17177A86945n2004D1209M36322A34898J46071c07219E38781A89479k4636f097
17166B02071L3665A1250K88861R2897e2197B58772a13453D59302l0430j58718
17156B70154j2409j4576j04957J14109r7925M8461J26162q9680J6725J24778k6812
17145C54030b4467A08176K22408D0099K7234M12986B37198K46958G9356N17631
17135E96987k27803J43620j16266A92226K3459K2752O4189G3238N47270k25877
17125C94631j1207J75899B43187L48811B88640J57128k4545o1401j48455J84967
17115C96334j18301j07959J20842J03492d2877I8877L40899o7715r1207J46205
$$ y = [87934, 283696, 523993, 200815, 174425, 213427, 232561, -78723, 156490, 114536, 282575, 186945, 134941, 41209, 477531, 134898, 280969, -307219, 538781, 189479, 164843, -6097, 202071, 235736, 11250, 300111, 393008, -52197, 258772, -113453, 459302, 428872, 270154, 257745, 243169, 138212, 252321, 154396, 202857, 329019, 239339, 256064, 380842, 354030, -24467, 108176, 330584, 40099, 67333, 480319, 237198, 484156, 79356, 596987, 369184, 512804, 396538, 192226, 215685, 238437, 302626, 73238, 620508, 394631, 383424, 559323, 243187, 591998, 288640, 445768, 421223, 359822, 211367, 396334, 278033, 170074, 290916, 394408, -42877, 98877, 439776, 372061, 280854, 427059]
17105D27059B05608J24013j20100a32726A17808M56736A87724Q6422J71163j65831
17095B79478j16072M24485A35287K7597N06535k06243A99000J53503K87933j74401
17085D66035A61993L60018k00197k2552R0325c3699B64311M1651J88917K3914
17075E18793m7070j11802L13538j84617j28302J52788k03158L11491q9731k44529
17065B87401M19161N9256k05557A76072l4139K97549n3787r8949J38702m0096
17055C85352o158j37438J38085J63757j62935j70715M12804A22995J77145j28343
17045A71797M80592j75637K38796l47632J11050B29901C1530M07017J12357L758
17035E54662o8707j74500Q9243N775K01863j99245m9255J12940J1044L044J09947
$$ y = [427059, 205608, 329621, 209521, -132726, 117808, 574544, 187724, 274146, 445309, 279478, 163406, 587891, 135287, 162884, 669419, 463176, 199000, 352503, 640436, 466035, 161993, 522011, 321814, 299262, 389587, -33699, 264311, 305962, 494879, 518793, 471723, 359921, 673459, 488842, 360540, 513328, 310170, 621661, 531930, 287401, 706562, 765818, 560261, 176072, 141933, 439482, 385695, 286746, 425448, 385352, 379194, 241756, 379841, 543598, 380663, 209948, 622752, 122995, 300140, 171797, 652389, 476752, 715548, 367916, 478966, 229901, 31530, 438547, 550904, 554662, 485955, 311455, 400698, 406473, 608336, 409091, 359836, 472776, 483820, 486864, 596811]
17024E96811R2772B77825L22069r2702A48702N27924k13399L5812J94940k11537
17014D82442M73737k60423o3718Q7511r6000j56775Q9053J56560l0672k45877
17004D35838M158p7339L31021j53725j66331L41225J76253m42584J81669k5089
16994F05096j50074L49833K71794l38383j11754r0554j00915K33869q4015J85824
16984G70721J90408m01764L35035l951j15032k18723J80226L49400l32702J2462
16974G66080p2531K22585k59122K14851l82657L26756J86782n1916j68082J77672
16964I60418l54695Q2773J03208R1994l11954J01780L07543k94298j51753K77536
16954H12552o554L29982m43564L89955l50315J57024M0687m9033q5071Q5727L05764
$$ y = [596811, 689583, 277825, 599894, 507192, 148702, 676626, 463227, 499039, 693979, 482442, 956179, 695756, 632038, 719549, 623549, 466774, 555827, 712387, 681715, 435838, 439996, 362657, 693678, 539953, 373622, 714847, 891100, 448516, 630185, 605096, 455022, 804855, 1076649, 738266, 626512, 535958, 435043, 668912, 584897, 770721, 961129, 559365, 894400, 890449, 775417, 556694, 736920, 1086320, 753618, 766080, 693549, 916134, 657012, 871863, 489206, 815962, 1002744, 950828, 782746, 960418, 605723, 688496, 791704, 883698, 571744, 673524, 981067, 686769, 535016, 812552, 805998, 1135980, 692416, 1082371, 732056, 889080, 929767, 880734, 795663, 881390, 1187154]
16943A187154k92316J79608n4076N0479M9492P6841k1882j53438L02817k94022
16933A030657n9006J24863p9549k52030M1271L43355J68376n08336L99837k7154
16923A182284J15946l42392N78912l89706K91914j22675q0970j1039L01170n14961
16913A008483M26382k3536P7060l23538J75282k44817M52103j84064j71462M17980
16903A609873m42053K27808J01653k09450K35851N6010K6334j42842L35067j47487
16893A650764q5228J70999m07065K32493k761L11827k033m78282M69251k73166
16883A586799L42745j22716J77884J58220m52539K14186j39695J99889O5977j35666
16873A895084J62885J42557P0004k2625J22727k99050K79359k80318N18533n46823
$$ y = [1187154, 894838, 1074446, 1020370, 1070849, 1120341, 1197182, 1175300, 1021862, 1324679, 1030657, 971651, 1096514, 1016965, 764935, 806206, 1149561, 1317937, 809601, 1209438, 1182284, 1298230, 955838, 1534750, 1145044, 1436958, 1314283, 1233313, 1222274, 1523444, 1008483, 1434865, 1411329, 1488389, 1164851, 1340133, 1095316, 1547419, 1363355, 1191893, 1609873, 1167820, 1395628, 1497281, 1287831, 1523682, 1579692, 1606026, 1463184, 1798251, 1650764, 1565536, 1736535, 1329470, 1561963, 1559202, 1871029, 1868996, 1390714, 1859965, 1586799, 1929544, 1806828, 1984712, 2142932, 1690393, 1904579, 1764884, 1964773, 2030750, 1895084, 2057969, 2200526, 2270530, 2247905, 2370632, 2071582, 2350941, 2070623, 2589156, 2042333]
16863B042333J83761L29154J06390o8528J92040j05126k3933n9456K70818k45535
16853B621918K18530o714k6449K86767k7973j17183k04648M65096k05470J47617
16843C151491K33839Q8389j51093K18511j35855n0383J72776K59533j08652l01679
16833C376877N84168j85443N88651m37577J22596J72940J99809l39300L15477
16824D398198L18989j78255Q2710j37796K81818N98910l82151J87021K4548L148
16814E197140N45831j71611L26413J04617M9803j18551j18568M93869K37894J2600
16804F559437L78856q3400M62272R5686j47622M05679K60020O762K70172L00014
16794H507876j76092J53536M46149M8403O79496L89238K16183K27514L04931j16801
$$ y = [2042333, 2226094, 2555248, 2661638, 2593110, 2785150, 2680024, 2656091, 2596635, 2867453, 2621918, 2840448, 2833734, 2807285, 3094052, 3066079, 2948896, 2744248, 3209344, 3003874, 3151491, 3385330, 3473719, 3322626, 3541137, 3405282, 3354899, 3527675, 3787208, 3678556, 3376877, 3961045, 3775602, 4364253, 3926676, 4049272, 4222212, 4422021, 4082721, 4398198, 4717187, 4538932, 4621642, 4483846, 4765664, 5364574, 4982423, 5169444, 5193992, 5197140, 5742971, 5571360, 5897773, 6002390, 6052193, 5933642, 5815074, 6308943, 6546837, 6559437, 6938293, 6854893, 7317165, 7412851, 7265229, 7670908, 7930928, 7937690, 8207862, 8507876, 8331784, 8485320, 8931469, 8979872, 9659368, 10048606, 10264789, 10492303, 10797234, 10680433]
16784A0680433Q22497J40084O3163N48359L79490M00015J97478O25426L90801
16775A4247746M57807J70773Q63904K95976O67099O94038O74763N5091R70337
16766A9097534R40109N21905P36963J046137Q90106J181842Q83849N55866J218890
16757B7073201J114380J670840R09164J802724J649247J146997J891294K047233
16749C9305080J672559K332296K181843K191685K467599K775131K972792L343120
16741E9242105L178098L404443M402494L747001M782504M650966N135635N881535
16733I4424781N735607O063608O539328O634291P172972P463204P318164P594871
16725A48946826P155646P603827O860263O262270N560951M747621L766299J989579
$$ y = [10680433, 11502930, 11643014, 11706177, 12254536, 12634026, 13034041, 13231519, 13856945, 14247746, 14705553, 14876326, 15740230, 16036206, 16703305, 17397343, 18072106, 18127197, 19097534, 20037643, 20559548, 21296511, 22342648, 23232754, 24414596, 25298445, 25854311, 27073201, 28187581, 29858421, 30767585, 32570309, 34219556, 35366553, 37257847, 39305080, 40977639, 43309935, 45491778, 47683463, 50151062, 52926193, 55898985, 59242105, 62420203, 65824646, 70227140, 73974141, 78756645, 83407611, 88543246, 94424781, 100160388, 106223996, 112763324, 119397615, 126570587, 134033791, 141351955, 148946826, 156102472, 163706299, 170566562, 176828832, 182389783, 187137404, 190903703, 192893282]
16717A92893282J507979j76375j491992k785549m125260m768359o223572o494998
16709A68335156o976409p353857p787955p507281p598950p229322p135877o884275
16701A09861230o244405o402411o036197n194152m863141m810738m335666m551347
16693F7423173l455513l651485l481067l112797k852969k592667k400223k413100
16685D3463352j994253j998457k059015j585288j705541j470520j370720j494983
16677B9784575j121107j689162j180915o89958j393000o97408p43675q98566p52468
16668B0618316q41672r24036m97838o60587q29396l60553n28176o52759o50062
16659A4673237j98578n80070l69497l57412k58363m63290j24937n94535m80731
$$ y = [192893282, 194401261, 194224886, 192732894, 189947345, 185822085, 181053726, 174830154, 168335156, 161358747, 154004890, 146216935, 138709654, 131110704, 123881382, 116745505, 109861230, 103616825, 97214414, 91178217, 85984065, 81120924, 76310186, 71974520, 67423173, 63967660, 60316175, 56835108, 53722311, 50869342, 48276675, 45876452, 43463352, 41469099, 39470642, 37411627, 35826339, 34120798, 32650278, 31279558, 29784575, 28663468, 26974306, 25793391, 25103433, 23710433, 23013025, 22269350, 21370784, 20618316, 19776644, 18852608, 18354770, 17694183, 16864787, 16504234, 15976058, 15323299, 14673237, 14474659, 13894589, 13525092, 13167680, 12909317, 12446027, 12321090, 11726555, 11245824]
16650A1245824j68613n73529j91159J4574o57190k31728o33l69958k53162j66096
16640H648330l55411J03364m41761n48515j19491L18077m20738p9768n03166Q9991
16630F690912k7415m95855L19356m14983l7032k14076P5458l61050k08600J52236
16620E478951j01425j94024K9699j01698R5211l60320j12717j96534J75082l35806
16610D376419J88361j53098M4661j39407k45892P1381j58106l03437J81769q7899
16600C774752l3738l34042L3269L61489m03980J5759m1586j15768j8916j24235
16590C113004p4666n7396R3552p9473j31879q2318o9366J87888j51741m34863
16580B312742M02756Q8924j54290j21333m4655J61063l44602K66673J06619l65886
$$ y = [11245824, 11077211, 10503682, 10312523, 10327097, 9669907, 9438179, 9437546, 9067588, 8814426, 8648330, 8292919, 8396283, 7954522, 7406007, 7286516, 7604593, 7183855, 7104087, 6600921, 6690912, 6663497, 6167642, 6486998, 6072015, 6034983, 5820907, 5896365, 5535315, 5326715, 5478951, 5377526, 5183502, 5213201, 5111503, 5206714, 4846394, 4733677, 4537143, 4712225, 4376419, 4564780, 4411682, 4456343, 4316936, 4071044, 4142425, 3984319, 3680882, 3862651, 3774752, 3741014, 3406972, 3440241, 3801730, 3397750, 3413509, 3371923, 3256155, 3237239, 3113004, 3038338, 2980942, 3074494, 2995021, 2863142, 2780824, 2711458, 2899346, 2747605, 2312742, 2715498, 2804422, 2650132, 2528799, 2484144, 2645207, 2300605, 2567278, 2673897, 2308011]
16570B308011j80654K98958m44530o3050L33220K12232n04446M43368l26608k5446
16560B051055R0927M2964j97309J36630k58554r1063J12673k17344J20773j8514
16550A772238L76301n47441K04721M6862m1299p0685j3863l34729L93344j24017
16540A661432q0261r5771o9216j26754L47000m04539L09156M1156L5782k42485
16530A375500j19567J82657q228k58191k34024O47141l37252q2018j25731M30917
16520A471204k70992p9415l3520K44891l31924m110Q9130J83132j54326J19634
16510A233704Q5239j44922j11574N139J41126M6486k27158L5717m2977l0115j45602
16499H45063M08865l94522O0529j32407O2458M6123K40011j89495O1846k30063
$$ y = [2308011, 2127357, 2426315, 1981785, 1918735, 2251955, 2464187, 1959741, 2403109, 2076501, 2051055, 2141982, 2184946, 1987637, 2124267, 1865713, 1774650, 1887323, 1669979, 1790752, 1772238, 2148539, 1601098, 1805819, 1852681, 1811382, 1740697, 1726834, 1392105, 1785449, 1661432, 1581171, 1485400, 1416184, 1289430, 1636430, 1231891, 1541047, 1582203, 1617985, 1375500, 1255933, 1438590, 1430362, 1172171, 938147, 1585288, 1248036, 1166018, 1040287, 1471204, 1200212, 1120797, 1087277, 1332168, 1000244, 996134, 1085264, 1268396, 1114070, 1233704, 1318943, 1174021, 1062447, 1067586, 1208712, 1255198, 1028040, 1063757, 1020780, 990665, 845063, 1253928, 859406, 919935, 787528, 849986, 896109, 1136120, 946625, 1008471, 778408]
16489G78408N39563o33107K74581N5097k05150L35384j47409R0855E31031L02972
16479H34003Q9308k41569P3066j56173L22796K54965n9620l2094k8059j19392
16469I37231l09380K39374J8580j70624r7761r7097J95734B31313O63631K04156
16459A099100l38085k75621M8090J82408o6903K85999C57935K39497J92795N9116
16449H49343l43015K00544J41541R6288l59861K2645m9698J36297j3758R8355
16439G78681k66110R8074J06834k38k18591M65252k75483j82593N2689j20183
16429D38332L50368l13885L4837K41490j57254B59353L22155K03920k77681j22557
16419C85190K30827k79510K87964N7795J80069l96745K77158k77402J60295A77978
$$ y = [778408, 1317971, 684864, 959445, 1014542, 809392, 1144776, 997367, 1088222, 531031, 834003, 923311, 681742, 754808, 598635, 921431, 1176396, 1116776, 1084682, 1056623, 937231, 627851, 867225, 885805, 715181, 617420, 520323, 716057, 231313, 894944, 1099100, 761015, 485394, 533484, 715892, 648989, 934988, 357935, 597432, 790227, 849343, 506328, 706872, 848413, 944701, 584840, 607485, 557787, 694084, 680326, 778681, 512571, 610645, 717479, 717241, 498650, 963902, 688419, 505826, 558515, 438332, 788700, 474815, 509652, 751142, 593888, 259353, 581508, 785428, 507747, 385190, 616017, 336507, 624471, 682266, 862335, 465590, 742748, 465346, 625641, 177978]
16408F35147K66687B68939j1677K35829k40972O39654D4646M04664J56038k62108
16398C43240M0484J7840J3601j27540L5311j35757K61302o0959m8673M51765k00337
16387E90277k61975J64231q5847I4740K94729A54554P3964K3160L74667j94042
16377D32303q7230M24262G2465L32538M8397j11108j14500q6563J77410q0234
16367B38405J09231m8554K92403o1979j80021D0933J29216P7313J14921J65176
16357E27559q8946A67646L42143k45050J52022j41418j19097F0637N58687B91718
16346B57999j1134A22841K69794r9988a25414A7098J60798K86330H3456D058L53884
16335C57942J44840A77531K3388J43364j34907P8537Q2840R6618j97526j2857
$$ y = [635147, 901834, 268939, 257262, 493091, 252119, 891773, 44646, 449310, 605348, 343240, 383724, 401564, 415165, 287625, 322936, 187179, 448481, 387522, 338849, 790614, 590277, 328302, 492533, 406686, 94740, 389469, 154554, 228518, 251678, 626345, 432303, 345073, 769335, 72465, 405003, 453400, 342292, 227792, 141229, 318639, 238405, 347636, 299082, 591485, 529506, 349485, 40933, 170149, 247462, 362383, 527559, 438613, 167646, 509789, 264739, 416761, 275343, 156246, 60637, 619324, 291718, 257999, 246865, 122841, 392635, 292647, -125414, 17098, 177896, 464226, 83456, 4058, 357942, 502782, 177531, 200919, 344283, 209376, 287913, 370753, 467371, 269845, 256988]
16325B56988E7992J30375K28445j65267o5282J03128H1996J47530k2742a32176
16314E46625R31n5209A88525K37808E8258J56934K08716j79291j18696K45221
16304C71142a58600A52082M03734G9037L57784J29697j61434F7033L4621J69801
16294B71455A17894a02505D2080J90797K98158r5054n2413h7008C83381j23553
16284B59828p8912q4241h072A23765K34037j03729l3876O8795l8536l0511j07033
16273A12912l676g3492b2963B99896a44910B85553J38171A53054k7171J42727
16263B68610H2708k1893H647M99321m6912A25927J98821G0391P712L12852I3432
16251D05033j87257p7071K36227j03381J11810k2611j0837A19740K81416A92229
$$ y = [256988, 57992, 188367, 416812, 251545, 186263, 289391, 81996, 229526, 206784, -132176, 546625, 547556, 492347, 188525, 426333, 58258, 215192, 423908, 244617, 125921, 371142, -158600, 152082, 555816, 79037, 436821, 566518, 405084, 67033, 101654, 271455, 117894, -102505, 42080, 232877, 531035, 435981, 383568, -87008, 383381, 259828, 180916, 96675, -8072, 123765, 357802, 254073, 220197, 288992, 250456, 219945, 112912, 109236, -73492, -22963, 299896, -144910, 285553, 423724, 153054, 125883, 268610, 82708, 60815, 8647, 507968, 461056, 125927, 324748, 70391, 78103, 390955, 93432, 405033, 217776, 140705, 376932, 273551, 385361, 362750, 351913, 119740, 401156, 192229]
16240A47166a13825E4128a7576B8364J45316K54526A06388l7107J54838a01543
16229A62942g8910k0499B67076n6420B5588K4211b92477A07704C7429M4384L60674
16218D42487j69794i2441A63382f9579K2256D4908L1926N6361k2208K34110i1317
16206B54020I5986b8732a0555j3872Q769j4421B43202G7151P9702k6573q780B3749
16193b0824A71814F4405J94663c030B26779O4383j35296K31420a0392j59577Q3663
16182h6306B11591a70419A29918M9503N2058o2553a97155C13706I6289e450j32546
16171a37996C25374G3450f2246J9518C03646a05023B270b6485B25790a02142j02283
16160b04425A7842J42166B7179j0328a06975o4827D1612A0217O9507g3198A66512
$$ y = [147166, -113825, 54128, -17576, 28364, 173680, 428206, 106388, 69281, 224119, -101543, 162942, -78910, -99409, 267076, 210656, 25588, 49799, -292477, 107704, 37429, 81813, 442487, 272693, -92441, 163382, -69579, -47323, 44908, 76834, 133195, 110987, 345097, -91317, 254020, 95986, -28732, -10555, -24427, -15658, -30079, 243202, 77151, 156853, 130280, 121500, 23749, -20824, 171814, 64405, 259068, -3030, 226779, 291162, 155866, 387286, -10392, -169969, -86306, 211591, -170419, 129918, 179421, 231479, 168926, -197155, 313706, 96289, -5450, -137996, 325374, 73450, -62246, -42728, 303646, -105023, 2270, -26485, 225790, -102142, -204425, 17842, 160008, 27179, 16851, -106975, -171802, 41612, 10217, 79724, -73198, 166512]
16148H1176b86322B13537a50271B20028G9242J95181a78475H2819J55066a18929
16137B00820P4022p480L5933C1182h0677B18070f2337P968I9376J37461J34934
16126C71771h773j32352f1304B00316a73593B0084b215k00777A54789b8657A16427
16114B06174N0954J36397a06869H3355P4902a7347J016I8678J05691a5844A12947
16102A15523K42760H840L28536d5060C29233A55500a62881e9073A05608J3424
16092A19032B4123a15891H5380a61672H8333b25387I3230a05022H3185N0305L67973
16081E01463B44556b4043A7078b57532a1321j4507D9012L7669P886J73225b50096
16069A15618C1173e706j14195C4863K75485c01895B57336H9755a40846L1428B9195
$$ y = [81176, -286322, 213537, -150271, 220028, 79242, 274423, -178475, 82819, 237885, -118929, 200820, 274842, 267362, 303295, 31182, -80677, 218070, -62337, -54369, 99376, 236837, 371771, -8773, -141125, -61304, 200316, -173593, 20084, -2215, -202992, 154789, -28657, 116427, 206174, 257128, 393525, -106869, 83355, 158257, -17347, -16331, 98678, 204369, -15844, 112947, 115523, 358283, 8840, 337376, -45060, 329233, 155500, -162881, -59073, 105608, 119032, 24123, -115891, 85380, -161672, 88333, -225387, 93230, -105022, 83185, 133490, 501463, 244556, -24043, 17078, -257532, -11321, -25828, 49012, 86681, 94567, 267792, -250096, 115618, 31173, -5706, -119901, 34863, 310348, -301895, 257336, 89755, -140846, -109418, 29195]
16057A559J46152C696d0810C78625A43086P2608c9396C18904b4130A68734R871
16046A78605a6537G2746c18271J19195R2154C556a6386A16851A9882a05307G258
16034c02720G1444j3339b18275B42066h4463A44086A500a55468d504A03969b941
16022g8649c4106j29365A07480a35984A0166a90582D085i431A10906K13761D0761
16010g0975A01133b9917l82111d253j22069G4364J71770C9270J58401q588b7818
15998b87061B71939n8941j6602c23389e5942p7163C11325c5847C303L26793e0194
15986A71781l0561b62501G2726P7945K91898f371A95792a91077H4865b51464i7136
15974c34929J48733m0264H2731A0691b3997A0180K15638J156N2804O0413A27670
$$ y = [1559, 147711, 3696, -40810, 378625, 143086, 215694, -39396, 318904, -24130, 168734, 178605, -16537, 72746, -318271, -199076, -106922, 3556, -16386, 116851, 19882, -105307, 7258, -302720, 71444, 58105, -218275, 242066, -84463, 144086, 1500, -155468, -4504, 103969, -2941, -78649, -34106, -163471, 107480, -135984, 10166, -190582, 4085, -9431, 110906, 324667, 40761, -70975, 101133, -29917, -412028, -4253, -126322, 74364, 246134, 39270, 197671, 189083, -27818, -287061, 271939, 212998, 196396, -323389, -55942, -133105, 311325, -35847, 3303, 330096, -50194, 171781, 141220, -262501, 72726, 150671, 442569, -6371, 195792, -191077, 84865, -251464, -97136, -334929, -186196, -226460, 82731, 10691, -23997, 10180, 225818, 226974, 279778, 340191, 127670]
15962d9022F4606i11H705a56397b2678j40385h1501p0334L6741m5965B49143a62028
15949a19555G3463J68789J51831a74481P9673L3120n4996e6281j3260A08197B6912
15937e6608j2940A67783H2429K06446j36858D0790a09728R404M4973J2170J3385
15926b9796n9899P823p3126A39323C7018K2206i4643r6410a847k97061o6140A72753
15913D7934f6436J9272l82083f0409A82244e5397E106b09136B14943a342k6173
15902b7515p0825n9929B7116B538a92456M0795A5742J5246b1346A91397f0976
15890B02279o9671c02869a13211o758B30232d8171n4320A25655b8983H5476b01036
15878b01011m3482a01987j35061b4970k95498c5495G2900a0618A40951b88106
$$ y = [-49022, 64606, -911, 8705, -156397, -22678, -163063, -81501, -151835, -115094, -161059, 249143, -162028, -119555, 73463, 242252, 394083, -174481, -94808, -61688, -116684, -56281, -69541, 108197, 26912, -56608, -69548, 167783, 82429, 288875, 152017, 40790, -109728, -100324, -55351, -43181, -29796, -89695, -81872, -154998, 139323, 37018, 59224, -94643, -191053, -1847, -298908, -365048, 172753, 47934, -66436, -47164, -429247, -60409, 182244, -55397, 5106, -209136, 214943, -1342, -27515, -98340, -158269, 27116, 2538, -192456, -151661, 15742, 30988, -21346, 191397, -60976, 202279, 132608, -302869, -113211, -119969, 230232, -48171, -102491, 125655, -28983, 85476, -201036, -201011, -244493, -101987, -237048, -24970, -320468, -35495, 72900, -10618, 140951, -288106]
15867a8411g62l26034D2413a76308g4749B5983R5913b67302H5293b45885a08706
15855a66111A8810N67472b16658D4755a56258L0378B06887d3966A56458l9864
15845A16594d34476a57550f9167o9979c88m40843J97017F2207c01524C57566A37439
15833A44482b10668d4045j31226A84271a69452O277K0520d6853k99956A14221
15822c76795A82044D5504e6651F6062J0221b96800J09162F7514d9530E4406b95004
15810D9336a42178A66577d76958B60258F4376A4111J5887c2390j27441n4001b1769
15798a2393A39476b19307P2472b7933j5740n7048j31324H2999a07203a3875D2849
15786A27093G211i1246n0628B05480c93020O7829A54867G0469a56637k8279A48038
$$ y = [-18411, -762, -326796, 42413, -176308, -74749, 25983, 121896, -267302, 85293, -245885, -108706, -166111, 18810, 586282, -216658, 44755, -156258, -125880, 206887, -43966, 156458, 116594, -434476, -157550, -69167, -139146, -388, -441231, -244214, 62207, -301524, 357566, 137439, 144482, -210668, -44045, -175271, 184271, -169452, -163175, -142655, -46853, -346809, 114221, -376795, 182044, 45504, -56651, 66062, 76283, -296800, -187638, 67514, -49530, 54406, -295004, 49336, -142178, 166577, -476958, 260258, 64376, 14111, 29998, -32390, -159831, -213832, -21769, -12393, 139476, -219307, -146835, -27933, -43673, -100721, -232045, 82999, -107203, -13875, 42849, 127093, 7211, -91246, -141874, 205480, -393020, -325191, 154867, 70469, -156637, -184916, 148038]
15774b83482P4222D17923a18281a0949j24377B09906e7410B20624c14614g4880
15763b63529h5820b4634j084b161l03052B00879l7080R1415D5490c5902I1255
15751A71700F5819B9711K05109f0150j83697L5662B90370n7554C8102M6215c19140
15739E5629g0606A88563b24283c2408l76569B63887g9387b6723A24563L6572a23349
15727B750K09897l2163a15770E2398c32425D1852e946H4514b99390J03818N7212
15716a38360M3068L4682j33121j45239A829c0798r1431A7891a83385K6020E35022
15704A25182G318M6066O2069R9119a27478C41785a50482M3616j0272C2610K75034
15693C07644b35621B10957h9458C23198j19901l8628p2233K1168i974l39153R0986
$$ y = [-283482, -209260, 417923, -118281, -10949, -135326, 209906, -57410, 220624, -314614, -74880, -263529, -85820, -24634, -25718, -2161, -305213, 200879, 163799, 255214, 45490, -35902, 91255, 171700, 65819, 29711, 234820, -60150, -243847, -208185, 290370, 232816, 38102, 84317, -319140, 55629, -70606, 188563, -224283, -32408, -408977, 263887, -79387, -26723, 124563, 161135, -123349, 2750, 212647, 180484, -115770, 52398, -332425, 41852, -5946, 84514, -299390, -195572, -138360, -95292, -60610, -193731, -338970, 1829, -30798, -122229, 17891, -183385, -157365, 535022, 125182, 7318, 53384, 115453, 214572, -127478, 341785, -150482, -106866, -117138, 32610, 307644, -235621, 210957, -89458, 323198, 203297, 164669, 92436, 113604, -9974, -349127, -258141]
15682b58141C9486K22031b56821c2622H7494d4646E0328h2626b8032D5123b71768
15670A30242f1659A61573a85057Q8059B9438a08265r0096e6423l26593d4478k41543
15659b86021h2889J7473C8923a96985L2194G1305K1053a52196k75034A26711d1684
15647h1576H4027l2178d45219a85934h280j17475A07719M470a66475G0984c82816
15635b43540A5505K48632M1670e3542F3423a92908j26772C9618d9028k2931L3732
15624c8227D0806a09596H3350J68909P569j02487a21490A64991p6736c1072j31422
15613a62494q1606C72519a37399A7846h4557a772A85e1370r5975p5786A5902b03891
15600b66568A13613R5270H8565D3071O0527a47997A43862b23917L5572C6813b63602
$$ y = [-258141, 39486, 261517, -256821, -32622, 87494, -44646, 50328, -82626, -28032, 45123, -271768, 130242, -61659, 161573, -185057, -96998, 29438, -108265, -198361, -56423, -383016, -44478, -286021, -82889, -65416, 38923, -196985, -164791, 71305, 92358, -152196, -427230, 126711, -41684, -81576, 84027, 51849, -445219, -185934, -8280, -125755, 107719, 112189, -166475, 70984, -382816, -243540, 15505, 264137, 305807, -53542, 63423, -192908, -319680, 39618, -49028, -71959, -38227, 40806, -109596, 83350, 252259, 259828, 157341, -121490, 164991, 88255, -31072, -162494, -244100, 372519, -137399, 17846, -84557, -1772, 185, -51370, -147345, -223131, 15902, -203891, -266568, 113613, 208883, 88565, 43071, 103598, -147997, 143862, -223917, -188345, 36813, -263602]
15588b27713I8505a12811C1262J37397F7614a35150d0231A08126a60219a1104
15577B034J2845d4763E4570J19123N6300a83855j8745B13825d2979B46487a60780
15565A318L12017a90211n4271J06255C00516g9197B28684b19839e9309C8332c11601
15553A1837h3037q4334o4893B4010a0222B73987b80317F4962g550q8600C30502
15541b50874H4230c5554m2677a6192C71181a01495m6253c9381j79102D8979i4652
15529f655j32819B45583o2105F8420L2227e04908B87006p2185c54970B44663a05348
15517b6528j12058N1336B0898M7422k9692P1722i4667F1207k9832b1336j13642
15506a34978B03945D4308J4363a14413r3418k28696J69323h8982g403j68815h2565
$$ y = [-227713, 98505, -112811, 31262, 168659, 67614, -135150, -40231, 108126, -160219, -11104, 2034, 14879, -44763, 54570, 173693, 229993, -183855, -202600, 213825, -42979, 246487, -160780, 1318, 313335, -190211, -244482, -138227, 300516, -79197, 228684, -219839, -59309, 38332, -311601, 11837, -83037, -167371, -232264, 24010, -10222, 273987, -280317, 64962, -7550, -96150, 330502, -250874, 84230, -35554, -78231, -16192, 371181, -101495, -147748, -39381, -218483, 48979, -94652, -6655, -139474, 245583, 183478, 68420, 100647, -504908, 287006, 214821, -354970, 244663, -105348, -26528, -138586, -87250, 20898, 68320, 38628, 110350, -94667, 61207, 31375, -21336, -134978, 203945, 44308, 58671, -114413, -207831, -436527, -267204, -88982, -7403, -176218, -82565]
15494a14505C8159b75339P9047d3084m8460k01353c9561j45515B00313E3453a52606
15482a45501B09645E6793J16664h8782k8995M9716C07028P4617I1446b73485J11959
15471a61526C01310A08729Q6915d7292r6446b3551B35828q1871K5783a03404m0974
15460a44378C96631E1772L4296a1664A42428n8643l0195c15754a13329k86888
15450d00217A28259h169o03601F0267h3453j2167j25592O3053M9236B06448l4559
15439A71889o047a07430B3548b53270e7335j9391b654k87216A27920J1526b28018
15427H2603j9593a38745n5678B47057b04783K222d4619D3213a35817A86131n5424
15416A30707K7461m1592a59387p2271A12191P9048I926b51309E610K4559b86228
$$ y = [-114505, 38159, -275339, -196292, -43084, -91544, -292897, -39561, -185076, 200313, 53453, -152606, -145501, 209645, 56793, 173457, -88782, -117777, -68061, 307028, 381645, 91446, -273485, -161526, 301310, 108729, 195644, -47292, -143738, -23551, 235828, 153957, 179740, -103404, -144378, 396631, 51772, 86068, -11664, 142428, 83785, 53590, -315754, -113329, -400217, 128259, -8169, -611770, 60267, -83453, -95620, -221212, -158159, -108923, 206448, 171889, 165842, -107430, 23548, -253270, -57335, -76726, -2654, -289870, 127920, 139446, -228018, 82603, 63010, -138745, -194423, 247057, -204783, -202561, -44619, 43213, -135817, 186131, 130707, 158168, 116576, -159387, -231658, 112191, 191239, 9926, -251309, 5610, 30169, -286228]
15404c86988A01627Q1213K6209b54757J03863d3507M521A70133a57206N7463r9096
15393a98839L5584k3537b689I7370j084L8947b5184J096o6712A32559J07141g1030
15380A70235a7534c297k85265f3170k7390k35886f5354L0997A38688i7713K6406
15369g1307j4227A0106a33141G7584b24810k22898c3810j89907k3152l0774J19197
15358a58446A52000i9761A13494b6983k03626b8537H8016c96519e8750j84I3974
15346A19245K2771c2338H1363J00445O775a75895C42881H4298M0159l8123a86342
15334B79275a24848L5893C63966A07722h2725G589k13c9664l4396a959F1418j4297
15322D7121L29484c64786F5916b57820d806B13648b5899j31495D4642Q6694J40538
$$ y = [-386988, 101627, 182840, 209049, -254757, -150894, -43507, -38986, 170133, -157206, -99743, -198839, -163255, -186792, -2689, 97370, 96286, 135233, -25184, -24088, -90800, 132559, 239700, -71030, 170235, -17534, -3297, -288562, -63170, -90560, -326446, -65354, -34357, 138688, -97713, -71307, -85534, 10106, -133141, 77584, -224810, -447708, -33810, -223717, -246869, -277643, -158446, 152000, -99761, 113494, -26983, -230609, -28537, 88016, -396519, -58750, -58934, 93974, 119245, 142016, -32338, 81363, 181808, 188583, -175895, 342881, 84298, 124457, 86334, -186342, 279275, -124848, -88955, 363966, 107722, -82725, 7589, 7376, -39664, -74060, -1959, 61418, 47121, 376605, -364786, 65916, -257820, -4806, 213648, -25899, -157394, 44642, 131336, 271874]
15311B71874A03080a00672d1250j90474c5526p2215A14882K07759b12584F252
15300d0423C71151b11466A65559e13467C24933E772M1885M52359h88B41826h7640
15288a73689H2976J45508f4743j67414i9769l487j32445a06287R069B42395a38292
15276H4088M30726i8616M7635C0554L28685A55068B7099k464c7134j68303R8426
15265a07011A14324J60530j21670g1358A18993P6069a47251F1277L13584i4676
15254a33941D05779b8766A5469a18901C27139M0103J046373M19517q41172M06988
15244A398948l6868A2068K09028b689B58074N4239c41465A24502J66923j17285
15234A74140a29844C34591F6505K325Q6836H524K78268a57272A14012a6920C07634
$$ y = [271874, 103080, -100672, -41250, -231724, -35526, -107741, 114882, 322641, -212584, 6252, -40423, 371151, -211466, 165559, -513467, 324933, 5772, 47657, 500016, -888, 241826, -87640, -173689, 82976, 228484, -64743, -232157, -99769, -103256, -235701, -106287, -97218, 242395, -138292, 84088, 514814, -98616, -50981, 30554, 359239, 155068, 27099, 24635, -37134, -205437, -107011, 114324, 274854, 153184, -71358, 118993, 195062, -147251, 61277, 374861, -94676, -133941, 405779, -28766, 15469, -118901, 327139, 367242, 1413615, 1833132, 991960, 1398948, 1362080, 12068, 221096, -2689, 258074, 312313, -341465, 124502, 291425, 174140, -129844, 334591, 66505, 68830, 155666, 8524, 286792, -157272, 114012, -16920, 307634]
15222A42756J6996m8467i7389L9944A00065c7435l31080d3316q0623B0838K78447
15211B99285a15983C52673a93364A07907c48736a5253n2758j1912o6680B4767
15200g723A44734b12140a0981j845C25968A4694Q9760m857i2150D9416b09469
15188c0481A5337a60146B63091G0194p721a35708j5776A1098Q6624a17590D9494
15176A81724a59791D85737f7552m5308K1218k9505E7388d6139k99985A62867J25388
15165B88255C7083d6322A85422A9767K52724L6111H5673J70610O58q0299d8678
15153b48151f437A29415C613J9409L08999c15366A57368A1894c45565C19847J1474
15142C31321A65112A0565J16737d5291A56670k110d4517C5283J44434j7979d8191
$$ y = [142756, 159752, 111285, -97389, -57445, 100065, -37435, -368515, -43316, -123939, 20838, 299285, -115983, 352673, -193364, 107907, -348736, -15253, -68011, -79923, -146603, 24767, -7723, 144734, -212140, -10981, -12826, 325968, 14694, 104454, 99597, -92150, 49416, -209469, -30481, 15337, -160146, 263091, 70194, 62473, -135708, -151484, 11098, 97722, -117590, 49494, 181724, -159791, 485737, -67552, -112860, -91642, -121147, 57388, -46139, -346124, 162867, 288255, 37083, -46322, 185422, 19767, 272491, 308602, 85673, 256283, 256941, 176642, -48678, -248151, -6437, 129415, 3613, 23022, 332021, -315366, 157368, 11894, -345565, 319847, 331321, 165112, 10565, 127302, -45291, 156670, 154560, -44517, 35283, 179717, 161738, -48191]
15130b1538D9978B0640i4741A51057n0411c5158B26006D7568a22955B4337K3442
15119D7779e5727A91889D3577J99817A8859M78361a44343f2941B8224J38851J89616
15108C56691A35698l6910e1555B60589a63775C22448A46273k9683h5837C34594
15097B77187a1401E7013L11490j47598F748J11420J09554j04184a72618e8446
15086A45264J27981a63062A56325c6767A14116b60698B92022d29B60101j07789
15076A52312a22301A61308o2292R9071A5116c6594k38208R8905M8093A32092K78298
15065D10390A35330J36799c3508A6455a7151B59276L11344B11047a38026B78384
15054C38773J57223c00217f0330A17566J9037b86333b390I4162b5561A41490L70590
$$ y = [-21538, 49978, 20640, -94741, 151057, 100646, -35158, 226006, 47568, -122955, 24337, 47779, -55727, 191889, 43577, 243394, 18859, 497220, -144343, -62941, 28224, 167075, 356691, 135698, 98788, -51555, 260589, -163775, 322448, 146273, 116590, -85837, 334594, 277187, -11401, 57013, 368503, 220905, 6748, 118168, 227722, 123538, -172618, -58446, 145264, 273245, -163062, 156325, -36767, 114116, -260698, 292022, -429, 260101, 152312, -122301, 161308, 99016, 198087, 15116, -36594, -274802, -175897, -127804, 132092, 410390, 135330, 272129, -33508, 16455, -17151, 259276, 570620, 211047, -138026, 278384, 338773, 495996, -300217, -60330, 117566, 136603, -286333, -2390, 94162, -25561, 141490, 512080]
15043E12080C1490K0707a52923g3111B1566J6769d3255A02361l7007K40647a85086
15031D70981A79604J8295L6763l8400d8446B30220F129J88344d2341c375C49163
15019A75575G8793J83458F1328K76848q9165B471M5184b62083B69593N8404n2034
15008B75963J04186A57749j3165J83866A18614J34546e167A259M26061A68994
14997C31264b8887J1320A99819j1395b51849C54410A41316K05313a19560B6121
14986C42966A70998K69331C2717r342J65942Q3487d9917A72824c27900A55735
14975D04619o8060j34851D7837J45682J07835N6597q1744G3590J03350K27454
14965D04394I4548J97201Q0222j53059M10084A01128M8208l1790J63893L7306
$$ y = [512080, 31490, 52197, -152923, -73111, 21566, 38335, -43255, 102361, 65354, 306001, -185086, 470981, 179604, 197899, 234662, 196262, -48446, 230220, 6129, 194473, -42341, -3375, 349163, 175575, 78793, 262251, 61328, 338176, 249011, 2471, 47655, -262083, 269593, 327997, 275963, 380149, 157749, 144584, 328450, 118614, 253160, -5167, 1259, 427320, 168994, 331264, -28887, -17567, 199819, 188424, -251849, 354410, 141316, 346629, -119560, 26121, 342966, 170998, 440329, 32717, 23375, 189317, 272804, -49917, 172824, -327900, 155735, 404619, 336559, 201708, 47837, 193519, 301354, 357951, 276207, 73590, 176940, 404394, 94548, 291749, 371971, 218912, 628996, 101128, 149336, 117546, 281439, 318745]
14955C18745A01752E084O998J78793m3210J37824Q9378Q353H7835d9819C04294
14943C4840L4159K85555p4940J05142J66883A49783j3649Q3794o724q9678J912
14932A25438K1924J19262a4128n400C25098D0755M17320P7431B12365J88775q5274
14921C15866D0163M97260j91585r8674a02484A45207C886J13290J19055L11528
14911E47759n2323H3714e86D34983j28271j47982g0042l4750E46593B52900o4365
14900A88535K02003A9687L01728I3060J00324M5587K12557c10989B82197a27082
14889e2531C06768P264J89524A31415J91430a0412E7334K77785L4591E9801M93051
14878E52852B76034O3981q1756J44531j64405n1103f4452E4122R9236K59652k05823
$$ y = [318745, 101752, 5084, 12082, 190875, 147665, 285489, 374867, 383220, 87835, -49819, 304294, 34840, 68999, 354554, 279614, 384756, 551639, 149783, 136134, 219928, 213204, 123526, 125438, 147362, 266624, -14128, -19528, 325098, 40755, 458075, 535506, 212365, 401140, 315866, 40163, 537423, 345838, 247164, -102484, 145207, 3886, 117176, 236231, 547759, 495436, 83714, -586, 434983, 306712, 158730, -70042, -104792, 546593, 252900, 188535, 390538, 19687, 321415, 93060, 193384, 238971, 451528, -310989, 282197, -127082, -52531, 306768, 314032, 503556, 131415, 322845, -10412, 57334, 335119, 369710, 59801, 552852, 276034, 340015, 258259, 402790, 238385, 187282, -64452, 54122, 153358, 413010, 207187]
14867B07187O9391c7319C14684r4129n6950J11052N1089H8304J70180M07158C21507
14855B3068J26343N2176K76059B18137M10652A97843J50627J75755j76731r5714
14845B51780L9705c3790E45602j67120A15410J48780O5785j20613M9994r757k4375
14834B25224L83227k73004I7411K00860F6984O13247k88920m7490J80217H4460
14823E05797J1840j89321j01063J19825A37344L16813A99225J21976L44J54201
14813D75746L7553A96744K18105L80106l86330M6512M57472B77272J16016p7306
14803C15982j29422K70049M7678j46351L43192k33277J69097J53719C43508r0841
14793B52667K09720J0886l8726n0170P2441k09944K95529G7657N06575k02298
$$ y = [207187, 276578, -37319, 314684, 220555, 163605, 274657, 325746, 88304, 258484, 665642, 321507, 23068, 149411, 201587, 477646, 218137, 628789, 197843, 348470, 524225, 347494, 251780, 291485, -33790, 545602, 378482, 115410, 264190, 329975, 209362, 259356, 249599, 225224, 608451, 335447, 97411, 298271, 66984, 680231, 391311, 343821, 524038, 84460, 505797, 517637, 328316, 227253, 347078, 137344, 454157, 199225, 321201, 321545, 475746, 513299, 196744, 414849, 794955, 408625, 455137, 912609, 277272, 393288, 315982, 186560, 456609, 504287, 357936, 701128, 467851, 636948, 790667, 343508, 252667, 462387, 473273, 434547, 384377, 456818, 246874, 542403, 77657, 584232, 381934]
14783C81934q9705m1194E2895L98771B18876K69058k4323J11486k17010P899N18945
14772H84931k10117B88432J74939M9001K3875j44476J68866K92391C35685J79726
14762E15411l9371j91908K19514N175n7445m891j2448N78q1916j307N11692l03529
14750E59555k0329J38255k7580N9370j23568R6243j23035j28321J73707R8564
14740G02861o7096J68116o6776l01725L12416j42200L1720j85471O24953l51628
14730G25170k46219L19117J52065m38041k23356N39305Q1423C98213M59243D20664
14719C33669O14837D13208K71354P6232j08294j66277Q6408J04797J53290j25100
14709G05618j8004j11927K32362j23000L78822l23096j62145M4536L89125l50787
$$ y = [381934, 292229, 251035, 52895, 451666, 218876, 487934, 463611, 575097, 358087, 365986, 884931, 674814, 288432, 463371, 512372, 536247, 391771, 560637, 853028, 335685, 515411, 476040, 284132, 503646, 508821, 451376, 446485, 434037, 434615, 352699, 351392, 863084, 559555, 539226, 677481, 649901, 709271, 585703, 681946, 558911, 430590, 604297, 702861, 635765, 803881, 737105, 435380, 747796, 605596, 637316, 451845, 1076798, 725170, 478951, 798068, 950133, 512092, 288736, 828041, 909464, 398213, 857456, 420664, 333669, 948506, 413208, 684562, 760794, 652500, 486223, 572631, 677428, 830718, 705618, 687614, 575687, 808049, 685049, 1063871, 740775, 578630, 623166, 1012291, 661504]
14699F61504j16952J28782L67936l62916J41383k36939K8802k988M2484K05028
14689H56124j70633J96795j04839k35779K99346k655j46352j71749L41859j87221
14679F74896L5685j82207L2285N14176j29389K09168l35353K23921k01622n7876
14669G83684Q9724K63705j87156R1014k70625L87250l94405L38775m41567J26605
14659G87004L14508j43658j37549l32131L58083K66863O0224k08397J01083m3327
14649A022703q6805J45221K88545m98183j22455J93114K14059p9381M62967o94031
14639H45754N27135k96137N00403m32777L1564K29806l31349R3211j19469J56345
14629A204486Q4445M4654o2384k00403J86137q0059J27794J80573l54326l743
$$ y = [661504, 544552, 673334, 1041270, 678354, 819737, 582798, 611600, 608612, 651096, 856124, 685491, 882286, 777447, 541668, 841014, 838359, 692007, 520258, 862117, 674896, 710581, 528374, 560659, 1074835, 945446, 1154614, 819261, 1043182, 841560, 783684, 873408, 1137113, 949957, 1040971, 770346, 1157596, 763191, 1101966, 660399, 787004, 1101512, 957854, 820305, 488174, 846257, 1113120, 1173344, 964947, 1066030, 1022703, 935898, 1081119, 1369664, 871481, 749026, 942140, 1156199, 1076818, 1539785, 845754, 1372889, 1076752, 1577155, 1144378, 1175942, 1405748, 1074399, 1167610, 1048141, 1204486, 1288931, 1333585, 1271201, 1070798, 1256935, 1176876, 1304670, 1485243, 1130917, 1127174]
14619A127174j99222M46909n6406J09570l8219k05J35629r4003l7362j74926o5115
14608A153824K40264K98835k85801P2735l47386J85130L2259K2752j38167J00524
14598A334969K28900l04523K58137m0454p7774L74852l98018K83064j44480K53935
14588A768608k74459J97941L7949J18596l48291N7602K01833j195j96382K01599
14578A763801j89865J36540k21146O93898l80887O5610k0600J13052j14245J97028
14568B043186J8713j01249M7494K6309L42771n25379M28826K1765l5618o7028
14558B199790N16502J55656K69028j25288M01975k00131L45385J279036P17279
14549E559232J889299M719780R498303J2326979Q779023j8528129j1961618E440654
$$ y = [1127174, 927952, 1374861, 1318455, 1428025, 1389806, 1389601, 1525230, 1431227, 1393865, 1218939, 1153824, 1394088, 1692923, 1407122, 1479857, 1132471, 1317601, 1349860, 1372612, 1234445, 1334969, 1563869, 1259346, 1517483, 1477029, 1399255, 1774107, 1376089, 1659153, 1514673, 1768608, 1494149, 1692090, 1730039, 1848635, 1500344, 1557946, 1759779, 1758584, 1562202, 1763801, 1573936, 1710476, 1489330, 2183228, 1802341, 1867951, 1847351, 1960403, 1846158, 2043186, 2061899, 1960650, 2008144, 2034453, 2377224, 1851845, 2280671, 2302436, 2266818, 2199790, 2716292, 2871948, 3140976, 3015688, 3417663, 3217532, 3562917, 4841953, 5559232, 7448531, 12168311, 21666614, 33993593, 42772616, 24244487, 12282869, 5440654]
14540C662228j244344l67599j41566m84446K66895J11304k35115q7999M09363
14531A888721k879j3311K73091l71411J95436q2883l8803J66752q0388P3159K41595
14520B249079r8540N8345J1630j30836J93290l7602j63027K6117L51765l1183
14510B429038k95235L76953J34815j89603j10067K61002k34259K50110m8881j84608
14500B389265J74114K31053m44180M94794L37259l46199k21347K97136l68008
14491B543887O33858j01887p0452Q5601J05817j08155p4449L40055J93985J21452
14481C669712o01724O34725r8835k18654L24716j23457M18355o12606K69222O5757
14471C727211j78048J23594K89337k52093L94632j63432J90947K07381r6590k0036
$$ y = [3662228, 2417884, 2050285, 1908719, 1424273, 1691168, 1802472, 1567357, 1479358, 1888721, 1885842, 1872531, 2145622, 1774211, 1969647, 1886764, 1847961, 2014713, 1934325, 2007484, 2249079, 2150539, 2208884, 2220514, 2089678, 2282968, 2245366, 2082339, 2108456, 2460221, 2429038, 2133803, 2510756, 2645571, 2455968, 2345901, 2606903, 2372644, 2622754, 2573873, 2389265, 2563379, 2794432, 2350252, 2845046, 3182305, 2836106, 2614759, 2911895, 2543887, 3177745, 3075858, 3005406, 3091007, 3196824, 3088669, 3014220, 3354275, 3548260, 3669712, 3067988, 3702713, 3603878, 3385224, 3709940, 3586483, 4004838, 3392232, 3661454, 3727211, 3549163, 3672757, 3962094, 3710001, 4104633, 3941201, 4132148, 4339529, 4242939, 4222903]
14461D222903J96901J91864m54590N6796L66691n1422k7270L00591J54627l92313
14451D564778L43397j46063K39650j07661j5318K52894k62617K94419L34919l22748
14441E175650K16229k23246L59157J07943R3157J03000j66513L69267N62056n96116
14431F000584K14727K7296J11847p7980O4251L17866q5409K42668l16080M73700
14421F973470J00219J03009m9199L70470K09087o0283j73799K82180K61247l45614
14411G670787L96909K31763m7643K07696k95513L44423N55313j14707j7270M08020
14401I339778K291K11739K67238J16923K71914N3469L6358K29438K40500J19135
14391A0888783J85816K46978N03775P1524l1900K32331J70618M63219j31556J32286
$$ y = [4222903, 4419804, 4611668, 4157078, 4213874, 4580565, 4529143, 4501873, 4802464, 4957091, 4564778, 4908175, 4762112, 5001762, 4894101, 4878783, 5131677, 4869060, 5163479, 5498398, 5175650, 5391879, 5168633, 5527790, 5635733, 5728890, 5831890, 5665377, 6034644, 6596700, 6000584, 6215311, 6242607, 6354454, 6276474, 6340725, 6658591, 6573182, 6815850, 6499770, 6973470, 7073689, 7176698, 7127499, 7497969, 7707056, 7646773, 7472974, 7755154, 8016401, 7670787, 8067696, 8299459, 8251816, 8459512, 8163999, 8508422, 9063735, 8949028, 8931758, 9339778, 9342069, 9553808, 9821046, 9937969, 10209883, 10263352, 10299710, 10529148, 10769648, 10888783, 11074599, 11321577, 11825352, 11896876, 11864976, 12097307, 12267925, 12731144, 12599588, 12731874]
14381A2731874N74931L65122M3041M52721L78098K05734K66916L23540K2378O29342
14371A5993697L415M47047K25206L78345M00051N23996L38135O90024j68032R02672
14361A9734556L35771K50499M59743P43012J53241O46861K23800P19744Q26629
14352B4093856L64280N34092R71601N65458M13391Q13031N25099Q29546Q27313
14343B9937667Q21870Q09530Q51593Q51524J268017N06252J135162J103927J281280
14334C8566822J121880J047399J355452J409697J241293J497662J423762J812290
14326D9476257J274281K128531J706080J756748K047624K066903K452506K140007
14318F5048937K332122K320562K944755K881459K897780L045815L401715L539769
$$ y = [12731874, 13306805, 13671927, 13714968, 14167689, 14545787, 14751521, 15018437, 15341977, 15364355, 15993697, 15997112, 16444159, 16669365, 17047710, 17447761, 17971757, 18309892, 18999916, 18831884, 19734556, 20070327, 20320826, 20780569, 21523581, 21676822, 22323683, 22547483, 23267227, 24093856, 24458136, 24992228, 25963829, 26529287, 26942678, 27755709, 28280808, 29110354, 29937667, 30759537, 31569067, 32420660, 33272184, 34540201, 35046453, 36181615, 37285542, 38566822, 39688702, 40736101, 42091553, 43501250, 44742543, 46240205, 47663967, 49476257, 50750538, 52879069, 54585149, 56341897, 58389521, 60456424, 62908930, 65048937, 67381059, 69701621, 72646376, 75527835, 78425615, 81471430, 84873145, 88412914]
14310H8412914L826399L915956M227754M657705M740670N167726N427801N568719
14302A25945644O342109N808288P144559P460637P904843Q226029Q971105R334170
14294A87137384R966673J0609335J1517475J1934820J2422989J3314887J4283358
14287B71186921J4588641J5671751J5828500J6478389J6052716J6895132J6334654
14280C83036704J6290120J5670974J5079605J3671417J2711306J0752396Q202494
14273D75415016N518636N04570n029051k377739J873380k240022n846274q766895
14265D59051621j0792629j2354534j3600703j5115610j6728982j7647261j7399802
14258C55412100j6940652j7212139j6256753j5598417j4466137j3768370j4071847
$$ y = [88412914, 92239313, 96155269, 100383023, 105040728, 109781398, 114949124, 120376925, 125945644, 132287753, 138096041, 145240600, 152701237, 160606080, 168832109, 177803214, 187137384, 197104057, 207713392, 219230867, 231165687, 243588676, 256903563, 271186921, 285775562, 301447313, 317275813, 333754202, 349806918, 366702050, 383036704, 399326824, 414997798, 430077403, 443748820, 456460126, 467212522, 475415016, 480933652, 481438222, 476409171, 474031432, 475904812, 473664790, 467818516, 459051621, 448258992, 435904458, 422303755, 407188145, 390459163, 372811902, 355412100, 338471448, 321259309, 305002556, 289404139, 274938002, 261169632, 247097785]
14251B47097785j2847270j2169800j1554658j0779068j0404626r743757q899633
14244A70698973p782977q039184p588038p250267o564738o047091n437135n525254
14236A16464289m970130n020164m810936m201878l893405l361717l708861l690314
14228H2806884l365288k885533l158938k425889k504788k377812k470348k338979
14220F1279309k044817j942809j866642j712993j976521j522622j111031j443011
14212D7658863j573708j550314j513439j075481j319166q05428r50215j135768
14204C7735344j537412p02249r58732r28571n21137r49999r45810j075350o74714
14195B9441370q40160k55468n71230q15371q48793j19575j002431n74738o70277
$$ y = [247097785, 234250515, 222080715, 210526057, 199746989, 189342363, 179598606, 170698973, 162915996, 154876812, 147288774, 140038507, 133473769, 127426678, 121989543, 116464289, 111494159, 106473995, 101663059, 97461181, 93567776, 90206059, 86497198, 82806884, 79441596, 76556063, 73397125, 70971236, 68466448, 66088636, 63618288, 61279309, 59234492, 57291683, 55425041, 53712048, 51735527, 50212905, 49101874, 47658863, 46085155, 44534841, 43021402, 41945921, 40626755, 39821327, 38871112, 37735344, 36197932, 35495683, 34536951, 33608380, 33087243, 32137244, 31191434, 30116084, 29441370, 28601210, 28345742, 27774512, 26959141, 26110348, 25990773, 24988342, 24413604, 23743327]
14186B3743327m41987l56783m49151n21764q95401j56240o23225m26004l49194
14177A9523578k63452j69389p89240l84304k53708l28984m55470l21280m51212
14168A6106539P4519j25547p08967J70422m67108j71251m72219j18430m28928
14159A3859030k33757o8976m87926J3060n3963n01138l6504l51163J36437o18398
14149A1656702j63337k89397J06197l08593l81683L92349j56614k55529k84197
14140A0315898k91683k14064l5861J8315m73697J80795l44469K63563k81154j09471
14130I028172l03914l55987k578N6623m40164J78863k2847k75489k23564J02505
14120G741620J97790n32802K51677l67638j68559j53020Q8567L00311n37726J94272
$$ y = [23743327, 23301340, 22944557, 22495406, 21973642, 21078241, 20922001, 20298776, 19872772, 19523578, 19260126, 19090737, 18301497, 17917193, 17663485, 17334501, 16879031, 16557751, 16106539, 16181058, 16055511, 15346544, 15516966, 15049858, 14878607, 14406388, 14287958, 13859030, 13625273, 13556297, 13068371, 13081431, 13027468, 12526330, 12489826, 12138663, 12275100, 11656702, 11493365, 11203968, 11310165, 11001572, 10619889, 11012238, 10855624, 10600095, 10315898, 10024215, 9810151, 9774290, 9792605, 9318908, 9499703, 9155234, 9418797, 9137643, 9028172, 8724258, 8368271, 8365693, 8422316, 7982152, 8161015, 8138168, 7862679, 7639115, 7741620, 7939410, 7406608, 7658285, 7290647, 7122088, 6969068, 7057635, 7357946, 6820220, 7014492]
14110G014492M1967j79464m41775J50913j82719k11674M0961j21709K12117m45754
14100E877355K65663q8927n25825L50671o9512j6211l61980q2997R4578J87544
14090E630359r8977j94466m9218k35265o10n4334n230L5039m74349L41876l36904
14079D557921K80962J2795l65850R1281l16343P107J06821o8635L29642k08305
14069D427396j93717j37624L28537l50486p6705j6990K13299l35416O4143O2879
14059C985316k70843K98832k39416j82770J7176K87546j3026j59967J01029j95500
14049C628377j05965P7626R954J82381l38182J9598k26056l4533j01623K29773
14039C341350L6943m07010J91282k55904L24296j75702q1711L45641m64840J01845
$$ y = [7014492, 7056459, 6876995, 6435220, 6586133, 6403414, 6191740, 6232701, 6110992, 6323109, 5877355, 6143018, 6054091, 5528266, 5878937, 5809425, 5793214, 5431234, 5348237, 5442815, 5630359, 5531382, 5336916, 5287698, 5052433, 5051823, 4997489, 4992259, 5027298, 4552949, 4894825, 4557921, 4838883, 4851678, 4485828, 4577109, 4260766, 4267873, 4374694, 4306059, 4635701, 4427396, 4233679, 4096055, 4424592, 4074106, 3997401, 3980411, 4193710, 3858294, 3922437, 3985316, 3714473, 4013305, 3773889, 3591119, 3608295, 3895841, 3882815, 3722848, 3823877, 3628377, 3522412, 3600038, 3609992, 3792373, 3454191, 3473789, 3247733, 3213200, 3111577, 3341350, 3378293, 2971283, 3162565, 2906661, 3230957, 3055255, 2973544, 3319185, 2854345, 2956190]
14029B956190K54342k67855O4L4967M7735l00791J44835k65483k2675L303l1674
14018B552958R7980q9106k18471J45793K03312l42558j28348J66844J69725j84329
14008B373800J10111l91259N59055l80600l45067M55566j52787r5718J00368R5130
13998B328599l14672J69582r6419K97717l52607r7472K35734L91163L40341P59683
13988C661649M084912P994859J2927352J3483031j4091067j3557026o154474k228812
13980F120424j391089n06197n90254k67262j03438K0925o97924P8592O2085N9632
13970B785494k81115Q7638j81304j20062n1046Q7519j7134m7640j96731K27423
13960B293042n86082L97687O3756q1545k26987L96379k97646P7638l1074k84064
$$ y = [2956190, 3210532, 2942677, 2942741, 2977708, 3025443, 2724652, 2869487, 2604004, 2581329, 2584632, 2552958, 2650938, 2561832, 2343361, 2489154, 2692466, 2349908, 2221560, 2388404, 2558129, 2373800, 2483911, 2092652, 2651707, 2271107, 1926040, 2381606, 2228819, 2133101, 2233469, 2328599, 2013927, 2183509, 2087090, 2384807, 2032200, 1934728, 2170462, 2561625, 2901966, 3661649, 7746561, 15741420, 28668772, 42151803, 28060736, 14503710, 8349236, 6120424, 4729335, 4223138, 3632884, 3365622, 3262184, 3283109, 2585185, 2663777, 2725862, 2785494, 2504379, 2592017, 2410713, 2290651, 2239605, 2327124, 2309990, 2262350, 2065619, 2293042, 1706960, 2104647, 2168403, 2086858, 1859871, 2256250, 1958604, 2036242, 2005168, 1721104]
13950A721104M46822j43334o7153o7702r3816j01492L72774n8456k55771j4946
13940A738030M3111k85707M51337n03885J34332L14757r6185l5984k00032l4086
13930A525688q5846K46623M39274l13144j23949j14808n3184j21193K85057j6353
13920A668165n4130J70459k23466K87735l49673m9208P0716k56915K62898l40671
13910A185910K89156l74221J42520O6282o2k52818L66008J36386l22374J09775
13900A346562j37449K48119k58082K36781j43905k85412L98193k79406J23898
13891A249299K09115m4621k4718q8899l4362j71855K08383M8491j31869p0679
13881A148285L36539l72717J90092J31986l2358k506j52073n7900K07260l56721
$$ y = [1721104, 2167926, 2024592, 1957439, 1889737, 1795921, 1694429, 2067203, 2008747, 1752976, 1738030, 1781141, 1495434, 1946771, 1442886, 1577218, 1891975, 1795790, 1759806, 1559774, 1525688, 1439842, 1686465, 2125739, 1812595, 1688646, 1573838, 1520654, 1399461, 1684518, 1668165, 1614035, 1784494, 1561028, 1848763, 1499090, 1449882, 1520598, 1263683, 1526581, 1185910, 1475066, 1100845, 1243365, 1309647, 1309585, 1056767, 1422775, 1559161, 1236787, 1346562, 1209113, 1457232, 1199150, 1435931, 1292026, 1006614, 1404807, 1125401, 1249299, 1458414, 1413793, 1389075, 1300176, 1265814, 1093959, 1302342, 1350833, 1218964, 1148285, 1484824, 1112107, 1302199, 1434185, 1401827, 1399321, 1247248, 1189348, 1396608, 1039887]
13871A039887O08247p40917K96451R3482O1542j75423j13634L05594k73470J668
13861A103427j21560J63778J51401R1268q0903j79704j70856M15452n51774j22947
13851F97582N91610l19278J3005M36636k09726k15663J13288n9842n5765j54666
13841H37181J4624K19744Q8843O4562k77563O4898j33738L1540J60350k09446
13831H60995P8716N2206j27504J89366k98161J22596l32218K56789M66666l26977
13821I42474J2217O0525j14567k3482L5136k955p1807J38840J62421j49928L49140
13810A338014m70974J14903J40330D95932K78733J12353J21290O3663K5054l4712
13800A062313j40381k33630L00583J1662l02279K89734D93925M37722n7233j77201
$$ y = [1039887, 1648134, 907217, 1203668, 1297150, 1358692, 1183269, 1069635, 1375229, 1101759, 1103427, 981867, 1145645, 1297046, 1388314, 1307411, 1127707, 956851, 1372303, 820529, 697582, 1289192, 969914, 982919, 1419555, 1209829, 994166, 1107454, 1047612, 991847, 837181, 851805, 1071549, 1160392, 1224954, 947391, 1012289, 878551, 910091, 1070441, 860995, 939711, 991917, 864413, 1053779, 755618, 878214, 545996, 802785, 1269451, 942474, 954691, 1015216, 900649, 877167, 912303, 909348, 837541, 976381, 1138802, 988874, 1338014, 867040, 981943, 1122273, 495932, 774665, 887018, 1008308, 1071971, 1097025, 1062313, 921932, 688302, 988885, 1000547, 698268, 988002, 493925, 931647, 874414, 697213]
13790F97213Q4472j53534K66652k25711K05782l54936L05668l503j61322j19533
13780E41248J58120K69358k74424L6828k04300M01303k32559O6560j11781J37757
13770G88110J99485m35564J5216j75766N16169q476m00592J94779N3960j68161
13760E79160J37938R2311j50268O1633k35399K82660n6997j09883R7548j445l45580
13749C51678L90488j10329K55337j45980K01416l07412L66026j09822j47536k95220
13739D48646J61064J19443n7369j37570j34918J6124J73462L9223K26011k54304
13729E99812J45790l27940J92430A73420K95221R3474J52602j20893N9116k60513
13719C92427M40177k26989k76632K72052J95075j13644J13509k2876l67611L35565
$$ y = [697213, 781685, 628151, 894803, 669092, 874874, 519938, 825606, 822103, 660781, 541248, 699368, 968726, 694302, 731130, 526830, 928133, 695574, 762134, 650353, 788110, 987595, 552031, 567247, 391481, 907650, 899174, 498582, 693361, 747321, 579160, 717098, 809409, 659141, 720774, 485375, 768035, 711038, 601155, 698703, 697258, 351678, 742166, 631837, 887174, 741194, 942610, 635198, 1001224, 891402, 743866, 448646, 609710, 729153, 671784, 534214, 399296, 415420, 588882, 628105, 854116, 599812, 745602, 417662, 610092, 173420, 468641, 562115, 714717, 593824, 652940, 392427, 832604, 605615, 328983, 601035, 796110, 682466, 795975, 773099, 405488, 741053]
13709G41053k6947j12968N5712l19760K87611K5820j67139p5255J04129j23267
13699C88989K78381n0951R5246k99494N8787J19618O4563j38829J58551k14133
13689D60728K32022P6777j21315q9481j0182K2250B61780M27318A75627K29311
13679D04938M5564j82405K3301L05432j28411J77942k57113K20042Q2678j59769
13669E32199K7103k4032A91029M88756B53660M15992l2715m8637k14163Q033r7449
13658B84721j38777O21245B69672M34469j7882l22484K15514j90052l1715J99626
13648E57148J0381j62838n5356L97132C29977K80921B98474j02139J95255D4267
13637C55944K6456A74908O1049o9007K63080O4076l0211K0945j55379M6554j12627
$$ y = [741053, 714106, 601138, 656850, 337090, 624701, 650521, 483382, 408127, 512256, 388989, 667370, 616419, 711665, 412171, 470958, 590576, 655139, 516310, 674861, 460728, 692750, 769527, 648212, 558731, 548549, 570799, 261780, 689098, 175627, 404938, 450502, 268097, 291398, 596830, 468419, 646361, 389248, 609290, 691968, 532199, 559302, 535270, 191029, 679785, 253660, 669652, 636937, 588300, 374137, 382170, 284721, 145944, 767189, 269672, 704141, 686259, 363775, 579289, 389237, 357522, 557148, 567529, 404691, 349335, 746467, 329977, 610898, 298474, 196335, 391590, 44267, 355944, 382400, 174908, 235957, 166950, 430030, 494106, 463895, 484840, 329461, 376015, 263388]
13626B63388J55869M6700N7708r0174A23188L69865J08636j23724J75719j73322
13616D80362k01899q3040J72042K02545q5958A93371J48095R7558J08768j41377
13606D06415L79122B5655J79267J09150K03992o9626a67274D18102l797M4795
13596D59100j7563L00082k94386Q3057r4800j59408m1717J82379Q8432L9492j92517
13585C52151m3214k9818K35249B11991K43396J1888K9141j30407A12999K3002
13575A36001K41348J68251B56259K17641M957N8918I3060J14110K87393K91903
13565G86466B63776k8602m2514K24581j42744j00934J17373j1740K07518B30748
13554E56538A18224O05480k64123j46295n9486J27412n2409O4314G2938M08592
$$ y = [263388, 419257, 465957, 523665, 433491, 123188, 493053, 601689, 477965, 653684, 480362, 278463, 195423, 367465, 570010, 484052, 193371, 341466, 439024, 547792, 406415, 785537, 25655, 204922, 314072, 518064, 448438, -167274, 418102, 414305, 459100, 441537, 741619, 447233, 530290, 435490, 276082, 234365, 416744, 505176, 544668, 352151, 308937, 279119, 514368, 211991, 455387, 467275, 496416, 366009, 112999, 136001, 377349, 545600, 256259, 473900, 478857, 537775, 93060, 207170, 494563, 786466, 263776, 235174, 192660, 417241, 274497, 173563, 290936, 279196, 486714, 230748, 556538, 118224, 723704, 459581, 313286, 253800, 381212, 328803, 393117, 72938, 481530]
13544D81530O7898n4508L1198K20884k24175J29521A74530H1043M01602J13361
13534E96006H0109K76045j57164J17757R5973j70429J15498J9638J78783B21671
13523A30381K19343R9231d9953D50728F758K92346J77137r8788F0039K41307p3224
13512B28122J45426l9216A43553L19725j40481J30812J23292k64788m8146A25473
13501A91690I5393K87258j71916L14279B46517q8126G2498M37277j90324k3459
13491B95992F9908j9997L94419D1477L78953p8092j43211p2193a4465B94777A39301
13479B97490J29622j47029j6117M00857A37567J02207P6172K13594q2752I3520
13468B01662c2645H933M75772j40198J75131A24671a4359A81201K40881j43264
$$ y = [481530, 549428, 494920, 526118, 747002, 522827, 652348, 174530, 81043, 482645, 596006, 80109, 356154, 198990, 316747, 412720, 242291, 357789, 377427, 556210, 221671, 130381, 349724, 448955, -49953, 450728, 6758, 299104, 476241, 377453, 60039, 301346, 228122, 373548, 334332, 143553, 463278, 322797, 453609, 576901, 312113, 263967, 125473, 191690, 95393, 382651, 210735, 525014, 246517, 158391, 72498, 509775, 319451, 295992, 69908, 49911, 444330, 41477, 420430, 342338, 199127, 126934, -14465, 294777, 139301, 297490, 427112, 280083, 263966, 664823, 137567, 239774, 315946, 529540, 446788, 93520, 201662, -32645, 8933, 484705, 344507, 519638, 124671, -14359, 181201, 422082, 278818]
13458B78818K2988f9202C51080K8281g2091C62481E3570N7385R8605L7743q8417
13447A58886L14921k19159J78976j06052e0119A36768J90368H8135K0691j508
13437A07318J14596G2209N6035C2621J39490n2311J38472N94003I0883d3016C60167
13425A04449R0671L2005K57617j05966c0058A00992J12695q8057i0473d4556G00532
13413E8544J21117L13927l7306A53659D1156M20415k25944r5886a4368j22225
13403a36593B08076H078P8906m0902J96640J16564p7422q2088p5890F29Q5117
13392H5746b49164A49646P5178f194A75789k308Q6011K36764j67402d3612E28906
13380C66177p4869K7736O9951D9617J86735K65299B9903N77666k94442A23551
$$ y = [278818, 301806, -69202, 351080, 379361, -72091, 362481, 53570, 110955, 209560, 247303, 158886, 473807, 254648, 433624, 327572, -50119, 136768, 327136, 88135, 108826, 107318, 221914, 72209, 128244, 32621, 172111, 119800, 258272, 852275, 90883, -43016, 360167, 104449, 195120, 227125, 484742, 378776, -30058, 100992, 213687, 125630, -90473, -44556, 700532, 58544, 179661, 493588, 456282, 153659, 41156, 461571, 235627, 139741, -14368, -136593, 208076, 8078, 86984, 46082, 242722, 359286, 281864, 199776, 123886, 629, 85746, -249164, 149646, 224824, -6194, 175789, 173481, 259492, 496256, 328854, -43612, 528906, 366177, 291308, 319044, 388995, 49617, 236352, 501651, 29903, 607569, 313127, 123551]
13369C39726J50344A69847d9263A44490C6520K09804o4671Q3389R400A20395K60011
13358C80406A69501K03110G1034J51507K76125B45058Q3819k0947a07900E08779
13347I6283R8366p5596P4365B871N31113A40479J84532A04032M01480A77860h2287
13335C51546A12330K11262a17484B97895o6350l0092J69384M1184p8329m7915
13325B85777K20789A23661k7683J63109m7024L3781J00624j22610J23021R9341
13315D46220k05869n039F3903J67492M0819G2548Q4178o3155l3799L1643O1947
13304A53362k2922K0193B2612L42301p4885A16174k0857L3408J88480q8134E9793
13292G0847K29736M1954j68722B5335h360A71667a93340I0687i7042B88628A30547
$$ y = [339726, 490070, 169847, -49263, 144490, 36520, 246324, 181653, 265042, 274442, 120395, 380406, 169501, 372611, 71034, 222541, 498666, 245058, 328877, 307930, -107900, 508779, 96283, 194649, 119053, 193418, 2871, 533984, 140479, 325011, 104032, 505512, 177860, -82287, 351546, 112330, 323592, -117484, 297895, 231545, 201453, 370837, 412021, 333692, 285777, 506566, 123661, 95978, 259087, 212063, 245844, 346468, 223858, 346879, 446220, 240351, 235312, 63903, 231395, 272214, 72548, 156726, 93571, 59772, 91415, 153362, 130440, 150633, 22612, 364913, 290028, 116174, 95317, 128725, 317205, 229071, 59793, 70847, 300583, 342537, 173815, 25335, -8360, 171667, -193340, 90687, -97042, 288628, 130547]
13280E37299A96106N4470B4287J57090c3434A61862m8614g1213I8420J83198M528
13269B86146E0601J34271G5632a09072C76457e6545D7203Q3188a42934E26996
13258A34714a74554B13217a71547D05047E4729g0719C49078A26261Q4832J32340
13248C43433c5420B05100K4127p4500f7066r9849B02643E0667J00983O735a92175
13236A20810L5482J51946d8132D02380H4409A6160J07751K24066A56977f3483
13225a5144j6977k5591l3598A29704K02195B069N5695K24642b43049a18618H0061
13213A31572E0108J83742e7327A87888R135d9203B26186Q024L28707A92764a28526
13201a33190B03168p8164d5548B97926F9819L42551A94542k7439K7806g4741C90358
$$ y = [537299, 196106, 250576, 24287, 181377, -33434, 161862, 113248, -71213, 98420, 281618, 286146, 50601, 184872, 75632, -109072, 376457, -56545, 47203, 130391, -142934, 526996, 134714, -174554, 213217, -171547, 405047, 54729, -70719, 349078, 126261, 211093, 343433, -35420, 205100, 229227, 154727, -67066, -166915, 202643, 50667, 151650, 158385, -192175, 120810, 156292, 308238, -48132, 402380, 84409, 16160, 123911, 347977, 156977, -63483, -15144, -32121, -57712, -91310, 129704, 331899, 2069, 57764, 282406, -243049, -118618, 80061, 131572, 50108, 233850, -57327, 187888, 197023, -49203, 226186, 234210, 562917, 192764, -128526, -133190, 203168, 125004, -45548, 297926, 69819, 412370, 194542, 167103, 194909, -74741, 390358]
13189A96353H452c5827A22769b6969F5243J61456q328g5668B66397m0203j07742
13178A18452G46M35694E089J07520J78654J9111j3878j37637G5304J15764l799
13167A87269o2110O7155a21540B06194b27561B37023I8935O152a28162C12020
13156B5635N7233L01610j8686a18191l8402A24355A0787b61277N5319A91558K72555
13145D64113j467c59656B77384a16908D0704L56709H8679J1211h6081B30881A05809
13133H2808A9816R3297a85528A35259N8147F5251j1713j3610J42506Q1635a12589
13121A43187E1474J58701A2370J45908J38192g4840k29D4220J00888b85746B00021
13109a39129A58384m5639J18134o5746L03803G9353N2989m8246K38645c2041B34086
$$ y = [196353, 8452, -35827, 122769, -26969, 65243, 226699, 218371, -75668, 266397, 226194, 118452, 746, 436440, 5089, 112609, 291263, 310374, 296496, 158859, 75304, 191068, 187269, 125159, 192314, -121540, 206194, -227561, 237023, 98935, 105087, -128162, 312020, 25635, 82868, 384478, 365792, -118191, -156593, 124355, 10787, -261277, -205958, 191558, 464113, 462646, -359656, 277384, -116908, 40704, 397413, 88679, 99890, -86081, 230881, 105809, 82808, 19816, 113113, -185528, 135259, 193406, 65251, 53538, 39928, 182434, 264069, -112589, 143187, 51474, 210175, 12370, 158278, 296470, -74840, -75069, 44220, 145108, -285746, 200021, -139129, 158384, 112745, 230879, 165133, 468936, 79353, 132342, 84096, 322741, -32041, 234086]
13097A36539m2856g9032F11699b28200J12674C63029b69536E9827O39136A98540
13086a55472B25021a9032A97010i5298k81102B12669K32533A76609a69515A34790
13075A76751b1369o6839C46410C8099b41725G1917J93403K57830B18806g6303
13064A0758J34238N6093L6081p1014B2602Q8030J7589J54782E7552c05250B74571
13052A60892i4922M5747B22415l2304A579R7123m8809j6790J51395l8743J21782
13041B67537B1173K06258l7267k2570E0646A3577g0684C27042h0101A07925K93227
13030D01152A03422C4269N5511b4680A69428n322e1961B65286a83038C44091b17205
13018A19439M7570D6366R9688j7984J74082c4687l24798B32723N4616g4136a2088
$$ y = [136539, 93683, -79032, 611699, -228200, -115526, 363029, -269536, 59827, 698963, 198540, -155472, 225021, -19032, 197010, -95298, -376400, 212669, 445202, 176609, -169515, 134790, 176751, -21369, -88208, 346410, 38099, -241725, 71917, 265320, 523150, 218806, -76303, 10758, 144996, 201089, 237170, 166156, 22602, 110632, 128221, 283003, 57552, -305250, 274571, 160892, -94922, -49175, 222415, 190111, 1579, 98702, 49893, 33103, 184498, 145755, 267537, 21173, 227431, 190164, 167594, 50646, 13577, -70684, 327042, -80101, 107925, 401152, 103422, 34269, 89780, -24680, 169428, 164106, -51961, 265286, -183038, 344091, -217205, 119439, 167009, 46366, 146054, 128070, 302152, -34687, -359485, 232723, 287339, -74136, -12088]
13006B2123L05577f9459A07849J8485j0808J11280o0627J51610q2636b35759H3035
12994I9258a31681o8906E01595k22755a34835l7804C47624j33089r0124J40491
12984B64902j14174n5644J99177I7030q18B2201i3710C10978c80778a81109A02220
12972a07023j6586e5261a3437A00290j5319f2618j48399g1426C02158b12544c6793
12960b3258l50566C45455c2121D38656A02006P300a9427l2909D4169O2222e093
12948C59422A31095M5095c1437b334q238E63477A77762a05055m08568A62519k1808
12937A40711F512P5537J31374i5919A56097R4860E0007b2365I691J60776G519
12925A25577R2336p5736o2701c5032C22981A11188b6977B6657J6127d1060D6767
$$ y = [22123, 327700, -69459, 107849, 126334, 115526, 226806, 166179, 317789, 235153, -235759, 83035, 99258, -131681, -200587, 501595, 278840, -134835, -172639, 347624, 214535, 124411, 264902, 150728, 95084, 294261, 97030, 96212, 22201, -93710, 310978, -380778, -181109, 102220, -107023, -123609, -55261, -13437, 100290, 84971, -62618, -211017, -71426, 302158, -212544, -36793, -23258, -373824, 345455, -32121, 438656, 102006, 109306, -19427, -52336, 44169, 106391, -5093, 359422, 131095, 176190, -31437, -2334, -10572, 563477, 177762, -105055, -513623, 162519, 140711, 6512, 82049, 213423, -95919, 156097, 250957, 50007, -22365, 9691, 170467, 7519, 125577, 217913, 142177, 79476, -35032, 322981, 111188, -26977, 26657, 42784, -41060, 46767]
12913a45133B87913k1788O7697f9901c0739j3542B02071J3281G5731q426k9798
12902C7507a73231B77890B2799m532d7340n0780A57223a74126F7669R6596P5832
12891B40097J10909j58986c8227j4808C97782j11191H8025b8671I3353J19972
12881B13325a18734L2579r3122H0012N7586a2199k7132A63341m2389h0482j17392
12870a97874N3880d8048k01852h9247E68473a9283B1672a07954o1048f2906K0664
12859d2242A50475C5170e38002A40923l8836a85694B9042J11970a91717F4662
12848e1724A651Q1139J00741m2971K94228H3703a28692D9714R846K05J79522e9854
12835B47138q3858E5308K4533K24302h1174L363j53624C49190j33539b58603A25457
$$ y = [-145133, 287913, 266125, 333822, -69901, -30739, -44281, 202071, 215352, 75731, 67305, 37507, -173231, 277890, 22799, 18267, -47340, -98120, 157223, -174126, 67669, 164265, 240097, 351006, 192020, -38227, -53035, 397782, 286591, 88025, -28671, 93353, 213325, -118734, -86155, -179277, 80012, 137598, -12199, -39331, 163341, 120952, -80482, -197874, -143994, -48048, -249900, -89247, 568473, -19283, 21672, -107954, -169002, -62906, -42242, 150475, 35170, -538002, 140923, 102087, -185694, 29042, 141012, -191717, 64662, -51724, 1651, 82790, 183531, 140560, 434788, 83703, -128692, 49714, 59560, 59765, 239287, -59854, 247138, 163280, 55308, 79841, 304143, -81174, -77811, -231435, 349190, 215651, -258603, 125457]
12823F3618b07545F090c3662B19805E3919L3715a23287A10203b22540A87258d0158
12811A1823M8208J82989a34203f3981H6971J10666J51996a51466A9929J18770
12801A38699D5432K34657j27393e9157j05109L0318A93710j2334F964N2296J72728
12790B31988f72168a05940f608C03207f1901I8346b48670F0286P8808f5489K9714
12779c5775B75397m2871c142G5757L95639j62028p3572O8042j37934c4568I7306
12767A28553a07455A60681L0554b02324h2916A53314Q3989r1087f1805A62536
12756A17723g5124C69697a87357B05167e6851A46113a60947B42027a28629o823
12746a35452B23454b69101D5952a41553N5011l489A3396L49019B1385K26917K34847
$$ y = [63618, -207545, 6090, -33662, 219805, 53919, 87634, -123287, 110203, -222540, 187258, -40158, 11823, 60031, 243020, -134203, -63981, 86971, 197637, 349633, -151466, 19929, 138699, 45432, 280089, 152696, -59157, -164266, -133948, 193710, 181376, 6964, 59260, 231988, -672168, -105940, -6608, 303207, -61901, 98346, -248670, 60286, 139094, -65489, -35775, 275397, 232526, -3142, 75757, 471396, 309368, 235796, 303838, 165904, -34568, 97306, 128553, -107455, 160681, 191235, -202324, -82916, 153314, 237303, 146216, -61805, 162536, 117723, -75124, 369697, -187357, 205167, -56851, 146113, -160947, 242027, -128629, -135452, 223454, -269101, 45952, -141553, -86542, -90031, 13396, 362415, 21385, 248302, 483149]
12735D83149B6669J15913L1251a2374H4762b73486f002A50794H978K3222n648
12724B6552a4949k91070C04597i0282H9420K39819D3802a66068A73866a91239
12713b19790b0355B33627j07602b04035D811M70640j80351k182E6368J52202a59667
12701h5904c1555f69j98785C71983m4462i3885B26106a16095l2306B77381b15617
12689B32329r9103b38825J4560B15353d10396a01487E4858a8231A2335M3366a15275
12677B30589g3828L4498n3849A56175c86681A83410q3877K34802h5822K2947A17975
12665B99272A17501D8099M08226j87737K52780a71237A25673a22380N1048C78532
12654A85989N3423J79847j62039G1079P5082b1342P459A29333J57064j0116k5121
$$ y = [483149, 26669, 142582, 173833, -12374, 84762, -273486, -6002, 150794, 8978, 32200, 26552, -14949, -306019, 304597, -90282, 89420, 329239, 43802, -166068, 173866, -191239, -219790, -20355, 233627, 126025, -204035, 4811, 475451, 295100, 292918, 56368, 208570, -159667, -85904, -31555, -669, -199454, 371983, 327521, -93885, 226106, -116095, -148401, 277381, -215617, 232329, 133226, -238825, -224265, 215353, -410396, -101487, 54858, -18231, 12335, 55701, -115275, 230589, -73828, -39330, -93179, 156175, -386681, 183410, 99533, 334335, -85822, -62875, 117975, 299272, 117501, 48099, 456325, 268588, 521368, -171237, 125673, -122380, -71332, 378532, 185989, 239412, 419259, 257220, 71079, 146161, -21342, -13883, 129333, 286397, 276281, 251160]
12643B51160j9462k2330n2009D2309b6618q0949b8146G5867M9236J5843D9142
12631D12629d4859B91881l1205J41159A07163f1863Q494C52094a90481A55765
12620e2557C44892A47875J59988A37680b37678i9404k29C8513b0203l6606A86072
12608b64235A86091g5206F691a36708D18105Q2543b17635b2149A66075d0355B16824
12596B31906r0825J82396A60841l0280i0692A83285C9164J01675b24229Q2476
12586a41753P856H9795F110e8415G8818b614A43004A1624f5756A88326g8287K9412
12574d8875b0855A23525J1211l6770C6742J93477n4744c0460B38733a8069B70169
12562h3085l99218B3265c65712G5371N674b53103d7559j93040A3192Q6865c43369
$$ y = [251160, 231698, 209368, 157359, 42309, -26618, -107567, -28146, 75867, 125103, 140946, 49142, 412629, -44859, 291881, 260676, 401835, 107163, -61863, -53369, 352094, -190481, 155765, -52557, 344892, 147875, 307863, 137680, -237678, -99404, -99633, 38513, -20203, -56809, 186072, -264235, 186091, -75206, 6691, -136708, 418105, 500648, -217635, -22149, 166075, -40355, 216824, 231906, 141081, 323477, 160841, 130561, -90692, 183285, 39164, 140839, -224229, -141753, -133897, 89795, 6110, -58415, 78818, -2614, 143004, 11624, -65756, 188326, -78287, -48875, -20855, 123525, 134736, 97966, 36742, 230219, 175475, -30460, 238733, -18069, 270169, -83085, -482303, 23265, -365712, 75371, 81045, -253103, -47559, -240599, 13192, 100057, -343369]
12550A22799b6315H4897a05855b8751A36216a60737A1600g7230G5049l0625K01362
12539B45786E2045A4263N7938p292J18285a47664B93692a39394j77749H3716M0294
12528A24010d08986A67435h6116n784B28458I9763K70917a0527A04480g3480k429
12517g5909B199J67826L2112g7219j46733F3317K79448G0077J58328f6660a4660
12505h4137A15740g8243b1079k7921A3424J18378J26968n4795o5470k9167b29924
12493a13974A26038E0109d3926p0804C44187C6087f2565j40612R4017F0581a88303
12481b4331k74171c0200k7274B26999C5621L27913A51922g9104C34172F5419a80550
12469A14137a22716A57346J65527a48794F964a72483B20858B7016K00207a87718
$$ y = [122799, -26315, 84897, -105855, -28751, 136216, -160737, 11600, -77230, 75049, 44424, 245786, 52045, 14263, 72201, 64909, 183194, -147664, 293692, -139394, -317143, 83716, 124010, -408986, 167435, -86116, -91900, 228458, 99763, 370680, -10527, 104480, -73480, -75909, 2199, 170025, 202137, -77219, -223952, 63317, 342765, 70077, 228405, -66660, -14660, -84137, 115740, -78243, -21079, -49000, 13424, 131802, 258770, 203975, 138505, 109338, -229924, -113974, 126038, 50109, -43926, -114730, 344187, 36087, -62565, -203177, -109160, 60581, -188303, -24331, -298502, -30200, -57474, 226999, 35621, 363534, 151922, -79104, 334172, 65419, -180550, 114137, -122716, 157346, 322873, -148794, 6964, -172483, 220858, 27016, 227223, -187718]
12458C22081j46115p8890a69742F80718b15553g8447b3179j26581F0628b55609
12447f9575p9583B52397C3042a38274G251d7858G7713e7762A24773b08469A77842
12435A2786L2004L62342d1589q0394a3624A16937K31886e4324A53360p2949a54399
12423c76015G9903h5992B20483h9410p3064c7107C32701D5343p360g2506D9869
12411B19517q1399k6404a12359A11127c57923A0175P8198d25284a56122I27g6142
12399B32385b20722E4606b60357A1659N5230P3296d3460C26023j40309a1386G2923
12387A78582J45690A0855J85831c4149j19983j4466K8233n2829E2841A017b4883
12375F0941K1013a31442d5490K162I4280a66585H8505b58954a6801A3984d5943
$$ y = [322081, 175966, 97076, -169742, 680718, -215553, -78447, -23179, -149760, 60628, -255609, -69575, -149158, 252397, 33042, -138274, 7251, -47858, 77713, -57762, 124773, -208469, 177842, 12786, 44790, 407132, -41589, -121983, -13624, 116937, 348823, -54324, 153360, 80411, -154399, -376015, 79903, -85992, 220483, -89410, -162474, -37107, 332701, 45343, 37983, -72506, 49869, 219517, 138118, 111714, -112359, 111127, -357923, 10175, 88373, -425284, -156122, 927, -76142, 232385, -220722, 54606, -260357, 11659, 66889, 140185, -43460, 326023, 185714, -11386, 72923, 178582, 324272, 10855, 196686, -34149, -154132, -168598, -140365, -193194, 52841, 1017, -24883, 60941, 81954, -131442, -45490, -43328, 94280, -166585, 88505, -258954, -16801, 13984, -45943]
12363e20881b08191H0258K49488A6070n052M1309d34727D7692N0432N9582M1374
12352A99080f8734L473j7111I1122M140K93617b38607A97162n6710c27384A00698
12340g8535G2250B4034J68748i8786C11852n6038a09467k53037G3790a02306k1884
12329a24190A82722a5194j04402A99895L2486b6770C5367J42301K048b43640A10787
12317c12211f2235K043A24786J88461D6645d51805E14N4179J1992J92573C5012
12305B63300n2857r0419K86552I297J28268J64615j03803b1446k8014I4797K51074
12294C45871c39o5243B0802b07650i2948H2439K27923f9023B00360l8654E4523
12282A26476g4871A71231F9901J83071f1899F535a1732k624C51015j70414J29822
$$ y = [-520881, -208191, 80258, 329746, 16070, 11018, 52327, -434727, 47692, 98124, 157706, 199080, -68734, -65261, -82372, 91122, 95262, 388879, -238607, 197162, 140452, -327384, 100698, -78535, 72250, 24034, 192782, -98786, 311852, 255814, -109467, -362504, 73790, -102306, -124190, 182722, -15194, -119596, 199895, 232381, -26770, 35367, 177668, 179716, -243640, 110787, -312211, -62235, -60192, 124786, 313247, 46645, -451805, 514, 54693, 66685, 259258, 35012, 263300, 210443, 120024, 406576, 9297, 137565, 302180, 198377, -21446, -49460, 94797, 345871, -339, -65582, 20802, -207650, -92948, 82439, 310362, -69023, 200360, 161706, 54523, 126476, -74871, 171231, 69901, 252972, -61899, 6535, -11732, -14356, 351015, 180601, 310423]
12271C10423j42333g6489B25952c73954A5148b45561i3869A55283b14992e546
12260A97401i682C22704e5289k2635B95597A12937g5415A19229Q250b9741G4641
12248A3508R2100O7033a82308Q6752j02540q7121a14021A17710m4566J60596A07788
12236a46820N566F4877N3676b22797H6129K23757i7019G8449K9188K51898D0859
12224A51243B1935K82302M5542A54123d2284D7489f241H6838k3895R7009b4511
12212C74804I7640R2574m5609a15286B4937N8283K0739J3460a98412B56740M6357
12201C03097E3917P5209i5090A19890a08931A06319J33358p3950j3509M0050N4617
12190B46885o5585a6712B87453q2133J91256a272C03404a38505C26031J0518f8543
$$ y = [310423, 168090, -76489, 225952, -373954, 15148, -245561, -93869, 155283, -214992, -5546, 197401, -9682, 322704, -55289, -77924, 295597, 112937, -75415, 119229, 127479, -29741, 74641, 13508, 105608, 172641, -182308, -95556, -198096, -285217, -114021, 117710, 73144, 233740, 107788, -146820, -141254, 64877, 118553, -222797, 86129, 309886, -97019, 78449, 107637, 359535, 40859, 151243, 21935, 304237, 349779, 154123, -42284, 47489, -6241, 86838, 62943, 159952, -24511, 374804, 97640, 190214, 144605, -115286, 24937, 83220, 103959, 117419, -198412, 256740, 303097, 53917, 129126, -95090, 119890, -108931, 106319, 239677, 165727, 152218, 192268, 246885, 181300, -16712, 287453, 205320, 396576, -1272, 303404, -138505, 326031, 336549, -68543]
12178A01577J10654C8102b08943B35d666B13696D1053a14373k8454c5072j1745
12167d6817B04297a87461A01766L5841O6399a00221J0264B32304J11270b03587
12156F553b33491A48121i71B85974q7865o6314C4190L13999a23454l0657C63886
12144a3026j69688F7119d1441B55374A19690d0723E3503i2794B39391K83517A92337
12132b04744C02508A44010J01007a758A15344a35658A18001K27177l7403A51781
12121b52542B1988m645c20346b2693A27984e063j9108E2973J8717f9518A61812
12109e5137D9971J42196j3965I352a65503A45834d6786B30637E475a32289B18607
12097I6723D7883K95415C1327h8012A87563L31233b11463I7619D2306L8916n327
$$ y = [101577, 212231, 38102, -208943, 235, -4666, 213696, 41053, -114373, -142827, -35072, -46817, 204297, -187461, 101766, 137607, 204006, -100221, -89957, 232304, 343574, -203587, 6553, -233491, 148121, -971, 285974, 198109, 131795, 34190, 348189, -123454, -154111, 363886, -13026, -182714, 67119, -41441, 255374, 119690, -40723, 53503, -92794, 239391, 522908, 192337, -204744, 302508, 144010, 245017, -1758, 115344, -135658, 118001, 345178, 307775, 151781, -252542, 21988, 17343, -320346, -22693, 127984, -5063, -24171, 52973, 71690, -69518, 161812, -55137, 49971, 192167, 178202, 9352, -165503, 145834, -46786, 230637, 5475, -132289, 218607, 96723, 47883, 343298, 31327, -88012, 187563, 518796, -211463, 97619, 42306, 81222, 75895]
12086G5895b29267C3223g280A47073J4788a7135A58295b51344c2998D0081f04473
12074a52152O8331j99208H6950J58427B5479i3925K9508n7679C12028M64014P59694
12063A535736G31475k23119H3886P7492i5473G3362a04342q6749b3373k13160
12053b36533A17804n4042K54349H1965h0597a6514A3502K29730E9151b20673A22871
12041A63004l4584g4080m4842a887A19284P8790f0419B36320b87374B22039f1092
12029c22689O4735A55174a54412b0723B26249i0158A17347n2779b54916A926c21533
12017b49667D8771O8804A9576e7954r9246j24327A62031a75900A14039h358A76801
12005a6802j08508A13853J27433l5185e6897m957G2341a46888B51925a73908g2058
$$ y = [75895, -229267, 33223, -7280, 147073, 161861, -17135, 158295, -251344, -32998, 40081, -604473, -152152, -83821, -283029, 86950, 245377, 25479, -93925, -64417, -122096, 312028, 776042, 1535736, 731475, 508356, 83886, 161378, -95473, 73362, -104342, -191091, -23373, -236533, 117804, 63762, 318111, 81965, -80597, -16514, 13502, 243232, 59151, -220673, 122871, 163004, 128420, -74080, -118922, -1887, 119284, 198074, -60419, 236320, -287374, 222039, -61092, -322689, -257954, 155174, -154412, -20723, 226249, -90158, 117347, 64568, -254916, 1926, -321533, -249667, 48771, 117575, 19576, -57954, -157200, -281527, 162031, -175900, 114039, -8358, 176801, -16802, -125310, 113853, 241286, 206101, -56897, -61854, 72341, -146888, 251925, -173908, -72058]
11993D09973d9025m4548j90487F2034b2762k85905c323j81233j334I4324J2134
11982A06458K11053c9423k00552I8196a18075d6467p3548A29190J01064A07122
11971h1749l3982M2387B95312I6311a9741A51112o2174a2097A37083i524m1532
11960e1056D8562N4819f1636r4460A68637B5391a81150K7265D41393e7036A62443
11948B29391K9443e7225A41561a103C65472d9283l23067a39556f6935B92150b53316
11936A28644Q7432b38262g1697k05934r9992c3373p4525j18809j07494J03508
11926b30693i6137j5111A74112b18619O402H0566P8606D7723c16322L3347a05815
11914b5085A43372a31562m9719Q5394p2369C6034a31828c555A76412o6695c6136
$$ y = [409973, -49025, -93573, -284060, 62034, -22762, -308667, -3323, -184556, -185890, 94324, 106458, 317511, -39423, -239975, 98196, -118075, -46467, -120015, 129190, 230254, 107122, -81749, -115731, -73344, 295312, 96311, -19741, 151112, 88938, -12097, 137083, -9524, -51056, 48562, 103381, -61636, -156096, 168637, 25391, -181150, -153885, 441393, -57036, 162443, 229391, 258834, -57225, 141561, -1103, 365472, -49283, -372350, -139556, -66935, 292150, -253316, 128644, 216076, -238262, -71697, -277631, -377623, -33373, -107898, -226707, -334201, -230693, -96137, -111248, 174112, -218619, -212217, 80566, 159172, 47723, -316322, -282975, -105815, -25085, 143372, -131562, -181281, -95887, -168256, 36034, -131828, -3555, 176412, 109717, -36136]
11902A59890C811e514b96j61635j52973A05837b05480B91111D3439Q4186J55682
11891B83307b0385A21610a35837K4873p2819B2066a93842g2336M155m1160F3856
11879A31580L8853h3530J9321j73342I16J368O441a8629o1837k39722B66348j32926
11867A33422m5631K42897A18509a86745m1893L7680E2434a38322O7867A0761L3113
11856D3874f993B27296a11552A94817I3589l9928f0870k3384k32036i3500A0386
11844d6026A1851a67301B81519E7955b94979e5456p7185A53836a12592o5882L1779
11833a46695k6348B28009J5360D2666c02852b9184B8113d56575b4821j88324A52771
11821a38268j26415a16610A72810E1834g9415B1356a73732c840D25055b94320
$$ y = [159890, 3811, -5514, -296, -161931, -314904, 105837, -205480, 291111, 43439, 127625, 283307, -20385, 121610, -135837, -110964, -183783, 22066, -193842, -72336, -68181, -109341, 63856, 131580, 170433, -83530, -64209, -237551, 916, 2284, 8725, -18629, -80466, -320188, 266348, 133422, 87791, 330688, 118509, -186745, -228638, -190958, 52434, -138322, -70455, 10761, 43874, -6993, 227296, -111552, 194817, 93589, 53661, -60870, -84254, -316290, -93500, 10386, -46026, 11851, -167301, 281519, 57955, -294979, -55456, -132641, 153836, -112592, -178474, -146695, -173043, 228009, 243369, 42666, -302852, -29184, 28113, -456575, -24821, -213145, 152771, -138268, -264683, -116610, 172810, 51834, -79415, 21356, -173732, -3840, 425055, -294320]
11810A05413j8060b26206C4031R630A3320J63248A3059b32830e5344j61387l7853
11799b54584O0936l600H4528l2502N3697o799P8821g5054A09181h9360o6815l4903
11787a91078p9047B34207a83960A15309K84586a97241H7277K57743q4668o9709
11777A90643a01295H2113M9522i867C89443E1613m691a74497a6670E131c63023
11765B34794b74291a2931j5710j92428a05800j50135a12447k2433l5547N2046
11755a18381k45919J42899a01839O939j94195c2007r2168A32677a82442L5093
11745a47349b0802B2969K8999A5059c67833f1980A65631R3382b39943D0267J99752
11734B40019i6352j4482G7441L04050a61075g9571o2377e2716A54864a82260A28162
$$ y = [105413, 87353, -226206, 34031, 43661, 13320, 176568, 13059, -232830, -55344, -216731, -254584, -193648, -197248, 84528, 52026, 105723, 98924, 177745, -75054, 109181, -89360, -156175, -191078, -270125, 234207, -183960, 115309, 399895, -197241, 87277, 345020, 260352, 190643, -101295, 82113, 131635, -9867, 389443, 51613, 46922, -174497, -16670, 5131, -363023, 234794, -274291, -12931, -28641, -221069, -105800, -255935, -112447, -134880, -170427, -118381, -364300, -221401, -101839, -94900, -289095, -32007, -124175, 132677, -182442, -147349, -20802, 22969, 51968, 15059, -367833, -61980, 165631, 259013, -239943, 40267, 240019, -96352, -110834, 77441, 381491, -161075, -79571, -141948, -52716, 154864, -182260, 128162]
11722a18503J5429o0963C92678a11630C66268b568l32858A5044d7340j68333G4944
11710a37470r211j0500A35466a4053A33025J7195O322J16m4261c67386H5670J09816
11698A95486B3243Q1476d049A22776b15006e6959j90039A14070l2575l9744b55401
11686C21707N7432b18399C94078a22060B44425I9438K67018H3558M1138d4692
11675B5465f7708J9490D80365a23112e2348d979k52057h2954m456A09355b21998
11663A05206Q7601a738j6182A5390a60469P6085A52331D1347j1673J12979R4756
11652B37409a46932j81205B41995d2120I4280c03594g8114k12480A41020B4801
11641F0747i9928B11175l3172b15723f8304H4327J90341E0146J25851O8728f712
$$ y = [-118503, -103074, -164037, 392678, -111630, 366268, -2568, -335426, 15044, -47340, -215673, 74944, -137470, -146681, -157181, 135466, -14053, 133025, 150220, 156542, 156658, 112397, -367386, 85670, 195486, 23243, 104719, -4049, 122776, -215006, -56959, -246998, 114070, 81495, 41751, -255401, 321707, 379139, -218399, 394078, -122060, 244425, 99438, 366456, 83558, 124696, -44692, 25465, -67708, -48218, 480365, -123112, -52348, -4979, -257036, -82954, -87410, 109355, -221998, 105206, 192807, -1738, -17920, 15390, -160469, -84384, 152331, 41347, 29674, 142653, 237409, -146932, -328137, 241995, -42120, 94280, -303594, -78114, -290594, 141020, 24801, 60747, -99928, 211175, 178003, -215723, -68304, 84327, 274668, 50146, 175997, 244725, -6712]
11629A9981J0299J20804R1754i6660K9478o4913B74456a49664A28195a87813K9780
11618a58033i18k88726J16011B56622b6757A8286R7383A3384b6897F3199i3464
11606c94966A26926fr8313M5147B011M4798J8044J87505F283b93573A13225c67922
11593I7146b00838B5240M6768a06631r4359a1438j98485O4573F0735P2852J79073
11582C12660A508M2007K02389G7491B1904J82049a36820O2971L6541k221A845
11570A7668Q5816a57764A2128P4575b22566F8147J76977c0150k7125C81118G111
11558a16201c4682B95834A9239c04772A15892J221b58974E4491j5079K45447G4886
11546C51213C134O2900b621E7507b1685D23426j91873E5116J9451B4652e3525
$$ y = [19981, 30280, 151084, 242838, -96660, -67182, -132095, 274456, -149664, 128195, -187813, -158033, -918, -289644, -173633, 256622, -26757, 18286, 115669, 13384, -26897, 63199, -93464, -394966, 126926, -6, -98319, -53172, 2011, 46809, 64853, 252358, 6283, -293573, 113225, -367922, 97146, -200838, 25240, 72008, -106631, -200990, -11438, -209923, -145350, 60735, 133587, 312660, 1508, 43515, 245904, 77491, 21904, 203953, -136820, -73849, -37308, -39529, 1845, 17668, 103484, -157764, 12128, 86703, -222566, 68147, 245124, -30150, -57275, 381118, 7111, -116201, -34682, 295834, 19239, -304772, 115892, 117113, -258974, 54491, 39412, 284859, 74886, 351213, 3134, 66034, -2621, 57507, -21685, 423426, 231553, 55116, 74567, 24652, -53525]
11534i3220j68372e9044A12127N519m2625a87150A97381N3952A01341J35071a73671
11522a45233k7776B58260f0746k09701F7301L0236a40452H7170Q0478D2848K94860
11511C37708D5555J96924H0407O6530g8946A52585p1722B6390N5627a97273B23750
11499C0447L82323j57310l6066a2515A10454C5481J63392b39675f7606A31672
11488A2940J71910n5460K23883a3249C72274A02679I674K46574B9947K14119a51575
11476A31472j6402M82022B9641O6711N9585c98813A51970j8814l8119a39085A0200
11464a43388A92062J9748L04007A07727c5162E8133J29381c4429A73852J95710
11454C69562a00376I7850b93904e7171K5121k81149B942L5114M02093D1618K43077
$$ y = [-93220, -261592, -59044, 112127, 117646, 75021, -187150, 197381, 251333, 101341, 236412, -173671, -145233, -173009, 258260, -60746, -270447, 67301, 97537, -140452, 87170, 167648, 42848, 337708, 45555, 242479, 80407, 146937, -78946, 152585, 80863, 26390, 82017, -197273, 223750, 30447, 412770, 255460, 219394, -12515, 110454, 35481, 198873, -239675, -67606, 131672, 12940, 184850, 129390, 353273, -13249, 372274, 102679, 9674, 256248, 29947, 244066, -151575, 131472, 115070, 597092, 29641, 96352, 155937, -398813, 151970, 133156, 95037, -139085, 10200, -143388, 192062, 211810, 515817, 107727, -35162, 58133, 187514, -34429, 173852, 369562, -100376, 97850, -293904, -57171, -32050, -313199, 2942, 38056, 440149, 41618, 284695]
11443B84695e7737k62573G5081a28837K6616l9050f5922A85953a00353B68000
11432a4834j07552A62906J33681b39422C6396f8507j17606M9575q9553Q4213A61991
11420a12659o6976j18451J37615b6696B24630b41750b546j33280f166B8060J06106
11409A34166g5675A82379E0350c05909A00412d2364j09177A68573K27084A22202
11398f8459A22608d324j63555C3316L09730E1911b49657c960B04057h5311k1544
11387a06855b2074j9684l5355B62050r1091d5692C29781a45067B1374a42640B14501
11375c14980A89792c3860r4734E4066J72391F659P7775g6444A49868E9655k2543
11364C7112J39491j678J01446E1145c5997d922G4908A6935c9326r3566M8710k5985
$$ y = [284695, -57737, -320310, 75081, -128837, -102221, -141271, -65922, 185953, -100353, 268000, -14834, -122386, 162906, 296587, -239422, 36396, -68507, -186113, -136538, -226091, -141878, 161991, -112659, -179635, -298086, -160471, -26696, 224630, -241750, -2546, -135826, -6166, 28060, 134166, -75675, 182379, 50350, -305909, 100412, -42364, -151541, 168573, 395657, 122202, -68459, 122608, -4324, -167879, 33316, 343046, 51911, -249657, -3960, 204057, -85311, -106855, -22074, -41758, -77113, 262050, 170959, -45692, 329781, -145067, 21374, -142640, 214501, -314980, 189792, -33860, -128594, 54066, 226457, 6659, 84434, -76444, 149868, 59655, 37112, 176603, 174925, 276371, 51145, -35997, -4922, 74908, 16935, -39326, -132892, -84182, -110167]
11352a10167o7473I711L45623g7470j69328k3412f4866E0736f4431C61081c16
11340C04741j44383e9892a7635o1684L7191p1646N6283C4225Q4946M888a07120
11328i6728G5694a10079J2632C042O8132P2225f667p5313C1692G685J18782F602
11315a77479A12571b07083A09105b5387A71709p3594M1322Q2983c40790B19719
11304B51703d19652i7885A07140a0067H2172d5841k2656n3170B75351B7991a48296
11292a46279C01266k0787a37122j4556M6619j48904J20580G2056J60923A482a75103
11280c5331B29848a90406G7611R7117b85200f5279C87048b2191j41032k867C919
11268A39714b47468e5019n7068B88642a24557N2507B3846e1796k48979A14528
$$ y = [-110167, -177640, 9711, 355334, -77470, -246798, -270210, -64866, 50736, -64431, 361081, -316, 304741, 160358, -59892, -17635, -79319, -42128, -113774, -57491, 34225, 119171, 124059, -107120, -96728, 75694, -110079, -97447, 3042, 71174, 143399, -6667, -81980, 31692, 7685, 126467, 6602, -177479, 112571, -207083, 109105, -25387, 171709, 98115, 139437, 222420, -340790, 219719, 251703, -419652, -97885, 107140, -10067, 82172, -45841, -68497, -121667, 275351, 27991, -148296, -146279, 301266, 280479, -137122, -151678, -105059, -253963, -133383, 72056, 232979, 1482, -175103, -35331, 229848, -190406, 77611, 174728, -285200, -65279, 387048, -22191, -163223, -166090, 3919, 139714, -247468, -55019, -112087, 288642, -124557, -72050, 23846, -51796, -300775, 114528]
11257H6248K9670b87261L1544G6081b65117J25178C78519i3154a6834A29688O9159
11246A98847G6446b35441R4753A83201K6079r1534B6937f647A93340H4354c08493
11234f8250A82935c071A36004J71748I614i2915r9057J4563C29014A9576D461
11222a78654J364n7475f8146K9983k55557l404O4257d1819p2326b9351j24200
11211a53551A21906a04837H706b50474j39130g1111k97241A10251N3463L5744
11201A99458D2286K86363b54721B05956d8036A06952e0224r242E0093a60897J0028
11190a50869A25237A2060a38547k14506B4081a74977f0293C15865h4013B53117
11179B56925a25052o6000h8880c3305B38138a24034A2686J90901c85056A96149
$$ y = [86248, 115918, -287261, -255717, 76081, -265117, -139939, 378519, -93154, -16834, 129688, 198847, 76446, -235441, -140688, 183201, 209280, 117746, 26937, -6647, 193340, 84354, -308493, -68250, 182935, -3071, 136004, 307752, 9614, -92915, -191972, -177409, 329014, 19576, 4461, -178654, -177290, -234765, -68146, -38163, -293720, -297124, -232867, -41819, -114145, -29351, -153551, 121906, -104837, 8706, -250474, -389604, -71111, -368352, 110251, 163714, 199458, 42286, 328649, -254721, 205956, -48036, 106952, -50224, -59466, 50093, -160897, -150869, 125237, 12060, -138547, -353053, 24081, -174977, -60293, 315865, -84013, 253117, 256925, -125052, -191052, -88880, -33305, 238138, -124034, 12686, 203587, -385056, 196149]
11168e6369B06175g4803A16852a27057l8359i516j77003K8709M7560B19917a60802
11156B74321a1288C93121l2042B7761b3396A49010q930a65258M1283n6409k53547
11145d33931E2999a38273B58969I852K42813B8747M671c7431A58257A019g0802
11133D46946G0799J23777c0133I9735A9054a14337K4987e904E976J64120a25692
11121A22930K975f1381F2049J73703L3285B1439L9527J42507j9132L4285C2395
11109a31758D20341b32219c0306E22K6404J45894F065e022K487A15892d1343E7801
11096B00595G9426b59772C33995o1530g9687o6438q681G3777J59542I4864P3804
11085A68668L0879a6559C97342j09243A37898K66788j55813f0191B35824h7466
$$ y = [-56369, 206175, -74803, 116852, -127057, -165416, -9516, -186519, -157810, -110250, 219917, -160802, 274321, -11288, 393121, 361079, 27761, -23396, 149010, 140080, -165258, -123975, -180384, -433931, 52999, -138273, 258969, 9852, 252665, 28747, 33418, -37431, 158257, 1019, -70802, 446946, 70799, 194576, -30133, 99735, 19054, -114337, -89350, -5904, 5976, 170096, -125692, 122930, 125905, -61381, 62049, 235752, 269037, 21439, 60966, 203473, 184341, 218626, 32395, -131758, 420341, -232219, -30306, 522, 26926, 172820, 6065, -5022, -2535, 115892, -41343, 57801, 200595, 79426, -259772, 333995, 272465, -79687, -146125, -154806, 73777, 233319, 94864, 168668, 199547, -16559, 397342, 288099, 137898, 404686, 248873, -60191, 235824, -87466]
11074D085K97385I8936K4367b73930A83334L02793A63968F849L76125j22842K29041
11063D89173n2127q6626J26175I1431M91516j85716m9477j72763K25410m2734
11053C57667L04039j76535M3062B48227K36877K89859l16892J47110j674j58167
11043D45340L78924j29712J89503k72310j18525j03721L757K99730j63719J295
11033E30562B23093K35021N5363J92475j6279q1685j15992j39804K35487B20222
11022D61285J21417N3558j38917J11489n1090k03241N0283q1132K81989j13375
11012D92266K04223k60808k0154K36303j97785M5002k13065L07797B51743O75406
11002I27149j93671j86431M1949J30719j60008J8593l6905K6738j91240L17939
$$ y = [4085, 301470, 98936, 123303, -273930, 183334, 486127, 163968, 6849, 382974, 260132, 489173, 437046, 350420, 476595, 91431, 582947, 397231, 347754, 174991, 400401, 357667, 661706, 485171, 528233, 248227, 485104, 774963, 458071, 605181, 603507, 445340, 824264, 694552, 884055, 611745, 493220, 389499, 393256, 692986, 529267, 530562, 223093, 458114, 513477, 705952, 689673, 607988, 491996, 352192, 587679, 220222, 461285, 582702, 636260, 497343, 608832, 557742, 354501, 404784, 323652, 605641, 492266, 696489, 435681, 415527, 651830, 454045, 499047, 285982, 593779, 251743, 927149, 733478, 547047, 588996, 719715, 559707, 578300, 541395, 568133, 376893, 694832]
10992F94832J32995l64332J03884K05719O2852k10621K25530N581j32154L09774
10982A034060k62287K63740O4507k88910P69449l28190O32840k41542L64910K63650
10972B272227J16470M0369K15453m79516j98108j79018k99732r6214p8986J21717
10962A434662n93653M36324j1807R0784p7215l92046M94358m02476q3421k05747
10952F89763M14603m61992O834m9297k56149o8770A31133M65307k95861G0685
10941B67927b14947A33334K50352E8246J34152N302g7875n5595B7541O8105g5779
10929I1668J09843e3802B10597H8487J13768l7455D7303K07556m5680A4141K66696
10918B80837E266R128g6103A30563f9572A86737L6339g1687G931J77326J12721
$$ y = [694832, 827827, 463495, 567379, 773098, 835950, 625329, 850859, 856440, 724286, 1034060, 771773, 1035513, 1100020, 811110, 1580559, 1252369, 1885209, 1643667, 2008577, 2272227, 2388697, 2429066, 2644519, 2165003, 1966895, 1787877, 1488145, 1391931, 1312945, 1434662, 841009, 1277333, 1265526, 1356310, 1279095, 887049, 1381407, 978931, 895510, 689763, 1104366, 642374, 649208, 599911, 343762, 274992, 131133, 596440, 300579, 70685, 267927, -214947, 133334, 383686, 58246, 192398, 197700, -77875, -133470, 27541, 95646, -75779, 91668, 201511, -53802, 210597, 88487, 202255, 164800, 47303, 254859, 209179, 14141, 280837, 5266, 14394, -76103, 130563, -69572, 186737, 223076, -71687, 7931, 185257, 297978]
10907B97978H754a0701j25246C28025m0520b4374m3073E0524a24485A05915C9194
10895a57127l8085h6567p2046F3311q876J27299C7640a46259A14101k9066b12221
10883C8714L40531A28313c8642E0647h7426C75881a54897A23008J31650K3920
10873B78578a82368A62448c43543B01845a11193A13669J69207a73401A00170K18532
10863C18702D4116b72095A87623a45980j04327j32966G5212R3726O97D9599J667
10852E1266c9860a9004j08164m2945j23830o9784A07228f5696j39199B65036l3188
10841B31848C8343J1303K96120g9208J5887l66143A79594D1563b61519C2777K61615
10830B94392E7075b87543e2281C07798a2491o7332m0361G0520b3221j23021j58642
$$ y = [297978, 8754, -10701, -135947, 328025, 287505, -24374, -67447, 50524, -124485, 105915, 39194, -157127, -195212, -86567, -158613, 63311, 54435, 181734, 37640, -146259, 114101, 85035, -212221, 38714, 379245, 128313, -38642, 50647, -87426, 375881, -154897, 123008, 254658, 278578, -182368, 162448, -343543, 201845, -111193, 113669, 282876, -173401, 100170, 318702, 44116, -272095, 187623, -145980, -250307, -383273, 75212, 168938, 169635, 49599, 51266, -39860, -19004, -127168, -170113, -293943, -363727, 107228, -65696, -204895, 265036, 231848, 38343, 49646, 345766, -79208, -63321, -429464, 179594, 41563, -261519, 32777, 294392, 57075, -287543, -52281, 307798, -12491, -79823, -120184, 70520, -23221, -146242, -304884]
10819c04884A0902J91944c29025A93149I2138J64894e2793B07181B0267b58471
10808c52963A11372b23409A03999a11020D8833J58691b03171H7038c9645q0491
10798a20136k00967c3840r1978A21451B4448L810A320K895E41a2667l16646A5164
10785H3232h546j42367m81010b75246L0032a04821l2831A39867Q9783p2755F2287
10773d0994C5013h0316A19414a28587n7579h6161I4269i8635d1533q2260M7920
10762g5873j07612g9103j6485A33952c56074c80A53307b81797d9578k73378g0920
10750a46365j08099h6126j9119k37859D8750b62557i5225D9719a80562B498Q3228
10739H5726B3113Q3737L2480d3157j63909C77223A21681a08667D0787J8136f8290
$$ y = [-304884, 10902, 202846, -329025, 193149, 92138, 257032, -52793, 207181, 20267, -258471, -352963, 111372, -223409, 103999, -111020, 48833, 207524, -203171, 87038, -39645, -120136, -321103, -33840, -125818, 121451, 24448, 28258, 1320, 4215, 541, -12667, -329313, 15164, 83232, -8546, -150913, -631923, -275246, -245214, -104821, -137652, 139867, 229650, 156895, 62287, -40994, 35013, -80316, 119414, -128587, -186166, -86161, 94269, -98635, -41533, -123793, -75873, -183485, -79103, -95588, 133952, -356074, -380, 153307, -281797, -49578, -322956, -70920, -146365, -254464, -86126, -105245, -343104, 48750, -262557, -95225, 49719, -180562, 2498, 85726, 23113, 106850, 139330, -43157, -207066, 377223, 121681, -108667, 40787, 58923, -68290]
10727B9585K80339b01572j15030a2784j10001h99A9344J90519J33049h2677A30029
10715b48236h8086k32800L9500B68240a74490j70643D2094a75391A15405g3409
10704C47489j60278B2951b86659j23732A39359a09068B19892a26115k9430P0121
10694h5424l28090g1688F920J53605a13871B22239b87853A25404i8102l16761
10684d14863a03905r9910k14352c0442a1889H7819a36949A52137I042Q8737k1190
10673G6589a7243E40153B52360c5633C841O2589a66618j38318J21666A95148a42130
10661f5812A25307h0290b0557A43885F8299a55765g3921H6835l8061d0544o0838
10650a01382D1085P1653e0577j2875j76863N0817A06428J01146a37861m1586l23858
$$ y = [29585, 309924, -201572, -316602, -12784, -122785, -899, 19344, 209863, 342912, -82677, 130029, -248236, -88086, -320886, -281386, 268240, -174490, -345133, 42094, -175391, 115405, -73409, 347489, 187211, 22951, -286659, -410391, 139359, -109068, 219892, -126115, -155545, -85424, -413514, -71688, 6920, 160525, -113871, 222239, -287853, 125404, -98102, -414863, -103905, -203815, -418167, -30442, -11889, 87819, -136949, 152137, 9042, 97779, 76589, -17243, 540153, 252360, -35633, 3841, 66430, -166618, -304936, -183270, 195148, -142130, -65812, 125307, -80290, -20557, 143885, 68299, -155765, -73921, 86835, 48774, -40544, -101382, 41085, 112738, -50577, -63452, -240315, -189498, 106428, 207574, -137861, -179447, -503305]
10639e03305a2792L909r3785H3076J992K06856j22758a4684I9419K7193a84497
10627a84380B9843e0071j95464R8956f3669m1896B41993f9240m8904H3644d1022
10615H8550c32572a23669j82560P8982Q8604A02714M8183j9222E4199a0199j31388
10604a41587H7467a06169A228a1600A86052b23020D5179A8916a63052I8471a88674
10592b47519b9410A51094b20120N6506A67518J0784k3754a28494C7629K9376L42939
10581D09944a63333o6316P6053L7778j24170f3611p7468n157A43890D46b80445
10569I3853b43185j13738N8452e5277l30548b8891j45240M3961A19914a48290
10558A9974b03980P3576e900l50003R9910A90535a0973B3157K51606d9115F2013
$$ y = [-503305, -12792, -8883, -102668, 83076, 85068, 291924, 169166, -14684, 99419, 126612, -184497, -184380, 29843, -50071, -245535, -146579, -63669, -105565, 241993, -69240, -118144, 83644, -41022, 88550, -332572, -123669, -306229, -227247, -138643, 102714, 150897, 131675, 54199, -10199, -141587, 87467, -106169, 1228, -11600, 186052, -223020, 45179, 18916, -163052, 98471, -188674, -247519, -29410, 151094, -220120, -163614, 167518, 178302, 154548, -128494, 37629, 67005, 409944, -163333, -229649, -153596, -115818, -239988, -63611, -141079, -146236, 143890, 446, -280445, 93853, -243185, -356923, -298471, -55277, -385825, -28891, -174131, -130170, 119914, -148290, 19974, -203980, -130404, -5900, -355903, -255993, 190535, -10973, 23157, 274763, -49115, 62013]
10546A37540b46049a9043j5504j03937j04773L9476j31026c6433H7263B2255L7278
10535E9533a26292B54533d3311j21399g3838l2248A94202i6878C02069a70468
10524b1810j10618A40900n9637h6160j65901h5746r2179J7190D7136a28453K330
10513a26123D5168R2729g7198a2717q3883A02774b57046a0015I8514b74177C29951
10501A53008a837k57260a15357k333B29921e5929D50214j14659A54922c68234
10490F7108g8645j06663j59418E0443a38337j00452C20720b486B47729j00693
10480A47036e8739H4142a0187F7194j3113L28143a81202A865a72451F8384a03433
10468e4902B2488d7635o4189A73442D2970O7516a36046E17314A8990b97437A50885
$$ y = [137540, -246049, -19043, -34547, -138484, -243257, -203781, -334807, -36433, 87263, 22255, 59533, -126292, 254533, -43311, -164710, -73838, -106086, 194202, -96878, 302069, -170468, -21810, -132428, 140900, 81263, -86160, -252061, -85746, -177925, -160735, 47136, -128453, -126123, 45168, 137897, -77198, -12717, -96600, 102774, -257046, -10015, 98514, -274177, 329951, 153008, -1837, -259097, -115357, -117690, 229921, -55929, 450214, 335555, 154922, -368234, 67108, -78645, -185308, -344726, 50443, -138337, -238789, 320720, -2486, 247729, 147036, -58739, 84142, -10187, 67194, 54081, 382224, -181202, 1865, -172451, 68384, -103433, -54902, 22488, -47635, -111824, 173442, 42970, 110486, -136046, 517314, 18990, -297437, 150885]
10456a74103g8382B89398B8864J98286e1404K3620H5068K51390F1830a63146B19727
10444c54715D48537F5016O4582h0658A5973f5898n0516j59811A92154a56728j76168
10433c32896E9129c2041E6644h9682a2107l49962J42174B64283o3393f3110C78058
10421f7909q9582c8085j71959D1909e3449k93841B87046a61127j41682A67540
10410B57291e57932B28978a55162k1673P8733n3017G5763i7728B06301a05939
10399d8271A28709g0804j08867b5311G5733K7548k2066L44089j69086M6289j45753
10388A56754l3448l1516a10306A27298a19788A04040h0176l9152A00205l73g5286
10376A67171h0740C57218b8605B34692D6302J5540Q6603J07663j14525J57969
$$ y = [-174103, -78382, 289398, 28864, 227150, -51404, -27784, 85068, 336458, 61830, -163146, 219727, -354715, 448537, 65016, 129598, -80658, 15973, -65898, -116414, -276225, 192154, -156728, -332896, 59129, -32041, 56644, -89682, -12107, -362069, -219895, 264283, 200890, -63110, 378058, -67909, -157491, -38085, -210044, 41909, -53449, -347290, 287046, -161127, -302809, 167540, 257291, -557932, 228978, -155162, -176835, -98102, -151119, 75763, -97728, 206301, -105939, -48271, 128709, -70804, -179671, -25311, 75733, 103281, 81215, 425304, 256218, 302507, 156754, 123306, 91790, -110306, 127298, -119788, 104040, -80176, -119328, 100205, 99832, -75286, 167171, -80740, 357218, -28605, 234692, 46302, 61842, 148445, 256108, 141583, 299552]
10366B99552N1468j53151J0434J01319R8530A7497J95871H2952l2205R2672K98718
10355D42137E6362K30654J48995j9939J27573k8687L51426l25622B61678J69617
10345D31295J44843B74448J92612Q6381A54680K69890q6728P624p6855J31835
10335D00446r6506B8902M5765M57150j61800A48597g1877E444M9797K98856F9046
10323a69525E25060k42099h8788a7805C48878a16703B34262a44284A86398a16689
10312G8261e0610D92771d72379d8532A23501P3230m0216B006J78937p8186a48456
10300i285A97304c2469j0007l50577h2276j06822B45012i31j1309A5230J66514
10289A81744b27782A46475Q8658m9038f7800N038n2832k51113C3723I963R3640
$$ y = [299552, 351020, 197869, 208303, 309622, 408152, 17497, 213368, 82952, 50747, 143419, 442137, 56362, 287016, 436011, 416072, 543645, 514958, 866384, 540762, 261678, 431295, 576138, 274448, 467060, 553441, 154680, 424570, 337842, 345466, 268611, 400446, 303940, 28902, 74667, 531817, 370017, 148597, -71877, 5444, 55241, 354097, 69046, -169525, 525060, 282961, -88788, -17805, 348878, -116703, 234262, -144284, 186398, -116689, 78261, -50610, 492771, -472379, -48532, 123501, 196731, 156515, 2006, 180943, 102757, -148456, -9285, 197304, -32469, -42476, -393053, -82276, -189098, 245012, -931, -12240, 15230, 181744, -227782, 146475, 235133, 186095, -67800, -62762, -115594, -366707, 33723, 9963, 103603]
10278A03603c24004L3982J39611N8141l2200b4577F2581B4477b9516A56776b82838
10266b85217A20147b77548A71660E8737b00103B64043j22124L9912Q942F0203
10255A83726b74171B52223K10873A71802g6295L7151A35782k5489c39725J13884
10245b25841e8105k58092K8326E8966R6823a21078o9554k35550b6328e327A71024
10233b35625Q2323B61804b92835A6755o969J8858B973a0164j94492A42988a48435
10221A75965b73723E0544a40374j02836A21317c66965C0300c16274j2459b8715
10210A44372c54030a37135A96819B8321I985g4566p6398A5629b37902M5415e1150
10198B52605A0976R740P7241K0380c28387a4606A24972b72957Q1678j2675G3861
$$ y = [103603, -324004, -290022, -150411, -92270, -124470, -24577, 62581, 24477, -29516, 156776, -282838, -285217, 120147, -277548, 171660, 58737, -200103, 264043, 141919, 181831, 190773, 60203, 183726, -274171, 252223, 463096, 171802, -76295, -39144, 135782, 110293, -339725, -225841, -58105, -316197, -287871, 58966, 155789, -121078, -190632, -426182, -26328, -5327, 171024, -235625, -153302, 261804, -292835, 16755, 9786, 28644, 2973, -10164, -204656, 142988, -148435, 175965, -273723, 50544, -140374, -243210, 121317, -366965, 30300, -316274, -328733, -28715, 144372, -354030, -137135, 196819, 28321, 9985, -74566, -150964, 15629, -237902, -192487, -51150, 252605, 10976, 20716, 97957, 118337, -328387, -14606, 124972, -272957, -191279, -203954, 73861]
10186A74140a57040g6232k20618J19262b3366E45022c42178R5662p612g828E5653
10174a26206n7716D78384j86723D4994D72a10264j41259b2258j81451A99540a84006
10162F5775A4497c5636j08419A51418b01171c3811j90714h401A90414A1872a36961
10150A27669b37431J9068I1010c1020j33461B21943c8872j11978I0822N664l9158
10139E7328i1391k68661n831G1728b35605C4738H034d9589I087k729b13953L9988
10127a73965K4513o0431A1476d75509J00079J69346d4255j49474B68891r9925
10117A68966l9730b88557B4936L0080A2206a36975p586o415e7628B9718K74154
10106C03872g2043B02703B7305e2007D7842c05996N5428A11317b09049H6358M7207
$$ y = [174140, -157040, -76232, -296850, -177588, -23366, 545022, -342178, -246516, -254128, -7828, 55653, -126206, -183922, 478384, 291661, 44994, 472, -110264, -251523, -22258, -203709, 199540, -184006, 65775, 14497, -35636, -144055, 151418, -201171, -33811, -224525, -8401, 190414, 11872, -136961, 127669, -237431, -218363, 91010, -31020, -164481, 221943, -38872, -150850, 90822, 96486, 57328, -91391, -360052, -365883, 71728, -235605, 34738, 8034, -49589, 9087, 6358, -213953, -173965, -149452, -209883, 11476, -475509, -375430, -206084, -44255, -193729, 268891, 168966, 129236, -288557, 24936, 55016, 12206, -136975, -144561, -150976, -57628, 29718, 303872, -72043, 202703, 27305, -52007, 47842, -305996, -250568, 111317, -209049, 86358, 133565]
10095A33565p938a34029J5796n0078F4182a25270n1844a8212A09944c05246A17216
10083d17267a93366j92006j22919a40985C720Q5053b22673j03641M4232c7598
10072f5602q2335F9681J99J22611b51994e4982l07433B54046a07919l97978D3354
10060h9403r6457B11374H2437M3458b06312G5548A0457M5253b13314B663b61981
10048C71190H5470J9367J75030k2002k2530d02311a39173p7591j42661I9804a01417
10036B2396b71373A09366r768e5963A18789K857B8887h9040A36357m3341c16466
10024a92296A61284i5359p9329e6244l33639C8708a61695F4471J37466b2325B62285
10012A5143h4878I4957c9879B73286j0318D9432c49300K9794H4159L11713o46
$$ y = [133565, 125627, -134029, -118233, -168311, 64182, -125270, -177114, -18212, 109944, -305246, 117216, -417267, -193366, -385372, -508291, -140985, 3720, 88773, -222673, -326314, -282082, -37598, -65602, -147937, 69681, 69880, 192491, -251994, -54982, -362415, 254046, -107919, -505897, 43354, -89403, -185860, 211374, 82437, 125895, -206312, 75548, 10457, 55710, -213314, 2663, -261981, 371190, 85470, 104837, 279867, 257865, 235335, -402311, -139173, -216764, -359425, 99804, -101417, 22396, -271373, 109366, 99598, -55963, 118789, 121646, 28887, -89040, 136357, 93016, -316466, -192296, 161284, -95359, -174688, -56244, -389883, 38708, -161695, 64471, 201937, -22325, 262285, 15143, -84878, 94957, -39879, 273286, 262968, 49432, -349300, -319506, 84159, 395872, 395226]
10001C95226j03710b27527D2526b8176l2786r5503A04850c50412A00262b09695
9990a48186m00486B0385N3733m752b1422k87606k10667E8986J46099a74927h7273
9978e08041a12114j1054M8430j04417k58710A58145a12811e5543j03580K3611
9968a35512N2549D82573b03359A44996c6524Q071D8979J1174J34690b68036Q7716
9957a80320A37804a24119C3366d22763a64660O3012B8340c84817J53027A34027
9946b38701E7688J40610m2492a40055q2096A87209e8668D4144J6958a37971A59353
9934A02117B6572a9898A66754m0542O8786b10007A32861E341g4766A41840J09399
9923B51239b88282J31795A82240p6740f7556q4191B1962c035k21774K2535A4435
$$ y = [395226, 291516, -227527, 42526, -28176, -60962, -156465, 104850, -350412, 100262, -209695, -148186, -548672, 20385, 74118, 69366, -21422, -309028, -519695, 58986, 205085, -174927, -87273, -508041, -112114, -123168, -74738, -179155, -437865, 158145, -112811, -55543, -159123, -135512, -82963, 482573, -203359, 144996, -36524, -28453, 48979, 60153, 194843, -268036, -180320, 137804, -124119, 33366, -422763, -164660, -101648, 28340, -384817, -231790, 134027, -238701, 57688, 198298, 155806, -140055, -222151, 187209, -58668, 44144, 61102, -137971, 159353, 102117, 26572, -19898, 166754, 126212, 194998, -210007, 132861, 5341, -74766, 141840, 251239, -288282, -156487, 182240, 105500, -67556, -151747, 21962, -3035, -224809, -202274, 14435]
9911c7917J412o2072c9212O70G8148d6972k07837A11044a92525d8412C05989a55102
9898b76422a13696p1364d8335B6845R512b1082q030H4785a18574j7702B42067
9886A42996a03258o4291A22234C0994O843a72540B07279a24593n5035j79892A13166
9874a08206G0973a73208p8019h2043j39522E8156g0110A52867b28369A86448a29593
9862a7081l18040A2917a38805D5517c05165j22336C64732a33899A54059m4135
9852A09924a87708p0029a28661j42601A10319a43335d8370C42575G8440j6519
9842F1921b65471B801b56271B06328r7429J9753B281K75757q5944o1118K59081
9831C90057B2306J04848C135Q5010a44844p0637B68067a1462A25100h3715l4934
$$ y = [-37917, -36505, -98577, -39212, -38542, 78148, -46972, -254809, 111044, -192525, -48412, 305989, -155102, -276422, -113696, -185060, -48335, 26845, 36357, -21082, -29112, 84785, -118574, -136276, 242067, 142996, -103258, -167549, 122234, 30994, 37837, -172540, 207279, -124593, -179628, -359520, 113166, -108206, 70973, -173208, -251227, -82043, -221565, 58156, -70110, 152867, -228369, 186448, -129593, -17081, -335121, 12917, -138805, 45517, -305165, -427501, 364732, -133899, 154059, 109924, -187708, -257737, -128661, -271262, 110319, -143335, -48370, 342575, 78440, 61921, -265471, 2801, -256271, 206328, 108899, 128652, 2281, 278038, 192094, 130976, 390057, 22306, 127154, 3135, 88145, -144844, -215481, 268067, -11462, 125100, -83715, -118649]
9820a18649H7847d278A64195j3842a83836k03793g779D5649J88125c09541i3750
9808b03592k1535O0878D2871a88198K0029D3082a25969B6654J54307m541b44662
9796d4647H6828b41621A18160a35921A13148l4308A9236J06329d9664k6000p1193
9785a46857k91568A14802d438G5167b6751A02370J30556H7812a64151F8528A969
9773c90201a11825C7852c91915A49476a4570B56270b22559h7892m45534f3888
9762h7072j71572B14154A6964d9086m26343h2324m3116l3251H2458a47780d4416
9750c13G9030d51540h5477j99278A19171c02838B30443J51356j88118c39008J42876
9739a96132H5336a9608B2274a05021L595a0248k07949A02909c11922P9716b3045
$$ y = [-118649, 87847, -4278, 164195, 150353, -183836, -387629, -7779, 45649, 233774, -309541, -93750, -203592, -225127, -164249, 42871, -188198, -168169, 43082, -125969, 26654, 180961, 176420, -244662, -44647, 86828, -241621, 118160, -135921, 113148, 78840, 19236, 125565, -49664, -75664, -146857, -438425, 114802, -4438, 75167, -26751, 102370, 232926, 87812, -164151, 68528, 1969, -390201, -111825, 37852, -391915, 149476, -14570, 256270, -222559, -87892, -533426, -63888, -87072, -258644, 214154, 16964, -49086, -475429, -82324, -125440, -158691, 82458, -147780, -44416, -313, 79030, -451540, -85477, -284755, 119171, -302838, 230443, 381799, 193681, -339008, -196132, 85336, -19608, 22274, -105021, -101426, -10248, -218197, 102909, -311922, -232206, -23045]
9727a01500A36443c82881A10118a02161K5683j02440A8043i8929r7724A9105M1472
9716F0577a34673d5396C9717c244D6717L7718b19468E0368k3228J85025c06172
9704g0135I1687A6647d16389J52603c7251p9099b6728A16412a47352C711b46806
9692a60909P5481c0890k18167l2602r9476e2795B08383a15512C3692A6208a53826
9680e8356n7239L7298j4738A2933O0582K62561a64651l13104b17650N7808B09386
9668D3359P1930l6657l7163L61461A3270a63106G1753a17299r1591g7455A44907
9656F640O1284b7602A78236d5781A41915b66010j63499a62213A18359b39038q1862
9645c20900J02253c1093B35692a23264j78690h737j59978o2251e4461B85708j28062
$$ y = [-101500, 136443, -382881, 110118, -102161, -76478, -178918, 18043, -98929, -196653, 19105, 60577, -134673, -45396, 39717, -3244, 46717, 84435, -219468, 50368, 27140, 212165, -306172, -70135, 91687, 16647, -416389, -263786, -37251, -116350, -26728, 116412, -147352, 3711, -246806, -160909, -85428, -30890, -249057, -281659, -381135, -52795, 208383, -115512, 33692, 16208, -153826, -58356, -115595, -78297, -93035, 12933, 73515, 336076, -164651, -477755, -217650, -159842, 209386, 43359, 115289, 78632, 41469, 402930, 13270, -163106, 71753, -117299, -208890, -77455, 144907, 6640, 67924, -27602, 178236, -45781, 141915, -266010, -429509, -162213, 118359, -239038, -320900, -218647, -31093, 235692, -123264, -301954, -8737, -168715, -230966, -54461, 285708, 157646]
9634A57646a46705C98638A00166a43857G5489L5327H728P3567A737a94413P6640
9623a17773d1216L01B4422a84192A22194i7567j50257B42778e9381r2360G2564
9611B56635d0131j86772o1764C04534g3703j1342J2183c5004j08241j10979a10138
9599C479L11520i1550D9551J72659f7172p178A3708a53243b9541c145B09333E0940
9586a03863P825C6764i1078j4841m3588j47192C1956h6690A19419f0986k57265
9575c18251J13801B27210c86259e5283J5766J9216H4701a09180H383a7945A29849
9563B06815c45900a29134j60753A43456b67873c8265n3702l7496J7323j86458
9553b98598l93A25258a49599H4011b20228K0346o0618b943j7832m7740a3158k45810
$$ y = [157646, -146705, 398638, 100166, -143857, 75489, 110816, 8728, 82295, 1737, -194413, -117773, -41216, -40915, 24422, -184192, 122194, -97567, -247824, 242778, -59381, -151741, 72564, 256635, -40131, -226903, -288667, 304534, -73703, -85045, -72862, -35004, -143245, -254224, -110138, 3479, 314999, -91550, 49551, 222210, -67172, -74350, 13708, -153243, -29541, -3145, 209333, 50940, -103863, -96038, 36764, -91078, -105919, -149507, -296699, 31956, -86690, 119419, -60986, -318251, -204450, 227210, -386259, -55283, -39517, -20301, 84701, -109180, 8383, -17945, 129849, 206815, -345900, -129134, -289887, 143456, -267873, -38265, -91967, -129463, -112140, -298598, -298991, 125258, -149599, 84011, -220228, -199882, -260500, -2943, -20775, -68515, -13158, -258968]
9541b58968B4750i4849h157F7723b87326c6070l3973j08174a6398j20307f0687
9529f8486K2261D2632a61061G9363K3914J59755f2628K2548k44718g9494q9409
9518a68903d1036A6795K00372Q8486a92000b3418I3119h1144j13215b200l70270
9507c72470J55623C9259b5r1852k76356H9005p319a12061a3668l5175j50247A66034
9494a8422q1590j21380E4849K40953a60006l1743f4955k5099j8768E0416J57020
9483B07436b02626b3464j92001D20874A9351a9083J213j15596k10139C7658K6575
9472F4233f1434D1675c30985A75122E1738b60890d293m2699k06798c6761A73735
9460C0130c1451m96780h1198f401q8137K8904j74867F115Q6234m2016J84883a35101
$$ y = [-258968, 24750, -94849, -8157, 67723, -287326, -36070, -70043, -178217, -16398, -136705, -60687, -68486, -46225, 42632, -161061, 79363, 103277, 263032, -62628, -40080, -284798, -79494, -168903, -41036, 16795, 217167, 305653, -192000, -23418, 93119, -81144, -194359, -2200, -372470, -216847, 39259, -25, -91877, -368233, 89005, 81686, -112061, -13668, -48843, -199090, 166034, -18422, -100012, -221392, 54849, 295802, -160006, -191749, -64955, -90054, -108822, 50416, 207436, -202626, -23464, -215465, 420874, 19351, -19083, -17870, -133466, -343605, 37658, 64233, -61434, 41675, -330985, 175122, 51738, -260890, -4293, -46992, -253790, -36761, 173735, 30130, -31451, -528231, -81198, -6401, -94538, -65634, -240501, 6115, 92349, 50333, 235216, -135101]
9447A0120c9913D9844b65533B1834a28443c8149A8362b3820A20201a83249a0063
9435a80532l6225l228c5566A7696e8353r3090a4861A07325c8690k53451N4928
9424b37213m398J1539d9455j38849M7020n6479F1105a54874L6481a0016o8262
9413g8278q9309B9220a09747G6456b54501k25234f913A77150k531c81571a22070
9401a95513A98239f765q1191p6063m8139A70255b7653k1779r9303k83871H8712
9389b94424i9932D9471K8723M8627m611K6329M7675b65243a8714j00533H42Q8194
9377H9036l9044h8763k35859I0701b3519k25338a540j82249e580D3362n134a1913
9364g7857k17925A129M62931b4956B0895a53312G7243g2140l7307B76999A28197
$$ y = [10120, -39913, 49844, -265533, 21834, -128443, -38149, 18362, -23820, 120201, -183249, -10063, -180532, -216757, -219985, -35566, 17696, -58353, -151443, -14861, 107325, -38690, -292141, -237213, -241611, -230072, -49455, -188304, -141284, -197763, 61105, -154874, -118393, -10016, -78278, -167587, 29220, -109747, 76456, -254501, -479735, -6913, 177150, 174619, -381571, -122070, -195513, 198239, -6765, -87956, -164019, -212158, 170255, -27653, -49432, -148735, -432606, 88712, -294424, -99932, 49471, 78194, 126821, 122210, 148539, 196214, -265243, -18714, -119247, 842, 89036, 49992, -88763, -324622, 90701, -23519, -248857, -1540, -183789, -5580, 43362, 38228, -11913, -77857, -295782, 1129, 464060, -24956, 20895, -153312, 77243, -72140, -109447, 276999, 128197]
9352B8850K73911a17208d2782j48094e1771B5545a46504l13779A33899a38678
9341a05351D5358b78104i011j1984j72780h8890L4940I4119a05177q2098N0055
9330a37220A15676E3909j2526a98891c3494C6894K77693c7284j62276B35309b39411
9318A3537c36688A42811c63616H2231O1799c78507a5157B08728c39734B2048a97876
9306A73218F2978f486l19555D9395c143C4881f521A57980p5911K85627D8372a58968
9293A50351L1560a92384e7404B18755j00782a20188l9709c8318a1674A145K81635
9282B82780B276a42682c4700A63925A8255b5040G6424f1654j29567A61868k5234
9271A36634E2134M3588a43327K6400A02034d40294B5151a17250B45805f1969D83243
$$ y = [28850, 302761, -117208, -42782, -190876, -51771, 25545, -146504, -460283, 133899, -138678, -105351, 45358, -278104, -9011, -20995, -193775, -88890, -53950, 94119, -105177, -187275, -137220, 115676, 53909, 41383, -198891, -33494, 36894, 314587, -37284, -199560, 235309, -239411, 13537, -336688, 142811, -363616, 82231, 144030, -378507, -15157, 208728, -339734, 22048, -197876, 173218, 62978, -6486, -326041, 49395, -3143, 34881, -6521, 157980, 82069, 367696, 48372, -158968, 150351, 181911, -192384, -57404, 218755, 117973, -120188, -159897, -38318, -11674, 1145, 282780, 2276, -142682, -34700, 163925, 18255, -25040, 76424, -61654, -191221, 161868, 136634, 52134, 95722, -143327, -116927, 102034, -440294, 25151, -117250, 245805, -61969, 483243]
9259A09539a51118L9789A00494j6571b79011E2493O144k145Q290E810b24352G1333
9246C0040i6204B0183h7354j12676d9977E0636a94240e8035A89930c9698k77040
9235c16738D0350a74407G2064a08482j57922d752r9776g46B73487b62198p8142
9224c40340e86B03222j8170a58116j4417A40742l0141i1349d2313A5727N2021
9213F7748l1347P7091f8374k20540b5586A38873a29319A997a56391j55756J703
9202c10444c7547k14244O7326B68474c21832j05741a44761K5753h911k58347J3363
9191b53895J23513E985h4456M1929F3031b18734A85929e7433B56332a85647q8199
9180b73846C21952b20530D3541N5740c15741J06390e4085j09670B55342F3436
$$ y = [109539, -151118, -111329, 100494, 83923, -279011, 52493, 58637, 56492, 64782, 5810, -224352, 71333, 30040, -96204, 20183, -87354, -200030, -49977, 50636, -194240, -58035, 189930, -39698, -316738, 40350, -174407, 72064, -108482, -266404, -4752, -104528, -746, 273487, -262198, -340340, -586, 203222, 185052, -158116, -172533, 140742, 110601, -91349, -42313, 15727, 67748, 36401, 113492, -68374, -288914, -25586, 138873, -129319, 1997, -156391, -312147, -310444, -37547, -251791, -184465, 268474, -321832, -427573, -144761, -119008, -8911, -267258, -253895, -130382, 5985, -84456, -42527, 63031, -218734, 185929, -57433, 256332, -185647, -273846, 321952, -220530, 43541, 99281, -315741, -209351, -54085, -163755, 255342, 63436]
9169A89081d2569k21313M7280d6853k07988R9536N0618C2263Q999a85949A07357
9157B19623B687h6764m9651p0440a008j51820d1549B57367p9242C8129a42855
9145b43444m754j47898B00254b64470Q8679A020d34601g6869k96555A80499c46642
9133B42326c9687J2844B16450b5675l3370B09555H2628A9412R9029b30498p2445
9122c02943A09719a25294A21285e362k29673H5762R5153b50665j70133J32293
9112b88505B33437G3310J1750A0493b30242G4126a62409A70263A8155a02298j82435
9101b84733A14238m2220b01854G058c0056a256l44097B0111d01931F5285c8799
9089A59133c06120A43980i3741C3995r10b25338i0624n16601b67901g5216B34025
$$ y = [189081, -42569, -263882, -216602, -46853, -254841, -155305, -104687, 32263, 41262, -185949, 107357, 219623, 2687, -86764, -136415, -206855, -1008, -152828, -41549, 257367, 178125, 38129, -142855, -243444, -248198, -396096, 200254, -264470, -175791, 1020, -434601, -76869, -373424, 180499, -346642, 242326, -39687, -26843, 216450, -25675, -59045, 209555, 82628, 19412, 118441, -230498, -302943, 109719, -125294, 121285, -5362, -235035, 85762, 180915, -250665, -420798, -288505, 233437, 73310, 85060, 10493, -230242, 74126, -162409, 170263, 18155, -102298, -284733, 114238, 72018, -201854, 7058, -30056, -1256, -345353, 20111, -401931, 65285, -38799, 159133, -306120, 143980, -93741, 33995, 33085, -225338, -90624, -607225, -267901, -75216, 234025]
9077A20339K66034b08939K3364j53741B14570a15133a8571F8203e5953N947p9893
9066a29899k930N4319j37383F8780d3980l60034A78196E2302J59551b8348j10254
9055a38602k0745L526E2750a76322L1229g1649B30903a90814B51501E5990O0078
9044A16068m0179i5335j03063B00284i2450l11873J32447B5763m72a53436B92655
9032a57025P8134A73293A0886i8603E117a34634I1609a36665c5160c716j42803
9021a46519c4123j29143d5502k21920i0210e273A13030f1887m0615r7979C68445
9009C95378j22358b83047Q0164P844f428j47116C3422a66592J5128e5238o0179
8998a15417I0998b7693C37256q2855I780b51279a05746b5056k82k12839E4654
$$ y = [120339, 386373, -208939, -185575, -339316, 214570, -115133, -18571, 68203, -55953, -50006, -129899, -132829, -78510, -215893, 68780, -43980, -404014, 178196, 52302, 211853, -28348, -138602, -159347, -155821, 52750, -176322, -145093, -71649, 230903, -190814, 251501, 55990, 116068, 75889, -95335, -198398, 200284, -92450, -404323, -271876, 25763, 25291, -153436, 292655, -157025, -78891, 173293, 10886, -98603, 5117, -134634, 91609, -136665, -35160, -3716, -146519, -34123, -163266, -45502, -267422, -90210, -5273, 113030, -61887, -102502, -200481, 368445, 395378, 273020, -283047, -202883, -195039, -6428, -153544, 33422, -166592, -151464, -55238, -115417, 90998, -27693, 337256, 254401, 9780, -251279, -105746, -25056, -25338, -238177, 54654]
8986A04142n026J19102K849H824a13664H641a960A13004a19164A39220J00752
8975B39972r7673c45089e5615F7590c344D53N1269d4291j32253A11418a13431
8963H1514J02017g9087D4368c05551R5211L8067j03338a33282j53923E7604a13705
8951g1283j85894A0486a99153Q5672b715o3182j14921B02029f0539k51928j46928
8940d59395B2974J25765b57238d4334B1196a16753A09447a2811l20925G399M01924
8929D09323d01440B2128c6756A80650K97967O09487K242724L186366L356014B635879
8918F86912N1232k59669D9052J01883A6727a37888A9265J4186K47037j25270G577
8906A17917c153A37283a50127p4798Q6068G4340J39064b7588A22252d9024m99134
$$ y = [104142, 99116, 218218, 221067, 8824, -113664, 8641, -1960, 113004, -119164, 139220, 239972, 142299, -345089, -55615, 67590, -3344, 453, 51722, -44291, -176544, 111418, -113431, 81514, 183531, -79087, 44368, -305551, -210340, -172273, -275611, -133282, -287205, 57604, -113705, -71283, -257177, 10486, -199153, -113481, -2715, -65897, -180818, 202029, -60539, -312467, -459395, 22974, 148739, -257238, -44334, 21196, -116753, 109447, -12811, -333736, 7399, 409323, -401440, 22128, -36756, 180650, 478617, 1088104, 3330828, 6517194, 9873208, 2635879, 686912, 738144, 478475, 49052, 150935, 16727, -137888, 19265, 33451, 280488, 155218, 7577, 117917, -3153, 137283, -150127, -224925, -138857, 74340, 213404, -27588, 122252, -49024, -548158]
8895e48158K06144B36898p4036E9374j7808K1449J10464a10029l9970H256b4351
8883A63215G7152g7463A23351K1340c41210B15645h5048A09728b31427C00569
8872e2911m805J0758A1500J32039k9496R6851O3732G8869g8923l9282A42340b00903
8859c4647q9663d5326j85285i7902E1367c06283a49324q9248M7842A34113J43610
$$ y = [-548158, -342014, 236898, 162862, 59374, 41566, 63015, 173479, -110029, -149999, 8256, -24351, 163215, 77152, -77463, 123351, 144691, -341210, 215645, -85048, 109728, -231427, 300569, -52911, -57716, -46958, 11500, 143539, 114043, 210894, 274626, 78869, -78923, -118205, 142340, -200903, -34647, -124310, -45326, -230611, -97902, 51367, -306283, -149324, -238572, -190730, 134113, 277723]
$$ [...]
##END NTUPLES=NMR SPECTRUM
##END=
