
##TITLE=UV1113_M2_1290-1353_7180679_BAYOcqiqza
##JCAMPDX= 6.0         $$ Bruker NMR JCAMP-DX V2.0
##DATA TYPE= NMR SPECTRUM
##DATA CLASS= NTUPLES
##ORIGIN= BRUKER
##OWNER= Administrator
$$ 1.72 TOPSPIN		Version 2.1
$$ 2012-12-05 02:29:00.118 -0500  Administrator@X
$$ Compression mode = diff/dup
##.OBSERVE FREQUENCY= 400.02188249412
##.OBSERVE NUCLEUS= ^1H
##.ACQUISITION MODE= SIMULTANEOUS (DQD)
##.ACQUISITION SCHEME= undefined
##.AVERAGES= 8
##.DIGITISER RES= 22
##SPECTROMETER/DATA SYSTEM= spect
##.PULSE SEQUENCE= zg30
##.SOLVENT NAME= COFFEE_meoh
##.SHIFT REFERENCE= INTERNAL, COFFEE_meoh, 1, 14.98509
##AUDIT TRAIL= $$ (NUMBER, WHEN, WHO, WHERE, PROCESS, VERSION, WHAT)
$$ ##TITLE= Audit trail, TOPSPIN		Version 2.1
$$ ##JCAMPDX= 5.01
$$ ##ORIGIN= Bruker BioSpin GmbH
$$ ##OWNER= Administrator
$$ $$ E:\/data/COFFEE/nmr/UV1113_M2_1290-1353_7180679_BAYOcqiqza/10/pdata/1/auditp.txt
$$ ##AUDIT TRAIL=  $$ (NUMBER, WHEN, WHO, WHERE, PROCESS, VERSION, WHAT)
(   1,<2012-12-05 02:28:51.977 -0500>,<Administrator>,<X>,<go>,<TOPSPIN 2.1>,
      <created by zg
	started at 2012-12-05 02:27:46.040 -0500,
	POWCHK enabled, PULCHK disabled,
       configuration hash MD5:
       86 BA 57 50 F2 9D 5C 9B 26 00 A9 28 5F 66 2E 89
       data hash MD5: 64K
       26 73 0B 23 8F CC 32 78 3C 0F 7A AA 2A 84 AE FA>)
(   2,<2012-12-05 02:28:55.056 -0500>,<Administrator>,<X>,<proc1d>,<TOPSPIN 2.1>,
      <Start of raw data processing
       efp LB = 0 FT_mod = 6 PKNL = 1 PHC0 = 0 PHC1 = 0 SI = 32K 
       data hash MD5: 32K
       EE 87 39 9B B1 F0 A0 8B EC AF EB 35 5B DC EE E6>)
(   3,<2012-12-05 02:28:55.509 -0500>,<Administrator>,<X>,<proc1d>,<TOPSPIN 2.1>,
      <pk PHC0 = 97.70142 PHC1 = 0 
       data hash MD5: 32K
       70 B7 8E A6 C6 DF 0E A0 02 5A 8D 02 48 B6 32 35>)
(   4,<2012-12-05 02:28:55.743 -0500>,<Administrator>,<X>,<proc1d>,<TOPSPIN 2.1>,
      <abs ABSG = 1 
       data hash MD5: 32K
       EB 27 2C 36 5B 36 1A D7 01 2E 7D 0D D1 77 D0 60>)
(   5,<2012-12-05 02:28:55.884 -0500>,<Administrator>,<X>,<proc1d>,<TOPSPIN 2.1>,
      <abs ABSG = 2 
       data hash MD5: 32K
       9D 89 68 BD DB 35 87 39 54 BD 6B 3A BE BD 34 59>)
(   6,<2012-12-05 02:28:56.040 -0500>,<Administrator>,<X>,<proc1d>,<TOPSPIN 2.1>,
      <abs ABSG = 3 
       data hash MD5: 32K
       D7 0E A9 E4 88 AD 7D 0E B5 1A BB EE D0 0F 66 83>)
(   7,<2012-12-05 02:28:56.181 -0500>,<Administrator>,<X>,<proc1d>,<TOPSPIN 2.1>,
      <abs ABSG = 4 
       data hash MD5: 32K
       9A ED 3A 71 AC AE 50 BB 33 8A 4F D7 CF 54 1C 17>)
(   8,<2012-12-05 02:28:56.321 -0500>,<Administrator>,<X>,<proc1d>,<TOPSPIN 2.1>,
      <abs ABSG = 5 
       data hash MD5: 32K
       A3 12 F1 E6 62 62 0F CE B5 05 CD 05 9F D0 F0 CD>)
$$ ##END=
$$ 
$$ $$ hash MD5
$$ $$ 98 B6 FE 3C 3C 11 5C 02 F2 DD 91 5C ED E9 81 C7
##$RELAX= 
##$RELAX= 
##$RELAX= 
##$RELAX= 
##$RELAX= 
##$RELAX= 
##$RELAX= 
$$ Bruker specific parameters
$$ --------------------------
##$DU= <E:\>
##$EXPNO= 10
$$ [...]
150 150 150 150 150 150 150 150
##$TP07= 0
##$TPNAME0= <>
##$TPNAME1= <>
##$TPNAME2= <>
##$TPNAME3= <>
##$TPNAME4= <>
##$TPNAME5= <>
##$TPNAME6= <>
##$TPNAME7= <>
##$TPOAL= (0..7)
0.5 0.5 0.5 0.5 0.5 0.5 0.5 0.5
##$TPOFFS= (0..7)
0 0 0 0 0 0 0 0
##$TUNHIN= 0
##$TUNHOUT= 0
##$TUNXOUT= 0
##$USERA1= <user>
##$USERA2= <user>
##$USERA3= <user>
##$USERA4= <user>
##$USERA5= <user>
##$V9= 5
##$VALIST= <valist>
##$VCLIST= <CCCCCCCCCCCCCCC>
##$VD= 0
##$VDLIST= <DDDDDDDDDDDDDDD>
##$VPLIST= <PPPPPPPPPPPPPPP>
##$VTLIST= <TTTTTTTTTTTTTTT>
##$WBST= 2048
##$WBSW= 25
##$XGAIN= (0..3)
0 0 0 0
##$XL= 0
##$YL= 0
##$YMAX_a= 685261
##$YMIN_a= -583754
##$ZGOPTNS= <>
##$ZL1= 120
##$ZL2= 120
##$ZL3= 120
##$ZL4= 120
##$ABSF1= 14.98509
##$ABSF2= -5.573092
##$ABSG= 5
##$ABSL= 3
##$ALPHA= 0
##$AQORDER= 0
##$ASSFAC= 0
##$ASSFACI= 0
##$ASSFACX= 0
##$ASSWID= 0
##$AUNMP= <proc_prof1d_extract_pilot.lims>
##$AXLEFT= 0
##$AXNAME= <>
##$AXNUC= <1H>
##$AXRIGHT= 0
##$AXTYPE= 0
##$AXUNIT= <>
##$AZFE= 0.1
##$AZFW= 0.1
##$BCFW= 0
##$BC_mod= 0
##$BYTORDP= 0
##$COROFFS= 0
##$CY= 15
##$DATMOD= 1
##$DC= 0
##$DFILT= <>
##$DTYPP= 0
##$F1P= 0
##$F2P= 0
##$FCOR= 0.5
##$FTSIZE= 32768
##$FT_mod= 6
##$GAMMA= 0
##$GB= 0
##$INTBC= 1
##$INTSCL= 1
##$ISEN= 128
##$LB= 0
##$LEV0= 0
##$LPBIN= 0
##$MAXI= 10000
##$MC2= 0
##$MEAN= 0
##$ME_mod= 0
##$MI= 0
##$NCOEF= 0
##$NC_proc= -8
##$NLEV= 6
##$NOISF1= 0
##$NOISF2= 0
##$NSP= 0
##$NTH_PI= 0
##$NZP= 0
##$OFFSET= 14.98509
##$PC= 1
##$PHC0= 97.70142
##$PHC1= 0
##$PH_mod= 1
##$PKNL= yes
##$PPARMOD= 0
##$PPDIAG= 0
##$PPIPTYP= 0
##$PPMPNUM= 2147483647
##$PPRESOL= 1
##$PSCAL= 4
##$PSIGN= 0
##$PYNMP= <proc.py>
##$REVERSE= no
##$SF= 400.02
##$SI= 32768
##$SIGF1= 0
##$SIGF2= 0
##$SINO= 400
##$SIOLD= 32768
##$SPECTYP= <>
##$SREGLST= <1H.CDCl3>
##$SSB= 0
##$STSI= 32768
##$STSR= 0
##$SW_p= 8223.68421052631
##$SYMM= 0
##$S_DEV= 0
##$TDeff= 65536
##$TDoff= 0
##$TI= <>
##$TILT= no
##$TM1= 0
##$TM2= 0
##$TOPLEV= 0
##$USERP1= <user>
##$USERP2= <user>
##$USERP3= <user>
##$USERP4= <user>
##$USERP5= <user>
##$WDW= 1
##$XDIM= 32768
##$YMAX_p= 482809370
##$YMIN_p= -685514
##$CURPLOT= <Network HP LaserJet P1505>
##$CURPRIN= <$Network HP LaserJet P1505>
##$DFORMAT= <normdp>
##$LAYOUT= <+/1D_H.xwp>
##$LFORMAT= <normlp>
##$PFORMAT= <normpl>
##$SURQMSG= 1
$$ End of Bruker specific parameters
$$ ---------------------------------
##NTUPLES= NMR SPECTRUM
##VAR_NAME=  FREQUENCY,     SPECTRUM/REAL,   SPECTRUM/IMAG
##SYMBOL=    X,             R,               I
##VAR_TYPE=  INDEPENDENT,   DEPENDENT,       DEPENDENT
##VAR_FORM=  AFFN,          ASDF,            ASDF
##VAR_DIM=   32768,         32768,           32768
##UNITS=     HZ,            ARBITRARY UNITS, ARBITRARY UNITS
##FACTOR=    0.250966925370066, 1,           1
##FIRST=     8223.43324360094, -35849,       -59598
##LAST=      0,             -21751,          -83011
##MIN=       0,             -685514,         0
##MAX=       8223.43324360094, 482809370,    0
$$ Real data points
##PAGE= N=1
##DATA TABLE= (X++(R..R)), XYDATA
$$ [...]
19536a81439A7863b2616n93099K88484H8389a83795B76569b7532j53261B71420
19525a51655c0553j04524i066q7447Q164j40829A61890b1521j51794q720H4892
19513g3962j29887L3121g7691D8668A6096h8714p7121O2164a890A95216e4713
19501a73025A93414b62571H6244C4854c73598a40676k52737a72674j83471E5157
19490a6796j44904n1346O0028B52248K92596H4142a50201f3388f129k01229D3855
19478e4152n6401A54854A2591c61189j54211a19146c0078j59351A00781b16095
19467A86046H1385c99617J70068J4956j27376I1871K45735h8324A05350c543q5181
19456h8724j05492E7392K22072B9835f0301A40602f5720b2565E4701R9573g3696
$$ y = [-181439, 17863, -22616, -615715, -327231, 88389, -183795, 276569, -27532, -180793, 271420, -151655, -30553, -135077, -9066, -96513, -88349, -229178, 161890, -21521, -173315, -182035, 84892, -73962, -203849, -170728, -77691, 48668, 16096, -88714, -165835, -103671, -1890, 195216, -54713, -173025, 193414, -262571, 86244, 34854, -373598, -140676, -393413, -172674, -356145, 55157, -16796, -161700, -213046, -153018, 252248, 544844, 84142, -150201, -63388, -6129, -207358, 43855, -54152, -110553, 154854, 12591, -361189, -515400, -119146, -30078, -189429, 100781, -216095, 186046, 81385, -399617, -229549, -214593, -341969, 91871, 337606, -88324, 105350, -3543, -88724, -194216, 57392, 279464, 29835, -60301, 140602, -65720, -22565, 54701, 154274, -73696]
19444G9818K4077B9628b97347J25646C3477O2390j0854D0174E121O6501k4945
19433D6677a96670B7238f3376J2219l38017a92834e2213A37620b12496B14698
19422E118J09277b16649i8019q7090A07105M1257a40791c4847B4374e0602j92789
19411b43391K6511h9014B31114I9968l0418B7453b88011i6449j45948C46123f4498
19399A06102C5405a32428N5029A9840c92371h6263J721D8714g1721E4429K84833
19388C39262A5710d45521F6802O1768A9739f9762k51549b3879E2734J00418k5186
19377A27966a47118c4936k09855J10709B560a203p8895A8530b52055b6033F44
19365B88741a23364j35123c7519k29344Q0149A64359b02551k0654A00158b06202
$$ y = [79818, 103895, 29628, -297347, -171701, 33477, 95867, 85013, 40174, 5121, 71622, 46677, -196670, 27238, -63376, -51157, -389174, -192834, -52213, 137620, -212496, 214698, 5118, 114395, -216649, -98019, -185109, 107105, 148362, -140791, -34847, 24374, -50602, -243391, -216880, -89014, 231114, 99968, 69550, 27453, -288011, -96449, -242397, 346123, -64498, 106102, 35405, -132428, -77399, 19840, -392371, -86263, -84542, 48714, -71721, 54429, 339262, 15710, -445521, 66802, 128570, 19739, -69762, -321311, -23879, 52734, 153152, 127966, -147118, -34936, -244791, -134082, 2560, -1203, -80098, 18530, -252055, -26033, 644, 288741, -123364, -258487, -37519, -266863, -186714, 164359, -202551, -223205, 100158, -206202]
19354e7376F501b75717H938a59855g5280C75968c15283a35318c1664B4889J80552
19343B05441a22174A14195E0879G115R5196K35241a78279q4681B62829c53180
19332i1052A25103g2843A54938E5016b24132A64448e06305b7415A94023I0763
19321b96475I8090a67468L8286A53229b5412A94498e4089A89457o0320n7704M6366
19310A17799c3735k09976L7552a3507j27830L9335A37089d03181J61401A54033
19299G2036b31135i552j23787A51629a30621M8076B62308c04254I0077a37006
19288g7504j81562D5365J16849b4208E7898b91210a05568B59953b07591Q1790
19278a25801A03048K8143M6397b66103j2783B8185a95998b1142A5018a82283M5567
$$ y = [-57376, 6501, -275717, 8938, -159855, -75280, 375968, -315283, -135318, -31664, 24889, 205441, -122174, 114195, 50879, 7115, 102311, 337552, -178279, -262960, 262829, -353180, -91052, 125103, -72843, 154938, 55016, -224132, 164448, -506305, -27415, 194023, 90763, -296475, 98090, -167468, -129182, 153229, -25412, 194498, -54089, 189457, 129137, 71433, 117799, -33735, -243711, -206159, -13507, -141337, -102002, 137089, -403181, -241780, 154033, 72036, -231135, -9552, -133339, 151629, -130621, -82545, 262308, -304254, 90077, -137006, -77504, -259066, 45365, 162214, -24208, 57898, -291210, -105568, 259953, -207591, -125801, 103048, 131191, 177588, -266103, -278886, 28185, -195998, -21142, 15018, -182283, -136716]
19267a36716G1416K27091a59616A62065J81481j37054c0307F7336a42665P68H5530
19255a41801f938j51230f4834l54444a03596M1020j15473F6572a78966j13250
19245b92216A47335a83589O8586I9208Q0706a92246M7190O5045j28593P6184O2146
19234g0274F5881e68528b01717R0489G6568A7980D528J14192j6003L59439c1234
19222d462B0220K04476a8151A24202N123B8524g917k28024Q3743C5566a04905
19210B5736K58601a10526j52423A56948C7779a32533A42774K31137A00475K06627
19200C07102b34773b1458l95948g5531j4143K6928C1667Q1678a70690A20790a79610
19188B6668a24053d8007G3334R8020b51873a20161D9305a79772k8999b3459k44794
$$ y = [-136716, 71416, 298507, -159616, 162065, 343546, 206492, -30307, 67336, -142665, -141897, 85530, -141801, -6938, -158168, -64834, -419278, -103596, -62576, -178049, 66572, -178966, -292216, 147335, -183589, -115003, 99208, 179914, -192246, -145056, -80011, -208604, -132420, -70274, 65881, -568528, -201717, -111228, 76568, 17980, 4528, 118720, 102717, 462156, -31234, -4462, 20220, 224696, -18151, 124202, 129325, 28524, -7917, -235941, -152198, 35566, -104905, 25736, 284337, -110526, -262949, 156948, 37779, -132533, 142774, 373911, 100475, 307102, -234773, -21458, -417406, -75531, -89674, -62746, 31667, 113345, -170690, 120790, -179610, 26668, -124053, -48007, 73334, 171354, -251873, -120161, 49305, -179772, -208771, -23459, -268253]
19177b68253B62027r0895f142l28765J19602i9848l0537A71487c3518A68620l7774
19166A30846c50697H4585o874i3948o7473c6805k24029L6067A04347J26518b48641
19154e8273o3076A23962b48975K897Q8459A19749a96976k9154C1286a94506A01436
19142B64142a6077r1067m7884j34278G1461a4248l44933a7083j28460E5638a49675
19130I6754J82567a48745B2971K7389c17053B2964c12948h504A15085e4725I8143
19118G3694b2887j23093q2111A847L59890j69264q6954C4997A4380b03542d6325
19106f1643n5389o5965C0999b53164d4727j46644p3226a0788A5106e070A97747
19094b11634B7752a40449J4945h831A00582c9355A37334k6345A3268b35901B55713
$$ y = [-268253, 262027, 171132, -6142, -334907, -215305, -99848, -130385, 171487, -33518, 168620, 130846, -350697, 84585, 77711, -93948, -161421, -36805, -260834, -224767, 104347, 230865, -248641, -58273, -121349, 123962, -248975, -246078, -157619, 119749, -196976, -226130, 31286, -194506, 101436, 264142, -16077, -107144, -155028, -289306, 71461, -14248, -359181, -17083, -145543, 55638, -149675, 96754, 279321, -148745, 22971, 50360, -317053, 22964, -312948, -8504, 115085, -54725, 98143, 73694, -22887, -145980, -228091, 1847, 361737, 192473, 105519, 34997, 14380, -203542, -46325, -61643, -117032, -182997, 30999, -253164, -44727, -191371, -264597, -10788, 15106, -5070, 197747, -211634, 27752, -140449, -125504, -8831, 100582, -39355, 137334, 110989, 13268, -235901, 255713]
19082A54372a12094a2671k74225a13422C67761l5627A16708a53305j28470b7059
19071C50571c06354A34820k5537c36222N2021B01917a54278B07783A02878b1479
19060b82878B05691c9790k37797e7623k20848E4259a23370j97190h4498L1641
19050e2857l5170A41492K4249o6229k0496b2711D0555a25252M4300A86935f6072
19038A21804d32521I5515a6406E3735a85294k0066D4045a09041l53098H2478J4587
19027I7065f7355B53871f5070B09611a34492d8810A02599J05496D9313J84326
19017B33639A08137l7798a40000K4252D4135K5835b06503F5857A6535J26563a45496
19005h1883E717K58479b37155C143b55438n6400a04824k46607H1125a09721B07158
$$ y = [154372, -112094, -12671, -286896, -113422, 367761, 332134, 116708, -153305, -281775, -27059, 350571, -306354, 134820, 109283, -336222, -284201, 201917, -154278, 207783, 102878, -21479, -282878, 205691, -39790, -277587, -57623, -278471, 54259, -123370, -320560, -84498, -52857, -88027, 141492, 165741, 99512, 79016, -22711, 40555, -125252, -80952, 186935, -66072, 121804, -432521, 95515, -16406, 53735, -185294, -205360, 44045, -109041, -462139, 82478, 97065, -67355, 253871, -65070, 209611, -134492, -48810, 102599, 208095, 49313, 233639, 108137, 70339, -140000, -115748, 44135, 69970, -206503, 65857, 16535, 143098, -145496, -81883, 5717, 264196, -237155, 3143, -255438, -311838, -104824, -351431, 81125, -109721, 207158]
18993g7605k57600l3316a59941B28252d8265A1695K39607e653A1293g8860k14779
18982b93639D7131Q9501Q1026a57676B10348a94764F3236a21343j8631C9040J09948
18971A48988J81727J22641B12244i8341l0870C3478J17154e317k82823P4742d3272
18959B07087h1432o3787M1016j39796k4713f3905m3845J5343l52633i475E82914
18947d1626e170j02513f289A25759k8762a37925B13852E5035D487b37051J9711
18936b17340N3211N016H6894J53112r6066E1288a92997p4604A3409c8485j85215
18925b23700a5779k01773A16137f3478j62401g6370j61573F1411c05869L1381
18915b74488A00709b80813A5660K52820j1553f22031F6401d22408I3912J26281
$$ y = [-77605, -335205, -368521, -159941, 228252, -48265, 11695, 251302, -5653, 11293, -78860, -293639, 47131, 136632, 217658, -157676, 210348, -194764, 63236, -121343, -139974, 39040, 148988, 330715, 453356, 212244, -98341, -129211, 33478, 150632, -5317, -288140, -213398, -43272, 207087, -81432, -145219, -104203, -243999, -268712, -63905, -107750, -92407, -445040, -9475, 582914, -41626, -5170, -107683, -6289, 125759, 96997, -137925, 213852, 55035, 4487, -237051, -217340, -164129, -159113, 86894, 240006, 143940, 51288, -192997, -267601, 13409, -38485, -223700, -15779, -217552, 116137, -63478, -225879, -76370, -237943, 61411, -305869, -274488, 100709, -280813, 15660, 268480, 256927, -622031, 66401, -422408, 93912, 220193]
18905B20193F2877c08386F1693J47053f0385P154H2996b10769j86615a31663l6229
18894a67892j00924G4289K18866H3324g1036B85056p1792a23097J5293H5721k0267
18883F5454a18721q3185A64794l7064a43478D38812i8033A42065K5355a9523B16800
18871a04371C69852g3935k06111B1289e1210A88019a94029A7691c53840J56062
18861a97778a6649A16663b39753a19533K2422d3895j84848A36469f4753j99149
18851b63902d6161j32857r0442A41134L2678C5291b4841l04385a34522e062A72595
18839B23647a46707A8872c10673J52312b874j29129d6686A27209m2178K2388n3345
18828E4074a4482k22904F6970a10118j20488J06784b5272l28276J72279F9014
$$ y = [220193, 62877, -308386, 61693, 208746, -60385, -53231, 82996, -210769, -397384, -131663, -167892, -268816, 74289, 293155, 83324, -71036, 285056, 213264, -123097, -107804, 85721, 65454, -118721, -201906, 164794, 127730, -143478, 438812, -98033, 142065, 167420, -19523, 216800, -104371, 369852, -73935, -280046, 21289, -51210, 188019, -194029, 17691, -353840, -197778, -16649, 116663, -239753, -119533, -97111, -43895, -228743, 136469, -64753, -263902, -46161, -179018, -269460, 141134, 173812, 35291, -24841, -329226, -134522, -5062, 172595, 223647, -146707, 18872, -310673, -158361, -2874, -132003, -46686, 127209, 85031, 107419, 54074, -14482, -237386, 66970, -110118, -230606, -123822, -25272, -353548, -181269, 69014]
18817C49949J09162G4198C0663L09907a91527a2861n2519I0132J71401B3098L02606
18806C25704g8390o9105D4326j0129c20598a37724f019D4667O3695a37627p2507
18795b10134F9030b68410d0714A69293p0120a80131F7699a49706n0980C5359a20362
18783g6378B438L03776d7761j7167r838D05527b89875A5149b3513A60344l2448
18772A27896J35678m5965l8749e5903D3455N486J4661Q3187a86051j20131i9265
18760H449b91709H9742a32109d3934G7138g9384L9371E1234a0519j82292G822
18748B47049r9613a34315k18261A36220i1824n5992C6781K02213a31283q6294
18738b17577A24609a62431n2480A76080a47125j1532o7979J01076j84749a31097
$$ y = [349949, 459111, 74198, 30663, 340570, -191527, -12861, -65380, 90132, 261533, 23098, 325704, -78390, -147495, 44326, 34197, -320598, -137724, -6019, 44667, 108362, -137627, -210134, 69030, -268410, -40714, 169293, 99173, -180131, 67699, -149706, -200686, 35359, -120362, -76378, 2438, 306214, -47761, -64928, -74766, 405527, -289875, 15149, -23513, 160344, 127896, 263574, 217609, 178860, -55903, 43455, 48941, 63602, 146789, -186051, -306182, -99265, 8449, -291709, 89742, -132109, -43934, 77138, -79384, -40013, 51234, -10519, -192811, 7822, 247049, 147436, -134315, -352576, 136220, -91824, -147816, 36781, 238994, -131283, -217577, 124609, -162431, -214911, 176080, -147125, -158657, -226636, -125560, -310309, -131097]
18727h4445c7029j76767k157F6532d1656k74348A2299C48L3302K7270a93459b6381
18714a86553B00428C9638L15439A2461h5050k03621e1182j15773A5738c1039C24292
18702g9147l5352B79046K2393p3004r7921b7450o7271c5108B6662N0209i1021
18690a50410f9012n3110j64455d0983A5794d6142p7046j84009d4667A4339d9851
18678g9501j7825A25485a53874B05087a70779e4265A3339b35277B7653b51664
18667c90394c7472E0287c4267q036n0051p4618N4316D0445b46885g0475F4539
18655c81922K9098C04497j2454j03660c8942E9676b31415R1271A9640K32174b31071
18643d9268G114b98371a38031p681O9952A70773k5042N7103a05782b9085j47429
$$ y = [-84445, -37029, -213796, -215953, 66532, -41656, -316004, 12299, 348, 33650, 60920, -193459, -26381, -186553, 200428, 39638, 355077, 12461, -85050, -288671, -51182, -166955, 15738, -31039, 324292, -79147, -114499, 279046, 301439, 228435, 130514, -27450, -94721, -35108, 26662, 76871, -91021, -150410, -69012, -122122, -286577, -40983, 15794, -46142, -123188, -307197, -44667, 14339, -49851, -79501, -97326, 125485, -153874, 205087, -170779, -54265, 13339, -235277, 27653, -251664, -390394, -37472, 50287, -34267, -42303, -92354, -166972, -112656, 40445, -246885, -70475, 64539, -381922, -352824, 304497, 292043, 188383, -38942, 59676, -231415, -140144, 19640, 251814, -231071, -49268, 7114, -298371, -138031, -145712, -75760, 170773, 145731, 202834, -105782, -29085, -176514]
18632a76514L4440K1240A73214a92803C8211e5910B55778I076e5486l01858C16908
18620b30455L640A54124c08368j56177K00131j8612J17293G5541c50588d1930
18609B30716c32320B3096N103a39372e5500F7985a11653M5311H8600d9166A18936
18597a48477n7987K9159I043a14694M2243A3036a20783c609B80482A20331R9656
18586B19987L1226e1974B513e212B24230l0052G7791b73069B25630d93658A76042
18574b48256B14411g8044I4992d32270G3086f3760A01005G389f093G4113P2434
18563A46547F6265B3369c9135m6688B82625k5813j1616j20915f9852a8768o6426
18552h5194j37214B71604p1285J1793G5471b40250a08365d1336B30012C5344g6328
$$ y = [-176514, -142074, -120834, 173214, -192803, 38211, -55910, 255778, 9076, -55486, -357344, 316908, -230455, -226815, 154124, -308368, -464545, -264414, -283026, -165733, 75541, -350588, -41930, 230716, -332320, 23096, 28199, -139372, -55500, 67985, -111653, -66342, 88600, -49166, 118936, -148477, -206464, -177305, 9043, -114694, -72451, 13036, -120783, -3609, 280482, 120331, 219987, 251213, -51974, 2513, -5212, 224230, 194178, 77791, -273069, 225630, -493658, 176042, -248256, 214411, -78044, 94992, -432270, 73086, -63760, 101005, 7389, -6093, 74113, 146547, 66265, 23369, -39135, -85823, 282625, 256812, 245196, 124281, -69852, -18768, -85194, -222408, 271604, 200319, 212112, 75471, -240250, -108365, -41336, 230012, 35344, -76328]
18540a06371o2075C44608c3808k9557B00770b18931F4213a96904K8379H0091a40495
18528a3605k15309O3580A36796d15184e9596H0947c5796A16169C5137c3487A38849
18516b1862j23504l9024P7275C99870r0973b95892D7042a25531A94829b96832
18505b22434H0740b01571A15014a15140C6154a37264B9866J93339D8253c5784
18494B52245b38771N2401d5932B85435f6382D994a00598D05085a77945N1448c441
18482B80420j06197k7480c0302E7792K39829b73713a31318C26861H0871A0251
18471b26795A51898F168K27887a12123B22237N0612A7114b53087A25909j2139
18461A13770j2786B6069K6059K41532D2300a35048f4865k73942F419J6439a08403
$$ y = [-106371, -168446, 344608, -33808, -63365, 200770, -218931, 64213, -196904, -168525, 80091, -140495, -13605, -228914, -165334, 136796, -415184, -59596, 80947, -35796, 116169, 35137, -33487, 138849, -21862, -145366, -184390, -107115, 399870, 308897, -295892, 47042, -125531, 194829, -296832, -222434, 80740, -201571, 115014, -115140, 36154, -137264, 29866, 223205, 48253, -35784, 252245, -238771, -186370, -45932, 285435, -66382, 4994, -100598, 405085, -177945, -126497, -3441, 280420, 174223, 146743, -30302, 57792, 297621, -273713, -131318, 326861, 80871, 10251, -226795, 151898, 6168, 234055, -112123, 222237, 272849, 17114, -253087, 125909, 113770, 100984, 26069, 52128, 293660, 42300, -135048, -64865, -338807, 6419, 22858, -108403]
18449b4005m6906l8478E3645a67899j38825f19o9535I4774l2543b18972j19907
18438c38879r9537g0222k31942B13993a90105B2920J18248g0216l92408A09791
18427a32239j01816q2880I1085f5129l7416l6093a1959C04824b66527a27494B73353
18415c5390f00j21668c1533A16900g1582A07328b08216A30852g1138J1340k10807
18404b70605B51161j00202a69266c2409r2356r633j35185g3489m215j67841M0148
18393b05397I1918a14779A29308k3388a53646H3043a74318n2523N4881o9072a02106
18381a89359G1307O9997B1227e2759C3946L87249A11305C8322A8021J06836K1132
18370A45989c51158f5914B63004b10686m2434C37807d7195k16261K9141C5968
$$ y = [-24005, -70911, -109389, 53645, -167899, -306724, -619, -70154, 94774, 62231, -218972, -338879, -438416, -70222, -302164, 213993, -190105, 22920, 141168, -70216, -462624, 109791, -132239, -234055, -316935, 91085, -65129, -102545, -138638, -11959, 304824, -266527, -127494, 273353, -35390, -600, -122268, -31533, 116900, -71582, 107328, -208216, 130852, -71138, -59798, -270605, 251161, 150959, -169266, -32409, -124765, -134398, -269583, -73489, -77704, -245545, -205397, 91918, -114779, 129308, 105920, -153646, 83043, -174318, -226841, -171960, -241032, -102106, -189359, 71307, 141304, 21227, -52759, 33946, 421195, 111305, 38322, 18021, 124857, 145989, -351158, -65914, 263004, -210686, -253120, 337807, -47195, -263456, -234315, 35968]
18359A70990e40785A12379a25536F5383j0356b77646E81506G503b16046E6435
18348a14326a8695A29813l9854j8396b37913A52774i3740n7249A48377C1372P346
18337C8718J92364H4211b03479j29923a59162F5486L3706b2910N133k78618a01523
18325H8963M4779a31901l22124h0773F2333a14741A2374e7732j3066j20129k29112
18314d20039B61925j28374a96008f7094f803j26225D8181j1490b19468m1773C8624
18302g036A1349L3851a87746J0712M5580j67136F2462l0112J26261d54110A94145
18290A20701E2411J65784i6684J1136j40530G7654g2435B66605G3073g39k2941
18279b3680j34783q509A88247r2493c09603a02610b7265C4443a68005F4832J9724
$$ y = [170990, -540785, 112379, -125536, 65383, 55027, -277646, 581506, 7503, -216046, 56435, -114326, -18695, 129813, 89959, 71563, -237913, 152774, -93740, -150989, 148377, 31372, 38718, 231082, 84211, -203479, -333402, -159162, 65486, 99192, -22910, -17777, -296395, -101523, 88963, 133742, -131901, -454025, -80773, 62333, -114741, 12374, -57732, -70798, -190927, -420039, 261925, 133551, -196008, -67094, -6803, -133028, 48181, 36691, -219468, -261241, 38624, -7036, 11349, 45200, -187746, -177034, -131454, -298590, 62462, 32350, 158611, -454110, 194145, 120701, 52411, 218195, -96684, -85548, -226078, 77654, -72435, 266605, 73073, -739, -23680, -158463, -166972, 188247, 95754, -309603, -102610, -27265, 34443, -168005, 64832, 84556]
18268H4556A8703M6230a30578Q393j46194h6516D1751h4353j64338i1891l07112
18257c99003B368c21065B90831k5300e875j1857l2089A03996Q2880A6511a16245
18245c07865j1676a49605k55986A38809a38233j2345d4683l3455j34571c8063
18234a47700B05342a99685G0017d18607A9041K21764f9009j30959D5897c22515
18223i140j49015I9467c21830B59905a7209m0084A50768h102n686k4010J4058
18212b3740B08598a109j56861j13126a22087F7742b11341A33237A4438l128a4207
18200b17397c6204j070j28438A31749a85856k86207A54768a10576G6424K4773
18190A01197a43118A40286b25354A39959a2894j5371B06060b21546C3700e4457
$$ y = [84556, 18703, 64933, -130578, -122185, -268379, -86516, 41751, -84353, -248691, -91891, -399003, 2368, -321065, 290831, 265531, -5875, -17732, -49821, 103996, 186876, 16511, -116245, -307865, -319541, -149605, -405591, 138809, -138233, -150578, -44683, -78138, -212709, -38063, -147700, 205342, -199685, 70017, -418607, 19041, 240805, -69009, -199968, 45897, -322515, -9140, -158155, 99467, -321830, 259905, -17209, -57293, 150768, -8102, -13788, -37798, -23740, 208598, -1109, -157970, -271096, -122087, 67742, -211341, 133237, 14438, 11310, -14207, -217397, -36204, -37274, -165712, 131749, -185856, -472063, 154768, -110576, 76424, 101197, -143118, 140286, -225354, 139959, -12894, -28265, 206060, -221546, 33700, -54457]
18179h264C9170M9252b93487M9849G6648l282k4082A9509J53961C0918a27741
18167a18654L9480j56754A18615a43466C40226a13437G5487J88278b17356j64927
18157c82283A61583a29206E2306K27770M9562j43300e8604q4043n8190j29528
18147c30365i3330C2606b48907o8906a49806f1838j74389b7228C38842A05673
18136I7569f3484b702r3560A44877f2418C8793c1650J1062B09386a13766c2576
18124C76475A27258J85398c4307l7786m42448a9414K212l2811R673e74G6658a86916
18111d2976j56807k2455g8854C4499L59737b11633n1912Q7757r7726c302F6161
18099g5639B6636J07894a51738O9494c196j24551F906B327O8801a56132g0148
$$ y = [-8264, 39170, 88422, -293487, -243638, 76648, 73366, 49284, 19509, 173470, 30918, -127741, -118654, -79174, -235928, 118615, -143466, 340226, -113437, 75487, 263765, -217356, -382283, 161583, -129206, 52306, 280076, 329638, 186338, -58604, -142647, -200837, -330365, -93330, 32606, -248907, -317813, -149806, -61838, -236227, -27228, 338842, 105673, 97569, -63484, -2702, -96262, 144877, -62418, 38793, -31650, -20588, 209386, -113766, -32576, 376475, 127258, 312656, -34307, -72093, -514541, -19414, -17202, -50013, -40340, -574, 76658, -186916, -42976, -199783, -222238, -78854, 34499, 394236, -211633, -263545, -175788, -273514, -3302, 66161, -75639, 26636, 134530, -151738, -82244, -3196, -127747, 6906, 2327, 71128, -156132, -70148]
18087a73900a6407k6503C3885R1903L79110g7294k18492i0673i425k67495D46751
18075B20710r527b42376B8722b23914k54403C20743e2482B64731a60809A93494
18064f6668b6639B02440b59591H7541b74121A44540a73758B13533a65542E2490
18053D05132c5936p2851B9019a63248a6276A09045c5560P490n690p5997D01697
18041a4428A03528e14444A74097c44188J55622k1594h0854D2959b32495P7236
18031a55259j30542f967D8009L6761a09319C41276i8276A5246N2697c51615f9524
18019b55999e1839j17346d9428r8265G848a41348J5557I5304a18232A28393a43150
18007A40450n5797b8256B5530K08228A2257a04219B56027b73166d8710E8968L7295
$$ y = [-173900, -16407, -42910, 33885, 125788, 504898, -77294, -295786, -90673, -9425, -276920, 446751, 220710, 211183, -242376, 28722, -223914, -478317, 320743, -52482, 264731, -160809, 193494, -66668, -26639, 202440, -259591, 87541, -274121, 144540, -173758, 213533, -165542, 52490, 405132, -35936, -108787, 29019, -163248, -16276, 109045, -35560, -28070, -33760, -109757, 401697, -14428, 103528, -514444, 174097, -344188, -188566, -210160, -80854, 42959, -232495, -155259, -285801, -6967, 48009, 84770, -109319, 341276, -98276, 15246, 67943, -351615, -69524, -255999, -51839, -169185, -49428, -147693, 7848, -141348, -125791, 95304, -118232, 128393, -143150, 140450, 84653, -28256, 25530, 233758, 12257, -104219, 256027, -273166, -48710, 58968, 96263]
17996I6263a06973A97679a20531q3121A1425e3858A26456e1632A06615d503k21545
17985b26048J4416L6529C13899c10697L2558E2255b35722b936E5575a53156A14770
17973a79916A97924q9707a26831B8994b7029C6107d9001r7268H3323J05168a80382
17961c51891A57750a6695H0236e1738K4766j32611o3080i7260B36765E2902h9878
17949i3025j05928j72043B5076h8651j25141I6383l4079d3497j57746H7077L1877
17938A18954a46723c6127m9076C05077a52965O7229A79333b47541A81291d964
17927g9862l94420C962L02367g732B10654j1655A916g5090A3525f022j60542r9804
17915b66368K9235C89697a75233A51683h3476L3011p8634I8160e22304c8948k12439
$$ y = [96263, -106973, 197679, -120531, -203652, 11425, -53858, 126456, -51632, 106615, -4503, -226048, -211632, -175103, 313899, -310697, -278139, 52255, -235722, -2936, 55575, -153156, 114770, -179916, 197924, 108217, -126831, 28994, -27029, 36107, -49001, -146269, 83323, 188491, -180382, -351891, 157750, -16695, 80236, -51738, -26972, -159583, -222663, -97260, 236765, 52902, -89878, -93025, -198953, -370996, 25076, -88651, -213792, 96383, 62304, -43497, -201243, 87077, 118954, -146723, -36127, -85203, 305077, -152965, -85736, 179333, -247541, 181291, -4964, -79862, -474282, 3962, 306329, -7732, 210654, 198999, 1916, -75090, 13525, -6022, -166564, -266368, -237133, 389697, -175233, 151683, -83476, -50465, -129099, 98160, -522304, -38948, -251387]
17904b51387B25480b501k69473q3335J19487j11384A935g5947A680d68641e2611
17892c12025f9622r7413d4472E7522c3389j38772I1721a14076B05406b18646a03114
17880I6622L515K21620h1823D228a16906K4032G6951b7049F6137J00130A9137
17868D6483a64414O0491D9954K3767b13605J9859E0957J57347c72484a5947C23014
17856a30588C57852B4918d86039J56748A37697o8232Q6971g1444l6238A13074
17845A80903N8634a28804B62881d035A47330b30940B66799A05126j2680F418J58927
17834A65345a62793E5679a87085H8771J42620h6012D2435A8113N9712J4138m5386
17823D6577a585A23266e7646E4943B3024B482R3496C6525b8338q5348n45740h7290
$$ y = [-251387, 225480, -2501, -271974, -355309, -235822, -347206, 1935, -75947, 1680, -468641, -52611, -312025, -69622, -167035, -44472, 57522, -33389, -172161, 91721, -114076, 205406, -218646, -103114, 96622, 100137, 321757, -81823, 4228, -116906, -92874, 76951, -27049, 66137, 166267, 19137, 46483, -164414, -103923, 49954, 73721, -213605, -193746, 50957, 208304, -372484, -15947, 323014, -130588, 357852, 24918, -486039, -329291, 137697, 69465, 156436, -71444, -107682, 113074, 180903, 239537, -128804, 262881, -4035, 147330, -230940, 266799, 105126, 92446, 6418, 165345, -162793, 55679, -187085, 88771, 231391, -86012, 42435, 18113, 77825, 91963, 46577, -1585, 123266, -57646, 54943, 23024, 2482, 95978, 36525, -28338, -113686, -659426, -87290]
17810c3542D989b21499g7520c060l8453H0242J9249b68435d2993A7121J5037d6901
17797E7701R4842K89193a20724B66700H0943C8623b50282I533b85912i4033j8069
17786a12102j9581p3557B56929n4196b29319B5024a02135K8152A41581a72811
17775C3858Q9670C2208a98985j79995F4102K13234b1037A45126R0439M9258a92769
17763A30419b26646P8063C24593F1279j066M402P7561G0497J1278J41953a4957
17751a14410D4206a33233A14348a82623k7622G6650B0433a07346j39650A63444
17740C03244B0284a95485C01610q8383b63150h5213G4883J70531A7951a3858H0029
17728a37010J3984L5649m3946n05272A64473G1084a4053D821J88644k8018K1942
$$ y = [-33542, 4989, -221499, -77520, -3060, -41513, 80242, 99491, -268435, -42993, 17121, 32158, -46901, 57701, 152543, 441736, -120724, 266700, 80943, 38623, -250282, 9533, -285912, -94033, -112102, -131683, -205240, 256929, 202733, -229319, 25024, -102135, -73983, 141581, -172811, 33858, 123528, 32208, -198985, -378980, 64102, 277336, -21037, 145126, 235565, 284823, -192769, 130419, -226646, -148583, 324593, 61279, 60213, 64615, 142176, 70497, 81775, 223728, -14957, -114410, 44206, -133233, 114348, -182623, -210245, 76650, 20433, -107346, -246996, 163444, 303244, 20284, -195485, 301610, 213227, -263150, -85213, 74883, 245414, 17951, -13858, 80029, -137010, -123026, -87377, -131323, -636595, 164473, 71084, -14053, 4821, 193465, 165447, 187389]
17717A87389L99129A0004J51103a78015j1621j55214A56210K40471C5188b7088
17706G9548N7686c0297A63885m9002J77323A22589J01026c6661A17230a3116p1946
17695h5062k3787B52163o4616p0465d3345m6873j74994l77H1850c8858A53648
17683B04420c65856i18k21171C6069K36410A6199O6010b69457R8869B9716L32663
17672C62379a53442b175l2053m1610C1654J49303c48629C11731a97725B9838J24860
17661A54698n3024a35303I6972l3502c18564A60381K2808F8010l2909e9770b1891
17649b9091o1232A96586O047F480K64453b6533e892D4372L5525e3437A80591a77055
17636B29077C2806A4340a1208k8386j99656c2251B46037B246K0009a14711F3571
$$ y = [187389, 586518, 10004, 161107, -178015, -189636, -344850, 156210, 396681, 35188, -27088, 79548, 137234, -30297, 163885, 114883, 292206, 122589, 223615, -36661, 117230, -13116, -85062, -108849, 252163, 187547, 117082, -43345, -90218, -265212, -265589, 81850, -38858, 153648, 204420, -365856, -918, -222089, 36069, 272479, 16199, 82209, -269457, -170588, 29716, 362379, -153442, -2175, -34228, -75838, 31654, 180957, -348629, 311731, -197725, 29838, 154698, 101674, -135303, 96972, 63470, -318564, 160381, 183189, 68010, 35101, -59770, -21891, -29091, -90323, 196586, 202633, 6480, 270933, -26533, -5892, 44372, 79897, -53437, 180591, -177055, 229077, 32806, 14340, -11208, -39594, -239250, -32251, 246037, 2246, 22255, -114711, 63571]
17624B70264b29466A6808P2986A9352J13615c45746a28486A2375R1917g7361E6532
17612A06438a62541B73850a45745N906A3818a2232H8083h6475L9973k3727k843
17601g3072E2578K42083o2291E4531J64329i3112A78578i5816k86118A6837a51701
17589A29053a5021k66896C44485D2065J89813d063C09220j0167Q8249b2789A52375
17577G1995L30179F0694h4356C5683a90096B4154F300f790A37105j5983N2419
17566A73541J02065a01657B65971q7201j6344e8607j27228c667j35182A57373
17555A6098b38662A76139h6912I5223K11806b18744B03258b75109A87432o4737
17545A22695J28476e0356E0154a33565A60062D8012e2023J8280l76730a60214
$$ y = [270264, -229466, 16808, 89794, 19352, 132967, -345746, -128486, 12375, 104292, -77361, 56532, 106438, -162541, 273850, -145745, -139839, 13818, -12232, 88083, -86475, -46502, -70229, -73072, 52578, 294661, 232370, 54531, 218860, -93112, 178578, -95816, -381934, 16837, -151701, 129053, -15021, -281917, 344485, 42065, 231878, -4063, 309220, 299053, 387302, -22789, 152375, 71995, 402174, 60694, -84356, 35683, -190096, 24154, 6300, -6790, 137105, 121122, 173541, 275606, -101657, 265971, 178770, 162426, -58607, -185835, -3667, -138849, 157373, 16098, -238662, 176139, -86912, 95223, 307029, -218744, 203258, -275109, 187432, 122695, 251171, -50356, 50154, -133565, 160062, 48012, -52023, -33743, -410473, -160214]
17534C0966c0583A4727J83494P6849H0075J05758G0399Q0171n7148M57605a51486
17522D11709A4110N5367J51169A3872c1796F8687Q1030l8288C8083M72569A59947
17510B80926A05845L9978h7741b4840r0954F2356K551J14913B4538b6305k70A32731
17497E2512J5685K71368C6936Q1326A1366Q2410k0937J73426N2619A4851e5346
17485a2052A4145R5870b78228A23181K57563A41335b9159j20059j02405L0588
17475b21035C03828j21195j9220E0043M16770c6245A03702k5594a89334c8460
17464B89511l8520a38039c7627B23661N0269b12093K5589A13438Q4599H0309l9545
17453D0764b796D70171A51918m4579R5290j8798J52701F3781M17676k29106J89668
$$ y = [30966, -30583, 14727, 198221, 275070, 80075, 185833, 70399, 150570, 93422, 551027, -151486, 411709, 14110, 69477, 220646, 13872, -31796, 68687, 149717, 111429, 38083, 510652, 159947, 280926, 105845, 145823, -87741, -24840, -115794, 62356, 64907, 179820, 24538, -26305, -26575, 132731, 52512, 68197, 339565, 36936, 118262, 11366, 93776, 72839, 246265, 298884, 14851, -55346, -12052, 14145, 110015, -278228, 123181, 380744, 141335, -29159, -149218, -251623, -221035, 303828, 182633, 163413, 50043, 466813, -36245, 103702, 78108, -189334, -38460, 289511, 250991, -138039, -37627, 223661, 273930, -212093, -186504, 113438, 198037, 80309, 40764, -2796, 470171, 151918, 107339, 202629, 183831, 336532, 63781, 481457, 252351, 442019]
17442D42019A80889D4630O5054e1224A27908O4116K81231f6501B75059J02831
17432C77890G7864k9236K6103J5005a59555E56411B26278j3400m9738p265e5904
17420A42002K49320A80171K19333i1291B44042O203P7842q7546m4529A8781K59713
17409B78494A16700O0818m7977K10188b0997m6200A11564R3960J1309r3327j3198
17398A10308a6842B31308P472J39145A02141a16264A4928L03427B8887a1512B31048
17386D8416c2369A37468K48012H1161M6331K32152b57740A11534J70030M5247
17376C26811a6133H9937m1615N1094K14491M3704A67968a90951D33015A92224
17365A43320a6738A06329L9784k350m8691b58870B74924b43276C04140I8495J42645
$$ y = [442019, 180889, 44630, 109684, -51224, 127908, 192024, 473255, -66501, 275059, 377890, 77864, 48628, 74731, 89736, -159555, 556411, 226278, 212878, 163140, 155875, -55904, 142002, 391322, 180171, 399504, -91291, 244042, 250245, 328087, 240541, 196012, 18781, 278494, 116700, 177518, 129541, 339729, -20997, -67197, 111564, 205524, 216833, 123506, 110308, -16842, 231308, 238780, 377925, 102141, -116264, 14928, 318355, 28887, -11512, 231048, 48416, -32369, 137468, 385480, 81161, 127492, 359644, -257740, 111534, 281564, 326811, -16133, 89937, 48322, 99416, 313907, 357611, 167968, -190951, 433015, 192224, 143320, -16738, 106329, 146113, 143763, 95072, -258870, 274924, -243276, 304140, 98495, 241140]
17354B41140b18792C75749d2541A08090J87442J21841A32352N2537J25249A18852
17343D7332R2999J54970C531J00658O0081R6491q9814N6973m3057b32149j85854
17332d18003B00242D0526b94509A93560M3075A05255J26393A12403B6787K71412
17322B98199A37682E1289J89698a37258M3136B76578b37920B00322L1323n3891
17312A77754D5669L59938A43557J37868R894q5586K83021A53857B9243f9819I1899
17300A53606L44822H7137d3871j33373B7483J91953a094o223A33388K1726N5781
17289B10895J79113J2799n3986j27912B2524f8152A5417M03294i5328j70131C5632
17277B34458J57420p6250K18319n95n5858r5737C8119L3770i4391B92157r3718
$$ y = [241140, -218792, 375749, -42541, 108090, 295532, 417373, 132352, 184889, 310138, 118852, 47332, 140331, 295301, 3531, 104189, 164270, 260761, 170947, 227920, 184863, -232149, -418003, 200242, 40526, -294509, 193560, 236635, 105255, 231648, 112403, 26787, 298199, 137682, 51289, 240987, -137258, -94122, 276578, -237920, 200322, 231645, 177754, 45669, 405607, 143557, 281425, 291319, 205733, 488754, 153857, 29243, -69819, 91899, 153606, 498428, 87137, -43871, -177244, 27483, 219436, -1094, -7317, 133388, 155114, 210895, 390008, 402807, 348821, 220909, 22524, -68152, 15417, 418711, -95328, -265459, 35632, 234458, 391878, 315628, 533947, 533352, 477494, 381757, 38119, 71889, -94391, 292157, 198439]
17266A98439R4217A14108M2197J99967o9522K2995G7935J91179n4102n7646J10093
17255B67459A22350d5946B43103D0399L5245L6624J328J11899H2163L67034r6425
17244C52772c132k46853B24274K0249N1186o120j28845F8737Q6590K49640j62685
17233B42282f1099A89365J05275B8482O41355c438H0864J74626J79933p8212j69795
17222A87416A4537K64025J19279A80318q6082b07971B76816b6215B36179l236
17212B32943r769B273J28141j5119m5048M42316B26603n6423K58042A54694J86833
17201C41527e9382A03765K29398J09890j33367Q1832j34995q6632K6887K1013
17191B17791A0665K29464K80766B35309J14263j71559q8145M8443J81987K48237
$$ y = [198439, 292656, 114108, 156305, 356272, 286750, 309745, 77935, 269114, 215012, 157366, 267459, 122350, -45946, 243103, 40399, 75644, 112268, 113596, 225495, 82163, 449197, 352772, -3132, -249985, 224274, 244523, 295709, 289589, 160744, 68737, 155327, 404967, 242282, -61099, 189365, 294640, 28482, 669837, -3438, 80864, 255490, 435423, 357211, 187416, 14537, 278562, 397841, 180318, 94236, -207971, 276816, -26215, 236179, 232943, 223174, 2273, 130414, 115295, 70247, 512563, 226603, 170180, 428222, 154694, 341527, -59382, 103765, 333163, 443053, 309686, 391518, 256523, 169891, 196778, 217791, 10665, 240129, 520895, 235309, 349572, 178013, 89868, 138311, 320298, 568535]
17181E68535B29782J71977q4241p0927j4521e5059C79046m4856a44071B08921
17170D22117K13557c9623I3266a63608C81937q9355l4224o290m9031B9459K19967
17159B49426K40902B11466g2906B15004j0007a108C79230j38267C8088J60084
17149A98172J37894N0437A86727K47151A76165G4299J72502J29206K1563J9039
17139D16609p3219l0740J43150j71333j36973k8471j4131N68003B71317Q2789
17129C54106K13410A9019K74392K15065j01663p2771K02480B01900J56641P2231
17119D30772j30250n7552L23632B48959G9183M06577j67038K24274j99647J33868
17109D77217n2980J17443A40685L73873B8062M66537A61169M5714J94111l2271
$$ y = [568535, 229782, 401759, 317518, 246591, 232070, -55059, 379046, 334190, -144071, 208921, 422117, 635674, -39623, 93266, -163608, 381937, 292582, 258358, 252068, 203037, 29459, 249426, 490328, 211466, -72906, 215004, 204997, -1108, 379230, 240963, 38088, 198172, 336066, 386503, 186727, 433878, 176165, 74299, 246801, 376007, 397570, 416609, 343390, 312650, 455800, 284467, 147494, 119023, 104892, 672895, 271317, 354106, 567516, 19019, 293411, 508476, 406813, 334042, 536522, 201900, 358541, 430772, 300522, 242970, 566602, 248959, 79183, 485760, 318722, 542996, 343349, 477217, 424237, 541680, 140685, 514558, 28062, 494599, 161169, 206883, 400994, 368723]
17099C68723J22495r1053m9892R4506A53506M19989k57815N0593j43607K91328
17089E13994B33697K45657m0420K14937k25445J02203j58204J8714q6726P1560
17079C75973l8473n193L06164k49359K3765j56551L66248O593B13112K57352j57355
17068C13109K4590J35964J65551j96750J36827k53494R5181J78736j39712J40433
17058F00435j00294B23361J30966L32803J96039B99940J25091K73604j48226n9709
17048D90700P6013J9102l1509o2564J70016L81081C34222k689j4043K68244j06273
17037D79461q62K36888j1137j50598K19348J7058l79846J45661k36941J11677
17027D30709N38482C96776J27172K31372P8405B79651L77048n8034M48925n04870
$$ y = [368723, 491218, 400165, 350273, 444779, 153506, 573495, 315680, 366273, 222666, 513994, 233697, 479354, 438934, 653871, 428426, 530629, 372425, 391139, 304413, 375973, 337500, 332307, 638471, 389112, 412877, 256326, 622574, 629167, 213112, 470464, 313109, 337699, 473663, 639214, 442464, 579291, 325797, 420978, 599714, 460002, 600435, 500141, 223361, 354327, 687130, 883169, 299940, 425031, 698635, 550409, 490700, 566713, 585815, 554306, 491742, 661758, 1042839, 334222, 331533, 317490, 585734, 479461, 478599, 715487, 704350, 553752, 773100, 790158, 410312, 555973, 319032, 430709, 969191, 396776, 523948, 755320, 833725, 279651, 656699, 598665, 1047590, 542720]
17017E42720K55102k38255p566K55888o1786k03799K57685k16546J70263j30624
17007F23082k11197K55780l32772N81818k89553J97817k52598L35256j94762o8674
16997F44197M1499K9848J75011k76469J05711J12697D08906J94866Q5867J43526
16987H33165L9972k54206K5936M7152P2634k4859J04816j00403J25409j24146
16977G45470J05029j25386O2346J14720j88622J56670J20846q5466k56538Q9991
16967G39060j64257L22614O4323Q9805j74443M6249j91313M23297l66338J95663
16957I84660P5823J15500N2620l64259J27926r7863o1195J81251l9698Q9878o0012
16946A004631J95714j99133K1259J45033r3854Q0198K55537l26509q9784L3104
$$ y = [542720, 797822, 559567, 552001, 807889, 746103, 542304, 799989, 583443, 753706, 623082, 411885, 667665, 334893, 916711, 627158, 824975, 572377, 907633, 712871, 644197, 685696, 715544, 890555, 614086, 719797, 832494, 408906, 603772, 689639, 833165, 873137, 618931, 644867, 692019, 764653, 739794, 844610, 744207, 869616, 745470, 850499, 725113, 787459, 902179, 713557, 870227, 991073, 905607, 649069, 739060, 574803, 897417, 961740, 1051545, 877102, 923351, 732038, 1155335, 788997, 984660, 1060483, 1175983, 1228603, 864344, 992270, 894407, 833212, 1014463, 974765, 1064643, 1004631, 1200345, 1001212, 1022471, 1167504, 1073650, 1153848, 1409385, 1082876, 993092, 1026196]
16936A026196L42290k30230K07822j89607m4209j31033q4642P78549k36816j83187
16926A255133j88387K84614j91003K30457L16066l70222k38342M36555k54378
16917A280493Q3191K48615Q815J07390j05054k96539Q0092M3659N7976J99873
16907A708511K49604l41867l1158j90052L20843K31292o525r7723M94559q00139
16897A537345M93565l42148J49695J21830j19806k47386L99482K1446N1862l804
16887B062081K54350j50506J63476m17005J98500l9638j20845L24557J96972o6102
16877B405840m51014J37796L73225j88101M4399j74682M50507p088N7589j03098
16867B545373K35185l16492L30666k53978M8990K86428J11891k63880K4587P7880
$$ y = [1026196, 1368486, 1138256, 1346078, 1156471, 1112262, 981229, 896587, 1675136, 1438320, 1255133, 1066746, 1351360, 1160357, 1390814, 1706880, 1336658, 1098316, 1534871, 1280493, 1363684, 1612299, 1621114, 1728504, 1623450, 1326911, 1407003, 1450662, 1508638, 1708511, 1958115, 1616248, 1585090, 1395038, 1715881, 1947173, 1940648, 1842925, 2337484, 1537345, 2030910, 1688762, 1838457, 1960287, 1840481, 1593095, 1992577, 2014023, 2065885, 2062081, 2316431, 2165925, 2329401, 1912396, 2110896, 2071258, 1950413, 2274970, 2471942, 2405840, 1954826, 2092622, 2465847, 2277746, 2322145, 2147463, 2597970, 2590882, 2648471, 2545373, 2780558, 2464066, 2794732, 2540754, 2589744, 2876172, 2988063, 2724183, 2748770, 2826650]
16857B826650L33484j91752r4950Q5726p1703L53879J33122p4944J16461R117
16847C425090m10182N29438k77704K93179m8605L21957j06259j4152Q7881R3420
16837C894063n49m7817J79939M0857K87471J78970M5183K03458k6967l49924M39432
16826D844116R6745Q8067J28142k2735m39112M20095J84175J6511L68217k49651
16816E434570O24834L41068l34301K61971J3274O23588j97992M12043j42480j44254
16806F892321K13630M87722j0096Q2161O34780k1507j21273L51096K06463J5424
16796H730721N07724K59168K69122K96850K17642K60549k06815N19748J07966
16787A0962675M08361P39063M90877J2985K90929K83696M69077J80853M34078
$$ y = [2826650, 3160134, 2968382, 2873432, 2959158, 2887455, 3241334, 3374456, 3299512, 3415973, 3425090, 3014908, 3544346, 3266642, 3559821, 3511216, 3833173, 3726914, 3712762, 3800643, 3894063, 3893514, 3845697, 4025636, 4066493, 4353964, 4532934, 4578117, 4781575, 4754608, 4404684, 4844116, 4940861, 5028928, 5157070, 5134335, 4695223, 5115318, 5299493, 5316004, 5684221, 5434570, 6059404, 6400472, 6066171, 6328142, 6341416, 6965004, 6767012, 7179055, 7036575, 6892321, 7105951, 7593673, 7583577, 7665738, 8300518, 8279011, 8157738, 8508834, 8715297, 8730721, 9238445, 9497613, 9766735, 10063585, 10281227, 10541776, 10334961, 10854709, 10962675, 11371036, 12110099, 12600976, 12613961, 12904890, 13188586, 13657663, 13838516, 14272594]
16778A4272594Q65395O73485M21386M7604M39843P38227J014294J85971Q39885
16769A9498684P30361N82293R13563P02955P29456J010613J134174J495912M99776
16760B7297787Q72516J679169J225061Q51219J917960J701163J544522J754891
16752C8844288J925933K053086K146859K147315K554929K701594L199248L047386
16744E8620638K938736L254775L915911M478200L772396M440168N305448N078100
16736I1804372O356993N299653O892535O555301P196097P322170P789397P918524
16728A47135042Q214247P977002Q411451P421468P114614O311051N414326M573218
16720B02572419L130002K003987O89631r12984k452611l227489n114235n883168
$$ y = [14272594, 15137989, 15811474, 16232860, 16280464, 16720307, 17458534, 18472828, 18658799, 19498684, 20229045, 20811338, 21724901, 22427856, 23157312, 24167925, 25302099, 26798011, 27297787, 28170303, 29849472, 31074533, 31925752, 33843712, 35544875, 37089397, 38844288, 40770221, 42823307, 44970166, 47117481, 49672410, 52374004, 55573252, 58620638, 61559374, 64814149, 68730060, 73208260, 76980656, 81420824, 86726272, 91804372, 98161365, 103461018, 110353553, 116908854, 124104951, 131427121, 139216518, 147135042, 155349289, 163326291, 171737742, 179159210, 186273824, 192584875, 197999201, 202572419, 205702421, 207706408, 208396039, 207483055, 205030444, 201802955, 196688720, 190805552]
16712A90805552o718099p239445p841661q136326q492182q049027q079709p863034
16704A28386069p374435o840560p055962o643442n762319n935672m958923n243582
16696G8571174m297954m490256l877964l879939k652082l668823k818709k894658
16688D9990789k276726k486542k331139j881512k230252j696761j677518j583707
16680C3826632j691812j239643j699963o73760j490884j091311q92006j272961
16672B3774292q41682n91785q75871o35779r20781o19053j415507k1132m19631
16663A7433071q59727o22794o02997n36691m26398l76699m56001m51827n30241
16654A2569696l21545m9606l07226p53064l19207r7708k30042p57383J20848k72191
$$ y = [190805552, 184087453, 176848008, 169006347, 160870021, 152377839, 144328812, 136249103, 128386069, 121011634, 114171074, 107115112, 100471670, 94709351, 88773679, 83814756, 78571174, 74273220, 69782964, 65905000, 62025061, 59372979, 55704156, 52885447, 49990789, 47714063, 45227521, 42896382, 41014870, 38784618, 37087857, 35410339, 33826632, 32134820, 30895177, 29195214, 28521454, 27030570, 25939259, 25047253, 23774292, 22932610, 22340825, 21464954, 20829175, 19908394, 19289341, 17873834, 17852702, 17433071, 16573344, 15950550, 15347553, 14810862, 14384464, 14007765, 13551764, 13099937, 12569696, 12248151, 12198545, 11891319, 11138255, 10819048, 10721340, 10491298, 9733915, 9854763, 9582572]
16644I582572m06909q7870l96045O8288j59273k56293p57941K2189n733n8178
16634G544807n49157j7341R858m08662j26363M7647l27924l1489q1413k46689
16624E813274J16102p13069N04185l86028K11389k86610o18188M78176n29313
16615D589918K90672k2233m45750r3734L41821j09790j75597k66116k55588J62475
16605D016078k62811k3292J36844m11532M97707m33378Q8226J00646l35033O677
16595C380132k93715K54120O1050o0279n9847O9168J6219j47868l65390k10974
16585B642616M09869j34355k23462K34099q9269m50509J06931J3442N1774L79493
16575B940629n35808J64177l02976K81621m1848j48328M34723m32012k27257O230
$$ y = [9582572, 9175663, 9087793, 8691748, 8760036, 8600763, 8344470, 7586529, 7608718, 7602985, 7544807, 6995650, 6978309, 6988167, 6579505, 6453142, 6500789, 6172865, 6141376, 6059963, 5813274, 5929376, 5216307, 5720492, 5334464, 5545853, 5259243, 4641055, 5119231, 4589918, 4880590, 4858357, 4412607, 4318873, 4660694, 4550904, 4375307, 4109191, 3853603, 4016078, 3753267, 3729975, 3866819, 3455287, 3952994, 3519616, 3607842, 3708488, 3373455, 3380132, 3086417, 3340537, 3401587, 3341308, 3281461, 3350629, 3366848, 3218980, 2853590, 2642616, 3052485, 2918130, 2694668, 2928767, 2839498, 2388989, 2495920, 2509362, 2561136, 2940629, 2404821, 2568998, 2266022, 2547643, 2505795, 2357467, 2792190, 2360178, 2132921, 2139151]
16565B139151l30209J28296j55076L03783j11795J74081J32664K8158M2571p75667
16555A575957K48518R3816k8833j0132m00090P0201K96374k1065M8500J31466
16545B004712m97809L79764n66726N7854j4575M5647j34699N47829m62598K88384
16535A647783m24039K46090J92792m58330L14513k14000L8568k70568J63664K29551
16525A466024n2220j03626o2996k07731K26792J0598p9976j5204K18257n6110
16515A343808k22947r3295k8047K56404j55902k46942K21522J7905K07777k76892
16505A023391K44701j02114q1687M8911r2853J73790j49724P4626j76883K00190
16495A162348k67629k74502N79406m11524o7677j96890N30646M5105m22436p8660
$$ y = [2139151, 1808942, 1937238, 1782162, 2085945, 1974150, 2148231, 2280895, 2309053, 2351624, 1575957, 1824475, 1918291, 1889458, 1879326, 1479236, 1549437, 1845811, 1824746, 1873246, 2004712, 1506903, 1886667, 1319941, 1377795, 1363220, 1408867, 1274168, 1821997, 1359399, 1647783, 1223744, 1469834, 1662626, 1204296, 1518809, 1304809, 1343377, 1072809, 1236473, 1466024, 1413804, 1310178, 1247182, 1039451, 1266243, 1276841, 1196865, 1181661, 1399918, 1343808, 1120861, 1027566, 999519, 1255923, 1100021, 853079, 1074601, 1092506, 1300283, 1023391, 1268092, 1165978, 1084291, 1133202, 1040349, 1214139, 1064415, 1139041, 962158, 1162348, 894719, 620217, 1199623, 788099, 720422, 523532, 1054178, 1099283, 676847, 598187]
16485E98187K85527m8106J85980K60568n26992J9614J02798K49761E45639J3802
16475E59441M99378k47788k386L4252o5429K2752J62241m61207R5582J09014j93962
16464E11888l3724J41286q1532N8254J86609l13505N02819k6402D72487K67010
16454G39497l35161J76646l0811J66968Q4544j69569p5025r117J85628k51869
16444D81731M70256l72791K47763k45795n1251J75713k31043k5934l8018K09625
16434F20256o464B42316L87811K8245R61j51622K22402k64182K48261C14261M1574
16423C55835N16718l35396q3440J09385l6868M0187N832K1275q6509K46733C65344
16411B87678P641K26237q1362m5105L5509j3751R3582L62975C90820j06282E9715
$$ y = [598187, 883714, 835608, 1021588, 1282156, 755164, 774778, 877576, 1127337, 545639, 559441, 1058819, 811031, 808645, 842897, 777468, 800220, 962461, 501254, 596836, 705850, 511888, 478164, 619450, 537918, 596172, 782781, 469276, 972095, 945693, 472487, 739497, 404336, 580982, 550171, 717139, 801683, 632114, 557089, 547972, 733600, 481731, 951987, 579196, 826959, 581164, 529913, 705626, 474583, 448649, 410631, 620256, 613792, 242316, 630127, 658372, 659333, 507711, 730113, 465931, 714192, 314261, 355835, 872553, 537157, 453717, 563102, 526234, 566421, 572253, 593528, 507019, 753752, 365344, 287678, 295319, 521556, 440194, 395089, 430598, 416847, 510429, 873404, 390820, 284538, 59715]
16399C27598j9865J8418J14997m0230q3457J35166q7909l6419O48680D43385l9902
16388D03483N529j14989L03235k39886q2179j02162O2856K22541l2469k2573K16066
16377F19452l1605B01233J03197M75196k88508N65623n22932j75370J74904n9886
16367D73457B04637k2327k2451K79299q5446M3174A93789J1780q4865L58300p7734
16356D01270k9942N6008O4039I3546K09901j744K6416o1532Q132L47420k20752
16345D01387M5465j30118k1310J56065j29397j0474L16196B59980A09602M17724
16335E27326A90725Q0267Q7414P8223B16350K04680J61182j95817G7830J24470
16325B02300j2276L54238k18567J25339K1271P8757B71131A30669R1007p4925
$$ y = [327598, 307733, 326151, 441148, 400918, 317461, 452627, 364718, 328299, 976979, 443385, 403483, 409012, 294023, 597258, 357372, 275193, 173031, 235887, 458428, 425959, 403386, 619452, 587847, 201233, 304430, 779626, 491118, 1056741, 533809, 358439, 533343, 473457, 204637, 182310, 159859, 439158, 353712, 396886, 193789, 205569, 120704, 479004, 401270, 371328, 427336, 491375, 93546, 303447, 301703, 328119, 266587, 274719, 622139, 401387, 446852, 316734, 295424, 451489, 322092, 311618, 627814, 259980, 109602, 527326, 190725, 270992, 358406, 436629, 216350, 421030, 582212, 386395, 77830, 202300, 190024, 544262, 325695, 451034, 472305, 551062, 271131, 130669, 221676, 146751]
16315A46751J19977m2905J98440j96971Q1038J27865E5780J98626J14987o6407
16305C02986l5192j25845Q1463K0873K9584n6120E8970L31572A62644M58499j91584
16294D29559j34741K11228i0620E56959F5544M65702a53842i823C78924J566A48563
16282A65671l2109J08493h9978B76565Q7591m2165r5222B5414K78942a87545h2860
16270d2419B84548E6592K8539c5194j41346H7486M53634A50508K8975m8124J957
16259A33316J12923A09862J78662J44501L2316A26177f6568J8141I0702L24197
16249D14899j79505i8467L6977A06714L37425j78197a6551D75436A77516a99750
16238a72480c4080B4339N0998j5179L0760K38949J15380A6774f3638D16861C1337
$$ y = [146751, 266728, 223823, 422263, 225292, 306330, 434195, 55780, 254406, 369393, 302986, 267794, 141949, 223412, 244285, 273869, 217749, 58970, 390542, 162644, 621143, 429559, 294818, 506046, -90620, 556959, 65544, 531246, -153842, -9823, 378924, 380490, 148563, 165671, 133562, 242055, -89978, 276565, 364156, 321991, 226769, 25414, 304356, -187545, -82860, -42419, 284548, 56592, 85131, -35194, -176540, 87486, 541120, 150508, 179483, 131359, 133316, 246239, 109862, 288524, 433025, 465341, 126177, -66568, -48427, 90702, 414899, 235394, -98467, -61490, 106714, 444139, 265942, -16551, 475436, 177516, -199750, -172480, -34080, 24339, 75337, 60158, 90918, 329867, 445247, 16774, -63638, 416861, 31337]
16226A14941D2830J7888K70957D2467L55400a48372F9312J69584d4546j8093n2292
16215a14931p8401F7769K20316a491o5385C41297A43474r940a55772A31823b38518
16203D0320J65183p4364f2133C99664B0398J02296D05K2698J16946b05193J4473
16192a90720A13566J58520m3542A01972j1973e3467D7753j3307J0192Q4974a01903
16180b1200k08838C04437a10375A64462a32681B4762a4968A17800K88761d791
16169A42264O2461p6277B4592Q336J28414A8907a68269N5420A19896a33704d6574
16157A42242e4786F4810O7720K11817H8678K85357a84528h5529l3180G9571L25711
16146D05282M340b3656B3211K50661c22779A41812a09130c5130C10359a08516
$$ y = [114941, 42830, 60718, 331675, 42467, 397867, -148372, 69312, 238896, -44546, -62639, -114931, -193332, 67769, 288085, -1491, -66876, 341297, 143474, 133534, -155772, 131823, -238518, 40320, 205503, 131139, -62133, 399664, 20398, 122694, 405, 23103, 140049, -205193, -190720, 113566, 272086, 228544, 101972, 89999, -53467, 47753, 34446, 44638, 129612, -101903, -21200, -230038, 304437, -110375, 164462, -132681, 24762, -14968, 117800, 406561, -4791, 142264, 204725, 128448, 24592, 32928, 161342, 18907, -168269, -112849, 119896, -133704, -46574, 142242, -54786, 64810, 132530, 344347, 88678, 374035, -184528, -85529, -118709, 79571, 405282, 409622, -23656, 23211, 273872, -322779, 141812, -109130, -35130, 310359, -108516]
16135A11039M253i3753k39009R1074J08604B71181a66910o5561e6737k4523G2943
16123A15693b44560M8941b7784D2860a10346C33870i445l3982p68j65612A0110
16111B13587a44563D2858j5491J16436J53866j21974a94930A93579p7003m6888
16101F9688J49943J81445E6183Q508b10931A00162e8714A85207h6048A10019N9301
16090A69320d4705F394J16757i1698C4446J21640b17759B13221j3271E8008K24870
16079B82878E6372L1306c604A51613c80716J22688a6298A86575I701b4205j72652
16068a96857c2936J6249H093J09971c5830B36450g8919B2087c9855B00571E9741
16056a52212f4160B43975j4618I1587h9702j80372B19403F827N7037P4371a34078
$$ y = [111039, 115292, -93753, -332762, -241688, -133084, 271181, -166910, -232471, -56737, -81260, 72943, 115693, -244560, -195619, -27784, 42860, -110346, 333870, -9445, -43427, -44195, -209807, 10110, 213587, -144563, 42858, 27367, 143803, 297669, 175695, -194930, 193579, 116576, 69688, 219631, 401076, 56183, 64691, -210931, 100162, -58714, 185207, -86048, 110019, 169320, -44705, 6394, 123151, -91698, 34446, 156086, -217759, 213221, 199950, 58008, 282878, 56372, 87678, -3604, 151613, -380716, -258028, -16298, 186575, 9701, -24205, -196857, -32936, -16687, 8093, 118064, -35830, 236450, -78919, 22087, -39855, 200571, 59741, -152212, -64160, 243975, 229357, 91587, -89702, -270074, 219403, 6827, 63864, 138235, -134078]
16044C29056A26140J02425b5614M18j98313A3283b2996k03894g0706k03806b0334
16032a77650D6030a76135B47082L884E4529d5151B0908a68081a474q5015j17439
16021b03928c2693l02078G6826J58200a34482D5584c7470A50007n089K33252I0645
16009d7860J0226p4440A47834F2010a72479A93882a59548a5574o0160q5733J7496
15998a43971g1981j33868H2297a66685A60403a92037g0444A24508b6810B37649
15987i289A53190m9643J01320H6408c11721E53759I6000J77780a17181A05187
15976A66357E8122k5732M7020K75522a0917k79387a17339J2474J8785A08425g4741
15964A19791h0600A18254J37531A2694J85077h6554j79891B2925a514r7305D7885
$$ y = [329056, 126140, 228565, -25614, -25196, -223509, 13283, -22996, -226890, -70706, -274512, -20334, -177650, 46030, -176135, 247082, 250966, 54529, -45151, 20908, -168081, -1474, -86489, -203928, -32693, -334771, 76826, 235026, -134482, 45584, -37470, 150007, 144918, 378170, 90645, -47860, -37634, -112074, 147834, 62010, -172479, 193882, -159548, -15574, -75734, -161467, -143971, -71981, -205849, 82297, -166685, 160403, -192037, -70444, 124508, -26810, 237649, -9289, 153190, 103547, 204867, 86408, -311721, 553759, 96000, 273780, -117181, 105187, 166357, 58122, 32390, 79410, 354932, -10917, -290304, -117339, -104865, -86080, 108425, -74741, 119791, -80600, 118254, 255785, 12694, 197771, -86554, -266445, 22925, -1514, -98819, 47885]
15952a13899E6595K6983a1391k23070O0800B85955d3983J5129G2992a43564j10682
15941b54246D9908a5709A27232a17703B84640e13236A20410C9499A5220c51727
15930b10389C2861d79969a33261A09272a81131Q6332q2754g6965k57523B76753
15919a15438E4556a39632r5654j5864A6467F247a25490C26506j08926j07144N2687
15908A63123E4690N1102B9354n827j0985b28676I4686q023c12596g5633Q464A31915
15895A69841K0181n3156m8105J53081f0554j06388I8806L8039J03207a85521R2104
15884i3417r7931D7614O3977a78008B08622a42437j98175O9502N5461a0635j15402
15873a26037A76934b38465B14490n7940b55999i229C8728a46555B47395f8607
$$ y = [-113899, 56595, 83578, -11391, -234461, -173661, 285955, -43983, -28854, 72992, -143564, -254246, 49908, -15709, 127232, -117703, 284640, -513236, 120410, 39499, 15220, -351727, -210389, 32861, -479969, -133261, 109272, -181131, -94799, -177553, -76965, -334488, 276753, -115438, 54556, -139632, -235286, -251150, 16467, 6247, -125490, 326506, 217580, 110436, 163123, 54690, 105792, 29354, 23527, 12542, -228676, 94686, 86663, -312596, -75633, -67169, 131915, 169841, 190022, 136866, 88761, 241842, -60554, -166942, 98806, 136845, 240052, -185521, -93417, -191348, 47614, 111591, -178008, 208622, -142437, -340612, -271110, -215649, -10635, -126037, 176934, -238465, 214490, 156550, -255999, -9229, 38728, -146555, 247395, -68607]
15862I9707a1051E5336a04962l47691A6878f9141A67108a18j6171D4846J78657
15851B23503g74A15785c55853a6507C3301b12334b4690A60958d9543A02841a54982
15839a26854A9062i749j32444B00803J0082g7454j45177D539a19194A0984P3795
15828H4779a87056h8000l6860A30193a74220k21298a33552A43473c45031L3847
15818c11184C00620h9088L6890I4055a70569P2865K0032j56876j54596E1630A8317
15806b7576O324A17693a92363E0608p100a79027l67469A69299D7604a0972q6390
15795i7362A16220a46915B12975C3496b57154A06640a96854A19077f974B44097
15784e5642o5994b6873j90567H673b41771l1248F7673a99832K6387G9213a59175
$$ y = [99707, -11051, 55336, -104962, -452653, 16878, -69141, 167108, -118, -16289, 44846, 223503, -774, 115785, -355853, -16507, 33301, -212334, -24690, 160958, -49543, 102841, -154982, -126854, 19062, -9749, -142193, 200803, 210885, -77454, -222631, 4539, -119194, 10984, 84779, -187056, -88000, -124860, 130193, -174220, -395518, -133552, 143473, -345031, -311184, 300620, -89088, -52198, 94055, -170569, -97704, -77672, -234548, -389144, 51630, 18317, -27576, -21252, 117693, -192363, 50608, 43508, -179027, -546496, 169299, 47604, -10972, -97362, 116220, -146915, 212975, 33496, -257154, 106640, -196854, 119077, -6974, 244097, -55642, -121636, -26873, -217440, 8673, -241771, -273019, 67673, -199832, -173445, 79213, -159175]
15772b70170O8078D3722N3822c14848C88743A11325c02532l531d4219j57497A73914
15760H3968Q1359o7064a76422A73817j1175r019C4573J84708a02306j88356B0120
15748A90653B9756K12790h8068j45596a00041k06585B36308f8434n7241A02349
15737e5651j03382B11086D1940R742a00781B56434H7015C5261a06944j38672J21645
15726a23971c0406m17572a53780e0148B37086a41170H4212J72126b29575C53526
15715B17269a05465A37041n6169f34342h1467b6802G5740a38720A15793e10356
15704a31488p0444d4034A92933a52943F3081D513J45051k775c26520O6504j16653
15693c76669J56812B09384D9686a82887Q9246L0635b7114K608j11815o5006j75531
$$ y = [-270170, -202092, 43722, 97544, -314848, 388743, 111325, -302532, -306063, -44219, -201716, 173914, 83968, 165327, 98263, -176422, 173817, 162642, 153623, 34573, 219281, -102306, -290662, 20120, 190653, 29756, 242546, -88068, -233664, -100041, -306626, 236308, -68434, -125675, 102349, -55651, -159033, 211086, 41940, 51682, -100781, 256434, 87015, 35261, -106944, -245616, -123971, -30406, -447978, -153780, -50148, 237086, -141170, 84212, 256338, -229575, 353526, 217269, -105465, 137041, 80872, -634342, -81467, -26802, 75740, -138720, 115793, -510356, -131488, -201932, -44034, 192933, -152943, 63081, 4513, 149564, 146789, -326520, -260016, -376669, -219857, 209384, 49686, -182887, -93641, -63006, -27114, -24506, -136321, -201327, -376858]
15682c76858p3640B14875a9820m64304K34520F0134b76707h1224A43673b51477
15671D22711a11725G7627B5309h1258A33048a1196A02370N8308J05625B5457a06485
15659a24162A9507a99805N2612j0173l7724A41334j0099F756J36268f1594J4795
15648d6799m2576P058D1394g2180F0719N5836K62816c47680G0147h5478B20022
15636C9171f9957A40803E726d67939b21251e3805b2529k35935j90444i4872A43150
15624b36577r264g6706j135j46974A28686a29663G2730c24414A57508G5163b20157
15612I6046e4819l60810A32725c02227c5135n2912A6198J5028c38772a52964A1253
15600h5028p3943e7164j71489C44858b36576a260B8249E693a36936F9281a12874
$$ y = [-376858, -450498, 214875, -19820, -484124, -249604, 60134, -276707, -81224, 143673, -251477, 422711, -111725, 77627, 25309, -81258, 133048, -11196, 102370, 160678, 266303, 25457, -106485, -124162, 19507, -199805, -147193, -157366, -195090, 141334, 131235, 6756, 143024, -61594, -46799, -89375, -82317, 41394, -72180, 60719, 116555, 379371, -347680, 70147, -85478, 220022, 39171, -69957, 140803, 5726, -467939, -221251, -53805, -22529, -258464, -448908, -94872, 143150, -236577, -245841, -76706, -77841, -224815, 128686, -129663, 72730, -324414, 157508, 75163, -220157, 96046, -54819, -415629, 132725, -302227, -35135, -88047, 16198, 31226, -338772, -152964, 11253, -85028, -158971, -57164, -228653, 344858, -236576, -1260, 28249, 5693, -136936, 69281, -112874]
15588a04998B38478j7931E9096K95891a26958B77954e6722j9273b8607k21164
15578b49771D1547a71852J8496J4321q7935c5018o1103D3093d17488a18656R678
15567a08978B4042a6193j8921j427J2525B8235P5474E0475c0064m2361J4444I2997
15554e9796k2455J0792C4048g3951p4682j07659o4322e3659j84614E9501R3890
15543A53391N8693c37646A53726b35467D48870a72289m0401b7632B5337L97376
15533D22713m9046C9799M0753a32962M5030B56805a54437A17360f7005k31502
15523b98507A7036K03066f6292H5524k8257a81074a3359j80768L5236e8432B32014
15511B79184p2226h622k26780f5276I3041Q1807h5674A82484l2068b13691A59908
$$ y = [-104998, 238478, 220547, 59096, 354987, -126958, 277954, -56722, -75995, -28607, -249771, 41547, -171852, -153356, -139035, -226970, -35018, -96121, 43093, -417488, -118656, -108978, 24042, -16193, -35114, -36541, -24016, 28235, 103709, 50475, -30064, -72425, -57981, 92997, -59796, -82251, -71459, 34048, -73951, -148633, -256292, -320614, -53659, -238273, 59501, 153391, 212084, -337646, 153726, -235467, 448870, -172289, -212690, -27632, 25337, 422713, 373667, 39799, 80552, -132962, -87932, 256805, -154437, 117360, -67005, -298507, 17036, 220102, -66292, 85524, 57267, -181074, -13359, -194127, -158891, -58432, 232014, 279184, 206958, -8622, -235402, -65276, 93041, 174848, -85674, 182484, 150416, -213691, 159908]
15499A47812b97944a43168k5330A38497a1778A07751I846J65862G1791k4344c8805
15487A62981f7508E9212d31090J22444f7904b8927k3285o1221b9145j84034A52764
15475B8977c09043A7569h2279A01819O1402g6696k34182B23a37285C41715A07997
15463d8415H7986a63296B5143J00267o2619B8608a31928F449a65771C06840a57335
15451d5487k37976A51813d25626J32976c2781k98725E3359k3170g0823m6448j44117
15440b61388J12726A88693a43542c3083j11368J6237I8479P4392c27577A7348
15429a91477A38103j9356C0958e2905m8098A5485M7371h0299L0880j1965j61303
15418b22687B98234d15928D39867a6701p2228C64503A4293O796J27729O8357j05500
$$ y = [147812, -297944, -143168, -168498, 138497, -11778, 107751, 9846, 175708, 71791, 47447, -38805, 162981, -67508, 59212, -431090, -308646, -67904, -28927, -52212, -113433, -29145, -213179, 152764, 28977, -309043, 17569, -82279, 101819, 163221, -76696, -310878, 223, -137285, 341715, 107997, -48415, 87986, -163296, 25143, 125410, 62791, 28608, -131928, 6449, -165771, 306840, -157335, -45487, -283463, 151813, -425626, -292650, -32781, -331506, 53359, 30189, -70823, -117271, -261388, -148662, 188693, -143542, -33083, -144451, -128214, 98479, 172871, -327577, 17348, -191477, 138103, 118747, 30958, -52905, -101003, 15485, 62856, -80299, -49419, -61384, -222687, 298234, -415928, 439867, -16701, -88929, 364503, 14293, 21089, 148818, 217175, 111675]
15407A11675j8446b00826D4848J50524K40362A01531a14612E4384f5779A04795
15396a86796M9511O7643B07950I8409b6227l6355A58519n1259d6191j17187f5268
15384a29326C44310d91241a17127b9990l5990H5607L00132a59560B02695a83276
15373a14630K6114M1756A00413K20030h8693A8595K3969J17222G7595b98739B45705
15361a81682d783k34119R3011B07554D5841A4354R7249F035J63157J24377D5334
15349b92487C1065g311q2214b6407F2066H458b01283k6308E752J02077a03577
15337C8208J54453b58753B16773P385a23395B43368a27360C95940A82596G3169
15326B64438b62783f908j56229C54526A13623m0785i5704H6967K88588F9049d3860
$$ y = [111675, 93229, -200826, 44848, 195372, 435734, 101531, -114612, 54384, -65779, 104795, -186796, -137285, -69642, 207950, 98409, -26227, -62582, 158519, 107260, -46191, -163378, -65268, -129326, 344310, -491241, -117127, -29990, -65980, 85607, 385739, -159560, 202695, -183276, -114630, -88516, -46760, 100413, 320443, -88693, 18595, 42564, 159786, 77595, -298739, 245705, -181682, -4783, -238902, -145891, 207554, 45841, 14354, 111603, 6035, 169192, 293569, 45334, -292487, 31065, -7311, -89525, -26407, 62066, 8458, -201283, -227591, 5752, 107829, -103577, 38208, 192661, -258753, 216773, 224158, -123395, 243368, -127360, 395940, 182596, 73169, 264438, -262783, -6908, -163137, 354526, 113623, 72838, -95704, 86967, 375555, 69049, -43860]
15314a43100A51879J930n4190J78525A7039B26e8832B6738R9601a68808j7115
15303a85923c2251A54527F1808c0158o8649H4098L24423c29131H9620J19371a4470
15291G6962a86221F9697K9550e2242A40304J08306c8912I0501C6998J91529H6920
15279A37794O324c517A00895l6596b17217g2266B73859j00989h8227M3553G7135
15267e188k46900A24851J7651E7567k96a83061B98185G1198j9796F900M27526
15256D34426i015B92444j44772K81033D2662K87675J16695M3976N47677P04120
15246A742805L850k06564M0699p07433B35124H3121Q8793a677B67436B5312J39105
15235A64417a25591m0497e0620E2482J94982Q9348l2697I2527g0968K9353C9560
$$ y = [-143100, 151879, 153809, 99619, 278144, 17039, 226, -58832, 26738, 126339, -168808, -185923, -32251, 154527, 61808, -30158, -98807, 84098, 408521, -329131, 89620, 208991, -14470, 76962, -186221, 69697, 99247, -52242, 140304, 248610, -38912, 90501, 36998, 228527, 86920, 137794, 144118, -3517, 100895, 64299, -217217, -72266, 273859, 172870, -88227, -44674, 77135, -5188, -252088, 124851, 142502, 57567, 57271, -183061, 298185, 71198, 51402, 6900, 434426, -9015, 292444, 147672, 428705, 42662, 330337, 447032, 491008, 1038685, 1742805, 1746655, 1540091, 1580790, 873357, 235124, 83121, 171914, -1677, 267436, 25312, 164417, -125591, -166088, -50620, 52482, 247464, 336812, 304115, 92527, -70968, -41615, 39560]
15223A47276D3751a03253B67772A3887d20749C15808A37279E6728e9354B08986
15212a404n6502j1339k6062G8873J76349A21985f1754A92537a84889C67071q2699
15201B84372E5182B2406c0931C1501a7967D37973C9003L11966f0738b3266B36092
15189F0847a07193A96405a46563B05374H2435a45318n8411C86341D6283J51764
15179A98047r5132B9808K51378j17708J3389R9992j36421E8239b18239B66563
15168B01097b69175d958A30504R3310K8668p1041K16447a1013A87628a90866H8122
15156g5451D29473c3667A59582F3096a52878B59554a80009A7103K34271h9016
15145D1023L91436I4923a20270A88178l2581d8698j18918A63588c4356C24398
$$ y = [147276, 43751, -103253, 267772, 13887, -420749, 315808, 137279, 56728, -59354, 208986, -1404, -57906, -69245, -95307, 78873, 255222, 121985, -61754, 192537, -184889, 367071, 284372, 55182, 22406, -30931, 31501, -17967, 437973, 39003, 350969, -60738, -23266, 236092, 60847, -107193, 196405, -146563, 205374, 82435, -145318, -203729, 386341, 46283, 198047, 102915, 29808, 281186, 163478, 176867, 276859, 140438, 58239, -218239, 266563, 201097, -269175, -4958, 130504, 223814, 252482, 181441, 397888, -11013, 187628, -190866, 88122, -75451, 429473, -33667, 159582, 63096, -152878, 259554, -180009, 17103, 251374, -89016, 41023, 432459, 94923, -120270, 188178, 155597, -48698, -167616, 163588, -34356, 324398]
15134a60027B52408c8844A24080M59736I9821l172K01144j04356L8426I0916M2893
15123A33809e0785A83661l6269O3343q2609c6811A44220D0753J69952B1582g9989
15111B5564J83827c8490C89407j66164J04539A49065L29774G3148h898B63323
15100b72100J9941A09854J76588E6153P3482a53602C19665A17147e094H8597l6457
15089E2140J60524a50564d8982B44150N6898L20864C8487j2534O5914O9430K57476
15078D18773b5304C62219A48978K58594R6440c2016C67822j01379j26174j3928
15068A26341R1483I8475K34768A07502J35986A02263K02389J0299K30400g0512
15057B1205K25383n4727L9431L5941A32962J32380a69580F4460p383K3728K6253
$$ y = [-160027, 252408, -38844, 124080, 583816, 99821, 96649, 297793, 193437, 231863, 90916, 133809, -50785, 183661, 147392, 210735, 128126, -36811, 144220, 40753, 210705, 21582, -79989, 25564, 209391, -38490, 389407, 223243, 327782, 149065, 478839, 73148, -8898, 263323, -272100, -252159, 109854, 286442, 56153, 129635, -153602, 319665, 117147, -5094, 88597, 52140, 212664, -150564, -48982, 244150, 301048, 621912, 38487, 25953, 91867, 161297, 418773, -25304, 362219, 148978, 407572, 504012, -32016, 367822, 266443, 140269, 126341, 217824, 98475, 333243, 107502, 243488, 102263, 304652, 314951, 545351, -70512, 21205, 246588, 191861, 231292, 267233, 132962, 265342, -169580, 64460, 57077, 80805, 107058]
15046A07058Q1941K31853k07241E0453P8330J58569A39401N6803R9559j05037
15036A90726J36836g323B20718P6367j00597m6784J96650M6219o0138N690F5396
15024a47350P0403G241a62248E06885a18961A55213J90828O6064A92996b7920
15013B03661K66573B5295i3730H0567M79022k41431b4863D119c4853B97020o4082
15002B32938P0884P8086K52395A46741B7509L05495n0138j34656J8744Q6208J1254
14991B64416J5598J09892p4869R2832L32690C66740m2959m6924j3520J76390B19860
14979C03567c03052E4903a08513C32062H0619a0142A92278b415C50320p2781n4785
14968B22754H1351K19161J30415A70630B4840J48637J79460f4012A11744R4480
$$ y = [107058, 188999, 420852, 213611, 50453, 128783, 287352, 139401, 196204, 295763, 190726, 327562, -7323, 220718, 297085, 196488, 149704, 346354, 392573, 332435, 338125, 65396, -147350, -76947, 7241, -162248, 506885, -118961, 155213, 346041, 412105, 192996, -27920, 203661, 470234, 25295, -93730, 80567, 559589, 318158, -24863, 4119, -34853, 297020, 232938, 303822, 381908, 634303, 146741, 27509, 333004, 282866, 148210, 166954, 253162, 264416, 280014, 389906, 315037, 407869, 740559, 366740, 323781, 276857, 263337, 439727, 219860, 303567, -303052, 54903, -108513, 332062, 80619, -10142, 192278, -2415, 350320, 277539, 222754, 81351, 300512, 430927, 170630, 24840, 173477, 352937, -64012, 111744, 206224]
14958B06224J40891i5320E72432B28277k1933J01263A08199L84455A70181l3044
14948A37137J63781N782a1259C07918A18988J33739K28138A18521K79473n8688
14938C39306r7619J45228j28739K81245A14328K54208j72937C1234L51900j26321
14928B56813p8197c8589C21742a14479B48682r3960L04135J43395J80469k86723
14918D95998r7395A81440J75345o7633L55791B81443K35839D1049N29956g0628
14907B78424j3122J69646m0768o3378j14621K66922J3157H3158L2986J68828P8842
14896C63814O9841j60070M02597k39650k16806k369L60804j90268q0053j17409
14886A90431Q1660K50949j06814j27837P2076K8820j02101j15844K23733A81038
$$ y = [206224, 347115, -95320, 572432, 228277, 206344, 307607, 108199, 492654, 170181, 137137, 300918, 306700, -11259, 307918, 118988, 252727, 480865, 118521, 397994, 339306, 241687, 386915, 258176, 539421, 114328, 368536, 195599, 31234, 383134, 256813, 178616, -38589, 321742, -114479, 248682, 154722, 458857, 602252, 782721, 495998, 398603, 181440, 356785, 289152, 644943, 281443, 517282, 41049, 571005, -70628, 278424, 265302, 434948, 394180, 330802, 216181, 483103, 496260, 83158, 116144, 284972, 363814, 433655, 273585, 676182, 436532, 219726, 217357, 578161, 387893, 307840, 190431, 272091, 523040, 416226, 288389, 360465, 389285, 287184, 171340, 395073, 181038]
14875F6027L05029o509Q5286j62511N9832E0860N19333c5859B24772M74382j95088
14864E04066J9116j76716K43337L3646m3439p1758l57j73787J82758j78179L85180
14853G23867l43644L00137j45213K83100C59719K03055M8927j10812J5569O4169
14843E80627k62305J06738J63225j70142O3147k1142G6004L86150J19904l5443
14833E46615P135R9375J12679j63776k36274L00275j95087Q078N2241r2193R962
14822D49030J19354k34082m0014N0386K99883B13415R3027R4969l3180L88262
14812G56493l26599J3352P0594Q665J52186A67414K12453K55023j01405K1894
14802E55379L33775j62657k86061K72103l55550l374P1195r4210M75020l47051
$$ y = [66027, 371056, 364547, 449833, 287322, 347154, 50860, 570193, -35859, 224772, 699154, 504066, 523182, 346466, 589803, 623449, 580010, 508252, 507895, 334108, 516866, 338687, 723867, 380223, 680360, 535147, 818247, 359719, 562774, 611701, 500889, 516458, 580627, 318322, 425060, 588285, 418143, 481290, 460148, 76004, 462154, 582058, 546615, 553750, 653125, 765804, 602028, 365754, 666029, 470942, 479020, 531261, 439068, 449030, 568384, 334302, 294288, 344674, 644557, 213415, 306442, 401411, 368231, 756493, 429894, 443246, 513840, 522505, 674691, 167414, 379867, 634890, 533485, 555379, 889154, 726497, 440436, 712539, 356989, 353615, 424810, 330600, 805620, 458569]
14792D58569j08744N26111j60474m559k24625B39220K56978p0702K48629J39816
14782H13941j66837r2724K98607k02784k97476L42287o3618j17617J27020l1277
14772F09522N8601J30786J18087m09446K31531j39697j73657L46508j18560B84549
14761G79548m8242J28961j11419k52027L78250l66939k52615J98067L37407k00155
14751E90836L87612p6354j73215L56146k86818J54230j29763n192j74680K68171
14741I10973j61056K21691k60845J2254K97757j63771j65944j79877J38015Q5886
14731G35083J09274j8181N1114J0383j20404Q1741A68385N61856J79279l15113
14721E94407K63126Q7603k70804k90281M55421K0998j05955j92666L5513K41312
$$ y = [458569, 349825, 875936, 715462, 710903, 486278, 239220, 496198, 425496, 674125, 813941, 647104, 554380, 852987, 650203, 352727, 695014, 631396, 513779, 640799, 609522, 668123, 798909, 916996, 507550, 739081, 599384, 425727, 772235, 653675, 284549, 779548, 731306, 860267, 748848, 496821, 875071, 508132, 255517, 453584, 790991, 590836, 978448, 902094, 728879, 1085025, 798207, 952437, 822674, 817482, 642802, 910973, 749917, 971608, 710763, 723017, 1020774, 857003, 691059, 511182, 649197, 735083, 844357, 826176, 877290, 887673, 767269, 849010, 168385, 730241, 909520, 594407, 857533, 945136, 674332, 384051, 839472, 860470, 754515, 561849, 597362, 838674]
14711H38674p5482J30424J19098j18824j03370n4887M90552j44329k91995J21976
14701I11837l2265j81830P905K82543j0352j46848j8206K25323k75858K50619
14691A012868m0684K64044m23248l2230M21725j13407m79768N68801k63971j15963
14681G98167L83706N3995l57870j07014M61381j78941m4151l0222K83372l24484
14671I37939l3613j37813L20351J28740k37153J90655J6352k10814J5769P3662
14661A064075Q3522p6688K74597K93896M7592m74199K05595j37875J45974k79743
14651A146746j13510K8993K03797o3257O3306q446K24182j74434J94029l84853
14641A116553K21061q4991R763k02530R7748r3232J71192K56304Q8841j04737
$$ y = [838674, 763192, 893616, 1012714, 893890, 790520, 735633, 1226185, 1081856, 789861, 911837, 879572, 697742, 705647, 988190, 977838, 830990, 812784, 1038107, 762249, 1012868, 972184, 1236228, 812980, 780750, 1202475, 1089068, 609300, 1178101, 914130, 798167, 1181873, 1235868, 877998, 770984, 1232365, 1053424, 1009273, 979051, 1262423, 937939, 904326, 766513, 1086864, 1215604, 978451, 1169106, 1185458, 974644, 990413, 1064075, 1147597, 1070909, 1345506, 1639402, 1686994, 1212795, 1418390, 1280515, 1426489, 1146746, 1033236, 1062229, 1266026, 1202769, 1266075, 1257629, 1481811, 1307377, 1501406, 1116553, 1337614, 1252623, 1262386, 1059856, 1157604, 1064372, 1235564, 1491868, 1580709, 1475972]
14631A475972m75368M24668o9383p0337K09039j41771L16930m1715O7757j42147
14621A553645j36509J3674j15853K79525N8562l45558J48728J45807J03527m1868
14611A663680j49244J8555L665N553J67720m84713K15936L65073j11905K38980
14601A933300k11458L16408l36874k84174L86800k02968L06180J39169l02669
14592A743714J97068k20007N41426j58248J72495l75637L70208n04185K00159
14583A966993K56298p9510o3884M30318p65420K34700K76057M9552K16293n86565
14573A934832M58113j99660J64981m4404L6801j80711R1599L57902l0560q0462
14563B508431J79997J62095j4855k59386L91382J80585k3602J87370L04575j81768
$$ y = [1475972, 1000604, 1425272, 1355889, 1285552, 1494591, 1352820, 1669750, 1628035, 1695792, 1553645, 1417136, 1430810, 1314957, 1594482, 1653044, 1307486, 1456214, 1602021, 1705548, 1663680, 1514436, 1532991, 1536656, 1542209, 1709929, 1225216, 1441152, 1806225, 1694320, 1933300, 1721842, 2038250, 1701376, 1417202, 1804002, 1601034, 1907214, 2046383, 1743714, 1940782, 1720775, 2262201, 2103953, 2276448, 1900811, 2271019, 1766834, 1966993, 2223291, 2143781, 2079897, 2510215, 1744795, 1979495, 2255552, 2305104, 2521397, 1934832, 2392945, 2193285, 2358266, 2313862, 2350663, 2169952, 2261551, 2619453, 2588893, 2508431, 2688428, 2850523, 2835668, 2576282, 2967664, 3148249, 3124647, 3312017, 3616592, 3434824]
14553C434824N58891P58380L82289J336698K989916O047947J0695180J0313053
14545C6517178M371810j7772034j0313676n065951l481190j368716o0417m17053
14537B409951l40468m0378M83707k25400k84791J75864O1198k903K8658o3046
14527B202392N5672L06665j78131p080n1737K99802k40984L22898l6677j53074
14517B519746J17490O6059K75685J65865l9660q9550j86461J93922q2843j48523
14507B791730L32428j86958L47707m46427N64311k10877Q7124n7050J31065K35885
14497C588938k59798P4827K5098J26497m93538O59739p3087l21725L48698K28784
14487C904433k58340L52183L7465L7400K86721n31298N17547J92395o96219O79179
$$ y = [3434824, 3993715, 4752095, 5134384, 6471082, 9460998, 15508945, 26204125, 36517178, 40888988, 23116954, 12803278, 7737327, 4256137, 2887421, 2827004, 2409951, 2069483, 2029105, 2512812, 2287412, 2002621, 2178485, 2239683, 2236780, 2265438, 2202392, 2258064, 2564729, 2386598, 2379518, 2327781, 2627583, 2386599, 2709497, 2672820, 2519746, 2637236, 2703295, 2978980, 3144845, 3105185, 3015635, 2829174, 3023096, 2940253, 2791730, 3124158, 2937200, 3284907, 2838480, 3402791, 3191914, 3279038, 3221988, 3353053, 3588938, 3329140, 3403967, 3429065, 3555562, 3062024, 3721763, 3648676, 3326951, 3675649, 3904433, 3646093, 3998276, 4035741, 4073141, 4359862, 3828564, 4346111, 4538506, 3842287, 4521466]
14477D521466j11543q2548j8431J25801j00261J02529J86243J27453R6448k33553
14467D613604K29672m5485K38364m87508L76066J41837L45267j72798n34611M76409
14457E180817R9733J50854k04931R36175r06348N51836j82711N0798L47617N5478
14447F079318l00202J12599M03687k83597K22426M4607J06808l0225m087L01828
14437F653162L13129k34036Q805r3567J7469K68690L80865L30516j72220Q1052
14427G553865m6251J68952M99934l0018j0159j08463M34308p910j92367J3969
14417H275860N12828J94376k63065P08436j57822L5588L55900q532L56844J64379
14407A0174792K4067K16006j85519M62319k71377P31102j03419L64767K07264
$$ y = [4521466, 4409923, 4327375, 4308944, 4434745, 4334484, 4437013, 4623256, 4750709, 4847157, 4613604, 4843276, 4797791, 5036155, 4548647, 4924713, 5066550, 5411817, 5239019, 4704408, 5180817, 5280550, 5431404, 5226473, 6162648, 5256300, 5808136, 5625425, 5676223, 6023840, 6079318, 5779116, 5891715, 6295402, 6011805, 6234231, 6278838, 6385646, 6355421, 6351334, 6653162, 6966291, 6732255, 6741060, 6647493, 6664962, 6933652, 7314517, 7645033, 7472813, 7553865, 7507614, 7676566, 8176500, 8146482, 8136323, 8027860, 8462168, 8454258, 8261891, 8275860, 8788688, 8983064, 8719999, 9428435, 9270613, 9306201, 9662101, 9653569, 10010413, 10174792, 10198859, 10414865, 10229346, 10691665, 10420288, 11151390, 11047971, 11412738, 11620002]
14398A1620002r9569L51711j36619M84953N45047l70451O55364o0390M65305N7504
14388A3512857P9209O22972r4399L54497M07223K26429J24886N45200j72453L83872
14378A5990293O35634K02631K85212K31963N39741K75461N15783L06667K80301
14369A9263686M21050K24236K94987J112785K09301L98458J26912N82034N46571
14360B3180020O40217N28041O0397N88568R20151N42527P08377P86476J90389
14351B8145163J159895L07669R62005Q15558O01875Q10802Q85407J016614R44787
14342C5649775P22105J247720O85107J056429J521237R35434R85212J003688J681688
14333D5488395J050050J563378J680546J533358J561596J686709J815058J428160
$$ y = [11620002, 11520433, 11872144, 11735525, 12220478, 12765525, 12395074, 13050438, 12990048, 13455353, 13512857, 13592066, 14215038, 14120639, 14475136, 14882359, 15108788, 15233674, 15778874, 15606421, 15990293, 16625927, 16828558, 17113770, 17345733, 17885474, 18160935, 18676718, 18983385, 19263686, 19684736, 19908972, 20203959, 21316744, 21526045, 21924503, 22051415, 22633449, 23180020, 23820237, 24348278, 24408675, 24997243, 25917394, 26459921, 27168298, 27954774, 28145163, 29305058, 29612727, 30574732, 31390290, 31992165, 32802967, 33688374, 34704988, 35649775, 36371880, 37619600, 38304707, 39361136, 40882373, 41817807, 42803019, 43806707, 45488395, 46538445, 48101823, 49782369, 51315727, 52877323, 54564032, 56379090, 57807250]
14325E7807250K364539K162692J885006K378067K024097K631970K248552K914071
14317G6416244K858009K929600L391704L121849L743854L377733M140124L877967
14309A03857084N004975M273149M870932N275777N388944N954878O091383O532479
14301A47249601P364874P169781P454995Q198338Q967490R041042J0012701J0265740
14293B15724562J0467892J1301966J2037487J2613917J3095833J3927966J4017648
14286C03187271J4956262J5275350J5245458J5353725J5665002J5752374J4990970
14279D10426412J4642475J4151113J2608456J1403494R684789O925524K967107
14272D82809370k298892m943324j200259K415935l095027n965057p681557r182340
$$ y = [57807250, 60171789, 62334481, 64219487, 66597554, 68621651, 71253621, 73502173, 76416244, 79274253, 82203853, 85595557, 88717406, 92461260, 95838993, 99979117, 103857084, 108862059, 113135208, 118006140, 123281917, 128670861, 134625739, 140717122, 147249601, 154614475, 161784256, 169239251, 177437589, 186405079, 195446121, 205458822, 215724562, 226192454, 237494420, 249531907, 262145824, 275241657, 289169623, 303187271, 318143533, 333418883, 348664341, 364018066, 379683068, 395435442, 410426412, 425068887, 439220000, 451828456, 463231950, 472916739, 479842263, 482809370, 480510478, 475567154, 474366895, 476782830, 473687803, 467722746, 460041189, 450858849]
14264D50858849j0933598j2465887j4036716j5075987j5064498j5974649j5925499
14257C51382015j6093713j5785634j5113649j4716182j3133945j3366649j3154053
14250B50018190j2153583j1758722j0926020j0631639r908713q980591q722431
14243A76936491q095018p890701p487519o941885o158153n951692n671164n558161
14235A23182198n027829n588093m101259m455353l921298l722535m102878k883459
14227H9379494l672928l206697l036275k817367k739671k435338k597731k162443
14219F6711044k263672k210108k382333j547480j783838j918309j344352j789156
14211E1471796j548065j369774j559415j011014r82368j595212j058529j535931
$$ y = [450858849, 439925251, 427459364, 413422648, 398346661, 383282163, 367307514, 351382015, 335288302, 319502668, 304389019, 289672837, 276538892, 263172243, 250018190, 237864607, 226105885, 215179865, 204548226, 194639513, 185658922, 176936491, 168841473, 160950772, 153463253, 146521368, 140363215, 134411523, 128740359, 123182198, 118154369, 112566276, 108465017, 104009664, 100088366, 96365831, 92262953, 89379494, 85706566, 82499869, 79463594, 76646227, 73906556, 71471218, 68873487, 66711044, 64447372, 62237264, 59854931, 58307451, 56523613, 54605304, 53260952, 51471796, 49923731, 48553957, 46994542, 45983528, 45001160, 43405948, 42347419, 40811488]
14203D0811488j059054j047953n57683q44958j338794j077751o22284j104635
14195C3158376p46383o61623q36968p25944r52005n08108q63414n69201r39422
14186B6355308j01726p26725o39543l02109o95578n90297l33659q15951n3135
14177B2096585p84685l51665P7291o90117o90514j99450o31514j06040n21356
14168A8198535J4452o01927m31952k39164n09132k82928k96612o6325j63005l63795
14158A5258147l64501o5091l73144l50900j6684m06890J43772n77801K9662n83111
14148A2693459K6419j12437m57634n4680k00501K64268p22424J30139n14087j23686
14138A0928836K29327n13393j4806l8548m02727K25217l03602m12051j09729l9251
$$ y = [40811488, 39752434, 38704481, 38146798, 37301840, 35963046, 34885295, 34263011, 33158376, 32411993, 31750370, 30913402, 30187458, 29235453, 28727345, 27863931, 27294730, 26355308, 26253582, 25526857, 24887314, 24585205, 23889627, 23299330, 22965671, 22149720, 22096585, 21311900, 20960235, 21037526, 20347409, 19656895, 19457445, 18825931, 18719891, 18198535, 18212987, 17611060, 17179108, 16939944, 16430812, 16147884, 15851272, 15784947, 15621942, 15258147, 14893646, 14828555, 14455411, 14104511, 14087827, 13680937, 13824709, 13246908, 13276570, 12693459, 12719878, 12607441, 12149807, 12095127, 11894626, 12158894, 11436470, 11566609, 11052522, 10928836, 11158163, 10644770, 10629964, 10591416, 10188689, 10413906, 10110304, 9698253, 9588524, 9549273]
14128I549273L29033o34680Q0785k58583Q4335P7977m99119M4685j48332j0916
14118H614458j95001j78165k88292j64410j00487K19699m83358O98412o19745
14109G503111P9996q0310k23336j33571N6505l15472j46214K2652j96058R886
14099F577189k635j39495J19397p7839j60628l90745J19421j19397r4255K84258
14089F115271j32668O8571j58048L37534r77480L67215k73534j48836M11830m35942
14079E173913q8608P3034J8750j45802L8980j8245j77869J71064k24785l06560
14069D513872J82245R1951l24430L19251j99153o9667k58959K98604k46254R6373
14059D403833m7322k06393L91473m07876R6770k98696L46477j61427j83698j08110
$$ y = [9549273, 9878306, 9243626, 9324411, 9065828, 9150163, 9228140, 8729021, 8773706, 8625374, 8614458, 8419457, 8241292, 7953000, 7788590, 7688103, 7907802, 7424444, 8122856, 7503111, 7583107, 7502797, 7279461, 7145890, 7202395, 6886923, 6740709, 6763361, 6567303, 6577189, 6574554, 6435059, 6554456, 6476617, 6315989, 5925244, 6044665, 5925268, 5831013, 6115271, 5982603, 6051174, 5893126, 6230660, 5253180, 5620395, 5346861, 5198025, 5609855, 5173913, 5085305, 5158339, 5177089, 5031287, 5070267, 5052022, 4874153, 5045217, 4820432, 4513872, 4696117, 4788068, 4463638, 4782889, 4583736, 4514069, 4255110, 4553714, 4307460, 4403833, 4356511, 4150118, 4541591, 4133715, 4230485, 3931789, 4278266, 4116839, 3933141, 3825031]
14049C825031p2020L48909k15956k08090J55455J27816k21133j64676k35465K69735
14039C609606n1401o6641J47038k04794n8460M03721m78734l2340J5120J6246
14029C299361K99786l58533K27517j98232k08793Q9610l7517k2564k6349p1614
14019B992672j22901J5762o079n527k27623R2403k48887J1040J05212J07455j91369
14008B522158L46857m29631M07308l67329j25424J9413Q3691n06953J77176J71646
13998B298912K07683l89145O53412p06752M43740o2604K51226L08354K30162J775646
13988E010634M915295J0083315J1620722R913980j4525235j2338623n343216k527448
13980F809424j512407m58426j047356j32214j4243p2255l48937q907j63126j02316
$$ y = [3825031, 3753011, 4101920, 3885964, 3677874, 3833329, 3961145, 3740012, 3575336, 3339871, 3609606, 3558205, 3491564, 3638602, 3433808, 3375348, 3779069, 3300335, 3267995, 3283115, 3299361, 3599147, 3240614, 3468131, 3269899, 3061106, 3150716, 3113199, 3090635, 3064286, 2992672, 2869771, 2885533, 2879454, 2873927, 2646304, 2738707, 2489820, 2500860, 2606072, 2713527, 2522158, 2869015, 2439384, 2846692, 2479363, 2353939, 2373352, 2457043, 1950090, 2127266, 2298912, 2506595, 2117450, 2770862, 2064110, 2507850, 2445246, 2696472, 3004826, 3234988, 5010634, 9925929, 20009244, 31629966, 41543946, 27018711, 14680088, 9336872, 6809424, 5297017, 4838591, 3791235, 3659021, 3644778, 3572523, 3223586, 3214679, 3051553, 2949237]
13970B949237j45226K4461j7979k32095p3945l09561m1379L85464j10364j88924
13960B239689J56673R4535k51180l249J4220M1513J42510q6643m49308M71510
13950B370270k39228n5439J04230n4900K0235j56085J23216P6563n0599k62418
13940A875845m9600L29845j39414J90684j67637o0126r8224k09120m49745O71194
13930A893702J29357k98340k08319L36552l69235K97279J92636k95179J30989
13921A809442k29945k6800L7807j89706L79843l88039K36993l57515M23384N2578
13911A748042j88198J35850k98946L85928l86877O0891Q2022q5574l1052K38672
13901A660758k14380M9145p1078j49975N3616M68050k53450j96213J85391m47843
$$ y = [2949237, 2804011, 2828472, 2810493, 2578398, 2504453, 2194892, 2153513, 2538977, 2428613, 2239689, 2396362, 2490897, 2239717, 2236468, 2250688, 2292201, 2434711, 2348068, 1898760, 2370270, 2131042, 2075603, 2179833, 2124933, 2145168, 1989083, 2112299, 2188862, 2138263, 1875845, 1826245, 2156090, 2016676, 2207360, 2039723, 1979597, 1881373, 1672253, 1222508, 1893702, 2023059, 1724719, 1516400, 1852952, 1483717, 1780996, 1973632, 1678453, 1809442, 1579497, 1552697, 1590504, 1400798, 1780641, 1392602, 1629595, 1272080, 1695464, 1748042, 1559844, 1695694, 1396748, 1782676, 1395799, 1456690, 1538712, 1453138, 1422086, 1660758, 1446378, 1495523, 1424445, 1274470, 1328086, 1796136, 1542686, 1346473, 1531864, 1084021]
13891A084021M30681n04574N67862n7573j77496K37907O8460P3604m01590K03556
13881A524858k08531K61484k43573l18584o0811J81855M65297n55795M9275J59233
13871A254708J41935k39705q9901M16531j11833j17316j196J49107J24674m40333
13861A086671J879m4748j49667K63565q7462J29374k54502m3466M63057k35903
13851A128798J7952k27314J78439k26534M01962N8911k07364M1531k43026J54753
13841A078108M9422o8750l2567q5077J24666K21957m82709N4795J49672J4660
13831A024177k58665M26097k00116M49455l18493k00188J56334M4740J00729K3347
13821A247417o8566E52628L86651L9973R9613o9955n291K86497l68770q6603K42285
$$ y = [1084021, 1514702, 1010128, 1577990, 1520417, 1342921, 1580828, 1649288, 1722892, 1321302, 1524858, 1316327, 1577811, 1334238, 1015654, 954843, 1136698, 1601995, 1046200, 1095475, 1254708, 1396643, 1156938, 1067037, 1483568, 1371735, 1254419, 1253223, 1402330, 1527004, 1086671, 1088550, 1043802, 894135, 1157700, 1070238, 1199612, 945110, 901644, 1364701, 1128798, 1146750, 919436, 1097875, 871341, 1273303, 1332214, 1124850, 1166381, 923355, 1078108, 1127530, 1058780, 1026213, 941136, 1065802, 1287759, 805050, 859845, 1009517, 1024177, 765512, 1191609, 991493, 1440948, 1122455, 922267, 1078601, 1123341, 1224070, 1247417, 1178851, 552628, 939279, 979252, 1078865, 1008910, 1003619, 1290116, 921346, 834743, 1077028]
13810A077028m05579O0705J7362L33743P1851l02187K46935m3101j89935j12368
13800G54454j87869J64355L62848j78106r2455K55748k20138q2954K19620q6257
13790I09246K22382l55222K34884J07324m55902J02582K53044J8718k86198P0418
13780H21276P9517q9373N8565N943j42462K23918k8279D60646K11941J6223O4970
13769G53780n7881o6295M6549m745L6195J03901n9371k18320L73424R9971k41975
13758G65233o2834j47986j40976j27785O29614j71734k44653K72310J19251j12838
13748G77602J22099m17846K5871N4487J05337k5639n790J24875n7301p9811J79809
13737H03693J82463A55573O62227Q3624q3351j16427k76761J41964R7459L18554
$$ y = [1077028, 671449, 732154, 749516, 1083259, 1155110, 852923, 1099858, 1056757, 866822, 754454, 566585, 730940, 1093788, 915682, 823227, 1078975, 858837, 775883, 995503, 909246, 1131628, 776406, 1011290, 1118614, 662712, 765294, 1018338, 1037056, 750858, 821276, 900793, 811420, 869985, 875928, 733466, 957384, 929105, 460646, 672587, 688810, 753780, 695899, 629604, 676153, 671408, 707603, 811504, 752133, 533813, 907237, 1007208, 765233, 702399, 554413, 413437, 285652, 915266, 743532, 498879, 771189, 890440, 777602, 899701, 481855, 507726, 562213, 667550, 641911, 636121, 760996, 703695, 623884, 803693, 986156, 155573, 817800, 901424, 818073, 701646, 424885, 566849, 664308, 982862]
13727I82862l60745j09256L17512J50979C64234M78215J08059D40984N9675P3942
13717E74601J58808J88488P8044l08009q8259j2116j02366J20038j88580L25583
13707G46232l06231O4250J57560B60049j05665N50797o6799j85482L05211n3236
13697G04875J76691j59366n0298k24392K42282J75238l03196m8898K46424B58954
13686F93007l5179k9008n593j21719j88623K24551K78470k89667r7263N0344l6683
13675D42637j92570L42673j87074K35512l06744J03029K77986k48262m2762K91302
13665G15727l10779m9237K1925K24006J6042J27487k77596K37157j46344k73706
13655B84682K14972n2851J33753J2778k30720J53535O4823B46633J35898p9426
$$ y = [982862, 622117, 512861, 830373, 981352, 364234, 842449, 950508, 440984, 500659, 574601, 733409, 921897, 999941, 691932, 603673, 591557, 489191, 609229, 420649, 746232, 440001, 504251, 661811, 260049, 154384, 705181, 638382, 452900, 758111, 704875, 881566, 722200, 671902, 447510, 689792, 865030, 561834, 512936, 759360, 258954, 693007, 657828, 628820, 623227, 501508, 312885, 537436, 815906, 526239, 428976, 479320, 442637, 250067, 592740, 405666, 641178, 334434, 437463, 715449, 467187, 424425, 715727, 404948, 355711, 377636, 601642, 617684, 745171, 467575, 704732, 558388, 284682, 499654, 446803, 580556, 593334, 362614, 516149, 580972, 246633, 382531, 303105]
13645C03105K74442j81170J30024k8584N2173j60544J34253M4578j3507J38532
13635F93302k82860K57703k81664j74413K35996k04547K16332o5645n2324J57712
13625D99592J09026j06636r7468q8312N67011m06765j20550L04188B30582L83352
13615F13934k99981Q8153A24893l7216L06390L2427o6933p2639J72991A38624
13604B91242I5290J46460L51441B63185l5063m8560p5180K86837J22066k55588
13594B57697J00266M2618K4365P0171J52601A35928J42301O9363J97781k10994
13584C34379J58776j32910m9682R8641A96721M73371I0550L02866K13615r8862
13574E08169A65715L97540k75066K8493j38308K95464A33991L35160L2559B08870
$$ y = [303105, 577547, 396377, 526401, 497817, 549990, 389446, 523699, 568277, 554770, 693302, 410442, 668145, 386481, 212068, 448064, 243517, 459849, 394204, 341880, 499592, 608618, 501982, 404514, 316202, 883213, 476448, 355898, 660086, 230582, 613934, 313953, 402106, 124893, 87677, 394067, 426494, 359561, 286922, 459913, 138624, 291242, 95290, 241750, 593191, 263185, 228122, 179562, 104382, 391219, 513285, 257697, 357963, 400581, 424946, 495117, 647718, 135928, 278229, 347592, 545373, 334379, 493155, 360245, 310563, 409204, 196721, 670092, 90550, 393416, 607031, 508169, 165715, 563255, 288189, 316682, 178374, 473838, 133991, 469151, 501710, 208870]
13563E77662H1605M32359n2716K4819k07597M24131l19067R5577A32596M213m7430
13552H9379l0396K98333A70342O978K28993r4178N17320j23302k57482J56926
13542F05597k70308j02248K64448k47716H1161M86470A40054K17635j78253J60765
13532C40201A62382M38291b13473C89796j58163J33377j0709M0189p2456A02467
13521B33788K96142a45075B58332P1415K81525H6264L13894J21894B19977J94238
13511D14215P8572l3028J261j98177j00527K34302j83612J3511K37242a50545
13500D82349A92485L15611A01139K07944N8750J1669p8355J93993j34818m6309
13490C14013J59183J6603j72151D0595J53273R3161P3828K37388o9806k50976
$$ y = [577662, 81605, 513964, 461248, 486067, 278470, 702601, 383534, 479111, 132596, 136809, 89379, 58983, 357316, 170342, 177320, 406313, 312135, 829455, 706153, 448671, 605597, 335289, 233041, 497489, 249773, 81161, 567631, 140054, 357689, 179436, 340201, 162382, 600673, -213473, 389796, 231633, 365010, 354301, 394490, 322034, 102467, 233788, 529930, -145075, 258332, 329747, 611272, 86264, 400158, 522052, 219977, 414215, 492787, 459759, 461020, 262843, 162316, 396618, 213006, 226517, 463759, -150545, 482349, 192485, 508096, 101139, 309083, 367833, 379502, 301147, 495140, 360322, 314013, 473196, 489799, 317648, 40595, 193868, 287029, 360857, 598245, 528439, 277463]
13480B77463O3255K593A44913J53786b5116C82091f0791E00670m0972j69742J16674
13469D06630j67312e1390A78471j9424m7694K00687D6799N33549A1243L97913
13459D09156A91958f5923C82860q3776L7269j46511K69394B29541L325J15009
13449C47875I4584O6169J19916r2685K07823a10717C09641j52814K4566J83622
13439C65015l8931l6958P7607j77206K99458i4671A95104J27446a7455D66031
13428B08097R0975A30194M69550j95608I1232B925J23389J45738R9709l9399h5910
13416B53157O7968A50388J44633J72596J9183k06401a0103A65920p8097K109L52416
13405D42348o3128j23081o2274J32699J26148k13092J46597f2817A33377J63201
$$ y = [277463, 340718, 343311, 144913, 298699, -25116, 382091, -60791, 500670, 459698, 289956, 406630, 239318, -51390, 178471, 159047, 111353, 312040, 46799, 580348, 11243, 409156, 191958, -65923, 382860, 299084, 336353, 189842, 459236, 229541, 232866, 347875, 94584, 160753, 280669, 187984, 395807, -110717, 309641, 156827, 181393, 365015, 326084, 289126, 366733, 189527, 488985, -94671, 195104, 322550, -17455, 466031, 208097, 299072, 130194, 599744, 404136, 91232, 2925, 126314, 272052, 371761, 332362, -85910, 253157, 321125, 150388, 295021, 467617, 486800, 280399, -10103, 165920, 87823, 89932, 442348, 379220, 256139, 193865, 326564, 452712, 239620, 386217, -62817, 133377, 296578]
13395B96578b16617C32859n4690a85387C98849B0494L11140n7153C8890K15424
13385B54314A24807K21204A58813R0437a33390D81315j06280q4507a5592B61671
13374B82991J77997a54832C01057m6057j2958A11995a55834C12985A41786J99287
13364C41073j12530J2315a09083C3276R9724J68627E7111J94302J85461m0673
13354C96201A59059M49982k45866K47206k10059A47729J2322L31146A80276l5679
13344A44597J56276L03467B52992K2499A10266n0518K66826N3717Q2546A44155
13333C36253A06672K59521A06017L42561I785J66859E7246K25157M1742k0988
13323C03157H0652L36644B03968E2341c02965C27145b43256B96553F3026a64753
$$ y = [296578, -216617, 332859, 278169, -185387, 398849, 20494, 331634, 274481, 38890, 254314, 124807, 346011, 158813, 249250, -133390, 481315, 375035, 290528, -15592, 261671, 282991, 460988, -154832, 301057, 255000, 242042, 111995, -155834, 312985, 141786, 341073, 228543, 240858, -109083, 33276, 133000, 301627, 57111, 251413, 436874, 396201, 159059, 609041, 363175, 610381, 400322, 147729, 160051, 491197, 180276, 144597, 300873, 604340, 252992, 275491, 110266, 59748, 326574, 380291, 462837, 144155, 336253, 106672, 366193, 106017, 448578, 9785, 176644, 57246, 282403, 324145, 303157, 80652, 417296, 203968, 52341, -302965, 327145, -243256, 296553, 63026, -164753]
13312B63000J12774A40360J48116K76661p8553A94061K28202A86902n4411O4052
13302A96543k1405F8191a2678C02624j43299Q296c8412B86555J21986A32091J50977
13291B83068J69791A54638b4100D0408K20017b788C08246A39399K06765l8713
13281C07451A20623O7507i0155j91206B3330K24852m4679P0317K60451A10443
13270c8204B18813K50605j19923I6269J5560K88369f0547B75809f3842j86443
13260b50285B07031P9188A8486K7451L29927J13335r7447b56413I5793L16187
13250D11980H5103R9320J26966J31945B06311Q1460h1915K6917j04503C82118
13239a98127I2822J88362p3443I7402k0528B0789M0498O5602h0815B55908A12827
$$ y = [263000, 375774, 140360, 288476, 565137, 486584, 194061, 422263, 186902, 132491, 196543, 175138, 68191, -12678, 302624, 159325, 167621, -38412, 286555, 408541, 132091, 283068, 452859, 154638, -24100, 40408, 260425, -2788, 308246, 139399, 346164, 307451, 120623, 188130, -90155, -281361, 23330, 248182, 203503, 273820, 534271, 110443, -38204, 218813, 469418, 349495, 96269, 111829, 400198, -60547, 275809, -63842, -250285, 207031, 286219, 18486, 45937, 375864, 489199, 391752, -256413, 95793, 411980, 85103, 184423, 311389, 443334, 206311, 287771, -81915, -54998, -159501, 382118, -198127, 92822, 281184, 207741, 97402, 76874, 20789, 61287, 126889, -80815, 255908, 112827]
13227C88815f9187B20550I2651M3995Q6801h8908A27812E1323c977j32732m4423
13216a81132A53260J18804b4825o900F5871f3222A33894J87694J39163o0336n062
13205C95353a4493B04089C1261J12053B7843R2406d8150D81745g181m9282B33013
13193b2452E90490a7948A28529k2510K75763j28857J01260A8746a00831C3392
13182D328a07347A48498O7378a12660A04543J61547a04451A98588B4194J75889
13172B00083K4771B3185K40784h430B08221p3381i4335B0736L32258e9187K6789
13161c2398B01633N7824a2429j18174E6617K02640J14960b16434R9494A41849
13150D4868O2745c55019A19020l7784e0367k65400D2936J84079L63359d8034A52580
$$ y = [388815, -69187, 220550, 92651, 136646, 223447, -88908, 127812, 51323, -3977, -136709, -181132, 153260, 272064, -24825, -31725, 65871, -63222, 133894, 321588, 460751, 400415, 395353, -14493, 204089, 31261, 143314, 27843, 120249, -48150, 481745, -7181, -56463, 233013, -22452, 590490, -17948, 128529, 106019, 381782, 252925, 354185, 18746, -100831, 33392, 4328, -107347, 148498, 215876, -112660, 104543, 266090, -104451, 198588, 24194, 200083, 224854, 23185, 263969, -8430, 208221, 134840, -94335, 20736, 352994, -59187, -32398, 201633, 259457, -12429, -130603, 56617, 259257, 374217, -216434, -116940, 141849, 44868, 107613, -355019, 119020, 81236, -50367, -315767, 42936, 227015, 590374, -48034, 152580]
13138B51563J36851k7276c7772j58858N5583a3363j64981j2961c5062H848L56043
13127C64891E5933N7816a9164D06133M1617d2683j89426B49232d13028C74794
13116G3503K1024a58174k4169g7357k8165r6940H8286J4531d644j69806A17852
13104B46578B9490K76893b02041A94602a23378B6606O8454C0478c02577J45498
13094a57079C76650b51629A26322K7483a27774A87703C6724L14194j65593f4913
13083B39295k5971i0770G9713J4249K26888q9593h8963C62314j67536b8919m5934
13072g4853A53430L9339H0711B1624J07703R5640a09902m4385d4720B85708e4209
13060A18664h0179C55252A64906M5735J2446A0333I19K72087j9214a40718B51201
$$ y = [251563, 388414, 361138, -37772, -196630, -141047, -13363, -178344, -191305, -35062, 8848, 364891, 55933, 113749, -19164, 406133, 447750, -42683, -232109, 249232, -413028, 374794, 73503, 94527, -158174, -182343, -77357, -105522, -202462, 88286, 102817, -4644, -174450, 117852, 246578, 29490, 306383, -202041, 194602, -123378, 26606, 95060, 30478, -302577, -157079, 376650, -251629, 126322, 153805, -127774, 187703, 36724, 350918, 185325, -64913, 239295, 213324, -90770, 79713, 93962, 320850, 231257, -88963, 362314, 194778, -28919, -74853, 153430, 192769, 80711, 21624, 129327, 224967, -109902, -154287, -44720, 285708, -54209, 118664, -80179, 355252, 164906, 210641, 223087, 10333, 919, 273006, 253792, -140718, 251201]
13048C11524j11340G1264N5736P0301F4827N0843b04626C39147M7564A42449B7997
13036B60754j24374J8078c5563m2430B81023l2094b0332A59257F1225J31198b6519
13024C43888l5174Q7262A70166l3703J67325A16146B4814L28290g9085L3752k38488
13013b83821a02296j03943A93356f4096D14584j09914j7011I0296a65890d1240
13002a35670E25151e9469B65972G9325a22724C31232j46064l0619D1467J98460
12992B39927b10844C64826D3191J23448l510J73907A03587b09278D92513I4760
12981E6915N0764J11850h6897A1857J24609b0808j57482B30788D1943J63253P9918
12970B85114a12652A20220D1751J4884k418B3992b26753d605j44222l2212A72561
$$ y = [311524, 200184, 71264, 127000, 197301, 64827, 115670, -204626, 339147, 386711, 142449, 27997, 260754, 136380, 154458, -35563, -77993, 281023, 248929, -20332, 159257, 61225, 192423, -26519, 343888, 308714, 395976, 170166, 136463, 303788, 116146, 24814, 353104, -79085, -45333, -283821, -102296, -206239, 193356, -64096, 414584, 304670, 287659, 90296, -165890, -41240, -135670, 525151, -59469, 265972, 79325, -122724, 331232, 185168, 154549, 41467, 239927, -210844, 364826, 43191, 166639, 163129, 337036, 103587, -209278, 492513, 94760, 56915, 107679, 219529, -86897, 11857, 136466, -20808, -178290, 230788, 41943, 205196, 285114, -112652, 120220, 41751, 56635, 54217, 23992, -226753, -4605, -148827, -181039, 172561]
12958i777B06083o8276N9145a13567G8875C5333b14158B11074K12556B03191h8336
12946A89723o9507J43787A03204a57144k6320C933R461M4397J44561D6618e5503
12934c1527B09868r0104B5981J32938o6391K36176c17761B46267j07982m5970
12924I2315J99475A10907a540H2177J73794b84815d3747A25163r528C5560K39849
12913B75409A08965a86160j10404B99661d3823A19134e5064q5917b3539A57698
12902C59947b65106h4506j55184H7041i479H7891a07102C04000E0722K5442K99458
12891C75622a75823B5476K24847A6804K09102I3525J13578F119i8883m0680N9580
12880g9983C94532b0933j95512C18640j39829a40002A56005O4523k9605a90085
$$ y = [-9777, 206083, 137807, 196952, -113567, 78875, 35333, -214158, 211074, 423630, 203191, -88336, 189723, 120216, 264003, 103204, -157144, -183464, 3933, 13394, 57791, 202352, 46618, -55503, -31527, 209868, 119764, 25981, 158919, 92528, 328704, -317761, 246267, 138285, 92315, 291790, 110907, -1540, 82177, 255971, -284815, -43747, 125163, 115635, 35560, 275409, 108965, -186160, -296564, 299661, -43823, 119134, -55064, -140981, -23539, 157698, 359947, -265106, -84506, -239690, 87041, -9479, 87891, -107102, 304000, 50722, 76164, 375622, -175823, 25476, 250323, 16804, 225906, 93525, 207103, 6119, -98883, -139563, -79983, 394532, -20933, -216445, 318640, 178811, -140002, 156005, 220528, 190923, -190085]
12869a03840B43536b51821b1870B25928j03424J62623a98584D6207J24209o2653
12859A07763i7963j37154b259B40748a53630B2512J7814J7554b0452B37280L59084
12848E96364A81679D0947k654K08049a82912D09065f0005p5627A1023l880c8304
12836C0016b6045o7486A39799k4343J08583N0292g8980A80296f2362J3441B12879
12824A30868A2827K3593e903j72842A07189a36647N3523A06632P9892J12981a21538
12812a93523P7555b3236A15960g1444A46989Q9925E2134a00237M3676I0650C8004
12800A40c18495a24213C37093c372B46860J1294J13627j12271A16995m9966a9533
12788C66956A67780g2983B8867a3090q2897H4668D230O7928a63622B32831n7884
$$ y = [-103840, 243536, -251821, -21870, 225928, 122504, 285127, -198584, 46207, 170416, 107763, -97963, -235117, -2259, 240748, -153630, 22512, 40326, 57880, -20452, 237280, 596364, 181679, 40947, 38293, 246342, -182912, 409065, -60005, -135632, 11023, 7143, -38304, 30016, -26045, -93531, 139799, 115456, 224039, 274331, -78980, 180296, -62362, -48921, 212879, 130868, 12827, 36420, -5903, -178745, 107189, -136647, -83124, 106632, 186524, 299505, -121538, -193523, -115968, -23236, 115960, -71444, 146989, 236914, 52134, -100237, -56561, 90650, 38004, 140, -318495, -124213, 337093, -3372, 246860, 258154, 371781, 259510, 116995, 67029, -19533, 366956, 167780, -72983, 28867, -13090, -95987, 84668, 4230, 72158, -163622, 232831, 174947]
12777A74947O0372H2267a94680I4662R6268a93840p6809D1694J37237b7206C40460
12765b45598P6521C1766a92322p8661A72564b66499a3460A09546P0354b86412
12754F5162J11410b38830A2697b24279B34306o0838l9832c14913A0745O8208a9606
12742b30745H4454b49861C72618E6771J4316K14735p1157a49240d0173A24595
12731A71107K83311A24830a6529H4162m302d0675A30773N9357B7016J62084G0459
12719A46505O7107Q2422e8334p5319L8982j6430G6638M5161k4868a53389A17437
12707F2862L00863A46771j9592a41891A56813b9978A18882C6773J3036a22786
12696C2113a13583A42361c18699b7070A8793K3672a6682H7976L6619a54854B76391
$$ y = [174947, 235319, 82267, -194680, 94662, 190930, -193840, -270649, 41694, 178931, -27206, 340460, -245598, -169077, 31766, -192322, -270983, 172564, -266499, -13460, 109546, 179900, -286412, 65162, 176572, -238830, 12697, -224279, 234306, 173468, 133636, -314913, 10745, 78953, -19606, -230745, 84454, -249861, 372618, 56771, 71087, 285822, 214665, -149240, -40173, 124595, 171107, 454418, 124830, -16529, 84162, 79860, -40675, 130773, 190130, 27016, 189100, 70459, 146505, 213612, 296034, -58334, -133653, -94671, -111101, 76638, 121799, 96931, -153389, 117437, 62862, 363725, 146771, 127179, -141891, 156813, -29978, 118882, 36773, 49809, -122786, 32113, -113583, 142361, -318699, -27070, 18793, 42465, -16682, 87976, 124595, -154854, 276391]
12684a77151F8404k3660i3020j21388R1938d2532n1168D35652f8660B58690c04666
12672A02232o670a1314I0546J63200m7312B9948N6959P8426g2817A44812L5584
12661A80396k573j7456R4590M4309j14368q6951a30124B54434j04353L0264p1475
12650A08870a42816A22991n8691a54568f9017E9060g766E6203O3320J95440r2849
12639B22114c29490F1363O8903a8551A53615n1157J76595I7619B3420J09660L8392
12628A71472K1365j4675K04911a8363A54267l5855B0324a19809A91785j2008A5345
12616C3938J15151k921k2840C4017K90313A38984J73048E9544R6629E9894J40992
12605B00886b7085A06209J553D0439J07169m210a24205b7136A07438e5767C1175
$$ y = [-177151, 68404, 44744, -93020, -214408, -122470, -42532, -93700, 435652, -68660, 258690, -304666, 102232, 95562, -11314, 90546, 253746, 206434, 29948, 86907, 165333, -72817, 144812, 180396, 177823, 160367, 254957, 299266, 184898, 97947, -130124, 254434, 150081, 180345, 108870, -142816, 122991, 64300, -154568, -69017, 59060, -7766, 56203, 119523, 314963, 222114, -329490, 61363, 130266, -18551, 153615, 102458, 279053, 97619, 23420, 133080, 171472, 192837, 178162, 383073, -18363, 154267, 118412, 20324, -119809, 191785, 179777, 15345, 33938, 149089, 146168, 123328, 34017, 324330, 138984, 312032, 59544, 156173, 59894, 200886, -27085, 106209, 107762, 40439, 147608, 143398, -124205, -27136, 107438, -55767, 31175]
12593E1244J85627a14644A40107J38405q249j6492j14571J8107J8821M1814q1940
12582A36002k6528g8006E6300J87297a16977D2797L28907j32591a12995E3415
12571b13376A02728K95214c75701C73004C1439K55248c4722j31771d2148l5299
12561g7447A33895J06984j1580b30176B95654j44847o8372J17473k7031O2789
12551B35666b7587B97934F4022b28078A53710e9675A35931f7760a5587k08905
12541b24492e9217a4252k6852e647A35836B6157O05432A35872n2830l7659J52937
12530A98320d7533q7851B0587K26127b27402b7391k72143A29125e2298C04948
12519b04268B8518C728a14940F2227i9758M5348H9234a91704B41910I2301K46666
$$ y = [51244, 236871, -114644, 140107, 278512, 270263, 253771, 139200, 157307, 176128, 217942, 136002, 109474, -78006, 56300, 243597, -116977, 42797, 371704, 239113, -112995, 53415, -213376, 102728, 397942, -375701, 373004, 31439, 286687, -34722, -166493, -42148, -77447, 133895, 240879, 229299, -230176, 295654, 150807, 82435, 199908, 172877, 235666, -27587, 297934, 64022, -228078, 153710, -59675, 135931, -67760, -15587, -224492, -59217, -14252, -41104, -5647, 135836, 26157, 631589, 135872, 83042, 45383, 198320, -47533, -135384, 20587, 246714, -227402, -27391, -299534, 129125, -52298, 304948, -204268, 28518, 3728, -114940, 62227, -99758, -54410, 89234, -191704, 241910, 92301, 338967]
12508C38967R8250b5371A94271r4049c1971k827E8803p810J17964q2983L39967
12497D25941I3032N789a05850A31394n0657c64130A44835b76476C88297b08461
12486h6121A22146A0648P2734L22045e637A8593o24J7790Q4094i0961I2524m562
12474H7962K2725b26075A3801g8818j93803A16026J81872a34390A60008p3504
12464H6504a65452B19394C4022J52356b15408A30284b41668G3173C061M9493a41573
12452D11946J06050E1843J00669c7884r7680A0515a99667A17052r172a43620h198
12440A14368c34456F3135L9836i7435d3390j63843C0654K0844d3783l6158k9467
12429a09408E9374Q5543K07273f2896A653c2475C24170j44728f8168A91867a22755
$$ y = [338967, 437217, -25371, 194271, 100222, -31971, -34798, 58803, 50993, 168957, 85974, 425941, 93032, 98821, -105850, 131394, 80737, -364130, 144835, -276476, 388297, -208461, -86121, 122146, 10648, 83382, 405427, -5637, 18593, 17969, 35759, 119853, -90961, 92524, 87962, 110687, -226075, 13801, -78818, -272621, 116026, 297898, -134390, 160008, 86504, -165452, 219394, 34022, 186378, -215408, 130284, -241668, 73173, 3061, 52554, -141573, 411946, 517996, 51843, 152512, -37884, -135564, 10515, -199667, 117052, 107880, -143620, -8198, 114368, -334456, 63135, 102971, -97435, -43390, -207233, 30654, 51498, -43783, -79941, -109408, 59374, 144917, 352190, -62896, 1653, -32475, 324170, 179442, -68168, 191867, -122755]
12417b41434I4254L7349n587g7835C75022g0425j8837k14593I9605a61820C48582
12405a85429e063B00700n9335b7802l31318B57794D8844b58882B8433f0215K396
12394e7819A63729C8912b68787A89038E7166d7682q130A51705a36978f6299M61
12383f5838R40I9566a52659B6154L39322j47037H6793a90972r3956A04002f5463
12371a17272B40534h5036o3370a5604j41325b7257A36696a13301C2642G195M2849
12360E0044i7221J7080r1423k718B49124d6469m7428A48631i5334D36637b7219
12348b21145L3640E1746K65697a30284e6788o7311j34192a11310A49592E2302
12337b17905A95232a80496D4151h3400B06310q1362a81618D4197a08451c6439
$$ y = [-241434, 94254, 131603, 126016, -77835, 375022, -70425, -89262, -303855, 99605, -161820, 348582, -185429, -5063, 200700, 141365, -27802, -359120, 257794, 48844, -258882, 28433, -60215, -57819, 163729, 38912, -268787, 189038, 57166, -47682, -55812, 151705, -136978, -66299, -65838, -64898, 99566, -152659, 26154, 365476, 218439, 86793, -190972, -284928, 104002, -65463, -117272, 240534, -85036, -148406, -15604, -156929, -27257, 136696, -113301, 32642, 7195, 50044, -97221, -80141, -171564, -174282, 249124, -46469, -93897, 148631, -95334, 436637, -27219, -221145, -187505, 51746, 317443, -130284, -56788, -124099, -258291, -111310, 149592, 52302, -217905, 195232, -180496, 44151, -83400, 206310, 124948, -181618, 44197, -108451, -36439]
12326C5427d3270j8540r9013A3036L056i9575C16907a0252C25450H2468B1637
12314C01572p3833L2318a44118N5013D7666O5411c29014A27968h5540K1731A99370
12302A8691K4858a60057N7751K981j05333R6898N0855C58J7630L63829B1351J70747
12290A92098h0891I8806C0583K24123G3828K4482O5941a57853A08638b88251E6932
12278A09585K87685A34836K38022b25198B33119K9609E1796L0422L02113a90012
12267a71324A7540J09043f7163F6339P6944R4195j03703K17980j50773B4967c9099
12255a75409D28094I0936a01511A89804a00367b6224B96576D722J48939J15182
12245B68843E5900L49090b99933I0223J89979b27304M1362b8625k14692h6608
$$ y = [35427, -43270, -61810, -160823, 13036, 16092, -99575, 316907, -10252, 325450, 82468, 21637, 301572, 227739, 260057, -144118, -89105, 47666, 113077, -329014, 127968, -85540, -63809, 199370, 18691, 43549, -160057, -102306, -99325, -204658, -107760, -56905, 358, 17988, 381817, 21351, 192098, -80891, 98806, 30583, 254706, 73828, 98310, 164251, -157853, 108638, -288251, 56932, 109585, 397270, 134836, 372858, -225198, 233119, 262728, 51796, 82218, 384331, -190012, -171324, 17540, 126583, -67163, 66339, 143283, 237478, 133775, 351755, 200982, 24967, -39099, -175409, 428094, 90936, -101511, 189804, -100367, -26224, 296576, 4722, 153661, 268843, 55900, 404990, -299933, 90223, 280202, -227304, -185942, -28625, -243317, -86608]
12234A22731p637O3551F6075K02848i1592B71806j04245K34188a38055j70667
12224c08722D02388k8664A04858J81127m2190j16622n091B3791J54888j9057J46202
12213C05824j8699A6666J91739L1497p8243J27433a52841L2353A83283J52076
12203C35359j62151n9900j0778M81565B55778a26874C30856C1284f9216G9373
12192C47187I4123L27019A56145E191a26573E5272P8646K31659C7558L01425D5907
12180D62877q8250A04554B3540a31289A76426g2701a0934C73649i4740C43158
12169B63391C5382O2287L5807J17239E9012M5575i4608j31895E3428b09113B9168
12157A89065B3172J23296n0750m874a74559j41806R2385A04711K90113h3738n4036
$$ y = [122731, 115094, 178645, 66075, 268923, -91592, 271806, 167561, 401749, -138055, -308722, 402388, 373724, 104858, 285985, 243795, 127173, 122082, 23791, 178679, 159622, 305824, 287125, 16666, 208405, 239902, 161659, 289092, -152841, -120488, 183283, 335359, 173208, 113308, 102530, 584095, 255778, -126874, 330856, 31284, -69216, 79373, 347187, 94123, 421142, 156145, 5191, -126573, 55272, 133918, 365577, 37558, 338983, 45907, 462877, 374627, 104554, 23540, -131289, 176426, -72701, -10934, 373649, -94740, 343158, 263391, 35382, 97669, 133476, 250715, 59012, 104587, -94608, -226503, 53428, -209113, 29168, 189065, 23172, 146468, 95718, 90844, -174559, -316365, -223980, 104711, 394824, -83738, -137774]
12146a37774D11941G3800a65113A65535e762k27396a04784B69780a74628f5907
12135B467c9009A08957c03616C6248j0609p642J56070k85a47543A09400c8214
12123A55246o5015N2793D8580K7185b40380H2312R4401C8074A2883K25723J36680
12112C75286d0286R085B36035H124L47430a49238C2312d10195J88132A0050b7862
12100H0475J44941b1306A41451B2570a08652B63172b0886k03647D29291d4831
12089A55916J92774a40313A04615b77408g5160A02657l4835a71464A18396g4090
12078b01640g8984j62858O3295c9888C5280K15568E2493g1557E3052a74480c1025
12066B73698f3446G5656M7970a04205b0329A82642J60260L01807L21752m289D35954
$$ y = [-137774, 411941, 73800, -165113, 165535, -5762, -233158, -104784, 269780, -174628, -65907, 2467, -39009, 108957, -303616, 36248, 25639, 17997, 174067, 173782, -147543, 109400, -38214, 155246, 90231, 143024, 48580, 75765, -240380, 82312, 176713, 38074, 12883, 238606, 375286, -40286, -31201, 236035, 8124, 355554, -149238, 32312, -410195, -222063, 10050, -27862, 80475, 225416, -21306, 141451, 22570, -108652, 263172, -20886, -224533, 429291, -44831, 155916, 348690, -140313, 104615, -277408, -75160, 102657, 67822, -171464, 118396, -74090, -201640, -78984, -241842, -178547, -39888, 35280, 250848, 52493, -71557, 53052, -174480, -31025, 273698, -63446, 75656, 123626, -104205, -20329, 182642, 342902, 644709, 966461, 962172, 435954]
12054D0810J18785p1359K70931j19488C515J88903D2820a68117B30695h6658A86613
12042b81413f9435J7404A69669h8172c9883j47148b9297h195A11846P0820L5337
12031B18003B3774a48552A02669J00159o1042b7185j87293Q4495j1634A42658
12020B26095F1278A9154l078J93219I4443n311a94673c1770j56820R1828k2987
12009a19749L7125o4474j60031F292a52923M0607B97339j3933a02972j04371c7523
11997h5290i874l17775c7838r7393O6078B1579b00843Q8608n7407f1667H4966
11985A17994b87154I3165a0193r0301m8010C75013g2733k40258E8928b0239l43937
11974c64176h7636B5224M8426J43846q9017R2586n1652d5738k6951C7119b09402
$$ y = [40810, 159595, 88236, 359167, 239679, 3515, 192418, 42820, -168117, 230695, -86658, 186613, -281413, -69435, -52031, 169669, -88172, -39883, -187031, -29297, -8195, 111846, 182666, 218003, 23774, -148552, 102669, 202828, 141786, -27185, -214478, -129983, -141617, 142658, 226095, 61278, 19154, 16076, 209295, 94443, 89132, -194673, -31770, -188590, -96762, -119749, -82624, -147098, -307129, 6292, -152923, -112316, 297339, 283406, -102972, -207343, -37523, -85290, -9874, -327649, -37838, -135231, -69153, 21579, -200843, -112235, -169642, -61667, 84966, 117994, -287154, 93165, -10193, -100494, -148504, 375013, -72733, -312991, 58928, -20239, -364176, -87636, 25224, 73650, 217496, 128479, 221065, 169413, -45738, -72689, 37119, -209402]
11962C10675b31574M12c1912j66044D1911d1402n588B32427c10584a54457f8434
11950a73775D2389J14846b40576C852a36642c8203E1146J04022k7564c06491a5142
11938f9999j99522Q0997d5584j13823A04892c3481D0514b33512A28617a20297
11927D35757k02567H287L55578b08566B10648a48134k7789D9733J97157b92163
11916g2515j38655j52748A06609k1265J37331O6313A32252C9714a04028j80557
11906b84585C00443l4354a73304A34621l2859k6386h0845B8255L1312i755j34142
11895a43897b9646B60554c4343J1242B33233a83105c3779j7340B89125G3277b1661
11883a91219j64702a9942k50017J22134o372C72887a76541P6447A80499a28866
$$ y = [310675, -231574, -231162, -31912, -197956, 41911, -41402, -46990, 232427, -310584, -154457, -68434, -173775, 42389, 157235, -240576, 3852, -136642, -38203, 51146, 155168, 127604, -306491, -15142, -69999, -269521, -188524, -45584, -159407, 104892, -33481, 40514, -233512, 128617, -120297, 435757, 233190, 8287, 363865, -208566, 210648, -148134, -175923, 49733, 246890, -292163, -72515, -211170, -363918, 106609, 85344, 222675, 288988, 132252, 39714, -104028, -284585, 300443, 266089, -173304, 134621, 101762, 75376, -80845, 28255, 59567, -9755, -143897, -29646, 260554, -34343, -23101, 233233, -183105, -33779, -51119, 289125, 73277, -21661, -191219, -355921, -19942, -269959, -147825, -154197, 372887, -176541, -100094, 180499, -128866]
11872B78267e3137a1263j26476f8817j69737a12007B58800K3519A12382E0667
11861d42170K5430a2749l4493B38800j02948l1841i1455p8377j25652c4118k27096
11850b61214J11487D0691b46276P4975I3093L7814m0036a12530A4261d5169A40403
11838C9050c65917A90527a39697K5166E0630a83506h6866B43774O3454a31112
11827e2027j82337e7252B07894c27074a45036B12451f1916j36621i0919p541J0639
11816h7821n7139C64405j75645b06647M4462N285A15524g5818n6834A46104g7754
11804C33150a77000a3357A68871F6433e0266j44636j8037A98217B6638K82387
11794C09025H3344a16188J0543B77361d40494G9798J10481a47677I1447L7415
$$ y = [278267, -53137, -11263, -137739, -68817, -238554, -112007, 258800, 282319, 112382, 50667, -442170, -416740, -12749, -47242, 238800, 135852, 104011, -91455, -169832, -295484, -34118, -261214, -149727, 40691, -246276, -171301, 93093, 130907, 90871, -112530, 14261, -45169, 140403, 39050, -365917, 190527, -139697, -114531, 50630, -183506, -86866, 243774, 307228, -131112, -52027, -234364, -57252, 207894, -327074, -145036, 212451, -61916, -198537, -90919, -98460, -87821, -144960, 364405, 188760, -206647, -162185, -156900, 115524, -75818, -132652, 146104, -77754, 333150, -177000, -13357, 168871, 66433, -50266, -194902, -212939, 198217, 26638, 309025, 83344, -116188, -105645, 277361, -440494, 79798, 190279, -147677, 91447, 128862]
11784A28862b62244B05681a86385h5328a5226I6781b00390J3605B18283a1466
11773h281F3119J54502g4676j86805F2113i7225k60432J47300h4448L0149F3262
11761A28603n589b55639f4788a6418A09682D0753L6313O433j6606N9629C7128
11749I1410f3952r2566C42293a0709k42815J05493a5440j03896l4822B38295A9583
11737i7683m1243E7791a49668D46944F5369b97412B31759g430B64742e0620j37621
11726a88241K2835A25880A5817K2957e3248m0726C3337b4392I6893Q0791a80984
11714h7978M3171C45417H0895H013b14674A71699m7153a33564g763B33014b35482
11702b22125A22000c0987j89577I2054b79852c2767B40998r8979a98390k09655
$$ y = [128862, -262244, 205681, -186385, -85328, -15226, 96781, -200390, -186785, 218283, -11466, -8281, 63119, 217621, -74676, -261481, 62113, -97225, -357657, -210357, -84448, -54299, 63262, 128603, 123014, -255639, -64788, -16418, 109682, 40753, 77066, 83499, 66893, 126522, 37128, 91410, -63952, -156518, 342293, -10709, -253524, -148031, -15440, -119336, -154158, 238295, 19583, -97683, -138926, 57791, -149668, 446944, 65369, -297412, 231759, -7430, 264742, -50620, -188241, -165406, 125880, 15817, 38774, -53248, -93974, 33337, -24392, 96893, 177684, -180984, -87978, -44807, 345417, 80895, 8013, -214674, 171699, 124546, -133564, -7763, 233014, -235482, -222125, 122000, -30987, -220564, 92054, -279852, -32767, 240998, 142019, -198390, -408045]
11692d08045F8501J03619c4606B34228a85644O7002A32658L7210i0772A09582
11681A11180j534d1046a2662H8300c3079A09588b67636A07497L12018A85537B1764
11669B12886b51082g2255q3042e0507j30615B23809j01712b1047O615r2495A03837
11657F2140J94151p627o9576b20168R5356C26443A16698i3892A46709a72351H4489
11645e8472A39755h9465A71401b35278B55360C7469a82628B8843b0562M630A35160
11633A30699b70075B24183p6349A8284N4047a29520q6577d8464B57144b30531
11622e3716F7091J41498c85245B24138A8945R7870a36490L1421A59462C4807J18604
11611A53411a25421o2855k6357d2524A84303B6778a81831J9543E36656B3702d06893
$$ y = [-408045, 68501, 172120, -34606, 234228, -185644, -118642, 132658, 169868, -90772, 109582, 111180, 109646, -41046, -12662, 88300, -33079, 109588, -267636, 107497, 419515, 185537, 21764, 212886, -251082, -72255, -155297, -50507, -181122, 223809, 122097, -21047, -14432, -106927, 103837, 62140, 256291, 248664, 179088, -220168, -124812, 326443, 116698, -93892, 146709, -172351, 84489, -58472, 139755, -89465, 171401, -235278, 255360, 37469, -182628, 28843, -20562, -15932, 135160, 130699, -270075, 224183, 147834, 18284, 72331, -129520, -216097, -48464, 257144, -230531, -53716, 67091, 208589, -385245, 224138, 18945, 116815, -136490, -105069, 159462, 34807, 153411, -125421, -188276, -214633, -42524, 184303, 26778, -181831, -162288, 536656, 23702, -406893]
11599F6380L26591A16148P8717b27181L4189I8323a42245E2526h2142A16763C3947
11587A0258K64432E9568a02738A39686B2987J70961b26411f1294j23526f9306
11576b78157A40482J08749G2573b31935j91394A32276g0474H5941b91730A49222
11565h9417j08097A71869a78184b2207D45729A06669C0858O1476J20451a15704
11554a19310B10526r9699a86722a0048A53997a38966L6770F235i2590G4038Q070
11543H2108J80274D5551a03961e0117C75868j78679f0376K7641F7276K66405j02047
11532B31634b39789A19060n6085L65610a54618B42160b28914E0881K40257a02307
11521C2349a79509D30962b48063A10119J38031d7173j30500B9013R2593m9064
$$ y = [66380, 392971, 116148, 194865, -227181, -192992, 98323, -142245, 52526, -82142, 116763, 33947, 10258, 274690, 59568, -102738, 139686, 22987, 193948, -226411, -61294, -184820, -69306, -278157, 140482, 249231, 72573, -231935, -423329, 132276, -70474, 85941, -291730, 149222, -89417, -197514, 171869, -178184, -22207, 445729, 106669, 30858, 92334, 212785, -115704, -119310, 210526, 110827, -186722, -10048, 153997, -138966, -102196, 6235, -92590, 74038, 82108, 262382, 45551, -103961, -50117, 375868, 197189, -60376, -32735, 67276, 333681, 231634, -239789, 119060, 62975, 428585, -154618, 242160, -228914, 50881, 291138, -102307, 32349, -179509, 430962, -248063, 110119, 248150, -47173, -177673, 29013, 121606, 72542]
11511G2542b5882A44561b35570B90918K47754e7637A42939b8340j8549A19364
11500d7763C66182p0106H841J70275J27590o9026N8764J55575H0577a88201D61207
11488c6390A7597J34659b46817B30629R8409m3179n8792J42495A37222O5579r4316
11477A08485J97489E6355K5400P4541m6811m1730C062K73322C7850N1273K54382
11466C43505A0636a6260B51328e3606B33372J9254j14552A4424K59874a70626
11455E3170b51197O4937B3663N3944j6876R949J24147L1292J7906o3194n4005
11444A26826c96367a04209A86124a99488m1938B53941I0614L37367H5761b4878
11433A68522a16648D4726N58197a65292A68045C3537J83359E2216K39603a2108
$$ y = [72542, -25882, 144561, -235570, 290918, 538672, -57637, 142939, -28340, -46889, 119364, -47763, 366182, 296076, 8841, 179116, 306706, 237680, 296444, 452019, 80577, -188201, 461207, -36390, 17597, 152256, -246817, 230629, 329038, 285859, 227067, 369562, 137222, 202801, 108485, 305974, 56355, 81755, 156296, 109485, 67755, 3062, 276384, 37850, 89123, 343505, 10636, -16260, 251328, -53606, 233372, 252626, 138074, 14424, 274298, -170626, 53170, -251197, -186260, 23663, 77607, 60731, 70680, 194827, 226119, 244025, 180831, 126826, -396367, -104209, 186124, -199488, -241426, 253941, 90614, 427981, 85761, -24878, 168522, -116648, 44726, 602923, -165292, 168045, 33537, 216896, 52216, 291819, -12108]
11422a19159B04948a39602m0317g0148A72841K16876d407l873A04172D3173a52227
11410b87540Q7631e0162B02732a31896A99408L9614N8340A28024F1823a48528
11399A4890b37030B49416g8710B8810J11466a26515A1421a54910l5594l4924K8062
11388a97366B67654j33479e4684A28519c17196D5392K6690b25267C57202f1634
11377A29431h7939L3673r3948P3004k9774k13538a26007o0020m8767Q7302F3238
11365h0916J2122A53329b52463r8714A69222l1696J01209I9849N1624n1089d26692
11353b11709k3795h7581k26601d6600A607h1425b6734m12636a21641L7428A33139
11341A8976h10b32A9609K17314K40472A80618B3006J18101D9289b30956B11137
$$ y = [-119159, 204948, -139602, -179919, -70148, 172841, 389717, -4407, -8280, 104172, 43173, -152227, -287540, -199909, -50162, 202732, -131896, 199408, 239022, 297362, 128024, 61823, -148528, 14890, -237030, 249416, -78710, 28810, 140276, -126515, 11421, -154910, -190504, -225428, -197366, 267654, 134175, -54684, 128519, -317196, 45392, 72082, -225267, 357202, -61634, 129431, -87939, -54266, -148214, -75210, -104984, -318522, -126007, -186027, -234794, -147492, 63238, -80916, -68794, 153329, -252463, -351177, 169222, 137526, 238735, 99849, 151473, 100384, -426692, -211709, -235504, -87581, -314182, -46600, 1607, -81425, -26734, -439370, -121641, -84213, 133139, 18976, -810, -232, 19609, 236923, 477395, 180618, 23006, 141107, 49289, -230956, 211137]
11329b54335L5313c8924b146j31926d2148j8026p269n4291B2455a04079m23376
11318e27455e5864C42895D5130c59206H7284P4295E6384d1439G2080a3104B03538
11306A45949D8919b58490a05481A69335J5726a34542k33240h6970I5713a93439
11295H439a62118J213F672N4485h4916k44137J41511B29972b8052A72552g5440
11283a56174f928A71685a63881M3269N7755B3114J39165E8593M429n23A3564O0742
11271G4306l5401c22608D3747J84051a34726A56690b61609B0545L2314c10585
11260A18990A1967h6289a055j17932E3374a59719A9822e8646m8968j57001B5586
11248B40339f1847a6219C58801e0710q2799B3312a63905j85602a8568C0096J62068
$$ y = [-254335, -219022, -38924, -2146, -134072, -42148, -60174, -67443, -121734, 22455, -104079, -527455, -55864, 342895, 45130, -359206, 87284, 161579, 56384, -41439, 72080, -13104, 203538, 145949, 48919, -258490, -105481, 169335, 185061, -134542, -367782, -86970, 95713, -193439, 8439, -162118, -160905, 6672, 61157, -84916, -329053, -187542, 229972, -28052, 172552, -75440, -156174, -6928, 171685, -163881, -120612, -62857, 23114, 162279, 58593, 63022, 62499, 13564, 74306, 38905, -322608, 43747, 227798, -134726, 156690, -261609, 20545, 52859, -310585, 118990, 11967, -86289, -1055, -118987, 53374, -159719, 19822, -58646, -107614, -264615, 25586, 240339, -61847, -16219, 358801, -50710, -133509, 23312, -163905, -349507, -18568, 30096, 192164]
11237A92164b41744D3510b75127c7470j3545j21605B37491j7561h5732j18392
11227b04124C46244A56502b71734A86040D6948A0242a58438H2239a11579j78589
11217b90168E1461K81058A2795a48286o5447G946J17424g2732K887j36198F0011
11205b78623o4130F1266b51734b7666A03464L17285F6692Q1484C4520K1086B5405
11193c6074A26061B4115a55629A62215a98222J6956b6939E8325a22501A2284N6078
11182F8362b91186A25001d7290k13763M5594P7957J0636K2841A22521b09967P7505
11171a32462m0884k4092P8848A08697b370q3488L4830A26324a61024F0452J14534
11160A74986G6530f6694I854K9910a40463J561B19308P8902B3086e5424n7180
$$ y = [192164, -241744, 43510, -275127, -37470, -51015, -172620, 237491, 219930, -85732, -204124, 346244, 156502, -271734, 186040, 46948, 10242, -158438, 82239, -111579, -290168, 51461, 332519, 12795, -148286, -213733, 7946, 125370, -72732, -69845, -206043, 60011, -278623, -342753, 61266, -251734, -27666, 103464, 420749, 66692, 148176, 34520, 55606, 25405, -36074, 126061, 24115, -155629, 162215, -198222, -181266, -26939, 58325, -122501, 12284, 68362, -291186, 125001, -47290, -261053, -215459, -137502, -126866, -104025, 122521, -209967, -132462, -173346, -197438, -118590, 108697, -2370, -85858, -51028, 126324, -161024, 60452, 174986, 76530, -66694, 9854, 39764, -140463, -138902, 219308, 298210, 23086, -55424, -112604]
11149a12604F0470a41489A02507a32667I4381b41751P5504e9296B85956C4922
11138a07675M4536a5902C56096a49986f4752n6141F2660P3273J6094J18805e8646
11126a05179j58515A3462J59904n2839h1694j44123A40059L0196J31101L1235
11116C32591A13719M33274a94442R4690B0250L08132D6291J10099b45687H6511
11105e2821A40626h1314c0945B76393A36499M5557o6553J07500e7790B42753D2399
11093a4628C42346j24761O5477H932b4430I3000K20637p477J08651O8712k23770
11082B59753M4861J8927A42574K23306K00270A33308o0502K91378o1717Q1729
11072C84196j79164J76486m894A76038K09519J58648L23915H813L15587P3449
$$ y = [-112604, 60470, -141489, 102507, -132667, 94381, -241751, -166247, -59296, 285956, 34922, -107675, -63139, -15902, 356096, -149986, -64752, -120893, 62660, 135933, 152027, 270832, -58646, -105179, -263694, 13462, 173366, 120527, -81694, -225817, 140059, 170255, 301356, 332591, 113719, 546993, -194442, -99752, 20250, 328382, 46291, 156390, -245687, 86511, -52821, 140626, -81314, -30945, 276393, 136499, 182056, 115503, 223003, -57790, 242753, 42399, -14628, 342346, 217585, 283062, 8932, -24430, 93000, 313637, 306160, 414811, 483523, 259753, 304614, 323541, 142574, 365880, 566150, 133308, 72806, 364184, 302467, 384196, 205032, 381518, 376624, 176038, 385557, 544205, 868120, 8813, 324400, 397849]
11062C97849J93341k088p6035K53835G7414M59793l7402l1489j60441O42980j24501
11051H26354p665r7506Q7999l5971k53431K19009k7424L6737J17069l23584J97424
11040G39011k0892k16173J96660k06417K7302o0358N2458J66114j72963K73246
11030G77988n153k20743J72620k53583K01383j42002j77949L54668k31888J13979
11020E89320j45502L21536o4818J17579M9355m08315J56510k2524j92128M3254
11010D44267L54839l32690m8834j26875M20359l54241J82649K48116l01392N12933
11000I99131l82487J49711j77018O9816K3237K96510k47742B57782K61256K48217
10990G67255l48714M35801k43289q226P4038K77625r2547K3723J74327j0824k9749
$$ y = [397849, 591190, 589102, 513067, 766902, 77414, 537207, 499805, 468316, 307875, 950855, 826354, 818689, 721183, 809182, 773211, 519780, 738789, 711365, 748102, 865171, 541587, 739011, 718119, 501946, 698606, 492189, 519491, 459133, 511591, 677705, 504742, 777988, 772835, 552092, 724712, 471129, 672512, 530510, 352561, 707229, 475341, 589320, 443818, 765354, 700536, 818115, 867470, 459155, 615665, 593141, 401013, 444267, 799106, 466416, 417582, 290707, 711066, 356825, 539474, 787590, 486198, 999131, 616644, 766355, 589337, 659153, 682390, 978900, 731158, 257782, 519038, 767255, 418541, 854342, 611053, 602827, 676865, 954490, 861943, 885666, 1059993, 1049169, 1019420]
10979A019420q6876M69528L05522L13936l7782J50240L45707O6751J09977L4783
10969B691206l60717l729m02311R6601o67054J39892Q5402l84813k45459L24364
10959A273382k70224m8407N91292k59250m80837n0775j43298O2008j81426J84191
10949F76656k28381N5416g2612B07564m4126K20401j18388a9417L960j10078D571
10937A80832K47153a16819n3451J2241A64655e6392l01019I2347b8626l66527
10927c95153C4888a91182l2506D3171b76821Q3054B57702C8499b2675l6306B98361
10915a19182C838b06734A84949N4486h1689B7893J21613J13560a72234b9526A49800
10903b2234k20655B12125g940n2965A33789N3153j5381a33300C8118h3976A04882
$$ y = [1019420, 932544, 1402072, 1707594, 2021530, 1983748, 2133988, 2479695, 2546446, 2656423, 2691206, 2330489, 2326760, 1924449, 2021050, 1353996, 1493888, 1579290, 1194477, 949018, 1273382, 1003158, 954751, 1546043, 1286793, 805956, 755181, 611883, 673891, 492465, 676656, 448275, 503691, -72612, 207564, 163438, 383839, 265451, -19417, -15457, -125535, 4571, 180832, 427985, -116819, -170270, -158029, 164655, -56392, -357411, 92347, -28626, -395153, 34888, -191182, -223688, 43171, -276821, -193767, 257702, 38499, -22675, -58981, 298361, -119182, 3838, -206734, 184949, 239435, -81689, 27893, 149506, 263066, -172234, -29526, 149800, -22234, -242889, 212125, -7940, -60905, 133789, 186942, 171561, -133300, 38118, -83976, 104882]
10891A58207f8523n0328b8298B07699c4517m8673j92983A61962E6467g0528A85284
10879a19269j5628e0780q7445j93225A85412a45670j37351K6951L8418G9515b62815
10867c1032a4159k43156A43447c72055A47401a00715E3721b12930C07028B8061
10856C05213r0771L8990a68612D7313K24787C8418M20883A07343J83789j17599
10846A73533D4788J08937b87549b0316A18473K76539c81463A90691d08669H283
10835B33487J01918b69360B20176b31369l4679a1656j29905d4091j30817m1099
10825b16007P6596A77721R7034D1684c4398C78942F4926a62217j37095h2378A3416
10813a46356j14944A28892L5255E4164c8963r9610C38744a69529q8348r5601A10114
$$ y = [158207, -68523, -118851, -28298, 207699, -34517, -83190, -276173, 161962, 56467, -70528, 185284, -119269, -134897, -50780, -138225, -331450, 185412, -145670, -283021, -256070, -217652, 79515, -262815, -31032, -14159, -257315, 143447, -372055, 147401, -100715, 53721, -212930, 307028, 28061, 305213, 214442, 253432, -168612, 47313, 272100, 38418, 459301, 107343, 291132, 173533, 44788, 153725, -287549, -20316, 118473, 395012, -381463, 190691, -408669, 8283, 233487, 335405, -269360, 220176, -231369, -266048, -11656, -141561, -44091, -174908, -216007, -139411, 177721, 274755, 41684, -34398, 378942, 64926, -162217, -299312, -82378, 13416, -146356, -261300, 128892, 164147, 54164, -38963, -138573, 338744, -169529, -257877, -353478, 110114]
10801a03701j6572B6682c36658a26119K6246A03009R462E1744K8493a29946a1047
10789H8300L15154d03984E2372O9293a44578O8939o733j10649A05585L39429c94910
10777c86286R6233b5835B47256c99347J52466e0145C6759D637K88830a50404j03538
10766b53942i028j13701J9281I841a19274n1682P0941B88733b44009D0143B695
10754c08739A02177B6004a00955l8034B0414b81246I6607K81770a246k9461k65929
10743b96636A68102j8729g7129A02200J20518I7984b35120Q6520A05612g8608
10732b57401h0723C66243a39095m6700e333j33797e1437p0995j30450H5919a23420
10720A76056n8201b33668C17466a44437B87774c5006j80606a142A16858J30146
$$ y = [-103701, -120273, 26682, -336658, -126119, -99873, 103009, 112471, 51744, 80237, -129946, -11047, 88300, 403454, -403984, 52372, 121665, -144578, -75639, -82372, -193021, 105585, 445014, -394910, -386286, -290053, -25835, 247256, -399347, -246881, -50145, 36759, 4637, 293467, -150404, -253942, -9028, -122729, -103448, 9841, -119274, -170956, -100015, 288733, -244009, 40143, 2695, -308739, 102177, 26004, -100955, -138989, 20414, -281246, 96607, 378377, -1246, -30707, -296636, 168102, 149373, -77129, 102200, 222718, 97984, -235120, -148600, 105612, -78608, -257401, -80723, 366243, -139095, -185795, -5333, -139130, -51437, -122432, -252882, 85919, -123420, 176056, 117855, -233668, 317466, -144437, 287774, -35006, -215612, -1142, 116858, 247004]
10710B47004A09370c03293A35568a24935A83924b46088A30851J28276a36944d9134
10699A26565i1771A03006b55834H175a01727C30221a78693i845C409b46148e8636
10687A49292E0788J90453j6404c02608a06031k5518l6215a1521k77874g8130L3983
10676d4147m8078p9383A34907a16782C2739a98845A56999N6766b58779c7195D936
10664f7584A20015c24260C1824K6277b81344a04915C9242J05654l4809b06595
10653c8403F912J87619a82523C1217c78068b5411A30136a43217d6387B0065e7372
10641a45674B43746C3472C153J94634D3879d23827a96695L0369i596n11368a36267
10629B37400c64026N2577L2886K9143A17984B0549J92967c01728a27237A0455
$$ y = [247004, 109370, -303293, 135568, -124935, 183924, -246088, 130851, 259127, -136944, -49134, 126565, -91771, 103006, -255834, 8175, -101727, 330221, -178693, -9845, 3409, -246148, -58636, 149292, 50788, 241241, 224837, -302608, -106031, -131549, -167764, -11521, -289395, -78130, -44147, -92225, -171608, 134907, -116782, 32739, -198845, 156999, 213765, -258779, -37195, 4936, -67584, 120015, -324260, 31824, 58101, -281344, -104915, 39242, 144896, 110087, -206595, -38403, 6912, 194531, -182523, 31217, -378068, -25411, 130136, -143217, -46387, 20065, -57372, -145674, 243746, 33472, 3153, 197787, 43879, -423827, -196695, -166326, -9596, -520964, -136267, 237400, -364026, -311449, -278563, -249420, 117984, 20549, 213516, -301728, -127237, 10455]
10618E2632b05721A22891J4208d3745b1484B50829b54166B99258a32669o7619
10608b00288d569k4346B51686e3276k60591p063L632a0125B50143I1372c09508
10596b76397A55267D2766P8796f5664j20185q6548A3345Q3712c42542A26907d9964
10584a31676a7086l39219a63273j881j12592B87493a394l14522a45390l3978j55879
10573c35247B12968A04907m7324P9163n2884f5292C208N8276b34426A59208o0639
10562I8569b80797f9928n5838q6572j3172f4493C58323b38250A45415a82905O3262
10551a19643H5956g2625E9006b554j57906J2557f6628n5467I3512I531J95598
10540B05129F4345b09394h1233n7107H9920A0588b48754k1743a31057B18503b3235
$$ y = [52632, -205721, 122891, 137099, -43745, -21484, 250829, -254166, 299258, -132669, -200288, -4569, -28915, 251686, -53276, -313867, -320930, -317298, -10125, 250143, 91372, -309508, -276397, 155267, 42766, 121562, -65664, -185849, -272397, 13345, 97057, -342542, 126907, -49964, -131676, -17086, -356305, -163273, -165154, -277746, 287493, -1394, -315916, -145390, -179368, -335247, 212968, 104907, 57583, 136746, 83862, -65292, 3208, 61484, -234426, 159208, 98569, -280797, -69928, -125766, -212338, -225510, -64493, 358323, -238250, 145415, -182905, -119643, 85956, -72625, 59006, -2554, -160460, -147903, -66628, -122095, 93512, 9531, 205129, 64345, -209394, -81233, -138340, 89920, 10588, -248754, -270497, -131057, 218503, -23235]
10528A53300R5512a29315B14296a9629n6857l40043D1451h331k2345l0232C28153
10516D0302c357E3281O3171i9562I5282J22946q9576j0807B1393N4180b58189
10504h1318n294k10786a9052l23231a66011A75883C1146a24453M5836j19776L5728
10493a62665c8465A07031J32052a70145B1345e2424A06723J68923I483b33735
10482B54668A00743a67663e0670B81431L9656j54187K9675H5229D2314J03756
10472A46070J0891L8821J0952f376j2057k12095B06223k1783r224c17545a28958
10460f5998A15428d04003H7481L1144c14939g8584k05292O2870G5707J82068F9524
10448c26546e0237l0709c5817a0625A05753b33646A32374a53153c3928E1479b10597
$$ y = [153300, 248812, -129315, 214296, -19629, -76486, -416529, 41451, -8331, -30676, -60908, 328153, 40302, -3357, 53281, 116452, -99562, 95282, 218228, 128652, 117845, 21393, 75573, -258189, -81318, -86612, -297398, -19052, -342283, -166011, 175883, 31146, -124453, -78617, -198393, -162665, -38465, 107031, 239083, -170145, 21345, -52424, 106723, 275646, 9483, -233735, 254668, 100743, -167663, -50670, 281431, 321087, 166900, 196575, 85229, 42314, 146070, 156961, 195782, 206734, -6376, -18433, -230528, 206223, 184440, 175216, -317545, -128958, -65998, 115428, -404003, 87481, 118625, -314939, -78584, -283876, -221006, 75707, 257775, 69524, -326546, -50237, -80946, -35817, -10625, 105753, -233646, 132374, -153153, -33928, 51479, -210597]
10436I5526J3257b48139a21490A8598J29358c14641B02728l3646f2111j10846
10426a72957j4778B2916a46064D360K44373A17741D7534h4220q2893A30670c67690
10414E9935j8212J54625c09000a41105H4886c37j28645B15733D2914a54489M6229
10403a08260e1735A89003C6779e36229F6035b2079H0046a14079B24390a07248
10392D4353J52961l1764c15753A10260a30438K6995o776B8035L29636j44795O8045
10381B80921D2718J77247O3J91219j74749I4062R6723J59447j42699I0446M3937
10370A34383K16050L22502k71652j09347q9155K84019K3644N8280R9744C5984
10359A65016J23776A553N26708h4091A51740K60352A91117O47917m18418J48683
$$ y = [95526, 108783, -248139, -121490, 18598, 147956, -314641, 202728, 169082, -62111, -172957, -187735, 22916, -146064, 4360, 248733, 117741, 47534, -84220, -167113, 130670, -367690, 59935, 41723, 196348, -309000, -141105, 84886, -337, -128982, 215733, 42914, -154489, -108260, -51735, 189003, 36779, -536229, 66035, -22079, 80046, -114079, 224390, -107248, 44353, 197314, 165550, -315753, 110260, -130438, -103443, -110219, 28035, 357671, 212876, 280921, 42718, 219965, 220028, 411247, 236498, 94062, 190785, 350232, 207533, 90446, 134383, 350433, 672935, 401283, 291936, 202781, 486800, 510444, 568724, 668468, 35984, 165016, 288792, 1553, 528261, -84091, 151740, 412092, 191117, 839034, 420616, 569299]
10349E69299j84879A27025n5878K60516K26146A88125J66408a5084B29961r465
10339B20496Q1209R4308l0621j48236Q0319a11579B4317Q5760K46890k9501q6335
10328B41131E5130h8853C3796K67761p0522C4872K07863j18817L73946j41714
10318C56150e7925K6255D76199b16178E9097J5836k7967K21494j01615a56830
10307e6469l45745R2324a30355j01853A78949C5217a56183b372C17295b58583
10296A52618d8912o0576L5233j38503d061r9643A29887h0147B5404A2071K57766
10285B69837n5631j01613e2523A42626b39777e7218B5155J05019d783r5574k3283
10274a23640h013m4484E3075j6168J36399a31682B22152R2597b37388g9921B1887
$$ y = [569299, 384420, 127025, 71147, 331663, 557809, 188125, 354533, -15084, 229961, 220496, 301705, 396013, 365392, 217156, 297475, -111579, 24317, 110077, 356967, 327466, 241131, 55130, -88853, 33796, 301557, 231035, 34872, 242735, 123918, 497864, 356150, -57925, -31670, 476199, -216178, 59097, 74933, 46966, 268460, 166845, -156830, -56469, -402214, -309890, -130355, -232208, 178949, 35217, -156183, -2372, 317295, -258583, 152618, -48912, -109488, -74255, -212758, -4061, -103704, 129887, -80147, 25404, 12071, 269837, 214206, 112593, -52523, 142626, -239777, -57218, 25155, 130174, -4783, -100357, -123640, -8013, -52497, 53075, 36907, 173306, -131682, 222152, 314749, -237388, -79921, 21887]
10262I6190c9086H1420m0035c3405d425B12814r6259h9094p2547G0421b35664
10250D2929b0400B04429g0342C31155j52501a64893A10773b29746A8363g7411
10239g2698A73262b07532l0875N6991H4659c16631e4082p1888A00400a01336L8530
10228f2806E0173P5669c05644J44643p1366a7195m23129A71719c4761l56932B17842
10216b5993j10110C6004J34714B5087a33360j93704G4614J52144a18316i853F5697
10204C06890A13683A1575J61953C546a16460F5839b0952k0272o6612k6620d4393
10192a73193M7279n8766H7653c11199a01836b6689j22557F6429J48997e2805E0254
10180a87640j84573J07143A48840a59476e398k27048j90878a53818m1215o1851
$$ y = [96190, -39086, 81420, 41385, -33405, -4425, 212814, 116555, -89094, -161641, 70421, -235664, 42929, -20400, 204429, -70342, 331155, 178654, -164893, 110773, -229746, 18363, -77411, -72698, 173262, -207532, -238407, -181416, 84659, -316631, -54082, -125970, 100400, -101336, -62806, 50173, 125842, -305644, -161001, -232367, -17195, -440324, 171719, -34761, -391693, 217842, -25993, -136103, 36004, 170718, 25087, -133360, -327064, 74614, 226758, -118316, -9853, 65697, 306890, 113683, 11575, 173528, 3546, -116460, 65839, -20952, -41224, -107836, -134456, -44393, -173193, -125914, -184680, 87653, -311199, -101836, -26689, -149246, 66429, 215426, -52805, 50254, -187640, -372213, -265070, 148840, -159476, -5398, -232446, -423324, -153818, -195033, -256884]
10170b56884M4823j38369B17218b52484J15169L7126j50395B58160i4548A59213
10159e3679p2496O09j36230G6017J64490A02956a77453A68187E9865d9439I7273
10147b6525k3801j07775I0036b00688q5904A11537d1234J1913A2047E856N9404
10136F5260K98302L3223A30090K3566D1802a56282D480f9108K4687A29387a78262
10124b884k59637C1301J5523L5374J5885C0735d6304j84922C11794b47740r1485
10113c39225i4053A83190j6147p9176M2030i264d013A96046r8009a12365I536
10101d7551n0399k52397A5992f7650q4409l93502E6860K71910f6376F3408c7455
10089a16675j56653k1210j5816A40414b4635l9132J3682j04331B7260f3390H4655
$$ y = [-256884, -212061, -350430, 217218, -252484, -137315, -100189, -250584, 258160, -94548, 159213, -53679, -126175, -125566, -261796, 76017, 240507, 102956, -177453, 168187, 59865, -49439, 97273, -26525, -50326, -158101, 90036, -200688, -286592, 111537, -41234, -29321, 12047, 5856, 65260, 363562, 396785, 130090, 153656, 41802, -156282, 4480, -69108, -44421, 129387, -178262, -2884, -262521, 31301, 46824, 82198, 98083, 30735, -46304, -231226, 311794, -247740, -339225, -94053, 183190, 167043, 87867, 129897, -9264, -4013, 196046, 98037, -112365, 9536, -47551, -97950, -350347, 15992, -67650, -152059, -545561, 56860, 328770, -66376, 63408, -37455, -116675, -273328, -294538, -310354, 140414, -24635, -63767, -50085, -154416, 27260, -63390, 84655]
10077C7336i563C00760b4495B56292f0495a31k78479b5081B7537a66362H8810
10065C51549A49660f1504E3105h7113B31788E442J87626B6835b19980A51696a77484
10053h9088B6184A2064b53154B1702N0837a38991l20108f6178E0067d9298j51277
10042b00575n7877P8139O3487q4635b3513j98259G4296b19094b1900l1780k49108
10031c02788q6132E7649Q2848c4547l23110e6918j39323C85204G5027c1184p2540
10020a03724j51096I4128d32329A60672b19587o4931h5885L1473l47206J88698
10010b12920C23050F671a63222a1345j5798A17265d44836a59537B09319h0583
9999B05278G3692i5591k2235E50b7770p5781F2881a32965E3343B0721a87766A41735
$$ y = [37336, -9563, 300760, -24495, 256292, -60495, -131, -278610, -25081, 27537, -166362, 88810, 351549, 149660, -61504, 53105, -87113, 231788, 5442, 193068, 26835, -219980, 151696, -177484, -89088, 26184, 12064, -253154, 21702, 72539, -138991, -459099, -66178, 50067, -49298, -200575, -258452, -180313, -116826, -201461, -23513, -221772, 74296, -219094, -21900, -53680, -302788, -388920, 57649, 140497, -34547, -357657, -56918, -196241, 385204, 75027, -31184, -103724, -254820, 94128, -432329, 160672, -219587, -284518, -85885, -54412, -401618, -212920, 323050, 6671, -163222, -11345, -27143, 117265, -444836, -159537, 209319, -80583, 205278, 73692, -95591, -117826, 550, -27770, -103551, 62881, -132965, 53343, 20721, -187766, 141735]
9986A02664R9357d3848a5803D52155b72662Q7648g4116A35080a65102A77012c74303
9974b94536C77650H5634e18528c4653J5175k00301j01248a35064B9945J86820
9964B16765B5049b60858c291j54700j025k0485p2096B36084j9995b43679A2725
9952A99692i3698l5919r7610l951o2014f7969p9892B68114A14402D2798b95891
9940I2244b72666l8476E6315q310c62701g7083k44835l5982J00153d7969j51933
9929a99902D8195g8849k22437G0815d4390J8995A53560a10337k35040e0192A5608
9917a24196B61148a1997o9544G6165a00094j40767B7771J82085c8643o9135K0880
9906h6898E1547d4525k94820A31547b50787A99029D6007h6601a3725j66744B20524
$$ y = [102664, 202021, -43848, -15803, 452155, -272662, -185014, -74116, 135080, -165102, 177012, -374303, -294536, 377650, 85634, -518528, -34653, -19478, -219779, -321027, -135064, 29945, 216765, 25049, -260858, -3291, -157991, -159016, -179501, -251597, 236084, 216089, -243679, 12725, 199692, -93698, -129617, -227227, -231178, -293192, -67969, -147861, 268114, 114402, 42798, -295891, 92244, -272666, -311142, 56315, 48005, -362701, -77083, -321918, -357900, -257747, -47969, -199902, 48195, -78849, -301286, 70815, -44390, -25395, 153560, -110337, -345377, -50192, 15608, -124196, 261148, -11997, -81541, 76165, -100094, -240861, 27771, 209856, -38643, -107778, -86898, 51547, -44525, -339345, 131547, -250787, 199029, 46007, -86601, -13725, -180469, 220524]
9894a24242k11807C4056a98533A9242a40372j24283H7721l5138a21819a6917I3779
9882a58560B11079a15927B20872e8835l96842b12609H9831a90747B92474D8876
9871a76352h7119H8762a12952k72337a08539A62962h6l60805a31498I7605H087
9859b13491M5849Q2762k0400B16230b72594A29091a26286A47005d8915j56640
9849b05555R2038D7044J8100e3807A90297I782a46119L8139F3598a98615N4019
9838a44596r8817o1391F031f2551D3296c92528J41547K2672m2214R7767B52670
9826B59644d78218a07560B23829c36147i2590q9309q389A12906g4070A02708c93518
9814A8901Q5225a91386C41251a9032k6846j08302a6134k18093H0164J24227e1270
$$ y = [-124242, -336049, 34056, -198533, 19242, -140372, -264655, 87721, 52583, -121819, -16917, 93779, -158560, 211079, -115927, 220872, -58835, -455677, -212609, 89831, -190747, 292474, 48876, -176352, -87119, 88762, -112952, -385289, -108539, 162962, -86, -360891, -131498, 97605, 8087, -213491, -167642, -84880, -105280, 216230, -272594, 129091, -126286, 147005, -48915, -205555, -113517, 47044, 65144, -53807, 190297, 9782, -146119, -107980, 63598, -198615, -144596, -243413, -304804, 6031, -62551, 43296, -392528, -250981, -228309, -270523, -172756, 252670, 259644, -478218, -107560, 223829, -336147, -92590, -181899, -190288, 112906, -74070, 102708, -393518, 18901, 104126, -191386, 341251, -19032, -45878, -154180, -16134, -234227, 80164, 204391, -51270]
9802a35755A22604F0256a37771c8151A7275a12790k33251J52490e1306a4664B21566
9790a23665F9724a29098a4345k58895B7839i7111P265L1071B44810a31401A06768
9778a44186B53559c59120a58602k3817b2523k25007E0609b28867E8307a69871
9767A67778h6150B9101c03193l28505e1912l2175j29504B1457L9441C570J55724
9756A59294a05240A67131Q4615A6532J68585a82857A29497b63222d9751A88588
9745a87547A14419a3318k3363n04138a8504k08613d0233p4068k2588k11466B68132
9733a67174D2612L6966d22944a48018J9124b4139j42845A4860e089j70872A03958
9721D1990a03243B6036e1556k49051B6539c03613A81187b96375C38875i3976m6120
$$ y = [-135755, 122604, 60256, -137771, -38151, 17275, -112790, -346041, -193551, -51306, -14664, 221566, -123665, 69724, -129098, -14345, -273240, 27839, -97111, -89846, -58775, 244810, -131401, 106768, -144186, 253559, -359120, -158602, -182419, -22523, -247530, 50609, -228867, 58307, -169871, 167778, -86150, 29101, -303193, -631698, -51912, -84087, -213591, 21457, 60898, 3570, 159294, -105240, 167131, 251746, 16532, 185117, -182857, 129497, -263222, -49751, 188588, -187547, 114419, -13318, -36681, -540819, -18504, -227117, -40233, -114301, -136889, -348355, 268132, -167174, 42612, 79578, -422944, -148018, -128894, -24139, -166984, 14860, -5089, -175961, 103958, 41990, -103243, 26036, -51556, -300607, 26539, -303613, 181187, -296375, 338875, -93976, -140096]
9710a40096H7996c23215a07911C51469H8916B7374a46667k41637C9993a25554
9699A93577H3295c07571Q5519O22m3398A04718j5693d25170K04648A01088R670
9688A10758J6151c94703B5255N6177R691g4747j96311a7481j50695j91636a46142
9676D20003G5505k1186d86727C4982a10467j70558f6819k66407h9210m1446j68103
9665b98759C2177h7930J8217l28724F4931a19042c7817H4717l0475a38379B25844
9653b29782B81160b48911A21889k4364L064B1048b60579B8800K07180b60098A02793
9641A67562m7944D7172b07426K5831C5888J63982E0517a39386C3808Q3653d06468
9629c53258a3617A4787i04r5400k71417A70813m354C3121q691b25431M331G640
$$ y = [-140096, 87996, -323215, -107911, 351469, 88916, 27374, -146667, -388304, 39993, -125554, 193577, 83295, -307571, -222052, -221430, -264828, 104718, 89025, -425170, -220522, 101088, 110758, 126909, -394703, 25255, 81432, 91123, -74747, -271058, -17481, -168176, -359812, -146142, 420003, 75505, 54319, -486727, 34982, -110467, -281025, -66819, -333226, -89210, -130656, -298759, 32177, -87930, -69713, -398437, 64931, -119042, -37817, 84717, 54242, -138379, 225844, -229782, 281160, -248911, 121889, 97525, 100589, 21048, -260579, 28800, 235980, -260098, 102793, 167562, 119618, 47172, -207426, -181595, 35888, 199870, 50517, -139386, 33808, 117461, -406468, -353258, -13617, 14787, -904, -96304, -367721, 170813, 166459, 33121, 24430, -225431, -221100, 7640]
9616h3252l5789N5801l59865E5299h0858I1478d04451a03057A74382b50220A2384
9604a7484g626k58849A0493J66905Q6042A23236j0232g4397C7540a90936A22904
9592a31834E74635k03824g4472C9223b70804a11239C72427A19136e6222l4304
9582i0526M515B03452a29933j07328A78663a67150I1752J27908P9295b38305A8449
9570F7274J49934A6381a99686A7438c19188E5354c34328J21903o3232a17057A7847
9558a24506M9480j18755J7446j51880J4375a11628G434b30445F114J46855b38165
9546e4985B9551a41197c9412k57882a40330m6986a9673j51583I2928a03330H9901
9534A43857a80262A87393a09145k09523j7530a9068m2531k52245g359q9018M4999
$$ y = [-83252, -119041, -63240, -423105, 55299, -80858, 91478, -404451, -103057, 174382, -250220, 12384, -17484, -7626, -266475, 10493, 177398, 263440, 123236, 113004, -74397, 37540, -190936, 122904, -131834, 574635, 370811, -74472, 39223, -270804, -111239, 372427, 119136, -56222, -90526, -86011, 203452, -129933, -237261, 178663, -167150, 91752, 219660, 298955, -238305, 18449, 67274, 217208, 16381, -199686, 17438, -319188, 55354, -334328, -212425, -275657, -117057, 17847, -124506, -75026, -193781, -176335, -328215, -313840, -111628, 7434, -230445, 6114, 152969, -238165, -54985, 29551, -141197, -39412, -297294, -140330, -187316, -19673, -171256, 92928, -103330, 89901, 143857, -180262, 187393, -109145, -318668, -336198, -19068, -61599, -313844, -7359, -96377, -51378]
9523e1378n7858l5583j7450P95P8689I2033a00922k9506I4972a89508B6824J09165
9511A35989J9235F1617k2969b76522A4231a51410m86d3623k30562J27979k1026
9500a67232A0240J9512i4319H3513a05549H6108b07609K7358A63844b70642R5993
9489a74649B6690g9594C46937a53864k2578k5279b7719q0102A16348j0741c27675
9477D5792N9302c03941a12239C4404a74977e3939k58855B72573E7928k4977c8614
9465a13095p1605A91884a6166n2875o7186A27375c9222j48725l0378c4580k16202
9454b50782k95773J74039E1228e6843C3482d8223k14058D1973d73268D6664c04629
9442b44769B08766G8077a56655C0260Q4461a79021k6957o4811c4299r7259r1498
$$ y = [-51378, -109236, -144819, -162269, -161474, -82785, 92033, -100922, -130428, 94972, -189508, 26824, 135989, 155224, 61617, 38648, -276522, 14231, -151410, -151896, -43623, -274185, -146206, -167232, 10240, 29752, -94319, 83513, -105549, 86108, -207609, -180251, 163844, -270642, -174649, 26690, -79594, 346937, -153864, -176442, -201721, -27719, -107821, 116348, 105607, -327675, 45792, 105094, -303941, -112239, 34404, -174977, -53939, -312794, 272573, 57928, 32951, -38614, -113095, -184700, 191884, -16166, -69041, -136227, 127375, -39222, -187947, -218325, -34580, -250782, -546555, -372516, 51228, -56843, 33482, -48223, -262281, 41973, -473268, 46664, -304629, -244769, 208766, 78077, -156655, 30260, 114721, -179021, -205978, -270789, -34299, -131558, -223056]
9431b23056j18555a10604G2262k4907b3380k13087M9995h072B957g5268k10142
9420b85410g1000K1574C0922c22366O0605L585D1151a87510B1594O7681a00615
9408A02029g4547b8670A54966b9311A6812a98822k73498A74960D1152b19553B46462
9396b41241b3144j43808B4113r404e8302J8194A44283m2755K7159K91606A12552
9384e2727C5212N5461K5564b15462g4226A88499a26602G9931b35667J02836C12405
9372a92661m0187c7782k03624g2731A51720b31228q5888B3563f652C3982K56776
9361B90758h887o7201o9334k80080a74629a4156n6071A40401f4832k55387A3346
9349a75641M2276D65524b48169n40A42767o5017a16476C6655i1128B34576l4706
$$ y = [-223056, -341611, -110604, 72262, 47355, -23380, -236467, -186472, -8072, 2957, -75268, -285410, -71000, -49426, 30922, -322366, -261761, -258176, 41151, -187510, 21594, 89275, -100615, 102029, -74547, -28670, 154966, -29311, 16812, -198822, -472320, 174960, 41152, -219553, 246462, -241241, -23144, -166952, 24113, 14709, -58302, -40108, 144283, 101528, 128687, 420293, 112552, -52727, 35212, 90673, 116237, -215462, -74226, 188499, -126602, 79931, -235667, -132831, 312405, -192661, -232848, -37782, -241406, -72731, 151720, -231228, -317116, 23563, -6652, 33982, 290758, -8887, -76088, -145422, -425502, -174629, -14156, -70227, 140401, -64832, -320219, 13346, -175641, -133365, 465524, -248169, -248709, 142767, 77750, -116476, 36655, -91128, 234576, 199870]
9338A99870D3521j507J79874g5421r5935p0711b761k28762B59084A6108a0041
9326b1520I21c45381a03840A69744c09632J44237k86646C855c52804i0543p7837
9315a68380a2165A57413e8337r5746c7083J7141A9821a2551l40292D6984c33773
9303a3158j19483l52746a49334g2222A4981K50978f7289l25913A27379k8705b64915
9291c13989o7644F3585a3967B3558g013k5581l26882J64129d7251o98k7982l5154
9279a11085A7720b1238f609j2482A6429d3080H9166m2954K04924A1516J15122
9268A26638c02857G3388R4150E0792M03116a19913j26397A34306a89880E0624
9257c0435H8686b74126J16141d5776D2409J33397h7516A5368c8829J5779r6423
$$ y = [199870, 43521, 42014, 221888, -75421, -171356, -242067, -2761, -231523, 259084, 16108, -10041, -21520, 921, -345381, -103840, 169744, -309632, -165395, -452041, 3855, -352804, -90543, -168380, -12165, 157413, -58337, -154083, -37083, -19942, 19821, -12551, -352843, 46984, -333773, -13158, -132641, -485387, -149334, -72222, 14981, 265959, -67289, -393202, 127379, 98674, -264915, -313989, -381633, 63585, -13967, 23558, -7013, -32594, -359476, -195347, -47251, -47949, -75931, -111085, 17720, -21238, -6609, -19091, 16429, -43080, 89166, 46212, 251136, 11516, 126638, -302857, 73388, 167538, 50792, 453908, -119913, -246310, 134306, -189880, 50624, -30435, 88686, -274126, -157985, -45776, 42409, 175806, -87516, 15368, -38829, -23050, -119473]
9246a19473d6866k41044a25410c2957J5447C73988b39773n4500J7026A34833a7363
9234h3183B02205A8673A22J31594a18311k0756C166e55404A78926a79337g9802
9222B27269I5583k0692J212J62183f7450k69274A10088a3449l0050l5169B21682
9210g6792A022J12786L548a76645A95933a68670L2672J9028N7307C26562b51765
9198A34389a75337G7622a31288C8633a78491l5640i0796B020J33917b24971k3900
9187b48871B12352b4639k15996m0071i4197J429l0360c6687D3258N1765b01885
9175b16655A6097c14913h6481E4133a07251d5491B9881b18438A15859b75659d6707
9163b25816L467g0384B33694e1900B13885b64871E1152b63691a3946A13189b95710
$$ y = [-119473, -46866, -287910, -125410, -32957, -17510, 373988, -239773, -294273, -277247, 134833, -17363, -83183, 202205, 18673, 122, 131716, -118311, -139067, 3166, -555404, 178926, -179337, -79802, 227269, 95583, 74891, 76103, 238286, -67450, -336724, 110088, -13449, -43499, -78668, 221682, -76792, 1022, 113808, 117356, -176645, 195933, -168670, -135998, -116970, -59663, 326562, -251765, 134389, -175337, 77622, -131288, 38633, -178491, -214131, -90796, 2020, 135937, -224971, -248871, 212352, -24639, -240635, -280706, -94197, -92768, -123128, -36687, 43258, 95023, -201885, -216655, 16097, -314913, -86481, 54133, -107251, -45491, 29881, -218438, 115859, -275659, -46707, -225816, -222349, -70384, 233694, -51900, 213885, -264871, 51152, -263691, -13946, 113189, -295710]
9151B35878K53156A70483A8821b12263P5318M1582M1217l90415a77115H7727c01950
9139A24618J6976h3212K1151G3340a86783n3812A57625b37375P0922k2779D48218
9127g8298j73322e2069C4122M0988f4965l28309A42845G674a62235C9186I917
9115B63076a00473A12226c46952G7875a98466O7555K8753H7081c15367a11528
9104d17328i3561G4982c02707A40759f60D5281O5609c72639h1577C75036b47725
9092b9869A13350j584a95623h9884B09783o4176j2697b46694q2916M4661J6520
9081b68429M4749j68058E9151J78405C1798a03329j76925N0084J06146n2667l1790
9070b08481e2905A35298B1348Q6986j5608b68613R9462n4819g1606C30749c9296
$$ y = [235878, 489034, 170483, 18821, -212263, -136945, -95363, -54146, -444561, -177115, 87727, -301950, 124618, 141594, -83212, -62061, 73340, -186783, -240595, 157625, -237375, -166453, -189232, 448218, -78298, -251620, -52069, 34122, 75110, -64965, -393274, 142845, 7674, -162235, 39186, 9917, 263076, -100473, 112226, -346952, 77875, -198466, -130911, -102158, 87081, -315367, -111528, -417328, -93561, 74982, -302707, 140759, -660, 45281, 110890, -372639, -81577, 375036, -247725, -29869, 113350, 111766, -195623, -89884, 209783, 145607, 132910, -246694, -329610, -284949, -268429, -223680, -391738, 59151, 237556, 31798, -103329, -280254, -230170, -124024, -176691, -208481, -52905, 135298, 21348, 108334, 92726, -268613, -169151, -223970, -71606, 330749, -39296]
9058A48843a03554a0984j10312M9578C7119c57079h394D9309g1787j78207g5566
9046b2211I1223J21252b34854i5913E1088e7746P112Q124B2223L41430c64803
9034c49866a32850A95821a39483I820K15462b06214N0581B8769b19041g3919F670
9022a72873a7413A10857b52962n9450A90834b65040K1857j27516h6922G6471b9047
9010F3500i0440j40542K4118K600G0428a14372B26169a3100j32778r4411Q7142
8999a53147D2459b3394j64192A40278a56118n9721g7715A96791E1606d847B24497
8987A68507d74430B333a18719k51700K8231A17844b77667B81040D9337d62498
8976F6255M7621L2708D3806K60893b51530A6398g7225B79259B262a84893R572
$$ y = [148843, -103554, -10984, -121296, -71718, 37119, -357079, -8394, 49309, -71787, -249994, -75566, -22211, 91223, 212475, -234854, -95913, 51088, -57746, -50634, -42510, 22223, 363653, -364803, -349866, -132850, 195821, -139483, 9820, 225282, -206214, -155633, 28769, -219041, -73919, 6670, -172873, -17413, 110857, -252962, -312412, 190834, -265040, -243183, -370699, -86922, 76471, -29047, 63500, -90440, -230982, -206864, -204264, 70428, -114372, 226169, -13100, -145878, -240289, -153147, 42459, -23394, -187586, 140278, -156118, -215839, -77715, 196791, 51606, -4847, 224497, 168507, -474430, 2333, -118719, -370419, -342188, 117844, -277667, 281040, 49337, -462498, 66255, 113876, 146584, 43806, 304699, -251530, 16398, -77225, 279259, 2262, -184893, -175321]
8965a75321j67770a08486o247L8054m18655D67956D9141i3795C4786d63246i0806
8953c4449a5007o9975l36432H0314b46485c232G4247J55526A02038a54046H4947
8941a5544A1607a49859A19212k2737a45239D97739A6376K76219a21244j14145
8931b35389H3328C5215P6501J10223A10413K18704J32205J653377K675893K791817
8921G582409L83715B251253I39040D19576A81898J61496A16082a55118D5708c48493
8910I7214A1041b78055A00044e0450n1406p4272h0594Q898r7603A56107f6165
8898a27529A648L05789A5683J54333a1017q4322i604j13780G1923b12142L8232
$$ y = [-175321, -343091, -108486, -114733, -76679, -495334, 467956, 49141, -93795, 34786, -463246, -90806, -34449, -15007, -84982, -421414, 80314, -246485, -3232, 74247, 229773, 102038, -154046, 84947, -15544, 11607, -149859, 119212, 96475, -145239, 497739, 16376, 292595, -121244, -235389, 83328, 35215, 111716, 221939, 110413, 329117, 461322, 2114699, 4790592, 7582409, 7966124, 2251253, 939040, 419576, 181898, 343394, 116082, -155118, 45708, -348493, 97214, 11041, -278055, 100044, -50450, -101856, -176128, -80594, -71696, -169299, 156107, -66165, -127529, 1648, 307437, 15683, 170016, -11017, -95339, -9604, -123384, 71923, -212142, -173910]
$$ [...]