
##TITLE=UV1113_M2_1290-1353_7180679_BAYOcqiqza
##JCAMPDX= 6.0         $$ Bruker NMR JCAMP-DX V2.0
##DATA TYPE= NMR SPECTRUM
##DATA CLASS= NTUPLES
##ORIGIN= BRUKER
##OWNER= Administrator
$$ 1.72 TOPSPIN		Version 2.1
$$ 2012-12-05 02:42:03.634 -0500  Administrator@X
$$ Compression mode = diff/dup
##.OBSERVE FREQUENCY= 400.02188249412
##.OBSERVE NUCLEUS= ^1H
##.ACQUISITION MODE= SIMULTANEOUS (DQD)
##.ACQUISITION SCHEME= undefined
##.AVERAGES= 64
##.DIGITISER RES= 22
##SPECTROMETER/DATA SYSTEM= spect
##.PULSE SEQUENCE= noesygpps1d.comp
##.SOLVENT NAME= COFFEE_meoh
##.SHIFT REFERENCE= INTERNAL, COFFEE_meoh, 1, 14.96085
##AUDIT TRAIL= $$ (NUMBER, WHEN, WHO, WHERE, PROCESS, VERSION, WHAT)
$$ ##TITLE= Audit trail, TOPSPIN		Version 2.1
$$ ##JCAMPDX= 5.01
$$ ##ORIGIN= Bruker BioSpin GmbH
$$ ##OWNER= Administrator
$$ $$ E:\/data/COFFEE/nmr/UV1113_M2_1290-1353_7180679_BAYOcqiqza/12/pdata/1/auditp.txt
$$ ##AUDIT TRAIL=  $$ (NUMBER, WHEN, WHO, WHERE, PROCESS, VERSION, WHAT)
(   1,<2012-12-05 02:41:57.727 -0500>,<Administrator>,<X>,<go>,<TOPSPIN 2.1>,
      <created by zg
	started at 2012-12-05 02:30:26.915 -0500,
	POWCHK enabled, PULCHK disabled,
       configuration hash MD5:
       86 BA 57 50 F2 9D 5C 9B 26 00 A9 28 5F 66 2E 89
       data hash MD5: 64K
       B2 72 67 36 B2 B7 BE 79 6F 06 96 F1 0F 09 B8 A3>)
(   2,<2012-12-05 02:42:00.837 -0500>,<Administrator>,<X>,<proc1d>,<TOPSPIN 2.1>,
      <Start of raw data processing
       efp LB = 0.3 FT_mod = 6 PKNL = 1 PHC0 = 0 PHC1 = 0 SI = 128K 
       data hash MD5: 128K
       FC E1 E0 D8 6E FF 4D 04 8E AC 15 99 C3 C4 71 4E>)
(   3,<2012-12-05 02:42:01.884 -0500>,<Administrator>,<X>,<proc1d>,<TOPSPIN 2.1>,
      <pk PHC0 = -80.41992 PHC1 = 0 
       data hash MD5: 128K
       8D BB FA 62 40 C3 AA F9 85 6C D5 D6 06 7B D1 A1>)
(   4,<2012-12-05 02:42:02.618 -0500>,<Administrator>,<X>,<proc1d>,<TOPSPIN 2.1>,
      <abs ABSG = 1 
       data hash MD5: 128K
       B2 E7 10 C1 E2 76 2D 09 27 08 B9 86 92 D3 22 3E>)
(   5,<2012-12-05 02:42:02.774 -0500>,<Administrator>,<X>,<proc1d>,<TOPSPIN 2.1>,
      <abs ABSG = 2 
       data hash MD5: 128K
       C4 44 77 53 74 9C 57 F3 6F 8C B6 2B 92 25 32 58>)
(   6,<2012-12-05 02:42:02.962 -0500>,<Administrator>,<X>,<proc1d>,<TOPSPIN 2.1>,
      <abs ABSG = 3 
       data hash MD5: 128K
       FB 90 48 0D E3 F1 CA 34 98 97 36 AD 09 A7 71 A9>)
(   7,<2012-12-05 02:42:03.134 -0500>,<Administrator>,<X>,<proc1d>,<TOPSPIN 2.1>,
      <abs ABSG = 4 
       data hash MD5: 128K
       8E 5E EA E2 35 78 1C 42 2B 8D 77 A3 33 3A D8 8C>)
(   8,<2012-12-05 02:42:03.306 -0500>,<Administrator>,<X>,<proc1d>,<TOPSPIN 2.1>,
      <abs ABSG = 5 
       data hash MD5: 128K
       89 E6 39 54 83 AD 47 01 B1 C8 8E 33 0F 2D DC C9>)
$$ ##END=
$$ 
$$ $$ hash MD5
$$ $$ 36 65 51 6B AB 4B 0A 63 C9 7D E1 63 7A 1F D0 74
##$RELAX= 
##$RELAX= 
##$RELAX= 
##$RELAX= 
##$RELAX= 
##$RELAX= 
##$RELAX= 
##$RELAX= 
$$ Bruker specific parameters
$$ --------------------------
##$DU= <E:\>
##$EXPNO= 12
$$ [...]
##$TP07= 0
##$TPNAME0= <>
##$TPNAME1= <>
##$TPNAME2= <>
##$TPNAME3= <>
##$TPNAME4= <>
##$TPNAME5= <>
##$TPNAME6= <>
##$TPNAME7= <>
##$TPOAL= (0..7)
0.5 0.5 0.5 0.5 0.5 0.5 0.5 0.5
##$TPOFFS= (0..7)
0 0 0 0 0 0 0 0
##$TUNHIN= 0
##$TUNHOUT= 0
##$TUNXOUT= 0
##$USERA1= <user>
##$USERA2= <user>
##$USERA3= <user>
##$USERA4= <user>
##$USERA5= <user>
##$V9= 5
##$VALIST= <valist>
##$VCLIST= <CCCCCCCCCCCCCCC>
##$VD= 0
##$VDLIST= <DDDDDDDDDDDDDDD>
##$VPLIST= <PPPPPPPPPPPPPPP>
##$VTLIST= <TTTTTTTTTTTTTTT>
##$WBST= 2048
##$WBSW= 25
##$XGAIN= (0..3)
0 0 0 0
##$XL= 0
##$YL= 0
##$YMAX_a= 5893027
##$YMIN_a= -12119073
##$ZGOPTNS= <>
##$ZL1= 120
##$ZL2= 120
##$ZL3= 120
##$ZL4= 120
##$ABSF1= 14.96085
##$ABSF2= -5.597332
##$ABSG= 5
##$ABSL= 3
##$ALPHA= 0
##$AQORDER= 0
##$ASSFAC= 0
##$ASSFACI= 0
##$ASSFACX= 0
##$ASSWID= 0
##$AUNMP= <proc_prof1d_extract.lims>
##$AXLEFT= 0
##$AXNAME= <>
##$AXNUC= <1H>
##$AXRIGHT= 0
##$AXTYPE= 0
##$AXUNIT= <>
##$AZFE= 0.1
##$AZFW= 0.1
##$BCFW= 0
##$BC_mod= 0
##$BYTORDP= 0
##$COROFFS= 0
##$CY= 15
##$DATMOD= 1
##$DC= 0
##$DFILT= <>
##$DTYPP= 0
##$F1P= 0
##$F2P= 0
##$FCOR= 0.5
##$FTSIZE= 131072
##$FT_mod= 6
##$GAMMA= 0
##$GB= 0
##$INTBC= 1
##$INTSCL= 1
##$ISEN= 128
##$LB= 0.3
##$LEV0= 0
##$LPBIN= 0
##$MAXI= 10000
##$MC2= 0
##$MEAN= 0
##$ME_mod= 0
##$MI= 0
##$NCOEF= 0
##$NC_proc= -2
##$NLEV= 6
##$NOISF1= 0
##$NOISF2= 0
##$NSP= 0
##$NTH_PI= 0
##$NZP= 0
##$OFFSET= 14.96085
##$PC= 1
##$PHC0= -80.41992
##$PHC1= 0
##$PH_mod= 1
##$PKNL= yes
##$PPARMOD= 0
##$PPDIAG= 0
##$PPIPTYP= 0
##$PPMPNUM= 2147483647
##$PPRESOL= 1
##$PSCAL= 4
##$PSIGN= 0
##$PYNMP= <proc.py>
##$REVERSE= no
##$SF= 400.020009697515
##$SI= 131072
##$SIGF1= 0
##$SIGF2= 0
##$SINO= 400
##$SIOLD= 131072
##$SPECTYP= <>
##$SREGLST= <1H.CDCl3>
##$SSB= 0
##$STSI= 131072
##$STSR= 0
##$SW_p= 8223.68421052631
##$SYMM= 0
##$S_DEV= 0
##$TDeff= 65536
##$TDoff= 0
##$TI= <>
##$TILT= no
##$TM1= 0
##$TM2= 0
##$TOPLEV= 0
##$USERP1= <user>
##$USERP2= <user>
##$USERP3= <user>
##$USERP4= <user>
##$USERP5= <user>
##$WDW= 1
##$XDIM= 131072
##$YMAX_p= 379230700
##$YMIN_p= -13083
##$CURPLOT= <Network HP LaserJet P1505>
##$CURPRIN= <$Network HP LaserJet P1505>
##$DFORMAT= <normdp>
##$LAYOUT= <+/1D_H.xwp>
##$LFORMAT= <normlp>
##$PFORMAT= <normpl>
##$SURQMSG= 1
$$ End of Bruker specific parameters
$$ ---------------------------------
##NTUPLES= NMR SPECTRUM
##VAR_NAME=  FREQUENCY,     SPECTRUM/REAL,   SPECTRUM/IMAG
##SYMBOL=    X,             R,               I
##VAR_TYPE=  INDEPENDENT,   DEPENDENT,       DEPENDENT
##VAR_FORM=  AFFN,          ASDF,            ASDF
##VAR_DIM=   131072,        131072,          131072
##UNITS=     HZ,            ARBITRARY UNITS, ARBITRARY UNITS
##FACTOR=    0.0627417313425164, 1,          1
##FIRST=     8223.62146879497, 2292,         -56304
##LAST=      0,             3482,            -56774
##MIN=       0,             -13083,          0
##MAX=       8223.62146879497, 379230700,    0
$$ Real data points
##PAGE= N=1
##DATA TABLE= (X++(R..R)), XYDATA
$$ [...]
61600D65063n876n724n427m702l716l381m258n494n665m639l665l562l717l311
61586D01926k697k772l486l848l312k367j643j156p63q30j749l023l523k889k083
61571C65785k174k947l316k838k105j653j325r28p73j016j147p56l42n94j205
61556C42666j198l52N51R06R42J020R79N87J34J43P00J358J523Q80k91j118q12
61539C48618M79J779K329K264K102K026J939J900K070K347K368J849Q29m17j534
61524C70948k290k700k928l046l007k881k832k810k479j680q37o76j477k724l472
61509C35109l118j816k49R71J634J749J343N75j35m23l96m81r29j611k291k752
61493C27180k750k138j177m46k67l73k74K42R89J634J916J749J246O52K20J40
$$ y = [465063, 459187, 453463, 448036, 443334, 439618, 436237, 431979, 426485, 420820, 416181, 412516, 408954, 405237, 401926, 399229, 396457, 392971, 389123, 385811, 383444, 381801, 380645, 379882, 379052, 377303, 374280, 370757, 367868, 365785, 363611, 360664, 357348, 354510, 352405, 350752, 349427, 348499, 347726, 346710, 345563, 344807, 344465, 343871, 342666, 341468, 341116, 341667, 342573, 343515, 344535, 345514, 346101, 346235, 346378, 347078, 348436, 349959, 350839, 350548, 349430, 348618, 349097, 350876, 353205, 355469, 357571, 359597, 361536, 363436, 365506, 367853, 370221, 372070, 372899, 372482, 370948, 368658, 365958, 363030, 359984, 356977, 354096, 351264, 348454, 345975, 344295, 343458, 342782, 341305, 338581, 335109, 331991, 330175, 329926, 330897, 332531, 334280, 335623, 336198, 336063, 335640, 335244, 334763, 333834, 332223, 329932, 327180, 324430, 322292, 321115, 320669, 320402, 320029, 319755, 319997, 320986, 322620, 324536, 326285, 327531, 328183, 328403, 328543]
61477C28543M54R21J018L97o09j121n71N91J269Q16k73q89n33J93L80j01n78n15
61459C29392n7L78O48Q71J096J222J030L56n83j112p71k5K90J77M44J273J761
61442C36390J304O10O32J240J749K120K663L111K986K601K636K923K741K183K099
61427C67988K641K930K440J697J293J143J016J111J537J967K103K045J949J857
61413C93717J963K418K756K277J094L8o26j466k578l168k887k574l006l724l890
61398C80344l569l305l075k489j660r62l42M21J050J081N84j5n02p31l48O13J277
61381C68372R34J49P4P66J147O09k23m89j48K78M88O01Q53J299J719J883J951
61364C80263K342K949K953J939P91P48J719K418K260K243L511N688P266P378O618
$$ y = [328543, 328997, 329918, 330936, 331333, 330724, 329603, 329032, 329623, 330892, 331708, 331435, 330546, 330013, 330206, 330586, 330485, 329907, 329392, 329335, 329713, 330361, 331232, 332328, 333550, 334580, 334936, 334353, 333241, 332470, 332445, 332735, 332912, 333356, 334629, 336390, 337694, 338304, 338936, 340176, 341925, 344045, 346708, 349819, 352805, 355406, 358042, 360965, 363706, 365889, 367988, 370629, 373559, 375999, 377696, 378989, 380132, 381148, 382259, 383796, 385763, 387866, 389911, 391860, 393717, 395680, 398098, 400854, 403131, 404225, 404263, 403637, 402171, 399593, 396425, 393538, 390964, 387958, 384234, 380344, 376775, 373470, 370395, 367906, 366246, 365284, 364942, 365363, 366413, 367494, 368078, 368063, 367561, 366830, 366482, 367095, 368372, 369306, 369455, 369529, 370295, 371442, 372051, 371828, 371339, 371191, 371469, 371957, 372558, 373411, 374710, 376429, 378312, 380263, 382605, 385554, 388507, 390446, 391237, 391985, 393704, 396122, 398382, 400625, 404136, 409824, 417090, 424468, 431086]
61349D31086O128O383P098P994R119J0374J1206J1155J0467R768R232Q565P717
61336E46292O965O280N250L838K555J654P22n49j826k739l428m095m567m736m851
61321E46765m846m141k681j497j391j718j398n51r4j05K28J111J832K020K240
61306E35774L060M302N465O320O966P793R298J1331J2647J2013R693P119N078
61293F36859L126P80j643l614m979n724n883n911o385p034o906n792m695m462
61279E77737m652m302l183j721k46J044J853K137K406L187M374N446O101O357
61265E96538O322O249O497P135P754P982P966Q122Q687R675J0968J2215J2991
61252G09101J3175J2921J2141J0566Q395O351M726L005P15j825m107o122p909
$$ y = [431086, 437214, 443597, 450695, 458689, 467808, 478182, 489388, 500543, 511010, 520778, 530010, 538575, 546292, 553257, 559537, 564787, 568625, 571180, 572834, 573556, 573007, 571181, 568442, 565014, 560919, 556352, 551616, 546765, 541919, 537778, 535097, 533600, 532209, 530491, 529093, 528542, 528448, 528343, 528571, 529682, 531514, 533534, 535774, 538834, 543136, 548601, 554921, 561887, 569680, 578978, 590309, 602956, 614969, 624662, 631781, 636859, 639985, 640765, 639122, 635508, 630529, 624805, 618922, 613011, 606626, 599592, 592686, 586894, 582199, 577737, 573085, 568783, 565600, 563879, 563633, 564677, 566530, 568667, 571073, 574260, 578634, 584080, 590181, 596538, 602860, 609109, 615606, 622741, 630495, 638477, 646443, 654565, 663252, 672927, 683895, 696110, 709101, 722276, 735197, 747338, 757904, 766299, 772650, 777376, 780381, 781096, 779271, 775164, 769042, 761133]
61239G61133q922q659p636o938o898o876o358n558m814m030l029k030j421j182
61225F86782q67j52P71J442J730J986K573L342L828L859L648L301K696J918J417
61210G18274J442J652J604J416J560K174K800K837K092J074O97J568L397N315
61196G47902O795Q047R514J1320J3336J5399J7310J8866K0122K1237K1982K1750
61184I33580K0275J7992J5473J2927J0546Q781P832P207O286N097M093L364K525
61171A055978J252m56k406m269n702o714p837r523j1546j3295j4556j5642j6833
61158I48451j8029j8899j9165j8788j8012j7114j6015j4462j2689j1368j0626
61147G73284r615p605n150l462k877k625k080j532j635k606m164n846p186p836
$$ y = [761133, 752211, 743552, 735916, 728978, 722080, 715204, 708846, 703288, 698474, 694444, 691415, 689385, 687964, 686782, 685915, 685763, 686534, 687976, 689706, 691692, 694265, 697607, 701435, 705294, 708942, 712243, 714939, 716857, 718274, 719716, 721368, 722972, 724388, 725948, 728122, 730922, 733759, 735851, 736925, 737622, 739190, 742587, 747902, 754697, 762744, 772258, 783578, 796914, 812313, 829623, 848489, 868611, 889848, 911830, 933580, 953855, 971847, 987320, 1000247, 1010793, 1019574, 1027406, 1034613, 1040899, 1045996, 1050089, 1053453, 1055978, 1057230, 1056774, 1054368, 1050099, 1044397, 1037683, 1029846, 1020323, 1008777, 995482, 980926, 965284, 948451, 930422, 911523, 892358, 873570, 855558, 838444, 822429, 807967, 795278, 783910, 773284, 763669, 756064, 750914, 747452, 744575, 741950, 739870, 738338, 736703, 734097, 729933, 724087, 716901, 709065]
61133G09065p695o819n303l360j354M56K022L286M191N102O760R346J2089J4346
61119G42132J6558J9374K2286K4179K5082K6234K8277L0389L1558L1805L1717
61108A029591L1532L1211L0775K9986K8251K5459K2428K0027J8143J6034J3392
61097A296829J0470P448M237Q01k880p027j1795j6770k1159k4521k7018k8986
61085A179629l0543l1667l2326l2426l1830l0503k8628k6611k4929k3833k3047
61074H63286k1966k0230j8037j5782j3697j1867j0278q696o806m732l095k225
61062G25875j645p43L76J209J793K655L904N048N871O863Q420J0105J1194J1662
61048G92587J2173J3207J4620J6130J7819J9946K2393K4625K6225K7368K8655
$$ y = [709065, 701370, 694551, 689248, 685888, 684534, 684990, 687012, 690298, 694489, 699591, 706351, 715697, 727786, 742132, 758690, 778064, 800350, 824529, 849611, 875845, 904122, 934511, 966069, 997874, 1029591, 1061123, 1092334, 1123109, 1153095, 1181346, 1206805, 1229233, 1249260, 1267403, 1283437, 1296829, 1307299, 1314747, 1318984, 1319785, 1316905, 1309878, 1298083, 1281313, 1260154, 1235633, 1208615, 1179629, 1149086, 1117419, 1085093, 1052667, 1020837, 990334, 961706, 935095, 910166, 886333, 863286, 841320, 821090, 803053, 787271, 773574, 761707, 751429, 742733, 735927, 731195, 728100, 725875, 724230, 723487, 723863, 725072, 726865, 729520, 733424, 738472, 744343, 751206, 759626, 769731, 780925, 792587, 804760, 817967, 832587, 848717, 866536, 886482, 908875, 933500, 959725, 987093, 1015748]
61037A015748L0535L2964L5544L7825L9547M0725M1634M2555M3573M4742M6363
61026A451755M8753N1644N4238N6021N7266N8545O0147O2222O5088O8942P3682
61015B108303P9540Q7505R8416J11964J27302J44488J64621J89023K19508K59356
61005C590026L12610L82096M69408N76878P07557Q62564J040561J240621J461180
60996A0643501J691654J908176K086193K219250K315768K367239K323580K116528
60988B7671889J721290J196719O59803K18054p6801k24158k49799k02378j65649
60979C0548970k45680n18350r75879j522695k026193k380641k541239k519880
60971A7818413k361431k120199j844495j569559j316729j095968r09275p54203
$$ y = [1015748, 1046283, 1079247, 1114791, 1152616, 1192163, 1232888, 1274522, 1317077, 1360650, 1405392, 1451755, 1500508, 1552152, 1606390, 1662411, 1719677, 1778222, 1838369, 1900591, 1965679, 2034621, 2108303, 2187843, 2275348, 2373764, 2485728, 2613030, 2757518, 2922139, 3111162, 3330670, 3590026, 3902636, 4284732, 4754140, 5331018, 6038575, 6901139, 7941700, 9182321, 10643501, 12335155, 14243331, 16329524, 18548774, 20864542, 23231781, 25555361, 27671889, 29393179, 30589898, 31249701, 31467755, 31390954, 31166796, 30916997, 30714619, 30548970, 30303290, 29784940, 28809061, 27286366, 25260173, 22879532, 20338293, 17818413, 15456982, 13336783, 11492288, 9922729, 8606000, 7510032, 6600757, 5846554]
60963E846554o26946n23773m40779l73828l19546k75820k40789k12078j87678
60954B645317j66790j48960j33059j18074j04301r2571q2700p3880o6306o1049
60944A597627n8280n6757n5327n3824n2307n0533m8593m7090m6063m4553m1780
60933A042520l8181l4749l1975k9863k8364k7227k5913k4225k2598k1302j9896
60922G38227j7918j5713j3982j2864j1990j1097j0119q939p603o544o111o055
60910F09292n882n435m712l495j689K06J580K469L296L971L947L125K081J303
60896F10057P25J84j50j06K7k57j104k138k918l417l976m785n564n971o207o786
60880E67614p692q218p968p478p488p847p705o635n150m083l801m019m102l572
$$ y = [5846554, 5219608, 4695835, 4255056, 3881228, 3561682, 3285862, 3045073, 2832995, 2645317, 2478527, 2329567, 2196508, 2078434, 1974133, 1881562, 1798862, 1724982, 1658676, 1597627, 1539347, 1482590, 1427263, 1373439, 1321132, 1270599, 1222006, 1174916, 1128853, 1084300, 1042520, 1004339, 969590, 937615, 907752, 879388, 852161, 826248, 802023, 779425, 758123, 738227, 720309, 704596, 690614, 677750, 665760, 654663, 644544, 635605, 628002, 621458, 615347, 609292, 603410, 597975, 593263, 589768, 588079, 588285, 589865, 592334, 595630, 599601, 603548, 606673, 608754, 610057, 610782, 610966, 610816, 610710, 610737, 610480, 609376, 607238, 604320, 600903, 596927, 592142, 586578, 580607, 574400, 567614, 559922, 551704, 543736, 536258, 528770, 520923, 513218, 506583, 501433, 497350, 493549, 489530, 485428, 481856]
60866D81856k468j214j30P56J414J689J655J721K115K641L157L857M768N401N413
60851E12631N179N194N289N014M456M076M010M162M633N338N492M389K499R06
60837E73268j97j406k580k719j743j115j920l282l652k975k548l068l903m242
60823E37918m081l834l633l408l217l177l267l408l657m158m883n551n803n566
60809D80275n167m967m890m487l609k763k502k646k473j698q87o14n88j38O05
60794D43451O92k41j150q38M01J144P82K19M59J358K211K856L491L940L888L589
60778D66252L589L965M426M975N711O178N781M888M682N604O741P056O683O525
60764E43056O978P594P771P365O694O100N587M903M035L425L429L748L828L636
$$ y = [481856, 479388, 478174, 478044, 478800, 480214, 481903, 483558, 485279, 487394, 490035, 493192, 497049, 501817, 507218, 512631, 517810, 523004, 528293, 533307, 537763, 541839, 545849, 550011, 554644, 559982, 565474, 569863, 572362, 573268, 573071, 571665, 569085, 566366, 564623, 563508, 561588, 558306, 554654, 551679, 549131, 546063, 542160, 537918, 533837, 530003, 526370, 522962, 519745, 516568, 513301, 509893, 506236, 502078, 497195, 491644, 485841, 480275, 475108, 470141, 465251, 460764, 457155, 454392, 451890, 449244, 446771, 445073, 444186, 443572, 442984, 442846, 443451, 444143, 443902, 442752, 441914, 442315, 443459, 444241, 444460, 444919, 446277, 448488, 451344, 454835, 458775, 462663, 466252, 469841, 473806, 478232, 483207, 488918, 495096, 500877, 505765, 510447, 516051, 522792, 529848, 536531, 543056, 550034, 557628, 565399, 572764, 579458, 585558, 591145, 596048, 600083, 603508, 606937, 610685, 614513, 618149]
60750F18149L556L606L436L073L053L599M292M750N060N211M790L658K489K077
60736F70799K403K845L028L054L115L371M112N534P304Q653R119R043R257J0187
60722G51824J1322J1762J1304J0733J0693J0735R923Q203O458N275M357L292K147
60709H58028J046k27j753l216m429n704p250q665r471r814j0226j1010j2158j3537
60695G61614j4718j5048j4336j3203j2434j2192j2244j2524j2971j3164j2672
60684F16108j1612j0474r551q914q628q543q110o987n669n026n198n458n143m384
60670E12411l826l874m233m153l265k207k056l039m231m728m587m195l402j987
60656D62628n45l4n57j272j485j151m32N80J624K388K913L409L685L314K383J534
$$ y = [618149, 621705, 625311, 628747, 631820, 634873, 638472, 642764, 647514, 652574, 657785, 662575, 666233, 668722, 670799, 673202, 676047, 679075, 682129, 685244, 688615, 692727, 698261, 705565, 714218, 723337, 732380, 741637, 751824, 763146, 774908, 786212, 796945, 807638, 818373, 828296, 836499, 842957, 848232, 852589, 855881, 858028, 859074, 858847, 857094, 853878, 849449, 843745, 836495, 827830, 818359, 808545, 798319, 787309, 775151, 761614, 746896, 731848, 717512, 704309, 691875, 679683, 667439, 654915, 641944, 628780, 616108, 604496, 594022, 584471, 575557, 566929, 558386, 550276, 543289, 537620, 532594, 527396, 521938, 516795, 512411, 508585, 504711, 500478, 496325, 493060, 490853, 488797, 485758, 481527, 476799, 472212, 468017, 464615, 462628, 462083, 462049, 461492, 460220, 458735, 457584, 457152, 457732, 459356, 461744, 464657, 468066, 471751, 475065, 477448, 478982]
60640D78982J179J210J457J891K271K218J819J589J676J656J378J342J848K320
60626E02836K046J228O99P46Q03L46l58o79n22n06j201k369l209l270k886k591
60610D91113k446k206j896j824k060k367k536k549k457k407k641l101l186k410
60596D57027j220n92p68j059r87r52j348j730j425o34k02m38o94k79O88J497J682
60579D48566J441J308J513J831K065K482L517N080O554P625Q743J0519J2911J5306
60565E29461J7217J8505J9070J8795J7875J6732J5458J3583J0683P006L128p26
60553F86787m611q130j0374j0844j0017q628o747m076q67K137M661P123R784J2308
60539F58506J4422J6383J8350J9824K0244J9672J8430J6419J3445R822O037K073
$$ y = [478982, 480161, 481371, 482828, 484719, 486990, 489208, 491027, 492616, 494292, 495948, 497326, 498668, 500516, 502836, 504882, 506110, 506809, 507555, 508358, 508704, 508346, 507667, 507145, 506639, 505438, 503069, 499860, 496590, 493704, 491113, 488667, 486461, 484565, 482741, 480681, 478314, 475778, 473229, 470772, 468365, 465724, 462623, 459437, 457027, 455807, 455215, 454447, 453388, 452401, 451449, 450101, 448371, 446946, 446312, 446110, 445672, 444978, 444699, 445387, 446884, 448566, 450007, 451315, 452828, 454659, 456724, 459206, 462723, 467803, 474357, 481982, 490725, 501244, 514155, 529461, 546678, 565183, 584253, 603048, 620923, 637655, 653113, 666696, 677379, 684385, 687513, 686787, 682176, 674046, 663672, 652828, 642811, 634183, 627436, 623360, 622493, 624630, 629291, 636414, 646198, 658506, 672928, 689311, 707661, 727485, 747729, 767401, 785831, 802250, 815695, 825517, 831554, 833627]
60527H33627k196o154q791r913j0226j0185r561q213o539m830k986j203k50m36
60513G52144q84m25J109K962M523N673O443O997P912R825J2641J5581J8302K1550
60499H64353K6375L2800L9655M5788N1228N6884O3128O8942P2677P3383P1151
60488A466364O6294N8699M8066L4393J8044k94j9427l7749n3843o7010p6935q3168
60476A353434q5232q3291p8393p1892o4850n7967n1752m6403m1574l6672l1591
60465G03817k6967k3451k0904j8639j6373j4450j3069j1851j0481r263q575q146
60453E21648p463o601n979n522m740l707l120l253l485l251k814k740k966k889
60439D63118k217j328q74j151j779j960j269j92M20L50M4k83r42j931k543k280
$$ y = [833627, 831431, 825277, 816486, 806573, 796347, 786162, 776601, 768388, 761849, 757019, 754033, 752830, 752580, 752144, 751260, 750835, 751944, 754906, 759429, 765102, 771545, 778542, 786454, 796279, 808920, 824501, 842803, 864353, 890728, 923528, 963183, 1008971, 1060199, 1117083, 1180211, 1249153, 1321830, 1395213, 1466364, 1532658, 1591357, 1639423, 1673816, 1691860, 1691566, 1672139, 1634390, 1580547, 1513537, 1436602, 1353434, 1268202, 1184911, 1106518, 1034626, 969776, 911809, 860057, 813654, 772080, 735408, 703817, 676850, 653399, 632495, 613856, 597483, 583033, 569964, 558113, 547632, 538369, 529794, 521648, 514185, 507584, 501605, 496083, 491343, 487636, 484516, 481263, 477778, 474527, 471713, 468973, 466007, 463118, 460901, 459573, 458699, 457548, 455769, 453809, 452540, 452348, 452768, 453118, 453162, 452879, 451937, 450006, 447463, 445183]
60423D45183j693j694k328k746k314j240k54O9l29r67j212q36j76M13R55J586
60407D32417K120K202J728Q50j50q13o60K24R81Q60J26k49K17J086J692J817J672
60390D46120J526J510J534J364R27N31N33Q08Q56M42j15l65j75K79P82J162J306
60373D59025J243J128J050Q99N58J19j79k18o3K03N43P84P00M12N31J383K280
60356D70398K178J156M97R46J663J570J044J240K137K555K112J806K305K853K540
60341D97000J765J568K172K947L353L188K370J110j3o70j189j815k136j854j480
60326E06316j513j435n21P85J343R70N38N82Q70J309K165L176L620L559M066N708
60310E31538P723R248J0556J2439J5014J7806K0522K3098K5383K7343K9202L0769
$$ y = [445183, 443490, 441796, 439468, 436722, 434408, 433168, 432914, 432983, 432654, 431687, 430475, 429639, 429463, 429876, 430831, 432417, 434537, 436739, 438467, 439317, 439167, 438354, 437694, 437918, 438899, 439759, 439885, 439636, 439853, 440939, 442631, 444448, 446120, 447646, 449156, 450690, 452054, 452981, 453512, 454045, 454853, 455709, 456151, 456036, 455671, 455496, 455775, 456557, 457719, 459025, 460268, 461396, 462446, 463345, 463903, 464022, 463843, 463625, 463562, 463765, 464308, 465092, 465792, 466204, 466735, 468118, 470398, 472576, 473732, 474229, 475175, 476838, 478408, 479452, 480692, 482829, 485384, 487496, 489302, 491607, 494460, 497000, 498765, 500333, 502505, 505452, 508805, 511993, 514363, 515473, 515460, 514790, 513601, 511786, 509650, 507796, 506316, 504803, 503368, 502847, 503632, 504975, 505945, 506483, 507065, 507935, 509244, 511409, 514585, 518205, 521764, 525830, 531538, 539261, 548509, 559065, 571504, 586518, 604324, 624846, 647944, 673327, 700670, 729872, 760641]
60298G60641L0880K8267K2800J5466P273j313r919j7887k4423k8817l0578k9752
60286G22638k7169k4005k0922j7839j4596j1613r656q984q956q590p537o311n567
60273E50893n393n441n476n334m668l283j748j024j323j804j693j178r38j269
60259E10321j970k659k813k006o06J94k77j158j089l4P04L51l59l59K97P42N81
60242D99860K58J83J45j83n06j46J038K285K747K450K137K246K476K396K085J878
60226E21349J832J815J860K035K115J811J251Q69Q31R23J037J332J912K638L369
60211E46979M077M652M845M550L934L249K689K450K627K951K969K571K128J987
60197E92658K090K212K257K199J981J694J550J438Q54m47j931k785k822k583k591
$$ y = [760641, 791521, 819788, 842588, 858054, 865327, 864014, 854095, 836208, 811785, 782968, 752390, 722638, 695469, 671464, 650542, 632703, 618107, 606494, 596838, 587854, 578898, 570308, 562771, 556460, 550893, 545500, 540059, 534583, 529249, 524581, 521298, 519550, 518526, 517203, 515399, 513706, 512528, 511590, 510321, 508351, 505692, 502879, 500873, 500267, 500461, 500184, 499026, 497937, 497903, 498607, 498958, 498599, 498240, 498537, 499279, 499860, 500118, 500301, 500446, 500263, 499757, 499611, 500649, 502934, 505681, 508131, 510268, 512514, 514990, 517386, 519471, 521349, 523181, 524996, 526856, 528891, 531006, 532817, 534068, 534937, 535768, 536691, 537728, 539060, 540972, 543610, 546979, 551056, 555708, 560553, 565103, 569037, 572286, 574975, 577425, 580052, 583003, 585972, 588543, 590671, 592658, 594748, 596960, 599217, 601416, 603397, 605091, 606641, 608079, 608933, 608486, 606555, 603770, 600948, 598365, 595774]
60182E95774k857l038k854k328j819j689j899k048k027k216k769l045k351r57
60168E63877K50R73J586K054J724M81p64j248j283j369j128M2J705K838L290L810
60152E76838M553M640L487J816P78P17J238K036L041L980M402M156L645L596M514
60137F23437O157P560P959P764Q096R215R999R349P517N457L428J056j542l666
60123G01786n008n840o163n546m099k791k318k216j747j010n58k55N74J935K862
60108F69606K543J278K7n68n31k81l09r11j925k814l192l105k753k168j401p73
60092F52723n56n51k68M79J501K657L948N134N794N927O075O515O723O064M685
60077G06850L292K108O82j233l139m367m944n556o696q038q778q508p663o979
$$ y = [595774, 592917, 589879, 587025, 584697, 582878, 581189, 579290, 577242, 575215, 572999, 570230, 567185, 564834, 563877, 564127, 565100, 566686, 568740, 570464, 570945, 570181, 568933, 567650, 566281, 565153, 565195, 566900, 569738, 573028, 576838, 581391, 586031, 589518, 591334, 592112, 592829, 594067, 596103, 599144, 603124, 607526, 611682, 615327, 618923, 623437, 629594, 637154, 645113, 652877, 660973, 670188, 680187, 689536, 697053, 702510, 705938, 706994, 705452, 701786, 696778, 690938, 684775, 679229, 675130, 672339, 670021, 667805, 666058, 665048, 664490, 664235, 664809, 666744, 669606, 672149, 673427, 673454, 672886, 672355, 672074, 671765, 670854, 668929, 666115, 662923, 659818, 657065, 654897, 653496, 652723, 652167, 651616, 651348, 651827, 653328, 655985, 659933, 665067, 670861, 676788, 682863, 689378, 696101, 702165, 706850, 710142, 712250, 712932, 711699, 708560, 704193, 699249, 693693, 686997, 678959, 670181, 661673, 654010, 647031]
60063F47031o647o351o024o037o469o847o969p332q102q369p317n704m970n095
60049E54798m689l302k144k071k166j227M78J916K897L800M417M241L540L063
60035E63551K915K712K580K845K960J984J32j265j643j937l090m768o022o446
60021E54508o191n552n052n331o342p170p100o483o041n812n272m217k920j649
60007D79376n29K37L74n6n58m60O06K295L634L848L214K779L151L973M589M750
59991E11223M546M128L734L535L231K371J203O71J173J935K082J721J395J029
59977E43977J66j096k140k682k991l329l668l810l444k323q57j67q59k037k231
59962E12509j173J33R66J619K453L106L093K577K034J604J214J007J238J830K319
$$ y = [647031, 640384, 634033, 628009, 621972, 615503, 608656, 601687, 594355, 586253, 577884, 570567, 564863, 559893, 554798, 550109, 546807, 544663, 542592, 540426, 539199, 539677, 541593, 544490, 548290, 552707, 556948, 560488, 563551, 566466, 569178, 571758, 574603, 577563, 579547, 579679, 578414, 576771, 574834, 571744, 566976, 560954, 554508, 548317, 542765, 537713, 532382, 526040, 518870, 511770, 505287, 499246, 493434, 488162, 483945, 481025, 479376, 478847, 479084, 479458, 479402, 478844, 478384, 478990, 481285, 484919, 488767, 491981, 494760, 497911, 501884, 506473, 511223, 515769, 519897, 523631, 527166, 530397, 532768, 533971, 534642, 535815, 537750, 539832, 541553, 542948, 543977, 544143, 543047, 540907, 538225, 535234, 531905, 528237, 524427, 520983, 518660, 517803, 517636, 516777, 514740, 512509, 511336, 511469, 512435, 514054, 516507, 519613, 522706, 525283, 527317, 528921, 530135, 531142, 532380, 534210, 536529]
59947E36529K238J485M47k19j77J77R5o92j765k582k932k816k358j927j967k476
59931E21060k966l078k884k502j883j178q23q48n65N01J734K011J112p0n90k46
59915E08785O41J655K315K274J774J582K117K908L211K946K708K945L495L907
59901E43263L927L624L248K984K788K460K059K050K759L769M296M225M265M867
59887E90584N461N263M424L826L861M040L878L533L315L149K838K554K569K715
59873F42010K528J865J021K61m97j462k663l908m979n728o063n903n238m296l507
59858F03441l056k553j505j58O55O96Q56K066M019N565O158O347O787P478Q134
59843F44930Q762R508J0204J0361R541P617M922K214K73o82r54p82j52O27O54
$$ y = [536529, 538767, 540252, 540699, 540480, 540303, 540480, 540575, 539883, 538118, 535536, 532604, 529788, 527430, 525503, 523536, 521060, 518094, 515016, 512132, 509630, 507747, 506569, 505746, 504898, 504333, 504834, 506568, 508579, 509691, 509621, 509031, 508785, 509426, 511081, 513396, 515670, 517444, 519026, 521143, 524051, 527262, 530208, 532916, 535861, 539356, 543263, 547190, 550814, 554062, 557046, 559834, 562294, 564353, 566403, 569162, 572931, 577227, 581452, 585717, 590584, 596045, 601308, 605732, 609558, 613419, 617459, 621337, 624870, 628185, 631334, 634172, 636726, 639295, 642010, 644538, 646403, 647424, 647685, 647188, 645726, 643063, 639155, 634176, 628448, 622385, 616482, 611244, 606948, 603441, 600385, 597832, 596327, 596169, 596824, 597520, 598376, 600442, 604461, 610026, 616184, 622531, 629318, 636796, 644930, 653692, 663200, 673404, 683765, 693306, 700923, 705845, 708059, 708332, 707650, 706696, 705914, 705762, 706389, 707043]
59828G07043p75l319n988q244j0250j2074j3223j3245j2398j1396j0662j0090
59816E95379r405q520p542o662n996n420m667l674k797k412k390k262j936j874
59802E29822k392l089l224k531j395l38K77J52q66k441l768m160l563k411j245
59787D98828m77k89m77o09n34n90j111j891k432k614k757l003l044k536j606o95
59771D74163p2K45K73M9j85rP01J486J695J194N23L15P16J450K265L078L772M121
59753D95780M038L703L355L128L113L420M002M551M683M262L507K817K545K720
59739E45624K940K663J765P29J33L1Jk14l75j67K19K20l96j150j371r29k54L05
59721E49774P37R77P23o7q57j148j154j345j576j312o07j72k90l68J46R82J615
$$ y = [707043, 706268, 702949, 696961, 688717, 678467, 666393, 653170, 639925, 627527, 616131, 605469, 595379, 585974, 577454, 569912, 563250, 557254, 551834, 547167, 543493, 540696, 538284, 535894, 533632, 531696, 529822, 527430, 524341, 521117, 518586, 517191, 516853, 517130, 517282, 516416, 513975, 510207, 506047, 502484, 500073, 498828, 498351, 498062, 497585, 496976, 496442, 495852, 494741, 492850, 490418, 487804, 485047, 482044, 479000, 476464, 474858, 474163, 474091, 474336, 474609, 474658, 474473, 474464, 475165, 476651, 478346, 479540, 480063, 480378, 481094, 482544, 484809, 487887, 491659, 495780, 499818, 503521, 506876, 510004, 513117, 516537, 520539, 525090, 529773, 534035, 537542, 540359, 542904, 545624, 548564, 551227, 552992, 553721, 553854, 553885, 553886, 553672, 553297, 553130, 553349, 553569, 553173, 552023, 550652, 549723, 549469, 549774, 550511, 551488, 552211, 552144, 551287, 550139, 548985, 547640, 546064, 544752, 544145, 543973, 543683, 543315, 543461, 544443, 546058]
59704E46058K009K292K151J314L56K65J172K065K024J311R91J720L095M070L924
59689E74817K828J496L57p15j815k564k525j837j059m76J2M17N16K30j87m84p02
59672E68309j022j484k006k556l225m088m952n286m668l408k439k298k460k010
59658E26407q47L16R38J187J386J512J447J378J589K074K536K745K656K311J760
59643E49395J065K91m89j159j591j787j948k296k792l080k771j886q83j72K96
59628E30193P98J285J392R86L45k33o32p07l07L42P09O45N35N11J23p88j533j511
59610E32153j174j304j706j538o61K53Q76J471K004J925J136L47R6J64K39M56
59594E34737Q65J073Q50N55M55K20m03r47q85n49p13j498k287k543k201j470p87
$$ y = [546058, 548067, 550359, 552510, 553824, 554180, 554445, 555617, 557682, 559706, 561017, 562008, 563728, 566823, 570893, 574817, 577645, 579141, 579498, 578783, 576968, 574404, 571879, 570042, 568983, 568507, 568519, 568936, 569452, 569682, 569495, 569011, 568309, 567287, 565803, 563797, 561241, 558016, 553928, 548976, 543690, 539022, 535614, 533175, 530877, 528417, 526407, 525560, 525876, 526814, 528001, 529387, 530899, 532346, 533724, 535313, 537387, 539923, 542668, 545324, 547635, 549395, 550460, 550751, 550262, 549103, 547512, 545725, 543777, 541481, 538689, 535609, 532838, 530952, 530069, 529897, 530193, 530991, 532276, 533668, 534654, 534999, 534766, 534134, 533427, 533120, 533462, 534171, 534816, 535351, 535862, 535985, 535197, 533664, 532153, 530979, 529675, 527969, 526431, 525770, 526023, 526899, 528370, 530374, 532299, 533435, 533782, 533878, 534042, 534281, 534737, 535602, 536675, 537525, 538080, 538535, 538755, 538352, 537405, 536520, 535971, 535258, 533760, 531473, 528930, 526729, 525259, 524472]
59577E24472q03j801l174l958l874l414l004k584k030j485j132j023j208j619
59563D93363j838j386l95M98J040J698K727L472L144K032J286J490K105K365K189
59548E13790J884J508J049Q80J422K507L663M990O990R483J1437J2293J2752J3752
59534E98400J5093J5690J4726J1956P400J684l508o343o474n072l231j106J230
59521F40445L105M025M484N242O137O218M921K692N27q11j343j873l240n305p034
59506F58190p874q565r992j1616j1896j0327q203p023o715o076m607l108k403
59493E59785k179j663r71r56j735k250j605k15R81J847K841L845M269M211M558
59478E70763N732P120Q003Q339Q322P897P151O494N946M930L268J795J224R88
$$ y = [524472, 523669, 521868, 518694, 514736, 510862, 507448, 504444, 501860, 499830, 498345, 497213, 496190, 494982, 493363, 491525, 490139, 489744, 490242, 491282, 492980, 495707, 499179, 502323, 504355, 505641, 507131, 509236, 511601, 513790, 515674, 517182, 518231, 519111, 520533, 523040, 526703, 531693, 538683, 548166, 559603, 571896, 584648, 598400, 613493, 629183, 643909, 655865, 663265, 664949, 661441, 655098, 648624, 643552, 640321, 639215, 640445, 643550, 647575, 652059, 657301, 663438, 669656, 674577, 677269, 677796, 676985, 675642, 673769, 670529, 665224, 658190, 650316, 641751, 631759, 620143, 608247, 597920, 589717, 582694, 575979, 569903, 565296, 562188, 559785, 557606, 555943, 554972, 554016, 552281, 550031, 548426, 548211, 549192, 551039, 553880, 557725, 561994, 566205, 570763, 576495, 583615, 591618, 599957, 608279, 616176, 623327, 629821, 635767, 640697, 643965, 645760, 646984, 647972]
59464F47972P0j331j934j111M52J956L452N298P245Q767R971J1596J3983J6502
59450G22888J8227J8964J9268J9468J9132J7721J5364J2550R309N282N15m416
59438H74272r077j3376j6992j9272j9943j9424j8258j6765j5345j4424j3809j2764
59426F84823j0970q797o332l119O82L857N732P325J0017J3677J7166K0070K2660
59413G56791K4581K5051K4321K3617K3284K2024J8420J2381M836l100j0206j5153
59401I06847j7204j6697j4600j1810q991o647n177n068p092j1694j8025k4052
59389G59790k7953k9195k8260k5810k2410j8691j5281j2566j0547q932p391n831
59377E46923m346k869j246K64J024R40P85J133J461J133O73J049K026K379J771
$$ y = [647972, 648042, 646711, 644777, 643666, 644118, 646074, 649526, 654824, 662069, 670836, 680807, 692403, 706386, 722888, 741115, 760079, 779347, 798815, 817947, 835668, 851032, 863582, 872891, 878173, 878688, 874272, 865195, 851819, 834827, 815555, 795612, 776188, 757930, 741165, 725820, 711396, 697587, 684823, 673853, 665056, 658724, 655605, 656287, 660144, 665876, 673201, 683218, 696895, 714061, 734131, 756791, 781372, 806423, 830744, 854361, 877645, 899669, 918089, 930470, 935306, 932206, 922000, 906847, 889643, 872946, 858346, 846536, 837545, 830898, 825721, 820653, 813561, 801867, 783842, 759790, 731837, 702642, 674382, 648572, 626162, 607471, 592190, 579624, 569077, 560145, 552754, 546923, 542577, 539708, 538462, 538726, 539750, 540690, 541475, 542608, 544069, 545202, 545875, 546924, 548950, 551329, 553100]
59362E53100J184J344J854K280K942M051N054N565O161P525R349J0927J2230J3716
59348F37282J5392J6854J8046J9272K0590K1698K2373K2566K2159K1017J9270
59337H56519J7206J4955J2467R710O678L343j83l599o646r330j1824j4314j6792
59324H58190j8810j9622j8976j7623j6483j5467j3852j1704r992r146q536p710
59312F90269p075o833o279m938l537k902k667j996r05J79J527L597N824P300Q358
59297F79922J0147J2682J4702J5584J6078J6686J6561J4624J0822N670n48p236
59285H05694j2890j6011j6527j5593j4224j2581j0403p558m181o63K480M948O857
59272G09348Q461R894J1273J2733J4140J5032J5129J4668J3983J2944J1169Q578
$$ y = [553100, 554284, 555628, 557482, 559762, 562704, 566755, 571809, 577374, 583535, 591060, 600409, 611336, 623566, 637282, 652674, 669528, 687574, 706846, 727436, 749134, 771507, 794073, 816232, 837249, 856519, 873725, 888680, 901147, 910857, 917535, 920878, 920695, 917096, 910450, 901120, 889296, 874982, 858190, 839380, 819758, 800782, 783159, 766676, 751209, 737357, 725653, 715661, 706515, 697979, 690269, 683194, 676361, 670082, 665144, 661607, 658705, 656038, 654042, 653137, 653316, 654843, 658440, 664264, 671564, 679922, 690069, 702751, 717453, 733037, 749115, 765801, 782362, 796986, 807808, 813478, 812930, 805694, 792804, 776793, 760266, 744673, 730449, 717868, 707465, 699907, 695726, 695063, 697543, 702491, 709348, 717809, 727703, 738976, 751709, 765849, 780881, 796010, 810678, 824661, 837605, 848774, 857352]
59260H57352N409J891j763n164p978j0307j2515j4600j6109j6682j6459j5852
59248G47223j5106j4210j3074j1653j0014q360o893n550l997j989K64K202L400
59235F62243L968M406N104N984O648O794O329N221L528J630J74n94j262k693n003
59220G02477p376q998r849j0423j0932j1117j0707r793q766q049p875p991p702
59207E82899o520m851l710l537l667l205k132j194q70r19q87o18j43N85J553K464
59191E55248K875K586J883J401J731L014M822O468P433P531O885N924N230N142
59177F18173N463N723N651N265M622L884L506M013N470P393R253J0799J1880J2352
59163G13447J2246J1863J1446J0964J0216R051P424N472L529J822J68j772l987
$$ y = [857352, 862761, 864652, 862889, 857725, 849747, 839440, 826925, 812325, 796216, 779534, 763075, 747223, 732117, 717907, 704833, 693180, 683166, 674806, 667913, 662363, 658366, 656377, 656641, 658843, 662243, 666211, 670617, 675721, 681705, 688353, 695147, 701476, 706697, 710225, 711855, 712029, 711435, 710173, 707480, 702477, 695101, 686103, 676254, 665831, 654899, 643782, 633075, 623282, 614516, 606467, 598592, 590601, 582899, 576379, 571528, 567818, 564281, 560614, 557409, 555277, 554083, 553213, 552294, 551407, 550789, 550646, 551231, 552784, 555248, 558123, 560709, 562592, 563993, 565724, 568738, 573560, 580028, 587461, 594992, 601877, 607801, 613031, 618173, 623636, 629359, 635010, 640275, 644897, 648781, 652287, 656300, 661770, 669163, 678416, 689215, 701095, 713447, 725693, 737556, 749002, 759966, 770182, 779233, 786657, 792129, 795658, 797480, 797648, 795876, 791889]
59150G91889o164q129r858j1082j1472j1238j1066j1194j1141j0486r427q346
59138F72286p341o521o146o061n575m344k901j823q98K43J263J652J751K314L339
59123F41238M223M902N903P270Q439R347J0630J2423J3812J4029J3448J2836J2212
59110G70712J1187R993R363R430R397Q406O454M348K991K626K664K189Q04j085
59096H49479k797m014m794n267n485n479n222m707m154l975m349m969n465n856
59082G82946o366o948p340p569q049r048j0314j1323j1754j1577j0905r896q761
59069F63096p593o259m677l274k859l742n120n702m984l670k738k427k286j931
59055F05834j388q70n55o21j163j983k650k771k232j256l49J5j24k37jK46J18
$$ y = [791889, 785725, 777596, 767738, 756656, 745184, 733946, 722880, 711686, 700545, 690059, 680632, 672286, 664945, 658424, 652278, 646217, 640642, 636298, 633397, 631574, 630676, 630919, 632182, 633834, 635585, 637899, 641238, 645461, 650363, 656266, 663536, 671975, 681322, 691952, 704375, 718187, 732216, 745664, 758500, 770712, 781899, 791892, 801255, 810685, 820082, 828488, 834942, 839290, 842281, 844907, 847571, 849760, 850564, 849479, 846682, 842668, 837874, 832607, 827122, 821643, 816421, 811714, 807560, 803585, 799236, 794267, 788802, 782946, 776580, 769632, 762292, 754723, 746674, 737626, 727312, 715989, 704235, 692658, 681753, 671857, 663096, 655503, 649244, 644567, 641293, 638434, 634692, 629572, 623870, 618886, 615216, 612478, 610051, 607765, 605834, 604446, 603576, 603021, 602400, 601237, 599254, 596604, 593833, 591601, 590345, 589996, 590011, 589887, 589650, 589649, 589895, 590013]
59038E90013l7N09J704K610K604K163K101K422K522K294K556M141O794R208J0239
59023F41843J0018R747J0335J1444J2077J1795J0949R922Q770P650O912O420N366
59010G63248L222O02j299j971j868j646j465j052j25J237K532L320L836M768O256
58995G79595P557Q087Q181Q299P965O455M236K595J844R66o85k512l951n496p592
58980H15544r401r789q986q097p365o123m248k385o66J512M142O263P454Q544
58966G86399J0163J1620J2159J2363J3233J4482J4977J4458J3598J2497J0465
58955I26414P334L856N40k853o403r574j2097j4432j6792j8518j9017j8626j7914
58942H01918j6757j4827j2518j0595r168p771o316n274m965n127n244m940m186
$$ y = [590013, 589976, 590485, 592189, 594799, 597403, 599566, 601667, 604089, 606611, 608905, 611461, 615602, 622396, 631604, 641843, 651861, 661608, 671943, 683387, 695464, 707259, 718208, 728130, 736900, 744550, 751462, 757882, 763248, 766470, 767072, 765773, 763802, 761934, 760288, 758823, 757771, 757646, 758883, 761415, 764735, 768571, 773339, 779595, 787152, 795239, 803420, 811719, 819684, 826139, 830375, 832970, 834814, 835780, 835095, 832583, 828632, 823136, 815544, 806143, 796354, 787368, 779271, 771906, 765783, 761535, 759150, 758484, 759996, 764138, 770401, 777855, 786399, 796562, 808182, 820341, 832704, 845937, 860419, 875396, 889854, 903452, 915949, 926414, 933748, 937604, 938144, 935291, 928888, 919314, 907217, 892785, 875993, 857475, 838458, 819832, 801918, 785161, 770334, 757816, 747221, 738053, 730282, 723966, 718692, 713727, 708600, 703356, 698416, 694230]
58929F94230l399l207l772m516m772m462l864l124k410k160k580l178l311k967
58915F46508k447j635k99J133J926K164K705L932N304O285P049P988R069J0102
58901F99784J1149J2360J3670J4856J5726J6186J6431J6899J7711J8283J8091
58890H71146J7720J8402K0473K3007K5137K6904K8482K9443K9318K8209K6215
58879A144456K2899J8069J2616P701L365j300o664j2047j6662k0460k3798k6763
58867A101412k9039l0125k9546k7191k3660k0078j7358j5708j4799j4247j3860
58856H65801j3661j3747j4104j4525j4737j4610j4193j3587j2840j1969j1030
58845G16798j0176r508q840p751o221n029n060o100o808o306n330n366o762q301
$$ y = [694230, 690831, 687624, 683852, 679336, 674564, 670102, 666238, 663114, 660704, 658544, 655964, 652786, 649475, 646508, 644061, 642426, 642127, 643260, 645186, 647350, 650055, 653987, 659291, 665576, 672625, 680613, 689682, 699784, 710933, 723293, 736963, 751819, 767545, 783731, 800162, 817061, 834772, 853055, 871146, 888866, 907268, 927741, 950748, 975885, 1002789, 1031271, 1060714, 1090032, 1118241, 1144456, 1167355, 1185424, 1198040, 1205741, 1209106, 1207806, 1201142, 1189095, 1172433, 1151973, 1128175, 1101412, 1072373, 1042248, 1012702, 985511, 961851, 941773, 924415, 908707, 893908, 879661, 865801, 852140, 838393, 824289, 809764, 795027, 780417, 766224, 752637, 739797, 727828, 716798, 706622, 697114, 688274, 680523, 674302, 669273, 664213, 658113, 651305, 644999, 639669, 634303, 627541, 619240]
58831F19240q641p703o345n147l954k565j293o22m91l53N1M22N83J003K197L852
58815E90234N078N440N241M831M264L732L623L828L579K419R20r0n37r21j468
58800F30173k026k551l073l339l136k841l070l698l899l254k284j636j258p27
58786E93381K5P32J289J886K683L619M490N044N102M728M249L917L655L222K533
58771F40555J652N18j036k983m925o339o915o646n728m527l513l034k992k880
58757E91207k249j115J77J400K593L797M864N638O140O396O214N441M380L755
58743F38638M061N072O148O909P440P890Q165Q146Q003P983Q040P927P657P534
58729G39613P684P861P821P620P392P126O850O716O663O332N649N168N408O099
$$ y = [619240, 610599, 602896, 596551, 591404, 587450, 584885, 583592, 582970, 582479, 582126, 582177, 582599, 583182, 584185, 586382, 590234, 595312, 600752, 605993, 610824, 615088, 618820, 622443, 626271, 629850, 632269, 633189, 633099, 632562, 631641, 630173, 628147, 625596, 622523, 619184, 616048, 613207, 610137, 606439, 602540, 599286, 597002, 595366, 594108, 593381, 593406, 594138, 595427, 597313, 599996, 603615, 608105, 613149, 618251, 622979, 627228, 631145, 634800, 638022, 640555, 642207, 642725, 641689, 638706, 633781, 627442, 620527, 613881, 608153, 603626, 600113, 597079, 594087, 591207, 588958, 587843, 588020, 589420, 592013, 595810, 600674, 606312, 612452, 618848, 625062, 630503, 634883, 638638, 642699, 647771, 653919, 660828, 668268, 676158, 684323, 692469, 700472, 708455, 716495, 724422, 732079, 739613, 747297, 755158, 762979, 770599, 777991, 785117, 791967, 798683, 805346, 811678, 817327, 822495, 827903, 834002]
58715H34002O632P003P691Q661R255R122Q616Q018O926M823J875j217l934o260
58701I01213q512j1065j4013j6955j9328k0982k2164k2897k2848k1942k0659j9437
58689F80411j8196j6647j4779j2773j0808r208q319p922p213n785m276l577l687
58676E57221l837l538k948k342j725r76nJ238K731M350O029P738R253J0207J0583
58661E93979J0756J0773J0102Q478O522M906L354J207j306l193m008m197m179
58648F33194l930l606l714m245m361l491k236j667k065k790l194l098k596j843
58634E90358j145q73j180j913k835l814m795n721o542p202p620p630o998n541
58620E26549l310n96K346N505Q931J2353J5178J6909J7533J7442J7031J6322J4977
$$ y = [834002, 840634, 847637, 855328, 863989, 873244, 882366, 890982, 899000, 905926, 910749, 912624, 911407, 907473, 901213, 892701, 881636, 867623, 850668, 831340, 810358, 788194, 765297, 742449, 720507, 699848, 680411, 662215, 645568, 630789, 618016, 607208, 598000, 589681, 581759, 574546, 568761, 564485, 560908, 557221, 553384, 549846, 546898, 544556, 542831, 541855, 541850, 543088, 545819, 550169, 556198, 563936, 573189, 583396, 593979, 604735, 615508, 625610, 634088, 640610, 645516, 648870, 650077, 648771, 645578, 641570, 637373, 633194, 629264, 625658, 621944, 617699, 613338, 609847, 607611, 605944, 603879, 601089, 597895, 594797, 592201, 590358, 589213, 588340, 587160, 585247, 582412, 578598, 573803, 568082, 561540, 554338, 546718, 539088, 532090, 526549, 523239, 522643, 524989, 530494, 539425, 551778, 566956, 583865, 601398, 618840, 635871, 652193, 667170]
58607F67170J2751R959P341N296L410J048j743m174n617o162o258o056n466m652
58593F66847m096m044m139l782k805j524j50J563L846O315Q222R229R699J0137
58579F95318J0643J0999J1000J0651J0190R951R954R668Q601P164O504P208Q639
58566H16490R830J0678J1851J3816J6380J8995K1072K2106K1892K0598J8466J5602
58554A017776J2262R017O272L829J315j156l185m826o579q592j0429j1643j2303
58541I91758j2755j3220j3718j4183j4516j4669j4756j4965j5345j5719j5740
58530H32172j5025j3404j1185r010p236n612l771j856l39O27J386K276L242L967
58516G76232M249M199M056L863L385K569J851J719J998K103J954J998K264K055
$$ y = [667170, 679921, 689880, 697221, 702517, 705927, 706975, 705232, 701058, 695441, 689279, 683021, 676965, 671499, 666847, 662751, 658707, 654568, 650786, 647981, 646457, 646307, 647870, 651716, 658031, 666253, 675482, 685181, 695318, 705961, 716960, 727960, 738611, 748801, 758752, 768706, 778374, 786975, 794139, 800643, 807851, 816490, 826320, 836998, 848849, 862665, 879045, 898040, 919112, 941218, 963110, 983708, 1002174, 1017776, 1030038, 1039055, 1045327, 1049156, 1050471, 1049315, 1046130, 1041304, 1034725, 1026133, 1015704, 1004061, 991758, 979003, 965783, 952065, 937882, 923366, 908697, 893941, 878976, 863631, 847912, 832172, 817147, 803743, 792558, 783548, 776312, 770700, 766929, 765073, 764734, 765361, 766747, 769023, 772265, 776232, 780481, 784680, 788736, 792599, 795984, 798553, 800404, 802123, 804121, 806224, 808178, 810176, 812440, 814495]
58502H14495R96l22j214j781k424l048l447l989n089o320o832o448n675m862m039
58487G60001l372l030k695j886p10L57J331K687M526O389P902Q953R397R177Q667
58472H07694Q249P615O162L945J558q09l316n574o754o725o260n934n556m862
58458G89433l965k939j691m85K21O71J747L636N352N949N581M853L880K538J046
58443H15827k74j512k854m048m562m176l166k036j133k95J037K969M594M950M446
58428H09767M501N637O843P203P229Q010R622J1166J1890J1778J1181J0394R391
58415I24612P802N371K504pj839l200m070m150l787l995n081o016n819m928m470
58400H92927m668m793m374l685l113k668k126j264J2J437K424K547J949J089K22
$$ y = [814495, 815491, 815169, 813955, 812174, 809750, 806702, 803255, 799266, 794177, 787857, 781025, 774577, 768902, 764040, 760001, 756629, 753599, 750904, 749018, 748308, 748665, 749996, 752683, 757209, 763598, 771500, 780453, 789850, 799027, 807694, 815943, 823558, 829720, 833665, 835223, 834414, 831098, 825524, 818770, 812045, 805785, 799851, 794295, 789433, 785468, 782529, 780838, 780353, 780574, 781245, 782992, 786628, 791980, 797929, 803510, 808363, 812243, 814781, 815827, 815553, 814041, 811187, 807139, 802577, 798401, 795235, 793199, 792066, 791771, 792808, 795777, 800371, 805321, 809767, 814268, 819905, 826748, 833951, 841180, 849190, 858812, 869978, 881868, 893646, 904827, 915221, 924612, 932414, 937785, 940289, 940282, 938443, 935243, 931173, 927023, 923236, 919241, 914160, 908144, 902325, 897397, 892927, 888259, 883466, 879092, 875407, 872294, 869626, 867500, 866236, 866248, 867685, 870109, 872656, 874605, 875694, 875916]
58385H75916o66j613k532l186l284k788k164j977k268k597k666k503j993q29R96
58370H45846L063N019O762Q126Q906R278R730J0455J1240J2002J2887J3834J4517
58357I71665J4710J4312J3190J1580J0312R806R192P358M706K765K205K451L117
58344A077369M377N777O323O047O159P142Q177Q912J0171J2267J4117J5010J5673
58331A197521J6583J6718J5286J3380J2461J2352J2090J1705J1666J1453J0361
58320A341576Q949Q207P833O914N755N516O364P493Q689J0320J1964J2555J2048
58307A454183J1665J2289J3590J4826J5623J5911J5915J6268J7377J8727J9401
58296A625775J9247J8931J8980J9325J9608J9601J9490J9922K1294K2958K3933
$$ y = [875916, 875250, 873637, 871105, 867919, 864635, 861847, 859683, 857706, 855438, 852841, 850175, 847672, 845679, 844850, 845846, 848909, 853928, 860690, 868816, 877722, 887000, 896730, 907185, 918425, 930427, 943314, 957148, 971665, 986375, 1000687, 1013877, 1025457, 1035769, 1045575, 1054767, 1062125, 1066831, 1069596, 1071801, 1074252, 1077369, 1081746, 1087523, 1093846, 1099893, 1106052, 1113194, 1121371, 1130283, 1140454, 1152721, 1166838, 1181848, 1197521, 1214104, 1230822, 1246108, 1259488, 1271949, 1284301, 1296391, 1308096, 1319762, 1331215, 1341576, 1350525, 1358732, 1366565, 1373479, 1379234, 1384750, 1391114, 1398607, 1407296, 1417616, 1429580, 1442135, 1454183, 1465848, 1478137, 1491727, 1506553, 1522176, 1538087, 1554002, 1570270, 1587647, 1606374, 1625775, 1645022, 1663953, 1682933, 1702258, 1721866, 1741467, 1760957, 1780879, 1802173, 1825131, 1849064]
58285A849064K4515K5980K8369L0063L0266L0337L1557L3148L3860L4151L5128
58274B186438L6557L7687L9049M1509M4243M5659M5878M6573M8657N1655N4959
58263B678864N8264O1136O3471O5939O8830P1204P2395P3327P4930P6486P7214
58252C442060P8177Q0544Q3222Q4613Q5691Q8760R3904R9331J04608J10814J17911
58241D469635J24747J31551J39763J49385J58983J68260J78197J88913J99788
58232E909222K11499K25315K40697K56254K72659K91811L13468L35868L59368
58223H416161L86142M16480M48963M84261N25078N72139O23960O80889P45626
58214A3299699Q19602R02840R97682J108464J237365J385227J556865J760758
$$ y = [1849064, 1873579, 1899559, 1927928, 1957991, 1988257, 2018594, 2050151, 2083299, 2117159, 2151310, 2186438, 2222995, 2260682, 2299731, 2341240, 2385483, 2431142, 2477020, 2523593, 2572250, 2623905, 2678864, 2737128, 2798264, 2861735, 2927674, 2996504, 3067708, 3140103, 3213430, 3288360, 3364846, 3442060, 3520237, 3600781, 3684003, 3768616, 3854307, 3943067, 4036971, 4136302, 4240910, 4351724, 4469635, 4594382, 4725933, 4865696, 5015081, 5174064, 5342324, 5520521, 5709434, 5909222, 6120721, 6346036, 6586733, 6842987, 7115646, 7407457, 7720925, 8056793, 8416161, 8802303, 9218783, 9667746, 10152007, 10677085, 11249224, 11873184, 12554073, 13299699, 14119301, 15022141, 16019823, 17128287, 18365652, 19750879, 21307744, 23068502]
58206B3068502K003557K291006K635321L055962L572906M206834M987304N952294
58198E1773686P136345Q565361J0261358J2237923J4485560J6971244J9644928
58191A41076405K2406138K5037797K7210077K8613783K9093481K8578675K6834780
58184C28851136K3342211J7565218R472135j46364r872946j8234696k4228217
58177C26748477k7510103k8295409k7169346k4918431k2345786k0052866j8285213
58170A58171323j6954427j5815402j4656156j3383767j2008008j0590936r207096
58163F5555531p918907o764339n758056m899609m178762l578070l077966k661885
58155B6717937k316030k026814j782123j574200j398393j249717j122916j014746
$$ y = [23068502, 25072059, 27363065, 29998386, 33054348, 36627254, 40834088, 45821392, 51773686, 58910031, 67475392, 77736750, 89974673, 104460233, 121431477, 141076405, 163482543, 188520340, 215730417, 244344200, 273437681, 302016356, 328851136, 352193347, 369758565, 379230700, 379084336, 369211390, 350976694, 326748477, 299238374, 270942965, 243773619, 218855188, 196509402, 176456536, 158171323, 141216896, 125401494, 110745338, 97361571, 85353563, 74762627, 65555531, 57636624, 50872285, 45114229, 40214620, 36035858, 32457788, 29379822, 26717937, 24401907, 22375093, 20592970, 19018770, 17620377, 16370660, 15247744, 14232998]
58147A4232998r23414q46106p79112p19727o66163o16362n68732n23384m80937
58138H109061m40934m02986l68278l38003l11204k86260k63703k45538k32240
58129E219915k22192k13608k05326j96248j85811j74781j64152j53668j42714
58120C561415j31997j22861j15365j08503j01846r5658q9890q4383p9569p5690
58110B555653p2022o8072o4708o2728o1161n8673n5856n4282n3859n3015n1144
58099A900133m9068m7227m5252m3163m1402l9655l7221l4431l2296l0859k9409
58088A470150k8068k7464k7027k5413k2798k0923k0587k0799k0760k0922k1466
58077A213923k1468k0441j9411j9380j9786j9459j8343j7386j7192j7438j7346
$$ y = [14232998, 13309584, 12463478, 11684366, 10964639, 10298476, 9682114, 9113382, 8589998, 8109061, 7668127, 7265141, 6896863, 6558860, 6247656, 5961396, 5697693, 5452155, 5219915, 4997723, 4784115, 4578789, 4382541, 4196730, 4021949, 3857797, 3704129, 3561415, 3429418, 3306557, 3191192, 3082689, 2980843, 2885185, 2795295, 2710912, 2631343, 2555653, 2483631, 2415559, 2350851, 2288123, 2226962, 2168289, 2112433, 2058151, 2004292, 1951277, 1900133, 1851065, 1803838, 1758586, 1715423, 1674021, 1634366, 1597145, 1562714, 1530418, 1499559, 1470150, 1442082, 1414618, 1387591, 1362178, 1339380, 1318457, 1297870, 1277071, 1256311, 1235389, 1213923, 1192455, 1172014, 1152603, 1133223, 1113437, 1093978, 1075635, 1058249, 1041057, 1023619, 1006273]
58066A006273j6425j5035j4226j4463j4653j3339j0793q896q741r432r636r274
58054H61360r148r667j0616j1586j2105j1790j0826r904r406r054q510p827p145
58041G33776o527o300o878p989q656q333p618p452p980q593q757q534q333q462
58027F23364q810r012q944q829q774q526q010p645p638p418o480n371n017n290
58013E17600n212m525l997m068m136l564k642k113k195k439k259j435l48L04L52
57998D79323M98J384K581L152K962K716K835L128L470L919M164L785L135L040
57984E20092L425L185J775Q2p39n63r1J20m1l60m59j42K76L94L66N72P67L78m10
57965E28627q00o40n87q44q87o63r19j884k688k763k741l270l967m384n021o304
$$ y = [1006273, 989848, 974813, 960587, 946124, 931471, 918132, 907339, 898443, 889702, 880270, 870634, 861360, 852212, 842545, 831929, 820343, 808238, 796448, 785622, 775718, 766312, 757258, 748748, 740921, 733776, 727249, 720949, 714071, 706082, 697426, 689093, 681475, 674023, 666043, 657450, 648693, 640159, 631826, 623364, 614554, 605542, 596598, 587769, 578995, 570469, 562459, 554814, 547176, 539758, 533278, 527907, 522890, 517600, 512388, 507863, 503866, 499798, 495662, 492098, 489456, 487343, 485148, 482709, 480450, 479015, 478667, 478971, 479323, 479821, 481205, 483786, 486938, 489900, 492616, 495451, 498579, 502049, 505968, 510132, 513917, 517052, 520092, 523517, 526702, 528477, 528559, 527820, 527257, 527166, 527286, 527245, 526885, 526426, 526284, 526560, 526954, 527320, 527892, 528659, 529037, 528627, 527827, 527187, 526600, 525756, 524869, 524206, 523287, 521403, 518715, 515952, 513211, 509941, 505974, 501590, 496569, 490265]
57949D90265p348o997n550m290l635k940j977j352j307j079P6J892L461M260M561
57934D68040N077O293P917R059R072Q238P345O797O337N531M274K877J821J246
57920E49924O31p68l004n268o830p758q438q850q719q115p443o985o794o783o672
57905D58128o111n209m681n065o013o764p061p243p504p604p287o648o003n555
57891C69380n131m301k940j639j153j393j416o89K24N79N06O40J068J317J082
57876C56134M51m54j454k141k267k225k571l158l295k756k078j800j854j899j756
57861C26877j406p99J27J375K846M263N211N536N591N809O143O263O178O276O713
57846C87003P179P305P016O368N346M003K582J355L64n78j675k880l832m201m115
$$ y = [490265, 482917, 475920, 470370, 466080, 462445, 459505, 457528, 456176, 454869, 453790, 453866, 455758, 459219, 463479, 468040, 473117, 479410, 487327, 496386, 505458, 513696, 521041, 527838, 534175, 539706, 543980, 546857, 548678, 549924, 550555, 549787, 546783, 541515, 534685, 526927, 518489, 509639, 500920, 492805, 485362, 478377, 471583, 464800, 458128, 452017, 446808, 442127, 437062, 431049, 424285, 417224, 409981, 402477, 394873, 387586, 380938, 374935, 369380, 364249, 359948, 357008, 355369, 354216, 352823, 351407, 350718, 350942, 351521, 352027, 352667, 353735, 355052, 356134, 356585, 356131, 354677, 352536, 350269, 348044, 345473, 342315, 339020, 336264, 334186, 332386, 330532, 328633, 326877, 325471, 324672, 324799, 326174, 329020, 333283, 338494, 344030, 349621, 355430, 361573, 367836, 374014, 380290, 387003, 394182, 401487, 408503, 414871, 420217, 424220, 426802, 428157, 428521, 427943, 426268, 423388, 419556, 415355, 411240]
57831D11240m042m214m381m319m150l952l479k688k142k263k417j530L78K011
57817C74052K320J618Q83M96J64k71n09k09M81R02L35j356l501n209o283p175
57801C56738p962p873o302l985k458k312k645k382j564q55k93O70J965K524J590
57786C24856j95j450j554j011m56j6L33L74Q9M7Q30K167L070K962K329K030K215
57769C36620K273J867J562K002K780K689J279n09j535j815k142k766l212l234
57755C35859l151l182l099k704k091j262j09J004J236J69j696l611n196o214o395
57740B99558n956n678n902n976n277m264l784l749l442k830k579k767k569j540
57726B43245l65J49J52K90O31P39N31L99M96N18L02K01M99Q26O42Q0k43j94k77
$$ y = [411240, 407198, 402984, 398603, 394284, 390134, 386182, 382703, 380015, 377873, 375610, 373193, 371663, 372041, 374052, 376372, 377990, 378873, 379369, 379533, 379262, 378753, 378544, 379025, 379927, 380262, 378906, 375405, 370196, 363913, 356738, 348776, 340903, 334601, 330616, 328158, 325846, 323201, 320819, 319255, 318400, 318107, 318777, 320742, 323266, 324856, 324661, 323211, 321657, 320646, 320190, 320174, 320507, 320881, 320970, 321017, 321847, 324014, 327084, 330046, 332375, 334405, 336620, 338893, 340760, 342322, 344324, 347104, 349793, 351072, 350563, 349028, 347213, 345071, 342305, 339093, 335859, 332708, 329526, 326427, 323723, 321632, 320370, 320261, 321265, 322501, 322670, 320974, 317363, 312167, 305953, 299558, 293602, 287924, 282022, 276046, 270769, 266505, 262721, 258972, 255530, 252700, 250121, 247354, 244785, 243245, 242880, 243029, 243181, 243471, 244102, 244841, 245372, 245771, 246267, 246785, 247087, 247288, 247787, 248613, 249255, 249335, 249092, 248898, 248621]
57707B48621o59p49k58Mp79j921j860k87J365J759J053J69m20o16j99Q25J827
57690B47875K150J816J143J81q69j203k39J436K729L489M496O099P783R285J1400
57675B97571J5203K0835K7417L4016M0339M6455N1976N6029N8125N8668N7897
57664G64531N4486M6154L1906J3061q000k8975m7234n9799o5254o4997o1571n6200
57652E18108m8990m0868l3635k8198k3971k0145j6602j3433j0679q567p204n970
57640B59846m179k261j325j514j881j859j721j582j139o66q97j656j845j224q55
57625B35242j280j607j182q22j399k326k568k213j947j730j194o07m41m89m37
57610B15000o42j307j600q23J42Kq65r88k16R7n61j048m73M71P20K81l27j067
$$ y = [248621, 247962, 247213, 246955, 246959, 246180, 244259, 242399, 242112, 243477, 245236, 246289, 246458, 246038, 245422, 245223, 246048, 247875, 250025, 251841, 252984, 253165, 252296, 251093, 250854, 252290, 255019, 258508, 263004, 269103, 276886, 286171, 297571, 312774, 333609, 361026, 395042, 435381, 481836, 533812, 589841, 647966, 706634, 764531, 819017, 865171, 897077, 910138, 902138, 873163, 825929, 766130, 700876, 635879, 574308, 518108, 469118, 428250, 394615, 366417, 342446, 322301, 305699, 292266, 281587, 273020, 265816, 259846, 255667, 253406, 252081, 250567, 248686, 246827, 245106, 243524, 242385, 241719, 240822, 239166, 237321, 236097, 235242, 233962, 232355, 231173, 230351, 228952, 226626, 224058, 221845, 219898, 218168, 216974, 216367, 215926, 215437, 215000, 214358, 213051, 211451, 210628, 210770, 210772, 209907, 208919, 208703, 208800, 208239, 207191, 206718, 207189, 207909, 208190, 207863, 206796]
57592B06796k068k983l450l683l954l969l368k532k187k418k627k390j883j510
57578A67774j459j645j890k084k279k553k774k696k348k074k015j841j204l17
57564A40595K12J7p28j574k153k296k038j598j229r74o01R0R08J351J242J083
57548A32307J479K240K453J645M87k1K67O37N15K8l87n09l68j18j2k64q23j416
57530A38140j780j778j435j096j346k403l640m099l508k476j698j359j346j509
57516A08667j572j138j38R82J724K053K257K557L032L721M484M933M739L997L129
57501A43427K453K027J830J825J840J563P86k99j128j233p10j83j32l85m74l98
57485A50809o78j517k324k297j335q4P65R78P23L25P3J8j09n29r84r31k24O18
$$ y = [206796, 204728, 201745, 198295, 194612, 190658, 186689, 183321, 180789, 178602, 176184, 173557, 171167, 169284, 167774, 166315, 164670, 162780, 160696, 158417, 155864, 153090, 150394, 148046, 145972, 143957, 142116, 140912, 140595, 140807, 140824, 140096, 138522, 136369, 134073, 132035, 130437, 129208, 128234, 127633, 127723, 128631, 129982, 131224, 132307, 133786, 136026, 138479, 140124, 140611, 140590, 140857, 141494, 142009, 142037, 141650, 141141, 140773, 140655, 140643, 140379, 139556, 138140, 136360, 134582, 133147, 132051, 130705, 128302, 124662, 120563, 117055, 114579, 112881, 111522, 110176, 108667, 107095, 105957, 105819, 106801, 108525, 110578, 112835, 115392, 118424, 122145, 126629, 131562, 136301, 140298, 143427, 145880, 147907, 149737, 151562, 153402, 154965, 155751, 155452, 154324, 153091, 152381, 152198, 152066, 151681, 151207, 150809, 150131, 148614, 146290, 143993, 142658, 142574, 143339, 144317, 145040, 145365, 145438, 145456, 145347, 144818, 143834, 142903, 142679, 143297]
57467A43297R79P56L11Kk0K94Q72J390J416P97j64q93r28j93Q56J479J257N10
57449A52018o2j59o2q5j57j11m4j65m42o29n38j37M78J029J234J104Q84N60j36
57430A54580j001j178k19J040J442J065J025J700K126J496M03n0J83J59o47j697
57414A60427k164j825j074l52K05P28J337J914K173J969J409P04K3m55n35j44
57398A64340N15J040J072O12J84M37J345K069J997J632J897K723L022K133O61
57383A85679k76j44Q47K043K624K229J548J669K561K944K027O29j9J25L06L06
57367B05098M95Q99J175J303J558J844J786J433J222J308J515J812K211K346J849
57352B27854J124R57J342J486J080Q08J296K254L041L488L745L737L305K649K239
$$ y = [143297, 144276, 145032, 145343, 145345, 145325, 145619, 146491, 147881, 149297, 150094, 149930, 149037, 148109, 147916, 148772, 150251, 151508, 152018, 151956, 151797, 151735, 151650, 151493, 151382, 151338, 151173, 150731, 150102, 149564, 149427, 149905, 150934, 152168, 153272, 154156, 154716, 154580, 153579, 152401, 152182, 153222, 154664, 155729, 156754, 158454, 160580, 162076, 162479, 162429, 162612, 162771, 162124, 160427, 158263, 156438, 155364, 155012, 155217, 155945, 157282, 159196, 161369, 163338, 164747, 165451, 165474, 165019, 164484, 164340, 164855, 165895, 166967, 167579, 167763, 168200, 169545, 171614, 173611, 175243, 177140, 179863, 182885, 185018, 185679, 185403, 185259, 186106, 188149, 190773, 193002, 194550, 196219, 198780, 201724, 203751, 204380, 204361, 204486, 204792, 205098, 205593, 206492, 207667, 208970, 210528, 212372, 214158, 215591, 216813, 218121, 219636, 221448, 223659, 226005, 227854, 228978, 229935, 231277, 232763, 233843, 234651, 235947, 238201, 241242, 244730, 248475, 252212, 255517, 258166, 260405]
57337B60405K324K732L082L070K733K428K490K799K895K484J735J156J236K040
57323B93609K991L300K821K215K048K124K056K037K456L118L585L967M570M940
57309C35837M270K810J885K259L301M042M290M319M222M076M153M477M665M679
57295C89285N154O452P848Q305P764P089O915P098P303P568Q185R286J0628J1672
57281E00552J1935J1345J0228Q937P712O798O367O182N675M590L306K353J849
57268E87829J573J379J300J337J366J273J138J270J927K859L415L331L213L833
57254F17043N061N998O102N706N438N576O010O486O841P193P856Q726R137Q809
57240G11982Q490Q998R977J0476J0443J0553J0768J0401R637R552J0358J0959
$$ y = [260405, 262729, 265461, 268543, 271613, 274346, 276774, 279264, 282063, 284958, 287442, 289177, 290333, 291569, 293609, 296600, 299900, 302721, 304936, 306984, 309108, 311164, 313201, 315657, 318775, 322360, 326327, 330897, 335837, 340107, 342917, 344802, 347061, 350362, 354404, 358694, 363013, 367235, 371311, 375464, 379941, 384606, 389285, 394439, 400891, 408739, 417044, 424808, 431897, 438812, 445910, 453213, 460781, 468966, 478252, 488880, 500552, 512487, 523832, 534060, 542997, 550709, 557507, 563874, 570056, 575731, 580321, 583627, 585980, 587829, 589402, 590781, 592081, 593418, 594784, 596057, 597195, 598465, 600392, 603251, 606666, 609997, 613210, 617043, 622104, 628102, 634204, 639910, 645348, 650924, 656934, 663420, 670261, 677454, 685310, 694036, 703173, 711982, 720472, 729470, 739447, 749923, 760366, 770919, 781687, 792088, 801725, 811277, 821635, 832594]
57228H32594J0811J0848J1797J2898J3219J3164J3580J4228J4351J3997J3713
57217I75200J3522J3267J3387J4226J5098J5170J4788J4828J5164J5076J4768
57206A134494J5151J6196J6845J6676J6447J6765J7280J7526J7620J7796J8010
57195A320806J8238J8580J8962J9305J9929K1040K1989K1963K1361K1426K2497
57184A546096K3679K4426K5222K6319K7062K7058K6972K7413K7901K7803K7513
57173A837464K7751K8198K7814K6256K4192K2396K1148K0429K0008J9542J9009
57162B094207J8955J9737K0702K0723J9571J8212J7591J7562J7278J6335J5263
57151B296136J4875J5326J5959J6120J6008J6401J7614J9000J9713J9697J9722
$$ y = [832594, 843405, 854253, 866050, 878948, 892167, 905331, 918911, 933139, 947490, 961487, 975200, 988722, 1001989, 1015376, 1029602, 1044700, 1059870, 1074658, 1089486, 1104650, 1119726, 1134494, 1149645, 1165841, 1182686, 1199362, 1215809, 1232574, 1249854, 1267380, 1285000, 1302796, 1320806, 1339044, 1357624, 1376586, 1395891, 1415820, 1436860, 1458849, 1480812, 1502173, 1523599, 1546096, 1569775, 1594201, 1619423, 1645742, 1672804, 1699862, 1726834, 1754247, 1782148, 1809951, 1837464, 1865215, 1893413, 1921227, 1947483, 1971675, 1994071, 2015219, 2035648, 2055656, 2075198, 2094207, 2113162, 2132899, 2153601, 2174324, 2193895, 2212107, 2229698, 2247260, 2264538, 2280873, 2296136, 2311011, 2326337, 2342296, 2358416, 2374424, 2390825, 2408439, 2427439, 2447152, 2466849, 2486571]
57140B486571K0506K2003K3491K4243K4209K3970K3991K3950K3075K1086J8537
57129B735632J6228J4522J3378J2763J2832J3755J5517J7936K0990K5128L0908
57118B929589L8154M5793N2872N9415O5876P2157P7905Q3652R0764J00279J12576
57107C729032J28324J48843J75109K07248K45550K91462L47191M14964M97203
57098F184926N96713P15955Q56317J018128J200148J397981J603617J807540K000488
57089A7381813K172624K314194K422642K510182K597824K693358K772574K786394
57081C7651605K691789K478781K169860J797090J381396R29369M42077p6687o16813
57072D8848467j160073j679628k143663k522843k797152k958791l011699k969286
$$ y = [2486571, 2507077, 2529080, 2552571, 2576814, 2601023, 2624993, 2648984, 2672934, 2696009, 2717095, 2735632, 2751860, 2766382, 2779760, 2792523, 2805355, 2819110, 2834627, 2852563, 2873553, 2898681, 2929589, 2967743, 3013536, 3066408, 3125823, 3191699, 3263856, 3341761, 3425413, 3516177, 3616456, 3729032, 3857356, 4006199, 4181308, 4388556, 4634106, 4925568, 5272759, 5687723, 6184926, 6781639, 7497594, 8353911, 9372039, 10572187, 11970168, 13573785, 15381325, 17381813, 19554437, 21868631, 24291273, 26801455, 29399279, 32092637, 34865211, 37651605, 40343394, 42822175, 44992035, 46789125, 48170521, 49099890, 49541967, 49465280, 48848467, 47688394, 46008766, 43865103, 41342260, 38545108, 35586317, 32574618, 29605332]
57064B9605332k850962k678138k471227k248083k022956j805705j602006j414680
57056A2511575j244808j092190r55905q35119p29133o36824n56737m87996m30361
57047E542502l82927l43380l09124k78792k52188k29270k09766j93503j80226
57038C163326j69152j59194j49743j40786j32246j23558j14015j03240r1261p8239
57028A901892o4215m8818l1337j1498R340K7989M1280M8756N3210N7417N9779
57017B043795N3906L3631j204m3853q4904j17046j36876j44353j41719j32228
57007A329149j18874j03837q8824p5157o3380n3400m5257l9181l4733l0744k6637
56996F49125k3092k0839j9357j7556j5261j3195j1704j0306q469o223l919j820
$$ y = [29605332, 26754370, 24076232, 21605005, 19356922, 17333966, 15528261, 13926255, 12511575, 11266767, 10174577, 9218672, 8383553, 7654420, 7017596, 6460859, 5972863, 5542502, 5159575, 4816195, 4507071, 4228279, 3976091, 3746821, 3537055, 3343552, 3163326, 2994174, 2834980, 2685237, 2544451, 2412205, 2288647, 2174632, 2071392, 1980131, 1901892, 1837677, 1788859, 1757522, 1746024, 1755364, 1783353, 1824633, 1873389, 1926599, 1984016, 2043795, 2097701, 2131332, 2130128, 2086275, 2001371, 1884325, 1747449, 1603096, 1461377, 1329149, 1210275, 1106438, 1017614, 942457, 879077, 825677, 780420, 741239, 706506, 675762, 649125, 626033, 605194, 585837, 568281, 553020, 539825, 528121, 517815, 509346, 503123, 499204, 497384]
56984D97384m7J366K307K349Q89k113n826r268j2071j4265j5672j6062j5620j4711
56970C98640j3312j1231q725o382m302j990R00M023O671Q377R245R924J1106J2776
56956D15720J3994J3726J1709Q323L819j726p815j3391j7428j9444j9487j7951
56944C70049j5505j2831j0262p751n075k048J383N044Q648J2066J5267J7911J9391
56931C96287J9480J8549J6885J4106R619L366m133j2063j9268k4470k7131k7885
56919C63342k7538k6096k3316j9789j6562j3924j1415q944p055o021n503n254
56907A91925n417n920o271o217o069o036n776m934l737k744k221j936j292L06
56893A33661K920N929Q733J1448J4417J7237J9156K0291K1535K2898K2936K0420
$$ y = [497384, 497337, 498703, 501010, 503359, 504248, 502135, 496309, 487041, 474970, 460705, 445033, 428971, 413351, 398640, 385328, 374097, 365372, 358990, 354688, 352698, 353598, 357621, 364292, 372669, 381914, 391838, 402944, 415720, 429714, 443440, 455149, 463472, 467291, 465565, 457750, 444359, 426931, 407487, 388000, 370049, 354544, 341713, 331451, 323700, 318625, 316577, 317960, 323004, 331652, 343718, 358985, 376896, 396287, 415767, 434316, 451201, 465307, 474926, 478292, 474159, 462096, 442828, 418358, 391227, 363342, 335804, 309708, 286392, 266603, 250041, 236117, 224702, 215758, 208703, 202682, 197179, 191925, 186508, 180588, 174317, 168100, 162031, 155995, 150219, 145285, 141548, 138804, 136583, 134647, 133355, 133661, 136581, 142510, 151243, 162691, 177108, 194345, 213501, 233792, 255327, 278225, 301161, 321581]
56881C21581J5891J0897O353K340r42k954l463k739j057J427M339P116R534J1902
56867C80225J4733J8385K2981K8226L3258L7038L9031L9479L8869L7278L4133
56856G23636K8483J9564P570n891j8184k6969l1421l2294l0821k7688k3011j6979
56844E65995j0058k613N287J3550K1864L0029L8120M6020N3059N8476O2033O3767
56832I45529O3202N9159N0214L5348J4756r258l2417n0501o1696o6772o7206o3832
56820H16526n7317m8916l9972l0966k1591j1678j689P620J5831K3154L0004L6145
56808G17151M0491M2107M1232L8642L3928K5269J1494n981k3715l8488m8684n4090
56796G79356n5252n3156m8951m3510l7284l0581k3756j7097j0631m231K030P663
$$ y = [321581, 337472, 348369, 354722, 357062, 356120, 353166, 349703, 346964, 345907, 347334, 351673, 358789, 368323, 380225, 394958, 413343, 436324, 464550, 497808, 534846, 573877, 613356, 652225, 689503, 723636, 752119, 771683, 779253, 773362, 755178, 728209, 696788, 664494, 633673, 605985, 582974, 565995, 555937, 553324, 558611, 572161, 594025, 624054, 662174, 708194, 761253, 819729, 881762, 945529, 1008731, 1067890, 1118104, 1153452, 1168208, 1158950, 1126533, 1076032, 1014336, 947564, 880358, 816526, 759209, 710293, 670321, 639355, 617764, 606086, 604397, 612017, 627848, 651002, 681006, 717151, 757642, 799749, 840981, 879623, 913551, 938820, 950314, 944333, 920618, 882130, 833446, 779356, 724104, 670948, 621997, 578487, 541203, 510622, 486866, 469769, 459138, 454907, 456937, 464600]
56784D64600J2060J5089J7280J9211K0708K0795J8404J3100N274m065j3678k2514
56772E66264k9775l4608l6226l4757l1651k8576k6004k3360k0446j7855j5931
56761B67075j4214j2321j0612r412q284o719n163m500m744m913m266l050j992
56748A76885j512j557j796j837j475q91m95m77o78q75j009j052r12n87l04l05
56732A61123m86m53k7M47M91J89J30N42Q58M67l60o98p7J067J996K315J968J068
56714A70560ko38m96J41O21N49J20j01K15P53Q76M32n0j01O8M7j09j24j26m19
56694A72216q05p21o0P39J349J738J887J872K053K549K660J684J91m97j00L86
56678A87141L82M13P80P84J1o97m63K48M49J95L28J164K260L210L799L714K892
$$ y = [464600, 476660, 491749, 509029, 528240, 548948, 569743, 588147, 601247, 606521, 602456, 588778, 566264, 536489, 501881, 465655, 430898, 399247, 370671, 344667, 321307, 300861, 283006, 267075, 252861, 240540, 229928, 220516, 212232, 205513, 200350, 195850, 191106, 186193, 181927, 178877, 176885, 175373, 173816, 172020, 170183, 168708, 167817, 167322, 166845, 166167, 165292, 164283, 163231, 162319, 161732, 161428, 161123, 160637, 160184, 160157, 160604, 161095, 161284, 161414, 161956, 162814, 163281, 162921, 162223, 162146, 163213, 165209, 167524, 169492, 170560, 170558, 169920, 169424, 169565, 170186, 170735, 170855, 170754, 170969, 171722, 172598, 173030, 172980, 172879, 172947, 172994, 172885, 172761, 172635, 172216, 171411, 170690, 170630, 171369, 172718, 174456, 176343, 178215, 180268, 182817, 185477, 187161, 187352, 186855, 186755, 187141, 187523, 187936, 188716, 189500, 189511, 188814, 188351, 188599, 189048, 189243, 189571, 190735, 192995, 196205, 200004, 203718, 206610]
56661B06610J924J385R74Q2j049j566j240p44o28p20o53m41m22r22j939k945l247
56644A94459k837k568l057l803l923l426l067l207l439l331k880k199j355n21
56630A54846J12N70R24J058R59R56J242J439J150P13P82J316J625J310O44O1k69
56613A69438l76l84l85j89M59J265J489J014O51P86O47l31j314j400j309k203
56597A67858l433l260j679n34o13o06M43J506J413P71P44J167J247J169J522J825
56581A69540J177K0k53N67J136N52m18n25M20J681K590K886K580J997J819K532
56565A88301L914N218N929O165O377O790P236P494P555P415O872N867M889M489
56551B74511M403L725K210Q10M93R12R26J17q19j176j083j056j316j792k470l283
$$ y = [206610, 208534, 209919, 210893, 210975, 209926, 208360, 207120, 206376, 205748, 205028, 204375, 203934, 203512, 202590, 200651, 197706, 194459, 191622, 189054, 185997, 182194, 178271, 174845, 171778, 168571, 165132, 161801, 158921, 156722, 155367, 154846, 154958, 155528, 156452, 157510, 158469, 159425, 160667, 162106, 163256, 163969, 164751, 166067, 167692, 169002, 169646, 169707, 169438, 169062, 168678, 168293, 168104, 168563, 169828, 171317, 172331, 172982, 173768, 174415, 174084, 172770, 171370, 170061, 167858, 164425, 161165, 159486, 158952, 158339, 157733, 158176, 159682, 161095, 161866, 162610, 163777, 165024, 166193, 167715, 169540, 170717, 170737, 170484, 171051, 172187, 172739, 172321, 171796, 172216, 173897, 176487, 179373, 181953, 183950, 185769, 188301, 192215, 197433, 203362, 209527, 215904, 222694, 229930, 237424, 244979, 252394, 259266, 265133, 270022, 274511, 278914, 282639, 284849, 285659, 286152, 287064, 287990, 288107, 287288, 286112, 285029, 283973, 282657, 280865, 278395, 275112]
56535B75112l902l986l616l222l110l268l660m328n052n235m474l178k188j789
56521B24104j524j010n42o04j144j668j859j810j794j999k360k440j816p85l11
56506B02438q32j482j157p0M27l57j544j823r86JK24k28m72R1J054J453R69K71
56488A97977O2J90J06k15l77k23J83R55K031K692K234J062K78K43L26J29l0L2
56470B07655j9j98J16J107J960J913J283Q42P48P32Q09J130J458J422J125R21
56454B23004P73L62k66o34m25J52N65M02k34o85l40O17J344J369J050Q77Q30P37
56436B29498P19Q65Q83O22N91J298K319K639J921Q95M33O67J110J277J041O06
56420B47384K62J20J8k28n50o06j21P74J520J564R91N20P06J299J673J659J561
$$ y = [275112, 271210, 267224, 263608, 260386, 257276, 254008, 250348, 246020, 240968, 235733, 231259, 228081, 225893, 224104, 222580, 221570, 221028, 220424, 219280, 217612, 215753, 213943, 212149, 210150, 207790, 205350, 203534, 202749, 202438, 201606, 200124, 198967, 198897, 199324, 198967, 197423, 195600, 194614, 194615, 194839, 194611, 194139, 194230, 195284, 196737, 197706, 197977, 198039, 198229, 198335, 198120, 197743, 197520, 197703, 198658, 200689, 203381, 205615, 206677, 206955, 207198, 207524, 207653, 207623, 207655, 207636, 207438, 207554, 208661, 210621, 212534, 213817, 214659, 215407, 216139, 216948, 218078, 219536, 220958, 222083, 223004, 223777, 224139, 223873, 223239, 222814, 222966, 223531, 223933, 223699, 223014, 222674, 223291, 224635, 226004, 227054, 227931, 228761, 229498, 230217, 231082, 231965, 232587, 233178, 234476, 236795, 239434, 241355, 242250, 242683, 243350, 244460, 245737, 246778, 247384, 247646, 247766, 247784, 247556, 247006, 246400, 246279, 247053, 248573, 250137, 251128, 251648, 252354, 253653, 255326, 256985, 258546]
56403B58546J558J543J468J315Q84J81j79L13J020Q20k30r62j040j547l150m867
56387B55673n622n949p001q544r199q384o848n434m214k900j249Q52L062M491
56373A98734M661M330M648N592O105N698M997M605M289L610K589J492N39J11N46
56358B52546J479J917J381M96J79O10J329J886K037J708J138P44N38rj077j874
56342B65028j475p5J150J435J170J206J867K864L762M249M146L580K957K566K263
56327B96693J889J745K226L039L376L009K637K821L170L049K592K260J864Q97
56313C31267l01o88J8Q71J001O27M87Q28J474K248K856K808K007J158J153K123
56297C49937L388M138L999L225K480K193K088J729J365J603K311K677K546K693
$$ y = [258546, 260104, 261647, 263115, 264430, 265314, 265495, 265316, 265629, 266649, 267469, 267239, 266277, 265237, 263690, 260540, 255673, 250051, 244102, 237101, 228557, 219358, 210974, 204126, 198692, 194478, 191578, 190329, 191181, 194243, 198734, 203395, 207725, 212373, 217965, 224070, 229768, 234765, 239370, 243659, 247269, 249858, 251350, 251889, 252000, 252546, 254025, 255942, 257323, 257819, 257998, 258608, 259937, 261823, 263860, 265568, 266706, 267450, 267988, 267979, 266902, 265028, 263553, 263478, 264628, 266063, 267233, 268439, 270306, 273170, 276932, 281181, 285327, 288907, 291864, 294430, 296693, 298582, 300327, 302553, 305592, 308968, 311977, 314614, 317435, 320605, 323654, 326246, 328506, 330370, 331267, 330966, 330278, 330296, 331167, 332168, 332795, 333282, 334110, 335584, 337832, 340688, 343496, 345503, 346661, 347814, 349937, 353325, 357463, 361462, 364687, 367167, 369360, 371448, 373177, 374542, 376145, 378456, 381133, 383679, 386372]
56283C86372L418L957L854L858M538N032M425L608M271O352P984P991P140O691
56269D59491O871P253P683Q233Q890R804J1389J3685J6023J7689J8694J9593K0828
56256F26126K2535K4800K7781L1570L5982M0554M4858M8984N3513N8828O4603
56245A080134P0108P4835P8548Q1036Q2238Q2423Q1773P9883P6076P0179O2616
56234A919849N3761M3622L2130J9440N882q042k1572l3908m4539n3298o0177o5303
56222A787845o8963p1399p2590p2440p1105o8980o6381o3374n9835n5744n1474
56211A065560m7659m4440m1083l6931l2612k9484k7783k6216k3717k0712j8106
56200G16817j5936j3814j1969j0851j0139r130p815o794o303o005n627n111m333
$$ y = [386372, 389790, 393747, 397601, 401459, 405997, 411029, 415454, 419062, 423333, 429685, 437669, 445660, 452800, 459491, 466362, 473615, 481298, 489531, 498421, 508225, 519614, 533299, 549322, 567011, 585705, 605298, 626126, 648661, 673461, 701242, 732812, 768794, 809348, 854206, 903190, 956703, 1015531, 1080134, 1150242, 1225077, 1303625, 1384661, 1466899, 1549322, 1631095, 1710978, 1787054, 1857233, 1919849, 1973610, 2017232, 2049362, 2068802, 2074684, 2066642, 2045070, 2011162, 1966623, 1913325, 1853148, 1787845, 1718882, 1647483, 1574893, 1502453, 1431348, 1362368, 1295987, 1232613, 1172778, 1117034, 1065560, 1017901, 973461, 932378, 895447, 862835, 833351, 805568, 779352, 755635, 734923, 716817, 700881, 687067, 675098, 664247, 654108, 644978, 637163, 630369, 624066, 618061, 612434, 607323, 602990]
56187F02990l325k585k582l008l093k470j390k90M28N64N09R63J864K231J629
56172E92435J051J512K497K858K609K665L152L333L055L019L569M284M915N677
56158F36631O518O974P048P348Q219R306J0226J1009J1822J2775J4056J5770J7754
56145G75456J9969K2757K6229K9847L3330L7518M3452N0835N8402O5509P2479
56134A235783P9593Q6616R3177R8627J01717J01323R7371R0459Q1038O9910N8948
56123B194562M9982M3119L7185L1399K5462J8535R792j25r605j8012k5795l2904
56111B323595l8737m3776m9733n7610o6819p6185q4484r0004r1229q8375q2973
56100A553670p5843o6856n6704m7169l9184l2219k5977k1069j7536j4321j0858
$$ y = [602990, 599665, 597080, 594498, 591490, 588397, 585927, 584537, 584247, 584675, 585239, 585748, 586711, 588575, 590806, 592435, 593486, 594998, 597495, 600353, 602962, 605627, 608779, 612112, 615167, 618186, 621755, 626039, 630954, 636631, 643149, 650123, 657171, 664519, 672738, 682044, 692270, 703279, 715101, 727876, 741932, 757702, 775456, 795425, 818182, 844411, 874258, 907588, 945106, 988558, 1039393, 1097795, 1163304, 1235783, 1315376, 1401992, 1495169, 1593796, 1695513, 1796836, 1894207, 1984666, 2065704, 2135614, 2194562, 2244544, 2287663, 2324848, 2356247, 2381709, 2400244, 2410036, 2409911, 2400306, 2382294, 2356499, 2323595, 2284858, 2241082, 2191349, 2133739, 2066920, 1990735, 1906251, 1816247, 1725018, 1636643, 1553670, 1477827, 1410971, 1354267, 1307098, 1267914, 1235695, 1209718, 1188649, 1171113, 1156792, 1145934]
56089A145934p769n424l275j265k69l40L5J905M321N768O086O130O519P424Q673
56074A174453R506R159Q207Q244R846J1973J3676J5118J6500J7422J7879J8524
56062A330507J9410J9803J9760K0342K1776K2865K2923K2651K2556K2130K1342
56051A566065K1126K1539K1180J9556J8262J8679K0011K0854K1268K2099K3510
56040A794149K5339K7629K9854L1043L1454L2588L4724L6289L6597L7194L9193
56029B156053M1321M2228M2855M4695M7314M9435N1109N3011N4858N6189N7628
56018B696696N9886O2584O5315O8585P2559P6253P9203Q2394Q6406R0364R3839
56007C534084R7884J02947J07800J11887J16554J22543J28625J34281J41204J50294
$$ y = [1145934, 1138165, 1132741, 1129466, 1128201, 1127932, 1127592, 1127627, 1129532, 1133853, 1139621, 1145707, 1151837, 1158356, 1165780, 1174453, 1183959, 1193118, 1201325, 1209569, 1219415, 1231388, 1245064, 1260182, 1276682, 1294104, 1311983, 1330507, 1349917, 1369720, 1389480, 1409822, 1431598, 1454463, 1477386, 1500037, 1522593, 1544723, 1566065, 1587191, 1608730, 1629910, 1649466, 1667728, 1686407, 1706418, 1727272, 1748540, 1770639, 1794149, 1819488, 1847117, 1876971, 1908014, 1939468, 1972056, 2006780, 2043069, 2079666, 2116860, 2156053, 2197374, 2239602, 2282457, 2327152, 2374466, 2423901, 2475010, 2528021, 2582879, 2639068, 2696696, 2756582, 2819166, 2884481, 2953066, 3025625, 3101878, 3181081, 3263475, 3349881, 3440245, 3534084, 3631968, 3734915, 3842715, 3954602, 4071156, 4193699, 4322324, 4456605, 4597809, 4748103]
55997D748103J59765J68273J77283J88070J99085K08866K19063K31887K46926
55988F547321K63064K81006L01347L22719L44633L69456L98816M31041M65009
55979I724412N03324N48422N99075O54179P16425P88471Q69456R59533J063715
55970A6427012J186633J328128J489345J678827J907113K180617K507671K905849
55962C1611195L396921M000953M743840N664221O802663Q188321R842696J1783803
55954H6034613J4010056J6484567J9139253K1862524K4447085K6578434K7950757
55947B36507289K8411502K7911834K6243977K2880738J7223356R140087o72004
55940C67646779j0831650j9809605k6474395l0361051l1626241l0817531k8614317
$$ y = [4748103, 4907868, 5076141, 5253424, 5441494, 5640579, 5849445, 6068508, 6300395, 6547321, 6810385, 7091391, 7392738, 7715457, 8060090, 8429546, 8828362, 9259403, 9724412, 10227736, 10776158, 11375233, 12029412, 12745837, 13534308, 14403764, 15363297, 16427012, 17613645, 18941773, 20431118, 22109945, 24017058, 26197675, 28705346, 31611195, 35008116, 39009069, 43752909, 49417130, 56219793, 64408114, 74250810, 86034613, 100044669, 116529236, 135668489, 157531013, 181978098, 208556532, 236507289, 264918791, 292830625, 319074602, 341955340, 359178696, 368318783, 367646779, 356815129, 337005524, 310531129, 280170078, 248543837, 217726306, 189111989]
55933A89111989k5645940k2409363j9249321j6365419j3840422j1685313r877674
55926G0038537q377954p136184o103634n242139m521412l913577l395896k954570
55918B8393171k580134k261465j987937j753745j555189j386038j239425j111895
55910A4517343j001746r05626q20283p45422o81338o25543n74903n29181m89328
55901H143973m54076m21317l91043l63909l38466l12886k88040k65895k46070
55892E062271k26753k07852j90488j74278j57843j41234j25448j10181r4339p8151
55882C555704o2747m8237l4222k1492j1279l473K319M527L54j1356k9377n1544
55870C289177p5282r7354j14947j27149j34347j36743j34570j29079j21814j13373
$$ y = [189111989, 163466049, 141056686, 121807365, 105441946, 91601524, 79916211, 70038537, 61660583, 54524399, 48420765, 43178626, 38657214, 34743637, 31347741, 28393171, 25813037, 23551572, 21563635, 19809890, 18254701, 16868663, 15629238, 14517343, 13515597, 12609971, 11789688, 11044266, 10362928, 9737385, 9162482, 8633301, 8143973, 7689897, 7268580, 6877537, 6513628, 6175162, 5862276, 5574236, 5308341, 5062271, 4835518, 4627666, 4437178, 4262900, 4105057, 3963823, 3838375, 3728194, 3633855, 3555704, 3492957, 3444720, 3410498, 3389006, 3377727, 3374254, 3376573, 3381100, 3381454, 3370098, 3340721, 3289177, 3213895, 3116541, 3001594, 2874445, 2740098, 2603355, 2468785, 2339706, 2217892, 2104519]
55860B104519j03931r4336q5527p7520p0001o3306n7718n2696m7884m3971m1427
55849A366202l9358l6903l4688l3561l2795l1162k8890k7051k5695k4198k2804
55838A029097k2173k1901k1014j9529j8146j6913j5544j4513j4387j4566j4101
55827H36310j3289j3018j3099j2709j2014j1796j1890j1612j1295j1735j2435
55816G01418j2149j1031j0452j0722j0694r726q390p047n365l600k730k805k571
55803F04136j278L33J417K190L158M184M932N331N213M319K994K080J713J093
55789F41815k74j983l655n476p334q411q303p799p909q769r991j1520j3339j4821
55775E32231j5080j3829j1442q400n127k141J05J570K508K994K693J222j240l838
$$ y = [2104519, 2000588, 1906252, 1820725, 1743205, 1673204, 1609898, 1552180, 1499484, 1451600, 1407629, 1366202, 1326844, 1289941, 1255253, 1221692, 1188897, 1157735, 1128845, 1101794, 1076099, 1051901, 1029097, 1006924, 985023, 964009, 944480, 926334, 909421, 893877, 879364, 864977, 850411, 836310, 823021, 810003, 796904, 784195, 772181, 760385, 748495, 736883, 725588, 713853, 701418, 689269, 678238, 667786, 657064, 646370, 636644, 628254, 621207, 615842, 612242, 609512, 606707, 604136, 602858, 603191, 604608, 606798, 609956, 614140, 619072, 624403, 629616, 633935, 636929, 639009, 640722, 641815, 641541, 639558, 635903, 630427, 623093, 614682, 606379, 598580, 590671, 581902, 571911, 560391, 547052, 532231, 517151, 503322, 491880, 483480, 478353, 476212, 476317, 477887, 480395, 483389, 486082, 487304, 486064, 482226]
55761D82226n727o899p955q964r150q075o633o192p052q397r449r985r927r267
55747C68554q449q092q233q331q043p480o709n628m319l108k173j533j255j282
55733B93919j206p67l75n80j212j729k174l006m111m839m996m960m818m240l341
55718B51565k701k343j599l72M20J72m36l44N89J790K858L646L915L535K725J572
55702B64992l18k987n354o117n438m908n536o445o125m534l231l354m186m167
55688B02292k919j527r06p03j56O64J072R05P37J062J712K134J906J057J09l57
55672B07082l91o81j591k623l155l266l226k701j302L59J153R00N27P21J249J709
55656A94764K102K404K408K322K756L752M466M237L449K834K529K279K126K215
$$ y = [482226, 476499, 469600, 461645, 452681, 443531, 435456, 428823, 422631, 415579, 407182, 397733, 387748, 377821, 368554, 360105, 352013, 343780, 335449, 327406, 319926, 313217, 307589, 303270, 300162, 297989, 296456, 295201, 293919, 292713, 291946, 291571, 290991, 289779, 288050, 285876, 282870, 278759, 273920, 268924, 263964, 259146, 254906, 251565, 248864, 246521, 244922, 244550, 244970, 245142, 244706, 244362, 244951, 246741, 249599, 253245, 257160, 260695, 263420, 264992, 264674, 261687, 256333, 250216, 244778, 239870, 234334, 227889, 221764, 217230, 213999, 210645, 206459, 202292, 199373, 197846, 196940, 196237, 196081, 196745, 197817, 198722, 199459, 200521, 202233, 204367, 206273, 207330, 207439, 207082, 206691, 206010, 204419, 201796, 198641, 195375, 192149, 189448, 188146, 188505, 189658, 190558, 191085, 191806, 193055, 194764, 196866, 199270, 201678, 204000, 206756, 210508, 214974, 219211, 222660, 225494, 228023, 230302, 232428, 234643]
55642B34643K216J544N9j837l684n187o108o339o153o079o411o896o925o068m500
55627A72275k903j800j133o07l26o35j416k012k006j708j658j916k068j795j211
55612A49081o85m35l43k10j28l96r32j207r73o84q40j243j398j310j271j221j016
55595A34789j050j726k449k149q74J11M5m36m55k0M59R03J222R86J54m53j33P84
55577A29708J543K076K732L411L721L733L843M087M185M113L965L474K375J072
55563A74038K92J10n3n20j112j779k751l930m783m989m679l975k905j974j985
55548A39005k903l541k959j649p44m46q1M89M83n48j824k183j459m84L7J62K50
55531A21605M00M70M54M96O41P06M87M6k29L7P32J271J253R96J106J610J950J953
$$ y = [234643, 236859, 238403, 238462, 236625, 232941, 227754, 221646, 215307, 209154, 203075, 196664, 189768, 182843, 176775, 172275, 169372, 167572, 166439, 165832, 165506, 164871, 163455, 161443, 159437, 157729, 156071, 154155, 152087, 150292, 149081, 148396, 147961, 147618, 147408, 147280, 146884, 145952, 144745, 143772, 143088, 142248, 141005, 139607, 138297, 137026, 135805, 134789, 133739, 132013, 129564, 127415, 126541, 126652, 126697, 126261, 125806, 125786, 126245, 127148, 128370, 129356, 129510, 129057, 128924, 129708, 131251, 133327, 136059, 139470, 143191, 146924, 150767, 154854, 159039, 163152, 167117, 170591, 172966, 174038, 174330, 174440, 174387, 173867, 172755, 170976, 168225, 164295, 159512, 154523, 149844, 145869, 142964, 140990, 139005, 136102, 132561, 129602, 127953, 127209, 126763, 126682, 127171, 127654, 127106, 125282, 123099, 121640, 121156, 121193, 121355, 121605, 122005, 122475, 122929, 123425, 124066, 124772, 125259, 125305, 125076, 125113, 125845, 127116, 128369, 129365, 130471, 132081, 134031, 135984]
55513A35984K266L510N334O774P312P086O220M580K262j02j941l302m660o231
55499A65092p642q229p667o385n257m729m380l619k603k006j968j829j090j85
55485A07503P4n38j493k078j862q61L57R23L89p18j328q58K81J178J220M92m32
55468A02249j002j082q66m95P2P51J136Q98L20Q6M24P35L21o78j433j471j159
55451I8806r68p97l85N2J36J26N85J318J426O47j22n3N25P87N77K67M3l9L25J197
55431A04453J860J551N29l09o77q98r19l31O15J072Q49O87J012J345J277J205
55415A13321J527J854J653J115P37N42K52j23l97o29r34j171j221j317j686k155
55399A11368k417k481k464k207j495m49N59J226J381R61K25k88k92qJ72L4m56
$$ y = [135984, 138250, 141760, 147094, 153868, 161180, 168266, 174486, 179066, 181328, 181226, 179285, 175983, 171323, 165092, 157450, 149221, 141554, 135169, 129912, 125183, 120803, 117184, 114581, 112575, 110607, 108778, 107688, 107503, 107577, 107039, 105546, 103468, 101606, 100745, 101102, 102025, 102414, 101696, 100368, 99510, 99791, 100969, 102189, 102681, 102249, 101247, 100165, 99299, 98804, 98876, 99627, 100763, 101661, 101981, 102067, 102491, 103226, 103547, 102869, 101436, 99965, 98806, 97838, 97041, 96656, 96708, 96844, 96970, 97555, 98873, 100299, 100946, 100824, 100771, 101296, 102083, 102660, 102927, 102970, 102931, 103256, 104453, 106313, 107864, 108393, 108084, 107407, 106509, 105590, 105259, 105874, 106946, 107795, 108482, 109494, 110839, 112116, 113321, 114848, 116702, 118355, 119470, 120207, 120749, 121001, 120878, 120481, 119852, 118918, 117747, 116526, 115209, 113523, 111368, 108951, 106470, 104006, 101799, 100304, 99855, 100414, 101640, 103021, 103982, 104207, 103919, 103627, 103619, 103791, 103825, 103369]
55382A03369j081j285o91J46K02n78j089o60NR7O3P61J892K375J991J576J597
55365A08690J540R03J2n32o56p54j102j594j862j619r64l24jP3L1j43l71l56p5
55346A00896M5k80p35r94j211j489j314k67J053J595J142L75j07j92J24O90R49
55329A00280N13m3J88J042J362O45k74m27J08O12O89M25O2j85k73m39q21r90l92
55310A02082P35J481J396R04M86J60l5J95P54R53M07l43n84l52j93l39n71o19
55292A06517l98k0J71n7l62j38N77J056R28O56O45N81J32l43l73j71j75k66j20
55273A08840L3k40p52r10o03j94J60M60M45l5m44j44M59L61m49p79O8J236J502
55254A09014P73r3m43k89rq2p97j767k076j275QQ73J147J143Q05r2j096j238k68
$$ y = [103369, 102288, 101003, 100312, 100458, 100660, 100082, 98993, 98333, 98338, 98435, 98498, 99259, 101151, 103526, 105517, 107093, 108690, 110230, 111133, 111145, 110613, 109957, 109203, 108101, 106507, 104645, 103026, 102062, 101738, 101737, 101810, 101841, 101698, 101327, 100971, 100896, 100941, 100661, 99926, 98932, 97721, 96232, 94918, 94651, 95704, 97299, 98441, 98816, 98709, 98517, 98641, 99331, 100280, 100793, 100750, 100938, 101980, 103342, 103987, 103713, 103286, 103394, 104006, 104695, 105120, 105182, 104997, 104724, 104285, 103464, 102474, 102082, 102817, 104298, 105694, 106598, 107084, 107244, 107209, 107404, 108158, 109111, 109518, 109175, 108591, 108239, 108046, 107707, 107136, 106517, 106119, 106099, 106270, 106213, 105851, 105713, 106290, 107346, 108274, 108930, 109575, 110156, 110288, 109945, 109572, 109401, 109226, 108960, 108840, 108873, 108633, 107881, 106971, 106368, 106174, 106334, 106794, 107239, 107204, 106760, 106616, 107075, 107436, 106987, 106208, 106276, 107512, 109014, 109787, 109694, 109251, 108962, 108953, 108871, 108074, 106307, 104231, 102956, 102964, 103837, 104984, 106127, 106932, 106840, 105744, 104506, 104238]
55235A04238Q95J233P26P4k77m37n41m15J22P90R86M22m23p78n36m09q74j333
55217A03463q87K76R56N57j09j8O95J153J116J203J798K389K176R80n70j574j561
55200A12043r26n77r24j365j138m11k3k40m61k21K15M70O27P90P05K28k46k84
55182A08262j8J88L25N10N81M27M19Q50J238Q20l12j177j058j67P90J300J246
55165A14224R54R31J217J130J51j129j663j386j148j191p71M36J555J708J202
55150A16220Q41O83L02k13m68o03j096j771j873j130q0P36J213J261O84k59q10
55133A13637n73J7M37O93Q61N63m07j352j283k48O58O61J8o41j053j126n80N56
55115A10838J544J636R69K90p8l92o96o14q9K91J20k00n8M87R03R84R87J110J313
$$ y = [104238, 105133, 106366, 107092, 107166, 106889, 106452, 105911, 105496, 105618, 106408, 107394, 107816, 107393, 106615, 106079, 105670, 104796, 103463, 102576, 102852, 103808, 104365, 104256, 104238, 104933, 106086, 107202, 108405, 110203, 112592, 114768, 115748, 115178, 113604, 112043, 111117, 110540, 109616, 108251, 107113, 106702, 106679, 106439, 105978, 105757, 105972, 106442, 107069, 107859, 108564, 108792, 108546, 108262, 108244, 108432, 108757, 109267, 109848, 110275, 110694, 111544, 112782, 113602, 113290, 112113, 111055, 110888, 111678, 112978, 114224, 115178, 116109, 117326, 118456, 118607, 117478, 115815, 114429, 113281, 112090, 111319, 111755, 113310, 115018, 116220, 117061, 117744, 118046, 117833, 117365, 116762, 115666, 113895, 112022, 110892, 110812, 111548, 112761, 114022, 114706, 114447, 113637, 113064, 113081, 113518, 114211, 115072, 115635, 115228, 113876, 112593, 112345, 113003, 113664, 113682, 113041, 111988, 110862, 110282, 110838, 112382, 114018, 114987, 115277, 115199, 114807, 114111, 113497, 113408, 113699, 113819, 113619, 113561, 114048, 114951, 115935, 116922, 118032, 119345]
55096A19345J538J732J681J252P22N25O37O48M20K12J12j91p82j143p24K89J087
55079A27360J076L66m44q68r00q48q63o99q9P55J211Q65m6q70j097p41l08l14
55061A23546o94q47l98K29L42o8l46j01L18L59j02p34j106r57m12J6j1j55J88
55042A19067R58J386J022L07j08j91l25o26q30o68j09N78Q60L45o51j231q81K9
55024A18932Q38J346J664J746J469R67M71k9o08j111j323j294j153q21k34L85
55008A21245P63Q71O85M3q38j090j26J333J926J341N78M74P39P20M46K84J42l10
54990A29226q12o89J48Q60O79j29o25l44K21K84l43j069j095j00J458K604K599
54973A32873J633O72N10J064J737K078J886J026l16j400j586j158q91q50l60P05
$$ y = [119345, 120883, 122615, 124296, 125548, 126270, 126795, 127432, 128080, 128500, 128712, 128824, 128633, 127851, 126708, 125984, 126273, 127360, 128436, 128802, 128358, 127490, 126590, 125742, 124879, 124180, 124091, 124846, 126057, 126922, 126876, 126006, 124909, 124168, 123860, 123546, 122852, 122005, 121607, 121836, 122178, 122110, 121764, 121663, 121981, 122340, 122238, 121504, 120398, 119441, 119029, 119045, 119034, 118879, 119067, 120025, 121411, 122433, 122740, 122632, 122441, 122116, 121490, 120660, 119992, 119883, 120461, 121321, 121666, 121015, 119784, 118903, 118932, 119770, 121116, 122780, 124526, 125995, 126962, 127433, 127404, 126796, 125685, 124362, 123068, 121915, 121094, 120860, 121245, 122008, 122879, 123564, 123607, 122769, 121679, 121553, 122886, 124812, 126153, 126731, 127205, 127944, 128664, 129110, 129394, 129536, 129226, 128414, 127725, 127873, 128733, 129412, 129283, 128658, 128314, 128535, 128819, 128476, 127407, 126312, 126212, 127670, 130274, 132873, 134506, 135178, 135688, 136752, 138489, 140567, 142453, 143479, 143163, 141763, 140177, 139019, 138128, 137278, 136918, 137623]
54957A37623J482J325P01M00N13O77P67P49L90l01p68o98n71q29j013n16L09P09
54939A40949P40R08R72K51r66j580j254p18l84J04P25Q34N00Q76K471M148M683
54922A53259M410M324M504M532M811O090P936Q933Q464P238N962M502K644P39
54908B28348q88k561m679o897q341q549p867o954o182n441m500l422k572k128
54894A57367j865j560j327j277j084l53P13J510J852K133K496K436J554L51j33
54879A62813O11K139L637M616N056N156N228N635O532P447P377N631K646k90k198
54864B22036l115l681m359n173n864o072n669n081n002n474n671m957l800l128
54850A54990l072l041k805k716k865k820k374j850j449r31l25j91o90r84l13P82
$$ y = [137623, 139105, 140430, 141131, 141531, 142044, 142721, 143488, 144237, 144627, 144326, 143558, 142860, 142289, 141460, 140447, 139931, 140240, 140949, 141689, 142597, 143569, 143820, 142854, 141274, 140020, 139302, 138918, 139022, 139747, 140581, 141081, 141957, 144428, 148576, 153259, 157669, 161993, 166497, 171029, 175840, 181930, 189866, 198799, 207263, 214501, 220463, 224965, 227609, 228348, 227460, 224899, 220220, 213323, 204982, 196433, 188566, 181612, 175430, 169989, 165489, 162067, 159495, 157367, 155502, 153942, 152615, 151338, 150254, 149901, 150614, 152124, 153976, 156109, 158605, 161041, 162595, 162946, 162813, 163424, 165563, 169200, 173816, 178872, 184028, 189256, 194891, 201423, 208870, 216247, 221878, 224524, 224234, 222036, 218921, 215240, 210881, 205708, 199844, 193772, 188103, 183022, 178020, 172546, 166875, 161918, 158118, 154990, 151918, 148877, 146072, 143356, 140491, 137671, 135297, 133447, 131998, 131067, 130742, 130551, 129861, 128877, 128564, 129346]
54834A29346J118N31M6L61J005J228J036R34J049J053P16J04o27j275j423p27
54818A34475N15J366J180L39j76M8M87N16K09K5L5o5l29m91n10p03j076j042j74
54799A34629J085J833J604O17n91j423j411o32J87M13K22K20N08O80O06N94P71
54782A39912Q93Q88J005J231J146O57L11N02R24J202J592K452L453L997M253N009
54766A69427O451P720P937P272O668O723P026O686N409L881K884K162P32j652
54752B39326m013n455o294p250q097q069p196o262n489m366k832j639j202j028
54738A70134o87n67j066j784k115k086j965j579o83M13J229J803K450L087L458
54723A70042L699M072M434M577M831N609O555O845O242N148L761K002J72j213
$$ y = [129346, 130464, 130995, 131041, 131402, 132407, 133635, 134671, 135605, 136654, 137707, 138423, 138527, 137900, 136625, 135202, 134475, 134990, 136356, 137536, 137875, 137699, 137747, 138234, 138750, 138959, 138984, 139019, 138954, 138625, 138134, 137624, 136921, 135845, 134803, 134629, 135714, 137547, 139151, 139768, 139177, 137754, 136343, 135711, 135898, 136311, 136533, 136753, 137261, 137941, 138547, 139141, 139912, 140805, 141693, 142698, 143929, 145075, 145732, 146043, 146545, 147469, 148671, 150263, 152715, 156168, 160165, 164418, 169427, 175878, 183598, 191535, 198807, 205475, 212198, 219224, 225910, 231319, 235200, 238084, 240246, 240978, 239326, 235313, 229858, 223564, 216314, 208217, 200148, 192952, 186690, 181201, 176835, 174003, 172364, 171162, 170134, 169447, 168880, 167814, 166030, 163915, 161829, 159864, 158285, 157602, 158015, 159244, 161047, 163497, 166584, 170042, 173741, 177813, 182247, 186824, 191655, 197264, 203819, 210664, 216906, 222054, 225815, 227817, 227989, 226776]
54709B26776k314l813n676o950p121o763o464n973n044m260m132m014k954j287
54695A60011l46n91j055q73m52o25j250j425q14j70l75j331k074j896j159q46
54679A44729j357j937j584l01Q84J204R53P45N15j36q37o19N57J283M43j129j620
54662A41793o50L22Q5q73j459j516j497j318n30O46J444J624J599J599J414J087
54646A43770R65R76N92k04o84n03l37q62j651j691o93O60J525J562R42J40l94
54629A44113n73n46k75L59R48P15l28j062o79J21J24n98q13M1J060J124K52o20
54611A43363p89l41J68L71M24P22J251J476R81J02m19j87O18J530K015J718R13
54594A53916M31O36P79l0j465k323k085j378q64n62l19j79k3M15Q66O59j52n67
$$ y = [226776, 224462, 220649, 214973, 208023, 200902, 194139, 187675, 181702, 176658, 172398, 168266, 164252, 161298, 160011, 159665, 159074, 158019, 157146, 156694, 156069, 154819, 153394, 152580, 152410, 152035, 150704, 148630, 146734, 145575, 144729, 143372, 141435, 139851, 139550, 140434, 141638, 142591, 143336, 143851, 143715, 142878, 142259, 142816, 144099, 144542, 143413, 141793, 141143, 141465, 141550, 140677, 139218, 137702, 136205, 134887, 134357, 135003, 136447, 138071, 139670, 141269, 142683, 143770, 144735, 145711, 146303, 146099, 145415, 144912, 144575, 143713, 142062, 140371, 139678, 140338, 141863, 143425, 144367, 144507, 144113, 143540, 142994, 142719, 143078, 144026, 144741, 144413, 143351, 142672, 142793, 142917, 142319, 141506, 141547, 142607, 143731, 143983, 143363, 142574, 142233, 142401, 142772, 143196, 143918, 145169, 146645, 147626, 147728, 147309, 147122, 147740, 149270, 151285, 153003, 153916, 154347, 154983, 155762, 155732, 154267, 151944, 149859, 148481, 147617, 147055, 146736, 146557, 146534, 146949, 147815, 148474, 148322, 147755]
54576A47755n5N49K65n95r63n53PK99M84O72O96O00O73Q68P75L03j15j96j78l42
54556A50949n53n66m58m41m44k07K90P02O89K68j88l24q4L33P65J181J498J589
54538A54999J474J271R42L97k1K55J011J070j91j612j509O7J320J097K15l0K77
54521A61032J58n33q54j75R35J421Q56k94j246j531j228o71o2N24Q71P51L98L45
54503A60697N95M57l96j220j129l64J10L6Q4N95R95P63K68J40L29L19qk86l29
54484A61656m09p33r88n87O12J952K462J863R47P24J308J935K052J832J594J254
54468A77474P16L70O01J133J287Q94M32L57O11Q45P38J49p46j354j113j51P02
54451A82945P20j0p99j084q99o66o98q84r29q37j003j670k362k237j051M12J036
$$ y = [147755, 147700, 148249, 148514, 147919, 146956, 146403, 146410, 146709, 147193, 147865, 148561, 149161, 149834, 150702, 151477, 151780, 151665, 151469, 151291, 150949, 150396, 149830, 149372, 148931, 148487, 148280, 148570, 149272, 149961, 150229, 150041, 149717, 149633, 149966, 150731, 151912, 153410, 154999, 156473, 157744, 158686, 159083, 159062, 159317, 160328, 161398, 161207, 159595, 158086, 158153, 159473, 160570, 160785, 160755, 161032, 161190, 160657, 159803, 159628, 160563, 161984, 162840, 162546, 161300, 159769, 158541, 157870, 157808, 158332, 159203, 159954, 160352, 160697, 161292, 161749, 161353, 160133, 159004, 158640, 158750, 158786, 158870, 159465, 160460, 161223, 161491, 161631, 161960, 162279, 162271, 161985, 161656, 161247, 160514, 159526, 158939, 159551, 161503, 163965, 165828, 166775, 167499, 168807, 170742, 172794, 174626, 176220, 177474, 178190, 178560, 179161, 180294, 181581, 182475, 182907, 183264, 183875, 184720, 185458, 185607, 184861, 183507, 182394, 182243, 182945, 183665, 183655, 182856, 181772, 180873, 180207, 179509, 178625, 177696, 176859, 175856, 174186, 171824, 169587, 168536, 168948, 169984]
54434A69984M60o22j220r86l68P8K72M19M79J95l83q18q33n82k67J30N13N12M4
54415A67007l02J09J108J931K114J778J197N78J46N6J69L09N36Q61R26M82M6L14
54397A79365J055J319P68O3k25k77l61k99J2K29K36M98J167J443N91q46j594j233
54379A81911n05j58j99k92l15l23l60m38m81k86J88O18O16K07k44m29k70J69O70
54360A80079R45R63R73J031Q17K35k57l02k83p38j494j967k067k085j835q28O74
54343A73861J504Q59p69k154k471j774p35q7j1l8K39N70N23L26N56J114J272P62
54325A73547P8m00p57q60k41R60J752J580J129J256J778J999J934K103K523K700
54309A91081K474K117J669Q90j46r70j346j486j625j769j862j817j470q88o67
$$ y = [169984, 170444, 169822, 168602, 167616, 167248, 167326, 167598, 168017, 168496, 168691, 168308, 167490, 166657, 166075, 165808, 165938, 166451, 166963, 167007, 166705, 166814, 167922, 169853, 171967, 173745, 174942, 175520, 175666, 175722, 175891, 176200, 176736, 177597, 178523, 179005, 179051, 179365, 180420, 181739, 182507, 182570, 182345, 182068, 181707, 181408, 181420, 181649, 181885, 182383, 183550, 184993, 185584, 184738, 183144, 181911, 181406, 181248, 181049, 180757, 180442, 180119, 179759, 179321, 178840, 178554, 178742, 179360, 179976, 180183, 179939, 179510, 179240, 179409, 180079, 181024, 181987, 182960, 183991, 184808, 185043, 184786, 184484, 184201, 183463, 181969, 180002, 177935, 175850, 174015, 173187, 173861, 175365, 176224, 175455, 173301, 170830, 169056, 168321, 168234, 168223, 168185, 168424, 168994, 169517, 169843, 170399, 171513, 172785, 173547, 173625, 173225, 172468, 171608, 171367, 172327, 174079, 175659, 176788, 178044, 179822, 181821, 183755, 185858, 188381, 191081, 193555, 195672, 197341, 198231, 198085, 197115, 195769, 194283, 192658, 190889, 189027, 187210, 185740, 184852, 184185]
54294A84185j302k337k695j967q88l39m00o26p73r05j029j024q54n66k06J60L63
54277A68797L09J29P1K25M85P02Q35Q79P07J28p81j462j295l44N44O18L8m31l17
54258A69837J95O68P86M40j47m08O0Q88J257R07M26L69N48M87K20J95N71J009
54240A78308J141R03L53m78j414k039j989j337n43LK50L06J16m07r88j051l52
54223A70782N40P35l8j177j852j732j091m28r4r8j82j08J26L74N50N75K95k84
54205A66893p41o08k4L29J28j48R1P20J127J046P70N59K71k35o18l31O46J545
54187A71420J542O95j10k06N2j35q89j516j468r76n38k33J68O89J092J206J032
54170A71825O46K09j06l76q98j620j924j351l01M55P27R30J186J104N19j20l61
$$ y = [184185, 182883, 180546, 177851, 175884, 174996, 174657, 174257, 173631, 172858, 171953, 170924, 169900, 169046, 168480, 168274, 168434, 168797, 169106, 169235, 169306, 169531, 170016, 170718, 171553, 172432, 173139, 173267, 172486, 171024, 169729, 169385, 169929, 170547, 170585, 170154, 169837, 170032, 170700, 171486, 171926, 171779, 171371, 171431, 172319, 173576, 174483, 174909, 175278, 175826, 176313, 176533, 176728, 177299, 178308, 179449, 180352, 180705, 180227, 178813, 176774, 174785, 173448, 172905, 172908, 173158, 173464, 173580, 173173, 172185, 171134, 170782, 171322, 172057, 172019, 170842, 168990, 167258, 166167, 165739, 165645, 165547, 165365, 165257, 165383, 165757, 166307, 166882, 167177, 166893, 166152, 165544, 165520, 165849, 165977, 165829, 165920, 166640, 167767, 168813, 169583, 170142, 170413, 170178, 169560, 169229, 169875, 171420, 172962, 173657, 173547, 173341, 173393, 173258, 172369, 170853, 169385, 168409, 167871, 167638, 167806, 168495, 169587, 170793, 171825, 172471, 172680, 172574, 172198, 171300, 169680, 167756, 166405, 166104, 166559, 167286, 168216, 169402, 170506, 171025, 170905, 170544]
54153A70544l11l14l78k85N1N15R47J137Q67J93m99r38j177j284j091n24R0M26
54135A67969O10R04J151R71M01r4k06j4K94N15L34l11q03l27R61J788J203k42
54117A75104j117o82M87J290J155L94j51J00Q61J287R89N12M70N73L0j204k193
54100A77905k115j199k83J46K00J69K13L67N43N05O3o29j082q75k2J026J760J973
54082A78665J802J446R56L56j68m09l77k10J40Q18J632J995J521N59j24r4L92
54065A88900P13M33l30r04n97N64J633J540K58j050j186j22J046J299O61l1j04
54048A92723M19J134J769K242K426K268K054K212K732L091K953K723L053L958
54034B25757M792N128N274N766O574P095O843N884M666L690L301L550L989L869
$$ y = [170544, 170233, 169919, 169541, 169256, 169307, 169822, 170769, 171906, 172773, 172966, 172467, 171529, 170352, 169068, 167977, 167453, 167543, 167969, 168579, 169483, 170634, 171605, 172006, 171912, 171706, 171692, 171986, 172501, 172835, 172524, 171721, 171394, 172355, 174143, 175346, 175104, 173987, 173305, 173792, 175082, 176237, 176631, 176480, 176580, 177441, 178728, 179717, 180229, 180699, 181272, 181302, 180098, 177905, 175790, 174591, 174308, 174454, 174654, 174823, 175036, 175403, 175946, 176451, 176514, 175885, 174803, 173928, 173906, 174932, 176692, 178665, 180467, 181913, 182869, 183225, 183057, 182648, 182271, 182061, 182201, 183019, 184651, 186646, 188167, 188726, 188602, 188508, 188900, 189613, 190046, 189716, 188812, 188215, 188779, 190412, 191952, 192210, 191160, 189974, 189852, 190898, 192197, 192858, 192827, 192723, 193142, 194276, 196045, 198287, 200713, 202981, 205035, 207247, 209979, 213070, 216023, 218746, 221799, 225757, 230549, 235677, 240951, 246717, 253291, 260386, 267229, 273113, 277779, 281469, 284770, 288320, 292309, 296178]
54020B96178K807J297L21L55Q82J038N12l15r74j405j731j938j939j945k408l414
54004B87321m323m304l371k543k685l383l410k325j074p72j377j959j902j293
53990B52600l57Q37K118L239M252N453O885Q327R713J1056J1929J1709J0512R127
53976C47400P803N812K640j157m824q350j1747j4084j4370j3020j1406j0122q714
53963B65861o963n324l978k644j556j428k075k196j214k43m03j060q90M7N52K68
53947B36754P7N77J298J702J921K186K311K229K407L182M094M361L767K796K098
53932B71760K017K412K717K459J895J853K695L749M083L615L124L287M004M658
53918C14328M757M359M004M205M937N692O074O205O378O575O555O238N764N181
$$ y = [296178, 298985, 300282, 300603, 300958, 301840, 302878, 303390, 303075, 302101, 300696, 298965, 297027, 295088, 293143, 290735, 287321, 282998, 278694, 275323, 272780, 270095, 266712, 263302, 260977, 259903, 259131, 257754, 255795, 253893, 252600, 252243, 253080, 255198, 258437, 262689, 268142, 275027, 283354, 293067, 304123, 316052, 327761, 338273, 347400, 355203, 361015, 363655, 362498, 357674, 349324, 337577, 323493, 309123, 296103, 284697, 274575, 265861, 258898, 253574, 249596, 246952, 245396, 243968, 241893, 239697, 238483, 238240, 237837, 236777, 235887, 235934, 236486, 236754, 236831, 237408, 238706, 240408, 242329, 244515, 246826, 249055, 251462, 254644, 258738, 263099, 266866, 269662, 271760, 273777, 276189, 278906, 281365, 283260, 285113, 287808, 291557, 295640, 299255, 302379, 305666, 309670, 314328, 319085, 323444, 327448, 331653, 336590, 342282, 348356, 354561, 360939, 367514, 374069, 380307, 386071, 391252]
53904C91252M415L525K722K068J305K12j031j941k241k160k213k663l311l824
53890C86115m140m439m786n081n281n520n883o284o644o991p249p148o530n578
53876C04561m628l879l383l161l105k953k589k273k340k733l093l199l112k932
53862B61181k635k198j710j294j051j051j287j637j999k353k618k624k294j814
53848B34616j378r83n88k75r3P0K03K9m99q15m07L07L72m22j255j374r00l30J81
53829B26459O52Q77O60K02m6J65Q28J738K494K741K710L145M326N588O161O259
53813B64959O735P922R371J0624J1607J2151J1775J0178P670M833J937j029l858
53800C54875n898o458n555m120l197k890k459j500n29j35n7K60O84O88M47O57
$$ y = [391252, 395667, 399192, 401914, 403982, 405287, 405499, 404468, 402527, 400286, 398126, 395913, 393250, 389939, 386115, 381975, 377536, 372750, 367669, 362388, 356868, 350985, 344701, 338057, 331066, 323817, 316669, 310139, 304561, 299933, 296054, 292671, 289510, 286405, 283452, 280863, 278590, 276250, 273517, 270424, 267225, 264113, 261181, 258546, 256348, 254638, 253344, 252293, 251242, 249955, 248318, 246319, 243966, 241348, 238724, 236430, 234616, 233238, 232255, 231667, 231392, 231299, 231369, 231572, 231601, 231102, 230287, 229880, 230187, 230559, 230137, 228882, 227508, 226608, 226278, 226459, 227111, 227988, 228648, 228850, 228804, 228969, 229797, 231535, 234029, 236770, 239480, 242625, 246951, 252539, 258700, 264959, 271694, 279616, 288987, 299611, 311218, 323369, 335144, 345322, 352992, 357825, 359762, 358733, 354875, 348977, 342519, 336964, 332844, 329647, 326757, 324298, 322798, 322269, 322134, 322077, 322337, 323021, 323709, 324156, 324813]
53784C24813J340J656J175M37m5n71j472k234k179j575j251j403j566j589j828
53769C13708k257k233j493p56q12j422j687j343j112j699k876l795l971l661l455
53754B81136l681m267m909n275n182m689m004l250k396j522r73j056j589j935
53740B36408j580o43K29M86K00J6M80J379J917J581P56L12O88J553K230K286J797
53723B50095J233J003R75N98l14j122j046j83N59N72J99J63P09J449J863J762
53707B58515J420J294J550J919K133K242K264J857Q24k35m43K59J109J586J838
53692B78132K023K016K006K457L186L197K053O23p9j90m15p95r36j026j548k231
53676B88473k240j432n32q0M7pl26o69m84K04O05K68k80l73j93l41q78j325j418
$$ y = [324813, 326153, 327809, 328984, 329421, 329376, 328805, 327333, 325099, 322920, 321345, 320094, 318691, 317125, 315536, 313708, 311451, 309218, 307725, 306969, 306157, 304735, 303048, 301705, 300593, 298894, 296018, 292223, 288252, 284591, 281136, 277455, 273188, 268279, 263004, 257822, 253133, 249129, 245879, 243483, 241961, 240988, 239932, 238343, 236408, 234828, 234185, 234414, 234900, 235100, 235116, 235596, 236975, 238892, 240473, 241229, 241541, 242229, 243782, 246012, 248298, 250095, 251328, 252331, 253306, 253904, 253590, 252468, 251422, 251239, 251798, 252370, 252569, 252732, 253441, 254890, 256753, 258515, 259935, 261229, 262779, 264698, 266831, 269073, 271337, 273194, 274018, 273783, 273340, 273599, 274708, 276294, 278132, 280155, 282171, 284177, 286634, 289820, 293017, 295070, 295693, 295614, 295424, 295009, 294214, 293278, 292252, 290704, 288473, 286233, 284801, 284269, 284189, 284236, 284229, 283903, 283234, 282750, 282954, 283559, 283827, 283547, 283174, 282981, 282640, 281762, 280437, 279019]
53657B79019j341j305j307j262j105p63k22L33O67P66Q16R12Q76M83j73o33n38
53640B75223r7J33Kj7M45J038J223J111J278J819K181J982J471J083R86J177J573
53623B92611J826J599J283J822L402M802M720L478K633K964L615L447K588K079
53609C32869K353K753K606K149K066K448K773K736K542K315J824J072O05P56J023
53594C62890P68K55K52P46Q49R3r04j332j184j027j180j522j797j783j455j154
53578C52515j315j834k079j830j726k323l100l015j894o37l2P1J94L28J4q41j611
53561C30885j582p41K87J066J803K755L505L335K302J414J417J862J738P96j56
53546C50686j80Q66K359L482L781L425L067L414M724O603Q305R326R779J0080
$$ y = [279019, 277678, 276373, 275066, 273804, 272699, 271936, 271714, 272047, 272714, 273480, 274296, 275208, 276084, 276567, 276394, 275761, 275223, 275126, 275259, 275261, 275244, 275689, 276727, 277950, 279061, 280339, 282158, 284339, 286321, 287792, 288875, 289861, 291038, 292611, 294437, 296036, 297319, 299141, 302543, 307345, 312065, 315543, 318176, 321140, 324755, 328202, 330790, 332869, 335222, 337975, 340581, 342730, 344796, 347244, 350017, 352753, 355295, 357610, 359434, 360506, 361111, 361867, 362890, 363658, 363913, 364165, 364911, 365760, 365853, 364949, 363617, 362433, 361406, 360226, 358704, 356907, 355124, 353669, 352515, 351200, 349366, 347287, 345457, 343731, 341408, 338308, 335293, 333399, 332762, 332730, 332801, 332995, 333323, 333337, 332496, 330885, 329303, 328562, 328849, 329915, 331718, 334473, 337978, 341313, 343615, 345029, 346446, 348308, 350046, 350842, 350686, 350506, 351372, 353731, 357213, 360994, 364419, 367486, 370900, 375624, 382227, 390532, 399858, 409637, 419717]
53532D19717J0321J0193R703R552J0373J1796J2873J3256J3309J3128J2333J1065
53520E57619J0360J0961J2365J3602J4532J5705J7336J9033K0372K1163K1365
53509G34413K1257K1474K2330K3255K3472K3106K2944K3180K3131K2329K1235
53498I82126K0580K0503K0641K0673K0449J9872J9042J8340J8141J8467J8976
53487A197810J9266J9114J8598J7978J7383J6644J5623J4589J3919J3465J2568
53476A376957J0834Q638O686N314M259K912O94k477n935q705j0441j1764j3444
53463A363528j5434j6972j7575j7600j7793j8549j9702k0851k1625k1820k1549
53452A154058k1269k1390k1726k1595k0697j9599j9004j8773j8137j6874j5632
$$ y = [419717, 430038, 440231, 449934, 459486, 469859, 481655, 494528, 507784, 521093, 534221, 546554, 557619, 567979, 578940, 591305, 604907, 619439, 635144, 652480, 671513, 691885, 713048, 734413, 755670, 777144, 799474, 822729, 846201, 869307, 892251, 915431, 938562, 960891, 982126, 1002706, 1023209, 1043850, 1064523, 1084972, 1104844, 1123886, 1142226, 1160367, 1178834, 1197810, 1217076, 1236190, 1254788, 1272766, 1290149, 1306793, 1322416, 1337005, 1350924, 1364389, 1376957, 1387791, 1396429, 1403115, 1408429, 1412688, 1415600, 1416294, 1413817, 1407882, 1399177, 1388736, 1376972, 1363528, 1348094, 1331122, 1313547, 1295947, 1278154, 1259605, 1239903, 1219052, 1197427, 1175607, 1154058, 1132789, 1111399, 1089673, 1068078, 1047381, 1027782, 1008778, 990005, 971868, 954994, 939362]
53441I39362j4923j4274j2869j0691q573p207o437n525l911j721L51J788K867
53428H58237M281O084P534Q271R101J1038J3867J6350J7773J8661J9819K1246
53416A012262K2307K2672K2807K3609K5608K8434L1081L2862L4055L5426L7279
53405A328402L9190M0714M1992M3574M5775M8300N0493N1996N3076N4166N5148
53394A852826N5509N5273N5189N5677N6077N5540N4207N2893N1832N0458M8347
53383B443828M5750M3063M0368L7526L4351L0620K6274K1586J6902J2266P615
53372B760149L003j760p280j3757k0317k5969l0946l6232m1924m7093n1258n4861
53360B431755n8059o0197o0912o0815o0625o0399o0130o0081o0034n9025n6633
$$ y = [939362, 924439, 910165, 897296, 886605, 878032, 870825, 864388, 858863, 854952, 853231, 853582, 855370, 858237, 862518, 868602, 876136, 884407, 893508, 904546, 918413, 934763, 952536, 971197, 991016, 1012262, 1034569, 1057241, 1080048, 1103657, 1129265, 1157699, 1188780, 1221642, 1255697, 1291123, 1328402, 1367592, 1408306, 1450298, 1493872, 1539647, 1587947, 1638440, 1690436, 1743512, 1797678, 1852826, 1908335, 1963608, 2018797, 2074474, 2130551, 2186091, 2240298, 2293191, 2345023, 2395481, 2443828, 2489578, 2532641, 2573009, 2610535, 2644886, 2675506, 2701780, 2723366, 2740268, 2752534, 2760149, 2763152, 2761392, 2754112, 2740355, 2720038, 2694069, 2663123, 2626891, 2584967, 2537874, 2486616, 2431755, 2373696, 2313499, 2252587, 2191772, 2131147, 2070748, 2010618, 1950537, 1890503, 1831478, 1774845]
53349A774845n3730n1328m9406m7636m6438m6226m6224m5210m3129m0911l8884
53338A265723l6520l3693l1138k9347k7827k5780k2965j9778j6912j5009j4113
53327I92641j3406j2006j0030q340p336o587n734n005m584m040k812r18J058K489
53313I15390L114L308L912N494P605R238J0054J0705J1846J3340J4712J5916J7238
53300A041872J8778K0362K1772K2869K3688K4588K6001K7798K9249K9841K9798
53289A316616K9530K8878K7461K5524K3823K2663K1480J9537J6670J3246R754
53278A555182O680M413K866J247j379n078q810j1441j2942j4388j6700j9617k2079
53265A457954k3479k4291k5403k7137k9065l0619l1618l2181l2438l2482l2463
$$ y = [1774845, 1721115, 1669787, 1620381, 1572745, 1526307, 1480081, 1433857, 1388647, 1345518, 1304607, 1265723, 1229203, 1195510, 1164372, 1135025, 1107198, 1081418, 1058453, 1038675, 1021763, 1006754, 992641, 979235, 967229, 957199, 948859, 941523, 934936, 929202, 924197, 919613, 915573, 912761, 911843, 912901, 915390, 918504, 921812, 925724, 931218, 938823, 948061, 958115, 968820, 980666, 994006, 1008718, 1024634, 1041872, 1060650, 1081012, 1102784, 1125653, 1149341, 1173929, 1199930, 1227728, 1256977, 1286818, 1316616, 1346146, 1375024, 1402485, 1428009, 1451832, 1474495, 1495975, 1515512, 1532182, 1545428, 1555182, 1561862, 1566275, 1569141, 1570388, 1569009, 1563931, 1555121, 1543680, 1530738, 1516350, 1499650, 1480033, 1457954, 1434475, 1410184, 1384781, 1357644, 1328579, 1297960, 1266342, 1234161, 1201723, 1169241, 1136778]
53254A136778l2478l2416l2021l1190l0071k8897k7909k7405k7572k8086k8194
53243H10539k7441k6224k5266k4738k4183k3268k2098k0813j9290j7488j5745
53232E63985j4400j3341j2178j0761r420q573q250p985p374o700o702p544q258
53219D42499p825o520n606n741o366o746o822o827o794o811p081p297o624m889
53205C50550l106k223j941j573j342j928l107l989m388m844n312m979l622k129
53191C06067j339j192j389j999k894l327k842k065j912k312k407j864j269j158
53177B78098j248r19j35M34K69k60l29K39O81L42l53n07p7Q8m57j070r60k24M10
53158B74022N21K72K2l9N0N1k51p33r92q50n40l04r0J58J90k49r97j617j886j898
$$ y = [1136778, 1104300, 1071884, 1039863, 1008673, 978602, 949705, 921796, 894391, 866819, 838733, 810539, 783098, 756874, 731608, 706870, 682687, 659419, 637321, 616508, 597218, 579730, 563985, 549585, 536244, 524066, 513305, 503885, 495312, 487062, 479077, 471703, 465003, 458301, 450757, 442499, 434674, 428154, 422548, 416807, 410441, 403695, 396873, 390046, 383252, 376441, 369360, 362063, 355439, 350550, 347444, 345221, 343280, 341707, 340365, 338437, 335330, 331341, 326953, 322109, 316797, 311818, 308196, 306067, 304728, 303536, 302147, 300148, 297254, 293927, 291085, 289020, 287108, 284796, 282389, 280525, 279256, 278098, 276850, 275931, 275796, 276230, 276499, 276239, 275910, 276149, 276830, 277172, 276819, 276312, 276235, 276323, 275866, 274796, 273836, 273612, 274022, 274543, 274815, 274837, 274798, 274848, 274899, 274648, 273915, 272923, 272073, 271533, 271229, 271139, 271297, 271487, 271238, 270241, 268624, 266738, 264840]
53138B64840j760j396p17J70R67J407J414J042L73l75p31l84K41K81m69j191j136
53121B62576n56o5L27P92Q55M2r51r00J60R67R26P00O34L5j345k406k195j407
53103B58189j279j834k187k061j869j700j249n36J19N78O96Q6j087j711j059k6
53087B43070Q7n09o34k23k44o65k79J042J683O59p65r04nM56K3m86n42m82n98
53068B40684o56n26n14p98j072r33m14P5J71j53n61o71l77J76Q60J464J543Q52
53050B39150j5r1O22R74K62o72o29K57Q84Q69Q32J003O82n82k044k591k077j289
53032B35545q84q47q45o29j38N06R42P59q0j097j666j549r96m62k55l92o00m97
53014B26815M5N75M50l09q21l63O52J223J139J120J542J782J254L63j27k45n79
$$ y = [264840, 263080, 261684, 260967, 261137, 262104, 263511, 264925, 265967, 266340, 265965, 265234, 264850, 265091, 265372, 264903, 263712, 262576, 262020, 261955, 262282, 263074, 263929, 263971, 263020, 262120, 262280, 263247, 264173, 264873, 265507, 265542, 264197, 261791, 259596, 258189, 256910, 255076, 252889, 250828, 248959, 247259, 246010, 245474, 245593, 246171, 246867, 246953, 245866, 244155, 243096, 243070, 243157, 242648, 242014, 241791, 241547, 240882, 240603, 241645, 243328, 243987, 243222, 242318, 242313, 242769, 242792, 242306, 241764, 241282, 240684, 240028, 239502, 238988, 238190, 237118, 236185, 235771, 235846, 236017, 235864, 235303, 234632, 234255, 234431, 235291, 236755, 238298, 239150, 239135, 239044, 239666, 240640, 240902, 240230, 239601, 239858, 240742, 241611, 242443, 243446, 244128, 243546, 241502, 238911, 236834, 235545, 234661, 233814, 232969, 232340, 232202, 232708, 233650, 234409, 234329, 233232, 231566, 230017, 229021, 228559, 228304, 227912, 227312, 226815, 226860, 227435, 227885, 227576, 226755, 226392, 227044, 228267, 229406, 230526, 232068, 233850, 235104, 235467, 235340, 235095, 234516]
52997B34516j137j248n75L72Q82P51K37k53l43M9M86M14j22m55q9P51J480J763
52979B37479J612J186O84K85R6J96O17J124J157M77l32m14K93J054J386J450J334
52962B49684P46k20p76m52J45J87k36m75m55o51j159j601j806j895j754j178n52
52945B37552n32r75r92l56n1q62k089k396j519m34J8p1k54m76r22j442j573j069
52927B21557k53K60J42m39j114j606j669j012L17J595J988J471Q49P11Q29P06
52911B24332L25L5LR4P6j93o36q48m56K71N98L25J18M91R62P70N5l69j93J37K33
52890B26130K20L21N46Q80J322J636J542J135P88N64J75m79j152j642j876j675
52874B28435r44j56Ol84n29n5N03O69Q14J416K130K212J582Q99O92Q98J113R86
$$ y = [234516, 233379, 232131, 231556, 231928, 232810, 233561, 233798, 233545, 233202, 233251, 233737, 234151, 234029, 233574, 233485, 234236, 235716, 237479, 239091, 240277, 240961, 241246, 241342, 241538, 242155, 243279, 244436, 244913, 244581, 244167, 244460, 245514, 246900, 248350, 249684, 250430, 250210, 249434, 248982, 249127, 249314, 249078, 248603, 248148, 247497, 246338, 244737, 242931, 241036, 239282, 238104, 237552, 237020, 236045, 235053, 234697, 234646, 233784, 231695, 229299, 227780, 227346, 227364, 227293, 227039, 226563, 225641, 224199, 222626, 221557, 221304, 221564, 221706, 221267, 220153, 218547, 216878, 215866, 216183, 217778, 219766, 221237, 222086, 222797, 223626, 224332, 224657, 224692, 224695, 224789, 224865, 224672, 224036, 223188, 222732, 223003, 223601, 223926, 224044, 224535, 225497, 226267, 226322, 225953, 225760, 225897, 226130, 226350, 226671, 227217, 228097, 229419, 231055, 232597, 233732, 234520, 235084, 235259, 234780, 233628, 231986, 230110, 228435, 227491, 227335, 227341, 226957, 226428, 226373, 226876, 227545, 228359, 229775, 231905, 234117, 235699, 236598, 237290, 238188, 239301, 240287]
52856B40287M63o7o9M22O44L7r86j583j574j500j725k009j981j608j122p88p44
52839B26097q42p35l45j00l64q35q82m05J37M43O16P05N53K40J98O53J292J711
52821B28137J798J496O01q07k043k353j693o51L07J174J996K634K989L227L472
52806B40284L488K961K048J323J035P24k06j681l069l930m310m256l609k447j371
52791B26984r29r99j063r27q02q48j033j392j991k554k519j602k02R59J429J327
52775B13838J136J215J419J244M72m58q57m92K46P70P11J36m41m72J7M25L99L20
52757B19628N98Q69N15k13m02K29R43J015N24j04o85j065r57l39L30O83Q54J032
52739B23455J041P56N12O18P79N02p4l11J02Q18J305J375J221J165J301J298P62
$$ y = [240287, 240750, 240683, 240614, 241036, 241680, 241717, 240731, 239148, 237574, 236074, 234349, 232340, 230359, 228751, 227629, 226841, 226097, 225255, 224520, 224175, 224075, 223711, 222876, 221994, 221589, 221726, 222169, 222785, 223490, 224043, 224283, 224481, 225134, 226426, 228137, 229935, 231431, 232032, 231225, 229182, 226829, 225136, 224485, 224792, 225966, 227962, 230596, 233585, 236812, 240284, 243772, 246733, 248781, 250104, 251139, 251863, 251657, 249976, 246907, 242977, 238667, 234411, 230802, 228355, 226984, 226055, 225056, 223993, 223066, 222264, 221416, 220383, 218991, 217000, 214446, 211927, 210325, 210123, 211082, 212511, 213838, 214974, 216189, 217608, 218852, 219324, 218866, 218009, 217517, 217763, 218533, 219244, 219380, 218939, 218467, 218484, 218909, 219308, 219628, 220226, 221095, 221610, 221397, 220995, 221224, 222167, 223182, 223706, 223602, 222917, 221852, 220895, 220556, 220886, 221569, 222423, 223455, 224496, 225252, 225764, 226382, 227161, 227663, 227589, 227278, 227380, 228198, 229503, 230878, 232099, 233264, 234565, 235863, 236625]
52722B36625j46p74q55q71j267j770j900j723j542j236n78N3L4n23q82p89o76
52705B21180p79p52l93o1o9k48l67m28k66N12J763K544K109Q14m10j039r56p7
52687B23077J331K301K049J068N78Q83J067M60l91n89o6N86R94J205J211Q42J23
52670B36729n87r25q26n02j80J32O35J330J769J467N88j45l12j70J6M44J260J942
52652B42665J851J159O76Q24J315J763J978J655M63j270k562k835k572k486k463
52637B40161j886p40J99L24r4k86J75J067J842K141K081K035K176K322K257K005
52621B55779J620R42j29j284j954j849j136j99N74R20Q78P85Q61Q11K14q20j653
52604B54360j858j599j244r27o21l55j90j43l04p20j129j046l40M64P05K85k84
$$ y = [236625, 236479, 235705, 234850, 233979, 232712, 230942, 229042, 227319, 225777, 224541, 223963, 224016, 224050, 223527, 222645, 221856, 221180, 220401, 219649, 219256, 219195, 219126, 218878, 218511, 218083, 217817, 218329, 220092, 222636, 224745, 225559, 225149, 224110, 223154, 223077, 224408, 226709, 228758, 229826, 230404, 231287, 232354, 232814, 232423, 231834, 231768, 232354, 233348, 234553, 235764, 236606, 236729, 236142, 235217, 234391, 233889, 233709, 233841, 234476, 235806, 237575, 239042, 239630, 239485, 239173, 239003, 239019, 239463, 240723, 242665, 244516, 245675, 246351, 247175, 248490, 250253, 252231, 253886, 254349, 253079, 250517, 247682, 245110, 242624, 240161, 238275, 237535, 237734, 238058, 237964, 237678, 237853, 238920, 240762, 242903, 244984, 247019, 249195, 251517, 253774, 255779, 257399, 258341, 258212, 256928, 254974, 253125, 251989, 251790, 252364, 253284, 254162, 254947, 255808, 256619, 256833, 256013, 254360, 252502, 250903, 249659, 248732, 248111, 247756, 247566, 247423, 247119, 246399, 245270, 244224, 243884, 244348, 245053, 245338, 245054]
52587B45054m76k14J78L50K61K17N07J026J348J206P86M64L99M31L26Ql78n69
52569B50924m52k42k15l26k04K97P66O25j35q11o82J17O43K00p94j310j067q63
52551B46471j298j799j433l27N50P66P83R06Q07L44M4K49M70J46m59o66l01L22
52533B45575R56J419J410R47O40R02J196P63j22m67l6L40M2n29o60j74P08J734
52515B54644K514K565J910J195Q83P43M64L95J092K342L222L097K200J226N74
52500B79066O6p48j933k853k724j660p37p67j342j523j197j065j380j448o72M62
52484B59545R59N83K0q6K50P24J238J736J879J353M26j60M0P35J347J625J683
52467B73897J656J652J836K184K265J662P20L62Q85J315N45j163k337k143j381
$$ y = [245054, 244578, 244364, 244542, 244892, 245153, 245370, 245877, 246903, 248251, 249457, 250243, 250707, 251106, 251537, 251863, 251871, 251493, 250924, 250472, 250230, 250015, 249689, 249485, 249782, 250548, 251173, 251038, 250227, 249545, 249662, 250305, 250505, 249711, 248401, 247334, 246471, 245173, 243374, 241941, 241614, 242164, 242930, 243713, 244619, 245426, 245770, 245814, 246063, 246533, 246679, 246220, 245554, 245253, 245575, 246531, 247950, 249360, 250307, 250947, 251849, 253045, 253808, 253686, 253219, 253183, 253523, 253565, 253036, 252376, 252202, 252910, 254644, 257158, 259723, 261633, 262828, 263711, 264454, 264918, 265313, 266405, 268747, 271969, 275066, 277266, 278492, 279066, 279132, 278384, 276451, 273598, 270874, 269214, 268477, 267710, 266368, 264845, 263648, 262583, 261203, 259755, 259083, 259545, 260504, 261087, 261107, 261021, 261271, 261995, 263233, 264969, 266848, 268201, 268627, 268467, 268507, 269242, 270589, 272214, 273897, 275553, 277205, 279041, 281225, 283490, 285152, 285872, 286234, 287119, 288434, 288979, 287816, 285479, 283336, 281955]
52452B81955j389k356l301l476l114k735k352j761j150r11j002j010p88n07k01
52437B55902K61O34L41o02j243p90K41O32O6n39l61J96J27q19j785j819q75K77
52419B49844R64J237J551J996K140J743J289J499K388L221L455L407L783M760
52405B83277N811O395O515O520O566O385N660M382K727P21j711m288o271p063
52391C15626o759n961n097m239l429k845k526k217j708j174j029j358j638j122
52377B74524M10K238L263L054K260J882K269K950L303L151K757K494K519K578
52363C09652K161J002m94j516j556q37q3R5l64r61j153r00n73l16J65R63J573
52346C06858J504J057R23J168J220Q22L96L24M71O64J163K232L600M693N279N550
$$ y = [281955, 280566, 278210, 274909, 271433, 268319, 265584, 263232, 261471, 260321, 259410, 258408, 257398, 256610, 256103, 255902, 256163, 256797, 257138, 256536, 255293, 254503, 254744, 255376, 255442, 254903, 254542, 254738, 254865, 254046, 252261, 250442, 249567, 249844, 250808, 252045, 253596, 255592, 257732, 259475, 260764, 262263, 264651, 267872, 271327, 274734, 278517, 283277, 289088, 295483, 301998, 308518, 315084, 321469, 327129, 331511, 334238, 334959, 333248, 328960, 322689, 315626, 308867, 302906, 297809, 293570, 290141, 287296, 284770, 282553, 280845, 279671, 278642, 277284, 275646, 274524, 274934, 277172, 280435, 283489, 285749, 287631, 289900, 292850, 296153, 299304, 302061, 304555, 307074, 309652, 311813, 312815, 312321, 310805, 309249, 308412, 308329, 308424, 308060, 307099, 305946, 305046, 304473, 304157, 304322, 305285, 306858, 308362, 309419, 310342, 311510, 312730, 313552, 313948, 314272, 314743, 315407, 316570, 318802, 322402, 327095, 332374, 337924]
52330C37924N739N898O015O214O766P810Q963R464R018Q336Q331Q886R008Q211
52316D46583P097O425O279O485P063P759P823O936N938N927O899P966Q579Q842
52302E46601Q816Q414P961Q067Q683Q967Q263O818N286M033L103K428J774Q30
52288F30044l74j403j978k314k663k840k518j764r98n33l85m25m90m02o7M26R40
52271F12256J459J981K419K714L044L678M567N279N485N394N527O038O502O529
52257F72872O378O632P295P671P282O590O444P069P865Q142P721O874N958N126
52243G69919M217K931J299j61r84j278j471j663j630j339j069r74r44r48j158
52228G64747j619k093k360k410k275j918j410r45o18m47n53r33j034j76J475K843
$$ y = [337924, 343663, 349561, 355576, 361790, 368556, 376366, 385329, 394793, 403811, 412147, 420478, 429364, 438372, 446583, 453680, 460105, 466384, 472869, 479932, 487691, 495514, 502450, 508388, 514315, 521214, 529180, 537759, 546601, 555417, 563831, 571792, 579859, 588542, 597509, 605772, 612590, 617876, 621909, 625012, 627440, 629214, 630044, 629670, 628267, 626289, 623975, 621312, 618472, 615954, 614190, 613192, 612659, 612274, 611849, 611359, 610957, 610890, 611316, 612256, 613715, 615696, 618115, 620829, 623873, 627551, 632118, 637397, 642882, 648276, 653803, 659841, 666343, 672872, 679250, 685882, 693177, 700848, 708130, 714720, 721164, 728233, 736098, 744240, 751961, 758835, 764793, 769919, 774136, 777067, 778366, 778205, 777221, 775943, 774472, 772809, 771179, 769840, 768771, 767797, 766853, 765905, 764747, 763128, 761035, 758675, 756265, 753990, 752072, 750662, 749717, 749099, 748652, 748099, 747166, 746132, 745956, 747431, 750274]
52212G50274L191K965L002L364L499L297L279L790M531M969M845M197L267K409
52198H00879J873J597J409J421J882K627L103L026K737K657K729K652K433K301
52184H33326K154J522J99j353k426k840l051l596m535n472n965n868n380m829
52170G91886m368l907l385k991k887k750k029p73K25M63N18J274K623L577L609
52155G81085L101K466J560L45n96p56m30j83M9O98J637K173J910J178N75N05J027
52138G96344J723J815Q79n39j418j382q63k42O02J774L004M038M967N915O843
52123H23460P895R519J1802J4065J5493J5994J6022J5812J5224J4285J3405J2900
52111I85876J2530J1700J0098Q050O299N326M996M913N029N549O330O793O657
$$ y = [750274, 753465, 756430, 759432, 762796, 766295, 769592, 772871, 776661, 781192, 786161, 791006, 795203, 798470, 800879, 802752, 804349, 805758, 807179, 809061, 811688, 814791, 817817, 820554, 823211, 825940, 828592, 831025, 833326, 835480, 837002, 837201, 835848, 833422, 830582, 827531, 823935, 819400, 813928, 807963, 802095, 796715, 791886, 787518, 783611, 780226, 777235, 774348, 771598, 769569, 768796, 769021, 769484, 770002, 771276, 773899, 777476, 781085, 784186, 786652, 788212, 788557, 787961, 787205, 786775, 786592, 786641, 787339, 788976, 791149, 793059, 794237, 794812, 795317, 796344, 798067, 799882, 800761, 800222, 798804, 797422, 796559, 796317, 796919, 798693, 801697, 805735, 810702, 816617, 823460, 831355, 840874, 852676, 866741, 882234, 898228, 914250, 930062, 945286, 959571, 972976, 985876, 998406, 1010106, 1020204, 1028254, 1034553, 1039879, 1044875, 1049788, 1054817, 1060366, 1066696, 1073489, 1080146]
52098A080146O310O182O148N912N596N413N048L928K108K73j251k956n374q162
52084A109321j0259j0829r947q512p469p045o651n675m218k837j843j165p92p96
52070A031283q79n15L25J090J459J733K149K369K161K013K521L404L848L652L383
52055A059996L465L697L789L718L447K779J811J012N36j12j378k918m021m555
52041A071266m972n490n783n585n139m806m468l686k337r43k06l77j024j466j405
52026A023579j214j566k692l992m474l764k579k019k414l052l139k663k101j564
52012I86346p74J72N67j29j662l403n092o839q597j0041j0994j1624j2224j3000
51998I02706j4099j5567j7205j8616j9448j9532j8789j7303j5459j3772j2452
$$ y = [1080146, 1086456, 1092638, 1098786, 1104698, 1110294, 1115707, 1120755, 1124683, 1126791, 1127064, 1125813, 1122857, 1117483, 1109321, 1099062, 1088233, 1078286, 1069774, 1062305, 1055260, 1048609, 1042934, 1038716, 1035879, 1034036, 1032871, 1032079, 1031283, 1030404, 1029889, 1030214, 1031304, 1032763, 1034496, 1036645, 1039014, 1041175, 1043188, 1045709, 1049113, 1052961, 1056613, 1059996, 1063461, 1067158, 1070947, 1074665, 1078112, 1080891, 1082702, 1083714, 1084250, 1084138, 1082760, 1079842, 1075821, 1071266, 1066294, 1060804, 1055021, 1049436, 1044297, 1039491, 1035023, 1031337, 1029000, 1028057, 1027851, 1027474, 1026450, 1024984, 1023579, 1022365, 1020799, 1018107, 1014115, 1009641, 1005877, 1003298, 1001279, 998865, 995813, 992674, 990011, 987910, 986346, 985572, 985744, 986311, 986182, 984520, 981117, 976025, 969186, 960589, 950548, 939554, 927930, 915706, 902706, 888607, 873040, 855835, 837219, 817771, 798239, 779450, 762147, 746688, 732916, 720464]
51987G20464j1319j0249r430r060q980q861q626q400q207p973p809p976q483q967
51973E96124r187r327r579r577q548o185l092k90J672K938L905M750N471O186
51959E65261P147Q408R519R705Q517O276L773J501o84l040n337o976p581p221
51945E89268o101m375k287j13K151M738P545R900J1207J1563J1480J1211J0698
51932F56885J0020R324Q327O424L439j22l685p133j0461j3276j5074j5844j6076
51919F12748j6216j6325j6198j5602j4389j2671j0830r237p918o637n233l741
51907D77751k217o39J063K934M878O543P532P928Q370R210R854R381P830O178
51893E56596M900L190O9m134p990j0423j1434j1506j0916r720p968n665k936k30
$$ y = [720464, 709145, 698896, 689466, 680406, 671426, 662565, 653939, 645539, 637332, 629359, 621550, 613574, 605091, 596124, 586937, 577610, 568031, 558454, 549906, 543721, 540629, 540339, 542011, 544949, 548854, 553604, 559075, 565261, 572408, 580816, 590335, 600040, 608557, 614833, 618606, 620107, 619423, 616383, 611046, 604070, 596489, 589268, 583167, 578792, 576505, 576392, 578543, 583281, 590826, 600726, 611933, 623496, 634976, 646187, 656885, 666905, 676229, 684556, 690980, 694419, 694297, 690612, 683479, 673018, 659742, 644668, 628824, 612748, 596532, 580207, 564009, 548407, 534018, 521347, 510517, 501280, 493362, 486725, 481492, 477751, 475534, 474895, 475958, 478892, 483770, 490313, 497845, 505773, 514143, 523353, 533207, 542588, 550418, 556596, 561496, 564686, 564755, 560621, 552631, 542208, 530774, 519268, 508352, 498632, 490664, 484999, 482063, 481833]
51879D81833K000L960O342R208J1554J2564J2784J3395J4498J5049J4552J3827
51867F11566J3668J3480J2037R175N964L395J675P65P94J617K585L138L218K775
51853F85852J350j319m665p773j0355j2706j4847j6317j6794j6446j5534j4161
51841E56285j2526j1012r793q694p577o551n703m957m302l826l318k375j087j44
51827D74420J27L24R99J665J462N09k93o63j213k177k770k251r62K36J035J676
51811D72124K221K522K661K940L372L593L225K176O32j033k484l774n226o744
51797D76205p559p031n549m119l234k624j987j446j122q64n43l40m76q96j352
51782D37063j605j436p60J35O32K85p64j898k416j926o41P10J539K070L019M645
$$ y = [481833, 483833, 487793, 494135, 503343, 514897, 527461, 540245, 553640, 568138, 583187, 597739, 611566, 625234, 638714, 650751, 659926, 665890, 669285, 670960, 671725, 672519, 674136, 676721, 679859, 683077, 685852, 687202, 685883, 681218, 673445, 663090, 650384, 635537, 619220, 602426, 585980, 570446, 556285, 543759, 532747, 522954, 514260, 506683, 500132, 494429, 489472, 485170, 481344, 478026, 475651, 474564, 474420, 474547, 474871, 475870, 477535, 478997, 479506, 479213, 478550, 477337, 475160, 472390, 470139, 469177, 469413, 470448, 472124, 474345, 476867, 479528, 482468, 485840, 489433, 492658, 494834, 495466, 494433, 491949, 488175, 482949, 476205, 468646, 461615, 456066, 451947, 448713, 446089, 444102, 442656, 441534, 440670, 440127, 439787, 439311, 438415, 437063, 435458, 434022, 433262, 433397, 434029, 434314, 433550, 431652, 429236, 427310, 426669, 427379, 428918, 430988, 434007, 438652]
51766D38652O384P603Q281Q766R167R251Q763P621N903L863J749m82l041n791
51752E06689q083r332r535r055q172p122o206n494m627l279j736n72J86J134K758
51737D37554M892P043Q879J0293J1213J1538J1280J0581R605Q342O654M583K625
51724E45082J418J133J366J704K026K101J345n86l156n395o825p545p577o728
51710E18363n189l699k912k829l007l052k735j944p19P08K036K999L413L230K603
51695E07266J819J206J165J993L434M652N004M666M145L313J550j228m259o700
51681E28026q203q598p743o004m337l312k424q57J322L251M407N135N957O773
51667E13393P017O383N323M709N067O082O870O611M903J777k250o167r016j0535
$$ y = [438652, 445036, 452639, 460920, 469686, 478853, 488104, 496867, 504488, 510391, 514254, 516003, 515521, 512480, 506689, 498606, 489274, 479739, 470684, 462512, 455390, 449184, 443690, 439063, 435784, 434048, 433476, 433662, 434796, 437554, 442446, 449489, 458368, 468661, 479874, 491412, 502692, 513273, 522878, 531220, 537874, 542457, 545082, 546500, 547633, 548999, 550703, 552729, 554830, 556175, 555589, 552433, 547038, 540213, 532668, 525091, 518363, 513174, 509475, 506563, 503734, 500727, 497675, 494940, 492996, 492277, 492985, 495021, 498020, 501433, 504663, 507266, 509085, 510291, 511456, 513449, 516883, 521535, 526539, 531205, 535350, 538663, 540213, 538985, 534726, 528026, 519823, 511225, 503482, 497478, 493141, 489829, 487405, 486548, 487870, 491121, 495528, 500663, 506620, 513393, 520410, 526793, 532116, 536825, 541892, 547974, 554844, 561455, 566358, 568135, 565885, 559718, 550702, 540167]
51653E40167j1021j0585r014o462l671j271P17K336L175K837J432p76l732p083
51639D97049r812j1192j1779j2566j3293j2627j0138p133n153m353l874l178k390
51626C89561j755j392j342j394j055j82N30K07j051k185k304j402NJ385K163J808
51610C81597M10j101j777j595j207r43n44J31P46J087J602K772M288N325N602
51595C96393N690O193P117Q205R411J0634J1314J0792R039O672M333K360J069
51582D89222Q32J638K852L796M493N647P779J0528J2941J4438J5451J6929J9238
51569F05784K1673K3167K3486K3507K4295K6039K8002K9457L0505L1981L4601
51558I02497L8400M2895M7523N1687N4516N4996N2456M6809L8273K7230J4387
$$ y = [540167, 529146, 518561, 509547, 503085, 499414, 498143, 498860, 501196, 504371, 507208, 508640, 507864, 504132, 497049, 487237, 476045, 464266, 451700, 438407, 425780, 415642, 408509, 403356, 399003, 395129, 391951, 389561, 387806, 386414, 385072, 383678, 382623, 382441, 382971, 383178, 382127, 379942, 377638, 376236, 376241, 377626, 379789, 381597, 382007, 380906, 379129, 377534, 376327, 375384, 374840, 374971, 375717, 376804, 378406, 381178, 385466, 390791, 396393, 402083, 408276, 415393, 423598, 433009, 443643, 454957, 465749, 474788, 481460, 485793, 488153, 489222, 490054, 491692, 494544, 498340, 502833, 508480, 516259, 526787, 539728, 554166, 569617, 586546, 605784, 627457, 650624, 674110, 697617, 721912, 747951, 775953, 805410, 835915, 867896, 902497, 940897, 983792, 1031315, 1083002, 1137518, 1192514, 1244970, 1291779, 1330052, 1357282, 1371669]
51547A371669P88j2666k5455l7020m6484n3261n7741o0802o2589o2352n9677n5351
51535H39059n0625m5965m1005l5599l0372k6090k2822k0011j7188j4371j1821
51524E23190r673p931o616n714n043m449m101m288m817m958m226l021k106j676
51510D54571j325q63o46j020j865k863l856m656m917m510l861l502l425l258k889
51495D11115k571k348j895j074k82Qj35j38M80J658K832L339K967K177J625J384
51479D19142Q54l68j836k750k874k634k446k376k382k449k428k183j939k067k466
51464C88798k587k249j804j345l94J127K287K249J525J349K054K973L685M355
51450D02023M833M563L773L730N211P439R142J0010J0491J0745J0724J0827J1500
$$ y = [1371669, 1372457, 1359791, 1334336, 1297316, 1250832, 1197571, 1139830, 1079028, 1016439, 954087, 894410, 839059, 788434, 742469, 701464, 665865, 635493, 609403, 586581, 566570, 549382, 535011, 523190, 513517, 505586, 498970, 493256, 488213, 483764, 479663, 475375, 470558, 465600, 461374, 458353, 456247, 454571, 453246, 452383, 451737, 450717, 448852, 445989, 442133, 437477, 432560, 428050, 424189, 420687, 417262, 414004, 411115, 408544, 406196, 404301, 403227, 402945, 402953, 402818, 402680, 403160, 404818, 407650, 410989, 413956, 416133, 417758, 419142, 419996, 419628, 417792, 415042, 412168, 409534, 407088, 404712, 402330, 399881, 397453, 395270, 393331, 391264, 388798, 386211, 383962, 382158, 380813, 380419, 381546, 383833, 386082, 387607, 388956, 391010, 393983, 397668, 402023, 406856, 411419, 415192, 418922, 424133, 431572, 440714, 450724, 461215, 471960, 482684, 493511, 505011]
51437E05011J2247J1879R870O828L623O78j745l327m086m597n472o785q258r676
51423E06190j0840j1383j0910r395p239n013l149j863j150q18n50j12M40Q56J104
51408D46168J520K269K839K608J879J756K749M063M609M205L371K527J928J947
51394D84438K621L317L534L774M825O549Q268J0077J2700J6052J9209K1994K5488
51381F22846L0488L6526M2972M9931N7229O3445O7269O9257P0982P2479P1759
51370A255183O7003N8351M7155L4303J9923M377j1139k5208l7177m7420n6561
51359A308790o4473p0153p2622p1797o8533o4066n9423n4895m9936m3943l7388
51348F51561l1699k7658k4463k0969j7415j5030j4159j3748j2852j1725j0973
$$ y = [505011, 517258, 529137, 539007, 545835, 549458, 550136, 548391, 545064, 540978, 536381, 530909, 524124, 515866, 506190, 495350, 483967, 473057, 463662, 456423, 451410, 448261, 446398, 445248, 444430, 443880, 443768, 444208, 445064, 446168, 447688, 449957, 452796, 455404, 457283, 459039, 461788, 465851, 470460, 474665, 478036, 480563, 482491, 484438, 487059, 490376, 493910, 497684, 502509, 509058, 517326, 527403, 540103, 556155, 575364, 597358, 622846, 653334, 689860, 732832, 782763, 839992, 903437, 970706, 1039963, 1110945, 1183424, 1255183, 1322186, 1380537, 1427692, 1461995, 1481918, 1486295, 1475156, 1449948, 1412771, 1365351, 1308790, 1244317, 1174164, 1101542, 1029745, 961212, 897146, 837723, 782828, 732892, 688949, 651561, 619862, 592204, 567741, 546772, 529357, 514327, 500168, 486420, 473568, 461843, 450870]
51337D50870j0404r383p866o425n428m804m466m387m184l289j704k56K53j36p72
51322C87619j195j338j159n28M71J416J832J518P04M9K48J247K025J704Q18P48
51306C96179J787K633K273J439J383J900J725N67m80o09k89l27r18k038l773n689
51290C95763o632n956m481l536l295k802j419M09J813K420K497K432K312K033
51276C81558J792K160L281M315M334L660L532M297M991M998M982N493N726M755
51262D39874L173K244J949J239o5j067j533k422m302o346p445p430o759n801m883
51247D00426m347m034l309k119j321j420j685j230l96j60o22r50p66n96q38j057
51231C75576o58K12Q93R89O59K86J66M58J133J928K497K656K452K051J636J443
$$ y = [450870, 440466, 431083, 423217, 416792, 411364, 406560, 402094, 397707, 393523, 390234, 388530, 388274, 388527, 388391, 387619, 386424, 385086, 383927, 383399, 383870, 385286, 387118, 388636, 389340, 389389, 389637, 390884, 392909, 394613, 395431, 396179, 397966, 400599, 402872, 404311, 405694, 407594, 409319, 409886, 409406, 408797, 408508, 408181, 407263, 405225, 401452, 395763, 389131, 383175, 378694, 375158, 371863, 369061, 367642, 368051, 369864, 372284, 374781, 377213, 379525, 381558, 383350, 385510, 388791, 393106, 397440, 401100, 404632, 408929, 413920, 418918, 423900, 429393, 435119, 439874, 443047, 445291, 447240, 448479, 448414, 447347, 445814, 443392, 439090, 432744, 425299, 417869, 411110, 405309, 400426, 396079, 392045, 388736, 386617, 385296, 383876, 382191, 380961, 380565, 380405, 379783, 378833, 378067, 377471, 376633, 375576, 374918, 375130, 376023, 377012, 377671, 377957, 378123, 378581, 379714, 381642, 384139, 386795, 389247, 391298, 392934, 394377]
51215C94377J669K167K351J731N89j73o4M26N74M83R63K340L919M772M743M405
51199D25272M196L913L129J892P77J72k12q79j715k107j874j524j358r66n5P29
51183D29390O00j46m94j70J66J16J17N32J035J233J245J232Q96K8r36j351j115
51166D32378n86r2J68J8m53q33r00r37j257j678j934k229k900l658l760k913j620
51149D06814o87o02j311k248k690k469k181k396k786k527j471l19L38O30Q94J136
51133C88125J307J662K357K939K776J909J112R58J262J564J832K335K981L185
51119D16304K623J756J390J797K503K922K904K698K569K614K763K899L009L192
51105D51943L396L287K620J696J101R26O05l22j599k657l255l500l460l212l093
$$ y = [394377, 396046, 398213, 400564, 402295, 402884, 402711, 402647, 403073, 403647, 404130, 405093, 407433, 411352, 416124, 420867, 425272, 429468, 433381, 436510, 438402, 439179, 439351, 439139, 438260, 436545, 434438, 432564, 431040, 429682, 428716, 428661, 429390, 429990, 429844, 429350, 429180, 429346, 429462, 429579, 430111, 431146, 432379, 433624, 434856, 435752, 435780, 434844, 433493, 432378, 431792, 431700, 431868, 431886, 431433, 430600, 429700, 428763, 427506, 425828, 423894, 421665, 418765, 415107, 411347, 408434, 406814, 406127, 405525, 404214, 401966, 399276, 396807, 394626, 392230, 389444, 386917, 385446, 385127, 385465, 386095, 386989, 388125, 389432, 391094, 393451, 396390, 399166, 401075, 402187, 403145, 404407, 405971, 407803, 410138, 413119, 416304, 418927, 420683, 422073, 423870, 426373, 429295, 432199, 434897, 437466, 440080, 442843, 445742, 448751, 451943, 455339, 458626, 461246, 462942, 464043, 464969, 465574, 465252, 463653, 460996, 457741, 454241, 450781, 447569, 444476]
51090D44476l450m052m116l140j628p16j024j853j759l7K404L844L452J975P87
51075D35163N61R81J407J512J426J480J849K371K753K889K924L065L554M635O138
51060D72708P248P227O441O023O392O748O335N413M544L717K918K923M415O667
51046E49719Q217Q776R342J0336J0855J0261R419R480J0117R918Q270N983M053
51033F64746K528P49j756m879q121j0942j3009j4331j5089j5356j4994j3857j2044
51020E43645r932p947o265m730l031j028J080K845L869M198M407N114O263P116
51006E45604P176O838O770O890O478N383M486M671N705O539O520N926N394N184
50992F29564N075M831M629M974O154P816R319J0504J1743J3216J4532J5363J6103
$$ y = [444476, 441026, 436974, 432858, 429718, 428090, 427374, 426350, 424497, 422738, 422701, 425105, 428949, 432401, 434376, 435163, 435724, 436705, 438112, 439624, 441050, 442530, 444379, 446750, 449503, 452392, 455316, 458381, 461935, 466570, 472708, 479956, 487183, 493624, 499647, 506039, 512787, 519122, 524535, 529079, 532796, 535714, 538637, 543052, 549719, 557936, 566712, 576054, 586390, 597245, 607506, 616925, 626405, 636522, 646440, 654710, 660693, 664746, 667274, 668023, 666267, 661388, 653267, 642325, 629316, 614985, 599896, 584540, 569546, 555689, 543645, 533713, 525766, 519501, 514771, 511740, 510712, 511792, 514637, 518506, 522704, 527111, 532225, 538488, 545604, 552780, 559618, 566388, 573278, 579756, 585139, 589625, 594296, 600001, 606540, 613060, 618986, 624380, 629564, 634639, 639470, 644099, 649073, 655227, 663043, 672362, 682866, 694609, 707825, 722357, 737720, 753823]
50979G53823J7304J8669J9150J8106J5892J3189J0268P167M173J667k38j584k170
50966H75416j673j03K171M821P679J0535J3207J5784J8440K0912K2632K3509K4047
50953A037377K4417K3977K2263K0010J8415J7621J6778J5621J5012J5527J6302
50942A243320J6119J5116J4618J5271J6106J5592J3126R237M748K08m067p834
50930A351560j0956j3434j5322j6657j7595j8500j9734k1315k2987k4639k6476
50919A143945k8540l0359l1308l1254l0470k9116k7187k4900k2651k0509j8288
50908H49363j6227j4997j4738j4591j3681j2070j0385q908p684p067p336p899
50896G13780p641o261m580l433k810k367k179k484k973k940k080q66qK70L76Q10
$$ y = [753823, 771127, 789796, 808946, 827052, 842944, 856133, 866401, 873568, 877741, 879408, 879170, 877586, 875416, 873743, 873640, 875811, 880632, 888311, 898846, 912053, 927837, 946277, 967189, 989821, 1013330, 1037377, 1061794, 1085771, 1108034, 1128044, 1146459, 1164080, 1180858, 1196479, 1211491, 1227018, 1243320, 1259439, 1274555, 1289173, 1304444, 1320550, 1336142, 1349268, 1358505, 1363253, 1363461, 1359394, 1351560, 1340604, 1327170, 1311848, 1295191, 1277596, 1259096, 1239362, 1218047, 1195060, 1170421, 1143945, 1115405, 1085046, 1053738, 1022484, 992014, 962898, 935711, 910811, 888160, 867651, 849363, 833136, 818139, 803401, 788810, 775129, 763059, 752674, 743766, 736082, 729015, 721679, 713780, 706139, 699878, 695298, 691865, 689055, 686688, 684509, 682025, 679052, 676112, 674032, 673166, 673158, 673428, 673804, 674614]
50880F74614J580K196K232J758J176Q07P64J094J769K606L449M398N596O827P609
50865G18475P775P749Q183R383J1101J2834J4313J5774J7660J9985K2311K4423
50853H89966K6776K9881L3540L7146M0517M3979M7627N1062N4011N6732N9621
50842A370858O2665O5416O7315O7925O7142O5173O2132N7694N1493M3872L5819
50831B017504K8132K1035J4682R507N778L232J483N17O01J902M417P862J1466
50818B128118J4227J5752J6457J6584J5308J1420M766l498j2058k0398k8537l6316
50806B121825m3323m9268n4125n7888o0373o1318o0553n8073n4053m8964m3545
50795A530342l8423l3643k8781k3666j8756j4589j1030p424l458M54L641N708
$$ y = [674614, 676194, 678390, 680622, 682380, 683556, 684363, 685127, 686221, 687990, 690596, 694045, 698443, 704039, 710866, 718475, 726250, 733999, 742182, 751565, 762666, 775500, 789813, 805587, 823247, 843232, 865543, 889966, 916742, 946623, 980163, 1017309, 1057826, 1101805, 1149432, 1200494, 1254505, 1311237, 1370858, 1433523, 1498939, 1566254, 1634179, 1701321, 1766494, 1828626, 1886320, 1937813, 1981685, 2017504, 2045636, 2066671, 2081353, 2090860, 2096638, 2099870, 2101353, 2101870, 2102471, 2104373, 2108790, 2116652, 2128118, 2142345, 2158097, 2174554, 2191138, 2206446, 2217866, 2222632, 2219134, 2207076, 2186678, 2158141, 2121825, 2078502, 2029234, 1975109, 1917221, 1856848, 1795530, 1734977, 1676904, 1622851, 1573887, 1530342, 1491919, 1458276, 1429495, 1405829, 1387073, 1372484, 1361454, 1354030, 1350572, 1351026, 1354667, 1360375]
50783A360375O598O427N450M014K483J230M76j34j538m303p717j0365j1745j2761
50769A338490j4459j6843j9272k1461k3571k5617k7313k8414k8873k8782k8325
50758A075560k7678k6668k4851k2142j9207j6803j4900j2797j0046o952m174k046
50746H87296l45J455L708O278Q743J0922J3034J5369J7992K0871K3902K6716K8813
50733A064754L0140L1255L2643L4199L5610L6925L8302L9468L9951L9686L9032
50722A461965L8178L6941L5041L2282K8498K3668J8138J2417O820J431l617q139
50710A683623j1921j4598j5647j4874j2801j0181p165l381J188N768R444J1888
50698A621343J3317J3895J3420J1626Q623M993J324k267n987r734j2981j5233
$$ y = [1360375, 1366973, 1373400, 1378850, 1382864, 1385347, 1386577, 1387053, 1386919, 1385381, 1381078, 1373361, 1362996, 1351251, 1338490, 1324031, 1307188, 1287916, 1266455, 1242884, 1217267, 1189954, 1161540, 1132667, 1103885, 1075560, 1047882, 1021214, 996363, 974221, 955014, 938211, 923311, 910514, 900468, 893516, 889342, 887296, 886951, 888406, 892114, 898392, 907135, 918057, 931091, 946460, 964452, 985323, 1009225, 1035941, 1064754, 1094894, 1126149, 1158792, 1192991, 1228601, 1265526, 1303828, 1343296, 1383247, 1422933, 1461965, 1500143, 1537084, 1572125, 1604407, 1632905, 1656573, 1674711, 1687128, 1693948, 1695379, 1691762, 1683623, 1671702, 1657104, 1641457, 1626583, 1613782, 1603601, 1596436, 1593055, 1594243, 1600011, 1609455, 1621343, 1634660, 1648555, 1661975, 1673601, 1682224, 1687217, 1688541, 1686274, 1680287, 1670553, 1657572, 1642339]
50686A642339j6309j6040j4234j1240q152n860m176k242L42L332O482R917J3844
50673A598003J8290K3093K7838L1992L5403L8388M0898M2059M1174L8878L6429
50662A972445L4067L1028K7223K3795K1651K0349J9003J7473J6069J4691J3071
50651B210865J1471J0401R905R661R669J0240J1490J3356J5958J9368K3136K6663
50639B382183L0008L3646L7347L9975M0755M0205L9283L8107L6069L3019K9566
50628B780163K6135K2372J7811J2638P279J477n707j4925k5872l7350m7658n4961
50616B681402n8001n6676n1751m3973l4047k3396j4089p417l049j45J162L5l784
50603B386271r788j7517k6599l6061m4602n1783n8140o3817o7916o9610o9249
$$ y = [1642339, 1626030, 1609990, 1595756, 1584516, 1576364, 1570504, 1566328, 1564086, 1564428, 1567760, 1574242, 1584159, 1598003, 1616293, 1639386, 1667224, 1699216, 1734619, 1773007, 1813905, 1855964, 1897138, 1936016, 1972445, 2006512, 2037540, 2064763, 2088558, 2110209, 2130558, 2149561, 2167034, 2183103, 2197794, 2210865, 2222336, 2232737, 2242642, 2252303, 2261972, 2272212, 2283702, 2297058, 2313016, 2332384, 2355520, 2382183, 2412191, 2445837, 2483184, 2523159, 2563914, 2604119, 2643402, 2681509, 2717578, 2750597, 2780163, 2806298, 2828670, 2846481, 2859119, 2866398, 2867875, 2862168, 2847243, 2821371, 2784021, 2736363, 2681402, 2623401, 2566725, 2514974, 2471001, 2436954, 2413558, 2399469, 2392052, 2389003, 2388858, 2390020, 2390055, 2386271, 2376483, 2358966, 2332367, 2296306, 2251704, 2199921, 2141781, 2077964, 2010048, 1940438, 1871189]
50592A871189o7865o6019o3667o0614n6661n1675m6085m0924l6786l2997k8499
50581A319397k3312j8432j4350j0431n922j029L461P142J0170J2686J4608J5957
50569A309945J6970J7685J7673J6530J4563J2686J1603J1312J1519J2195J3452
50558A466133J5181J7201J9680K3013K7266L2034L6793M1095M4502M6745M7949
50547A817592M8320M7699M5915M3542M1744M1151M1439M2204M3638M6070M9331
50536B308645N3124N7586O2989O9158P5639Q2233Q8907R5430J01538J07295J12876
50525C215420J18090J22478J25741J27697J27949J26018J21699J14843J04962
50516D304897R1618P5162N6630L6762J5663o438k8614m9790o9446q7300j02478
$$ y = [1871189, 1803324, 1737305, 1673638, 1613024, 1556363, 1504688, 1458603, 1417679, 1380893, 1347896, 1319397, 1296085, 1277653, 1263303, 1252872, 1246950, 1245921, 1249382, 1256524, 1266694, 1279380, 1293988, 1309945, 1326915, 1344600, 1362273, 1378803, 1393366, 1406052, 1417655, 1428967, 1440486, 1452681, 1466133, 1481314, 1498515, 1518195, 1541208, 1568474, 1600508, 1637301, 1678396, 1722898, 1769643, 1817592, 1865912, 1913611, 1959526, 2003068, 2044812, 2085963, 2127402, 2169606, 2213244, 2259314, 2308645, 2361769, 2419355, 2482344, 2551502, 2627141, 2709374, 2798281, 2893711, 2995249, 3102544, 3215420, 3333510, 3455988, 3581729, 3709426, 3837375, 3963393, 4085092, 4199935, 4304897, 4396515, 4471677, 4528307, 4565069, 4580732, 4574294, 4545680, 4495890, 4426444, 4339144, 4236666]
50505D236666j13567j19746j21502j19931j15390j07234r4998p9463o2220m4399
50495C258216k6330q494P794K1022L0347L5498L6086L1574K1895P695j0037l0246
50483C375020n1588p2276r0465j04931j15380j22147j25564j25681j22680j17402
50473B326906j11131j04750r8322r1631q4803p8214p2017o6110o0453n5206n0554
50462A453715m6424m2354l7772l2648k7780k3965k0942j7710j3973j0539q027
50451A171581n978l748j610k05O00J465K577L696M918O464P914Q584Q659R025
50437A213942R840J0185R413Q116P350P555Q611J0308J2329J4144J5492J6669
50425A343954J8071J9637K1142K2727K4929K8153L2251L6512M0207M3388M7000
$$ y = [4236666, 4123099, 4003353, 3881851, 3761920, 3646530, 3539296, 3444298, 3364835, 3302615, 3258216, 3231886, 3223392, 3231186, 3252208, 3282555, 3318053, 3354139, 3385713, 3407608, 3415303, 3405266, 3375020, 3323432, 3251156, 3160691, 3055760, 2940380, 2818233, 2692669, 2566988, 2444308, 2326906, 2215775, 2111025, 2012703, 1921072, 1836269, 1758055, 1686038, 1619928, 1559475, 1504269, 1453715, 1407291, 1364937, 1327165, 1294517, 1266737, 1242772, 1221830, 1204120, 1190147, 1179608, 1171581, 1165603, 1161855, 1160245, 1160040, 1160640, 1162105, 1164682, 1168378, 1173296, 1179760, 1187674, 1196258, 1204917, 1213942, 1223782, 1233967, 1243380, 1251496, 1258846, 1266401, 1275012, 1285320, 1297649, 1311793, 1327285, 1343954, 1362025, 1381662, 1402804, 1425531, 1450460, 1478613, 1510864, 1547376, 1587583, 1630971, 1677971]
50414A677971N1791N7275O2316O6605P0805P5217P9100Q1585Q2449Q1675P9014
50403B465803P4558O9067O3070N6102M7424L7069K5572J3096m18j4580k8652m2153
50391B765958n4753o5745p4337q0327q3987q5320q3955p9686p2699o3338n2304
50380A969507m0887l0331k0894j2083l833L102Q007J0756J1301R264M486k434
50368A905961j0522j9175k8156l7070m5137n1596n6154n9023o0498o0549n8964
50357A419117n6006n2542m9265m6027m2381l8536l5197l2587l0244k7797k5245
50346I83290k2450j9101j5493j2668j1253j0667r953q945q071p405o562n399m282
50333H41041l635l659m337n351o056n950n137m040k763j178N50J960K860L417
$$ y = [1677971, 1729762, 1787037, 1849353, 1915958, 1986763, 2061980, 2141080, 2222665, 2305114, 2386789, 2465803, 2540361, 2609428, 2672498, 2728600, 2776024, 2813093, 2838665, 2851761, 2851343, 2836763, 2808111, 2765958, 2711205, 2645460, 2571123, 2490796, 2406809, 2321489, 2237534, 2157848, 2085149, 2021811, 1969507, 1928620, 1898289, 1877395, 1865312, 1861479, 1864581, 1872588, 1883344, 1894645, 1903909, 1908395, 1905961, 1895439, 1876264, 1848108, 1811038, 1765901, 1714305, 1658151, 1599128, 1538630, 1478081, 1419117, 1363111, 1310569, 1261304, 1215277, 1172896, 1134360, 1099163, 1066576, 1036332, 1008535, 983290, 960840, 941739, 926246, 913578, 902325, 891658, 881705, 872760, 864689, 857284, 850722, 845323, 841041, 837406, 833747, 829410, 824059, 818003, 812053, 806916, 802876, 800113, 798935, 799485, 801445, 804305, 807722]
50319H07722L684L528L106K972L405M044M377M391M487M969N803O697P284P375
50305H73844P194P157P346P399P084O651O413O269O001N868O461P931R681J0917
50291I76216J1322J1131J0716J0169R246P717N788M074L067K608K007O28j607
50278A053082m156o258p624q800j0548j2725j4163j3957j2551j1034r767q331
50266I33168o665n390m812m423l821l427l692m053l489j884j75Q45J233J401J494
50251H96310J514J623J922K178K090J696J342J291J516J767J747J334P69N22P99
50236I18420J221J129K76r43j999k863l932n314o494o863o495o033n860n724n334
50221H63192m977n132n690n924n307m058k795j865j122k07J059K469L626M420
$$ y = [807722, 811406, 814934, 818040, 821012, 824417, 828461, 832838, 837229, 841716, 846685, 852488, 859185, 866469, 873844, 881038, 888195, 895541, 902940, 910024, 916675, 923088, 929357, 935358, 941226, 947687, 955618, 965299, 976216, 987538, 998669, 1009385, 1019554, 1028800, 1036517, 1042305, 1046379, 1049446, 1052054, 1054061, 1054689, 1053082, 1048926, 1042668, 1035044, 1026244, 1015696, 1002971, 988808, 974851, 962300, 951266, 941499, 933168, 926503, 921113, 916301, 911878, 908057, 904630, 900938, 896885, 893396, 891512, 891337, 892182, 893415, 894816, 896310, 897824, 899447, 901369, 903547, 905637, 907333, 908675, 909966, 911482, 913249, 914996, 916330, 917099, 917621, 918420, 919641, 920770, 921046, 920103, 918104, 915241, 911309, 905995, 899501, 892638, 886143, 880110, 874250, 868526, 863192, 858215, 853083, 847393, 841469, 836162, 832104, 829309, 827444, 826322, 826115, 827174, 829643, 833269, 837689]
50207H37689N290O904R487J2535J5192J6947J8071J9392K1495K4031K5939K6494
50195A039466K5959K5036K3957K2437K0338J7960J5675J3637J1825J0041P864
50184A234195M975J584j885n544j0049j5597k1326k5986k8914l0157k9951k8484
50172A042861k6001k2821j9235j5531j1979q693n645k995j189n69r90k002l330
50159I21881n013p137r472j1266j1511r824p066m720l459k722j813r25o98j295
50145H44960k434l970n826p539q485q613q426q275q036p453o357m609k326j12
50131G62499J408K379L431M567M928L947K196O84k33p74r13l35P94J676J779J584
50115G89617K011L194M251M424M064M145M910N699O043O346O953P292O687N646
$$ y = [837689, 842979, 849883, 859370, 871905, 887097, 904044, 922115, 941507, 963002, 987033, 1012972, 1039466, 1065425, 1090461, 1114418, 1136855, 1157193, 1175153, 1190828, 1204465, 1216290, 1226331, 1234195, 1239170, 1240754, 1238869, 1233325, 1223276, 1207679, 1186353, 1160367, 1131453, 1101296, 1071345, 1042861, 1016860, 994039, 974804, 959273, 947294, 938601, 932956, 929961, 928772, 928203, 927213, 925211, 921881, 916868, 909731, 900259, 888993, 877482, 867658, 860592, 855872, 852413, 849691, 847878, 846953, 846255, 844960, 842526, 838556, 832730, 825191, 816706, 808093, 799667, 791392, 783356, 775903, 769546, 764937, 762611, 762499, 763907, 766286, 769717, 774284, 779212, 783159, 785355, 786039, 785806, 785032, 784119, 783784, 784578, 786254, 788033, 789617, 791628, 794822, 799073, 803497, 807561, 811706, 816616, 822315, 828358, 834704, 841657, 848949, 855636, 861282]
50101H61282N430O378P549Q254Q926J0151J1609J2672J3455J4597J6376J8737
50089I95416K1866K5955L0513L4641L8053M1219M4415M7256M9350N0804N1731
50078A431219N1798N0646M8490M5824M2829L9508L6238L3591L1493K9013K5189
50067A865838J9825J3275N718k955j2629k2634l2057m0210m6794n1838n5545n8030
50055A581964n9106n8496n6408n3628n0730m7447m3144l7837l2301k7210k2668
50044A092989j8703j5590j3420j1728j0055q576p711p246o390m688k510n58Q19
50031I86633J742K563L539M511M863M143K774J716J319Q35o20k939n194o646p271
50016I91968p491p752q361r355j0449j1377j2209j3060j3609j3394j2651j2226
$$ y = [861282, 866712, 873090, 880639, 888893, 897819, 907970, 919579, 932251, 945706, 960303, 976679, 995416, 1017282, 1043237, 1073750, 1108391, 1146444, 1187663, 1232078, 1279334, 1328684, 1379488, 1431219, 1483017, 1533663, 1582153, 1627977, 1670806, 1710314, 1746552, 1780143, 1811636, 1840649, 1865838, 1885663, 1898938, 1904656, 1901701, 1889072, 1866438, 1834381, 1794171, 1747377, 1695539, 1639994, 1581964, 1522858, 1464362, 1407954, 1354326, 1303596, 1256149, 1213005, 1175168, 1142867, 1115657, 1092989, 1074286, 1058696, 1045276, 1033548, 1023493, 1014917, 1007206, 999960, 993570, 988882, 986372, 985814, 986633, 988375, 990938, 994477, 998988, 1003851, 1007994, 1010768, 1012484, 1013803, 1014638, 1014018, 1011079, 1005885, 999239, 991968, 984477, 976725, 968364, 959009, 948560, 937183, 924974, 911914, 898305, 884911, 872260, 860034]
50004H60034j2378j2149j0523p779n032k651N4L491P017R850J2036J3889J5022
49991H70881J4772J3281J1401R555P461N050K898J488O38n0p69j861l886o728
49977I24131r102r709q662p144n802m184j759J199M026O477Q890J1784J5483J9781
49963I45409K3860K6791K8389K9363L0485L1809L2792L2989L2521L1940L1724
49952A278072L1812L1643L0929L0084K9543K8703K6174K1215J4364O387k660j2763
49940A513503k2889l1463l7785m2335m5702m7927m8994m9321m9350m9054m8122
49929A040561m6377m3797m0404l6506l2769k9661k6847k3539j9500j5441j2234
49918G13486r987q082o003l818j863l13P40J089O97J04J75J353L402N899Q553
$$ y = [860034, 847656, 835507, 824984, 817205, 812173, 809522, 809576, 813067, 820084, 829934, 841970, 855859, 870881, 885653, 898934, 910335, 919890, 927351, 932401, 935299, 936787, 937425, 937375, 936606, 934745, 930859, 924131, 915029, 905320, 896658, 889514, 883712, 879528, 877769, 878968, 882994, 889471, 898361, 910145, 925628, 945409, 969269, 996060, 1024449, 1053812, 1084297, 1116106, 1148898, 1181887, 1214408, 1246348, 1278072, 1309884, 1341527, 1372456, 1402540, 1432083, 1460786, 1486960, 1508175, 1522539, 1528926, 1526266, 1513503, 1490614, 1459151, 1421366, 1379031, 1333329, 1285402, 1236408, 1187087, 1137737, 1088683, 1040561, 994184, 950387, 909983, 873477, 840708, 811047, 784200, 760661, 741161, 725720, 713486, 703499, 695417, 689414, 685596, 683733, 683420, 684160, 685249, 685946, 686050, 686225, 687578, 690980, 696879, 705432]
49903G05432J1008J2795J3878J4808J6030J7332J8328J9067J9546J9029J6657
49892H83910J2705Q455M708J230k197n087p062q709j0916j3750j6529j8712k0166
49879H07880k0892k1043k1037k1095k0793j9605j7686j5602j3448j0918q234o248
49867F11279n354m829l619j452J086L241M660N540O377P452Q552R434J0478J2324
49853F65169J4769J6660J7251J7125J7302J7795J7658J6213J3695J0679P508M368
49841H36192J520q59k905m959p272r772j2057j3681j4594j5193j5791j6078j5354
49828G09197j3239j0080o737m107k593j721m26J868M517O381P262Q141R877J2169
49814G20509J4080J5179J5682J5745J5170J3857J2124J0368Q694O986N197L303
$$ y = [705432, 716440, 729235, 743113, 757921, 773951, 791283, 809611, 828678, 848224, 867253, 883910, 896615, 905070, 909778, 911008, 908811, 903724, 896662, 887953, 877037, 863287, 846758, 828046, 807880, 786988, 765945, 744908, 723813, 703020, 683415, 665729, 650127, 636679, 625761, 617527, 611279, 605925, 601096, 597477, 596025, 597111, 600352, 605012, 610552, 616929, 624381, 632933, 642367, 652845, 665169, 679938, 696598, 713849, 730974, 748276, 766071, 783729, 799942, 813637, 824316, 831824, 836192, 837712, 836853, 833948, 828989, 821717, 811945, 799888, 786207, 771613, 756420, 740629, 724551, 709197, 695958, 685878, 679141, 675034, 672441, 670720, 670294, 672162, 676679, 683060, 690322, 698463, 708340, 720509, 734589, 749768, 765450, 781195, 796365, 810222, 822346, 832714, 841408, 848394, 853591, 856894]
$$ [...]
##END NTUPLES=NMR SPECTRUM
##END=
