
##TITLE=UV1125_M3-1004-1000_6274892_X7K6TUEJ8X
##JCAMPDX= 6.0         $$ Bruker NMR JCAMP-DX V2.0
##DATA TYPE= NMR SPECTRUM
##DATA CLASS= NTUPLES
##ORIGIN= BRUKER
##OWNER= Administrator
$$ 1.72 TOPSPIN		Version 2.1
$$ 2012-06-07 01:43:08.796 -0500  Administrator@TOPSPIN
$$ Compression mode = diff/dup
##.OBSERVE FREQUENCY= 400.13188235
##.OBSERVE NUCLEUS= ^1H
##.ACQUISITION MODE= SIMULTANEOUS (DQD)
##.ACQUISITION SCHEME= undefined
##.AVERAGES= 8
##.DIGITISER RES= 22
##SPECTROMETER/DATA SYSTEM= spect
##.PULSE SEQUENCE= zg30
##.SOLVENT NAME= COFFEE_meoh
##.SHIFT REFERENCE= INTERNAL, COFFEE_meoh, 1, 14.98061
##AUDIT TRAIL= $$ (NUMBER, WHEN, WHO, WHERE, PROCESS, VERSION, WHAT)
$$ ##TITLE= Audit trail, TOPSPIN		Version 2.1
$$ ##JCAMPDX= 5.01
$$ ##ORIGIN= Bruker BioSpin GmbH
$$ ##OWNER= Administrator
$$ $$ C:\Bruker\TOPSPIN/data/COFFEE/nmr/UV1125_M3-1004-1000_6274892_X7K6TUEJ8X/20/pdata/1/auditp.txt
$$ ##AUDIT TRAIL=  $$ (NUMBER, WHEN, WHO, WHERE, PROCESS, VERSION, WHAT)
(   1,<2012-06-07 01:42:59.546 -0500>,<Administrator>,<TOPSPIN>,<go>,<TOPSPIN 2.1>,
      <created by zg
	started at 2012-06-07 01:41:52.656 -0500,
	POWCHK enabled, PULCHK disabled,
       configuration hash MD5:
       D5 CA 7A 23 FE 6B EE E2 50 67 74 61 24 F7 5E 3B
       data hash MD5: 64K
       62 B3 34 85 F7 61 D9 B7 85 1B A2 A9 1D 95 BD 02>)
(   2,<2012-06-07 01:43:04.156 -0500>,<Administrator>,<TOPSPIN>,<proc1d>,<TOPSPIN 2.1>,
      <Start of raw data processing
       efp LB = 0 FT_mod = 6 PKNL = 1 PHC0 = 0 PHC1 = 0 SI = 32K 
       data hash MD5: 32K
       E2 7E AD 37 0E 66 F8 48 DA 64 48 5E 5F 89 D7 3F>)
(   3,<2012-06-07 01:43:04.562 -0500>,<Administrator>,<TOPSPIN>,<proc1d>,<TOPSPIN 2.1>,
      <pk PHC0 = 208.6029 PHC1 = 0 
       data hash MD5: 32K
       07 76 75 75 4B BF 33 BE 09 F5 DA 0F A7 91 4E 9B>)
(   4,<2012-06-07 01:43:04.640 -0500>,<Administrator>,<TOPSPIN>,<proc1d>,<TOPSPIN 2.1>,
      <abs ABSG = 1 
       data hash MD5: 32K
       9C DE E1 64 59 BC 97 39 AB 2B 5F F8 05 A8 F5 FE>)
(   5,<2012-06-07 01:43:04.671 -0500>,<Administrator>,<TOPSPIN>,<proc1d>,<TOPSPIN 2.1>,
      <abs ABSG = 2 
       data hash MD5: 32K
       F0 91 63 3B 48 70 25 EF 72 87 FA 65 55 5C 16 7B>)
(   6,<2012-06-07 01:43:04.703 -0500>,<Administrator>,<TOPSPIN>,<proc1d>,<TOPSPIN 2.1>,
      <abs ABSG = 3 
       data hash MD5: 32K
       3E 09 CE 3F FD 8F DB 69 01 C5 AC C4 5C 84 B5 DB>)
(   7,<2012-06-07 01:43:04.734 -0500>,<Administrator>,<TOPSPIN>,<proc1d>,<TOPSPIN 2.1>,
      <abs ABSG = 4 
       data hash MD5: 32K
       F3 8B 25 29 3B EE 0D 77 CD 0E 8A 52 52 C9 48 CA>)
(   8,<2012-06-07 01:43:04.765 -0500>,<Administrator>,<TOPSPIN>,<proc1d>,<TOPSPIN 2.1>,
      <abs ABSG = 5 
       data hash MD5: 32K
       E2 42 A2 9D 58 F4 11 A5 B9 CB C8 89 5D AE 4A D1>)
$$ ##END=
$$ 
$$ $$ hash MD5
$$ $$ AF F0 F1 41 DE 0E 03 76 67 AA 2F 0C 46 AE A7 0F
##$RELAX= 
##$RELAX= 
##$RELAX= 
##$RELAX= 
##$RELAX= 
##$RELAX= 
##$RELAX= 
$$ Bruker specific parameters
$$ --------------------------
$$ [...]
##$TP= (0..7)
150 150 150 150 150 150 150 150
##$TP07= 0
##$TPNAME0= <>
##$TPNAME1= <>
##$TPNAME2= <>
##$TPNAME3= <>
##$TPNAME4= <>
##$TPNAME5= <>
##$TPNAME6= <>
##$TPNAME7= <>
##$TPOAL= (0..7)
0.5 0.5 0.5 0.5 0.5 0.5 0.5 0.5
##$TPOFFS= (0..7)
0 0 0 0 0 0 0 0
##$TUNHIN= 0
##$TUNHOUT= 0
##$TUNXOUT= 0
##$USERA1= <user>
##$USERA2= <user>
##$USERA3= <user>
##$USERA4= <user>
##$USERA5= <user>
##$V9= 5
##$VALIST= <valist>
##$VCLIST= <CCCCCCCCCCCCCCC>
##$VD= 0
##$VDLIST= <DDDDDDDDDDDDDDD>
##$VPLIST= <PPPPPPPPPPPPPPP>
##$VTLIST= <TTTTTTTTTTTTTTT>
##$WBST= 2048
##$WBSW= 25
##$XGAIN= (0..3)
0 0 0 0
##$XL= 0
##$YL= 0
##$YMAX_a= 505839
##$YMIN_a= -618164
##$ZGOPTNS= <>
##$ZL1= 120
##$ZL2= 120
##$ZL3= 120
##$ZL4= 120
##$ABSF1= 14.98061
##$ABSF2= -5.57192
##$ABSG= 5
##$ABSL= 3
##$ALPHA= 0
##$AQORDER= 0
##$ASSFAC= 0
##$ASSFACI= 0
##$ASSFACX= 0
##$ASSWID= 0
##$AUNMP= <proc_prof1d_extract_pilot.lims>
##$AXLEFT= 0
##$AXNAME= <>
##$AXNUC= <1H>
##$AXRIGHT= 0
##$AXTYPE= 0
##$AXUNIT= <>
##$AZFE= 0.1
##$AZFW= 0.1
##$BCFW= 0
##$BC_mod= 0
##$BYTORDP= 0
##$COROFFS= 0
##$CY= 15
##$DATMOD= 1
##$DC= 0
##$DFILT= <>
##$DTYPP= 0
##$F1P= 0
##$F2P= 0
##$FCOR= 0.5
##$FTSIZE= 32768
##$FT_mod= 6
##$GAMMA= 0
##$GB= 0
##$INTBC= 1
##$INTSCL= 1
##$ISEN= 128
##$LB= 0
##$LEV0= 0
##$LPBIN= 0
##$MAXI= 10000
##$MC2= 0
##$MEAN= 0
##$ME_mod= 0
##$MI= 0
##$NCOEF= 0
##$NC_proc= -8
##$NLEV= 6
##$NOISF1= 0
##$NOISF2= 0
##$NSP= 0
##$NTH_PI= 0
##$NZP= 0
##$OFFSET= 14.98061
##$PC= 1
##$PHC0= 208.6029
##$PHC1= 0
##$PH_mod= 1
##$PKNL= yes
##$PPARMOD= 0
##$PPDIAG= 0
##$PPIPTYP= 0
##$PPMPNUM= 2147483647
##$PPRESOL= 1
##$PSCAL= 4
##$PSIGN= 0
##$PYNMP= <proc.py>
##$REVERSE= no
##$SF= 400.13
##$SI= 32768
##$SIGF1= 0
##$SIGF2= 0
##$SINO= 400
##$SIOLD= 32768
##$SPECTYP= <>
##$SREGLST= <1H.CDCl3>
##$SSB= 0
##$STSI= 32768
##$STSR= 0
##$SW_p= 8223.68421052632
##$SYMM= 0
##$S_DEV= 0
##$TDeff= 65536
##$TDoff= 0
##$TI= <>
##$TILT= no
##$TM1= 0
##$TM2= 0
##$TOPLEV= 0
##$USERP1= <user>
##$USERP2= <user>
##$USERP3= <user>
##$USERP4= <user>
##$USERP5= <user>
##$WDW= 1
##$XDIM= 32768
##$YMAX_p= 458337256
##$YMIN_p= -741022
##$CURPLOT= <Network HP LaserJet P1505>
##$CURPRIN= <$Network HP LaserJet P1505>
##$DFORMAT= <normdp>
##$LAYOUT= <+/1D_H.xwp>
##$LFORMAT= <normlp>
##$PFORMAT= <normpl>
##$SURQMSG= 1
$$ End of Bruker specific parameters
$$ ---------------------------------
##NTUPLES= NMR SPECTRUM
##VAR_NAME=  FREQUENCY,     SPECTRUM/REAL,   SPECTRUM/IMAG
##SYMBOL=    X,             R,               I
##VAR_TYPE=  INDEPENDENT,   DEPENDENT,       DEPENDENT
##VAR_FORM=  AFFN,          ASDF,            ASDF
##VAR_DIM=   32768,         32768,           32768
##UNITS=     HZ,            ARBITRARY UNITS, ARBITRARY UNITS
##FACTOR=    0.250966925370066, 1,           1
##FIRST=     8223.43324360095, 173227,       72601
##LAST=      0,             143901,          -123317
##MIN=       0,             -741022,         0
##MAX=       8223.43324360095, 458337256,    0
$$ Real data points
##PAGE= N=1
##DATA TABLE= (X++(R..R)), XYDATA
$$ [...]
19562h7623G2901D241J49935a47348g0931j68440A51690b74922P8011j30882O5495
19551b62298a02567F0956c64027B24900h6525J79d3051J3434r8399a4512r0310
19540a04822A12584b37559D6686Q4631J6209O7202G9975Q9344b27401A43493J70609
19529C14102L9635J8399A10887a00067C9125a99313R312A04714J44513b09668
19518a74584b1194A53309a71783A14968K60501a21313c0023o0267G0903K460J6365
19507H9728d5770a4891D4907a58899c3635q5536k14530i7611B01781b47258K2171
19496b25087Q2034K9057N3043j84664P3026j37748j05515D0693a03381j7192k10896
19485c31469A61013D2361a16193F6942a66291b4012j43057A40745m0920L6620
$$ y = [-87623, 72901, 4241, 154176, -147348, -70931, -239371, 151690, -274922, -196911, -327793, -262298, -102567, 60956, -364027, 224900, -86525, -86346, -43051, -29617, -128016, -14512, -104822, 112584, -237559, 46686, 131317, 147526, 214728, 79975, 169319, -227401, 143493, 314102, 353737, 372136, 110887, -100067, 39125, -199313, -190001, 104714, 249227, -209668, -174584, -21194, 153309, -171783, 114968, 375469, -121313, -30023, -90290, 70903, 73363, 89728, -45770, -14891, 44907, -158899, -33635, -119171, -333701, -97611, 201781, -247258, -225087, -143053, -113996, -60953, -245617, -172591, -310339, -415854, 40693, -103381, -120573, -331469, 161013, 42361, -116193, 66942, -166291, -24012, -167069, 140745, 99825, 136445]
19475A36445e3944L910D2384a60929A2257b6661h016k32571H9668e9739k22543
19464b82282e2944A7499a8776A5859e1152A34824a54039j90267G4857J36940g4842
19452A7897a64651F577e2016A09466a43818b1092k5780j88837J14046E8870N4770
19441A13640e06506i2368A6956b5051p8182f773H7857c14423k6906B359f6819
19429A86838p6580a27670C2704b2979m17050i1427l212M5851A0966J8759P0129
19418I9854J42869a86447l855O2220j99679J47542A69566a48898D3793B29Q6501
19407H6730l3041J25462b43310j08844J74671A8579a77707c4497I5963b05029
19396i2216l78316i9817A80380a86759B8143L246a18709b0730C4535i7548c2303
$$ y = [136445, -53944, -50034, 42384, -160929, 12257, -26661, -8016, -240587, 89668, -59739, -282282, -52944, 17499, -18776, 15859, -51152, 134824, -154039, -344306, 74857, 211797, -74842, 17897, -164651, 6577, -52016, 109466, -143818, -21092, -46872, -235709, -121663, 58870, 113640, -506506, -92368, 16956, -25051, -103233, -6773, 87857, -314423, -341329, 2359, -66819, 186838, 110258, -127670, 32704, -22979, -440029, -91427, -94639, -48788, 10966, 29725, 99854, 242723, -186447, -190302, -128082, -327761, -180219, 169566, -148898, 43793, 229, 86730, 53689, 179151, -243310, -352154, -177483, 18579, -177707, -34497, 95963, -205029, -92216, -470532, -99817, 180380, -186759, 28143, 31389, -118709, -20730, 34535, -97548, -32303]
19384A56896a7447G6465b27689J7161B12077E9443c24675j25638a36589d6333
19373c06569J05503e1563A920R3203p652h407B89553b34961B7745K16254c60949
19361B37727f4075j87579g3143m6502q0204d0570A19725B6477f6504j79640A83296
19349e003k83327i13k3735l39431A31488a49431l35710C4391e2348J8028M369
19338b9951j85950M5238j30065a24766A4378e8618E4534a74804A03725d9428A62624
19326G8514J17628n5958b7439h890l53088R9901f7828b9926E9071N7167c37073
19314a1321j6866j38294B489g6696k17857a29854A4639a33290A2019b68941J20546
19303a48395e4792A47039n3643d720l06490F9058B5602c64039A44162E8026i4745
$$ y = [156896, -17447, 76465, -227689, -210528, 212077, 59443, -324675, -450313, -136589, -46333, -306569, -201066, -51563, 1920, 95123, 87471, -8407, 289553, -234961, 27745, 243999, -360949, 237727, -64075, -251654, -73143, -119645, -199849, -40570, 119725, 26477, -66504, -246144, 183296, -5003, -288330, -913, -24648, -364079, 131488, -149431, -485141, 34391, -52348, -34320, -29951, -215901, -170663, -300728, -124766, 14378, -58618, 54534, -174804, 103725, -49428, 162624, 78514, 196142, 140184, -27439, -8890, -361978, -262077, -67828, -29926, 59071, 116238, -337073, -11321, -28187, -166481, 2489, -76696, -294553, -129854, 14639, -133290, 12019, -268941, -148395, -54792, 147039, 93396, -4720, -311210, 69058, 25602, -364039, 144162, 58026, -94745]
19291a65200d630I4717a86421c6712J5733E648a88051h637o7696b4756A62683
19279B02312b9843o0661B75108a4139o2950m1469A12717K18287a77642B33009
19268b850j59061l6332j39346P8815a06355f382l00534e9380J0961A38480g4664
19256a52885J2167c5286A40643F4122k5499L10345I2349a35415N1450n225K9662
19245e9528j72064i0008B36646a58993K297j33161H4743B4056J73408k2282B7218
19233a96637A58410b39787H4821J06981a49892P0796K3514J7438B3700a9271m56993
19222d76264C5119b00356D5314a13745j65450f8853K9235A78653i687p4168O923
19211g6932B7022b7362B18516a72652P1097A70783a74395n328g3054D87299a86072
$$ y = [-165200, -4630, 94717, -186421, -36712, -20979, 5648, -188051, -8637, -76333, -24756, 162683, 202312, -29843, -90504, 275108, -14139, -77089, -118558, 112717, 331004, -177642, 233009, -2850, -161911, -198243, -337589, -258774, -106355, -6382, -306916, -59380, -48419, 138480, -74664, -152885, -140718, -35286, 140643, 64122, 38623, 348968, 92349, -135415, -83965, -89190, -59528, -231592, -90008, 236646, -158993, -156696, -289857, 84743, 24056, 197464, 175182, 27218, -196637, 158410, -239787, 84821, 191802, -149892, -79096, -55582, -38144, 23700, -19271, -476264, 35119, -200356, 45314, -113745, -279195, -68853, -39618, 178653, -9687, -83855, -76932, 27022, -27362, 218516, -172652, -101555, 170783, -174395, -179723, -73054, 487299, -186072]
19199b21301D3544d6254j54339A53748a33765f6680D293b88668O8119C9692c62002
19187A17131P3161C8375a1153j62476A1720a06290j37808j99432A41990a6816
19176a30217a9055A18299b86132I7157A1714c06813i4325k17532a12710A27460
19165c73579A33792m4140J35589B0926i7319l08342J38399h0065B91938G6042
19154A72519a62438I6344a52334o7108n1297e4616m1400c846B17994a19232e9080
19142e90005a25325p4071h038r067j00313C2273A2944a51820B38081a54711j04586
19131b59297M0470h7736G8929b20271d2139C5430a74526Q3564j4695G6757j2i6863
19118c00453c4824k35661o196A02413N8593a71254j23517J03405N0431E5336a9280
$$ y = [-221301, 43544, -46254, -200593, 153748, -133765, -66680, 4293, -288668, -220549, 39692, -362002, 117131, 190292, 38375, -11153, -173629, 11720, -106290, -244098, -443530, 141990, -16816, -130217, -19055, 118299, -286132, 97157, 11714, -306813, -94325, -311857, -112710, 127460, -373579, 133792, 89652, 225241, 20926, -97319, -405661, -267262, -80065, 291938, 76042, 172519, -162438, 96344, -152334, -219442, -270739, -54616, -96016, -3846, 217994, -119232, -59080, -590005, -125325, -199396, -8038, -17105, -117418, 32273, 12944, -151820, 238081, -154711, -259297, -218827, -87736, 78929, -220271, -42139, 35430, -174526, -90962, -105657, 76757, 76745, -96863, -300453, -34824, -270485, -276681, 102413, 161006, -171254, -294771, -191366, -140935, 55336, -19280]
19106a23945N5593n1394q9755N7558F3950J28209j9992e25809i2900A69927c07154
19094a71795C02929a56622P3705n3228C5577Q8187Q9892c88777J73281j47234
19084c62730b3900n45l56730b8373B36993O006a74879d6001A0089a86882A21393
19072C6178b02293D5035b15627A75528a37871b3257B21631c92049C9109d6653
19061F1416i1220k688k16999J38526j58368d323m06927b04260c147A05058c8595
19049a73812B06179J8059a60788j00223C2741b85268i991j74343e4344K3264E8994
19037C12833D8340b10657k119e3370F4261a34337C3503H2b56123h1602q1080K5739
19025a36943E147b55855B84094o5054a8215B29366I9845c391B07040K31000b0104
$$ y = [-123945, -68352, -119746, -209501, -151943, 63950, 192159, 172167, -525809, -92900, 169927, -307154, -171795, 302929, -156622, -82917, -136145, 35577, 123764, 213656, -388777, -215496, -362730, -23900, -24445, -381175, -28373, 236993, 242999, -174879, -46001, 10089, -186882, 121393, 36178, -202293, 45035, -215627, 175528, -137871, -23257, 221631, -392049, 39109, -46653, 61416, -91220, -93908, -310907, -172381, -330749, -4323, -411250, -204260, -3147, 105058, -38595, -173812, 206179, 224238, -160788, -261011, 32741, -285268, -9991, -184334, -54344, -31080, 58994, 312833, 48340, -210657, -212776, -53370, 64261, -134337, 33503, 82, -256123, -81602, -162682, -136943, 5147, -255855, 284094, 219040, -18215, 229366, 99845, -3391, 207040, 438040, -20104]
19013A1533L51210b18467d1647j08338a7498k8726E5850r796J28123a03054k059
19002a05113C72428b3052A36621B6851J84203g865H2101K27882a05805H2710c1948
18990A12927L9370R5660j14617b80270J17677A79543a48202q5768r018k7735C71405
18978g9301C2365J20218b27609a12170j38480A22641i9888a566k59725J13882
18968a47409h070k62111J17290j22087H0756a02852A12138l8998c26873a05283
18957b34442i3377F6744L5534a57092K5510k7182r5434k56681a84062Q4551b7513
18945a5451j44653H0981a04582A03413J20170E6429J64237R5069j48854d7213
18934b77399P5320m0370B00878a6730m15861G474a02985B05201a57836P5967A90680
$$ y = [11533, 362743, -218467, -41647, -149985, -17498, -46224, 55850, 46054, 174177, -103054, -105113, 372428, -23052, 136621, 26851, 211054, -7865, 82101, 309983, -105805, 82710, -31948, 112927, 152297, 247957, 133340, -280270, -162593, 179543, -148202, -233970, -242988, -270723, 371405, -79301, 32365, 152583, -227609, -112170, -250650, 122641, -99888, -1566, -261291, -147409, -8070, -270181, -152891, -274978, 80756, -102852, 112138, 73140, -326873, -105283, -234442, -93377, 66744, 102278, -157092, -131582, -158764, -254198, -510879, -184062, -99511, -27513, -15451, -160104, 80981, -104582, 103413, 223583, 56429, 220666, 315735, 166881, -47213, -277399, -202079, -242449, 200878, -16730, -432591, 7474, -102985, 205201, -157836, -81869, 190680]
18922d06436d6100j42158H266a73538B32699c0735C33028c72027B07779E9993
18911A05673J52964I2248b56900d8276k09519A0952a15388A8105P8073l4683K41581
18900C03076A34468E6362c3932m9600C15521A43691h2067k51241a36883j00855
18890b37738P2358O1103q1853e2196A0069e7305Q053j23477A02423g8519I6708
18878h6176L8409p8697m1676r5698a20830j1957M5500j06787N5991I3058a18495
18866f0529k30451g5137H0753b8911j74053C81186a60294H7421B5940d8728j36872
18855a85600f8384B7147a5868n40A19954b93702F0742a68347C91963a76462n6308
18844b32770b2134C1146N9386l0039g1932o8217a415A49042a05075c9176a814
$$ y = [-406436, -46100, -188258, 8266, -173538, 232699, -30735, 333028, -372027, 207779, 59993, 105673, 258637, 92248, -256900, -48276, -257795, 10952, -115388, 18105, 96178, 61495, 303076, 134468, 56362, -33932, -83532, 315521, 143691, -82067, -333308, -136883, -237738, -165380, -104277, -186130, -52196, 10069, -57305, -49252, -172729, 102423, -78519, 96708, -86176, -47767, -126464, -168140, -263838, -120830, -132787, -87287, -194074, -138083, 93058, -118495, -60529, -290980, -75137, 80753, -28911, -202964, 381186, -160294, 87421, 25940, -48728, -185600, -68384, 27147, -15868, -16408, 119954, -293702, 60742, -168347, 391963, -176462, -232770, -22134, 31146, 90532, 60493, -71932, -140149, -1415, 149042, -105075, -39176, -1814]
18832I6986a19037A38208K63K4216n4804a96966L8223b0506k40376B02867b00114
18820B96750c04926e3989E2665o785h9610c6325A25430a9886F9336l3259N3457
18809H9534M6415b5380k52408D9454J99929a02728j61778B9746c3253B41678I1027
18797a13195C90284c57649B16287C7494H575N7749b03713k98195G8783b28795
18786a67183O4834A19538a62690B4919L7159J44377b11264A36561C9581N7927
18776I7508l3786c6367r8615e5953j85768e3855n33m08394e3720l3751l8440e642
18763C30002A22727K8926a61256M9581A49010a15992j5111L7607A62299a13798
18752a13846H2490l806A3678J68390e263A30112c0540k85029G6547J01153f7822
$$ y = [96986, -119037, 138208, 138471, 162687, 107883, -196966, -158743, -20506, -260882, 202867, -200114, 296750, -304926, -53989, 52665, 45880, -89610, -36325, 125430, -19886, 69336, 36077, 89534, 135949, -25380, -277788, 49454, 249383, -102728, -264506, 29746, -33253, 241678, 91027, -113195, 390284, -357649, 216287, 37494, 8575, 66324, -203713, -501908, 78783, -228795, -167183, -102349, 119538, -162690, 24919, 62078, 206455, -211264, 136561, 39581, 97508, 63722, -36367, -134982, -55953, -241721, -53855, -54388, -462782, -53720, -87471, -125911, -5642, 330002, 122727, 151653, -161256, -111675, 149010, -115992, -131103, -93496, 162299, -113798, -113846, 82490, 78684, 13678, 182068, -5263, 130112, -30540, -315569, 76547, 177700, -67822]
18740E0946b35330G1954a07234A38871C6869a47972E8900b83310o0329b6448j43489
18729a69937F0672a59253N9286a0016k07634m8505R1264Q6824k20974P6327Q0054
18718a52660K6380o1098Q5264j7816j81026a39717j8480a6754B08108c97436B8945
18706A23942g9426F1170Q289j6952h8869j41443E5867J24457n2616a51490G1950
18694b17920l1517A9696J3953A4586a24685B35040g1390b5337j68070A86415B9009
18682a38231B37947q5293i9579d7292j49529K6486G5613h2103j54040F2088g2386
18670B9612c26345d7771k41841f8624H3878O2384m5879O4753O4469i2425j40750
18659b33175g1832m1144B56727a22582a9889o9613p4686B2646c53248f3634K1325
$$ y = [50946, -235330, 71954, -107234, 138871, 36869, -147972, 58900, -283310, -343639, -26448, -169937, 60672, -159253, -99967, -10016, -217650, -266155, -174891, -88067, -309041, -232714, -152660, -126280, -187378, -102114, -119930, -300956, -139717, -158197, -16754, 208108, -397436, 28945, 123942, -79426, 61170, 69459, 52507, -88869, -230312, 55867, 180324, 127708, -151490, 71950, -217920, -249437, 19696, 33649, 14586, -124685, 235040, -71390, -25337, -193407, 186415, 29009, -138231, 237947, 152654, -99579, -47292, -196821, -170335, 75613, -82103, -236143, 62088, -72386, 29612, -326345, -47771, -289612, -68624, 83878, 146262, 100383, 165136, 229605, -92425, -233175, -71832, -112976, 256727, -122582, -19889, -89502, -164188, 22646, -353248, -63634, -42309]
18648d2309F3384B3561a17444k9950d7713j8135c326H8845k4253i2442j48485
18637b40927M2965h731j62159A7718g5999b2502C4602J04304a74838j44931A81872
18625b66312O8495E4869a59896q4568i2060C46215b4177l7432K0849H9547c23625
18613e6901H1662c44426F9065L4791a16124B29196m4512a87547k26815j01D2480
18601a85367e3237A5126N7840a22402A54626o3216a80480d9992A03351a42504
18590h0218I145a96470k9125B04121b01634A07488b48559a1772A6829O3158c56042
18578A47289b56855A3340c51712J67754k0225P0411k93142e3448j3934B1567d62836
18566A47355D1126c4247l77047H1889J44966a19194c7376j30288N4494A4956i8824
$$ y = [-42309, 63384, 23561, -117444, -147394, -47713, -65848, -3326, 88845, 64592, -92442, -240927, -197962, -8731, -170890, 17718, -75999, -22502, 34602, 138906, -174838, -319769, 181872, -266312, -197817, 54869, -159896, -244464, -92060, 346215, -24177, -61609, -40760, 89547, -323625, -56901, 81662, -344426, 69065, 103856, -116124, 229196, 184684, -187547, -414362, -414463, 42480, -185367, -53237, 15126, 72966, -122402, 154626, 91410, -180480, -49992, 103351, -142504, -80218, 9145, -196470, -225595, 204121, -201634, 107488, -248559, -11772, 16829, 79987, -356042, 147289, -256855, 13340, -351712, -183958, -204183, -133772, -426914, -53448, -67382, 21567, -462836, 147355, 41126, -34247, -411294, 81889, 226855, -119194, -37376, -167664, -113170, 14956, -98824]
18554A7427a11079j9688j68965a07361A32223h4309j45948h0108j19906j32922
18544c32936A06004b1340B26343c696k17849F0496B4453c05367d8346j11663f6922
18532B01186Q1891a54320K1041l7166B02696a67476A02314b85841P9694B16678
18521b73754I9504j3011b2625A79848p9032J065a64810J5698j22526c1387k0428
18510e1815A40719j9627a13922B32991b74640D7598J78375Q6700E6763O685a7507
18498c25192d3805m5745B7275J20021B8755J24751m6235c5068k61029A40928F2729
18486b05959k60102I6839K49424G5437a56692A70117c07352a157D3574c5771F9906
18474D7733g9329c8929B88231j40004g2316n2256I4337K5821J32936g4310A58190
$$ y = [17427, -111079, -130767, -299732, -107361, 132223, -84309, -230257, -80108, -200014, -332936, 106004, -21340, 226343, -3696, -221545, 60496, 24453, -305367, -48346, -160009, -66922, 201186, 283077, -154320, -133279, -170445, 202696, -167476, 102314, -285841, -206147, 216678, -273754, 99504, 86493, -22625, 179848, 100816, 101881, -164810, -149112, -271638, -31387, -51815, 140719, 121092, -113922, 232991, -274640, 47598, 225973, 312673, 56763, 63448, -17507, -325192, -43805, -89550, 27275, 147296, 28755, 153506, 107271, -35068, -296097, 140928, 62729, -205959, -466061, 96839, 346263, 75437, -156692, 170117, -307352, -1157, 43574, -35771, 69906, 47733, -79329, -38929, 288231, 148227, -72316, -124572, 94337, 120158, 253094, -74310, 158190]
18462B59636a66944A01358c93718r9705I0849B550K44976j20880a08615l3367
18452a41982q8838f2033j24701N4692N9982A701M2557a31731m0992c7527A32096
18440A60066b76725a7522A07169i171A09155k3957g8717j94705d9334G4119b17607
18428a80572P4286r0568K5162A77956B7999K94j404A2824J88143r5790J58806
18417B63983j0375E8878R5333a4702l2314j31764p4544e3272o9043C11675A9850
18405b31848g7078q7992H8501Q3333K5370a05963A6100f8775k7652A78066n2569
18394A25497a55621f2064A88357F2865a40635e3869K4678j7443j44765B6030a43918
18382A60593K5261a70835L5744d2884O111A93749F1312K3542c95378B36436h9471
$$ y = [259636, -166944, 101358, -393718, -493423, 90849, 2550, 247526, 126646, -108615, -141982, -230820, -62033, -186734, -132042, -72060, 1701, 44258, -131731, -172723, -37527, 132096, 160066, -276725, -17522, 107169, -9171, 109155, 85198, -78717, -273422, -49334, 74119, -217607, -180572, -106286, -196854, -171692, 177956, 27999, 28293, 26889, 12824, 200967, 105177, 263983, 253608, 58878, 154211, -14702, -47016, -178780, -253324, -53272, -122315, 311675, 19850, -231848, -77078, -165070, 88501, 171834, 197204, -105963, 16100, -68775, -96427, 178066, 125497, -155621, -62064, 188357, 62865, -140635, -53869, -29191, -46634, -191399, 26030, -143918, 160593, 185854, -170835, -135091, -42884, -36773, 193749, 61312, 84854, -395378, 236436, -89471]
18370D4562C724a14335I4975d7779n2038K7603B16458a06131m685B3500J16009
18359A39509a50211g2892j6942j3853c2317j04409j36520J2488I9009b49287i5735
18347A00890b04174J5606A6180J45017J3487i815o4441K5619B05587a64572A63864
18335I3407P1972J50267H1631h8326m7204l0762A05905G098O579d4120G4751b4190
18322A13146D836J46162h713D7824d413B06343d496k83887g5077r2459Q0613r8868
18310a85791D0888a76034l1926g3472o3916Q096A00117C4230a47563I6900J05233
18299B02133e6081K7699j27880k4595e753r2644E0301b3058o0110j64879o1912
18288c09959A70502f1981K4157A2069c69427d7995k07388B04842e5835a2870F7390
$$ y = [44562, 3724, -114335, 94975, -47779, -99817, -72214, 216458, -106131, -110816, 23500, 139509, -150211, -72892, -89834, -103687, -32317, -136726, -273246, -260758, 99009, -249287, -95735, 100890, -204174, -188568, 16180, 161197, 174684, -9815, -74256, -48637, 205587, -164572, 163864, 93407, 165379, 315646, 81631, -88326, -135530, -166292, 105905, 7098, 13677, -44120, 74751, -24190, 113146, 4836, 150998, -8713, 47824, -4413, 206343, -4496, -288383, -75077, -167536, -86923, -185791, 40888, -176034, -207960, -73472, -137388, -129292, 100117, 34230, -147563, 96900, 202133, -56081, -28382, -156262, -180857, -5753, -98397, 50301, -23058, -83168, -248047, -309959, 170502, -61981, -37824, 12069, -369427, -47995, -255383, 204842, -55835, -12870, 67390]
18276a95965k23214a85976H2809b25899g5823j49749Q3655B9701a4199k16532
18266b30731A00310a20961B01406g7717n3955I9713a79672A80396D7941b90998
18255a70005A96843c19838k0941f0910A51383k8190l4128J33605G9095J6254L71144
18244D66493a66023B8334b63988j50568J41508J20695F5919h266j16546B35662
18233a73137h6364k34271a7208B00990p4974k8133a85635h5307r0292p565O6665
18222a16499J5352j75802a27831b5566j51702M0399B1395K95288j37840c53155
18211c7603p2709C9059J11532p4760K09169B308b8638k09701A62903A4967J34729
18200A49696Q487h2513j14243d2047G7551l6643i7804B9373c87820R2089j8124
$$ y = [-195965, -419179, -185976, 82809, -225899, -75823, -225572, -141917, 29701, -14199, -230731, 100310, -120961, 201406, -77717, -131672, 99713, -179672, 180396, 47941, -290998, -170005, 196843, -319838, -340779, -60910, 151383, 123193, 89065, 222670, 79095, 95349, 466493, -166023, 28334, -263988, -414556, -273048, -152353, 65919, -8266, -124812, 235662, -173137, -86364, -320635, -17208, 200990, 126016, 97883, -185635, -85307, -175599, -183164, -116499, -101147, -276949, -127831, -25566, -177268, -136869, 21395, 316683, 178843, -353155, -37603, -110312, 39059, 150591, 75831, 285000, 2308, -28638, -238339, 162903, 14967, 149696, 158183, -82513, -196756, -42047, 77551, 40908, -97804, 29373, -387820, -295731, -313855]
18189c13855a7838F6644e9342O909k43311H1618D258a53088p938A42948b30095
18177c5615I055i6240n1304G8349P1271a70027L9136n125H9187a78412m8910a4917
18164E0131J35492a58690h95k66234a32133B38448A3767b7384B02054g4103E395
18152A04252A1202e0496F9853e72093K45304A39476m9748m2273p161a96767A9250
18140H9233k1371a17370o1199A2892a35738b6964A96336E1444b94234A465c02073
18128A11100a99665E5830K8449a15493A09595L1389O0270a70485E3793a07096
18117C2791a11576D8584b75104j06796E8424a41374E0417d3349l13520a29462
18106A11927O7988b00961B95682c5214k6370A16567g9303k6555C31819j37720
$$ y = [-313855, -17838, 66644, -59342, -52433, -295744, 81618, 4258, -153088, -161026, 142948, -230095, -35615, 9055, -96240, -147544, 78349, 149620, -170027, -130891, -136016, 89187, -178412, -227322, -14917, 50131, 185623, -158690, -895, -267129, -132133, 238448, 13767, -27384, 202054, -74103, 5395, 104252, 11202, -50496, 69853, -572093, -326789, 139476, 89728, 47455, 40294, -196767, 19250, 89233, 67862, -117370, -178569, 12892, -135738, -26964, 196336, 51444, -294234, 1465, -302073, 111100, -199665, 55830, 84279, -115493, 109595, 140984, 201254, -170485, 53793, -107096, 32791, -111576, 48584, -275104, -381900, 58424, -141374, 50417, -43349, -356869, -129462, 111927, 179915, -200961, 295682, -35214, -61584, 116567, -79303, -105858, 331819, 194099]
18096A94099b0363k12926J11741M0650j33239P0422j22873E3711P751b8918B22690
18084B97261j31177m5664G67a18617A87830A6247c55545D4471P9011a61903A3235
18072i1235d1338B07320i4660d1078r1076L5940c0530l40407a19853L3625q1410
18061a67638A04044b44730J0757B2341g074B98776A36367J27616c15685A05295
18050C0228N7407K4883a01243A77760e1386I9270L05142d33725a46058G9915A712
18038A1836b08614q2052A18988R2962a53235n4451a8494G0197p416h0178B2714
18026a7496A51051C7196Q6052n0933O6292m8321a19316h030l02606D4505b14256
18014c00034D2819p743J5181j2719c5202j39529B84722a81435m2994c7n8680C6801
$$ y = [194099, -20363, -233289, -121548, -80898, -214137, -143715, -266588, 53711, 61462, -28918, 222690, 297261, 166084, 120420, 767, -118617, 187830, 16247, -355545, 44471, 123482, -161903, 13235, -91235, -41338, 207320, -94660, -41078, -132154, -96214, -30530, -370937, -119853, -86228, -167638, 104044, -244730, -233973, 22341, -7074, 298776, 136367, 263983, -315685, 105295, 30228, 87635, 112518, -101243, 177760, -51386, 99270, 404412, -433725, -146058, 79915, 1712, 11836, -208614, -290666, 118988, 211950, -153235, -207686, -18494, 70197, 62781, -80178, 22714, -17496, 151051, 37196, 123248, 72315, 138607, 90286, -119316, -8030, -310636, 44505, -214256, -300034, 42819, 35076, 50257, 37538, -35202, -174731, 284722, -181435, -224429, -37, -58717, 36801]
18001A8176a50579A25413L7784p0582a08797d6357k7428I7748A3510a42245A69077
17989A3761b2854j9025j59455A41351A4580Q9165c9483o803j35600B05804r7207
17978A08597b23395A41110n4988k8262a19275c4056A33466b40496d7185J0935
17968c6250j15330k08901F2645a13028p6169q3236F1733m923a0149B23527a9404
17956H2148B331a36701d6845C23240A09621D342b27721A9259i1707A02371b54150
17944a68271B4554d1936B57715G5173d49993A59222k4035J928h1555I858a80405
17932B35777b58855G8360d8812o3842A28263a56808A53933F6902a03126B7612
17921A97585J6011a75466g7948o8179l5690D6507c6191B09844H4986k9249J32258
$$ y = [18176, -150579, 125413, 163197, 92615, -108797, -46357, -73785, 97748, 13510, -142245, 169077, 13761, -22854, -41879, -201334, 141351, 14580, 103745, -39483, -46286, -181886, 205804, 108597, -223395, 141110, 86122, 57860, -119275, -34056, 133466, -240496, -47185, -36250, -151580, -360481, 62645, -113028, -189197, -272433, 61733, 56810, -10149, 223527, -19404, 82148, 2331, -136701, -46845, 323240, 109621, 4342, -227721, 19259, -91707, 102371, -254150, -168271, 24554, -41936, 257715, 75173, -449993, 159222, 135187, 137115, -81555, 9858, -180405, 235777, -258855, 78360, -48812, -112654, 128263, -156808, 153933, 66902, -103126, 27612, 197585, 213596, -175466, -77948, -146127, -181817, 46507, -36191, 209844, 84986, 55737, 187995]
17910A87995F5057K25043B3377J28512a70326D1465a50524j36577A71583a62678
17899B88758b16344E864J67588K9023i2354A36904b25852R6738A59161B9250a62139
17887c83281a7091F6871d1790C791b8393o4938D1706c1600k84619g9669A05869
17875d8636C49624p1655B8298a74047d1467l03361A09265N2572a31886e1775B33464
17863e0525k50734f0519A67998h5181c0866B5113e1359H7209b9597A7659d56346
17851d420j61881E091c6335j95043A4980K4564g4908B64945a81794j0482c9523
17839h0755j7101d1890A57924f6978C10240e2565B13237a19838b8436d933C2578
17827b09271g0525k26025n9152e2766l4734C11275d7958m74041a15j55576M4865
$$ y = [187995, 65057, 290100, 23377, 151889, -170326, 41465, -150524, -287101, 171583, -162678, 288758, -216344, 5864, 173452, 202475, -92354, 136904, -225852, -129114, 159161, 29250, -162139, -383281, -17091, 66871, -41790, 3791, -28393, -93331, 41706, -31600, -316219, -79669, 105869, -48636, 349624, 277969, 28298, -174047, -41467, -344828, 109265, 161837, -131886, -51775, 233464, -50525, -301259, -60519, 167998, -85181, -30866, 25113, -51359, 87209, -29597, 17659, -456346, -4420, -166301, 5091, -36335, -231378, 14980, 39544, -74908, 264945, -181794, -192276, -39523, -80755, -97856, -41890, 157924, -66978, 310240, -52565, 213237, -119838, -28436, -4933, 32578, -209271, -70525, -296550, -355702, -52766, -87500, 311275, -47958, -521999, -115, -155691, -110826]
17816a10826B1797K9420K11803n915j9623c48249b0956A21098d4299F5036a77397
17804F7035N4943M7422a65030A43769c4529j74763e1937H8864a01783m1433c1329
17792a32447E7766L8059j5375j8089a49063A7895J13000a75013e5167C13558B3732
17780c74347A30276b47213c953j17586L1566j31962P6482D1290K58381j45503
17770A54168c21189b0700r8623j7730B22218e395j13254C05313O2543E6143b41813
17758a81253h4138H5580a92205H1903P9923m1691a34749A83898b27277G1008a08404
17746h8885A4935L6079e9734G3804i8876D1701c4679A77870J0006j1621J1778
17735A88033L6306F3821J26284D153d97070H7265b58771B78522E481d3057C30151
$$ y = [-110826, 21797, 51217, 263020, 257105, 237482, -348249, -20956, 121098, -44299, 65036, -177397, 67035, 121978, 169400, -165030, 143769, -34529, -209292, -51937, 88864, -101783, -143216, -31329, -132447, 57766, 95825, 80450, 62361, -149063, 17895, 130895, -175013, -55167, 313558, 23732, -374347, 130276, -247213, -3953, -121539, -89973, -221935, -145453, 41290, 299671, 154168, -321189, -20700, -119323, -137053, 222218, -5395, -118649, 305313, 367856, 56143, -241813, -181253, -84138, 85580, -192205, 81903, 161826, 120135, -134749, 183898, -227277, 71008, -108404, -88885, 14935, 51014, -59734, 73804, -98876, 41701, -34679, 177870, 187876, 176255, 188033, 224339, 63821, 190105, 4153, -497070, 87265, -258771, 278522, 5481, -43057, 330151]
17723C46570B0011J8470Q0912a09871N0325I8722a7608j3237k89126R9324A27718
17711C27273f2731B89085j17808j1095l7536c316k06504d7781a5652C77830a69862
17699C03630C056a78953m4445Q1910M3432H6629a46990A18604f899B5797J18558
17688A44355J34475a51206r1359c6936c034r7750A3572J40148D8252a45719k02638
17677c48357C61092E6703b05087c7891D5341d9749o7880j47261A04598Q9167d2362
17665C9430J49486d4535m6134j97826I6660h4323k9197j94959I3359A274c14810
17653h3154j8637l9458N3186A98544F8530J02144b8077E9516J8196c51795C39523
17641A24362o0663J43122f9572C7789b76245f9805c1837A3749L9802K47724D9233
$$ y = [346570, 20011, 38481, 119393, -109871, -59546, 98722, -17608, -30845, -319971, -220647, 127718, 327273, -62731, 289085, 171277, 160182, 122646, -3316, -209820, -47781, -15652, 377830, -169862, 303630, 3056, -178953, -223398, -141488, -98056, 86629, -146990, 118604, -6899, 25797, 144355, 278830, -151206, -242565, -36936, -3034, -100784, 13572, 153720, 48252, -145719, -348357, 361092, 56703, -205087, -37891, 45341, -49749, -117629, -264890, 104598, 193765, -42362, 39430, 188916, -44535, -90669, -288495, 96660, -84323, -113520, -308479, 93359, 1274, -314810, -83154, -101791, -141249, -88063, 198544, 68530, 170674, -28077, 59516, 77712, -351795, 339523, 124362, 63699, 206821, -69572, 37789, -276245, -69805, -31837, 13749, 53551, 301275, 49233]
17629i4611C17428j36987f7772H1622L57885a36589B66176D7314A7307L99412
17619D16719A89156g2798A44901h5202A14059a81183E9233p548J25224E6213D266
17607B46232a42464A83899J33031j19221a69162B1397K09124E1142a19430I0239
17596a50639a8158f83A53637d8432r65j15129I7281l5841j2815N35916E8979L22264
17584C81243g161j24498B19422g2077B90809A23654E4363K40226a01815A40875
17573f103k151l7412D0386C520f1862G4233N9454M3420b98610J07210A18380B4539
17560D5017K20269k4075a09837M3944D7704a39312D1685O2927B7066e3488G6810
17548b75761J34631A18117J19359c24185f8350C7814a03009C05127b434C7101
$$ y = [-94611, 317428, 180441, -67772, 81622, 439507, -136589, 266176, 47314, 17307, 416719, 189156, -72798, 144901, -85202, 114059, -181183, 59233, 51685, 176909, 56213, 4266, 246232, -142464, 183899, 316930, 197709, -169162, 21397, 230521, 51142, -119430, 90239, -150639, -18158, -683, 153637, -48432, -49397, -164526, 97281, 61440, 48625, 584541, 58979, 381243, -7161, -131659, 219422, -72077, 290809, 123654, 54363, 294589, -101815, 140875, -6103, -8254, -45666, 40386, 3520, -61862, 74233, 133687, 177107, -298610, -191400, 118380, 24539, 45017, 265286, 241211, -109837, -65893, 47704, -139312, 41685, 104612, 27066, -53488, 76810, -275761, -141130, 118117, 237476, -324185, -68350, 37814, -103009, 305127, -2434, 37101]
17537G2425L2156J17102D4441K02918j19252R9711P6642q0084E6569Q7556a43215
17525A96573O4617B9643j2088L2272i5822B23917m2882K49845h5623j34309D8156
17513B51228j04929p1574a79823c255L32k6727A94863C371L81906H4679m789O208
17501H6098R5961F9596J3052g6287c1256A41553A1158b2210A22778M1465E5635
17489B97273A19040a8864B4453b2967C00386a25147A68787L654M0355D4927Q7316
17478A32243L07823F0011c5653H3194J05094E7060a40939j8858E6754j2914J88922
17467B32762f5057B6361N4773M24011j88359H7480J15653R5840j18127M4122o7168
17456A57800P7980a62603F339J63237c317B83095K22838f6974A23857J84270j42109
$$ y = [72425, 104581, 221683, 44441, 247359, 128107, 227818, 304460, 224376, 56569, 144125, -143215, 196573, 261190, 29643, 17555, 49827, -95822, 223917, 181035, 430880, -85623, -219932, 48156, 251228, 146299, 74725, -179823, -3255, -2923, -29650, 194863, 3371, 385277, 84679, 79890, 86098, 182059, 69596, 82648, -76287, -31256, 141553, 11158, -22210, 122778, 164243, 55635, 297273, 119040, -18864, 24453, -22967, 300386, -125147, 168787, 172441, 212796, 44927, 132243, 440066, 60011, -35653, 83194, 188288, 57060, -140939, -159797, 56754, 43840, 232762, -65057, 26361, 81134, 505145, 316786, 87480, 203133, 298973, 180846, 224968, 157800, 235780, -162603, 6339, 169576, -3317, 283095, 505933, -66974, 123857, 308127, 166018]
17445A66018G5165K63973M3945i4468k38583C14747n4413b05903B70650D1996
17434I1490L78245m5262A72916J78255A71317L37661k21551h21C13819a40277
17423C12261a36054A4255J80534L63236F2316J33630N969a94952C97816A22305
17412A04291N76777C15013A20065N4602J4855r2929K42010h0860E07878M3338
17402E51216A40497m118j8401a45954B20574M858G8300Q8351J71315A21656K9629
17391A51285J46160j33650E4688f0531E0152K69883j46002b28372h247A1097Q6613
17380I7710K0303J31084a071E9903a6693l4382l6983I3560b33295J01631B90803
17368h4718A86775d4734j59452C73552b66062A50165L765b26594e1096E4426b83838
$$ y = [166018, 75165, 339138, 383083, -94468, -333051, 314747, 260334, -205903, 270650, 41996, 91490, 469735, 424473, 172916, 351171, 171317, 508978, 287427, -821, 313819, -140277, 312261, -136054, 14255, 194789, 558025, 62316, 195946, 201915, -194952, 397816, 122305, 104291, 681068, 315013, 120065, 174667, 189522, 96593, 338603, -80860, 507878, 551216, 140497, 136379, 117978, -145954, 220574, 225432, 78300, 166651, 337966, 121656, 151285, 297445, 163795, 54688, -60531, 50152, 320035, 174033, -228372, -8247, 11097, 97710, 118013, 249097, -1071, 59903, -16693, -51075, -88058, 93560, -233295, -131664, 290803, -84718, 186775, -44734, -204186, 373552, -266062, 150165, 153930, -226594, -51096, 54426, -283838]
17356F6886b63199C49715D0026L42733p0697a57443B16556b44469D5648J11771
17346A57419A5864K40034L6773a88462A03994L30137C7737L85152r5778A55265
17335C4991J32220a15705B07568a20638k1994f3719B14704Q8136H4398h2482B42517
17323B76462B7866K31862A20085J44855a44155D52522A44265N4730E9094P4674
17313A33768c5299J0695C53876A41257K15434A17050N8378n3505J8268J90373
17303C30564e2290A59316D7946J54314A0341Q3259J10016o767a21934A82112L1082
17292B13194O5484H2653h2076j57254D71451r8490A78645A8211K75816F3482a80325
17280B80573A12223A8759Q4348m7199J85642l4651J13144j28529L256K41284A13672
$$ y = [66886, -263199, 349715, 40026, 382759, 312062, -157443, 216556, -244469, 45648, 157419, 15864, 255898, 292671, -188462, 103994, 434131, 37737, 422889, 327111, 155265, 34991, 167211, -115705, 207568, -120638, -142632, -63719, 214704, 302840, 84398, -82482, 242517, 276462, 27866, 259728, 120085, 264940, -144155, 452522, 144265, 198995, 59094, 133768, -35299, -24604, 353876, 141257, 356691, 117050, 175428, 121923, 140191, 330564, -52290, 159316, 47946, 202260, 10341, 93600, 203616, 196849, -121934, 182112, 213194, 278678, 82653, -82076, -239330, 471451, 372961, 178645, 18211, 294027, 63482, -180325, 280573, 112223, 18759, 103107, 55908, 241550, 206899, 320043, 191514, 194770, 436054, 113672]
17268e9848A81389D8825M3128J18911M9581a71957D29185B06458a14444E77955
17257B8014J91658q8141K03861g6515G097J07732i4468A93471l32i4494r4784
17246a89278D71717G8042R6893D4790J18475l2956Q1460o4054r123k5748J78127
17235B90971B7119K22317j20573K49807r7926L46988j78804A86751J8785r5081
17225A10455L18537d6144B49656m8243b8430A07226B7081J65618a54428B23831
17214B22690d212B07978r585m9158M78176k81269J72645A81225K68447A61812
17203C63129j59406K35173j31777p1721J64961J64022B64100q4055L38869o7874
17193D51040p9020M8951d6225B14458l393G2818N043O7255L91758A81419o6822
$$ y = [-59848, 181389, 48825, 91953, 210864, 260445, -171957, 429185, 206458, -114444, 577955, 28014, 219672, 131531, 335392, -76515, 7097, 114829, -94468, 193471, 193139, -94494, -189278, 471717, 78042, 174935, 44790, 163265, 130309, 211769, 147715, 138592, 112844, 290971, 27119, 249436, 128863, 378670, 280744, 627732, 448928, 186751, 205536, 110455, 428992, -46144, 249656, 201413, -28430, 107226, 27081, 192699, -154428, 223831, 222690, -4212, 207978, 198393, 149235, 627411, 346142, 518787, 181225, 449672, 161812, 363129, 203723, 438896, 307119, 235398, 400359, 564381, 264100, 180045, 518914, 451040, 372020, 420971, -46225, 214458, 211065, 72818, 77861, 145116, 536874, 181419, 114597]
17182A14597L6616G1655J39529m2720c1711G725P8552L53391j52182j34991k2326
17171A30169a5926A42940n8165L41496l4484j54980n5900K32662p1223p9685p0673
17160A91988B9353M13073j54692l0480J2193L7543j28015J23285J29147q2810
17150C48597I040K30643M1389l1993D263d7929A03926O0749l9566E1589J98356
17139B49945p7374l1280n8688M0060n209J606J82600j6348q14G5206O02932C31319
17126F3310J50287D8201J66231a09965B26044J08843m6699N968N3700D9352L79322
17115D28674O660J83133A8330K69369L59489B45253J23088A38661J08111A3736
17104B02171m7179K62032j19149A08352B7750M17773r4760j67354J69248J70798
$$ y = [114597, 151213, 71655, 211184, 168464, -31711, 7725, 86277, 439668, 287486, 152495, 130169, -15926, 142940, 84775, 426271, 391787, 236807, 180907, 413569, 342346, 262661, 191988, 29353, 442426, 287734, 257254, 269447, 306990, 178975, 302260, 431407, 348597, 9040, 239683, 281072, 249079, 4263, -47929, 103926, 164675, 125109, 51589, 249945, 172571, 141291, 82603, 122663, 117454, 119060, 301660, 285312, 284498, 75206, 678138, 331319, 63310, 213597, 48201, 214432, -109965, 226044, 334887, 288188, 294156, 347856, 49352, 428674, 435334, 618467, 18330, 287699, 647188, 245253, 368341, 138661, 246772, 13736, 202171, 154992, 417024, 297875, 108352, 27750, 445523, 350763, 183409, 352657, 523455]
17094E23455j42373A53204L18928K2188L1943k03502K35300A06189K50869J02815
17084D59873j36860J5262j6172K34562k37045h7832A12531L58818j7669K59113
17074G12793j75535j59251M24931l67372J39750r6673N4772A67446J38703K90911
17064E97060L6305j31518K14508l29192J93807A84896M55740j74532J74035n4902
17054E85237k57669K14042j55443j82201J20433A54937L35104K7110K00395C50829
17043E21271j00358n1907A46510J23914K51715J13936B22404K65324N0138j89662
17033C48204J73695J20395j98628P3913k6558J13987q9238J32389j81372J22359
17023E89146Q6537N2269l41586L45444K7568l03419Q8192j59751L87822C71597
$$ y = [523455, 381082, 153204, 472132, 494320, 526263, 322761, 558061, 106189, 357058, 459873, 323013, 338275, 322103, 556665, 319620, -87832, 112531, 471349, 453680, 712793, 537258, 378007, 802938, 435566, 575316, 478643, 533415, 167446, 306149, 597060, 633365, 501847, 716355, 387163, 580970, 184896, 640636, 466104, 640139, 585237, 327568, 541610, 386167, 203966, 324399, 154937, 490041, 517151, 717546, 350829, 521271, 420913, 369006, 146510, 270424, 522139, 636075, 222404, 487728, 537866, 348204, 521899, 642294, 443666, 517579, 491021, 605008, 515770, 648159, 466787, 589146, 675683, 727952, 386366, 731810, 759378, 455959, 544151, 384400, 772222, 371597]
17012F61281K53242j02418j04514J13076B24955N80831l405r8656M7525q5013
17002F66237C27687L27271J33964L8123j83655p6487L02660k33139J34909j68582
16992F02751k85204P8938L25108k11445N49187l78335K71560q1001k70652J49244
16982G50151j01670J79725n5625l4155K89717k75694j12734M3547K40135j33865
16972G89532C50812K52285L40295K01341P9373n03393K74913k66029j6033n6233
16962F57331K49179j4034J70880m14506L68297j18774J55161m20767P4692K09067
16952I16526O9325m738m4126m4287J54293Q9670k07589J46795l79381J76608K28936
16941A102032k86715Q1831M66104j39653l90531K66742j27643O1221K85926P4268
$$ y = [661281, 914523, 812105, 707591, 820667, 224955, 805786, 802381, 703725, 751250, 666237, 327687, 654958, 788922, 827045, 643390, 566903, 869563, 636424, 771333, 602751, 317547, 396485, 721593, 510148, 1059335, 681000, 952560, 871559, 600907, 750151, 648481, 828206, 772581, 738426, 1028143, 752449, 639715, 683262, 923397, 789532, 350812, 603097, 943392, 1144733, 1224106, 720713, 995626, 729597, 713564, 657331, 906510, 892476, 1063356, 648850, 1017147, 898373, 1053534, 632767, 707459, 916526, 985851, 981113, 936987, 892700, 1046993, 1136663, 929074, 1075869, 696488, 873096, 1102032, 815317, 897148, 1363252, 1223599, 833068, 1099810, 972167, 1033388, 1319314, 1393582]
16931A393582k05844k58417M52657k43227K03107l58983R3044L4974j03549J12801
16921A120145R5704j865o5496J11483M27804n51900N36786j48951k16265J04031
16911A411476R214m27475K21833L31831q09q5945k25141M35786j50287K18226
16901A738709k11729m3692R6327j70824q8141N00968l03325j01450K75402k82890
16891A409355J82609N0955m0328j08755R8706M31847j86357P8626m9094P518J02884
16880A977966L8885k35661M8768j5188K01833N0768J40890j25035k65418R5196
16870A913004M8316J67935m442Q3770j25122J85522M5172K38640k41985k25328
16860B085482M88501J9263l0131j86048R2637J9661J37199j28j2686O7416N7659
$$ y = [1393582, 1187738, 929321, 1381978, 1138751, 1341858, 982875, 1075919, 1110893, 1007344, 1120145, 1215849, 1213984, 1148488, 1259971, 1687775, 1135875, 1672661, 1523710, 1307445, 1411476, 1420690, 993215, 1215048, 1546879, 1546070, 1460125, 1234984, 1670770, 1520483, 1738709, 1526980, 1483288, 1579615, 1408791, 1320650, 1821618, 1518293, 1416843, 1692245, 1409355, 1591964, 1642919, 1602591, 1493836, 1592542, 2024389, 1838032, 1916658, 1867564, 1875082, 1977966, 2016851, 1781190, 1829958, 1814770, 2016603, 2067371, 2208261, 2083226, 1817808, 1913004, 1961320, 2129255, 2124813, 2208583, 2083461, 2268983, 2314155, 2552795, 2310810, 2085482, 2573983, 2593246, 2563115, 2377067, 2469704, 2489365, 2626564, 2626436, 2613750, 2681166, 2738825]
16849B738825N047j08039M784J94953J43284j78067L61796l31181J45828L95010
16839C372240l57425J2873K71620l0071L72824k47951J03405k57495N46431J51285
16829C937736N1363q6254J25874m67250L05958J05780L29274o549K86282m57691
16819D124523M72358l34239M83812r763k4738N7743K29256J39763J35637J7656
16809E292008O2205J49370j35597M47440j79081j0172J20524K17958m8243M20299
16799F336711j58955N51123k77157M63663l15484N30235J80392l480j127L48140
16789G654061K20076J82212J68961J98511K84966M07080J37337K74756K41676
16780I769636p4393K30475J79904L55306L028O40969L19710N32050Q2330K12243
$$ y = [2738825, 2743872, 2635833, 2640617, 2835570, 2978854, 2800787, 3162583, 2831402, 2977230, 3372240, 3014815, 3027688, 3299308, 3269237, 3642061, 3394110, 3497515, 3240020, 3786451, 3937736, 3989099, 3902845, 4028719, 3561469, 3867427, 3973207, 4302481, 4295932, 4582214, 4124523, 4596881, 4262642, 4746454, 4736691, 4711953, 4769696, 4998952, 5138715, 5274352, 5292008, 5354213, 5503583, 5367986, 5815426, 5636345, 5626173, 5746697, 5964655, 5916412, 6336711, 6177756, 6728879, 6451722, 6915385, 6599901, 7130136, 7310528, 7307048, 7305921, 7654061, 7874137, 8056349, 8225310, 8423821, 8708787, 9115867, 9253204, 9527960, 9769636, 9695243, 9925718, 10105622, 10460928, 10463956, 11104925, 11424635, 11956685, 12039015, 12251258]
16770A2251258L80373K41825N08952R17870J35618L08838M60746J35457P93533
16761A6134470P22505K65938P43419M93560Q17112N86348P10564Q68231N16011
16752B1858158R89611P79094J082820J015563R06975R29433J535731J009058J293073
16743C1399516J171456J903593J027792J699601J564379J995196K111813K135052
16735D5008398K375650K415173K311405K637018K726256L218728L549426K978276
16727F7220330L813872M145134L848292M304092M671562M898244N407560N158596
16719A03467682N121471O013602N879317N779707N761193N935678N502237N425113
16711A48886000M956695M822907M126917L913325K641532J906116J009703K39722
$$ y = [12251258, 12631631, 12873456, 13382408, 14300278, 14435896, 14744734, 15205480, 15340937, 16134470, 16856975, 17122913, 17866332, 18359892, 19177004, 19763352, 20473916, 21342147, 21858158, 22847769, 23626863, 24709683, 25725246, 26632221, 27561654, 29097385, 30106443, 31399516, 32570972, 34474565, 35502357, 37201958, 38766337, 40761533, 42873346, 45008398, 47384048, 49799221, 52110626, 54747644, 57473900, 60692628, 64242054, 67220330, 71034202, 75179336, 79027628, 83331720, 88003282, 92901526, 98309086, 103467682, 108589153, 114602755, 120482072, 126261779, 132022972, 137958650, 143460887, 148886000, 153842695, 158665602, 162792519, 166705844, 169347376, 171253492, 172263195, 172502917]
16703A72502917p52265j348157k548372l244253m149248m218003m887947n447927
16695A45906745n485722o208418n626883o054563n775834n532057n957296n056315
16687A00209657n464652m963530m410074m632095m291812m013217l910246l810741
16679F4713290l132858l310477k832943k864959k512005k498515k692645j977237
16671D2891651k145530j453663k232615j470284j595126j808467j272836j037294
16663B9875836j386326r02756j440255j060486r77726p86248j250923p43702o98749
16654B0628665m26883j014138q02759n13041k12424j115380k92732l15818o27313
16645A5308177l60923p24782m51359k03239p57228p4341o50757m11217j78681
$$ y = [172502917, 171750652, 170402495, 167854123, 164609870, 160460622, 156242619, 151354672, 145906745, 140421023, 134212605, 128585722, 122531159, 116755325, 111223268, 105265972, 100209657, 94745005, 89781475, 85371401, 80739306, 76447494, 72434277, 68524031, 64713290, 61580432, 58269955, 55437012, 52572053, 50060048, 47561533, 44868888, 42891651, 40746121, 39292458, 37059843, 35589559, 33994433, 32185966, 30913130, 29875836, 28489510, 27586754, 26146499, 25086013, 24108287, 23322039, 22071116, 21327414, 20628665, 20201782, 19187644, 18384885, 17871844, 17659420, 16544040, 16251308, 15935490, 15308177, 14947254, 14222472, 13771113, 13567874, 12810646, 12736305, 12085548, 11674331, 11495650]
16636A1495650n46956p5475k99578j01721o42079r9727l34686j18327j14631o84460
16626H478010K4989m38094q6319P7116k80757j92143l67892k70705j46674Q351
16616F805882p8348J65563o72165J96802j75923J67099n89087k14363l4073R9884
16606E671271m20537k6163l57400L81394k37645J00683K9774n38206m8586j64365
16596D390220r2708L82338l46108m04009N3895k00580K25278j41194j04091k93117
16586C469924K63500P3994m13403N0418n5639L0237j64810J08848j9489j48894
16576C194686l43876M40475j02352l76722k1407L91584n3226m96932m3322o6138
16566B522770J60781k50791N4906L37742m38496L26097l47982J04189m94987N79392
$$ y = [11495650, 10948694, 10873219, 10573641, 10471920, 9829841, 9730114, 9395428, 9277101, 9162470, 8478010, 8502999, 8064905, 7978586, 8055702, 7774945, 7582802, 7214910, 6944205, 6797531, 6805882, 6727534, 6893097, 6220932, 6417734, 6241811, 6408910, 5819823, 5605460, 5571387, 5671271, 5250734, 5224571, 4867171, 5248565, 5010920, 5111603, 5141377, 4603171, 4554585, 4390220, 4297512, 4679850, 4333742, 3929733, 3983628, 3783048, 4008326, 3867132, 3763041, 3469924, 3733424, 3807418, 3394015, 3444433, 3388794, 3419031, 3254221, 3363069, 3343580, 3194686, 2850810, 3291285, 3188933, 2812211, 2790804, 3182388, 3129162, 2632230, 2588908, 2522770, 2683551, 2432760, 2487666, 2825408, 2386912, 2713009, 2365027, 2469216, 1974229, 2553621]
16556B553621l52918l37651M13585m0680K46792n12615K09166j4274j96727M1214
16546B009513m70609K07672K82725j32937n926k00100p172J89864o2916K07742
16536B017856m59809R2889Q0629k01042J54404q9033K33325k87567k73552O43947
16526A912047l57398j50764j20323J80010J07634p7395L5478k56045L01113l17591
16516A256766q7036J27044J20495j05877j01106p1269M0020K6412M26725p07367
16506I24807L78254j38440P4092j88475K14339l04553J20678K02140j89237j43507
16496I50098L17948k75719j5072J33034J46738k65427K99409m88643L29570n020
16486A126916k1729q7808n8086k51203P182N5471M95333k44065J68871n63220
$$ y = [2553621, 2200703, 1863052, 2276637, 2235957, 2482749, 1970134, 2179300, 2165026, 1968299, 2009513, 1538904, 1746576, 2029301, 1896364, 1890438, 1690338, 1683166, 1873030, 1810114, 2017856, 1558047, 1650936, 1731565, 1530523, 1684927, 1595894, 1829219, 1541652, 1268100, 1912047, 1554649, 1403885, 1283562, 1463572, 1571206, 1493811, 1529289, 1273244, 1574357, 1256766, 1169730, 1296774, 1417269, 1311392, 1210286, 1139017, 1179037, 1205449, 1632174, 924807, 1303061, 1164621, 1238713, 1050238, 1264577, 960024, 1080702, 1282842, 1093605, 950098, 1268046, 992327, 977255, 1110289, 1257027, 991600, 1291009, 802366, 1131936, 1126916, 1105187, 1017379, 959293, 708090, 715272, 770743, 1266076, 1022011, 1190882, 627662]
16476F27662K86952q7144M01654k13966k3061p6438K04320k45678N3424j27414
16466H00311k45841K7706l1367K90562P7699j19849M3280n0280M7899J39907K1259
16455A001286j29129j72815k2611J4639K29144D08026L49068C53485L27462l04849
16445C76098J93389Q3583k73131L26746J7861j96292j4586J03331J26609k33795
16435E09813K97173J22577C13885N26738l21386O1886j99162q6928L69994O3688
16425G28715q9768J41138k90060n0652L6216K13397L0443k21160k29251R5224
16415C64242K07309l350k54939J22752K37428k65736j00784j30665K37286j33561
16405B79982N9666K25770k15131O5274j03410J35605j609J72388j46999j73977
$$ y = [627662, 914614, 827470, 1229124, 1015158, 992097, 915659, 1119979, 874301, 927725, 800311, 554470, 582176, 550809, 841371, 919070, 799221, 842501, 792221, 840120, 980027, 1001286, 872157, 699342, 676731, 691370, 920514, 408026, 757094, 353485, 680947, 376098, 569487, 653070, 379939, 706685, 724546, 528254, 513668, 616999, 743608, 509813, 806986, 929563, 313885, 840623, 519237, 581123, 381961, 295033, 665027, 728715, 638947, 780085, 490025, 439373, 475589, 688986, 719429, 498269, 269018, 364242, 571551, 568201, 313262, 436014, 673442, 407706, 306922, 176257, 413543, 279982, 339648, 565418, 350287, 415561, 312151, 447756, 446147, 618535, 471536, 297559]
16395B97559N12344l49680K17529B98502K70417k36941J08133r6182l6193P9301
16385C87037J0355n0486n9226A42138K62227A21672L24198k1489J79314k81426
16375C22269j00165M14180B38661N3242m2195M38398r0967J35529B09276L1429
16365B40705J92068j38330M3896o1563J2727J2778A14136C5070K01899q424L07823
16354E36368J1502k50139K20753A77420J215c5295C86818q7147K42019r2122a01273
16342D21378M7957B4532K05031O8594j589K64674H3813L6861K51369A00186K26218
16331C26404j36660J07962J49219p1075A16775L15986a30142A68240R7966a63284
16320B78546C8413M27809k12045G4113J14671h2324I8183J65281K08532H6305
$$ y = [297559, 809903, 460223, 677752, 298502, 568919, 331978, 440111, 343929, 307736, 387037, 397392, 346906, 287680, 142138, 404365, 121672, 445870, 424381, 603695, 322269, 222104, 636284, 238661, 291903, 249708, 688106, 597139, 732668, 209276, 240705, 432773, 294443, 338339, 276776, 289503, 302281, 114136, 35070, 236969, 228545, 536368, 547870, 297731, 518484, 177420, 178635, -35295, 386818, 299671, 541690, 449568, -101273, 421378, 469335, 24532, 229563, 298157, 296568, 561242, 83813, 120674, 372043, 100186, 326404, 189744, 297706, 446925, 375850, 116775, 432761, -130142, 168240, 266206, -163284, 278546, 38413, 466222, 254177, 74113, 188784, -82324, 98183, 263464, 471996, 86305]
16309D61986a33883B61111A29940B3742J37676L8379l7451D6070J78900M5498
16299B70468J52576j42973J44887a14889F20060B92030q8926a3804B36779n3813
16289A82966I471a83831B59763J341l9092r0963J80323D3547N230a81099C57511
16277D68007c8637D15158b9096B28677d489A49485o5850J09390G5854A0157L00125
16266C10282l2143a4365q6121B28320N5738a60571N4238A25431J59460P5780a00455
16254B34267e8605D43836A22183J77230J12594b8677q1007C37403E3978A5839
16243a06112c6594C79864j85113P3950n6310m3532J47803k1687b51352B17305
16232A74557a07623d9015D4796f4859E51040B64182G8819B9853J21552p916o3976
$$ y = [461986, -133883, 261111, 129940, 23742, 161418, 199797, 162346, 46070, 224970, 270468, 423044, 280071, 424958, -114889, 620060, 292030, 203104, -13804, 236779, 182966, 9471, -183831, 259763, 261104, 222012, 131049, 311372, 43547, 48777, -181099, 357511, 468007, -38637, 415158, -29096, 228677, -4489, 149485, 83635, 193025, 75854, 10157, 310282, 278139, -14365, -100486, 228320, 284058, -160571, -106333, 125431, 284891, 360671, -100455, 234267, -58605, 443836, 122183, 299413, 412007, -28677, -109684, 337403, 53978, 15839, -106112, -36594, 379864, 194751, 268701, 212391, 168859, 316662, 294975, -251352, 217305, 174557, -107623, -49015, 44796, -64859, 551040, 264182, 78819, 29853, 151405, 143489, 79513]
16221G9513K6920b70383i1198E38234b83131C25227A46689F8332h4028B39157
16210A23813L989b648C83193A54182M9471B8183i7952B88198P17q8040c104E88897
16197g1125l03537a45742e0789H2903j5083f6122E51519D9033J93656a79209O6664
16186a12545N949A33084Q373L0318f2236B97267f3680J1521E5011R9106a24718
16174A07976A8781K61902o209A30780m3025b15084b4073j3406D6019e9880j09215
16163a69095O9742B55335k1242f5326k50960h759B66896C7577a1726A27156a55929
16151H2861b88701A57395J78215c46532J44063I8749f6390B08175h1075l6598
16141a17673d6029A17657L4160b4048A81110l1853B1893a55707E5886E207b91963
$$ y = [79513, 106433, -270383, -91198, 538234, -283131, 325227, 146689, 68332, -84028, 239157, 123813, 127802, -2648, 383193, 154182, 203653, 28183, -97952, 288198, 288915, 200875, -3104, 588897, -71125, -374662, -145742, -50789, 82903, 67820, -66122, 551519, 49033, 242689, -179209, -112545, -106596, 133084, 141457, 171775, -62236, 297267, -63680, -52159, 55011, 154117, -124718, 107976, 18781, 280683, 274474, 130780, 87755, -215084, -24073, -37479, 46019, -59880, -169095, -99353, 255335, 234093, -65326, -316286, -8759, 266896, 37577, -11726, 127156, -155929, 82861, -288701, 157395, 335610, -346532, -202469, 98749, -66390, 208175, -81075, -117673, -46029, 117657, 151817, -24048, 181110, 149257, 21893, -155707, 55886, 5207, -291963]
16129C11793A08682c0900A73097l1837K0174M1665E7175b10144L7196a1941j6709
16118b8650B04342j3730C6119c3042a3775k73438f427C4440P1801g1725A31288
16106H2508a99933b3845k9841o4542A84605a27625a0278E53075b5877A19028b79419
16094A2743a56150O9687B90857c27298J08822B95498j5055g1688C35240a57003
16083c3644A5123J02884I608c6380D1255h4114A1698B162J02622D3454b29209
16071a43256B07270k9105F4106i1342B77340g8687j49496D9567e2072H0503J17274
16060A97777d7379C58318g2335L210j4713A36440h9974K4861A53664a37235A32654
16048A70685b32299A91837k2157e1474B0025L2297c15026A3680N8441J02804h1700
$$ y = [311793, 108682, -30900, 173097, 141260, 161434, 203099, 57175, -210144, -172948, -11941, -28650, 204342, 190612, 36119, -33042, -13775, -287213, -6427, 34440, 106241, -71725, 131288, 82508, -199933, -23845, -53686, -118228, 184605, -127625, -10278, 553075, -25877, 119028, -279419, 12743, -156150, -86463, 290857, -327298, -218476, 295498, 280443, -71688, 335240, -157003, -33644, 15123, 118007, 9608, -36380, 41255, -84114, 11698, 2162, 104784, 43454, -229209, -143256, 207270, 178165, 64106, -91342, 277340, -78687, -228183, 49567, -52072, 80503, 197777, -47379, 358318, -72335, -69125, -83838, 136440, -89974, -65113, 153664, -137235, 132654, 170685, -232299, 191837, 169680, -51474, 20025, 52322, -315026, 13680, 72121, 174925, -81700]
16036h9093A13687b42265B79191c3818D10479g570N12n0739p0734b5499F8268
16024A29297O8986b8448k65716A15799a87768K7083A61303c5248A33746D2869
16013A22661F291c4718J1716A61300b22487A38242D5642a61572B47315i4302K8334
16002f5968F5469P2652F2804K48114a37653I1097k2190b1116o25559A70196o9364
15991A00832a5853k08092Q2869B50878a85118B9315c30094A69492b17445B84685
15980I4119J8905j5118L4034D5502B0187J81822N24m7746e9294E68J78975J15535
15968B95078F9429P2835M02374c2231B12404C519O8349A0539g1522K1925q7227
15957a36824q4284g0699q8824q2850J15991j84582d0978A11466a66247O4666c8265
$$ y = [-89093, 113687, -242265, 279191, -33818, 410479, -7570, -7058, -57797, -128531, -25499, 68268, 129297, 198283, -28448, -294164, 115799, -187768, -160685, 161303, -35248, 133746, 42869, 122661, 6291, -34718, -23002, 161300, -222487, 138242, 45642, -161572, 247315, -94302, -65968, 65469, 138121, 62804, 310918, -137653, 91097, 68907, -21116, -646675, 170196, 100832, -15853, -223945, -141076, 250878, -185118, 29315, -330094, 169492, -217445, 284685, 94119, 113024, 97906, 131940, 45502, 20187, 202009, 202533, 154787, -59294, 568, 179543, 295078, 69429, 142264, 544638, -32231, 212404, 3519, 71868, 10539, -71522, -49597, -136824, -221108, -70699, -159523, -242373, -126382, -310964, -40978, 111466, -166247, -101581, -38265]
15945d903D5665c15348P7270m569h0704A36346a55949j65509d7121A39171a62456
15933a30112K1801j07163j71987e3921p856A62198h2578A23110a32889k63602
15923c96491H4768c19543O0713k6125a39111m0493O5940A5583a19514F5576J27760
15912A93336G1173e3768o4185A79627l3874i6311j34155A71022k4847e9645q3507
15901a43152G4575P4950H769J87325H4790P8425a16333l2802f0813C01159A42598
15889c9326A5757a07798B74545i653j25987C18595a07817j27457k09448d7434
15878a75979N1357A61601d7582K2729n2247D8673J09783a87112l1400K1609G5203
15866c74911A76378F843J66108c3199E4661J94939F9976i4683E6903b67837P3028
$$ y = [-4903, 45665, -315348, -238078, -242647, -80704, 136346, -155949, -321458, -47121, 139171, -162456, -130112, -108311, -215474, -387461, -53921, -61777, 162198, -82578, 123110, -132889, -396491, 84768, -319543, -258830, -284955, -139111, -179604, -113664, 15583, -119514, 65576, 193336, 71173, -53768, -117953, 179627, 145753, -96311, -230466, 171022, 146175, -59645, -143152, 74575, 149525, 8769, 196094, 84790, 163215, -116333, -149135, -60813, 301159, 142598, -39326, 15757, -107798, 274545, -9653, -135640, 318595, -107817, -235274, -444722, -47434, -175979, -124622, 161601, -47582, -24853, -77100, 48673, 158456, -187112, -218512, -196903, 75203, -374911, 176378, 6843, 172951, -33199, 54661, 249600, 69976, -94683, 56903, -267837, -194809]
15855a94809B97446b44413B56302a11177C92336c0248G5778a98867Q0159p6534
15845a95242A77587a91529j44070a11955n7858l9444M6154L9910K3064B18776
15834A61706a7376k9060D1047c8108n3781K9934k44941G8555L6671a61150L5132
15823a26018L0478d7292j89832R6358A27771a70050l0506D4460F079a92973j69595
15812c62568B01862C1042b2300d982C7401g033n1066p6318E759i9826M7603j16538
15800a68761r7001d5769m6673G1623a52324L3471e2004j40149D4235h2062l6390
15789a18452r8098K183d3153A2340L125P5821a00460A8400J16694f5379G080a20580
15776A06333a68672C32945a60741j80796C5162A2483a54906B81241G0929b11298
$$ y = [-194809, 297446, -244413, 256302, -111177, 392336, -30248, 75778, -198867, -118708, -195242, 177587, -191529, -335599, -111955, -169813, -209257, -163103, -123193, -100129, 218776, 161706, -17376, -46436, 41047, -38108, -91889, -61955, -306896, 78555, 115226, -161150, -126018, -95540, -47292, -237124, -140766, 127771, -170050, -200556, 44460, 6079, -192973, -362568, 201862, 31042, -22300, -4982, 37401, -7033, -58099, -134417, 5759, -99826, -52223, -168761, -265762, -45769, -92442, 71623, -152324, -118853, -52004, -192153, 44235, -82062, -118452, -216550, -214367, -43153, 12340, 15465, 91286, -100460, 18400, 135094, -65379, 7080, -120580, 106333, -168672, 332945, -160741, -341537, 35162, 12483, -154906, 281241, 70929, -211298]
15765a37678K5890j83071D7934L352c69878F3448d8950l7270q0300A23100C0075
15753b4914o18A87528E6330i8507c5397D6980b05371A16852a96572P1227C06457
15741A26638q653C2897c940j29922c568j03749A03823a51117P4911B1181b8784
15729B14387j06931h7065F1487J02570e1066k35544A57351e9235j63909a4353
15718G8460K3585a98061j5831C3734I131a13989m113I6804Q2168c18190g3815
15706A76833b25251C1489j5575a28690G2223B7500J6648a84265A6702J49244c9153
15694A53638b9876F0309P5740A3116a44866M1752I4748f3939E7527e8608A78285
15682H9930C9232a22631D33372b29406A15849J78875B0927a08230l0110I2349
$$ y = [-137678, -111788, -294859, 47934, 51286, -369878, 63448, -48950, -86220, -166520, 123100, 30075, -24914, -25532, 187528, 56330, -98507, -35397, 46980, -205371, 116852, -196572, -125345, 306457, 126638, 117985, 32897, -3940, -133862, -3568, -107317, 103823, -151117, -76206, 21181, -28784, 214387, 107456, -87065, 61487, 164057, -51066, -286610, 157351, -59235, -223144, -14353, 78460, 102045, -198061, -213892, 33734, 9131, -113989, -118102, 96804, 178972, -318190, -73815, 176833, -225251, 31489, 15914, -128690, 72223, 27500, 44148, -184265, 16702, 165946, -39153, 153638, -29876, 60309, 136049, 13116, -144866, -103114, 94748, -63939, 57527, -58608, 178285, 89930, 39232, -122631, 433372, -229406, 115849, 294724, 20927, -108230, -138340, 92349]
15671a7892H215L39339A15524a05214k31338N4401E3595b19905A3403R2879m6641
15660E9641l164c31172k3062A84434f8838B34816K7122c9976A10982K6687i4925
15648A44619R5379p7457F0385R7466E956K88356a71381E7880a31040p087B24506
15636h8281B43703p5583H087M9902a58571b2884A69397a90281C56129C041d3371
15624A11674b46829a09838j64091i084k22997k3895C76524b4631I6671a06006
15613c41010a20655n6772A0078J87862K01050A19729M8343B0128a71657g873E3687
15601f0084o1958n8822B3311b32479L3802a2192k31187A49391a28961K2811I5386
15589I5340j5762a08917C2640M4801q775b71576B22162a94545B24699C6745N502
$$ y = [-17892, 8215, 347554, 115524, -105214, -336552, -282151, 53595, -219905, 13403, 106282, 59641, 56477, -331172, -354234, 184434, -68838, 234816, 261938, -39976, 110982, 137669, -94925, 144619, 239998, 162541, 60385, 157851, 5956, 294312, -171381, 57880, -131040, -138127, 224506, -88281, 243703, 168120, 8087, 57989, -158571, -22884, 169397, -190281, 356129, 3041, -43371, 111674, -246829, -109838, -273929, -9084, -232081, -255976, 376524, -24631, 96671, -106006, -341010, -120655, -177427, 10078, 197940, 398990, 119729, 168072, 20128, -171657, -7873, 53687, -60084, -122042, -180864, 23311, -232479, -198677, -12192, -243379, 149391, -128961, -106150, 95386, 95340, 79578, -108917, 32640, 77441, 68666, -271576, 222162, -194545, 224699, 36745, 42247]
15578D2247j5620c47668P0850a38354E0962Q4500a59139A16542D3256K80867j55156
15567A68967A8542K2758a07201b8405Q415F6702a22226k14347f3122A62016J3767
15556A75783E2053c2897F5816f7049J4842G9605e40400b16075A16250e3532D091
15544a34536A49613F8852i7663a1598j12923G5382b80191N346E5504J20108C7902
15532a6699k55161I4270a7097j55049h0002b5668E6422a39792I4486h6961j53168
15521b40129F0549J44880j7834a44780f7298l6107A57822E730h262k32697I2713
15509d9883J4264j35661g6375p9623B27552e5476H764R1009b0158k47045B2702
15497I3868J45560O3852E1216K5035b67750A02516b65213P2559B04116b95758
$$ y = [42247, 26627, -347668, -276818, -138354, 50962, 135462, -159139, 116542, 43256, 324123, 168967, 18542, 41300, -107201, -28405, -19990, 66702, -122226, -336573, -63122, 162016, 175783, 52053, -32897, 65816, -67049, -52207, 79605, -540400, -216075, 116250, -53532, 4091, -134536, 149613, 68852, -97663, -11598, -124521, 75382, -280191, -274845, 55504, 175612, 37902, -16699, -271860, 94270, -17097, -172146, -80002, -25668, 56422, -139792, 94486, -86961, -240129, 60549, 205429, 187595, -144780, -67298, -103405, 157822, 5730, -8262, -240959, 92713, -49883, -35619, -171280, -76375, -155998, 227552, -55476, 8764, 99773, -20158, -267203, 22702, 93868, 239428, 303280, 51216, 76251, -267750, 102516, -265213, -192654, 204116, -295758]
15486a67173a2600m2885r1022O4994A14772o958c1761A06094a52023e6090m18337
15475d74427B65515a62435q2546q5317a32345L66A81030a1759B31968p9106b56652
15463D0814K427i6286F7658J78419a95734I2655h3902G1370K6185E058b12736
15451a82429e8548C29967n6813i3196C29286c17563C32719b20669b2958j17492
15441a40450E45808A48953j1982a59907D47758a57328k90851A49337F5131i6965
15430g6940A43194J0311b18680H389J94121c42958a26634D9878P0789J27941D0259
15418B12863i1439c2315k0597j8333j23160G7804K8862F551J66576k6900f4636
15406A11487b0259k4193a8397B03974H3214K6365a01314p3410G5477g1316j42225
$$ y = [-167173, -12600, -55485, -146507, -81513, 114772, 107814, -31761, 106094, -152023, -56090, -474427, 265515, -162435, -244981, -330298, -132345, -131979, 181030, -11759, 231968, 152862, -256652, 40814, 43241, -96286, 67658, 246077, -195734, 92655, -83902, 71370, 97555, 5058, -212736, -182429, -58548, 329967, 273154, -93196, 329286, -317563, 332719, -220669, -22958, -140450, 545808, 148953, 136971, -159907, 447758, -157328, -448179, 149337, 65131, -96965, -76940, 143194, 153505, -218680, 8389, 202510, -342958, -126634, 49878, 120667, 248608, 40259, 212863, -91439, -32315, -52912, -71245, -194405, 77804, 106666, 6551, 173127, 146227, -64636, 111487, -20259, -44452, -18397, 203974, 83214, 109579, -101314, -174724, 75477, -71316, -213541]
15395b13541A78932h9430M553M1438B32309e0269g849B8255L63933I4879b98502
15383A64969c17804a27983C421J51779b80447F677O4629M2983i199l16387e1999
15371A65723H2490K10283a14213i894C6432H209J76807C280c4064p2413A33165
15359h0761A9326a54457o1499G4137j3151N0993j1549f2287C93823G4416f5772
15347A20162c4617k16907A99006J72000B8546J18470a74486B44630A3577J38276
15337A51853h2768k1434L3849j18132b6265B34908a44942g117j16079B1254L8575
15326E9829a49971B7009a41984G0207K349a17544G3297R1180L2125k4523b3324
15314b3346F6742K31205D4651J13604B8359b08333b9116E7258a11483j1165j32596
$$ y = [-213541, 178932, -89430, -84877, -43439, 232309, -50269, -7849, 28255, 392188, 94879, -298502, 164969, -317804, -127983, 3421, 155200, -280447, 6677, 71306, 114289, -9199, -325586, -51999, 165723, 82490, 292773, -114213, -9894, 36432, 8209, 185016, 3280, -34064, -106477, 133165, -80761, 19326, -154457, -215956, 74137, 60986, 111979, 100430, -62287, 393823, 74416, -65772, 120162, -34617, -251524, 199006, 371006, 28546, 147016, -174486, 244630, 13577, 151853, -82768, -104202, -70353, -188485, -26265, 234908, -144942, -7117, -123196, 21254, 59829, -149971, 27009, -141984, 70207, 72556, -117544, 73297, 164477, 196602, 172079, -23324, -23346, 66742, 297947, 44651, 158255, 28359, -208333, -29116, 57258, -111483, -122648, -255244]
15303b55244B65027q3460b01781r8232G4005J93116q4722n8653m4299a75469m6989
15292b22458A74691E2523K99317a62011e3488n400B8012J4942A464K51225h6595
15280g6463B44810d03969a02224B26802a76973A88654A3715a61462B10851q3667
15270A27184B7353L3479a26372j34276C04403c0494r5034a5807H0624c6828A76313
15258g8116m3751C6747A2170J9525K94955A11020l3009J94528a62720c107j88718
15247a91825B3105P9472A284a9514k1438L572A16351K32742k5388E1636A6251
15235D93450j18283M30236P3600p1263K32437l05123B43730F4540K09093K2992
15225B96625B352J760L4653N90610D1588R2376a52976F4311P6002F2911a20773
$$ y = [-255244, 265027, 181567, -201781, -300013, 74005, 267121, 182399, 123746, 79447, -175469, -222458, 174691, 52523, 351840, -162011, -53488, -58888, 28012, 42954, 1464, 252689, -86595, -76463, 244810, -403969, -102224, 226802, -176973, 188654, 13715, -161462, 210851, 127184, 27353, 60832, -126372, -260648, 304403, -30494, -125528, -15807, 80624, -36828, 176313, -78116, -121867, 36747, 12170, 31695, 326650, 111020, 78011, 272539, -162720, -3107, -191825, 23105, 102577, 1284, -19514, -40952, -37380, 116351, 349093, 323705, 51636, 16251, 493450, 375167, 805403, 879003, 807740, 1040177, 735054, 243730, 64540, 273633, 296625, 2352, 4112, 38765, 629375, 41588, 133964, -152976, 64311, 140313, 62911, -120773]
15213g631q1179A2495b19598C21766b3715B8943N3408A9239K43442B4606J47173
15202A71779b03447A01467L8514D7645q597L6743g4562H6869HK20601H4882r035
15190G5847A4375c2471n0760c5874E7412c21396A61399K60371j91597L5326G9804
15178c31582B16499D3588f8988I6014c01693a01451d7194j1081C80111j48590
15168B31521j03692B936J79849Q8851b47082B99104A03961J94824i1573m9264
15158a40837A34216C4465a6199C42192j61167m422a98583C08993C6004J26671
15148A62675a71370B36995a08562c5100k39561d7158A38255J65141n380I5244
15137a00631G287K11329a59011A51675Q3324d46949e2836j70108O3382B93812
$$ y = [-7631, -88810, 12495, -219598, 321766, -23715, 28943, 82351, 19239, 262681, 24606, 171779, -203447, 101467, 139981, 47645, 39048, 75791, -74562, 86869, 8, 220609, 84882, 75847, 14375, -32471, -83231, -35874, 57412, -321396, 161399, 421770, 230173, 265499, 79804, -331582, 216499, 43588, -68988, 96014, -301693, -101451, -47194, -58275, 380111, 231521, 127829, 2936, 182785, 271636, -247082, 299104, 103961, 298785, -91573, -140837, 134216, 34465, -16199, 342192, 181025, 176603, -198583, 308993, 36004, 162675, -171370, 236995, -108562, -35100, -274661, -47158, 138255, 303396, 298016, 95244, -100631, 7287, 218616, -159011, 151675, 234999, -446949, -52836, -222944, -159562, 293812]
15126C26256o7839E8501J34253c2868j26173H5706i6354A74017I809O8018A8104
15114A48936b9941C73284j78453k3892C5135a9771n8171B06018L7489J15174H3675
15102a13456j50060i7357A17077A4506K09567j10304P5066F8848J87345b35073
15091D9184b0498A19717c61924A53952k2243J57491J82793G8310J26864a09981
15080e45k29740A7746a77631B03724J13189b24293g6622B0848K43658b2898A11196
15068F6737a66465B16078L2127H5513A856h1982C08276J36298j85455O9883k4441
15057C04561m0640n4606R9025o1136A4286J39401J47875j27175J63728j31019
15047B07096G8250q266J22616o3650i33C3887R1089O2637h9567L2638C82571B0762
$$ y = [326256, 258417, 58501, 192754, -32868, -159041, 85706, -96354, 174017, 9809, 77827, 18104, 148936, -29941, 373284, 194831, 170939, 35135, -19771, -77942, 206018, 243507, 358681, 83675, -113456, -263516, -97357, 117077, 14506, 224073, 113769, 188835, 68848, 256193, -235073, 49184, -20498, 119717, -361924, 153952, 131709, 289200, 471993, 78310, 205174, -109981, -545, -230285, 17746, -177631, 203724, 316913, -224293, -76622, 20848, 264506, -22898, 111196, 66737, -166465, 216078, 248205, 85513, 1856, -81982, 308276, 444574, 259119, 329002, 304561, 263921, 209315, 308340, 247204, 14286, 153687, 301562, 174387, 338115, 207096, 78250, 69984, 192600, 128950, -933, 33887, 124976, 187613, -89567, -56929, 382571, 20762]
15034d5933B11577A4907b43820A14440L9028n7124L0342a70937A12222Q8060a6060
15022B09089a9727A82925N9404F0535P5248K06142a75494B23450b711A1536L9769
15011E1305L17573d1583B10180h9027A25067l6230J25891a21117D9446K11595
15001B61041r2496J50648A04137J01582I9147j214C9741K73279j5601J68624n8209
14990D07834F9845h8246H360K67318h2877B3250J58325o6826L43439k00386F9033
14978A40282b98155A75316J10679B992J43464c4661C99683D2665N2637N5639g5562
14966E9244O2438J05647K62867j91960A14425L23125K5428j52758b5845B3064
14955B42348j15697L58305j61110N9370a0835B56825J33474J3686a90349F21915
$$ y = [-45933, 211577, 14907, -243820, 114440, 153468, 96344, 126686, -170937, 112222, 200282, -16060, 209089, -19727, 182925, 242329, 60535, 135783, 341925, -175494, 223450, -2711, 11536, 51305, 368878, -41583, 210180, -89027, 125067, 88837, 214728, -121117, 49446, 261041, 168545, 319193, 104137, 205719, 99147, 97933, 39741, 313020, 297419, 466043, 407834, 69845, -88246, 8360, 275678, -82877, 23250, 181575, 114749, 458188, 257802, 69033, 140282, -298155, 175316, 285995, 2992, 146456, -34661, 399683, 42665, 95302, 150941, -75562, 59244, 121682, 227329, 490196, 298236, 114425, 437550, 462978, 310220, -25845, 23064, 242348, 126651, 484956, 323846, 383216, -10835, 256825, 390299, 403985, -190349, 621915]
14944D59167j83953G3065J22191G3975K52967b23260C4946R4487n7053M6132L02301
14933D20813p4683J70483j13250d4850D75816a34584B39050C7636e8244F20958
14922D75879m6928J2198k06694K25138A05065K19202P1181j19811m4396J56776
14912C88017J17109j32131j47550J20077a54406E36314j68783m0447J79135r4181
14902D12038J07622A95152K87935A44544L77572M551A72746J17898m0861n8689
14892A91094K37741A08936J63973o8570Q1677n0902A04243b1723C72451M9464
14882D21915J26662a28565B41380m6878R1555O2110l6466A47666j3230P4139I8130
14870D43120q2554J08507m288j43713j02043D0575K25113M5323o1924a7377C68641
$$ y = [459167, 275214, 73065, 195256, 73975, 326942, -223260, 34946, 129433, 72380, 118512, 420813, 346130, 516613, 403363, -44850, 475816, -134584, 239050, 37636, -58244, 620958, 475879, 428951, 441149, 234455, 459593, 105065, 324267, 395448, 275637, 231241, 388017, 505126, 372995, 225445, 345522, -154406, 536314, 367531, 327084, 506219, 412038, 519660, 195152, 483087, 144544, 522116, 526667, 172746, 290644, 249783, 191094, 428835, 108936, 272909, 204339, 286016, 235114, 104243, -21723, 372451, 421915, 548577, -128565, 241380, 194502, 286057, 348167, 311701, 147666, 134436, 208575, 98130, 443120, 360566, 469073, 464785, 321072, 219029, 40575, 265688, 311011, 249087, -17377, 368641]
14858A71802J6267Q5830J02556j71764J10186J02386J73132B27756K39445K19086
14848F86287C06196G9209J05658B3731N10922k1057r8610l5134q4496J32086j6078
14837D11364c1956B70815A22589N09707k69459Q7874k0021K6808K11445l32885
14827C36058J40948j37866j2427K4950L7971J27868p5839J72660J02663j04505
14817F12481q1379l4964o1042r5238R6363k3037R4680j11558H9604M16971k32809
14806B73766q5115J66042K45708k00387j47716M14425n2841j14405n6236p1302
14796C71939K00467j06069B09382J18639k2022J81773j51363P2971J87516l5407
14786E61489j68086K76746j28737j62749J17065k14255K33122J91223j90370o2615
$$ y = [171802, 188069, 273899, 376455, 204691, 314877, 417263, 590395, 227756, 467201, 686287, 306196, 79209, 184867, 23731, 534653, 513596, 414986, 379852, 295356, 427442, 411364, -31956, 270815, 122589, 632296, 362837, 450711, 430690, 457498, 668943, 336058, 477006, 339140, 326713, 351663, 389634, 517502, 441663, 614323, 716986, 612481, 531102, 496138, 435096, 339858, 436221, 413184, 507864, 396306, 89604, 506575, 273766, 188651, 354693, 600401, 400014, 252298, 666723, 613882, 499477, 443241, 371939, 572406, 466337, 209382, 328021, 305999, 487772, 336409, 409380, 596896, 561489, 393403, 670149, 541412, 378663, 495728, 281473, 514595, 705818, 515448, 452833]
14776D52833J56513p3449J74520q9336j73752L50093l94676L0069n1919p0574
14766C10322n0932L26360m2152j04547K7376l5793q347j93622M75470A37467K06929
14755C44396J17912K89948j79334j5031M8991k11382K42894J59611j29324j07219
14745E61462J1159J4651k640n5060j07750L32561J26440l42501k36443K51427
14735E53306J81173j94312Q4242K743L34749D37494K23578r9056o009O749L37988
14724I00744C71523L28497j61657o1141l434j46598L02484B61477N47445l09065
14714D99857j27061K62443L02817l13156K28516K7357j6316C67491N88662m70086
14704D86067N2520M95414m69851J92891K5041J4003K0954l95022L68577q5608
$$ y = [452833, 609346, 535897, 710417, 621081, 447329, 797422, 402746, 432815, 380896, 310322, 259390, 585750, 543598, 439051, 466427, 430634, 422287, 228665, 704135, 137467, 344396, 462308, 752256, 572922, 557891, 606882, 395500, 638394, 798005, 668681, 561462, 572621, 587272, 584632, 529572, 421822, 754383, 880823, 538322, 301879, 553306, 734479, 540167, 624409, 627152, 961901, 437494, 661072, 562016, 556007, 562756, 900744, 371523, 700020, 538363, 477222, 473788, 327190, 629674, 261477, 808922, 499857, 372796, 635239, 938056, 624900, 853416, 880773, 864457, 367491, 956153, 486067, 538587, 1034001, 564150, 757041, 782082, 796085, 817039, 422017, 790594, 704986]
14694G04986p9067J46790K08447J29528l82261R0893k15089M7155R2113K58764
14684A002259n5689C97879L60706R787K07925l1850P7659l48479J17624j79977
14674F11274p2239L06167J06721k01503o8245M02913k56321j04066J13440O9055
14664I07196Q6864j77364j02784j17401L97277J6012j85173p3709J84458n113
14654I30263P9265k50956N6795k1818J4171j2205J87260K3899r748j75107J35229
14643I57048L0957l82718M5K27325O8477K52560k79661q0697K76502J10141J45815
14632A325794l50960K9161L4808q6161J757K10414L9686p9153M6226j23246o1566
14621I86760K68601j12278k41440K76543K04868k70466M0963p1309Q0499K31511
$$ y = [704986, 625919, 772709, 981156, 1110684, 728423, 819316, 604227, 651382, 743495, 1002259, 946570, 397879, 758585, 768372, 976297, 944447, 1022106, 673627, 791251, 611274, 539035, 845202, 951923, 750420, 682175, 1085088, 828767, 724701, 838141, 907196, 994060, 816696, 713912, 596511, 993788, 1009800, 824627, 750918, 935376, 930263, 1009528, 758572, 815367, 793549, 807720, 795515, 982775, 1006674, 996926, 821819, 957048, 988005, 605287, 605332, 832657, 901134, 1153694, 874033, 793336, 1069838, 1179979, 1325794, 974834, 1003995, 1038803, 952642, 954399, 1164813, 1204499, 1125346, 1171572, 1048326, 986760, 1255361, 1143083, 901643, 1178186, 1383054, 1112588, 1153551, 1082242, 1162741, 1394252]
14611A394252j2086j36820n9950J90762k5611R2907l55459N75771n90543J13723
14601A186946L21471k13212j3663J82957j99340K22846j62176j20048N31157m16241
14591A320697L36678m03296J31303J32599K60734m20444L35902k11935p5760K51698
14581A658176m86208M94745j65611K65629l31013J32407J06624K67762n97472
14572A345039K16701O9690J56268J42015l38415K94292N1320j58955K54513R9930
14562B132398k01176j22401j1137N6446J6319q0061M48700k74374l9986J61876
14552B086604j29246J24975r5559J44259M72442L3344Q0719J56599k04735K66847
14542B936249K19749K46702P1367L45661O55559L22097J104354R36235K122720
$$ y = [1394252, 1382166, 1245346, 1185396, 1376158, 1350547, 1443454, 1087995, 1663766, 1073223, 1186946, 1508417, 1295205, 1281542, 1464499, 1265159, 1488005, 1325829, 1205781, 1736938, 1320697, 1657375, 1254079, 1385382, 1517981, 1778715, 1358271, 1694173, 1482238, 1406478, 1658176, 1171968, 1666713, 1501102, 1766731, 1435718, 1568125, 1674749, 1942511, 1345039, 1561740, 1631430, 1787698, 1929713, 1591298, 1885590, 1936910, 1777955, 2032468, 2132398, 1931222, 1808821, 1797684, 1854130, 1870449, 1790388, 2239088, 1964714, 1924728, 2086604, 1957358, 2082333, 1986774, 2131033, 2603475, 2636819, 2717538, 2874137, 2669402, 2936249, 3155998, 3402700, 3474067, 3819728, 4475287, 4797384, 5901738, 6837973, 8960693]
14533H960693L724147O080943Q320104L413491j0171248p780319m881175k764168
14525D902468p64662q13446K1198n44687k15932K25004m83741K98990m29994J290
14515B196488J05237j90289K17373K0843m02970K25878l13988N81131k17741J90032
14505B411994m12199m5630N27565k28055L08905l91160J91817l1331O0927K88951
14495B681784l10708J83058L04152k5379n28227O91398r4557P113J17784j94737
14485B831681M033O7318m8177O2265K28131L1532j09754l24095M46827k6448n3458
14474C109855K55925k37071L97297j63460k981Q0637P5403r9264J62461l6804
14464C541998R3359j83563M34865j10696K9574j26407J97616N149j11895k7085
$$ y = [8960693, 12684840, 18765783, 27085887, 30499378, 20328130, 12547811, 7666636, 4902468, 4137806, 3324360, 3345558, 2800871, 2584939, 2809943, 2326202, 2625192, 2195198, 2196488, 2301725, 2111436, 2328809, 2349652, 1946682, 2172560, 1858572, 2439703, 2221962, 2411994, 1999795, 1954165, 2481730, 2253675, 2562580, 2171420, 2363237, 2331906, 2392833, 2681784, 2371076, 2554134, 2858286, 2832907, 2304680, 2996078, 2901521, 2908634, 3026418, 2831681, 2835714, 2903032, 2854855, 2917120, 3145251, 3176783, 3067029, 2742934, 3189761, 3163313, 3109855, 3365780, 3128709, 3526006, 3362546, 3359565, 3440202, 3515605, 3416341, 3578802, 3541998, 3635357, 3451794, 3886659, 3775963, 3805537, 3679130, 3876746, 3881895, 3770000, 3742915]
14454C742915J05451M64275m81943L83281Q0170m6557K62042j12807k8166j77137
14444D191524L47241k70677K32870K75360l59753L47168l9649J91270J74637K37121
14434E327112m67611L40118l83446L17330L6805j57447K88972M61595m68233K91424
14424E586619K84522j05095O4563r3892M00870l10974N49142k68318q5426K28017
14414F250028j04820K74804K99112m4041J50072J52855K38057k06944M32908m58009
14404F984022M12040L2594j49677P03482k42547J21589j39184L41840K41741J31374
14394H437274k03949J66555M26869P4738J32687n5542Q9615K29096K03905L47096
14384I848344K94498m14399L44516M27301k03922R4636N92325q9042L09549N6090
$$ y = [3742915, 3848366, 4312641, 3830698, 4213979, 4294149, 4247592, 4509634, 4396827, 4368661, 4191524, 4538765, 4268088, 4500958, 4776318, 4416565, 4763733, 4724084, 4915354, 5089991, 5327112, 4859501, 5199619, 4816173, 5133503, 5170308, 5012861, 5301833, 5763428, 5295195, 5586619, 5871141, 5766046, 5830609, 5736717, 6137587, 5826613, 6375755, 6107437, 6022011, 6250028, 6145208, 6420012, 6719124, 6675083, 6825155, 6978010, 7216067, 7009123, 7442031, 6984022, 7396062, 7428656, 7278979, 7982461, 7739914, 7861503, 7722319, 8064159, 8305900, 8437274, 8233325, 8399880, 8826749, 8901487, 9034174, 8978632, 9068247, 9297343, 9501248, 9848344, 10142842, 9728443, 10072959, 10500260, 10296338, 10390974, 10983299, 10894257, 11203806, 11259896]
14374A1259896L53325M33734k64730N45032L08006p3439N67904l23325N89644
14365A3396047K72421K48940O07676k18936N40692j5286L06934M34583J96417
14356A5769488M38682L06525N22777L31548K11970L97251J82872L87723Q55403
14347A9404239J77711O13243O01495J16977L80526N01588N10631O24326O39055
14338B3569791K53793Q91067M15624N15530R68174M70338J27083J264042N15506
14329B8990948J076326Q03242P35799Q14761J009965L11850J355821J143150J115362
14320C7357224R21526J335669J072962J398114J051983J637587J288009J529950
14312D7593024J725780J613378J560018J713839K336377J922076K113397K056190
$$ y = [11259896, 11613221, 12046955, 11782225, 12327257, 12635263, 12561824, 13129728, 12806403, 13396047, 13668468, 13917408, 14525084, 14306148, 14846840, 14831554, 15138488, 15573071, 15769488, 16208170, 16514695, 17037472, 17369020, 17580990, 17978241, 18161113, 18548836, 19404239, 19581950, 20195193, 20796688, 20913665, 21294191, 21795779, 22306410, 22930736, 23569791, 23823584, 24714651, 25130275, 25645805, 26613979, 27084317, 27211400, 28475442, 28990948, 30067274, 30870516, 31606315, 32421076, 33431041, 33742891, 35098712, 36241862, 37357224, 38278750, 39614419, 40687381, 42085495, 43137478, 44775065, 46063074, 47593024, 49318804, 50932182, 52492200, 54206039, 56542416, 58464492, 60577889, 62634079]
14304F2634079K538543K863042K519285K825452K390746L502854L714709L210734
14296H6199444L935934L888291M031593M234844M689807M762386N686620N587888
14288A23016807N838514O853116O546764P189215P750427Q130956Q979919Q759222
14280A83064940J0051965J0514163J0800186J2005334J2202363J3113189J3804482
14273B65556622J4331886J4210569J4323344J4826409J5052273J4971395J4406403
14266C67678901J3738431J2637291J1914159J0836413R546479Q761059P742832
14259D42855565P275003O271821J934867r74033K25523k203387p837149p055435
14251D40492775p754682j1348959j2970922j2124389j3664440j3281302j4437294
$$ y = [62634079, 65172622, 68035664, 70554949, 73380401, 75771147, 79274001, 82988710, 86199444, 90135378, 94023669, 98055262, 102290106, 106979913, 111742299, 117428919, 123016807, 128855321, 135708437, 142255201, 149444416, 157194843, 165325799, 174305718, 183064940, 193116905, 203631068, 214431254, 226436588, 238638951, 251752140, 265556622, 279888508, 294099077, 308422421, 323248830, 338301103, 353272498, 367678901, 381417332, 394054623, 405968782, 416805195, 426351674, 435112733, 442855565, 450130568, 456402389, 458337256, 457363223, 457588746, 455385359, 447548210, 440492775, 432738093, 421389134, 408418212, 396293823, 382629383, 369348081, 354910787]
14244C54910787j4586107j4702723j4319799j3655268j3338577j3490361j2635344
14237B58182608j2347004j2050256j1617933j0387561j0228471j0374546r859751
14230A81317086r556645r127948q244929p619493p557402o704690o541854n520751
14222A20443374n354498n475119m923374m667030m441094l942934l591147l353361
14214H4694817l739934l182969l059991l307046k729340k120217k639048j814192
14206F2102080k136130k339421k161054j617753j882759j802527j549622j383278
14198D7229536j281271j462606j290337j533287j101168j559766l68816r52073
14190C7680212j166802j281854r16474j072048p27511r72969p26962q85459q32069
$$ y = [354910787, 340324680, 325621957, 311302158, 297646890, 284308313, 270817952, 258182608, 245835604, 233785348, 222167415, 211779854, 201551383, 191176837, 181317086, 171760441, 162632493, 154387564, 146768071, 139210669, 132505979, 125964125, 120443374, 115088876, 109613757, 104690383, 100023353, 95582259, 91639325, 88048178, 84694817, 80954883, 77771914, 74711923, 71404877, 68675537, 66555320, 63916272, 62102080, 59965950, 57626529, 55465475, 53847722, 51964963, 50162436, 48612814, 47229536, 45948265, 44485659, 43195322, 41662035, 40560867, 39001101, 38632285, 37680212, 36513410, 35231556, 34315082, 33243034, 32515523, 31542554, 30815592, 29930133, 29098064]
14181B9098064n23374q15098o56781n64755j033047m51300q16717j79204r22831
14172B3134957l78769m34269p21162n43264k43988l27077n41842l58779n09600
14163A9076207l80538k35102l17100m24407k31521p05019j98869p48570J31730
14154A5966811l63777k58123k23198l75923l93612l81651Q4109j07304o54709
14145A3292623M7033k23411l83197l01102L7164l73347k01565j77647k44324m31854
14135A1040373O5762o37670M19767k82811k2307j14859k91956k81762M509p4822
14125I824224k84249j76617j72093R1294j92943o63209M0752N19190m44715k22124
14115H319510j9408m34617J25694q380k06049J13171l56915R8115M718l94679
$$ y = [29098064, 28574690, 27759592, 27102811, 26538056, 25505009, 25053709, 24236992, 24057788, 23134957, 22756188, 22321919, 21600757, 21057493, 20813505, 20486428, 19944586, 19585807, 19076207, 18695669, 18460567, 18143467, 17719060, 17487539, 16782520, 16583651, 15835081, 15966811, 15603034, 15344911, 15121713, 14745790, 14352178, 13970527, 14054636, 13947332, 13292623, 13339656, 13116245, 12733048, 12431946, 12469110, 12095763, 11894198, 11716551, 11472227, 11040373, 11106135, 10468465, 10888232, 10605421, 10583114, 10468255, 10176299, 9894537, 9899046, 9824224, 9539975, 9363358, 9191265, 9282559, 9089616, 8426407, 8467159, 8986349, 8541634, 8319510, 8300102, 7865485, 7991179, 7982799, 7776750, 7889921, 7533006, 7631121, 7635839, 7241160]
14105G241160L10010k92753n46138M13897n38676K55278j38822j58066k1604j19405
14095F404881l39696J80067l70429J83208p8631J5521k60010Q1591k08252K49751
14085E858001k12084l28864k65934M02744k63993m3904J060J06051l0557j18560
14075E103960j70060M9975j02073l50662J66879M849J39157J39384q57563L36588
14065D460434L3242K3650j78756k25440K83678m09030L74502k21658J53831k33477
14055D060976k34111N2419L17330k90761J55632l09249J11955l21767J42566J76695
14045C861685r5845Q2546M0607k34849J96265l44336j80758M4737J06222P5679
14035C551953m44385R678p0239p928k56752L36653J13567l39126N2661J97017
$$ y = [7241160, 7551170, 7258417, 6712279, 7126176, 6587500, 6842778, 6703956, 6545890, 6524286, 6404881, 6065185, 6245252, 5874823, 6058031, 5979400, 5994921, 5734911, 5816502, 5608250, 5858001, 5645917, 5317053, 5051119, 5453863, 5189870, 5145966, 5147026, 5253077, 5222520, 5103960, 4933900, 4983875, 4881802, 4531140, 4698019, 4702868, 4842025, 4981409, 4123846, 4460434, 4493676, 4517326, 4338570, 4113130, 4396808, 3987778, 4362280, 4140622, 4294453, 4060976, 3826865, 3879284, 4196614, 3905853, 4061485, 3752236, 3864191, 3542424, 3684990, 3861685, 3765840, 3848386, 3888993, 3654144, 3850409, 3506073, 3325315, 3370052, 3476274, 3551953, 3107568, 3117246, 3047007, 3039079, 2782327, 3118980, 3232547, 2893421, 2946082, 3143099]
14025C143099r3657q7434P1079k05481r4464J73328j48118O44606n36884j67865
14015B698209k3189J77267k06328J42268j51000R7193l74203l3846n5666J65800
14005B436505j51967k3840K2238L0580J66764k14432p0910L29624l05874j4279
13995B204409Q3906j07074N5158l28790k11748L78276k14556L89701R5530k44031
13985B100781J35478k33543K05921K58468j7643P8823J87082Q8285K60219K81017
13975C344888J053796J039312K845976N454384Q570091P012396o727537p880676
13967A4712630m464332k508192j818206r36972p79144k82144m9048q13521R2825
13958C153896r3513k95173l4981k18068r083j21410j88677j01273l46036K84139
$$ y = [3143099, 3049442, 2962008, 3033087, 2827606, 2733142, 2906470, 2758352, 3402958, 2866074, 2698209, 2675020, 2852287, 2645959, 2788227, 2637227, 2734420, 2360217, 2326371, 2270705, 2436505, 2284538, 2260698, 2282936, 2313516, 2480280, 2265848, 2194938, 2524562, 2218688, 2204409, 2288315, 2181241, 2236399, 1907609, 1695861, 2074137, 1859581, 2249282, 2344812, 2100781, 2236259, 2002716, 2208637, 2467105, 2449462, 2528285, 2715367, 2803652, 3063871, 3344888, 4398684, 5437996, 8283972, 13738356, 22308447, 29320843, 22593306, 14712630, 10248298, 7740106, 5921900, 4984928, 4205784, 3923640, 3874592, 3061071, 3153896, 3060383, 2765210, 2730229, 2512161, 2503078, 2381668, 2192991, 2091718, 1745682, 2029821]
13948B029821L49631k70346l14187q5824M55614l46645Q7719J34976l7816l28674
13938A674269L49468k75157J17794j90049L21041k31855k16947M22977j07899
13929A863642l48737J58962O8582j5228k03351J7461n3404K10442m9942L1984
13919A680411j22268R8205j57718K43832k32924K1543K60043n53518J29423k74182
13909A092847J88770L75902k19586q3241J9499k62136J76569P1139j78882P2392
13899A253273L71580m76438K12488k39718N41209m99238Q0401J44625J410K4469
13889A414061K0652k50761K2755j16851Q3990k89304K93590j60956K32681k77518
13879I72339M7390J14673K37992r4229P6168r3553L707j54302O7145q3881j06652
$$ y = [2029821, 2379452, 2109106, 1794919, 1709095, 2164709, 1818064, 1905783, 2040759, 2002943, 1674269, 2023737, 1748580, 1866374, 1676325, 1997366, 1765511, 1548564, 1971541, 1863642, 1514905, 1673867, 1742449, 1727221, 1523870, 1541331, 1487927, 1698369, 1648427, 1680411, 1558143, 1656348, 1498630, 1742462, 1509538, 1531081, 1791124, 1237606, 1367029, 1092847, 1281617, 1657519, 1437933, 1354692, 1374191, 1112055, 1288624, 1359763, 1180881, 1253273, 1624853, 1148415, 1360903, 1121185, 1662394, 1163156, 1243557, 1388182, 1389592, 1414061, 1434713, 1183952, 1206707, 1089856, 1173846, 884542, 1178132, 1017176, 1249857, 972339, 1019729, 1134402, 1372394, 1278165, 1354333, 1260780, 1264487, 1110185, 1177330, 1093449, 986797]
13868I86797n6369P7881K63636m8640K07527m84656L31507l09283O7064R5180
13858A130644p8623J17651j94546K74741j35245K4653o470m48589M69860p8301
13848A075775K62531m07467O4114M0049q8583P7211m102J92881m49239J26268
13838H89438L25900l69523O3189k02265n1481L96428J03062o1462j24009J55907
13828A125184j19849R1592j39916l75847N36025E23535L66685L3906l5658j32798
13818G55670q6827M76605k36357j21887K39580l7766k38833P7802k5251J28097
13808I30833m39213N94554j85644j19038L0000R6645J13921k22645J75685r3509
13798H81589l20487J11604K61096j06450j00568j43251M31841q0628J49809n38349
$$ y = [986797, 930428, 1008309, 1271945, 1223305, 1430832, 946176, 1277683, 968400, 1035464, 1130644, 1052021, 1169672, 975126, 1249867, 1114622, 1139275, 1132805, 684216, 1154076, 1075775, 1338306, 930839, 994953, 1035002, 946419, 1023630, 1019528, 1212409, 763170, 889438, 1215338, 845815, 909004, 706739, 655258, 1051686, 1154748, 1093286, 969277, 1125184, 1005335, 1096927, 957011, 581164, 1117189, 523535, 890220, 924126, 888468, 755670, 668843, 1145448, 909091, 787204, 1026784, 989018, 750185, 827987, 802736, 930833, 491620, 1086174, 900530, 781492, 811492, 908137, 1022058, 799413, 975098, 881589, 561102, 672706, 933802, 827352, 726784, 583533, 1015374, 934746, 1084555, 546206]
13788E46206L35962l8981J19866j08393P7934l38773J40991j86572L20286Q3811
13778I52337m2278k56853j25167M27650l81838K43580k00045k39761M34234q8440
13768G23419m5725O6002l37077J12967m2231K46255k34050O6040j63256L30939
13758G23283k43969j08584K68092k9541K4976L2471q5031J35185j58246K60738
13748H19374B14986O03528l60147M1869j67178K90092L4334n9516j14964K22500
13738G05504J98659l60658J82858l25532J49247o0995B38347L53325B83754J99852
13728D83606K32096r9783k88626K93578k62487K72879j34699J80370n3993P7115
13718G00056j69942J44616C26736L44923K44832l92264o3633R7347k09519K34537
$$ y = [546206, 882168, 843187, 963053, 854660, 932594, 593821, 734812, 548240, 868526, 952337, 910059, 653206, 528039, 955689, 573851, 817431, 617386, 377625, 811859, 723419, 677694, 743696, 406619, 519586, 477355, 723610, 489560, 555600, 392344, 723283, 479314, 370730, 638822, 609281, 634257, 666728, 581697, 716882, 558636, 819374, 214986, 818514, 458367, 500236, 333058, 623150, 657484, 597968, 483004, 705504, 904163, 543505, 726363, 400831, 550078, 489083, 238347, 591672, 283754, 483606, 715702, 615919, 327293, 620871, 358384, 631263, 496564, 676934, 622941, 700056, 530114, 674730, 326736, 671659, 916491, 524227, 460594, 557941, 348422, 582959]
13708E82959r5527n7309J72920j031C4710K88143A16502O39229C04883J42943
13698D47826J3904j18350K18200B80078Q3664J21535k9158L41952C34252J19202
13688D53454j10609l704j1087O6152p9957n90J94932K13934j82667L9873j68437
13677D11294P0570K89609j48088Q4892k63525R8418K9983k5465j55557A45515
13666A99635J95921o6051K16960k39531j08208K90000R8302p9871j08152K22695
13656F21700B19803K3486J51903j72153P6256K38615L4271k18029j21964K68400
13646E00588k26168L68365A37351K70228M6830j75187L5070J27375J4593J43552
13636E99812k48241o5278K20684B19403P386K73367K9822p9599F1746O47990A01512
$$ y = [582959, 487432, 430123, 603043, 602012, 34710, 322853, 116502, 755731, 304883, 447826, 461730, 343380, 561580, 280078, 363742, 485277, 456119, 798071, 334252, 453454, 342845, 339141, 328054, 394206, 314249, 313659, 508591, 722525, 539858, 579731, 411294, 481864, 771473, 623385, 708277, 444752, 543170, 573153, 547688, 392131, 145515, 199635, 395556, 329505, 546465, 306934, 198726, 488726, 587028, 507157, 399005, 621700, 219803, 243289, 395192, 223039, 299295, 537910, 572181, 354152, 232188, 500588, 274420, 642785, 137351, 407579, 454409, 279222, 314292, 441667, 456260, 599812, 351571, 286293, 506977, 219403, 226789, 500156, 529978, 450379, 61746, 709736, 101512]
13624C84492L66592B80582K58752j67360K10481I3643M68552B34314K26203k20458
13614B40059K18701Q2122J81833l57492r7075j5856n9112J11349J09943J44829
13604E59301k75137K22958j67153Q1846O8246P508R0852B11550R1551M2508m0859
13593C04750J79170A99265J05816m9167o7144J08655m8156F3167N01790j88987
13583C75970j05843a70675C76964l5652K24839B53075l6061L05437j7746r8530
13573D06175K94440k67559A27961K49673G9321J40361K05202Q1234j72762p1424
13563B61932P3530J55338j61151J87223J011k27096J73280j06552n3247O0062
13553C64330A35168J67404j6205K91912I2751N42803E9879L84862M782B05002
$$ y = [384492, 751084, 280582, 539334, 371974, 582455, 93643, 562195, 234314, 460517, 240059, 458760, 540882, 722715, 365223, 268148, 252292, 193180, 304529, 414472, 559301, 284164, 507122, 339969, 421815, 490061, 497569, 588421, 211550, 303101, 345609, 304750, 483920, 199265, 305081, 255914, 188770, 297425, 249269, 63167, 564957, 375970, 270127, -170675, 376964, 341312, 566151, 253075, 217014, 522451, 504705, 406175, 700615, 433056, 127961, 377634, 79321, 219682, 424884, 506118, 333356, 261932, 335462, 490800, 329649, 516872, 517883, 290787, 464067, 357515, 304268, 364330, 135168, 302572, 286367, 578279, 92751, 635554, 59879, 444741, 449523, 205002]
13542E11120A85104q9383K17872J71724p5226N4929f042A63102J01915j00435
13532A64582J01360J81061j44108a94926G63135B02743I231P719K12858j06554
13522A23254K72475k9877P1400J14839b4085B81622K27640A76178J87951J6411
13512C80540o1315d8222A61416K31658n2748N4571P1307j55117L9277L48828C00449
13500A82594J08H5152L67625k14451J04006R1864r769G8188j5002N34979q5221
13489E12944k04322I4771L0096J13280b7080D40732C4391K72449r002b58384B03753
13477A45722L0423l1725K91531d6243A17749c1191D70725B10860P4525J71014
13467D56399A55003K52386I8167L0412O6475L054H1790K51375C2645Q259L81344
$$ y = [511120, 185104, 95721, 313593, 485317, 410091, 465020, -6042, 163102, 265017, 164582, 265942, 447003, 302895, -194926, 763135, 202743, 9231, 16950, 229808, 123254, 395729, 365852, 437252, 552091, -24085, 281622, 509262, 176178, 364129, 380540, 319225, -48222, 161416, 393074, 340326, 394897, 466204, 311087, 350364, 699192, 300449, 182594, 182702, 85152, 452777, 238326, 342332, 434196, 424427, 78188, 63186, 598165, 512944, 308622, 94771, 124867, 238147, -27080, 440732, 34391, 306840, 297838, -258384, 203753, 145722, 176145, 144420, 435951, -46243, 117749, -31191, 470725, 210860, 285385, 456399, 155003, 407389, 98167, 128579, 195054, 198108, 81790, 333165, 32645, 40904, 422248]
13456D22248n3613H9916J53143M0944j846B3182L13869I8531l2394J5567a7137
13444A15229M1384Q6400k8192I4786a56505B89316b2908A31425L9058J25104A05304
13432a91720D19799A95395K6054n0210O6853p4691K58011k5662j16156b41895
13421I456K97035A47655m0393K22369k1693A25767e2088A28137q953r636f723
13409c18392B03393J6883L479b67098D6026Q822J3151J1375J30521E5862K92069
13398C47931q0273o7713E9728L21209J5842o0746D3806J99949F328O5464j5157
13387E6635N8270K25289N8402a54308B16702J27359j25915A08056A0925Q7756
13377I8681K03437H3329a303A6202a51674B99978H633J83769J19890j12832K493
$$ y = [422248, 368635, 89916, 243059, 284003, 282157, 23182, 337051, 98531, 66137, 81704, -17137, 115229, 156613, 243013, 214821, 94786, -156505, 289316, -22908, 131425, 170483, 295587, 105304, -191720, 419799, 195395, 221449, 171239, 238092, 163401, 421412, 395750, 279594, -241895, 9456, 306491, 147655, 107262, 329631, 307938, 125767, -52088, 128137, 119184, 109548, -6723, -318392, 203393, 220276, 223755, -267098, 46026, 54848, 67999, 79374, 209895, 55862, 347931, 267658, 199945, 59728, 380937, 396779, 336033, 43806, 243755, 6328, 71792, 56635, 114905, 340194, 398596, -154308, 216702, 344061, 218146, 108056, 10925, 98681, 302118, 83329, -1303, 16202, -151674, 299978, 8633, 192402, 312292, 199460, 201953]
13366B01953k2483a81120C29892G3480L2078J73831H5567h9805E7185J38860q3529
13355A12516A5921c7377C01925K13154A99497P2666E9902a8332A86919j6439b09974
13343I6210B0157R7252B6131K5894A8226J7252K49200A37124J67118i15C65209
13331C68114j9729I5226k6880L51769q7685j1861o6825a34630C08710F7651P2388
13320A40039B4496L56359A01541a7355B11939J21354J27145F2574a05914A00628
13309C71762m6227L7248A77480K42781c544A45906F5305a51462f751B51222l1004
13298B20218k1012R7700M7145A11842P966J36245C847K91220G9194J21689F0282
13286A89718F1080J75360b5333B43188r0469J04606j19805a43459D10041o9961
$$ y = [201953, 179470, -181120, 329892, 73480, 105558, 279389, 85567, -89805, 57185, 196045, 112516, 15921, -37377, 301925, 515079, 199497, 272163, 59902, -18332, 186919, 170480, -209974, 96210, 20157, 117409, 26131, 52025, 18226, 35478, 284678, 137124, 304242, -915, 365209, 368114, 348385, 95226, 68346, 420115, 332430, 320569, 253744, -134630, 308710, 67651, 140039, 24496, 380855, 101541, -17355, 211939, 333293, 460438, 62574, -105914, 100628, 371762, 325535, 362783, 177480, 420261, -3544, 145906, 65305, -151462, -6751, 251222, 220218, 199206, 296906, 344051, 111842, 119808, 256053, 3847, 295067, 79194, 200883, 60282, 189718, 61080, 236440, -25333, 243188, 152719, 257325, 137520, -143459, 410041, 340080]
13276C40080J22277A97618B9014J68807I7481M9364o7724i6910A49140j8901P6954
13265B07193C9190J89636a8556D01964F1361e5071b0342B9889b9374D09057j70150
13254B38907c6059H5482a81415Q9995B69594n723o8953H8355K93980f8853B61116
13242B73296g9725j8670n9841A63811a66855k8620E6084L67229A26198b00825
13231B5455b05876A60719b5101j7492A43578K218J87023b00068G3603c9489C65855
13219c8319M758B02576q4966l4817B5437K33427j26327a15397H8005f4150C08695
13207C0414J01451j485Q9760A2613K07450j09595b6912C91188A7502a86640I9104
13195B36949l7478a8767A28796A0916b7975F206k773a2328G9734f0462A39670
$$ y = [340080, 462357, 197618, 29014, 197821, 97481, 146845, 79121, -96910, 149140, 130239, 207193, 39190, 228826, -18556, 401964, 61361, -55071, -20342, 29889, -29374, 409057, 238907, -36059, 85482, -181415, -91420, 269594, 263871, 194918, 88355, 382335, -68853, 261116, 273296, -79725, -98395, -158236, 163811, -166855, -195475, 56084, 423313, 126198, -200825, 25455, -205876, 160719, -25101, -42593, 143578, 145796, 332819, -200068, 73603, -39489, 365855, -38319, -33561, 202576, 117610, 82793, 25437, 258864, 132537, -115397, 88005, -64150, 308695, 30414, 131865, 130380, 220140, 12613, 220063, 110468, -26912, 391188, 17502, -186640, 99104, 236949, 199471, -18767, 128796, 10916, -27975, 6206, 3433, -12328, 79734, -60462, 139670]
13183b4635A62935E7262K10395L37171a88796N1544H2615K53468l7056e0068H5187
13171g4859A23422o1468e471H5029e3667G3449A8732J11110b00885A35152d2747
13159E6100a41557H0780J22330j4236k7164g7593A41815J5736J9196l3724E4831
13147b3449C29186b7419q8543B455O0409J56427J2421c91402K0765B14781k2667
13136A92114J62032j40464q7430f1117G4067f8282A73637c3866A13318a18253
13125b33630h9319B97066O4031A32237B9954J71400e0681B08225C6645O1261j4219
13114H3687l7433J929b1013F2445M5147a77888A68984p7160c3588A07440D9909
13102E0897c0863A82917m7465O0847m4315c0603C75228d9360A77338f8115B04605
$$ y = [-24635, 162935, 57262, 267657, 604828, -188796, -137252, 82615, 336083, 299027, -50068, 85187, -74859, 123422, 61954, -5471, 85029, -53667, 73449, 18732, 129842, -200885, 135152, -42747, 56100, -141557, 80780, 203110, 188874, 161710, -77593, 141815, 157551, 176747, 143023, 54831, -23449, 329186, -27419, -115962, 2455, 62864, 219291, 231712, -391402, -370637, 214781, 192114, 354146, 213682, 126252, -61117, 74067, -68282, 173637, -33866, 113318, -118253, -233630, -89319, 297066, 361097, 132237, 29954, 201354, -50681, 208225, 36645, 97906, 83687, 46254, 48183, -21013, 62445, 107592, -177888, 168984, 91824, -33588, 107440, 49909, 50897, -30863, 182917, 135452, 196299, 151984, -30603, 375228, -49360, 177338, -68115, 204605]
13090f8086A68121C9094K0803b19719A20436i754j07731C2890K31359d0597B98830
13078a09527j85106i9249F69a5835B08017R1567A34989F6958k4448J03952F214
13066i2081K5636A77830b71046a19761d7261k3180B97396l9562m3860D4020M9514
13055I3534M1769P0703h0088C22495E3654b15708B70425j13502A0786R374i2313
13043a33694q569E22202k10911H7928K00284A06072b6038F0588c1583A43405J13004
13032B56409q4436h5976C03223b8717j0576I5192J73595l5211b3615H9716K5620
13021A15336J40744C7246J84294P0707b9241q2263G7604a28621A44073G1984K97132
13010C69116r7349A24939L3850J87350f7547A27738E3522J21565M3923f2418L734
$$ y = [-68086, 168121, 39094, 59897, -219719, 120436, -9754, -117485, 32890, 264249, -40597, 298830, -109527, -294633, -99249, 669, -15835, 208017, 299584, 134989, 66958, 42510, 146462, 6214, -92081, -66445, 177830, -271046, -119761, -47261, -70441, 297396, 257834, 213974, 44020, 93534, 135303, 206006, -80088, 322495, 53654, -215708, 270425, 156923, 10786, 20160, -92313, -133694, -142263, 522202, 311291, 87928, 288212, 106072, -26038, 60588, -31583, 143405, 256409, 171973, -85976, 303223, -28717, -39293, 95192, 268787, 233576, -23615, 89716, 115336, 256080, 37246, 221540, 292247, -29241, -111504, 77604, -128621, 144073, 71984, 369116, 271767, 124939, 158789, 346139, -67547, 127738, 53522, 175087, 219010, -62418, -58684]
12999e8684A67492l0993a02212L1389B13770c43469I9092l6573R1465A0784J61282
12988A72066d0310k4648A12694b24302B54488j9516A05631a79375B18501H8706
12977h8020F841N2947b18234d1217D00366q5019r6993a28202A8505J266J09536
12966A29307A3670K33537O1338A05935a45459d6790A1209K07053c64623B14621
12955C30017a313j08738m417l9523A90054m8122m498K1148A9672M7957g1968j6708
12943h8676B43939G2590l1865J55414J97237a78277C51574i380j74909G0238k9426
12932D0812P6778d9717C16717E5663c4363G4125O9189a28465N1849G9160b30299
12920C03816a18399C62988a35259k08418b6583l22757g801A24004C1617h2107
$$ y = [-58684, 167492, 136499, -102212, -70823, 213770, -343469, 99092, 62519, 153984, 10784, 172066, -40310, -64958, 112694, -224302, 254488, 234972, 105631, -179375, 218501, 88706, -88020, 6841, 59788, -218234, -41217, 400366, 315347, 218354, -128202, 18505, 19771, 129307, 13670, 247207, 308545, 105935, -145459, -46790, 11209, 218262, -364623, 214621, 330017, -1313, -110051, -114468, -153991, 190054, 141932, 137434, 158582, 19672, 67629, -71968, -88676, 243939, 72590, 40725, 196139, 393376, -178277, 351574, -9380, -184289, 70238, 40812, 117590, -49717, 316717, 55663, -34363, 74125, 143314, -128465, -76616, 79160, -230299, 303816, -118399, 362988, -135259, -343677, -26583, -349340, -7801, 124004, 31617, -82107]
12909A59742h5620m18j6525k65999G7104A1526P3434b78032P9513i3068A50094
12897c2785F0521f689k16127A91289b9433j22067b2542r0769b3375A27368J11453
12886B38821a41459B24663K45461h3134G4301P9724a45961D7426b18k572B25939
12874A55856K7700J6474r7719q123b82139m6054A21586a3455A16738P879J32912
12863B57529a99392J4095C38380a55758k40180A34953A103J65974i7165j96356
12853b93521B62200O1496B2310c885k05476f5535L1206a867l41541A25059c2946
12841D17910A59438a040C41148N4290L524A05142K04508A771P9186a04717r0807
12830a95524A31849A0551a77381j18159b5971A11381J04688K6735h9275a6765
$$ y = [159742, -85620, -86038, -102563, -368562, 77104, 11526, 84960, -278032, -198519, -93068, 150094, -32785, 60521, -6689, -222816, 191289, -29433, -151500, -22542, -113311, -23375, 127368, 238821, -141459, 224663, 470124, -83134, 74301, 154025, -145961, 47426, -218, -2790, 225939, 155856, 183556, 200030, 102311, 94188, -282139, -328193, 121586, -13455, 116738, 124617, 257529, -199392, -185297, 338380, -155758, -395938, 134953, 1103, 167077, -97165, -293521, 262200, 323696, 22310, -3885, -209361, -65535, -34329, -1867, -343408, 125059, -32946, 417910, 159438, -1040, 341148, 395438, 398962, 105142, 309650, 1771, 80957, -104717, -195524, 131849, 10551, -177381, -295540, -25971, 111381, 216069, 242804, -89275, -16765]
12819f1355r7183I9419R8293a16348k44614B76375f235q4588m3150A51192b16284
12807B75200b09378A2100P4438a38184A7530L299a9424A28983i895p4746j93475
12796b78116K4520A24095l5887N7945F4585c28618J08977B30931b27731E0367
12785f0236k3822m7383H4145Q3837p5631a50237i135j17688B38133a77086A52133
12773H1228R1252a41693d8616A28303J24948l8260l7643F6054H088e6851B4849
12761A72502b65712H6190A2258i0371B06247a23765j14708H7117a24941A32695
12750C75178a17878A10691b2047I4111k3142K6893a50520A20056h1930A0729J59232
12739A69961g8785D7533a8990C5038R8552h4729A77203m2838A3762K00294a36621
$$ y = [-61355, -158538, 99419, 197712, -116348, -360962, 276375, -6235, -90823, -133973, 151192, -216284, 275200, -209378, 12100, 86538, -138184, 17530, 20829, -19424, 128983, -9895, -84641, -278116, -253596, 124095, 88208, 146153, 64585, -328618, -219641, 230931, -227731, 50367, -60236, -84058, -131441, 84145, 167982, 92351, -150237, -9135, -126823, 238133, -177086, 152133, 81228, 172480, -141693, -48616, 128303, 253251, 214991, 177348, 66054, 8088, -56851, 24849, 172502, -265712, 86190, 12258, -90371, 206247, -123765, -238473, 87117, -124941, 132695, 375178, -117878, 110691, -22047, 94111, 70969, 97862, -150520, 120056, -81930, 10729, 169961, -78785, 47533, -18990, 35038, 133590, -84729, 177203, 134365, 13762, 214056, -136621]
12727d7798A63528A6755b87955J02117A59027N0602J35966f3084A01476K10200
12717C11676F8172i7757C23693f2392I0030L5779d8287k74271g3808A0024K03703
12706B13727P6126f9255B52051j08444c3406A24019D8045C534d8563A09162g3949
12694C46457M6129A7529K54034J25709O7785E219L4779a68553E3509O1324c04852
12682A33346g0971J6494l79678G9841K67340A70180G0778J1558J0883i5841j1544
12671a07385c204p2361a3503k00503L6552A25234n5304a62105c4703j70795I234
12659C69390A43088p1442g7498p3062A1894i307j03219d1772m2636j61984B96801
12647A32306a713B59716D7322G33K21683q7403d5257D05060A57818D5427o63J9495
$$ y = [-47798, 163528, 16755, -287955, -185838, 159027, 209629, 345595, -63084, 101476, 311676, 68172, -97757, 323693, -62392, 90030, 125809, -48287, -322558, -73808, 10024, 213727, 289853, -69255, 252051, 143607, -33406, 124019, 48045, 3534, -48563, 109162, -73949, 346457, 392586, 17529, 271563, 397272, 465057, 5219, 39998, -168553, 53509, 114833, -304852, 133346, -70971, -54477, -434155, 79841, 347181, 170180, 70778, 82336, 93219, -95841, -107385, -3204, -75565, -13503, -214006, -177454, 125234, 69930, -162105, -34703, -205498, 9234, 369390, 143088, 71646, -77498, -150560, 11894, -9307, -112526, -41772, -84408, -246392, 296801, 132306, -1713, 259716, 47322, 733, 222416, 135013, -45257, 405060, 157818, 45427, 44764, 64259]
12635F4259p277a17287j26501f218B23726a9664B13787b3927F9512i9711E0115
12623D0951b4900I6739P9487o6987O2999Q8197h5711D01455A76607M3313r2276
12612A27644K41365O170A74288q3782K00092A9061J17533b44642C88372A29090
12601b8300B51871c4494j97220A29878a03233B00362e2234A5871E62L7294K05460
12590B43316a77514d9725A50090N2784M3752b16514g1767J7093B01522p0458d3834
12578b21331F4946a24456d5711j85807b0205B14572a3522E314b5032B5513b34312
12566D715b03715B05648M8456b12509A21612f7484j01371F3435A0620Q2601k1517
12555G1704K57326Q3797I1894c70735a79574A88092D4404a01379J9445B70863
$$ y = [64259, 56982, -117287, -243788, -6218, 223726, -19664, 213787, -23927, 69512, -99711, 50115, 40951, -24900, 96739, 176226, 109239, 172238, 260435, -85711, 401455, 176607, 219920, 127644, 369009, 375179, 174288, 90506, 290598, 19061, 136594, -244642, 388372, 129090, -28300, 251871, -34494, -231714, 129878, -103233, 200362, -52234, 15871, 562, 37856, 243316, -177514, -49725, 150090, 202874, 246626, -216514, -71767, -54674, 201522, 131064, -43834, -221331, 64946, -124456, -45711, -231518, -20205, 214572, -13522, 5314, -25032, 25513, -234312, 4715, -203715, 205648, 254104, -212509, 121612, -67484, -168855, 63435, 10620, 93221, 71704, 329030, 412827, 91894, -370735, -179574, 188092, 44404, -101379, -81934, 270863]
12544B82959l9937A9091J69448a07355B59949G5397e945C53707b65051E2988a56994
12532a33424M5630E6260O5164d4260k50684g9671m7558B25244E3553a25919B76031
12520A70888a14455e4741C8208e5738k62080g3791F7894K71630j23846C1464b89049
12508d05017B378b18282A22875a79872j20344a552j02438K396o9251A11791b3981
12496B27515g0438D8750N6316D5344a22510F4424c94856i420o4588A10046P4415
12485A84461F2483c6369j07052O6298A32598J65686c21620e0164K4777A55622
12474i222B35606L45879a53462A74800E6581F907d07238a07852P68A02475a71991
12462b36323j0286A43891D7788c26650F0788a11211K3460A41393a13979J2753
$$ y = [282959, 243022, 19091, 188539, -107355, 259949, 75397, -5945, 353707, -265051, 52988, -156994, -133424, -87794, 56260, 121424, -44260, -294944, -79671, -127229, 225244, 53553, -125919, 276031, 170888, -114455, -54741, 38208, -55738, -317818, -73791, 67894, 339524, 215678, 31464, -289049, -405017, 2378, -218282, 122875, -179872, -300216, -1552, -103990, -101594, -170845, 111791, -23981, 227515, -70438, 48750, 105066, 45344, -122510, 64424, -394856, -9420, -74008, 110046, 184461, 62483, -36369, -143421, -77123, 132598, 298284, -321620, -50164, -25387, 155622, -9222, 235606, 581485, -153462, 174800, 56581, 6907, -407238, -107852, -107084, 102475, -171991, -236323, -246609, 143891, 47788, -326650, 60788, -111211, -87751, 141393, -113979, -101226]
12452a01226j58133g0351n7681J5430A70943a70503F8639b20541I5988a04270
12441b62647J13067A25954D9656e8866A00753C4021K46208a8216j42420f3074
12430a9180A77812L621D8347L3299P3572a60493g7135K3823I1999A9692i6761
12418E1425L4848b4507j05652A67795d720A86208h548m5022A5174L6725R7217
12407A49116m9824b02570e9873k50388B57767g1999j80315C4333K22611J60169
12397D17113b90350f771j88796E06862d9037a9982k2871j04093b0563C1605a5222
12385f9085B30577C6314a57469C8987c2424E2826J8945h7870B1284c4455J6272
12374a8183k79878A37700n1831b06824A70481G0605a92853P0403j24317B93183
$$ y = [-101226, -259359, -70351, -128032, -112602, 170943, -170503, 68639, -220541, 95988, -104270, -262647, -149580, 125954, 49656, -58866, 100753, 34021, 280229, -18216, -160636, -63074, -19180, 177812, 181433, 48347, 81646, 155218, -160493, -77135, -53312, 91999, 19692, -96761, 51425, 86273, -24507, -130159, 167795, -4720, 186208, -8548, -53570, 15174, 51899, 149116, 99292, -202570, -59873, -310261, 257767, -71999, -252314, 34333, 256944, 417113, -290350, -6771, -195567, 506862, -49037, -19982, -42853, -146946, -20563, 31605, -15222, -69085, 230577, 36314, -157469, 38987, -32424, 52826, 71771, -87870, 21284, -34455, -18183, -298061, 137700, 85869, -206824, 170481, 70605, -192853, -122450, -246767, 293183]
12363A74916m8282l2567K7994n0618e0764C7014f5300k62214c6507C1315b6623
12351A92897h5966C43348r8800b6462O095k6153L513B60791b7430m37302d7895
12339C6899J38605i1912M4041D8505J38572J68545k4860G365a16585L1105I496
12327g0334K4376B33037d7436k4534g184F7370j6787N3626B5704g4045B6244b8397
12314e5553B35863d90588F5366K82206J2887A23734M5452G9459b9052C04905a9164
12302A63535h6870B86204C309K30768b31046g5865A28920e0903j33030M6726A14330
12290d6772o300J4050B1093a67910C047a65384m6077A03957l4825b5201k09358
12279b34559O6540L4238F1948J03260C8252J87603c0065k43168A91807p3044j5923
$$ y = [174916, 126634, 94067, 122061, 71443, -50764, 37014, -65300, -327514, -36507, 31315, -26623, 192897, -85966, 343348, 244548, -26462, -20367, -46520, -43007, 260791, -27430, -464732, -47895, 36899, 175504, -91912, -47871, 48505, 187077, 355622, 330762, 7365, -116585, -85480, 9496, -70334, -45958, 233037, -47436, -71970, -7184, 67370, 50583, 104209, 25704, -74045, 26244, -28397, -55553, 235863, -490588, 65366, 347572, 360459, 123734, 169186, 79459, -29052, 304905, -19164, 163535, -86870, 286204, 3309, 234077, -231046, -75865, 128920, -50903, -183933, -137207, 114330, -46772, -53072, -39022, 21093, -167910, 3047, -165384, -211461, 103957, 69132, -25201, -234559, -168019, -133781, 61948, 165208, 38252, 225855, -30065, -273233, 191807, 118763, 102840]
12268A02840D7781h0537B24109a16590B88157A30002e8397q6014d3405a1676A19144
12256A53598N9501J18881p6338A1708a1521C85720H8469J16044J14314N5731a06988
12244I0368J34265a11867M6907l3989A17681J09959A06698f13j70613B48958M5923
12233B94881q534a18479B72024C5323a28955E005J16555j397l7199J26379b55998
12221g8750J6955B30467A06160A8382J54263D5510H257J22559R5666q8206j7417
12210A20859j6006K09877a89480I0694J1381K27435j42418B0731J87613P136F1616
12198I4001O2376Q5538A11631d8766k79863B98463G7174e0745D8538J52371J94811
12187C95720D6682N1675k4826L69103F4796K87801I2750R0216m9260b2083A84596
$$ y = [102840, 47781, -80537, 224109, -116590, 288157, 130002, -58397, -144411, -43405, -11676, 119144, 153598, 213099, 331980, 255642, 11708, -11521, 385720, 88469, 204513, 318827, 374558, -106988, 90368, 224633, -111867, -64960, -98949, 117681, 227640, 106698, -613, -171226, 248958, 294881, 286347, -118479, 272024, 35323, -128955, 5005, 121560, 120163, 82964, 209343, -255998, -78750, -61795, 230467, 106160, 18382, 172645, 45510, 8257, 130816, 226482, 138276, 120859, 104853, 314730, -189480, 90694, 102075, 329510, 187092, 20731, 208344, 215480, 61616, 94001, 156377, 241915, 111631, -48766, -328629, 298463, 77174, -50745, 48538, 200909, 395720, 46682, 98357, 73531, 442634, 64796, 352597, 92750, 182966, 133706, -22083, 184596]
12175A65927K98085a42407C85506r1719j4231A00610a13552B6193J74922A5348
12164A82250J46249h2085I3124K60246m8709j23033P2563a51295A69095L75051
12154E44146a43484O9391B5531b17594A38563K80954D5746K56125j2702d8378
12143a63197B15436q3297J65888m8848a64543b2266B02573a38659j83468A94825
12132A09946a874l538A78144a10957F7393J10541g773j8631A92954K6103G9562
12120A13458l6399B2273J03958k1389a15111I7766c8592J5191A32465B9065J30171
12109A59236D085K7671K05997h5774C47083b3271Q643F0538P6167E8994a77411
12097B72101B2771e8781j70642A18337n6568a42857e7419B37560a57730A10165
$$ y = [165927, 464012, -142407, 385506, 293787, 279556, 100610, -113552, 26193, 201115, 15348, 182250, 328499, -82085, 93124, 353370, 304661, 181628, 254191, -151295, 169095, 544146, -143484, -74093, 25531, -217594, 138563, 419517, 45746, 301871, 289169, -48378, -163197, 215436, 132139, 298027, 249179, -164543, -22266, 202573, -138659, -322127, 194825, 109946, -1874, -5412, 178144, -110957, 67393, 177934, -7773, -26404, 192954, 219057, 79562, 113458, 77059, 22273, 126231, 104842, -115111, 97766, -38592, -23401, 132465, 29065, 159236, 4085, 31756, 237753, -85774, 347083, -23271, -14628, 60538, 136705, 58994, -177411, 272101, 22771, -58781, -229423, 118337, 61769, -142857, -57419, 237560, -157730, 110165]
12086B1525L1722b83478J30773D5099q192K7748J43590h3583B24794J06378c625
12074e1453J3536p837E2807O1629E97J61117K3378R7053b04100I2187N15562O85441
12062A293190m96443l23838m5837j58791i2114J2593B81371C1667e6336j00647
12052a56983A58652o8154N7941d208G5291J356K05497n5846O1311a91901G5210
12040E2002B1196J07939b84611B09075a5851F9414N37544f3353q128D6873J70859
12029B17732g7017H210a39210p6811j74954d4980l34614A99110J90201c2316E4063
12017D6112J84574b11893B66770j24486k8601a45201A74139a09017P695A49653
12006i5041J3777j03233A10119b14841A06166a56527G7543a0504k01250a02003
$$ y = [21525, 53247, -283478, -152705, 45099, 36907, 64655, 208245, -83583, 224794, 331172, -3625, -51453, -37917, -45754, 52807, 114436, 597, 161714, 185092, 282145, -204100, 92187, 607749, 1293190, 796747, 472909, 427072, 268281, -92114, -79521, 281371, 31667, -56336, -156983, 158652, 90498, 148439, -4208, 75291, 76647, 282144, 226298, 287609, -191901, 75210, 52002, 21196, 129135, -284611, 209075, -15851, 69414, 606958, -63353, -71481, 46873, 217732, -77017, 8210, -139210, -216021, -390975, -44980, -379594, 199110, 389311, -32316, 54063, 46112, 230686, -211893, 266770, 142284, 113683, -145201, 174139, -109017, -101322, 149653, -95041, -81264, -184497, 110119, -214841, 106166, -156527, 77543, -10504, -211754, -102003]
11995f0118D51979I8929B8894c1486r5824C19369h2651E9390b18392Q3549B56023
11983c80151H405a29026I7306c26753A332c08751F5913b16598a0552B4907i544
11971A8255h4885A76454a83602g2045A83068H9487a12102k0256A39323b91850
11960H4992B2775K45841b95576A40289D5739c23151a38848l05876B9044Q8352
11950A17396b0837A48967D7588c03757d9659j25136p4513A88979i1132j69604
11940b60736j48042h3907b9516G3834J81430i1791j41888A67419O1067b670j52037
11929a54707C3539K03495d4344K786m1213m9039G379a34123B55490H6238c9404
11917c55453A80083m9090a10665M6617B93627a08975A47477a82948A6096a7001
$$ y = [-60118, 451979, 98929, 28894, -31486, -127310, 319369, -82651, 59390, -218392, -134843, 256023, -380151, 8405, -129026, 97306, -326753, 1332, -308751, 65913, -216598, -10552, 24907, -9544, 18255, -84885, 176454, -183602, -72045, 183068, 89487, -112102, -132358, 139323, -291850, 84992, 22775, 268616, -295576, 140289, 45739, -323151, -138848, -444724, 29044, 117396, -20837, 148967, 47588, -303757, -49659, -174795, -249308, 188979, -91132, -260736, -408778, -83907, -29516, 73834, 255264, -91791, -233679, 167419, 228486, -2670, -154707, 33539, 237034, -44344, -41558, -82771, -131810, 7379, -134123, 255490, 86238, -39404, -355453, 180083, 130993, -110665, -64048, 293627, -108975, 147477, -182948, 16096, -17001]
11906A49759E1071d3291j31150A13020a6803k8611C7417L0984Q9618G7974k4776
11895E3198a74182K2013G810b32394Q9674d342G6729L8797e6004A58548g2287
11883A49213E6429Q4294a11259c458F6480b26527J10063a3983I2492f7090k31288
11872b98378C09336A25696J3066F6753l784e8577j9741a0160B13501r208c80601
11860b9114G0498J48237p4449a91001A70551L8184b65039I7624d5633k19265E1166
11848B975b60420h0003j06059M7684I370K21376a49832k05577i6331A47694p601
11837A40093a19980A40094c30384E48287a08545E3621J42787a84874j65502K6416
11827c23960B8205b002B1323c46629a68777H384N5042b2930k73114b3172j05582
$$ y = [149759, 51071, -43291, -174441, 113020, -16803, -45414, 37417, 68401, 158019, 77974, 53198, -174182, -152169, 7810, -232394, -142720, -4342, 76729, 115526, -56004, 158548, -72287, 149213, 56429, 140723, -111259, -3458, 66480, -226527, -116464, -13983, 92492, -67090, -298378, 309336, 125696, 138762, 66753, 62969, -58577, -78318, -10160, 213501, 204293, -380601, -29114, 70498, 218735, 144286, -191001, 170551, 208735, -265039, 97624, -45633, -264898, 51166, 2975, -260420, -80003, -186062, -138378, 9370, 230746, -149832, -355409, -96331, 147694, 140093, -119980, 140094, -330384, 548287, -108545, 53621, 196408, -184874, -350376, -323960, 28205, -2002, 21323, -346629, -168777, 8384, 63426, -22930, -296044, -23172, -128754]
11816a28754N2192K8127C26474A56646c27860A70112c51357J9497I0064R4347
11806A84411a17642A40815o0943l9460j2437b55578E2005j3174a25410m8348e8039
11794h5647c2153r2442A51441a11382J7193A27876a85001d147B92022a08967k16671
11783c25638A56043a50926A45123b04682E7812B1454e8205L809l09985J68535
11773a95846g3321k78943a11076a9106A00365N3576b32269A96710a71963H4642
11762a08497c234B26149i3346A28354c26046O6617A88468b01653A45242K5583
11752A70825c21634B329P4072R1758c8359e860j4535E6503d47714b07889B47095
11740F5704d8634H8900K14438K4207a68346f0958n5938k6970E0173b67504A67359
$$ y = [-128754, -76562, -48435, 326474, 156646, -327860, 170112, -351357, -331860, 90064, 184411, -117642, 140815, 79872, 40412, 27975, -255578, 52005, 38831, -125410, -173758, -58039, -85647, -32153, -124595, 151441, -111382, -94189, 127876, -185001, -4147, 292022, -108967, -325638, 156043, -150926, 145123, -204682, 57812, 21454, -58205, -54396, -364381, -195846, -73321, -352264, -111076, -19106, 100365, 153941, -232269, 196710, -171963, 84642, -108497, -3234, 226149, -93346, 128354, -326046, -259429, 188468, -201653, 145242, 170825, -321634, 2329, 76401, 168159, -38359, -5860, -20395, 56503, -447714, -207889, 247095, 65704, -48634, 88900, 303338, 327545, -168346, -60958, -116896, -143866, 50173, -267504, 167359]
11728A06943d48367B21044b23093H2599k7262L26256b10264b4132A61614l2891
11718A28723J462h6432o3062B13199J7377B4254M0893b47623N5393A37125J31169
11707B68294I650K65782j07915b47638F3273A5320L71287A5264a80356B0346e9318
11695a16027B85303p5136a34803f4696K0179k48361g3447a4861B23865K72739
11685D96604A63326a02094q7814A65340b61099h7699j8548j72414B41839f2354
11674A63498F3196o055d2829j31033F4565b62870R6625B06592j9757L1234g6703
11662A67688b578A41641a78634D9817J50308J63065C7777J22770b60415I099h9223
11650b9521D36539i962r1155A6132a45604j35414d7842j97889a13839j58316A13373
$$ y = [106943, -448367, 221044, -223093, 82599, 55337, 381593, -210264, -24132, 161614, 128723, 130185, -86432, -149494, 213199, 230576, 24254, 65147, -247623, -192230, 137125, 268294, 9650, 275432, 167517, -247638, 63273, 15320, 386607, 15264, -180356, 20346, -59318, -116027, 285303, 210167, -134803, -64696, -44517, -292878, -73447, -14861, 223865, 496604, 163326, -102094, -189908, 165340, -261099, -87699, -106247, -278661, 241839, -62354, 163498, 63196, 57141, -42829, -173862, 64565, -262870, -166245, 206592, 186835, 218069, -76703, 167688, -2578, 141641, -178634, 49817, 200125, 363190, 37777, 160547, -260415, 9099, -89223, -29521, 436539, -9962, -101117, 16132, -145604, -281018, -47842, -245731, -113839, -272155, 113373]
11638A16574L07402C0514g3095l5540k53404J47654B12605p820E366b01333B27419
11626a10802J0458B46940A03443b19810F5057c00756a1152j68315b3366k42131
11616b65497I5260A6177J34190L9708a86875B23335b15792C70017p8998e9434
11605B4238K69003A3013g8143o728c6133E2951L6648j1948c13694d3959p3208
11594a17167B19813K6007a60358C06903g2745I9952b65536E8159a53848A83383
11583H9645i8517k7503A55494a5303A54875g7581A8238K05407A07836a65491D9750
11571c0630A78411C4097a5524A58307J85526J5202F5689O8335d1513C32354e3033
11559G8633K34279a74634i400B81319a56919A14886a0197A06904P4957P6175k487
$$ y = [116574, 423976, 30514, -73095, -108635, -362039, -214385, 212605, 204785, 5366, -201333, 227419, -110802, -100344, 246940, 103443, -219810, 65057, -300756, -11152, -179467, -23366, -265497, 95260, 16177, 150367, 190075, -186875, 223335, -215792, 370017, 291019, -59434, 24238, 293241, 13013, -78143, -84871, -36133, 52951, 89599, 77651, -313694, -43959, -117167, 219813, 245820, -160358, 306903, -72745, 99952, -265536, 58159, -153848, 183383, 89645, -98517, -126020, 155494, -15303, 154875, -77581, 18238, 223645, 107836, -165491, 49750, -30630, 178411, 34097, -15524, 158307, 343833, 359035, 65689, 134024, -41513, 332354, -53033, 78633, 312912, -174634, -9400, 281319, -156919, 114886, -10197, 106904, 181861, 258036, 255549]
11548B55549B9380Q1141N6617J66274a24070D1240a42601E6368Q218B7139e599
11536I2732J5408b51432O536B15656a43521A2657b642j40121F0797a12676G2632
11524g7851A17970i7168j32586A22508J06854r9856a78061A94852M4609N5135
11514B94596D2599K68237o6817O1694a02266B1181e1082p1727B08416a58946d882
11502D7606a7774f152A55877a67287A23740K56407j88152H098M52317e0423B30705
11490a01180e143G7385O3203J51989d05068g3212B36669a17216B87258j03338
11480A83920R2642e4978B52166q0218H3428a92481A08347J4710C750J1799K91356
11469C06905g8574k0163C17760j22657o7808l5564b16319J06935C07979a18647
$$ y = [255549, 29380, 110521, 167138, 333412, -124070, 41240, -142601, 56368, 64586, 27139, -5599, 92732, 108140, -251432, -244896, 215656, -143521, 12657, -2642, -142763, 60797, -112676, 72632, -77851, 117970, -97168, -229754, 122508, 229362, 129506, -178061, 194852, 239461, 294596, 42599, 310836, 244019, 305713, -102266, 21181, -51082, -122809, 208416, -158946, -4882, 47606, -17774, -6152, 155877, -167287, 123740, 380147, 191995, 8098, 460415, -50423, 230705, -101180, -5143, 77385, 140588, 292577, -405068, -73212, 236669, -117216, 287258, 183920, 276562, -54978, 252166, 171948, 83428, -192481, 108347, 123057, 3750, 15549, 306905, -78574, -98737, 317760, 195103, 127295, 91731, -216319, -109384, 307979, -118647]
11458B73842k1231A11434J23870o3201J7129G0628Q1712J30853F0892K29028a59068
11446a37568J8544A02375l9513a78717B437L72401j58378r8151a3844F3674a03446
11434B06815j5569q9697a46451B22125B7900K62495i6183B1849J13796B9463D555
11422A47270l6503J6851a58672O8385C3320d9147k8214A46280q631C1949N5918
11411H7867c15873d3543k38920G2432d796p8320A96904d9174m0814A13219B6883
11399b69800J15231A11048R9475b6691C9676b23309E369g6577A71530q2277J5427
11388A04680F260K56109A3397a40059H6062b82509A61678d1376D28034b42081
11377A68385B9884c5657C01265j22417H2738i1420K7079m0153p1375A76409I153
$$ y = [273842, 252611, 111434, 235304, 172103, 189232, 70628, 152340, 283193, 60892, 289920, -159068, -137568, -119024, 102375, 62862, -178717, 2437, 374838, 216460, 118309, -13844, 63674, -103446, 206815, 191246, 101549, -146451, 222125, 27900, 290395, -96183, 21849, 135645, 29463, 4555, 147270, 110767, 127618, -158672, -90287, 33320, -49147, -77361, 146280, 137649, 31949, 87867, -315873, -43543, -282463, 72432, -4796, -83116, 196904, -49174, -89988, 113219, 26883, -269800, -154569, 111048, 210523, -26691, 39676, -223309, 5369, -76577, 171530, 89253, 104680, 6260, 262369, 13397, -140059, 86062, -282509, 161678, -41376, 428034, -242081, 168385, 29884, -35657, 301265, 178848, 82738, -91420, -64341, -104494, -175869, 176409, 9153]
11365D2807Q4763a27120j64327e9258A10079b4293j2314F503e6546A05323Q8569
11354A93892H2207d12381B19917p9811L2016d830A29798K5624e0329n3195B00206
11342b95513C8332M1778l1864i4598A34309j0254a15429k00818C5505L33237a95435
11330e4047A77697p3331j9546K52736G1297a10819N0700O895A21025J71291a15308
11318a33045a6717l4962A88017B832P0569d22414a20728k70441A33961b98609
11307f3181o5250d7455k29224B36408j05840J48034a85771C41064a33045j84965
11297c18010A68360P0350m7823e1083B19231g6401m9034D6166b18314N7525B07241
11285c0292A65584M9846G7605a3611H8870b56481B5958b2617B55047b7954A27329
$$ y = [42807, 127570, -127120, -291447, -59258, 110079, -24293, -36607, 6503, -56546, 105323, 193892, 82207, -412381, 219917, 140106, 172122, -4830, 129798, 155422, -50329, -103524, 200206, -295513, 38332, 80110, 48246, -94598, 134309, 124055, -115429, -316247, 35505, 368742, -195435, -54047, 177697, 104366, 84820, 337556, 71297, -110819, -60119, -53224, 121025, 292316, -115308, -133045, -16717, -51679, 188017, 2832, 73401, -422414, -120728, -391169, 133961, -298609, -63181, -128431, -47455, -276679, 236408, 130568, 278602, -185771, 341064, -133045, -318010, 168360, 238710, 190887, -51083, 219231, -76401, -125435, 46166, -218314, -160789, 207241, -30292, 165584, 215430, 77605, -13611, 88870, -256481, 25958, -22617, 255047, -27954, 127329]
11273F6671b0742j47746A97333a48299A70945b47089R4260a7380B75148e62090
11262E5467b4561j91693O6539j61288A93011D5903Q3956f1850j74537C45838E3911
11250E8915A9615a01442I3904f8966A39027o4826M252i5946j77821A10264c40613
11238D15555j40315a75068G7291J16660b05854c4020G9644b82103K1158a27989
11227d17811A60478k0321a59994E1778Q071b59111j6258h0529k69602B16624A2087
11215A75292b2562I3280b06350g9235B1630a70165m5588b3076D2615l103A3773
11203c09081a387j00112a6724A35675d8944k43223j00913E2057O1935Q5316n7126
11192A42182P6979I7424D6044d47565I7500K9144P3477i5079A29517o1320c16136
$$ y = [66671, -20742, -168488, 197333, -148299, 170945, -247089, -152829, -17380, 275148, -562090, 55467, -24561, -216254, -149715, -311003, 193011, 45903, 129859, -61850, -236387, 345838, 53911, 58915, 19615, -101442, 93904, -68966, 139027, 74201, 78453, -95946, -273767, 110264, -340613, 415555, 275240, -175068, 77291, 193951, -205854, -34020, 79644, -282103, -260945, -127989, -417811, 160478, 140157, -159994, 51778, 59849, -259111, -275369, -80529, -350131, 216624, 12087, 175292, -22562, 93280, -206350, -79235, 21630, -170165, -215753, -23076, 42615, 39512, 13773, -309081, -1387, -101499, -16724, 135675, -48944, -292167, -393080, 52057, 113992, 199308, 142182, 219161, 97424, 46044, -447565, 97500, 126644, 200121, -95079, 129517, 68197, -316136]
11180a03861l15587d8018B7452c6443k4830A09510f5274r7745D8963J73209B2808
11168A22361m8523d3519H4032P2012C0331G38a48129C3525h6168G889h8290A0470
11155b90583I2663a29859d7522C7077h3488G9921b57501p3015c9385o3745l6000
11144a39130H927a63152o9028Q944j46803G4374O9147g1926m5650e4648C50211
11132a31944A04226R1324a311G9534b43593g0988B78363A0680L13280e7688D9440
11120a19383B8575a44888A44747l707M9044o0715b70520B3679b3505B89703b33843
11108h705B12941Q7708j39914a36702A67604b21684B22100N9961F3884i9448C12943
11096G7642b90902C30533f4686A88621H3798a367F5311J8113Q2332C1229K28410
$$ y = [-103861, -419448, -48018, 27452, -36443, -61273, 109510, -65274, -163019, 48963, 222172, 22808, 122361, 73838, -43519, 84032, 156044, 30331, 738, -148129, 33525, -86168, 7889, -88290, 10470, -290583, 92663, -129859, -47522, 37077, -83488, 79921, -257501, -330516, -39385, -103130, -139130, 8927, -163152, -232180, -223236, -370039, 74374, 143521, -71926, -117576, -54648, 350211, -131944, 104226, 195550, -1311, 79534, -243593, -70988, 278363, 10680, 323960, -57688, 49440, -119383, 28575, -144888, 144747, 141040, 190084, 129369, -270520, 23679, -23505, 289703, -233843, -8705, 212941, 300649, 160735, -136702, 167604, -221684, 222100, 282061, 63884, -99448, 312943, 77642, -290902, 330533, -64686, 188621, 83798, -1367, 65311, 83424, 165756, 31229, 259639]
11085B59639c0361A60024G5759g3559m3530c6619k20228A15762Q7698O361a31210
11073b46996C17300r3488A02614K62715A36309o3387M9771K76515n1582L1990
11063C79616r3349K80757j01511A59918K22027G5460N6815J08591K14902B25524
11052E29347A76364N9703q0361P3902L74296J52347B14066K2760m1806L33508
11042E28528O8269r5509n328P2813o8848M59368l72564k9957j36708L18067q1057
11031F57074J62866k56174J38644n2399K7829J09537k56368J58497p2312B65410
11020F37780R234k15888Q7229J57200N9584J10636l69942L37145B16692M79018
11010F95710m2048J94559j73212P0519r4751j67672r9444J96959J63524O1037
$$ y = [259639, -30361, 160024, 75759, -73559, -117089, -36619, -256847, 115762, 203460, 209821, -131210, -246996, 317300, 223812, 102614, 365329, 136309, 72922, 122693, 399208, 347626, 379616, 286267, 567024, 465513, 159918, 381945, 75460, 132275, 240866, 455768, 225524, 529347, 176364, 236067, 155706, 229608, 603904, 756251, 214066, 236826, 195020, 528528, 596797, 501288, 495960, 568773, 499925, 959293, 586729, 556772, 420064, 738131, 657074, 819940, 563766, 702410, 650011, 677840, 787377, 531009, 689506, 617194, 265410, 637780, 647014, 431126, 518355, 675555, 735139, 845775, 475833, 812978, 216692, 695710, 653662, 848221, 675009, 745528, 650777, 483105, 383661, 580620, 744144, 805181]
11000H05181L6715D12528N7602l2609R6745K97574p0815l24918K1640q0399M73977
10989H51325j24489l09955L42271J26629m07650n8574J20042J93566k06372j86028
10979C40765N66908l98990N8326R8310q1548J35342J86781k85973J20947K07331
10969I48199K909J10746j741q568L49085j87752J19929j21330J8323N72272K9187
10958A831259J78780j5280N94966J41032k01940k98910j52566k48919j48376K96720
10948A976766j48191k74406K48722k90262Q7525N6652K17511j30024q7657O2777
10938A719413m06660J63023j28003l62789p2509K54034m26966k22180k39791J20596
10928C98168Q0630L36922C27770B1658M74179j60040A51837J13815J24476A50741
$$ y = [805181, 841896, 412528, 470130, 437521, 534266, 831840, 761025, 436107, 457747, 377348, 851325, 726836, 416881, 759152, 885781, 478131, 419557, 539599, 733165, 526793, 340765, 907673, 508683, 567009, 665319, 583771, 719113, 905894, 619921, 740868, 948199, 951108, 1061854, 1060113, 1051545, 1400630, 1212878, 1332807, 1211477, 1229800, 1802072, 1831259, 2010039, 1994759, 2589725, 2730757, 2528817, 2229907, 2077341, 1828422, 1680046, 1976766, 1828575, 1554169, 1802891, 1512629, 1600154, 1656806, 1874317, 1744293, 1656636, 1719413, 1312753, 1475776, 1347773, 984984, 912475, 1166509, 739543, 517363, 277572, 398168, 478798, 815720, 327770, 21658, 495837, 335797, 151837, 265652, 390128, 150741]
10917B25322n55J42986a21353G8116K65178j03619a56935E954b76683B0874M9241
10906G0115K36895H8447k8286a4443n1120D10580A05757b6375N927p5506H2129
10894A08770a45597B9291b27569G3335K38399c0618G3501b59676A838e2476h858
10882c1762D3793a77511f9512a8547q2598B73767m7570a91145m6360R1203C07771
10870A08901a73315I0860K2776D5914b39440i6417j81455L0408i4600k3166N5942
10859f1824J6796H5494J6208l8283b42359H9528l4176Q1854m2293a12523m8371
10848a60894H7844b6897o833N731j3357G1224A6463b53138a23942c3842F5046
10836E4265Q7812a21921E238J54598e9686n456l39328I3310b36747h8078G8111
$$ y = [225322, 224767, 367753, -121353, 78116, 343294, 239675, -156935, 5954, -276683, 20874, 70115, 307010, 88447, 60161, -14443, -65563, 410580, 105757, -26375, -20448, -95954, 82129, 108770, -145597, 29291, -227569, 73335, 311734, -30618, 73501, -259676, 1838, -52476, -8858, -31762, 43793, -177511, -69512, -18547, -101145, 273767, 226197, -191145, -237505, -146302, 307771, 108901, -173315, 90860, 113636, 45914, -239440, -96417, -277872, -247464, -94600, -117766, -61824, -45028, 85494, 101702, 63419, -242359, 89528, 55352, 137206, 94913, -112523, -160894, 87844, -26897, -33730, -27999, -41356, 71224, 16463, -253138, -123942, -33842, 65046, 54265, 142077, -121921, 5238, 159836, -59686, -65142, -404470, 93310, -236747, -88078, 78111]
10824B28512I7436a14281R120A8279R2864a93700L090o2398A55240l4380b82567
10812g4546j40211f8490b1345F3466M127b17237A81525D4915h4436k01997a5115
10800B00858F5773J23785a08215d6795j06605f2754k77571J66120A2547L4812
10790D7359d4853l6847n2336p6458H5260B0002d4236E8825b17738Q9425A85795
10778b71026a19898K3037k0140k6999j6712A75992F8479l0907b93763a24312R240
10767a15072A31749a95345A07834J9844b9261A56420J05905b41352A43968b07402
10756a51454j11431G3526a05647A994J00957L2436F4580J81984E6242B1111c25205
10744a00363M046k02952a11762G8428c52763I696a51801N2044K2679E5133J5381
$$ y = [228512, 97436, -114281, -105161, 18279, 111143, -193700, -190610, -253008, 155240, 120860, -282567, -74546, -214757, -68490, -21345, 63466, 67593, -217237, 181525, 44915, -84436, -286433, -15115, 200858, 65773, 189558, -108215, -46795, -153400, -62754, -340325, -174205, 12547, 47359, -44853, -81700, -134036, -210494, 85260, 20002, -44236, 58825, -217738, -128313, 185795, -271026, -119898, -96861, -117001, -144000, -160712, 175992, 68479, 37572, -293763, -124312, -115072, 131749, -195345, 107834, 127678, -29261, 156420, 262325, -241352, 143968, -207402, -151454, -262885, 73526, -105647, 1994, 102951, 135387, 64580, 246564, 56242, 21111, -325205, -100363, -96317, -299269, -111762, 78428, -352763, 9696, -151801, -99757, -77078, 55133, 70514]
10733G0514a16387b6756j46036A74037C8456j5095J87561d6798A6378a8341q3649
10722a01990H6158h923k06941R2050L6081N630E1254a5844A2656a88900j2762
10711b01662a8083A42119n7615a36991E221a11618j23452F4747K56790j48339
10701A73198H6173a75021B9570P8383d32993a38333f8450i920j31328A2564a47933
10689b28071c3073n0159F5679P9924K17183g6843A79059D6605b03589l3554A29570
10677B56449a97937B97138b20844a0533C04162g3516F9072l636g9494B22213h1639
10665a62868k70717c8856o5273P629r4477n5131J00736g431n0728K5390k06617
10654b39386A47095a4657C26643g6090A94373a87698j72704J41787A32836j3553
$$ y = [70514, -116387, -26756, -172792, 174037, 38456, 23361, 210922, -46798, 16378, -18341, -101990, 86158, -8923, -215864, -123814, -87733, -82103, 51254, -15844, 12656, -188900, -201662, -18083, 142119, 84504, -136991, 5221, -111618, -235070, 64747, 321537, 173198, 86173, -175021, 29570, 107953, -432993, -138333, -68450, -9920, -141248, 12564, -147933, -228071, -33073, -83232, 65679, 145603, 362786, -76843, 179059, 46605, -203589, -237143, 129570, 256449, -197937, 297138, -220844, -10533, 304162, -73516, 69072, 65436, -79494, 222213, -81639, -162868, -433585, -38856, -104129, -96500, -190977, -246108, -145372, -7431, -58159, -32769, -239386, 147095, -14657, 326643, -76090, 194373, -187698, -360402, -218615, 132836, 119283]
10644A19283a23039a5930j75262h0491j97132A55460g0208B70879b9980j11187
10634a41167d414B2226K12077c3706B60756A01160j8430d357F5627f8808E0193
10622b28212l9708j64012E0964b39783M9011h678j22886B4584Q7074l1447E878
10610a54422j23948f4391j15406Q4795m1282J2866F9265l1650d8569k14551B32139
10598a55121A49805a96349j26906D1752A4646e1690j3250O31j7137o862A03321
10586A46840c06688A81421l0132b45061B27985b6310B65758g923k51932a15012
10575B56946c88665B50467c7632j55803L2172G455a16820p6816B43725J52168
10565C95893b01405E3553J70853g3165n706j36316d1550A4904h432C892g7661
$$ y = [119283, -123039, -15930, -191192, -80491, -277623, 155460, -70208, 270879, -29980, -141167, -4414, 22226, 234303, -33706, 260756, 101160, 82730, -4357, 65627, -68808, 50193, -228212, -267920, -431932, 50964, -239783, -190772, -8678, -131564, 24584, 111658, 80211, 5878, -154422, -278370, -64391, -179797, -95002, -136284, -123418, 69265, 37615, -48569, -263120, 232139, -155121, 149805, -196349, -323255, 41752, 14646, -51690, -64940, -64309, -81446, -88308, 103321, 146840, -306688, 181421, 151289, -245061, 227985, -26310, 265758, -7923, -259855, -115012, 256946, -388665, 250467, -37632, -193435, -161263, 7455, -116820, -193636, 243725, 395893, -201405, 53553, 224406, -73165, -78871, -215187, -41550, 14904, -8432, 3892, -77661]
10553B19318a30499L6474A85510a73496B48994I9995g0576G5994a98627g5753
10542F6938a05509j79725E7457b91208g1179G2375C4060D156c7168j57628D5289
10530b05936A47686a17981B5659b19668e5267j8295n3935K845j02628f7298D57866
10518a75138M092g2239E8851e0776j15011C8651g468I485L1898Q3443N0089i750
10505a66700d7084j85640j06984f9825A19048g8849m16970A4535a48861B22544
10494a99371H5957a54495j06005A45291b02889g1946A1864K66268j11787m4089
10484A22256j4662K04909c08029A49952i7240e740I8170a56741q846A47891b86385
10472A30453b7572k9944j18742f4393A56996K0082J73576m7953O1073L49701B48378
$$ y = [219318, -130499, -94025, 185510, -173496, 248994, 99995, -70576, 75994, -198627, -75753, 66938, -105509, -285234, 57457, -291208, -71179, 72375, 34060, 4156, -37168, -194796, 45289, -205936, 147686, -117981, 25659, -219668, -55267, -73562, -127497, -124652, -227280, -67298, 457866, -175138, -171046, -72239, 58851, -50776, -165787, 38651, -7468, 9485, 41383, 124826, 174915, -9750, -166700, -47084, -232724, -339708, -69825, 119048, -78849, -495819, 14535, -148861, 222544, -199371, 85957, -154495, -260500, 145291, -202889, -71946, 11864, 278132, 166345, 122256, 107594, 312503, -308029, 149952, -97240, -5740, 98170, -156741, -165587, 147891, -286385, 130453, -27572, -57516, -176258, -64393, 156996, 177078, 350654, 302701, 363774, 713475, 248378]
10460A73703A5051h0959B28206r2004J40746a02099B33459a28019d1555j94867
10450b36422B3469h5536e150A53066i0372b6785E776a86583J9164J8422A32310
10438b57189A82501e4452l03322J22273F0313a47723j98357g3790D4000e7577
10427f5737I4816N6681i6045A22089a08704k688Q39B51968o7548c26323B5190
10415D0412b1262n6312I4731J28478B3388a65498N8605A16411j2312b41354A42629
10403A00752j6624j907j8453J67883j11a35028L7464r4232C75026f4921k5181
10392i0102B22100b35895B21180a26863E6870B4656b1864j57833L8064j6793d9447
10380e9786A20593K7468F4204B3271Q3142d5689B74582a79720D21918a3292B715
$$ y = [173703, 15051, -80959, 228206, 136202, 276948, -102099, 233459, -128019, -41555, -236422, 23469, -85536, -5150, 153066, -90372, -26785, 5776, -186583, -167419, -148997, 132310, -257189, 182501, -54452, -357774, -235501, 60313, -147723, -346080, -73790, 44000, -57577, -65737, 94816, 151497, -96045, 122089, -108704, -111392, -110553, 251968, 184420, -326323, 25190, 40412, -21262, -77574, 94731, 223209, 23388, -165498, -106893, 116411, 104099, -241354, 142629, 100752, 84128, 82221, 63768, 231651, 231540, -135028, -97564, -191796, 375026, -64921, -90102, 222100, -235895, 221180, -126863, 56870, 24656, -21864, -179697, -141633, -158426, -49447, -59786, 120593, 148061, 64204, 23271, 106413, -45689, 274582, -179720, 421918, -13292, 2715]
10368H3504J6034a49030A81444K9552d9888B94763A00818J601h3260B30839J41501
10357C72340A322J96495D5771Q698L25910j05892j08929P0467N3484M5065j39020
10346A95554J42655o7684Q7798j00697e5551D94188J2250f9918C36564Q9931A18191
10334D9330K54528A40738J29427J07104j832a4262D15788j26872C8780i5163B33953
10322D47559h8524A27315b870C2635R4478b10026P7404D5903d14A9529a33440
10310G8531Q8030K899l959D8702K33250A31603a10336A90879D6225L0183c8625
10298c321A83777Q6670g7861l2821B01697n0376f1274B82636g6762j07110E3074
10286a09935o2797c8127k87886C04729A27613g1722H1357a01405B1446f9629A03880
$$ y = [83504, 99538, -149030, 181444, 210996, -49888, 294763, 100818, 102419, -83260, 230839, 372340, 1322, 197817, 45771, 54469, 380379, 274487, 165558, 236025, 289509, 334574, 195554, 338209, 270525, 358323, 257626, -55551, 494188, 506438, -69918, 336564, 426495, 118191, 49330, 303858, 140738, 270165, 377269, 375437, -14262, 415788, 288916, 38780, -95163, 233953, 447559, -88524, 127315, -2870, 32635, 127113, -210026, -132622, 45903, -414, 19529, -133440, 78531, 166561, 169460, 165501, 48702, 281952, 131603, -110336, 190879, 46225, 76408, -38625, -3321, 183777, 270447, -77861, -110682, 201697, 151321, -61274, 282636, -76762, -183872, 53074, -109935, -172732, -38127, -326013, 304729, 127613, -71722, 81357, -101405, 21446, -69629, 103880]
10274b82660A39899R4925D1341a25162c1026l01481B39079L93454C6960b96327
10263a46996b4040p392e699A9070b37764f9288A13006J98678j05237a6523k74696
10252b91219a15040L8071K2538H1798j4974c6491r2391B34907A13996R1482J57901
10241C63379j39481a2997A99332H1754R2844A7300d6045B17387b67623F1666b74190
10229A2268f2630f626C1392J49976d828j28959k2719C6671a00345A14283J00369
10218B14652A00344M1895a29085j44994a08844B37388a24546J4077F4666c28985
10207A60319a42695E9646c46826a54836b7144q6562A64167b39930N3375B9564
10196B36542a5196A53123C2650N7660C5502A6970M4476a28747k3911k1275A82346
$$ y = [-282660, 139899, 234824, 41341, -125162, -31026, -332507, 239079, 632533, 36960, -296327, -146996, -24040, -31432, -5699, 19070, -237764, -69288, 113006, 311684, 206447, -16523, -291219, -115040, -76969, -54431, 81798, 66824, -36491, -128882, 234907, 113996, 205478, 363379, 223898, -12997, 199332, 81754, 174598, 17300, -46045, 217387, -267623, 61666, -274190, 12268, -62630, -6626, 31392, 181368, -4828, -133787, -156506, 36671, -100345, 114283, 214652, 100344, 142239, -129085, -274079, -108844, 237388, -124546, -110469, 64666, -328985, 160319, -142695, 59646, -346826, -154836, -27144, -113706, 164167, -239930, -186555, 29564, 236542, -15196, 153123, 32650, 90310, 35502, 16970, 61446, -128747, -152658, -173933, 182346]
10184d8726B70543a20282C72359j59042b49H9250M6823a07879I3410N9045a32419
10172a18073A1783O8747e448j52001k7744b0272R997E7964h1629j54368P2265
10161a63732I0555c36513a39251B9624L57789b52277A43256j0207h1431e831k69378
10150b75209c1313n1687b9673C9415a65212B26318d1959k30251A7987a03414F3822
10138I347K04780c16575A36867c5561j80599G8494a34081k8995A29626k5723a49484
10126g9599J6567G8771i3098k24826a3675L381B18442b93051A24306E0234K2241
10115G2475a88125I5869j1999h8418j11877I9996a57539B66024c7194h128j16857
10104a24985n3027b2548j60449C78049b25782A30332J2109K8466g0301A87166
$$ y = [-48726, 270543, -120282, 372359, 213317, -249, 89250, 136073, -107879, 93410, 152455, -132419, -118073, 11783, 80530, -5448, -157449, -185193, -20272, -10275, 57964, -81629, -235997, -163732, 90555, -336513, -139251, 29624, 387413, -252277, 143256, 133049, -81431, -5831, -275209, -31313, -83000, -29673, 39415, -165212, 226318, -41959, -272210, 17987, -103414, 63822, 9347, 214127, -316575, 136867, -35561, -216160, 78494, -134081, -163076, 129626, 103903, -149484, -79599, -63032, 78771, -93098, -317924, -13675, -10294, 218442, -293051, 124306, 50234, 72475, -188125, 95869, 83870, -88418, -200295, 99996, -157539, 266024, -37194, -8128, -124985, -178012, -22548, -182997, 378049, -225782, 130332, 142441, 170907, -70301, 187166]
10093b98897J30059F5488f2638K827a578k6088A04471c04927e2029a148I5873
10081a31276f0706j3777A12267b32237j26530A3057a93607A34675a57211E4660
10070h6250q7756k5990E8936j5832a25079e8364j05195B6021K38590b06291j08440
10059c14731C8416f4145D3360c6996C46845b94287A46559a00015j37557C53126
10048f9847C5741f8581A77690c77391a70662A78060a26063M7189a6135j66567
10038a82702q1631J20611A34263d14332c4101A00956j3654a54517d2773A06125
10027A91353b04601F7573a57184A75811a5764j69460K4346m4010L826N3747c836
10015b6296A91337g9111K6251F7K43517i2489L0443J1890F4086K5840i3182G1635
$$ y = [-298897, -168838, 65488, -62638, -59811, -1578, -27666, 104471, -304927, -52029, -1148, 95873, -131276, -60706, -74483, 112267, -232237, -358767, 13057, -193607, 134675, -157211, 54660, -86250, -174006, -199996, 58936, 43104, -125079, -58364, -163559, 26021, 264611, -206291, -314731, 38416, -64145, 43360, -36996, 346845, -294287, 146559, -100015, -237572, 353126, -69847, 35741, -68581, 177690, -377391, -170662, 178060, -126063, -78874, -16135, -182702, -264333, -143722, 134263, -414332, -34101, 100956, 87302, -154517, -42773, 106125, 191353, -204601, 67573, -157184, 175811, -15764, -185224, -160878, -204888, -201062, -147315, -3836, -26296, 191337, -79111, -52860, 67, 243584, -92489, -62046, -50156, 64086, 89926, -93182, 71635]
10002a71716P461B42931f5866F9097R5819H1205c7591p5162A5320c241A77257
9990f0077K300k6912A73538a45079d7042I891g3472k21253c5542l64186J43745
9979b55983k1990A57688K1535b50275d1793k67794f7324o8345m2108P5029I3312
9967d465l549k11998g5456A50014h2235K4124j4422o980A86462N9615A17645b12871
9954A82301h4615A47831c22057Q3934j8499k2278A58626c74149g7953A01354c43442
9942c81264q668q474a23533B20038r6709P630a90214P6238L7106A26205l0042
9931I6163h0298J9731B0053J40247b92952F5259M6744g4145i023j83431N2650
9920a39804A5371a44599d5958a5714F6370d9968j85878a12018G7479b26090b0746
$$ y = [-171716, -164255, 242931, -65866, 69097, 164916, 81205, -37591, -112753, 15320, -3241, 177257, -60077, -57777, -84689, 173538, -145079, -47042, 9891, -73472, -294725, -35542, -399728, -255983, -277973, 157688, 179223, -250275, -41793, -309587, -67324, -135669, -177777, -102748, 93312, -4465, -8014, -220012, -75456, 150014, -82235, -58111, -72533, -79513, 186462, 246077, 117645, -212871, 182301, -84615, 147831, -322057, -238123, -256622, -278900, 158626, -374149, -77953, 101354, -343442, -381264, -389932, -398406, -123533, 220038, 123329, 130959, -190214, -113976, -76870, 126205, 96163, -80298, -60567, 20053, 160300, -292952, 65259, 112003, -74145, -9023, -192454, -139804, 15371, -144599, -45958, -15714, 66370, -49968, -235846, -112018, 77479, -226090, -20746]
9908b9549k67566d6656D6385a27751m5060A31305b78817m4716D7634a2099k83277
9897b95376e7549o7853D2309a25377C5281a44719m36743a23488m1725f7334A07408
9885b4085j9777j99158E5533c2301k87431a33551o4706Q7529q0115B3568J28685
9874A52253b628k64772A96451c8482n8108c1311j89492r157B38981D1035d71248
9862a55750A92516B8250J02254L8111c0817A16993f0247O413A15431n5268b14432
9850b82714I8674d5402R922A77203J77757a58736j35052M1104A4414a7504F3358
9838C69919A21147i2346F268c81898a06672j21684a11990b025E8864c8635j31884
9827a70519D726g9573A90936b6851p8957I6327P9384B1470K242e9616A74526p2915
$$ y = [-29549, -297115, -46656, 46385, -127751, -172811, 131305, -278817, -323533, 47634, -12099, -295376, -57549, -125402, 42309, -125377, 35281, -144719, -581462, -123488, -165213, -67334, 107408, -24085, -43862, -243020, 55533, -32301, -319732, -133551, -198257, -110728, -190843, 23568, 152253, -2628, -267400, 196451, -38482, -96590, -31311, -220803, -229960, 238981, 41035, -471248, -155750, 192516, 28250, 130504, 168615, -30817, 116993, -60247, -53834, 115431, 60163, -214432, -282714, 98674, -45402, -35480, 177203, 354960, -158736, -293788, -252684, 14414, -17504, 63358, 369919, 121147, -92346, 6268, -381898, -106672, -228356, -111990, -2025, 58864, -38635, -170519, 4726, -79573, 190936, -26851, -105808, 96327, 175711, 21470, 23712, -59616, 174526, 101611]
9815A01611i0150A20724j2578B1055a63260j51144a43389n7887F2204a51890C3104
9803a9152k10911J03776a2671j99355g3707K1152F9404a46567F9031b27199a11440
9791F4872c6049j1319k0989A47124F0843e4622j51807N0955j361O7173f233I317
9778c69916B40680b19734e0082j26994E1899b64861a26487B14296j3194b0212
9767a72302C12926f6561k10969J37366k4843j01935h4903E5307d569n3818j24220
9756a82607j37541h8614j9457C74153a44195j09825A22035a34381k6532B11106
9745d3871l62150K02549f539B22237b07074M3639L5590A75161A6456C873a06168
9733E9553b19483d2385j77212H1970J15733e6023k42634J17440G0564b00506B59627
$$ y = [101611, -90150, 120724, 108146, 21055, -163260, -314404, -143389, -201276, 62204, -151890, 33104, -19152, -230063, -126287, -12671, -212026, -73707, -52555, 69404, -146567, 69031, -227199, -111440, 64872, -36049, -47368, -68357, 147124, 60843, -54622, -206429, -155474, -156835, -89662, -6233, 9317, -369916, 240680, -219734, -50082, -177076, 51899, -264861, -126487, 214296, 201102, -20212, -172302, 312926, -66561, -277530, -140164, -165007, -266942, -84903, 55307, -4569, -58387, -182607, -320148, -88614, -108071, 374153, -144195, -254020, 122035, -134381, -160913, 211106, -43871, -406021, -203472, -6539, 222237, -207074, -163435, -127845, 175161, 16456, 3873, -106168, 59553, -219483, -42385, -219597, 81970, 197703, -56023, -298657, -181217, 70564, -200506, 259627]
9721a52803j44857D6435b00379N8182C15011b9185E1670g4081A26750g784l868
9710a1652k30579c7088J0400k73422A96305f250A61894b00902c1642D3454J73250
9699B16704N0076a06038l0781r137j50686O0857k3063J21678j88202J26356j03604
9688c02620E4186a60236j38353b0334j65114A412c18223B12889a7170D0802c4522
9676C31578a66628f8205m8341C1760J20672b30940P2425d6660B41468b4614k4049
9665d8663A96472c08676C93269c50238L3416h697m5120j41661c3880a0866H4072
9653g6133j79433E0030d1969O553A11453c26829N2151C552M44239b40365B34515
9641B66405A6521J61308a81770A35830J54155g7549I6971g0848K3254J2021j99525
$$ y = [-152803, -297660, 46435, -200379, -142197, 315011, -29185, 51670, -74081, 126750, -7784, -11652, -242231, -37088, -26688, -300110, 196305, -6250, 161894, -200902, -31642, 43454, 216704, 266780, -106038, -136819, -145956, -296642, -235785, -258848, -137170, -325372, -199016, -302620, 54186, -160236, -298589, -20334, -185448, 1412, -318223, 212889, -17170, 40802, -34522, 331578, -166628, -68205, -116546, 31760, 152432, -230940, -158515, -46660, 241468, -24614, -48663, 196472, -308676, 393269, -350238, -316822, -8697, -53817, -195478, -33880, -10866, 84072, -76133, -255566, 50030, -41969, -35416, 111453, -326829, -274678, 3552, 447791, -240365, 234515, 266405, 16521, 177829, -181770, 135830, 289985, -77549, 96971, -70848, -47594, -35573, -235098]
9630b35098a8853m631A95325H3680B2781a62048P8734j69848f0768E2628J07973
9619A60601d44805J17289l7788B4293J659L1634A3681b2751k49914f1791B11068
9607a18614d7661F4154a01634o894j55350A52246b2055n1496i609j0269P509j03556
9595a15925b7395l485j67444L6374j7892N4508B74173b02043h3138E3797J17296
9584A71093a07703k13981B26857f4374B23140d01869d9430A73465n8980b08314
9573c81428B70065E0189a03869N1791C9366K02523J5164e72401A57963b05362
9562a94226J8023G2186L4002a86197a1653q233k91948C0832j0604c18551A59004
9550B56860i6737j20142D5524b585k18402Q5799q267n0141F4857a21551C18508
$$ y = [-235098, -18853, -23484, 195325, 83680, 22781, -162048, -83314, -253162, -60768, 52628, 160601, -444805, -327516, -365304, 24293, 25952, 57586, 13681, -22751, -272665, -61791, 211068, -118614, -47661, 64154, -101634, -108528, -263878, 152246, -22055, -73551, -9609, -19878, -12369, -115925, -27395, -30880, -198324, -161950, -179842, -125334, 274173, -202043, -83138, 53797, 171093, -107703, -321684, 226857, -64374, 223140, -401869, -49430, 173465, 114485, -208314, -381428, 270065, 50189, -103869, -52078, 39366, 241889, 257053, -572401, 157963, -205362, -194226, -176203, 72186, 106188, -186197, -11653, -19886, -311834, 30832, 20228, -318551, 159004, 256860, -96737, -216879, 45524, -2585, -220987, -135188, -143455, -193596, 64857, -121551, 318508]
9538A97100a14151A3971b08161Q7710o4052J1610j08710l29614b8233A43012i7223
9526f14048B08076a43626L8674j61123B63799c01698A34029c65322e6514B4058
9515F6799b1258k10389J11533N5186D2009d38173f4538j72803a081l4299B64090
9503B54756a44007A5326a11896C8046O4944M8786c8590k2187a3432p6340H800
9491h2682A60355a86779f8673G5015i7514j43609b7586I3800R0101a28311J3872
9480a14439b6395A69020G1639h1962j48734j17570a61037N9625A15106b20796
9469A61881a02484H4587a81606A07905a80578A24845J04728d1006a7562A03846
9458a45836N2018p4141N5492A05924C7878L4915e172m4054A58312k0612K5766
$$ y = [197100, -114151, 13971, -208161, -120451, -184503, -172893, -281603, -611217, -28233, 143012, -97223, -614048, 208076, -143626, -104952, -266075, 263799, -301698, 134029, -365322, -56514, 24058, 66799, -21258, -231647, -120114, -64928, 42009, -438173, -64538, -237341, -1081, -35380, 264090, 254756, -144007, 15326, -111896, 38046, 102990, 151776, -38590, -60777, -13432, -89772, 8800, -82682, 160355, -186779, -68673, 75015, -97514, -241123, -27586, 93800, 183901, -128311, -114439, -26395, 169020, 71639, -81962, -230696, -348266, -161037, -101412, 115106, -220796, 161881, -102484, 84587, -181606, 107905, -180578, 124845, 229573, -41006, -17562, 103846, -145836, -93818, -167959, -112467, 105924, 37878, 72793, -5172, -49226, 158312, 137700, 163466]
9447A63466a07097j77837D13c49474I5126a80968H9391c3209r4707M3966n2223
9436a36173O6816k43160K9629a4343j33122b4371l11701e6085m5336j14922G8082
9424d2894A14591J80900b80753K0474B60186Q7576b6758G9345m799c64467A58607
9412b22571O4376J2587N3484l42742A59560P865h5397k24976L4599K2921G0365
9400C03253b42039M9000G1305a18646D5699a16558n6975H0947A2870J29596h6899
9388d0928o0388k82854a75784M2745D32444A65096a73513B26949b76043a16043
9377I5717P4400b45177C6552a43878N3609j59312G0005a27958B2823h5199r8771
9366a83970q3579l5538c339g26k55456C8783g5303D6921c9474q6760j7582A0824
$$ y = [163466, -107097, -284934, 413, -349474, 95126, -180968, 89391, -33209, -127916, -83950, -136173, -69357, -312517, -282888, -14343, -147465, -24371, -336072, -56085, -101421, -216343, 78082, -42894, 114591, 295491, -280753, -260279, 260186, 347762, -26758, 79345, 74546, -364467, 158607, -222571, -158195, -145608, -92124, -434866, 159560, 167425, -85397, -310373, -275774, -252853, 70365, 303253, -242039, -193039, 71305, -118646, 45699, -116558, -173533, 80947, 12870, 142466, -86899, -40928, -101316, -384170, -175784, -133039, 432444, 165096, -173513, 226949, -276043, -116043, 95717, 170117, -245177, 36552, -143878, -90269, -249581, 70005, -127958, 22823, -85199, -183970, -267549, -303087, -3339, -726, -256182, 38783, -75303, 46921, -39474, -126234, -143816, 10824]
9353f4434B17263p7966c8679p4638b6528q4907k12397R9618j9348P0751b031k45872
9341b47903a0004k1726A53497h9246c1343A4371J41817b1125j75232I787R8450
9330A08237Q4967a97241R320F8458b2701k01390q652o8967E3861J73741a76593
9318A59666D0367b15456J01168o0770C0631J92068g6144m4735I595J97484E1031
9306a28410D6675a70654A58236I340b48627f8663d181k35266R2256E4863j2677
9295D2186A7456a38589k68667J32227J16189k11910A00461h2793j80103A95956
9284a22663n8855f1884j89028n3489B8643b44549j1307B53558G8776a60637m6876
9273b07513i27j67435A05527a76814d6112a9653j57498m1709j59811B99211H7667
$$ y = [-64434, 217263, 139297, -38679, -113317, -26528, -111435, -323832, -224214, -243562, -172811, -2031, -247903, -10004, -31730, 153497, -89246, -31343, 14371, 156188, -21125, -196357, 9787, 108237, 193204, -197241, -187921, 68458, -22701, -224091, -232743, -301710, 53861, 227602, -176593, 159666, 40367, -215456, -114288, -175058, 30631, 222699, -76144, -120879, 9595, 207079, 51031, -128410, 46675, -170654, 158236, 9340, -248627, -68663, -4181, -239447, -147191, 54863, 42186, 17456, -138589, -407256, -275029, -158840, -370750, 100461, -82793, -262896, 195956, -122663, -181518, -61884, -250912, -304401, 28643, -244549, -255856, 253558, 78776, -160637, -207513, -927, -168362, 105527, -176814, -46112, -19653, -177151, -218860, -378671, 299211, 87667]
9261A24841b15138r2243I6533b1406k6417p5206c5054J7036I3864O4564E3677
9249e0874o7197j38050J27608p6102A42979G479J27742e79243A1225P1140m0471
9238D1894L3518a48404H1532a6917l2173C1119J02874a65302e2166j9911o2400
9227a34477A62622b520j99907B33978a25372r0079o6759i0988B95211j37772Q3412
9216B40851e7210J9000r9801j24857B31758c1193a2867k27399a038l5057B3189
9204d92424b04586L8858k05607G6390i5797G6383B4295J53159g8839j50359d7561
9192a16747o4029e4929B8544c17293j30649a67438B3139M2174J30568F6965a06596
9180A34851c4423k90083B38319d67430b1819m0607R311j04938A06176c10150K9541
$$ y = [124841, -215138, -307381, 96533, -21406, -47823, -123029, -35054, -18018, 93864, 158428, 53677, -50874, -118071, -256121, -128513, -204615, 142979, 7479, 135221, -579243, 11225, 82365, 41894, 75412, -148404, 81532, -16917, -49090, 31119, 133993, -165302, -52166, -72077, -134477, 162622, -2520, -202427, 233978, -125372, -215451, -282210, -90988, 295211, 157439, 240851, -57210, -38210, -138011, -262868, 231758, -31193, -12867, -240266, -1038, -36095, 23189, -492424, -204586, -165728, -371335, 76390, -95797, 76383, 24295, 177454, -78839, -229198, -47561, -116747, -180776, -54929, 28544, -317293, -447942, -167438, 23139, 65313, 195881, 66965, -106596, 134851, -34423, -324506, 238319, -467430, -21819, -62426, -53115, -158053, 106176, -310150, -280609]
9169b80609B09602f4832r7434B00555k2070J78972a44695b1548C6558q566J69957
9158A97949E9810h977A13987J73766j38938i3668C8309j4856b2412B4697j337
9147B3360J67933D7031M6770B3751J08913a15095M2853A25017c19384d5928o1028
9136a06956o264A233b20352A0761b86459c1425J4943C6864N8524C9225b4884o8117
9124i3001b1307p3524p2094M0791A8681M0738L9566a85797C3773J49658E9989
9112a34084K5527j57989e091H324b20057p3732N7082a16881m6309k3567d7335
9100a33666k05566g7081a0919l37994a64407A81836b27890R4472j26741C4395
9089i0674r4639h7070L1890A20358K5458a09349b5739I1523d812A87590p9121
$$ y = [-280609, 209602, -64832, -162266, 200555, 178485, 357457, -144695, -21548, 36558, 27992, 197949, 59810, -8977, 113987, 287753, 148815, -93668, 38309, 23453, -22412, 24697, 23360, 191293, 47031, 93801, 23751, 132664, -115095, -72242, 125017, -319384, -45928, -106956, -113220, 1233, -220352, 10761, -286459, -31425, -16482, 36864, 95388, 39225, -24884, -93001, -21307, -94831, -166925, -126134, 18681, 59419, 98985, -185797, 33773, 183431, 59989, -134084, -108557, -266546, -5091, 8324, -220057, -293789, -236707, -116881, -163190, -186757, -47335, -133666, -339232, -77081, -10919, -348913, -164407, 181836, -227890, -133418, -260159, 34395, -90674, -185313, -87070, -55180, 120358, 145816, -109349, -25739, 91523, -4812, 187590, 108469]
9078A08469e7425D7513h9218A12867g8764j4933n4048m5075I829a73451g6376
9066A59006a33959a0018B29026c59858A60236c94053i7046k8087C3270c8249m3069
9055h1318j30367h1318a6794j5303B83459m2767a70828j99405D2843K70490A47647
9043A30012a46804I748P750J07651A9326b89035A87539b42975B21045a97013J6677
9032a80336j23596J15736Q7765j9792A26695N3023C9396a79895A3894c3595k12122
9021b45717e609q4885A24381A0051J28241c8778j2507D3594P0594B1348a09804
9009a6775p8434j48955B15657a41434c2671j52346j05617D9290a51830A39889
8998a21912b7190k34546B1766a68668O1031j9610B26879a57971A02038c01639
$$ y = [108469, -57425, 47513, -89218, 112867, -78764, -93697, -147745, -192820, 9829, -173451, -76376, 159006, -133959, -10018, 229026, -359858, 160236, -394053, -97046, -125133, 33270, -38249, -81318, -211685, -81318, -16794, -32097, 283459, 240692, -170828, -370233, 42843, 313333, 147647, 130012, -146804, 9748, 17498, 125149, 19326, -289035, 187539, -242975, 221045, -197013, -180336, -303932, -188196, -100431, -120223, 126695, 179718, 39396, -179895, 13894, -33595, -245717, -5609, -90494, 124381, 10051, 138292, -38778, -51285, 43594, 114188, 21348, -109804, -16775, -95209, -244164, 215657, -141434, -32671, -185017, -290634, 49290, -151830, 139889, -121912, -27190, -261736, 21766, -168668, -107637, -127247, 226879, -157971, 102038, -301639]
8987a46329q5164O8394A68144b23323j24844d2087j8609a2510B0995b93528C23152
8975E8648a5506H3518J65488c28200E1432O6401m76Q1756R1594A17366J02730
8964B20096h2430A74078A265K4172M5460l1136a09976D1202J26484G5303a95122
8952b42341j4943R9023A49368N6351d58016J67757B69340a68482G5728K20931
8942B96659b47007B08180d22740B11398f8774H2285d7644j78095k286b2781I1275
8930d56850A32711c938j15753F1780L4267B2448i9785B2613i9755L5057q4609
8919a49307B02666J255M9624E5779M06807j88031a94707C75343j64916L87113
8909E97540J54071P46602R64067J726257L848772k490055B704177j156798m74829
$$ y = [-146329, -231493, -163099, 168144, -223323, -348167, -42087, -60696, -12510, 20995, -293528, 323152, 58648, -15506, 83518, 249006, -328200, 51432, 117833, 117357, 199113, 290707, 117366, 220096, -82430, 174078, 1265, 25437, 70897, 39761, -109976, 41202, 167686, 75303, -195122, -242341, -257284, -158261, 149368, 205719, -458016, -290259, 269340, -168482, 75728, 296659, -247007, 208180, -422740, 211398, -68774, 82285, -47644, -225739, -228025, -22781, 91275, -456850, 132711, -3938, -119691, 61780, 96047, 22448, -99785, 22613, -99755, -64698, -149307, 202666, 203921, 253545, 55779, 462586, 274555, -194707, 375343, 210427, 597540, 751611, 1498213, 2462280, 4188537, 8037309, 5547254, 2704177, 1547379, 1072550]
8900A072550l16856k94746o3885a80531C54610j65768a06557B17385K51979A91980
8889a92593L0511j11420A43800a46429l17147F9301K1180d03799A2248a8317C1200
8877E3711b27424d4609l04922A15968C4833A0800a51728H8552h500m9712O703
8866e1509m2674A97951d1522j27437g6144c7653k3315k62649H2744k2638a64241
8854a37786B01576C1282Q1603D5393d53107a30789k00850J65547B8389b6729j25125
8843a51854G6501R3082G7469a23149c4670I4185b36157C98215a62895C5700Q3262
$$ y = [1072550, 755694, 460948, 397063, -180531, 354610, 188842, -106557, 217385, 469364, 191980, -192593, -162082, -273502, 143800, -146429, -463576, 69301, 90481, -403799, 12248, -18317, 31200, 53711, -227424, -44609, -349531, 115968, 34833, 10800, -151728, 88552, -8500, -58212, -51509, -94183, 197951, -41522, -168959, -76144, -37653, -60968, -323617, 82744, 60106, -164241, -137786, 201576, 31282, 112885, 45393, -453107, -130789, -331639, -166092, 28389, -26729, -151854, 76501, 169583, 77469, -123149, -34670, 94185, -236157, 398215, -162895, 35700, 118962]
$$ [...]
##END NTUPLES=NMR SPECTRUM
##END=
